##TITLE=1H_DE-2-AAoccid
 DMSO-d6
 8 sc, 
 29.7.2024
##JCAMPDX= 6.0         $$ Bruker NMR JCAMP-DX V2.0
##DATA TYPE= NMR FID
##DATA CLASS= NTUPLES
##ORIGIN= UXNMR, Bruker Analytische Messtechnik GmbH
##OWNER= root
$$ XWIN-NMR		Version 3.5
$$ Mon Jul 29 16:15:50 2024 Russian Standard Time (UT+4h)  she@DPX200
##.OBSERVE FREQUENCY= 200.1315
##.OBSERVE NUCLEUS= ^1H
##.DELAY= (6, 6)
##.ACQUISITION MODE= SIMULTANEOUS
##.ACQUISITION SCHEME= undefined
##.AVERAGES= 8
##.DIGITISER RES= 18
##SPECTROMETER/DATA SYSTEM= spect
##.PULSE SEQUENCE= zg30
##.SOLVENT NAME= DMSO
##.SHIFT REFERENCE= (INTERNAL, DMSO, 0, 15.7039)
##AUDIT TRAIL= $$ (NUMBER, WHEN, WHO, WHERE, WHAT)
$$ ##TITLE= Audit trail, XWIN-NMR		Version 3.5
$$ ##JCAMPDX= 5.01
$$ ##ORIGIN= Bruker BioSpin GmbH
$$ ##OWNER= she
$$ F:/spectra/data/she/nmr/H-F/1/audita.txt
$$ ##AUDIT TRAIL=  $$ (NUMBER, WHEN, WHO, WHERE, WHAT)
(   1,<2024-07-29 16:14:29.20 +0400>,<she>,<DPX200>,
      <created by zg, POWCHK disabled, PULCHK disabled
       configuration hash MD5:
       00 E9 B6 7A A2 85 ED C7 34 08 36 98 17 FE 4E 26
       data hash MD5: 16K
       28 8A DB F3 73 22 E7 06 E8 63 EA F9 6D B3 73 7C>)
$$ ##END=
$$ 
$$ hash MD5
$$ 0B 53 05 06 1A 80 8C DB 18 A9 78 82 31 F9 48 99
##$RELAX= 
##$RELAX= 
##$RELAX= 
##$RELAX= 
##$RELAX= 
##$RELAX= 
$$ Bruker specific parameters
$$ --------------------------
##$DU= <F:/spectra>
##$EXPNO= 1
##$NAME= <H-F>
##$PROCNO= 1
##$TYPE= <nmr>
##$USER= <she>
##$AMP= (0..31)
100 100 100 100 100 100 100 100 100 100 100 100 100 100 100 100 100 100 
100 100 100 100 100 100 100 100 100 100 100 100 100 100 
##$AQSEQ= 0
##$AQ_mod= 1
##$AUNM= <au_zg>
##$AUTOPOS= <>
##$BF1= 200.13
##$BF2= 200.13
##$BF3= 200.13
##$BF4= 200.13
##$BF5= 200.13
##$BF6= 200.13
##$BF7= 200.13
##$BF8= 200.13
##$BYTORDA= 1
##$CFDGTYP= 0
##$CFRGTYP= 5
##$CHEMSTR= <none>
##$CNST= (0..31)
1 1 145 1 1 1 1 1 1 1 1 1 1 1 1 1 1 1 1 1 1 1 1 1 1 1 1 1 1 1 1 1 
##$CPDPRG= <>
##$CPDPRG1= <>
##$CPDPRG2= <>
##$CPDPRG3= <>
##$CPDPRG4= <mlev>
##$CPDPRG5= <mlev>
##$CPDPRG6= <mlev>
##$CPDPRG7= <mlev>
##$CPDPRG8= <mlev>
##$CPDPRGB= <>
##$CPDPRGT= <>
##$D= (0..31)
0 1.2 0 0 0 0 0 0 0 0.06 0 0.03 0 0 0 0 0.0002 0 0 0 0 0 0 0 0 0 0 0 0 
0 0 0 
##$DATE= 1722255268
##$DBL= (0..7)
120 120 120 120 120 120 120 120 
##$DBP= (0..7)
150 150 150 150 150 150 150 150 
##$DBP07= 0
##$DBPNAM0= <>
##$DBPNAM1= <>
##$DBPNAM2= <>
##$DBPNAM3= <>
##$DBPNAM4= <>
##$DBPNAM5= <>
##$DBPNAM6= <>
##$DBPNAM7= <>
##$DBPOAL= (0..7)
0.5 0.5 0.5 0.5 0.5 0.5 0.5 0.5 
##$DBPOFFS= (0..7)
0 0 0 0 0 0 0 0 
##$DE= 6
##$DECBNUC= <off>
##$DECIM= 24
##$DECNUC= <off>
##$DECSTAT= 4
##$DIGMOD= 1
##$DIGTYP= 9
##$DL= (0..7)
0 120 120 120 120 120 120 120 
##$DP= (0..7)
150 150 150 150 150 150 150 150 
##$DP07= 0
##$DPNAME0= <>
##$DPNAME1= <>
##$DPNAME2= <>
##$DPNAME3= <>
##$DPNAME4= <>
##$DPNAME5= <>
##$DPNAME6= <>
##$DPNAME7= <>
##$DPOAL= (0..7)
0.5 0.5 0.5 0.5 0.5 0.5 0.5 0.5 
##$DPOFFS= (0..7)
0 0 0 0 0 0 0 0 
##$DQDMODE= 0
##$DR= 18
##$DS= 0
##$DSLIST= <SSSSSSSSSSSSSSS>
$$ [...]
##$SUBNAM2= <"">
##$SUBNAM3= <"">
##$SUBNAM4= <"">
##$SUBNAM5= <"">
##$SUBNAM6= <"">
##$SUBNAM7= <"">
##$SUBNAM8= <"">
##$SUBNAM9= <"">
##$SW= 24.0689530833862
##$SWIBOX= (0..15)
0 0 2 0 0 0 0 0 0 0 0 0 0 0 0 0 
##$SW_h= 4816.95568400771
##$TD= 16384
##$TD0= 1
##$TE= 0
##$TE2= 300
##$TE3= 300
##$TEG= 300
##$TL= (0..7)
0 120 120 120 120 120 120 120 
##$TP= (0..7)
150 150 150 150 150 150 150 150 
##$TP07= 0
##$TPNAME0= <>
##$TPNAME1= <>
##$TPNAME2= <>
##$TPNAME3= <>
##$TPNAME4= <>
##$TPNAME5= <>
##$TPNAME6= <>
##$TPNAME7= <>
##$TPOAL= (0..7)
0.5 0.5 0.5 0.5 0.5 0.5 0.5 0.5 
##$TPOFFS= (0..7)
0 0 0 0 0 0 0 0 
##$TUNHIN= 0
##$TUNHOUT= 0
##$TUNXOUT= 0
##$USERA1= <user>
##$USERA2= <user>
##$USERA3= <user>
##$USERA4= <user>
##$USERA5= <user>
##$V9= 5
##$VALIST= <valist>
##$VCLIST= <CCCCCCCCCCCCCCC>
##$VD= 0
##$VDLIST= <DDDDDDDDDDDDDDD>
##$VPLIST= <PPPPPPPPPPPPPPP>
##$VTLIST= <TTTTTTTTTTTTTTT>
##$WBST= 1024
##$WBSW= 4
##$XGAIN= (0..3)
0 0 0 0 
##$XL= 0
##$YL= 0
##$YMAX_a= 119749
##$YMIN_a= -109440
##$ZGOPTNS= <>
##$ZL1= 120
##$ZL2= 120
##$ZL3= 120
##$ZL4= 120
##$ABSF1= 10
##$ABSF2= 0
##$ABSG= 5
##$ABSL= 3
##$ALPHA= 0
##$AQORDER= 0
##$ASSFAC= 0
##$ASSFACI= 0
##$ASSFACX= 0
##$ASSWID= 0
##$AUNMP= <proc_1d>
##$AZFE= 0.1
##$AZFW= 0.1
##$BCFW= 1
##$BC_mod= 2
##$BYTORDP= 1
##$COROFFS= 0
##$CY= 11.3945322036743
##$DATMOD= 1
##$DC= 2
##$DFILT= <>
##$DTYPP= 0
##$F1P= 15.6554695791079
##$F2P= 12.8336369535428
##$FCOR= 0.5
##$FTSIZE= 0
##$FT_mod= 4
##$GAMMA= 1
##$GB= 0.15
##$INTBC= 1
##$INTSCL= 1
##$ISEN= 128
##$LB= 0.24
##$LEV0= 0
##$LPBIN= 0
##$MAXI= 10000
##$MC2= 0
##$MEAN= 0
##$ME_mod= 0
##$MI= 1.114404
##$NCOEF= 0
##$NC_proc= 0
##$NLEV= 6
##$NOISF1= 3.799351
##$NOISF2= 2.8
##$NSP= 1
##$NTH_PI= 0
##$NZP= 0
##$OFFSET= 15.70392
##$PC= 1
##$PHC0= -25641.07
##$PHC1= 13.78749
##$PH_mod= 1
##$PKNL= yes
##$PPARMOD= 0
##$PSCAL= 0
##$PSIGN= 0
##$REVERSE= no
##$SF= 200.130013532006
##$SI= 16384
##$SIGF1= 3
##$SIGF2= 2
##$SINO= 400
##$SIOLD= 16384
##$SREGLST= <1H.CDCl3>
##$SSB= 0
##$STSI= 0
##$STSR= 0
##$SW_p= 3612.71676300578
##$SYMM= 0
##$S_DEV= 0
##$TDeff= 0
##$TDoff= 0
##$TI= <>
##$TILT= no
##$TM1= 0
##$TM2= 0
##$TOPLEV= 0
##$USERP1= <user>
##$USERP2= <user>
##$USERP3= <user>
##$USERP4= <user>
##$USERP5= <user>
##$WDW= 1
##$XDIM= 8192
##$YMAX_p= 0
##$YMIN_p= 0
$$ End of Bruker specific parameters
$$ ---------------------------------
##NTUPLES= NMR FID
##VAR_NAME=  TIME,          FID/REAL,        FID/IMAG
##SYMBOL=    X,             R,               I
##VAR_TYPE=  INDEPENDENT,   DEPENDENT,       DEPENDENT
##VAR_FORM=  AFFN,          ASDF,            ASDF
##VAR_DIM=   8192,          8192,            8192
##UNITS=     SECONDS,       ARBITRARY UNITS, ARBITRARY UNITS
##FACTOR=    0.0002076,     1,               1
##FIRST=     0,             0,               0
##LAST=      1.7004516,     0,               0
##MIN=       0,             -109440,         0
##MAX=       1.7004516,     119749,          0
$$ Real data points
##PAGE= N=1
##DATA TABLE= (X++(R..R)), XYDATA
$$ [...]
2062E03m42p45R34K8j349J639J5j740J260P87j721Q39Q61j707N32J457j520o54
2080a023K094j445j15J461q23j054J803l58j722J439M96j459P11J097j640K11
2096c27J172j408L02J214j458k81J512o89r09J762n41r37R44Kj221J162K22j153
2114f32O88N84j289N09J091j695K69J339j394k24J614j168k09J323o33r02J607
2131H78k73j644J542J98j602P72J099j786N65J245j725K44J374r88q56K068q97
2148B14p77J369n49j289J660M5j319J204J52j322O60O73j265N80Q28j560O82J152
2166A138j803o4J482r67p96J794n41p50J500l75j716J269N57j661R34P94j273
2183d78J22J622j818j65J430j053m26J700o68j168J345n0j520J644J32j558R37
$$ plain form
2062 503 61 -684 250 278 -1071 568 583 -1157 103 890 -831 8 869 -838 -306 1151 -369 -1023
2080 -1023 1071 -374 -489 972 149 -905 898 540 -1182 257 753 -706 5 1102 -538 -327
2096 -327 845 -563 -261 953 -505 -786 726 37 -872 890 349 -588 356 358 -863 299 521 -632
2114 -632 56 640 -649 -140 951 -744 -475 864 -530 -754 860 -308 -517 806 173 -729 878
2131 878 605 -1039 503 701 -901 -129 970 -816 -251 994 -731 -487 887 -101 -957 1111 214
2148 214 -563 806 257 -1032 628 673 -646 558 710 -612 48 721 -544 36 864 -696 -14 1138
2166 1138 -665 -729 753 -214 -1010 784 243 -507 993 618 -1098 171 728 -933 1 795 -478
2183 -478 -356 1266 -552 -717 713 -340 -766 934 266 -902 443 393 -1127 517 649 -909 28
2200B8O49j329P90Q54j528J34R78q17l59J344r96j26J041o84p70J450m16j012
2218g69J391m07j226J069P32j599J212L28j264J91J340j752L31J428j321n83J340
2235D41n20q20J531q0j573J337L89j752Q21P49j265M61J111j535N68R33q40o70
2253g14J554j117l16P73k5j110J549m06q95R71n5p11O90N72j446M55Q17j224L08
2272c30J278j424l3J640j490m86J549o88p97J385J98j438R33L11j681J249O62
2289H38j313L7J150j360J68J314r71l08J088m84j091J531m70o98P96j35p49Q51
2307A94J63q44Q70J78j212N94P09j350O72N02q15N6J112j083l95J639p92r51J213
2326D60j1j577J406J32j151J034N05j294J81J264j298j22J360j016p44J283j24
$$ plain form
2200 28 677 -652 138 992 -536 -402 576 -241 -600 744 -252 -378 663 -21 -791 659 243 -769
2218 -769 622 215 -1011 58 790 -809 403 731 -533 -342 998 -754 -423 1005 -316 -899 441
2235 441 -79 -899 632 552 -1021 316 705 -1047 -226 523 -742 -281 830 -705 -137 796 -44 -714
2253 -714 840 -277 -593 180 155 -955 594 188 -707 264 209 -502 188 760 -686 -231 586 -638 -330
2272 -330 948 -476 -509 1131 -359 -845 704 16 -781 604 802 -636 297 608 -1073 176 838
2289 838 -475 -438 712 -648 -480 834 -137 -445 643 159 -932 599 129 -569 227 92 -657 194
2307 194 357 -487 383 561 -651 -57 652 -698 -26 476 -339 -283 829 -254 -649 990 198 -753 460
2326 460 449 -1128 278 410 -741 293 798 -496 -315 949 -349 -471 889 -127 -871 412 288
2343B88q59J269j98j392J055N79j288Q86J04o27J16P38j049N63L29r36J44R20
2361F42r73j02J426j313q3Q88j26p74J006l29r84J027J50j484Q45J084j513N90
2379b3R40j664K94J409j239n47J464n13q19J208j18j567J288N74j520Q27O49r75
2397c32M69N33q16j4Q86q39l41P23j70p70J328m89o35J091o61n35P97K62j162
2416f75O32M02j110P00M65j046Q04Q41j648J45J138o36p53J639r19p74J215j52
2434B68j183J070P06j710Q61N98j049M08O13q28k06R75n19n06J324p66n70Q84
2452C70k9q56R47L8j020P43J39q00M93J71q09L39J318j527J2R27p64M7R24j174
2472e11j99J327m58j010J352n03o62R36K18j406O67J098j449M22J005j071p02
$$ plain form
2343 288 -571 698 500 -892 163 742 -546 340 444 -183 -67 671 -378 185 514 -422 -278 642
2361 642 -331 -433 993 -320 -403 485 359 -415 591 262 -722 305 455 -1029 -184 900 -613 -23
2379 -23 917 -747 -453 956 -283 -830 634 121 -698 510 392 -1175 113 687 -833 -6 643 -332
2397 -332 137 670 -146 -160 726 -113 -454 269 99 -671 657 168 -467 624 -37 -572 225 487 -675
2416 -675 -43 359 -751 -51 414 -632 172 1013 -635 -490 648 12 -741 898 -21 -795 420 268
2434 268 -915 155 861 -849 12 610 -439 -31 582 -246 -452 523 4 -502 822 56 -514 370
2452 370 341 -515 432 470 -550 193 332 -468 25 196 -613 -274 1044 -483 -471 456 -308 -261 663 -511
2472 -511 -710 617 159 -851 501 -2 -664 272 490 -916 -249 849 -600 -178 827 -244 -946
2489i46J591o47m65J045l91q88R59J52j102Q74J64q94N97M24q47J80O89q25J78
2508a52L41m54K02P11r67j79J179r84l34J217o09n72J191k06q68J087j74j217
2526g88R87K67j113L38R19j053J94Q05o00m64Q75l41m38O83j8o01M33K71j129
2545g73P81O46q46J92J95k73k7M92n70J22L10o27JQ67o29m57J014m87o37R29L0
2566B53p21J133K3j375O77O58j324L88J167j255l00J264p65l92J286n39q12J051
2584D17K6r79P51J85p75J98P46r49Q6O15o98MR66r98K35N83q38J2N87o0m35L77
2606E6P7p54R69k55q96J254J19j029O28L98r91J38R78q50m7O09q42k05J033k79
2626A11p52J453o48j122J183R0p20O31M45j120J79O25m41l57Q72m84k90P37k28
$$ plain form
2489 -946 645 -2 -467 578 187 -701 258 410 -692 182 346 -548 49 473 -374 -194 495 -330 -152
2508 -152 189 -265 -63 648 -319 -498 681 -303 -637 580 -29 -601 590 384 -484 603 429 -788
2526 -788 199 466 -647 -309 610 -443 -249 556 -44 -508 367 26 -412 271 253 -348 85 356 -773
2545 -773 8 654 -192 0 195 -78 -105 387 -183 -61 249 -378 -377 490 -139 -596 418 -69 -706 223 253
2566 253 -468 665 688 -687 -10 648 -676 -288 879 -376 -676 588 -177 -569 717 178 -634 417
2584 417 443 -536 215 400 -375 -177 569 -380 -294 321 -377 -373 593 -405 -170 413 -425 -413 174 114 -321 56
2606 56 133 -621 348 93 -803 451 570 -459 169 567 -424 -286 692 -158 -205 404 -438 -643 390 111
2626 111 -641 812 164 -958 225 315 -405 226 671 -449 -270 355 -86 -443 429 -55 -345 392 164
2645A64o67Q32n48l49P56K94p27M38Q6m71K22M19j037Q51j11n06K16Q78j132K
2665c90J212j097l17J398o37o92J026m57n88O97L33j178N68O45j115J47J273j210
2683c82k43J083m20q92J173j81p43R10p1p99O95O3p59N89N2l18J46N8k94K10M57
2704C34n24J43M93r14J25P87q31K81Q57p45n73R44l15n53P47J89j071M98O27j011
2724e12J34R65r08l34J577j111j37P90n14l44P31J01p90M94M84j068M19O39q79
2743b63q2Q88p22k71O63k63j59M02n07N29o0k20j17P05m64l11M74mo17N84O5o94
2765d44N82M55j295P52O68j130K75O68p33l94J134j40r37Q03k15r98J386L5j050
2784e78L80P95j013L15O91o78m50J186q38RL06N3m99P66k40m01N92k67k59L69
$$ plain form
2645 164 -503 329 -219 -568 188 482 -245 193 279 -192 30 449 -588 263 152 -354 -138 740 -392 -390
2665 -390 822 -275 -592 806 169 -523 503 46 -542 155 488 -690 -122 523 -592 -445 828 -382
2683 -382 -625 458 38 -854 319 138 -605 305 234 -565 130 193 -566 23 75 -243 -97 -39 -333 -123 334
2704 334 -190 -47 446 -468 -343 444 -387 -106 751 6 -567 377 62 -491 256 445 -626 -128 499 -512
2724 -512 -378 587 -321 -655 922 -189 -326 464 -50 -394 337 438 -352 142 626 -442 -23 616 -263
2743 -263 -345 543 -179 -450 213 -50 -209 193 -314 215 155 -65 -182 523 59 -252 222 218 -399 185 250 -444
2765 -444 138 593 -702 50 718 -412 -137 531 -202 -596 538 398 -539 264 49 -949 437 472 -578
2784 -578 -198 597 -416 -101 590 -88 -538 648 -190 -181 125 178 -321 445 205 -196 396 129 -130 239
2804B39k8n35N96q2m43O11j91j013O70M48n71m3Q62p47k07O98j24o41P64rq56
2825f02R59R0j050P01K56q75K12J079j021K64O25r58k72J039l47n00P73l59k49
2844b35O01j02o24M93q6m02N62Qm31K10M66p29J82M92m43l00R62r64mO79k39p24
2866f28J029j59o58R10Oj071P10M16p39K06N79q30j91J000n70p73R79Q1q28Q18
2886B87N9r27Q06P0n27R8N00m90J65K11o26J0P06o11N4O77o94J53L41j15q66J016
2908B97l48k77P90q21J25N48j12m57K31M22r23O01N17r02l58R90m96l20R55n20
2928e8o46J197n03o49P22L59o86M03L70j144L26N43k62r1N28p65K2O63l62j16
2948a49O34q37L4M31J73o57M98Q1n91O58J11p66M99K75q49O85K36r00J67O19n59
$$ plain form
2804 239 211 -324 272 190 -253 358 167 -846 -176 272 -299 -342 520 -227 -434 264 140 -501 263 254 -602
2825 -602 357 447 -603 98 354 -521 -309 770 -251 13 638 -320 -592 447 100 -400 373 14 -235
2844 -235 366 264 -360 133 47 -355 207 215 -216 -6 460 -269 -87 405 -38 -338 624 -340 -344 335 96 -628
2866 -628 401 242 -416 494 500 -571 139 555 -184 22 601 -229 -420 580 10 -763 216 297 -531 287
2886 287 346 -581 225 295 -232 -134 366 -124 41 252 -374 -364 342 -269 -215 462 -232 -79 262 147 -719 297
2908 297 -51 -328 462 -359 -234 314 202 -255 -24 398 -525 76 593 -309 -667 323 -173 -493 462 -58
2928 -58 -704 493 -10 -659 63 422 -264 139 509 -635 -309 234 -28 -119 409 -356 -334 329 -33 -149
2948 -149 485 -352 -318 113 286 -371 127 208 -383 275 386 -380 119 394 -455 230 466 -434 -267 352 -207
2969b07k52Q56k55p33R40m9o85M52L14q16N11K63r69O26N85p21r4O87m34m13P02
2990C08l70k66N01k0n27O49o3o74O61L3n45L46J86o88O00K11n87J3N85p41K28
3011a60N90l73m13O42l62m24O35j89m83P63O0n88L96J78q20L15L94m05j26Q02
3031D32p60J4O90j72m11L95P3q45N89M20p02K51L59o48M51J81m67k1L25j47k74
3052b67M36j72k7M50l77j37J16j6l45L64q5n72J110l98n20K72P28p97J12N49m59
3073c5k33O46n59k30O20j62m33M78j04m08M72M7j30J66J35r44O42J87k62J26L69
3094C88m95j46L55l31l65Q06k74k78J33K03j86N75k59k26L21M02r62N53m3n74
3114d03O26K56p76P7P49n04k52O21m03l88P39k3o23L76K34n11N82k50n17L94M41
$$ plain form
2969 -207 -459 397 142 -591 349 300 -385 67 381 -435 76 339 -630 -4 581 -140 -234 453 19 -394 308
2990 308 -62 -328 173 153 -374 275 212 -462 199 232 -313 33 219 -469 131 342 -245 -232 353 -388 -160
3011 -160 430 57 -356 286 -76 -500 135 -54 -537 226 286 -302 94 272 -548 -233 161 -244 -370 432
3031 432 -328 -314 376 204 -207 188 261 -584 5 425 -277 -26 333 -315 136 317 -150 -171 154 7 -267
3052 -267 169 -3 -30 420 43 -94 22 6 -339 25 -60 -632 478 80 -440 -168 560 -237 -125 424 -35
3073 -35 -268 378 -181 -411 209 47 -386 92 -12 -420 52 99 -31 135 270 -674 -32 155 -107 19 388
3094 388 -107 -253 102 -229 -594 212 -62 -340 -207 -4 -190 385 126 -100 221 623 -339 214 171 -403
3114 -403 223 479 -297 -220 529 25 -227 394 -9 -397 342 319 -304 72 306 -205 377 127 -390 4 445
3135D45p72P5M95m60j69R43p16r6J63j67M4O00k98l73O11Q6n09r0K72k62K46L26
3157C94n84J39M68m04m91J067o49l42R58k55n93N26o1m86O32k73l53J93L49m41
3177b06O9O75o21l52P21o31J68K37k93Q3K92K19o68O55q5o41L85q9l35M27L05
3198C15n08J16M33n79Q8N21n38J9O87n98m06O89k46k56L57J40l96N8L77l38j42
3219b07O26o41J11O25j003N12N30p36k96O71r5m22M91k16o4J22k30J27K67K92
3239D64p57L5N38o55N56L0n33J90O10q88J35P13m11l50N13l07j66L41J00l19N14
3260C53m48j00K24J01m34K75M74o46M55K55l54k16L54k42ln6K46p21M89Jj43J5
3282a21M89n75L39N0n99M46J19k13r1M13k77l90P55l27k80O83k52n54O31l01o7
$$ plain form
3135 445 -327 -252 243 -217 -386 557 -159 -255 -92 -259 -215 385 87 -286 325 411 -98 -188 84 -178 68 394
3157 394 -190 -51 417 13 -478 589 -60 -402 556 301 -292 234 173 -313 319 46 -307 -114 235 -206
3177 -206 -137 538 -83 -435 286 -345 -177 60 -233 -150 142 361 -307 348 263 -378 7 -82 -417 10 315
3198 315 -193 -77 356 -223 -135 386 -152 -133 554 -44 -450 239 -7 -263 94 234 -162 -104 273 -65 -207
3219 -207 419 -222 -111 514 -489 23 553 -183 -479 192 97 -325 166 -50 -114 8 -222 -95 172 464
3239 464 -293 -258 280 -375 181 211 -322 -132 478 -410 -275 438 27 -323 190 -117 -283 58 158 -161 353
3260 353 -95 -195 29 130 -304 -29 445 -201 254 509 155 -61 293 51 48 -8 238 -483 6 7 -136 -121
3282 -121 368 -207 132 182 -417 29 148 -65 -156 257 -20 -410 345 18 -262 421 169 -385 246 -55 -122
3303a22M48K93p20K63R7n31J39K84k79O2M82k45l36L31j88n07P27p6l85K82P3
3324I2k42j7J38k74N31O8n55L01o3k90M03L48m11j36M63m07l37P93m20O1K93l51
3346a2k40K35L14l86K42P5l27K75K67p16J85J51m30K83K86Jm10M40m7p20M77L66
3368C09r03M08O46p44K90L05o88N58J17m72R9K31l25J2K77l8l95N95j27l21L09
3389A43p4J2O0K44n72k11N15m33J68L61n56Q2N46n72Q4O13m22j73K85J32n30M69
3411A71r6o18N54n6j59J78J44m09J98K74m36K71K99m80n4K39P7k33J54K15m75
3432b42L34K96o37L10m0l59L5O03m11MM67k81k31K48r3o0J94k49j44L48J39p23
3454d92N13K26n15L34K71o52k04N05k72L41n6K4QL77m94j24M91o9l30L03j14j17
$$ plain form
3303 -122 326 619 -101 162 259 -272 -133 151 -128 -66 416 171 -165 166 -22 -529 198 122 -263 19 92
3324 92 -150 -167 -29 -303 228 296 -259 42 -21 -311 92 440 29 -107 356 -51 -388 405 -15 46 339 -12
3346 -12 -252 -17 297 -89 153 228 -99 176 443 -273 -88 63 -367 -84 202 203 -207 233 186 -534 -57 309
3368 309 -594 -186 460 -284 6 311 -377 181 298 -174 -75 156 -169 -157 120 82 -313 282 155 -166 143
3389 143 69 81 141 385 -187 -398 117 -316 -148 213 -343 -261 285 -287 -203 410 -12 -185 100 232 -298 171
3411 171 75 -543 11 -45 -204 -26 118 -291 -93 181 -255 16 315 -165 -219 20 97 -136 18 233 -242
3432 -242 92 388 -249 61 21 -338 -303 300 -111 -107 360 79 -152 96 3 -57 137 -112 -256 92 231 -492
3454 -492 21 247 -268 66 337 -315 -519 -14 -286 55 -1 23 31 408 -86 -210 281 212 -118 185 71 -46
3476d6L49j7q19N31J26k41J32K55k95j61M35l19QO00n34m32L60p2k57O36J88n28
3498a01M37k42m7q1J2j47k85J000n43J27L89p21j50Q74m67q6M32m09r9J8J23j10
3520g6J91J26l59J19L79o53M98k4l17j03O04l27m40N27j19k95K87N3j20J30J39
3541B20m40M35J98m72M7n8k98L47L11m20Q7J92n8k79N64k88l20N27l82l32L35
3562h4L55m12J81L27m40o9L37n52K02K36j57J44K28n20l6M54k81k1M50k06l26
3583a90K78K59n12M9K30m43M11L25l32q4L99l57N1J04o6m74O04m90k86P98j18
3604A56l40L66q9l58L52k51K7K53O5m94J00M19J5l56K24j59j71M20k89k07O60
3625C43n13K08K04k19k74J39O27q91K21O16q15k02N69j8j52L87k71m80P07l07
$$ plain form
3476 -46 303 286 -533 -2 124 -117 15 270 -25 -186 249 -70 -62 538 4 -428 -68 -140 -397 239 427 -101
3498 -101 336 94 47 -34 -22 -169 -454 546 3 130 519 -202 -352 522 55 -31 401 -8 -107 -89 34 -76
3520 -76 115 241 -118 1 380 -273 225 201 -116 -219 385 58 -382 145 26 -269 18 71 -49 81 220
3541 220 -220 215 413 -59 -12 -70 -368 -21 290 -130 -43 149 91 -188 376 88 -232 295 -87 -419 -84
3562 -84 271 -141 40 367 -73 -142 195 -357 -155 81 -76 68 296 -224 -260 194 -87 -108 342 136 -190
3583 -190 88 347 -165 -116 114 -329 82 407 75 -9 390 33 84 188 122 -352 252 -238 -524 274 156
3604 156 -184 182 93 -265 87 -164 -137 116 181 -313 -213 206 221 -135 89 -70 -241 179 -110 -317 343
3625 343 -170 38 242 23 -251 -112 515 -376 -155 461 -354 -556 13 -5 -157 230 -41 -521 186 -121
3645a21j53L00M1k49j71M58n34M48r8j15K48j62l5QP81p93K22K33m37J87J18m08
3667b32O5K15J05l11L75j7k20l2K58k39j67J31J48j15J93R7k80R4L0l86M20J16
3689B48m61N60l17j85K91K35o64K77L88l91j88L69l03j17M36j78k64O31m78o8
3709a79K43J28n00M11j25j67L25K63p21K68J51p16M17P71r67JQ65l76j75M28m81
3730a36K8J8j63P5L34l5j45o7J75m92J70M48k76Nl5q5J05K21l93P0N17k46l31
3753b38J73Q1m23O86l88j97L97K33o17L62O1n43O28k2j5j41K3J73n15N21j54k83
3775a98N46l05j99J65J10m20J46M99m42J50M35p49K08J15k17j96M72l2l59M60
3795A89k52j52L48j56jJ71q5j80J98l19J02K98J13m98P0k0k76N19J60l70k77L54
$$ plain form
3645 -121 -274 26 67 -182 -353 105 -429 19 -79 -194 54 -108 -143 -135 646 -147 75 308 -129 58 176 -232
3667 -232 -167 48 153 -158 217 200 -20 -52 206 -33 -200 -69 79 -36 157 254 -26 68 98 -288 132 248
3689 248 -213 347 30 -155 136 371 -293 -16 372 -19 -207 162 -141 -258 178 0 -264 367 -111 -179
3709 -179 64 192 -308 103 -22 -189 136 399 -322 -54 97 -619 -202 569 -398 -397 468 92 -83 345 -136
3730 -136 -108 -90 -253 -178 156 121 -24 -91 84 -408 -238 210 -66 -61 -96 -181 -76 145 -248 -178 339 93 -238
3753 -238 -65 16 -407 279 -109 -306 91 324 -293 69 130 -413 215 193 178 37 60 233 -282 239 85 -198
3775 -198 348 43 -156 9 119 -301 -155 344 -98 52 487 -262 -54 61 -156 -352 120 88 -271 189
3795 189 -63 -215 133 -23 -24 147 62 -118 80 -239 -137 161 274 -224 -154 -174 -450 69 229 -141 -418 -64
3817f4K22k57M22n08k46N21j45j86K3M13n25L17m6j13n5L68k15l0L75n21pL08
3839E1K41k56K04L5m16P8K26l16L60m0m88K76K53l21R7K88k51j25J99k60j31M59
3861A63j56j75N90m74O9J49J86n05J06m6p7J61K35j49l9M4k00l27R20n51j60O54
3883D18n96L0K71j78j67L97r2K8j56P7k00j36P21n76p7N51m68l90Q57n2n83O20
3905B99j65m03P15n66M4L23m36j22Q41l95n95K97L22k33l11M83J11l35m0J53k87
3926c00N82l55n5J93k6m12K85J17J8L2Rk44p2M97n32Q0M77n46J74K83l88P1N79
3949D67n14j25L69l03K62J09k18j22N2K3k16j7L90j47j9K80j30j65L37q6k42q3
3971i8L04n66N51P9o81K20K74j41k3J36O2r6K23m25P5M25o74M41l7k57J87K63
$$ plain form
3817 -64 158 -99 323 -185 -431 90 -55 -241 -218 195 -330 -13 -59 -172 -227 141 -74 -104 271 -250 -257 51
3839 51 292 36 240 275 -141 -63 163 -153 207 167 -321 -45 208 -113 -16 272 21 -104 95 -165 -296 163
3861 163 7 -168 422 -52 17 166 352 -153 -47 -93 -170 -9 226 77 38 82 -118 -445 475 -76 -236 418
3883 418 -178 -148 123 -55 -222 175 83 111 -45 32 -168 -304 417 -159 -236 315 -153 -543 314 262 -321 299
3905 299 134 -269 446 -120 -76 247 -189 -311 530 135 -460 -163 159 -74 -385 98 209 -126 -166 -13 -300
3926 -300 282 -73 -128 65 39 -373 -88 29 47 79 88 -156 -228 269 -263 -183 294 -252 -78 205 -183 -112 467
3949 467 -47 -172 197 -106 156 265 47 -75 -23 0 -216 -233 157 10 -9 271 141 -24 313 227 -15 -98
3971 -98 206 -360 191 270 -411 -191 83 -58 -81 55 117 21 244 -181 -106 319 -355 86 49 -208 -21 242
3993B42k34j28Q5J48l76K39K16l59j8M95n92J90M33o12J97R6j90j65L49K44l92
4014a32J87j48l22J03L28k0K79o6m50P8J72o0k7K51l25J96J88k00j28L24k84j80
4036b36K86M4j10K07m68PK66j38M8p9L92j42j55l1k1K83J6j05P8J67l52j15n5
4059b13M44L4k44L2l13L45J23l09p4J12R3M09l79J09m35L66L1p6R5j1k81O60k43
4082B75o16N27j70k25M45k18l16J49K55r1K8l1j92L57m9j43k37K16N0k69R3M10
4104B48p17J96K47N8k54N70p14K63K68k89k7M63m21L47J2l04k6L76J7m43M84l
4126C51n83L72p5l58N62k46m2K1L63m53L11j14l32K02j15k6N3J44Q3m75M04M08
4148D55m21k78K2K23j60L18jr3N3k04L1j1l8k12K55j65j80L81m2K51J9q2l64K58
$$ plain form
3993 242 8 -120 -35 113 -263 -24 192 -167 -185 310 -282 -92 341 -271 -74 22 -168 -333 16 260 -132
4014 -132 55 -93 -415 -312 16 -4 275 209 -241 -163 9 -51 -78 173 -152 44 232 32 -96 228 -56 -236
4036 -236 50 94 -16 191 -277 -270 -4 -142 -94 -173 219 77 -78 -109 -130 153 169 64 142 309 -43 -158 -213
4059 -213 231 265 21 53 -260 85 208 -101 -175 -63 30 439 60 169 -266 100 131 55 150 139 -142 518 275
4082 275 -341 186 16 -209 236 18 -298 -149 106 15 43 12 -180 177 128 -15 -252 -36 14 -255 -162 248
4104 248 -469 -273 -26 32 -222 348 -366 -103 165 -124 -151 312 -109 238 250 -54 -80 296 313 -130 354 351
4126 351 -232 140 65 -293 269 23 -19 2 365 -88 223 109 -223 -21 -136 -162 -109 35 118 -357 47 455
4148 455 34 -244 -222 1 -159 159 158 65 118 -86 -55 -66 -104 -316 -61 -226 -406 -25 -67 184 203 121 -243 15
4172A5j91O8O2m3j82L10K15l10r8M59j68J10J61l10PJ7Q2n44L73K5m2l11K65R5
4196F5Lj58K38k6p2l05K46o1q3J93P4L41n82M16L1l98l15N76k21J25k53J65K03
4219B02J16j47M0l56L60j55J24m52L91Q3q5q7j65J64j52L85j57k61J65J62j71
4240DK0J53m36J71J83l91N19q5P1j95J31q7k28L14j55n2L19k64k06KK01j14J54
4263B9K39k62k36M56l66K01J41m14M35O8j67m10K49K32k57K06j70m29L07K17j04
4284c5L8p5J78Q0K34l09k50J87k10K65l5r1K0R3N6j00M1O2ll26L05m87K01L72
4308B11k80J84N2l40J34p5j96K63K63K2p40P29k99k82L80q9j29K00k16j30L34
4329dK90n9j82J24k81K21k19Jj82M96l31J85J16n17Q3J16K76l39L37k23P1M2M2
$$ plain form
4172 15 -176 -108 -46 -89 -271 39 254 -56 -154 305 137 247 408 98 105 122 204 -340 33 58 16 -295 -30 65
4196 65 68 -90 148 122 50 -255 -9 -70 -153 40 114 455 -127 289 320 -78 -393 183 -38 87 -166 -1 202
4219 202 318 171 211 -145 215 60 184 -268 123 206 121 34 -131 33 -119 266 109 -152 13 175 4
4240 4 24 177 -259 -88 95 -296 223 138 209 14 145 58 -170 144 -11 -63 256 -8 -214 -212 -11 -125 29
4263 29 268 6 -230 226 -140 61 202 -212 223 291 124 -286 -37 195 -62 144 -26 -455 -148 69 -35
4284 -35 3 -72 106 186 420 111 -139 48 -162 103 68 -23 -3 90 146 46 87 149 146 -180 125 -362 -161 211
4308 211 -69 115 167 -173 -39 -114 -310 -47 216 238 -502 227 -72 -354 26 -63 -192 8 -208 -338 -4
4329 -4 286 227 45 169 -112 109 -110 -109 -291 205 -126 59 175 -342 -259 -143 133 -206 131 -92 -21 21 63
4352F3k70l1M70k9j98N3r9J50P6k08J7L9J57k11N5j58J7pj22JM28Q2l23M06k40
4377A18k32O3k9r2R8M7n5j22P5M28j55j03l9M0j88K44J47Lj20k40m3M92n19m55
4401f37P03P2k95L24j38l0J59k54J62m7p3P4J23l17Q1L41k19l1L21j78j3o3K35
4424C00n85j4N01k50n5L94n65L05jK28m30J31J73k35n18Q81n19QL08j6j66J84
4446E9J29l77M98j41k70R9m9J80R6l59j61L85j61j47n0J81j8Q2j28J02J15n6P8
4469H7m39M91l88J47J87%k39J97J76l43k7N6L52l08K27l52j21M89p4j99Q4q2K64
4492A85k36j68K22k2K30j22m3L0j16K0K64k55k87L40K0k19J68j71J10NR0p9J22
4515H8k43l54N12l1J26j23J62k22J44K89l62J93o3j53K73j36k72N7K04n6K02l27
$$ plain form
4352 63 -207 -238 232 203 5 58 -41 109 185 -23 -6 33 190 -21 34 -124 -107 -114 -236 -235 193 275 -48 358 118
4377 118 -114 -51 -80 -172 -74 -27 -82 -204 -129 299 144 41 2 42 -146 98 245 248 128 -112 -155 337 -182 -637
4401 -637 66 138 -157 167 29 -1 158 -96 66 19 -54 20 143 -174 -93 248 29 -2 319 141 128 65 300
4424 300 -285 -299 202 -48 -103 291 -274 31 30 258 -172 -41 132 -103 -621 260 -259 -251 57 41 -125 59
4446 59 188 -189 309 168 -102 -3 -52 128 224 -135 -296 89 -72 -219 -269 -88 -106 -24 -152 -50 65 9 87
4469 87 -352 139 -249 -102 85 85 -154 43 219 -124 -151 -95 257 -51 176 -176 -297 192 118 -81 3 -79 185
4492 185 -51 -219 3 -19 211 89 46 76 -40 -20 244 -11 -298 42 62 -157 11 -160 -50 -45 45 -34 88
4515 88 -155 -509 3 -28 98 -25 137 -85 59 348 -14 179 116 -37 236 100 -172 -115 89 33 235 -92
4537i2K71l74K56Ol54J41K36l4p2J63m00N38j32k37q5N8K6J37M7j42N7r2J08l04
4561b74M35J37j72k18l9J66j66L7n3N6P9K5J14j10K08l66L82n7q4L00m18J36j3
4584A05j25j93L83m56L42l51L11M5k48K09M8o8k07O6K47l0J0q6J01J43m66K58
4606C8P1p6R1j25J53k62L98l10N2J42j39k12RK75L0k5k33J40R5m7l99K95J02o2
4630Ap5L98o2n51M16K6k88L16k72K9N9pr4M3Q5r5N1m6J79j6j23k8l6J20p9l9%
4657h8o0P9M7r4P4K46j43l60L73K8J01l4j6l14J55J74k96K50l6J5lj88J46l07
4681b51M53k5K9l46rR9K77q1J0j65p1l8J80J6n57M69K99j40J99m82K4J19K26m67
4705b32K7M38l32k35J64M13j67oL4m40L16K50m76L2K68j19l5J43jj65M1k3j47
$$ plain form
4537 -92 179 -195 61 67 -287 -146 90 56 -16 147 -253 285 153 -84 -169 -111 -85 52 99 -43 14 -78 30 -274
4561 -274 161 298 126 -92 -131 35 -131 -94 -147 -91 -12 13 127 17 225 -141 241 184 100 400 -18 118 105
4584 105 -20 -213 170 -286 56 -295 16 61 -187 22 70 2 -205 -139 108 78 88 2 103 246 -220 38
4606 38 109 33 124 -1 152 -110 288 -22 30 172 33 -179 -170 105 135 110 -123 17 112 65 -334 -39 63 1
4630 1 -74 324 262 -289 127 153 -135 181 -91 -62 -3 -10 -104 -61 24 -71 -20 -66 113 97 -26 -54 -90 30 -49 -88 -88
4657 -88 -148 -69 -22 -116 -42 204 61 -299 74 102 203 169 153 -161 -6 168 -128 122 86 101 98 -90 56 -251
4681 -251 202 177 206 -140 -149 -50 227 146 156 -9 -80 -118 62 78 -479 -10 289 149 348 -134 -110 9 235 -232
4705 -232 -205 233 -99 -334 -170 243 76 70 104 -336 -20 230 -246 -214 54 -65 -100 43 42 -123 -82 -105 -252
4728b52J24J57j53K30n6j91J93n2q7j33M41j90k38K91l71K20M01n62l6J53J19
4749Hj17k0K76j76J61j01r5k32K03M1j1K68l29K25j10k11J50J63k05L40k07j76
4771a55J21J06J71l07R5M0n0K68l33j39K32r3k25K29N6q0j35L6K82k63P7j65M12
4794A80m25K58K1J0l29K78J94J18k95K9K51k92K39l67J27l13J93J9j13L13J09
4815B05j86l7o9o1J46o3M46k87k79L07K71n54j47L81q6J57k68M5J21k45L41l64
4837b26J41Q3K3j3o5J7p6J20k6l82L19K88N5m23K46k79L02p3k88K33J47K9n48
4860c96M82Q1j12n5j20K33q6L40n03L30j82k73P2J58p2k99N67M6O4m80k0M6l4
4883b13L34j81J97j26R7j73K90p4k11k0j37J44K28k58O9J46m28M8L38j15j75M17
$$ plain form
4728 -252 -128 29 -124 106 50 -141 52 0 -87 -220 221 31 -207 84 -287 -67 334 -228 -264 -111 8
4749 8 -109 -129 147 -29 132 31 -64 -296 -93 -52 -63 205 -124 101 -9 -220 -70 93 -112 228 21 -155
4771 -155 -34 72 243 -64 31 71 21 289 -44 -183 49 -44 -269 -40 16 -64 -199 -163 119 -144 -67 -232 180
4794 180 -245 13 34 44 -285 -7 187 305 10 39 290 -2 237 -130 -3 -316 -123 -104 -217 96 205
4815 205 19 -18 -87 -148 -2 -65 381 94 -185 122 393 -161 -308 73 -13 144 -124 -79 42 -203 138 -226
4837 -226 -85 -2 21 8 -57 -40 -116 4 -22 -404 -85 203 258 -165 81 -198 104 31 -257 -24 123 152 -396
4860 -396 86 167 55 0 -120 113 27 367 -136 194 12 -261 -189 -31 -103 -402 165 211 275 -205 -225 -179 -213
4883 -213 121 -60 137 11 108 -65 225 151 -60 -80 -217 -73 155 -103 -34 112 -316 -268 70 -45 -220 197
4905A97P6m12L22r9k69K42q0j28r9J57j24K56k79L68M6k08J6r9J5j64L26J75j81
4928E4Q5k30L07l16m9Q4P5J28n4r9O6P0k48r8M03j10j95O9j13J73K20j17l53L89
4952A41P2k33q4K16j96K05k83j0J41J1j44K82K5j70J65p1J42Jl8%k39j94K74o1
4976d8L72j61m17l1J52K3K71r1k51J21O7P1N5l88J8L41Jm2k58L72k65M7R2J70
5000B21r2m27M14r3J41k45lk06L86j8j06J43j04p2K69k55r9J0M53n19L74k95o8
5023a91J79N4m3j93K97j23K61k70J8O5j85m2J12L08j44J2P2l20RJ87k17k33K58
5046a29J34Q3P3L0j17j26K6l8j09M71l22j11J83Pm9M8m06K84Q3k87J41j34K95
5069C0j05m6K63J45k61q5j4J58r9j70J10R4l9J12r5j99M4J31k19K04N0K01l55
$$ plain form
4905 197 273 -139 183 84 -185 57 -23 -151 -250 -93 -217 39 -240 128 174 -34 -18 -117 -102 -266 60 235 54
4928 54 139 -91 216 -100 -149 -65 10 138 84 -15 51 121 -127 -225 178 68 -127 -58 -171 2 222 105 -248 141
4952 141 213 -20 -104 112 -84 121 -162 -172 -31 -20 -164 118 143 -27 138 67 209 210 172 172 -67 -261 13 -48
4976 -48 324 163 -254 -285 -133 -110 161 70 -181 -60 7 78 133 -255 -237 104 105 63 -195 177 -88 -41 51 221
5000 221 129 -298 116 23 164 -81 -84 -290 96 78 -28 115 11 -61 208 -47 -146 -136 317 -202 172 -123 -191
5023 -191 -12 42 -1 -194 103 -20 241 -29 -11 54 -131 -173 -61 247 103 115 187 -133 -124 63 -154 -387 -129
5046 -129 5 88 161 191 74 -52 -26 -64 -173 298 -24 -135 48 55 6 54 -352 -68 15 -272 -131 -265 30
5069 30 -75 -121 142 287 26 -59 -73 85 -14 -184 -74 20 -19 93 -2 -201 -157 -26 -245 -41 9 210 -145
5092a45O7J48k6o8L05k16K71l50p6K00N7l16J56j02k15M72j58M2p0o0R2j77J67
5115bj21l7j10L51l20O9J29o7L79o3j15K2j18M0J50J88n82K08l8J30l19n7N23
5138B40j95j05k85N48m03J97k8k29L6O89q97O04k77K6K03K6j89J40K5P9k63p3
5160a31JO1O2l5k13J70L9pJ49l60K92l3M8j99K72l07L77p4k7k47K7L97n59K58
5184c9K10k44J66R1r1K63o1k88n4j49K28J87k64Nj07J44%l23O56m51m6N53k79
5207A07l73O25l55j54K39M3l79J70K2P9j00K73q5r0kJ17k53Q1J13j37j65L32k56
5230a48j1L88k24J25j83O7j56n3j09M20j00J03j6k85J93k58R9L94p5k47p5J55
5252Dp0j49M21j24J21j54l14K35O2k49K3K09K48m63r2M12J6l78J83k25K98j95
$$ plain form
5092 -145 -78 70 44 -24 281 65 336 -14 -90 110 167 -149 7 -95 -310 162 4 46 -24 -84 8 -169 -2
5115 -2 -123 -160 -270 81 -239 -170 -41 -108 271 208 93 115 -3 37 187 375 -207 1 -37 93 -226 -283 240
5138 240 45 -60 -345 203 -200 -3 -31 -260 -224 465 -432 172 -105 -79 124 150 -39 101 126 205 -58 -131
5160 -131 -130 -69 -7 -42 -255 -85 -46 -53 96 -264 28 -5 43 -156 116 -191 186 112 85 -162 -135 262 -297 -39
5184 -39 171 -73 93 184 93 356 295 7 -47 -196 32 219 -45 -40 -147 -3 -3 -326 330 -121 -167 386 107
5207 107 -266 359 4 -150 89 132 -247 -77 -55 24 -76 197 112 22 20 137 -116 -35 78 -59 -224 108 -148
5230 -148 -159 229 5 130 -53 14 -142 -195 -304 116 16 119 103 -182 11 -247 -148 246 171 -76 -151 4
5252 4 -66 -215 206 82 203 49 -265 -30 32 -217 -194 15 263 -200 -292 120 136 -242 -59 -284 14 -181
5274a81K41k8k19K09p0o3J87KJ10k61K97j65n7Kj08M0r2M1O8l7q4J87j20K75l39
5299a65O1o4L09j41J92r2k41K31kk28R0M62o83J45k2Q5P9j98l06J29L46P0l19
5322b62N56k07j15q1J76l81K35Qm7J89j23K74q6k03M9J13O7k76K25n2O8j72N8
5345A3l0J06j05N3J28r2J80m79j14L56j03k3j33K12J55J2m39K67k27q7K99K50
5367A99r5n6K98l74O4K97l82pj55J83p6N0K41j0k24K53k13j04Q4j24R2j06M6q5
5391b04nK21l5j29J55k49J75O4K59l05J38j43N4r3J86l50K41J67k9j67L39k01
5413H9j74K34m06J62j3j49M24k79Q8J48J7o5k1j09k13M54l03K8k06O75l29K2m3
5436C1r4K46k19q5o0L64r0k11j99M12k7l24M42k47K32J47j00k40o1M4o0N26k74
$$ plain form
5274 -181 60 32 -187 22 -48 -111 76 78 188 -73 224 59 2 4 -104 -64 -156 -115 -47 -84 -168 19 -101 174 -165
5299 -165 -104 -168 141 0 192 100 -141 90 88 -140 -50 412 -271 -126 -148 -63 16 -182 -488 -359 -13 57 -262
5322 -262 294 87 -28 -109 67 -314 -79 -71 -118 71 -52 222 136 -67 -18 95 162 -114 111 59 127 -45 13
5345 13 -17 89 -16 37 165 73 253 -226 -340 16 -87 -110 -243 -31 124 136 -303 -36 -263 -350 -51 199
5367 199 104 48 346 -28 36 333 -49 -56 -211 -28 -104 -54 187 177 -47 206 -7 -111 -27 -151 -59 -165 -119 -204
5391 -204 -209 12 -23 -152 3 -246 -71 -7 252 -53 85 -58 -4 -97 89 -261 -20 147 118 -49 290 89
5413 89 -85 149 -257 -95 -108 -257 167 -112 -24 124 141 76 55 -54 -267 187 -116 -88 -294 381 52 74 31
5436 31 -63 183 -36 -121 -181 183 93 -118 -317 95 68 -256 186 -61 171 318 218 -22 -83 -39 -99 427 153
5459A53j24j6j50K76l78j0N75j42j74j4l12L56j26K49n2L1K49l31R9J08p2q2l09
5482a96L02o3J87k93J25O0j01J4p4k99P5K54K8J54r8K33n17L50m72L54K7n3k61
5505b64K88j5p2J60j22k8K62J38j05q5l22q8K27O5l99M88k38o7J14K36m67K56
5527c8L64l54J47j19m2N3J40k67K2K22J16l74J38l4L07m56J17O3j06k9M65l09
5549B6Kj56K65k54m6K18r1L7l56O2M04k2j04L32k32J49k1q7k57J83l6J36q4Oj78
5574a04J40q9l13K02l06N15j3j68j00J28J30J36j05j63J66J90k93J99k1J94k07
5595A18j08q7q8K93n1j75L26j14j31J44k92o9K98J50J8p6k12P9j76M18k49l13
5617b97J92J22k54J28J29k96J35m5J70p4J48l23K63M1j41l2L92l78J38J33j30
$$ plain form
5459 153 29 13 -137 139 -239 -249 326 184 10 -4 -316 40 -86 163 111 142 391 60 159 267 195 113 -196
5482 -196 106 43 230 -63 62 122 21 35 -39 -338 -263 -9 19 173 75 308 -209 141 -331 23 50 -3 -264
5505 -264 24 9 -63 97 -25 -53 209 347 242 157 -165 -253 -26 39 -360 128 -110 -177 -63 173 -294 -38
5527 -38 326 -28 119 0 -42 11 151 -116 -94 128 244 -130 8 -26 281 -175 -58 5 -101 -130 335 26
5549 26 28 -128 137 -117 -163 55 -36 1 -355 -293 111 89 -15 317 85 234 213 126 -131 52 16 152 68 74 -104
5574 -104 36 -53 -366 -164 -470 45 32 -136 -236 -108 22 158 53 -110 56 246 -47 152 131 325 118
5595 118 10 -77 -165 128 77 -98 228 114 -17 127 -165 -234 64 214 232 156 -56 23 -153 265 16 -297
5617 -297 -105 17 -237 -109 20 -276 -141 -186 -16 -90 58 -265 -2 39 -102 -134 258 -120 18 151 21
5638B1Q7k04K69j26K1l59K27J97l20K33j36j3q3r5L30j59K05j66r0J59k21K36
5660A3j45P2J04r4j5K77K02l54L02m85J87l3rp3m3J59l44M29k05L25j85k61P9
5683i7J03J10J05n4lm31K69J00j8k87O1k11M38j26O0qO0j25j42M35j33l88K19
5706f3J34j15N9R8j89J69L4j20K28j16J62l82k31K24n7L28k16N8o3O4j4m9J40
5729H3J7k74J12P8K65k13k84L06J54j52l75J10J04L2J32k0j42N3j56J74Lk88K38
5752d3K4J34l68K62J61l72PJ49J65k22j50K86k49J89O0j52K14j62p6o9M51km89
5775b52J99j57l7K25M8j7O2k7P2l3j67J73j18J63k11P1O3r0j84K61r0M5j08M1
5799f8J54j68J44NK24j81k06K69r8m75L83l17J64J37r3L6nO0q2r7L91m02j3K65
$$ plain form
5638 21 108 -96 173 47 68 -291 -64 133 -187 46 -90 -103 -186 -281 49 -110 95 -71 -161 -2 -223 13
5660 13 -132 -60 44 -50 -65 212 414 60 362 -123 64 31 22 -51 -94 65 -279 150 -55 270 85 -176 -97
5683 -97 6 116 221 167 164 -267 2 102 84 -203 -142 -353 85 -41 19 11 71 -54 -196 239 106 -282 -63
5706 -63 71 -44 15 113 -76 93 127 7 235 119 281 -101 -332 -108 -165 163 -53 5 -58 6 -8 -57 83
5729 83 100 -174 -62 16 281 68 -216 90 244 92 -283 -173 -69 -37 95 75 -67 -14 -170 4 7 -281 -43
5752 -43 -19 115 -253 9 170 -202 -195 -46 119 -103 -253 33 -216 -27 33 -119 95 -67 -143 -212 239 237 -252
5775 -252 -53 -210 -247 -22 26 9 71 44 116 83 -84 89 -29 134 -77 -6 57 -33 -217 44 -46 -1 -109 -68
5799 -68 86 -82 62 67 291 110 -96 173 75 -400 -17 -334 -170 -33 -126 -90 -95 -35 -117 -214 177 -225 -238 27
5823B7J11k50J03K17m39N9L53m49J62J19k27L63R6k73k3j48K40L1j64K61k79L28
5845B18j90n0J04l4n3K3l8J29k53j65K63J10j68j81J96J46nl4j17l6m4L19k58
5868a18j89L33K82k83j8j38Q3rL7N6j79J89j62P5K90m06m3L00k35j18M05j82K
5891b8J13r3J86l0j95K62k3l93j63M77j66j07J56Q1No2J64j46k81K49r3J85J25
5914B23m46K93qJ72k46J01J30j75j0q9j1j15K84Q8m29K7Q0K05J89k83m4K84l98
5937a78L76k4j16N9J15p2j50m7M6m0J35j72K24J53l4k10%l06o0M18q3P2r5K2L57
5962C90m72K4Q2Q6N1l40n2K3M9K00J0j92J52k00M76n25M74l05r1J14M7j55J66
5985A2j24j04M34k75j5j28L20q2P4j77R2k28K42j10M4M07l35k99J56NK7n6K70
$$ plain form
5823 27 138 -112 -9 208 -231 -172 181 -268 -106 13 -214 149 245 -28 -51 -199 41 72 -92 169 -110 218
5845 218 28 -22 82 48 -5 18 -20 109 -144 -309 -46 64 -104 -285 -89 57 52 18 -99 -135 -179 140 -118
5868 -118 -307 26 308 25 7 -131 -48 -57 -20 36 -143 46 -116 -41 249 -157 -200 100 -135 -253 152 -30 -28
5891 -28 85 -8 178 148 -47 215 192 -201 -364 113 -53 -160 -4 77 82 20 184 38 -243 6 -87 98 223
5914 223 -223 70 62 234 -12 89 219 44 34 -55 -66 -181 103 191 -238 -211 -131 74 263 -20 -64 220 -178
5937 -178 198 174 58 117 232 160 10 -37 9 -31 104 -68 156 309 275 65 65 -241 -301 117 34 106 11 33 390
5962 390 -82 -58 24 110 161 -179 -231 -208 -159 41 51 -141 11 -189 287 -238 236 -69 -160 -46 1 -154 12
5985 12 -112 -216 218 -57 -72 -200 120 38 112 -65 27 -201 41 -69 -25 382 47 -252 -96 -91 -64 -120 150
6008A50k01O3j51L5p4J04O2j00J20j5k69L16r2L9L13m64J67J13l47Q3k12L78R2
6031A10o4k8J90l39R0K09j53k17P5O3Q2J80m95K31j84j09J63J90j48J89j60J45
6053B0K7k45J01O7P3l72K25j74N45n14lK31r6k39L44k79K41J38r8j70R6l3j53
6076b68L06p9l3M5Nk7J94q1k45L08k8r6J14k68n3K65J54k6m17R9L95n68K10L82
6100B88k77L2n8j29K42k6q9lj1M3k61N00q2l42L80J49P5p77M77J6j87L5l00N76
6124B71l08j49JM39k70%J95k37j4J32Kl40M78j02k08J71J11oM9k00l25M86j07
6147F9k79K41n3L16k40j10J26p9K25j67j62M33m92J04j36J33J15K6q4p0N4pj2
6170d9l9K01k86K35J84j46j31k50j93K66M0L92J34o23O75k99r3J44k8l12L00j15
$$ plain form
6008 150 -51 12 -139 -104 -178 -74 -12 -112 8 -7 -276 40 -52 -13 300 -164 3 116 -231 -148 -360 18 110
6031 110 46 18 208 -131 -41 168 15 -202 -127 -64 18 198 -297 -66 -250 -359 -196 -6 -154 35 -125 20
6053 20 47 -198 -97 -30 43 -329 -104 -278 267 -247 -250 -19 -115 -354 -10 -289 -48 90 -8 -178 -82 -115 -268
6076 -268 38 -41 -74 -29 -24 -51 143 62 -183 125 97 1 115 -153 -206 59 213 187 -230 -131 264 -304 -94 288
6100 288 11 43 -15 -144 98 72 -17 -20 -31 12 -249 251 169 -173 207 356 431 -346 131 147 -40 -5 -305 271
6124 271 -37 -186 -185 254 -16 -16 179 -58 -72 60 62 -278 200 98 -110 61 172 166 215 15 -310 176 69
6147 69 -210 31 -22 294 54 -56 70 -9 216 49 -113 320 -172 -68 -204 -71 44 70 -14 -84 -30 -37 -49
6170 -49 -88 113 -173 62 246 100 -31 -281 -474 -208 -168 224 358 -265 410 111 18 162 134 -178 122 7
6192GJ09p6j02Q1PL2j19J94m17L00J58J60m22K32lJ90l26J87j43n4L89l40Q3j85
6216e8q6P0K77l29P7K38j02k32L58q6j56M10n14kJ93p7j41N90m03q9J43N8P6j74
6240D1j43J13j66L95o6m40M23k43j39O50n80J76M87k73l24n8K91k65J88j58J40
6261D9l06N08l45q4k0M9J32k9J53k73K21M7p4L33k92RM1j86J10J42J36o4j14j43
6285@j44M4l1M82j65k21J15j02J93n4q8K58n3l35LJ16L20k92j71O8P5L72k30n5
6309A05k68K93l76J89L31j06k86j7j34K82l62M58l42M94l26j28N64o38J79l05
6329c93K10R3J78j18j60M44l16L29j73j67l8l8R2J44m42M42k71KL30j37Jm1k0
6352d9K5J62l4l1j04K70l16l1jM68m92Q6M31l78L17k61j22K79k01j11L05k53K31
$$ plain form
6192 7 116 40 -62 19 26 58 -61 133 -284 16 174 334 -88 144 141 331 5 192 49 -5 384 44 127 -58
6216 -58 -144 -74 203 -126 -49 189 87 -145 213 127 -29 381 -133 -135 58 -19 -160 430 27 -62 81 139 215 41
6240 41 -102 11 -155 240 174 -266 157 -86 -225 425 -155 21 508 235 -89 -147 144 -121 67 -91 49
6261 49 -257 251 -94 -178 -198 -149 -17 -46 107 -166 55 102 28 361 69 78 119 -67 43 185 321 257 143 0
6285 0 -144 -100 -131 351 186 -35 80 -22 171 117 29 287 234 -101 -98 18 338 46 -125 -57 18 390 160 105
6309 105 -163 130 -246 -57 274 168 -118 -135 -269 13 -349 109 -233 261 -65 -193 371 -267 -88 -393
6329 -393 -183 -90 88 -30 -190 254 -62 267 94 -73 -111 -149 -57 87 -355 87 -184 -182 148 11 12 -29 -49
6352 -49 -24 138 104 73 -31 239 -77 -108 -109 359 -133 -47 384 6 323 62 -60 219 18 -93 212 -41 190
6375A90L4j95k05K82k25J93L27o21J21L92m85K21P0M2m68N21j75k86J61R8k37
6396b45K77j30j23K95l50L23p3L9L5K45j76O7l19K20%j45r6J58Q1j30J40r7M1
6419C7O3qm79M94k00J68J84l55L4oL25l62o6M95n96J88L30n9n62K24M83m80K9
6442a19L56n39J63M34m19L84l81J70m4j85M6j63R5J39L86o52J58O4K06j41QK03
6464A69l4m23R2p5K43J46k31L5J53o8p2k99MK30K56j60j80L58l06K27R8j17p7
6487c1l3pk31L72j0o0M1Qk31L46j62J34k71Q5o4j9J42J18j04J28k58K71m35L86
6511A15Qj30L81m11n7J32k75P5J27j04r4j04L98J12k10k1m9P7PK90j26J9l38j15
6535b93L18J80l99J48l2j13L48j3m38M95j76k40J35K02p8K1j84J04J38l35M60
$$ plain form
6375 190 224 29 -176 106 -119 74 401 -220 -99 293 -192 29 99 141 -327 194 19 -267 -106 -8 -245
6396 -245 32 -98 -221 74 -276 47 -26 13 48 293 117 184 -135 85 85 -60 -156 2 83 -47 93 -4 37
6419 37 100 92 -387 107 -93 75 259 -96 -62 -68 257 -105 -171 324 -272 -84 246 187 -375 -151 332 -148 -119
6442 -119 237 -302 -139 295 -124 260 -121 49 5 -180 -134 -297 -202 -63 323 -329 -171 -107 99 -42 -34 169
6464 169 135 -288 -196 -271 -28 118 -113 -78 75 7 -65 -364 -360 -130 126 -34 -214 144 -162 65 163 46 -31
6487 -31 -64 -71 -302 70 60 0 41 49 -182 164 2 136 -135 -50 -114 -133 9 127 23 151 -107 164 -271 115
6511 115 123 -7 374 -37 -94 38 -237 -162 -35 -139 -233 -337 61 173 -37 -58 -107 -30 -23 267 141 160 -178 -293
6535 -293 25 205 -194 -46 -78 -191 157 144 -294 201 25 -215 -80 122 44 65 -119 -15 123 -212 248
6556B48k58k7N9J22m6j75p7J81R4l79L82JJ8r9N3n3j4J92m52L64l04L12l65M64
6580B41j54j11m6J05LJ64p4j39K0J87j09k54K67k27j68K99q2L34j45K61j17l88
6602a33K3J33j52J69j22M4K17j06j36j27J05J4M03l17p5J21j58OL25k29J34P5
6624B14j81r9J86K4m85M70j1l0J66k14M4l31M41j68r2L5Ro8q0Q9L06l01J16P1
6648A11j30l3J96j51j05J09j3k13J15M1K91j67J8o1J24j18R8n2k91K62k42J0N3
6671a48R7O4q8N3J46k87K26j44L6j47K21O1r6l0K48k91J97k11k5J42J91l27J46
6694C4q3J8J36q5P0o3q4l92M5M42j95j48J40K03K23l70J82j31J75k57J74K68m60
6717a58J72J06n9j48J56k43L1L80j66L78n83K13k4J98l34M23l85J73qO9j3k33
$$ plain form
6556 248 -10 -37 22 144 98 -77 -154 27 121 -258 124 125 143 44 97 44 30 222 -230 134 -170 142 -223 241
6580 241 87 -24 -70 35 38 202 128 -11 9 196 87 -167 100 -127 -295 4 -78 256 111 372 255 -133
6602 -133 -110 23 -129 40 -82 -38 179 73 -63 -190 -85 -71 332 15 -60 61 -97 -91 234 5 139 214
6624 214 33 -66 120 144 -341 129 118 88 254 40 84 -247 194 26 -66 -31 -22 -90 -170 -81 225 -76 40 111
6648 111 -19 -52 144 -7 -112 -3 -16 -229 -114 -73 218 51 69 8 132 14 112 60 -231 31 -211 -201 -148
6671 -148 -51 13 -75 -22 124 -163 63 -81 -45 -192 29 90 -6 -36 212 -79 118 -93 -118 24 215 -112 34
6694 34 -49 -31 105 20 90 27 -57 -449 -404 38 -157 -305 -165 38 261 -109 73 -58 117 -140 34 302 -158
6717 -158 14 120 61 -87 69 -174 -143 237 71 449 -134 79 55 253 -81 342 -43 130 122 191 178 -55
6739e5jr6M0M0R3j63L3J66M3nL9j14k4j3J75j21J9k91L41K30m18m18J86L93Pk30
6765a44Q6K03k87P4J66K27l82j26J48R5p7l6J21k27O8o3L13j52k64J53J55p1M5
6788B5J67l07K63j99l7L17l30K28q2J45k64k4q1L68R6m08Q5L02l54p5M4K91k63
6811i3J05K00j68P8j25nk60N99l05O7o0k39M41k5ml52K07L0K15p74M99m0p9m1
6835a29P6K5m3K4J5k16J67m2M36k14k58K88k30M61k42j5l0J35k86M48o05J95J5
6858b5j47K75j55M7l4J81j60j35P4mK23p7k64J77N3j2mo1J34P2k04j3J72j97K0
6883f4K1j75M9kJK26p9j1N5O1j00j08J56Q7k81K40q8qK79o1K5k78J41o8K9j12
6909f5j15L76j4o9o8r3k89J91L3o0o5L02k4P2j90J6N5K33j52K1J08l12L21k52
$$ plain form
6739 -55 -56 -152 -112 -72 21 -142 -109 57 100 95 134 20 -4 -17 158 37 56 -235 106 336 -82 -500 -314 79 86 -144
6765 -144 -58 145 -142 -68 98 325 -57 -183 -35 60 -17 -53 68 -159 -91 -154 159 7 -257 -104 51 -20 25
6788 25 192 -115 148 -51 -88 229 -101 127 45 190 -74 -98 -179 189 285 -123 -38 264 -90 -165 -121 170 -93
6811 -93 12 212 44 122 -3 -8 -268 331 26 93 33 -206 235 210 206 -146 61 91 306 -468 31 -9 -88 -129
6835 -129 -53 -28 -71 -47 -32 -248 -81 -123 313 99 -159 129 -101 360 118 103 73 208 -78 370 -235 -40 -25
6858 -25 -172 103 -52 -5 -39 142 -18 -153 -79 -83 140 63 -201 -24 29 17 13 -48 86 158 -46 -59 113 -84 -64
6883 -64 -43 -218 -169 -171 -170 56 -23 -34 21 82 -18 -126 30 117 -164 76 -12 -20 259 198 223 -55 86 18 47 -65
6909 -65 -180 196 182 113 45 -48 -337 -146 -113 -173 -238 64 40 112 -78 -62 -7 226 74 95 203 -109 212 -40
6933d0NJ83j68K07k34K70k4j31j16K4J47N2k38R9j89K23j86K84J8j01o2k07N04
6956C20m57K26kJ8k3K40q9k57J78m19L61j79p5k0M23m41J67N7k93k13K57K72N1
6979A02rN5j99K19k46K42k48m1%K17j38l3K62r0P3q1l3k24L50p96P88m0R6j98
7003B8p4O8%L20j43J7l29L41k96J21J1k61J49P4J81k28J02oj09J30Q2O1j22l07
7027a90L81j72o4J55k97J64j4J00j49J26O4P2j39k81J30Q6l71L52J35K47k30j98
7049i3j6J98j91Q2R9j73K7L10q2j48O3k40K84k00N8K13n05L26Pj39J17r9J37O1
7073I6k23J15j08N2J%J10j36l8q8K54m9K31OJ46n45J97l7k14K59m3J25r4L3j1
7098C9j69J56lM4m2r3l5K23k48J43k93L20Pk10n4K51ol9n2qM0LMj12K1J02q3K86
$$ plain form
6933 -40 -35 148 -20 187 -47 223 199 68 -48 -24 123 175 -63 36 -153 70 -116 168 186 85 23 -184 320
6956 320 -137 89 87 105 82 322 233 -24 154 -265 96 -83 -158 -178 245 -196 -29 28 -265 -478 -221 51 102
6979 102 93 148 -51 168 -78 164 -84 -125 -125 92 -46 -79 183 93 166 85 52 -172 178 -618 170 130 226 28
7003 28 -46 22 22 342 199 216 -113 228 -68 53 64 -197 -48 26 207 -21 81 75 -34 96 178 239 117 -190
7027 -190 191 19 -45 110 -187 -23 -37 63 -86 40 104 176 37 -244 -114 -28 -399 -47 88 335 105 -93
7049 -93 -109 89 -102 -20 79 -94 -67 243 161 13 76 -164 120 -80 -22 191 -314 12 19 -120 -3 -102 35 96
7073 96 -127 -12 -120 -68 -67 -67 43 -93 -131 -219 35 -14 217 223 369 -176 21 -16 -230 29 -14 111 17 50 39
7098 39 -130 26 23 67 25 -68 -103 120 -128 15 -278 42 49 -161 -215 36 30 -9 -61 -69 -29 -26 -22 -134 -113 -11 -94 192
7126A92k23J6q6K54k6N5o5k45p7L34j25l9J53p9O4k17O4J20j46K08l4j78L3j22
7150a69L86n92M41n5j38p9K36j04J84j72j77L22j73L16o2j30l68L15k09K03K2
7171cj34O8J76Q0k31P7L28j26p7k37K43m52J75j68J90j1R5q4j36M15j73m31M89
7194G3l28J44j2K13K03k33P9O7L3j68k74n3N40n61M12k49N9L21n30K41L00k59
7216A8j84J2n5Q2K4M9L53k64k56J82j10l4K24l30L92k31Q2j5J80K20m14M0L8r5
7240i2j2J59k86RM62m76K48k17j39L32l27J86K30J32l14j37L37q9o3Q2L3l18N59
7263B99l65J84j11q1L10j37j13r3J51j09j31Q3j68M53l96q4K62q1j58L09k11M74
7285B87j50k44K00k87J79P2q3m33K32K98Q9l04L42k95M0J85j36k37J17N31l71
$$ plain form
7126 192 -31 -15 -101 153 127 182 117 -128 -205 129 4 -35 118 39 103 -114 -50 70 -76 132 98 -80 -47 -169
7150 -169 217 -375 66 11 -127 -206 30 -74 110 -62 -239 83 -90 226 164 34 -334 -19 -228 -25 -3
7171 -3 -137 -69 107 187 -44 33 361 235 158 -79 164 -288 -113 -281 -91 -102 -7 -91 -227 188 15 -416 73
7194 73 -255 -111 -123 90 293 60 139 206 239 71 -203 -256 284 -277 135 -114 -55 266 -264 -23 277 18
7216 18 -166 -154 -209 -127 -103 -54 299 35 -221 -39 -149 -183 41 -289 103 -128 -46 -61 119 339 -75 -35 3 -92
7240 -92 -104 55 -231 -222 240 -236 12 -205 -344 -12 -339 -153 77 209 -105 -242 95 6 -57 25 58 -260 299
7263 299 -66 118 7 -74 236 99 -14 -107 44 -65 -196 -113 -281 172 -224 -308 -46 -127 -285 24 -187 287
7285 287 137 -107 93 -194 -15 57 -26 -459 -227 71 160 -144 198 -97 -57 128 -8 -245 -128 403 32
7306C2o6l4k44L20k45K41j37J02K84j56Lm69J61M7N4J59r2L21m05J28M7nr4j6
7330f4J50j74J34N3j07QK10l34J61p4J22j10k64L72k25L33k24k2k20J95j06lJ62
7353b7J72K58o55K86n7p7J44N9j63J8mL01n31M36j31L62n06M54l87P3j53j51K85
7376FL2j78J66Q4m28N92l55M6R4r5NL11l57K23j43J19k81J80J56l81J85K28l2
7399A77k89K54j60l1J48j81J87j79r9p3N31j1k11j87J56m23K68M63j16j46k3l02
7421b47j06O31q6l9J3j30J43k90L55l71j9K76J6l13M1O5L74q9l12L94m11J32l21
7444b94L10J98p30N20k13K59J70k86L71l22J38lk66J34J12l19K7K04k5J68j33
7465B0J45j20J07j52o0O7NJ66k75J37k27J98ln8J61j07k64M12l77K00J95%j86
$$ plain form
7306 32 -34 -68 -312 8 -237 4 -133 -31 253 97 100 -369 -208 -161 -107 52 -40 281 -124 4 51 46 -48 -64
7330 -64 86 -88 46 99 -8 0 210 -124 37 -37 85 -25 -289 83 -142 191 -33 -55 -275 -80 -186 -189 -27
7353 -27 145 403 -252 34 -23 -100 44 103 -60 -42 -46 255 -276 160 29 391 -115 339 -48 25 -128 -279 6
7376 6 38 -140 26 110 -318 274 -81 -35 59 -36 -31 280 -77 146 3 122 -159 21 177 -204 -19 209 177
7399 177 -112 142 -18 -49 99 -82 105 -74 -173 -246 285 274 63 -124 32 -391 -123 340 224 78 55 -247
7421 -247 -353 278 192 153 166 36 179 -111 244 -127 -146 130 146 -167 -126 -61 313 224 -88 306 -105 27 -294
7444 -294 16 214 -516 4 -209 50 220 -66 305 -17 121 118 -148 -14 98 -221 -194 10 -15 153 20
7465 20 165 45 152 0 -60 7 12 178 -97 40 -187 11 8 -50 111 4 -260 152 -225 -25 170 170 -16
7488a6m4L97l43K14j78j0N2J06k78k8J52k78L95l71P28n02oj15K18j49k83K5J64
7511a50J49P8L59k43k17M26n76R0K33k00j18O3J26R3j44j54J19J80k0J07j32k04
7533a35M64l05J27L6j76J89m47J0L85l91M88l31M24jo67J22K31j04K54j75J25
7554A23k16j28K08RJ39j15Q6k93L34J90k88j50J00n9J08J2j46J55j80m9J98j58
7576a20M2J70K49k11J52o1k24j67J61P0k15P8M6q0k14J56o4L15P7m6j06J3N5L0
7600A06k46M23l01K18m42L94m2j29j10M5j53J36K98l79N0M8L5k5L34k56m2j42
7622a80j62N15o5k45K15J10k9k10O3n9m8M66l34J73k53K03j53J95l06L57o51N54
7644A56r7j53j61L54k27K48R6k37J32j90J24Q3l7k15L16k71O3m1%q2R0J72j39
$$ plain form
7488 -16 -60 337 -6 208 30 20 72 178 -100 -128 24 -254 141 -230 498 -4 -10 -125 93 -56 -339 -314 -150
7511 -150 -1 77 436 193 -24 402 -174 -84 149 -51 -169 -106 20 113 -31 -185 -66 114 94 201 69 -135
7533 -135 329 24 151 187 11 200 -247 -237 148 -243 245 -86 338 337 -330 -208 23 -81 173 -2 123
7554 123 -93 -221 -13 -4 135 20 106 -187 147 337 49 -101 -1 -60 48 60 -86 69 -111 -160 38 -120
7576 -120 -78 92 341 130 282 221 -3 -170 -9 61 -154 -76 -30 -110 -324 -168 -232 83 160 114 8 21 76 106
7600 106 -140 283 -18 200 -242 152 110 -19 -129 -84 -237 -101 197 -182 -132 -84 -49 -74 260 4 -38 -180
7622 -180 -342 173 108 -137 78 188 159 -51 12 -47 -95 371 37 210 -43 160 7 202 -104 253 -398 156
7644 156 59 -94 -255 99 -128 120 216 -21 111 -79 45 128 91 -124 192 -79 -16 -57 -57 -139 -49 123 -16
7667a6k03J65J08P5k3j48n3K68o6j14l24J51K6K80l97L88k02L16l41J87j93J2
7689a04L4P2N1l2o9K8j0k9p5RR3j16K40j99J86j77J81p7j10L88m09J66P6N4J37
7714C08j89j52lk26J02J40R2j98K76k10J9K73k21M30m28Mq4Q2j80K71j21J13o4
7737C4M50l53j55j85L61k10q3L14j02K23k80N7nJ39k85l29L92K46k54J46k58j39
7759b76J96j17K13KQ8j73J29j31k5J34K8l20M57q7k54o9L11l12m4j67O49l35J1
7782i2K34p2k5j77J35j22J45j1k15J69L84j86l99J21J20j36J46j12M25l87m7R
7804i3J09j29J43K90k64j80o4M95k5l62r2L50l53P0P8P2j95M07m08K00k23K37
7826F3l3Q1j88K11P7k58Q8J61l72K47k39J67M6k5k4nq0RP3j24J47O5j25L02k92
$$ plain form
7667 -16 -219 -54 54 129 106 -42 -95 173 107 -7 -331 -180 -154 126 -271 117 -85 231 -110 77 -116 -104
7689 -104 -70 2 53 21 -48 -20 -30 -59 -134 -125 -32 -148 92 -107 79 -98 83 6 -104 284 -125 41 117 171 308
7714 308 119 -33 -36 -262 -160 -20 72 -126 150 -60 -41 232 11 441 13 17 -67 15 -165 106 -15 98 34
7737 34 484 131 -24 -209 152 -58 -141 173 71 294 14 71 66 205 -80 -409 -17 229 -25 121 -137 -276
7759 -276 -80 -197 16 18 106 -67 62 -69 -94 40 68 -252 205 118 -136 -205 106 -206 -250 -417 232 -103 -92
7782 -92 142 70 45 -132 3 -119 26 15 -200 -31 353 167 -232 -111 9 -127 19 -93 332 -55 -102 -93
7804 -93 16 -113 30 320 56 -124 -188 307 282 -80 -172 178 -175 -105 -27 45 -150 257 -151 49 -174 63
7826 63 30 111 -77 134 211 -47 41 202 -170 77 -162 5 51 26 2 -3 -83 -74 -1 -125 22 87 -38 264 -28
7851b8J94k11J3J14j53J52j70J88J28l11j26M39l63j22K56j5j12L83k15J49l04
7872a14M44o32J49M97j74k85J75J20j34m0q7K06m45O6N16l61o7L3q9L09k13J42
7894A6K4J20m0j75J70l35N58j88k24j70K66j78RM4q0R4K82m56L3K34O5k62K56
7917F3KP6l81N32k58j41M16m10j18L38n3j44j0K00Mk20J33k22L06q0l70P17l70
7940A0P8p2O6k7j72L9J86R4o9r8O0l18o1J28J85N3k00j00K79p1J19N9j53N0j92
7965a27L09o7j04K40k5n13M47m3k05M9J31L20l90o8P6K7J24j86L6M8qk99J23j79
7989b84J54K77j00j21ok50k1M90j43o2q5N53o13kK72nk94q3K48M54k80j48N6r1
8013h4J01J66k18R3m1k84p3O70k90m44M57J52q8l32K35k19J43L9k98L86k4l34
$$ plain form
7851 -28 166 -45 -32 82 -71 81 -89 99 227 -84 -210 229 -134 -256 0 -15 -127 256 41 190 -114
7872 -114 330 -302 -153 344 170 -115 60 180 46 6 -81 125 -320 -254 262 -99 -166 -133 -222 87 -126 16
7894 16 40 160 120 -55 115 -220 338 150 -74 -244 22 -156 -147 -103 -183 -89 193 -263 -230 4 69 -193 63
7917 63 65 141 -240 292 34 -107 309 -101 -219 119 66 -78 -88 112 116 -104 29 -193 113 33 -337 380 10
7940 10 88 16 82 55 -117 -78 108 202 133 35 95 -223 -284 -156 29 82 -118 -218 61 -10 109 168 15 65 -127
7965 -127 182 115 11 251 226 -287 160 117 -88 -39 92 412 22 -46 30 57 181 -5 31 79 71 -228 -105 -284
7989 -284 -130 147 47 -74 -80 -330 -351 139 -4 -66 -151 402 -211 -213 59 54 -240 -323 -75 379 99 -49 7 -84
8013 -84 17 183 -35 58 17 -267 -340 330 40 -404 53 205 117 -215 20 -199 -56 -17 -315 71 47 -287
8035b87j9K04J77k54J42K27k68K02o8j79J04K65k79K7K31j22l05LJ96J26p3j48
8057i8p8L78k17m2k52K56j49J6K23K7j19J96m02K47J57K9k45J43K8k3o3j12Q4
8080a6Q7m5l3K58j56l39J74kj09J18R2J75m3j51j38K71m73K83j23J9K30j02K14
8103A91o3j78O5j6j64J76n0L20j76j79n4J42J69l49K52L49m48j71J3L70k11J6
8125DQ1j37L0j73J81J36j8l89M06k6L7k54M8r4k3K77j83L71k78r3J69O3j00K7
8149F2j59J30lj85l8J72K94j71j16j39n2K51j30M3r6L89m30L08j02k59L21r1K06
8172B05j93J33m2j56J04J07j94o5K9R3r0L30k39l28K79k07K18J5R2
$$ plain form
8035 -287 -306 -102 75 -179 -37 190 -78 124 56 -123 -19 246 -33 -6 225 103 -202 -199 -3 123 50 -98
8057 -98 -176 202 -15 -57 -309 -53 -202 -186 37 64 -55 141 -261 -14 143 172 -73 70 98 75 12 -100 -16
8080 -16 71 26 -7 251 95 -244 -70 -72 -181 -63 29 204 161 10 -128 143 -330 -47 -170 -151 79 -23 191
8103 191 128 -50 15 -1 -165 11 -39 281 105 -74 -128 14 183 -166 86 435 -13 -184 -171 199 -12 4
8125 4 85 -52 -22 -195 -14 122 104 -285 121 95 132 -122 -74 -168 -191 86 -97 274 -4 -97 72 135 35 62
8149 62 -97 33 30 -155 -193 -21 273 102 -14 -153 -205 46 -84 -41 -137 252 -178 130 28 -231 90 -1 205
8172 205 12 145 103 -53 51 158 -36 -101 -72 21 -69 261 22 -306 -27 -234 -16 -1 91
8191I1
$$ Imaginary data points
##PAGE= N=2
##DATA TABLE= (X++(I..I)), XYDATA
0@%%%%%%%qJ6j6J6j6K4l2M0m9N7p1Q5j00J16j35J55j78K07k38K70l08L50l94M46
31B37n02N64o32P03p85Q76r73J080j198J326j467J626j800J993k210K453k729
48a438L045l410L838m349M969n740O734q065R953j2866J7989k9610J02545n385
62G8210j87650M7409K9718L8258J06715L508j64170m0115N0276K3868O4603N6620
74A07250r8713q8851K2524L4863L7934N4609l9322p8578j2602K4739L7873M6300
86D8026k1946n2185j1451k8K5231N8779j5308n6355R178L024j1878O0603J9678
99E5368p5369l580L8831l1677K0883O2443n8426n1579N6659l656l1603O1968J085
112D1347q1285K3471M0604m4574J6888M6770n4758k6007M9509j5727k2740M2751
$$ plain form
0 0 0 0 0 0 0 0 0 -8 8 -8 8 -8 16 -16 24 -25 32 -39 46 -54 62 -73 82 -96 111 -127 143 -165 185 -209 237
31 237 -265 299 -333 370 -415 461 -512 568 -630 696 -771 855 -945 1048 -1162 1291 -1438
48 -1438 1607 -1803 2035 -2314 2655 -3085 3649 -4416 5537 -7329 10660 -18950 83595 78210
62 78210 -109440 -62031 -32313 5945 112660 116168 -48002 -88117 -37841 -13973 50630 107250
74 107250 8537 -80314 -57790 -22927 15007 69616 30294 -48284 -60886 -36147 1726 48026
86 48026 26080 -26105 -37556 -37584 -12353 46426 31118 -25237 -16059 -13035 -24913 35690 55368
99 55368 -20001 -23581 15250 -16427 4456 66899 8473 -43106 13553 9897 -21706 40262 41347
112 41347 -39938 -16467 24137 -20437 -3549 43221 -11537 -37544 11965 -3762 -26502 16249
124A6249n454l7881K2362Q715k5512J5220J5211j5861O695L866j6406P838N867
137I09n408J9610J73k7766J2415R421k3238K4920K4936m2838m516L3897l1662
150i147o895N3574k3504m1253M2900k280m7074M1523K3244n5934J4608L8228m8930
163b0940n965M9940k7850k2425M7251j1971m1097L0498R720k8742K6006J8908
175B3333l5344k847J7311j2019J0251K1060j5490j1584K319p524J3599J7951j3623
188G393k524K331k2717R455L0338j9472r829K3218k3745j8986M1884l870l5764
201b2288L0841P831m4411K2944K9068m5262L242M3130l2110j6289M2364k1393
213b333l1957M4331P684l5374K2159R239l9531J4564L3803k0463l832J6466k3080
$$ plain form
124 16249 10795 -27086 -4724 3991 -21521 -6301 8910 -6951 -256 3610 -12796 -4958 909
137 909 -4499 15111 15284 -12482 -67 9354 -13884 11036 35972 -6866 -11382 22515 -9147
150 -9147 -16042 37532 14028 -27225 15675 13395 -33679 7844 31088 -24846 -10238 27990 -20940
163 -20940 -26905 23035 -4815 -27240 20011 8040 -33057 -2559 7161 -21581 4425 23333
175 23333 -12011 -14858 2453 -9566 685 21745 6255 -5329 -3010 -10534 3065 21016 7393
188 7393 4869 7200 -15517 -6062 24276 4804 -5025 18193 -5552 -24538 17346 13476 -22288
201 -22288 8553 16384 -28027 -5083 23985 -21277 -18035 25095 -7015 -23304 19060 -2333
213 -2333 -34290 10041 17725 -17649 4510 13749 -25782 -11218 22585 2122 -1710 14756 -8324
226h324q269K7412K77o956P663j3020r749J4467J191O5R299j5157r350J6926o980
241e05q896K2402q113k2716K3733L919l1133J9156J6681l1833J0798K9706l5185
254a1986j1470L7497j6268j6026L9748r450m0030K6403J4043k8174K2192K1072
266B7551l8975m361K8060j5017k180K8387j6502k1715J7731P61r854J7190p84
279A0292j6735O048J487o724J0492j159j0759J0514r17j2970J2749L84j8103J6429
293A028J2314k3863M878J5306k5989L260L3885j7646j6594K4229j3897k1382L6241
306A1770R116l2261J3554R226l1249J3912L1247k3611r288K1017j8200j1391K9879
319A3721k213k0077J3371J33j6705J3120P908j4964L999O912j0420M148M214j0745
$$ plain form
226 -8324 -16593 10819 11096 4140 11803 -1217 -10966 3501 4692 4757 14056 -1101 -10451 6475 -505
241 -505 -9401 13001 4888 -17828 5905 9824 -21309 -2153 14528 -17305 -6507 23199 -11986
254 -11986 -23456 14041 -2227 -18253 21495 12045 -27985 -1582 12461 -15713 6479 27551
266 27551 -11424 -15785 12275 -2742 -4922 23465 6963 -14752 2979 3740 -6114 11076 10292
279 10292 -6443 -395 1092 -5632 4860 3701 -7058 3456 2539 -10431 2318 2702 -15401 1028
293 1028 13342 -10521 -5643 9663 -16326 -13066 20819 3173 -13421 10808 -3089 -24471 11770
306 11770 20886 -11375 2179 11405 -19844 -5932 25315 1704 -7584 13433 -4767 -16158 13721
319 13721 11508 -8569 4802 4935 -11770 1350 9258 -5706 -1707 5205 -5215 -1067 3147 -7598
333g598L645P482p277O236L705j7959L391J4958j0316L630J5229k1765j1026K4695
347G030l492j0471K3190p387k9778J9429J4298k1234J3517J5084l0662l019K7173
360A3678j3839p958K4755j3051k0269K2258K279j9166J4007O665j9566Q302J1496
373I591j6422K54J0760q683K305J0625j0449n289P043n153M138J2380j0155p828
387f883Q034p721N72J9976o815j5251J1299l400j2645K1908P286k4355O339J0705
401I049k0822P645K2477j9710q724K0481j1206j2484K3282l319k0246J6782O262
414I467k0230R235R903j8843N044J6677j2304m457J0061j0762k904J6464k110
427E241p490N451p585n526J4518J276n864O422p796j0283J4435M370r326Q939
$$ plain form
333 -7598 -3953 3529 -3748 2488 6193 -11766 -8375 6583 -3733 -103 15126 -6639 -17665 7030
347 7030 3538 -6933 16257 8870 -20908 -1479 12819 -8415 5102 20186 -10476 -13495 13678
360 13678 -161 -8119 16636 3585 -16684 5574 7853 -11313 2694 9359 -10207 -1905 9591
373 9591 -6831 -6577 4183 -4500 -2195 8430 -2019 -7308 -265 -5418 -1280 11100 945 -6883
387 -6883 1151 -6570 -5998 13978 7163 -8088 3211 -189 -12834 9074 16360 -7995 -1656 9049
401 9049 -11773 -4128 18349 -1361 -10085 10396 -810 -13294 9988 6669 -13577 3205 9467
414 9467 -10763 -1528 8375 -10468 -5424 11253 -1051 -5508 4553 -6209 -9113 7351 5241
427 5241 -2249 3202 -4383 -9909 4609 5885 21 6443 -1353 -11636 2799 7169 -2157 6782
441F782j026j8232J0488J2327j4865L983J2611j8333k902K0015j1161j0170J9617
454I134n814j5404J7804J313k0590J2009J1097j6434N787J2116j9034k633J7425
467F776o844l264J3323r676j2197J2682K106n056J0243l106j3108O160L992m634
481b603R114P43j3224M087M995q306P421P115j4274J689J0543j2031o14J4011
495H666j0564o457J7148o466j3437J4715k71j4682J5403O849j9738M547J0567
508F280j4637M363J7919j3744q463J2600p340n130J7456j489j4213P390N06r477
522g979J1078O279j2086K401L148r195N625P994r104O90O225r175R38R315r130
537b976j664J1274o919n508J1199o564r380J4882J601j2176R340J125j6232Q909
$$ plain form
441 6782 5756 -12476 -1988 10339 -4526 -543 12068 -6265 -9167 10848 -313 -10483 9134
454 9134 3320 -12084 5720 7033 -13557 -1548 9549 -6885 -1098 11018 -8016 -10649 6776
467 6776 -68 -3332 9991 315 -11882 800 2906 -2150 8093 4987 -8121 -1961 2031 -2603
481 -2603 6511 7254 -5970 -1883 3112 -5194 2227 9342 -4932 -3243 7300 -4731 -5345 8666
495 8666 -1898 -8355 8793 2327 -11110 3605 3334 -11348 4055 10904 -8834 -4287 6280
508 6280 -8357 -3994 13925 181 -8282 4318 -3022 -8152 9304 7815 -6398 992 1498 -7979
522 -7979 3099 9378 -2708 -307 2841 -6354 -729 7265 -1839 -1149 5076 -4099 -3161 6154 -2976
537 -2976 -4640 6634 -285 -5793 5406 -1158 -10538 4344 5945 -6231 3109 4234 -11998 -3089
551c089J3057j2266J043R207j4905k901J8318n490p157J1700o796j2543J4349
564B527M113j0426P066K475j3266N400Q768r599K167P252r573o19R189p658k583
579d767R466n437k855R838o456p603R842q02o093J1173j835j3714P098N524q931
594e552Q432P309j6363n47J1341q164J053J4343j1252r939J2736k225p476J3321
608G017m55j4360Q024M977j1354O490P456j1985J294R030q732j656Q908o423k828
623d597J0853m568p083P401k951n238J1062M47r770M425Q3p925R662O633j1025
638b591J602L843j0659M965J2092q561l911Q520q896l951J4753k677r660Q808
652C677r84j1000J0211N011j2058M437P306j1461K380R383j0539j838J1637n607
$$ plain form
551 -3089 9968 -2298 -1255 7952 -6953 -9854 8464 2974 -4183 7517 721 -11822 2527
564 2527 6640 -3786 3280 5755 -7511 -2111 6657 -2942 -775 6477 -3096 -3715 5474 -2184 -4767
579 -4767 4699 -738 -3593 6245 -211 -7814 2028 1226 -4867 6306 4471 -9243 -2145 3379 -5552
594 -5552 2880 10189 -6174 -6721 4620 -3544 -2491 11852 600 -9339 3397 1172 -6304 7017
608 7017 6562 -7798 226 5203 -6151 339 7795 -4190 -2896 6134 -2598 -4254 4654 -1769 -4597
623 -4597 6256 1688 -5395 2006 -945 -6183 4879 5326 -4444 -19 64 -7861 1801 8434 -2591
638 -2591 -989 2854 -7805 -2840 9252 691 -3220 5300 -3596 -7547 7206 4529 -5131 3677
652 3677 2693 -8307 1904 6915 -5143 -706 6600 -4861 -2481 6902 -3637 -5475 6162 555
666E55m604Q920n678p515J0889J162o669P010j993j0720P851N559o528M286K713
681E238j2244K473R142n415J469O475j0557l257J0571l078m018J0043n339q803
695g300R542J154q833P653L186j1540N743O387j0094J090Q274q277k58J0465p740
710e48o212R135k454m432J0580k113j0560N727K241o343Q450L713j1191J060M932
725A985o298M317Q428r380l430P390n641r78J0573m779p046P872k317o316Q954
740C334N40r003O234L618r607M323N062r197K478Q993p950k584Q048p572k825
755f108J1527k062p435O412k100p803R240M408q123K861J888r009L944Q824o982
770e18k08N408q384j228R829m016l831P328m238n604Q072p1p019O698J210p709
$$ plain form
666 555 -4049 4871 -807 -8322 2567 3729 -2940 4070 2077 -8643 -792 4767 -1761 2525 5238
681 5238 -7006 -4533 4609 -806 663 7138 -3419 -6676 3895 817 -3201 6842 1503 -7300
695 -7300 2242 3396 -5437 2216 5402 -6138 -395 5992 -4102 -3012 5262 -3015 -3273 7192 -548
710 -548 -6760 2375 -79 -4511 6069 3956 -6604 -877 1364 -4979 3471 7184 -4007 -2947 1985
725 1985 -4313 4 8432 -948 -4378 3012 -2629 -3607 6966 2187 -4859 3013 696 -5620 3334
740 3334 3874 -5129 1105 4723 -4884 -561 4501 -4696 -2218 6775 -1175 -3759 4289 -3283 -6108
755 -6108 5419 3357 -4078 2334 234 -7569 1671 6079 -2044 817 2705 -6304 -2360 6464 -518
770 -518 -726 4682 -3702 -4930 4899 883 -2948 4380 142 -5462 2610 2539 -4480 2218 3428 -4281
786d281N191K803q827L716O378p407J165O629q644k193R176l276l136Q195n014
801D75q006Q605J237n400P181K99j0784M494N405o154L686N211r162j263P691
816C515n065p50P688n056m720P313k386n381P853n12o892O085J962q133L939L763
832C223o924L815N600q366j055O554n003l66Q525m738o088O351k007m184Q820
847D157L75q857M428J471o715O080M959q416P99N160o582P93P670n283l211P170
863C998m223m028P664k158n430O863M38p010M370K077p256M739N233p377P41M210
879B851p022O47Q324m332k784N960n228l810Q759k42n866N428j500p350O393L730
895C958o342L499K881q235K357O327n971j80O054n265k744O932k995m477O788
$$ plain form
786 -4281 910 3713 -5114 -1398 4980 -2427 -1262 5367 -3277 -5470 3706 430 -2706 5489 475
801 475 -7531 1074 2311 -3089 4092 4391 -6393 -1899 3506 -2648 1038 6249 -2913 -4176 3515
816 3515 -1550 -2300 5388 332 -4388 2925 539 -4842 3011 2499 -4393 1692 3654 -4479 -540 3223
832 3223 -3701 114 5714 -2652 -3707 2847 -2156 -2522 6003 1265 -4823 1528 -479 -4663 4157
847 4157 4532 -4325 103 1574 -5141 939 5898 -2518 -1719 3441 -3141 -2348 5322 39 -3172 3998
863 3998 -225 -4253 3411 1253 -4177 2686 3124 -3886 484 2561 -4695 44 5277 -2100 -1359 2851
879 2851 -4171 -3524 4800 468 -2316 3644 -1584 -5394 3365 3123 -2743 2685 1185 -6165 228 3958
895 3958 -2384 1115 3996 -4239 -1882 4445 -1526 -1706 4348 -917 -3661 3271 276 -4201 2587
910B587o16n328N461K40p497M710L725n720L486K997q292Q42O244l993M96N787
926E129o288l945P128j539k967O739k346p082N516J449n519N512K744q436K251
941a654M553n723J794N800o449r78O267m149l077O559k576m072O991j054o267
956d035M676J026n925N929K985p218J081L356n472K419O560n640k587N018m184
971b011j556Q035k146n752N198j572m822O598J770o736L518J839o209L277M649
986D080n980K19N078m903r94N716l755k746O259j707m290N052j260n520N698K202
1002C149n324K971J855p302K528N952m593K52M111o534j519P315k077k524N579
1017C839l761n113O191J403n301M493Q81o839L890L435n472K105M027o084M33
$$ plain form
910 2587 1971 -3357 2104 2344 -5153 -443 3282 -2438 1048 4045 -4247 -3405 2839 -1154 -658 5129
926 5129 -1159 -5104 2024 485 -2482 4257 1911 -5171 345 1794 -3725 1787 4531 -3905 -1654
941 -1654 2899 -2824 -1030 4770 -1679 -2657 3610 -539 -3616 2943 367 -3705 3286 2232 -4035
956 -4035 641 1667 -4258 1671 4656 -2562 -1481 1875 -3597 -1178 5382 -258 -2845 2173 -2011
971 -2011 -3567 4468 2322 -3430 1768 196 -4626 1972 3742 -2994 524 2363 -3846 -569 4080
986 4080 -1900 -1681 3397 -1506 -2500 3216 -539 -3285 2974 1267 -3023 2029 769 -4751 947 3149
1002 3149 -2175 796 2651 -4651 -2123 3829 -764 -512 3599 -2935 -4454 2861 784 -1740 3839
1017 3839 78 -5035 1156 2559 -2742 1751 2632 -4207 -317 3118 -2354 -249 3778 -2306 -1873
1032a873N447m573j771N790l104k537O032k767m652N000O13m760N546R07p153
1047c855K595L071m615L223M209o575q12M740l462k37O248l772m308N084j438
1062I6l261N870J90o078L550J484n059L466L189n694J013M389m959o0N063m470
1078a271j273O019k837l404M682j617m091N760R66n441L182R77n856M260M057
1093D113n398O02L337n930Q14O264l498k182M537l584l106O761p70m369M451n83
1109A459n254M162K120n047K630K998n411J177M000m985l75N754l402j850N000
1124B976l221l667N961k03m123M274j34n966L665K998m751L164K399o289O25M659
1140B367l578O01M222m309k997N622j751l009N132j040m283M230L35m412L711
$$ plain form
1032 -1873 3574 -999 -2770 3020 -84 -2621 3411 644 -4008 992 1605 -3155 2391 3298 -3855
1047 -3855 -1260 1811 -2804 419 4628 -1947 -2759 1981 -1481 -1718 4530 758 -3550 1534 96
1062 96 -3165 2705 2895 -3183 367 1851 -3208 258 3447 -2247 -1234 3155 -1804 -1864 3199 -1271
1078 -1271 -2544 3475 638 -2766 1916 299 -3792 1968 2934 -2507 675 1652 -4204 56 4113
1093 4113 -1285 -683 2654 -3276 -2462 3802 304 -1878 2659 -925 -4031 2730 1960 -2409 2042 1459
1109 1459 -3795 367 2487 -2560 70 3068 -2343 -1166 2834 -2151 -2526 3228 -174 -2024 2976
1124 2976 -245 -3912 2049 1846 -2277 1997 1863 -4103 -438 2560 -2191 973 3372 -2917 -2292 2367
1140 2367 -1211 -610 3612 -697 -3694 1928 177 -2832 2300 1260 -3023 1207 1542 -2870 841
1155H41J975n010K054L036n111N85M328m015l34N021l847k701M952j460k919N291
1171B686j152m751L536J013m254M011K202n599J131K841l755J271M817m772j322
1186b097M354l239j605N687k336l292M543j124m009M475O65m965L702K150n232
1201b323J682L202m588Q73M491l662j686L849k754k121N395p65l586L172o61m081
1217c563M147K167m453K217J244m808K148M083l660n42L294l669r31M835k352
1232A57k260M637j985l183M059J07m197L853J240m470K289K171n018J425M256
1247C081m320L19L735m232j672N282j734k253M417k258l960M307P49l764L981
1262A678M83m926K024K766l618J282L395m623l97L803k869o69M351k705k366M536
$$ plain form
1155 841 2816 -2194 -140 2896 -2215 -1630 2698 -1317 -1651 3370 -477 -3178 1774 314 -2605 2686
1171 2686 1534 -3217 319 1332 -2922 1089 3291 -2308 -1177 1664 -2091 -820 3997 -775 -2097
1186 -2097 2257 -982 -2587 3100 764 -2528 2015 891 -3118 1357 2022 -2943 759 2909 -2323
1201 -2323 -641 2561 -2027 -1154 3337 -325 -2011 1838 -916 -3037 2358 1593 -1993 1179 518 -3563
1217 -3563 584 2751 -1702 515 1759 -3049 -901 3182 -478 -1020 2274 -1395 -2326 2509 157
1232 157 -2103 2534 549 -2634 1425 1532 -2665 1188 2428 -2042 247 2418 -2600 -1175 3081
1247 3081 -1239 -920 2815 -1417 -3089 2193 459 -1794 2623 365 -3595 712 1461 -2303 1678
1262 1678 2161 -2765 -741 2025 -1593 -311 3084 -1539 -1936 1867 -1002 -1671 2680 -25 -2391 2145
1278B145j700l219L841M50l959L281J365m712K012K397l947J771L510m079j154
1293a998L739l057n99N096k301l379L655j156k613M587O04m550K072J255m113
1308b758K999K972m226K24K596l276j38M165k451j927L947j952k805M199p76l092
1324b299L602P4l304K653J151m733K828K782l821P01K401m034j97M708k353j829
1340a670L929k668k576M722l39k962K956m16m024K904K645l913J294K567m275
1355a826N18L252k853p7L361k459j826L763j520k604L670k99l155L228L94l749
1371b182J966K082l348J346K636l853k20L283k424k50M127l401k303M118j497
1386H0j655L555m40l680K767M41l539K990J962m204R52K624l388L88L541k712
$$ plain form
1278 2145 445 -2774 1067 1517 -2442 839 2204 -2508 -496 1901 -2046 -275 3235 -844 -1998
1293 -1998 1741 -1316 -1915 3181 880 -2499 1156 0 -2613 1974 2578 -1972 100 1355 -2758
1308 -2758 241 3213 -1013 -789 1807 -1469 -1607 2558 107 -1820 2127 175 -2630 1569 793 -2299
1324 -2299 1303 1377 -1927 726 1877 -2856 -28 2754 -1067 -366 2035 -1999 -2196 2512 159 -1670
1340 -1670 2259 -409 -2985 1737 1398 -1564 1392 976 -3048 -144 2501 -1412 -118 2449 -1826
1355 -1826 -1308 1944 -909 -986 2375 -84 -1910 1853 333 -2271 1399 1100 -2055 1173 1567 -2182
1371 -2182 -216 1866 -1482 -136 2500 -1353 -1573 1710 -714 -964 3163 -238 -2541 1577 80
1386 80 -1575 1980 1540 -2140 627 1068 -2471 519 2481 -1723 -771 1853 -1535 -1147 2394 -318
1402c18j077L477k587j594L851j257k286L372j65l674K790N98l208K570J766l363
1418a105K92K346l281P83L456k594j367L565k811j260L881j069k455K837q82k797
1434b461K904J608l760K104J177l972J784K706l422L26L504l143j036L841k497
1449c37j787M182j404k466K827j36l293K695J631l206J512J382l324P79L307l107
1465g45M2K771k874j303L669j180j470L145j886k240K842J57k851K631R83l276
1481a585J464J915l378J117K700l028j80K948k697r55L392j588j726L158q46l165
1497b454L531J68k714K014J001l394J410K229l169J167K501l366q1K518k005p41
1513a385L574j845k080K641m87k250L056l4k979K366R08l103J424K086l265P28
$$ plain form
1402 -318 -1395 2082 -505 -2099 1752 495 -1791 1581 1416 -2258 532 1130 -2078 492 2258 -1105
1418 -1105 -813 1533 -1748 -965 2491 -103 -1470 2095 -716 -1976 1905 836 -1619 1218 336 -2461
1434 -2461 443 2051 -1709 395 1572 -2400 -616 2090 -1332 -1006 2498 -645 -1681 2160 -337
1449 -337 -2124 2058 654 -1812 1015 879 -2414 281 1912 -1294 218 1600 -1724 -945 2362 -745
1465 -745 -703 2068 -806 -2109 1560 380 -1090 2055 169 -2071 771 928 -1923 708 1691 -1585
1481 -1585 -121 1794 -1584 -467 2233 -795 -975 1973 -724 -1679 1713 125 -1601 1557 711 -2454
1497 -2454 1077 1245 -1469 545 1546 -1848 -438 1791 -1378 -211 2290 -1076 -1157 1361 -644 -1385
1513 -1385 2189 344 -1736 905 418 -1832 1224 1190 -1789 577 1485 -1618 -194 1892 -1373 -645
1529f45K622k967l99L083k499o02L225j168k561L110n73k821L407N02l433J531
1545a88J399l091J592K369k952K94K219k806m7L217k010j451K929j360k006K736
1561H44j18k479K383P12l362K145J313l026J301J728k615M78K459k697k22K934
1577A778j997o76K647j755k182L070l3k536K811K14l583K139J694k601J219J868
1593B077l392j7L090j910o76K792k358j750L496j033j720K535m88k331K396M41
1609A152k889J853J270k684J004K221k884j20K654k077n11K935j870j560K684
1624A178j038j628L220o53k989K088P49k623K019J417k923R25J656k572M17K217
1640A460j623j063K804k025j070L026j075k203K803l00k628K308R13k902J625
$$ plain form
1529 -645 1977 -990 -1389 1694 -805 -1407 1818 650 -1911 1199 626 -2195 1212 1714 -1719 -188
1545 -188 1211 -1880 -288 2081 -871 -577 1642 -1164 -1211 2006 -4 -1455 1474 114 -1892 844
1561 844 726 -1753 630 1342 -2020 125 1438 -1588 -287 1441 -1174 -696 1763 -934 -1156 1778
1577 1778 -219 -895 1752 -3 -2185 885 852 -1684 1127 1341 -2242 -103 1591 -1010 209 2077
1593 2077 -1315 -1332 1758 -152 -828 1964 -394 -2144 1352 319 -1401 1134 646 -1685 711 1152
1609 1152 -1737 116 1386 -1298 -294 1927 -957 -1077 1577 -500 -1011 1924 54 -1506 1178
1624 1178 140 -1488 1732 1079 -1910 178 927 -1696 323 1740 -1183 -258 1398 -1174 -757 1460
1640 1460 -163 -1226 1578 -447 -1517 1509 434 -1769 1034 734 -1894 414 1327 -1575 50
1655E0J685l191P26K269k547QK820k144o59K287j591j304K870o88k014K327l60
1672E44k647K519R23k488J462R54k849J081K107k110l59K589k269q77K616r52
1688B44j381K379o89k073K172J74j991J564P82k349J460J207k679P08K075k297
1704f94MK303k368q23K548j058j301K865r50j839J814K67j983J689O79k378Q33
1721c92J450k268R50J940k374l31K306j891n75K696j153j599K399r37j879K494
1737H36L32k563J738P97k351J144J401k322K91K486k280m35J850j173p11K250
1753A290r81j407K020m86j909K073K66j961J053J243k603J105J791k373M68J856
1769A445k253l38K784j893p51K446j148j920K611n08j932K127N85k490J422N64
$$ plain form
1655 50 1735 -1456 -730 1539 -1008 -1000 1820 -324 -983 1304 -287 -1591 1279 591 -1423 904 544
1672 544 -2103 416 1339 -1149 313 1267 -1582 -501 1606 -504 -863 1726 -543 -1420 1196 244
1688 244 -1137 1242 553 -1520 652 826 -1165 399 1181 -1168 292 1499 -1180 -472 1603 -694
1704 -694 -690 1613 -755 -1578 970 -88 -1389 1476 526 -1313 501 768 -1215 474 1153 -1225 -392
1721 -392 1058 -1210 -260 1680 -694 -1025 1281 -610 -1185 1511 358 -1241 1158 221 -1658 836
1737 836 1168 -1395 343 1140 -1211 -67 1334 -988 -697 1789 -491 -926 924 -249 -960 1290
1753 1290 309 -1098 922 436 -1473 600 866 -1095 -42 1201 -1402 -297 1494 -879 -411 1445
1769 1445 -808 -1146 1638 -255 -1006 1440 292 -1628 983 475 -1457 670 1255 -1235 187 751
1785G51k125J149J644k015j23J948j813m06K307j250j064K295j262j779K405p1
1801E91j949K168J44k371J559N91j564R15J389k343J60K010j654q79K589j343
1817A3j285K527j199j746K496j1j900J771L22k255J224J401k351P71J358k103
1833i67J75J788j432n39K360j399j563K517n01j845K184J1k139J502O58j911J178
1850G7J217k186L39J605j838Q9J994j761j98J929j018j583K183o34j364K018l5
1867H34k087J133P89j870J374J074k165Q32J246j890j00K124j380r58K136j476
1883c84j094K294o29j499K030J88k347J926L76j844Q00J399k187N14J468j877
1899h66O2J821j316r73K601j299j068K052j77j925J653k58j282J230Q36k238J356
$$ plain form
1785 751 -1374 -225 1419 -596 -719 1229 -584 -990 1317 67 -997 1298 36 -1743 662 591
1801 591 -1358 810 954 -1417 142 733 -831 84 1473 -870 -710 1300 -354 -1233 1356 13
1817 13 -1272 1255 56 -1690 806 795 -1105 666 988 -1267 -43 1358 -993 -222 1136 -967
1833 -967 -792 996 -436 -975 1385 -14 -1577 940 439 -1406 778 789 -1350 152 810 -1101 77
1850 77 1294 -892 -553 1052 -786 -697 1297 -464 -662 1267 249 -1334 849 215 -1149 869 834
1867 834 -1253 -120 669 -1201 173 1247 -918 -86 1160 -730 -830 1294 -86 -1044 1092 -384
1883 -384 -1478 816 187 -1312 718 906 -1441 485 861 -983 -183 1216 -971 -457 1011 -866
1899 -866 -804 1017 -299 -1272 1329 30 -1038 1014 837 -1088 565 307 -975 255 1091 -1147 209
1916B09O29j689L70J731j734J63J506j565n91K084r17j357K010p20j386J515O93
1933I51k019J351P49j996O87J245j713M01J440j246n07J848j356p57J644l53j313
1950i44J746n00j445J756k21j562J476P04j963M00J585j861M63J754j890k14J676
1967I60j308l56J642n43j489J711k95j881J906N33j920J102J161j925O47J145
1983A090j776K97J338j360k94J649j343o57J991m49j741J885j66j558J140P21
1999G67j616Q81Q31j713L88J511j537oJ442j477k05J727p21j056J723o02j482
2016a145J824l4j655J458K28j900J360O82j605N55J418j687rJ661j711k54K013
2033A199j221r82J886o95j336J908l10j409J427M69j803O67J203j697L75J361
$$ plain form
1916 209 838 -851 -481 1250 -484 -321 1185 -380 -971 1113 196 -1161 849 129 -1257 258 951
1933 951 -1068 283 1032 -964 -277 968 -745 -344 1096 -150 -657 1191 -165 -922 722 369 -944
1950 -944 802 302 -1143 613 392 -1170 306 1010 -953 -553 1032 -829 -366 1388 -502 -716 960
1967 960 -348 -704 938 395 -1094 617 322 -1559 347 880 -1040 62 1223 -702 -55 1090
1983 1090 -686 -389 949 -411 -705 944 -399 -1056 935 486 -1255 630 464 -1094 46 767
1999 767 -849 32 863 -850 -462 1049 -488 -494 948 -529 -734 993 272 -784 939 337 -1145
2016 -1145 679 645 -1010 448 676 -1224 136 818 -787 -232 1186 -501 -510 1151 -560 -814 1199
2033 1199 -22 -1004 882 187 -1149 759 449 -960 467 936 -867 -200 1003 -694 -319 1042
2049A042j472m80J908j239k39J290o30j051J768q54p21J293Jj195P03M22j732
2066a186R46J137j682N33J249j443JJ262r61l85J573r54q88J277m4j252J466N8
2084G07j874J135Q71j592R81N26j333L09J093j366k9J445q45p64J574p66j009
2101i37J337K34j421J002L93j588J200M51j629Q57J263j859L02J027j124j04J682
2118A086j388k78J437r69o14J455o52q03J215L69k094J535L09j418Q05J000j690
2135f95J20J621j503n10J849j121m41J649o20j376J635K37j840J384R3j206Q21
2152I7P29j747Q47N27j116M82J029j003m48J115n96q97J787r25o79J139j50j271
2170a080J538j91j140J062L95j366Q00R66j739M75J306j517l65J670j072m68J269
$$ plain form
2049 1042 -430 -910 998 -241 -480 810 180 -871 897 43 -678 615 616 -579 124 546 -1186
2066 -1186 -240 897 -785 -252 997 -446 -445 817 -144 -529 1044 90 -798 479 435 -817 649 707
2084 707 -1167 -32 839 -753 228 754 -579 -270 823 -543 -572 873 28 -736 838 72 -937
2101 -937 400 634 -787 215 608 -980 220 671 -958 -101 1162 -697 -395 632 -492 -596 1086
2118 1086 -302 -580 857 -112 -726 729 77 -726 489 858 -1236 299 608 -810 -5 995 -695
2135 -695 -575 1046 -457 -967 882 -239 -680 969 349 -1027 608 845 -995 389 482 -724 97
2152 97 826 -921 -74 453 -663 -181 848 -155 -603 512 -84 -981 806 -119 -798 341 191 -1080
2170 -1080 458 267 -873 189 584 -782 18 984 -755 -280 1026 -491 -856 814 -258 -726 543
2187E43l53r24J280o3j321J241L35j482N48J174j833Q51P86r97l20J233q13m47
2205e62J267p21n42J431o34q75J032L4j356J229Q3r76R87Q7j283P36Q53j329K19
2224c20J314j524k0J584j305o10J484n62j044J789l87j301J185P32j918O64J096
2241H57j453J87J276r36k16Q81q21m57J332n90m65P23O1o18M38M18j293M98O58
2260D80j301O94N72j094P51M81p88P2N95o04k07J199n86j097J588m91j025J764
2278A003j17j669J293R3j536O79J031j320J67J273j179m47J464p68q07J527k67
2295D20j111Q36L97j312J063L57j437Q21M59j022M86N59q49J00J201j399L1R69
2313E69p90l73J202p87q44J791l84j130J441m62r91R54N48j675J105O56j321J77
$$ plain form
2187 543 190 -734 546 483 -838 403 738 -744 -196 978 -855 -4 782 -215 -535 698 -115 -562
2205 -562 705 -16 -558 873 239 -636 396 430 -926 303 386 -590 397 484 -799 -63 790 -539 -320
2224 -320 994 -530 -550 1034 -271 -881 603 41 -1003 786 399 -902 283 1015 -903 -239 857
2241 857 -596 -409 867 -69 -285 596 -225 -682 650 60 -405 318 379 -239 199 617 -676 -178 480
2260 480 -821 -127 445 -649 102 583 -205 -133 462 -142 -349 850 264 -833 755 264 -761 1003
2278 1003 886 -783 510 603 -933 -254 777 -543 -376 897 -282 -729 735 -33 -840 687 420
2295 420 -691 145 542 -770 293 650 -787 34 493 -529 -43 516 -333 -233 968 -431 -400 569
2313 569 -221 -594 608 -179 -1023 768 384 -746 695 233 -758 196 744 -931 174 830 -491 -314
2331c14J117j083n16J569p87p58J752r93r30J402J66j234Q40O85j623O57O91j081
2349d40J34R03r01k23J199j005j41J010p88l16R11m48l83P87j72q31J173J93j475
2368h13J156K60j237P43P59j435J37J340j562J26J583q35j110J828q17j116J650
2385F57N1j541O85Q66j422O73R16j301L70P12j007j04J132n67p19J055n38j79
2403b61M74j25n13R30k03j122R78K86r10P86J44j127P08M13p92M78P81j229m5
2422c49J228j152j39J132n12j062J454n6j613J298L31j512J057M13j087J60J165
2439G56j152k78J354p64m95R94k71o20O94J77j311R39M69j011N46Q62j154M81
2457B16J57n29J20K70j013M30P46q32o4J273o80r32J550n58r40R46J19r26R48
$$ plain form
2331 -314 803 -280 -796 773 -14 -772 980 -13 -943 459 625 -609 231 916 -707 -50 641 -440
2349 -440 -306 597 -304 -527 672 -333 -474 536 -252 -568 343 -105 -488 299 127 -704 469 662 -813
2368 -813 343 603 -634 109 868 -567 -430 910 -652 -526 1057 222 -888 940 123 -993 657
2385 657 708 -833 -148 718 -704 -31 885 -416 -46 666 -341 -445 687 120 -599 456 -82 -261
2403 -261 213 88 -425 505 302 -820 158 444 -466 320 464 -663 45 458 -334 144 925 -304 -349
2422 -349 879 -273 -412 720 208 -854 600 544 -1069 229 560 -952 105 518 -569 -409 756
2439 756 -396 -674 680 -84 -579 415 144 -476 218 395 -916 23 492 -519 27 889 -265 216
2457 216 373 -156 -36 234 -779 -349 397 -435 -499 774 94 -838 712 154 -786 160 279 -647 301
2476C01K41j492Q11J001j326J99J074r30m56J413p84k94Q93n22p66O83N25j120
2494e49P83O21j378M28O53o53k40Q05p37J57N17q07J65O12l10m38J053p40p51
2513h09J513q00m00J238n89p47Q79l6r03P65N47j296M24J422j680O0J215q49r22
2532i68J769n20r24J004l1r49R65Q07j720J74J003j062L45N37n56k32Q13p08n6
2551c09M61p7l26Q51l50n52O41l65m96R37j43r96J022K40q25L75M37q52J85P50
2571F08j127p3J680j316j60P33j76q87P61P45j755R50O64j467O48Q30j079K74
2589a47Q98p12l62R99q11l12P92k1o26M65Q6p98Q23P2o04K36L00m76K66K60o15
2610b87L20M02r35L97Q13j016M0J089r90n90J738r77r60J148M19j356R59K67q71
$$ plain form
2476 301 542 -950 -139 862 -464 -265 809 -121 -577 836 52 -242 651 129 -637 46 571 -549
2494 -549 234 855 -523 -95 558 -95 -335 470 -267 -110 407 -400 -235 377 67 -371 682 -58 -809
2513 -809 704 -96 -496 742 153 -594 285 249 -654 111 658 -638 -214 1208 -472 -412 803 -46 -968
2532 -968 801 281 -643 361 330 -619 346 1153 -567 -393 610 -452 -107 430 -126 -358 455 -253 -309
2551 -309 152 75 -251 600 250 -302 339 -26 -522 415 272 -724 298 538 -287 88 525 -327 -142 608
2571 608 -519 -592 1088 -228 -388 345 169 -718 43 788 -967 -17 647 -820 -172 658 -421 -147
2589 -147 751 39 -323 676 -135 -447 345 324 -302 163 249 -549 274 346 -258 -22 278 -198 68 328 -287
2610 -287 33 435 -500 -103 710 -306 -266 823 -167 -757 981 4 -956 192 611 -745 214 481 -390
2629c90M11O13r67l07J165q28k9Q51m66n62Q66p7p36O64N75j350M49Q08j115K78
2649a47M86p78L83L36m15o5P69p49J8N14m59K49O29q22k63O09k94n92R71k6r05
2670e51Q98J99j232Q35M47j078J66J047q46k59R78n12o23Q70j08j174J181P0j002
2689f94O60M00r83Q75l08l58J96P83o21o3L38m92q0O45l95J04M14o51k55O85j88
2710A2p65J013J03r11O91K41j123M61P29q91J58Q14o76j72J151q47n59R83k39
2729A73q19R49j63p54M88O42j058L40N44q26K56P92m31k52P86j047J66P08m91
2748Cl48P06k62n04N32k2n69N51Q5p83Q72n3q51O99L01p62J58J120r88l71J010
2769E24m86n88J104l85q46J050j54o86O36P6q22P10O52j241L87O67p80l73P42
$$ plain form
2629 -390 21 634 -333 -640 525 -303 -332 519 53 -509 357 280 -456 208 783 -567 -118 690 -425 -147
2649 -147 339 -439 -56 280 -135 -200 569 -180 -162 352 -107 142 771 -51 -314 295 1 -591 380 354 -551
2670 -551 347 546 -686 149 596 -482 -316 731 -115 -374 604 92 -531 339 231 -943 238 308 -694
2689 -694 -34 366 -617 258 -50 -408 -212 571 -50 -113 225 -267 -347 298 -97 7 421 -230 -485 200 12
2710 12 -753 260 363 -548 143 384 -739 -278 451 -440 -282 532 -144 -316 835 -12 -571 412 173
2729 173 -646 303 140 -614 -126 516 -542 -202 342 -484 -228 564 133 -119 667 -380 -214 494 3
2748 3 -345 361 99 -405 127 105 -464 87 172 -611 261 208 -643 56 357 -405 -247 873 -115 -486 524
2769 524 38 -550 554 169 -677 373 219 -467 169 245 -577 133 785 -456 -69 598 -182 -555 187
2788A87Q8p61P23k36l06N10r7m58M95q3m54K66N18n18K78L15j078L11N76n23J3
2809b34M67m57j68R33q98q9P74o5p39Q15k27q82Q35J1p69Q20R6o93J99Q27p67
2830b11j74Q97k08r21P86P1j027J151j15p31K63N87q25M56R2l86K52N23j001N34
2850A3K67n12J69K71l37lK57l79Q3M91j3r23J104l68o55R66J23r55O62K63r48
2871d24J51Q87q21o7O78r15J68Q61m13o80P24Q4p78P10K1n95M92O62j046j77R76
2892D98j155N25L80l34j21N75q29K37O17n52k32O93l92l35Q10k56p03P13J01q38
2912e98O01K91n48L69M77o13k87J054n56r39J127l48o40R39j50m86M12K42p47
2931d00L35O40j065M08M81l24m85O15n78j53N36q0k24P43n77p0M80k16j26P6M
$$ plain form
2788 187 275 -486 237 1 -305 205 108 -350 145 62 -392 -126 392 -126 152 467 -611 -300 276 -247 -234
2809 -234 233 -224 -392 541 -357 -446 328 263 -476 339 112 -770 65 76 -693 127 223 -470 -271 556 -211
2830 -211 -385 512 304 -617 169 240 -787 364 249 -482 -219 368 -457 -1 91 -295 -43 480 -521 13
2850 13 280 -232 -63 208 -129 -132 125 -254 -171 320 307 -616 488 120 -535 431 554 -401 261 524 -424
2871 -424 -273 614 -207 -274 404 -511 -343 518 105 -575 149 233 -545 165 186 -409 83 745 -301 -478 498
2892 498 -657 -132 248 -86 -207 368 -461 -224 393 -159 -391 302 -90 -425 385 129 -574 139 240 -598
2912 -598 3 294 -254 115 592 -21 -308 746 190 -749 378 30 -610 329 179 -307 105 347 -400
2931 -400 -65 575 -490 -82 399 75 -410 205 -373 -526 10 -70 -294 449 -128 -198 282 66 -60 16 20
2952B0n65M01J67j80P0M76m71k14O28l74m21R91o87l34P02l64k57O64j27o01L97
2973g9O16j135N35K95j033N74Q15q29k11N68j83l53P90n29J27K98l89j73N16K39
2993D59q21M74L9l76L67K26o97L1P31o59K16K95l18N0N45n42m73R55p33l9P55
3014D85k76n48M93n1n55M94L89r24L97N79o53j36N31k73l56P65k37m66O77l79
3034d4k03M69O8q25P20L53q69P2O03l90k35N18m47j28O07q8k90N75l22m47P89
3055D86o75k16L44p7j81K16M79p42N75o6l74K12N27o92K33L82m91l03Q15m02m07
3076c57N87J00j185P61N40p90L73om69K25O44o48j03P38j75n08L82j71l97Q03
3096C44m94k44P90j84l78M05J20p38O36q1j16J49K17r48K70M76m08j51P63m13
$$ plain form
2952 20 -545 -144 23 -157 -87 389 -82 -296 332 -42 -463 528 -159 -493 209 -155 -412 252 125 -476 -79
2973 -79 537 -598 -63 232 -801 -227 588 -241 -452 116 -67 -420 370 -159 -32 266 -123 -296 220 459
2993 459 -362 112 151 -225 142 368 -329 -298 433 -226 -10 285 -33 17 562 20 -453 502 -231 -270 485
3014 485 209 -339 154 103 -452 42 431 -493 -96 483 -170 -306 225 -48 -404 361 124 -342 335 -44
3034 -44 -247 222 290 -535 185 538 -331 -259 344 -46 -281 237 -210 -338 269 181 -109 466 144 -303 486
3055 486 -189 -405 -61 -138 -319 -103 376 -366 209 143 -231 -19 508 -184 49 431 -60 -363 452 50 -357
3076 -357 230 330 -855 -94 446 -344 29 23 -446 -221 423 -225 -328 410 235 -273 109 -62 -459 344
3096 344 -150 -394 396 212 -166 239 359 -379 257 176 60 209 426 -522 -252 224 -184 -335 428 15
3116A5k04M75l41m02P72L9o50N62N0m37N7O05q21L9P03n40k9N18k55o95Q77n08
3138a70l67N93Jn42M62M28r41O55o0m09L32L0o20O51K18o75K18N74n21j5P10n98
3160d6j45N23l26j83N18K76r83P42j73l71K09J28m24K23K98n27L26L73m78j70
3180b10K83l18L8O24L3q05O12k99m72M43K08m09L35K4j91oL77o59L65K07m60L6
3202b44O55o84L77q6O2k38K18K23p93M68M31n80K36M7l92N01L44p22k76N30l79
3223c02j88N27K09m82O20k10k69J07K1m95N45K1m68N19J15k36J1M2k6k82P98p30
3245a53m65N53Jj4J73J13q69Q15K76n20J75K84p56L44M39l95j42M09l09j61M32
3266B30l46r3M97k11l31L65k9l14O48m49r3O9M26n75K71P9k31j63O87p08k56P90
$$ plain form
3116 15 -189 286 -55 -457 315 354 -296 266 316 -121 -64 541 -280 -241 462 -78 -107 411 156 -539 338 -170
3138 -170 -537 56 57 -485 -23 405 -536 119 59 -350 -18 12 -608 43 261 -414 -196 378 -143 -158 552 -46
3160 -46 -191 332 6 -177 341 617 -366 376 203 -168 41 169 -255 -32 266 -261 65 438 -40 -210
3180 -210 73 -245 -207 417 450 -355 257 -42 -514 -71 137 -272 63 87 -104 -110 267 -392 -27 180 -280 -244
3202 -244 411 -273 104 18 80 -158 60 283 -510 -42 389 -191 45 92 -300 201 545 -177 -453 77 -302
3223 -302 -490 37 246 -236 384 174 -95 12 33 -462 83 104 -364 155 270 34 45 87 61 -221 577 -153
3245 -153 -618 -65 -64 -78 95 208 -661 154 430 -90 85 369 -387 -43 396 1 -141 268 -41 -202 230
3266 230 -116 -209 288 77 -254 111 82 -232 416 -33 -126 -57 369 -206 65 144 -87 -250 437 -271 -527 263
3288B63m41K47R8k85k94R20m41l48K77J92m17M48m5o45M29M02m75J53N71p31j4
3309a36M60m48q3O43n01k38N36r9m18L92J51m17O7N09p93K93M52m78L9M57m08
3330b0NM15n04j42M72k87Q7K93j94m39L96k20k56J43O02n55K70j6k59k2N86l54
3352Ak76M79O9m70M06k45k11K06M43o19Q8L50m40M09N9n70L31R9j43nK52l24j09
3375b20M12M4m74N07k45k1K73k15k43L22K24l81j13L19m23k75N62j77J55L66n77
3396a80PO91n23j64L53k67j17P90m85m23J62N05n19M87R8p59O4O95m76J3K55k43
3418c6m5M10l98k96L90m9k30L77M8n49M24J36n07K79M91n50r1M64n84K50K61m23
3440b28K51J40j07k72M46q9p68Q81j29n35L00L12o09O40n7n65O62J62r60M51J61
$$ plain form
3288 263 -178 69 167 -118 -412 508 67 -281 -4 188 -229 219 174 -471 -42 360 -115 38 609 -122 -136
3309 -136 324 -124 -207 436 -65 -303 233 134 -284 108 259 -158 -91 418 -375 -82 370 -108 -69 388 -20
3330 -20 -15 400 -104 -246 226 -61 26 319 125 -314 82 -138 -394 -251 351 -204 66 50 -209 -231 355 1
3352 1 -275 204 273 -197 209 -36 -247 -41 402 -217 -129 221 -219 190 249 -321 10 109 -34 -39 213 -111 -220
3375 -220 192 236 -238 269 24 3 276 61 -182 140 364 -17 -130 189 -234 -509 53 -124 31 397 -180
3396 -180 -173 518 -5 -169 184 -83 -200 590 105 -318 -156 349 -170 317 415 -344 -280 415 -61 -48 207 -36
3418 -36 -81 329 -69 -365 25 -24 -254 123 171 -378 46 182 -325 -46 445 -105 -196 268 -316 -66 195 -228
3440 -228 23 163 56 -216 230 141 -627 254 125 -410 -110 202 -407 233 176 -389 273 435 -525 -74 87
3461H7k48k33P12j56m60P68m51k72N33Km91J24J98n41K21L56k20J76J99l72r4
3482a62M06j61j90J64N2o02R34k50o42R84k73l81j70K82l37M06N60o92k9L93m86
3503a94n2O38l99l92N82k2n58M72J57n24M50k2l06M08K31q90O36j49l54M82l5
3524A59k96r5N18m51L2N67k57m24M59k61O1J98k95M9n5K90m80K52o5j35j91O93
3546B73m84J33M31l63j15J53P4k82J58j15J37ML51n09R0L17m84j2M61k20N3J73
3568B24l74K17K17n11j30M73j30k72L32K27o42L46L15m71L56K5l27J38M34n78
3588a31r2J30k90K64M25m66k39M23N9n01L76J95l64J61J27l43K31L65n74L4N47
3609C37m75j78P98m87j98L73m6k52M42r5j05M0J30m00N31J36p39J01M03n23L15
$$ plain form
3461 87 -161 -394 318 162 -298 470 19 -253 280 282 -209 -85 113 -428 -207 149 -71 105 304 -68 -162
3482 -162 244 83 -107 57 109 -493 441 191 -451 533 260 -121 -291 -9 -346 60 620 -72 -101 292 -194
3503 -194 -246 392 -7 -399 183 161 -397 75 232 -292 158 136 -170 238 469 -421 215 66 -288 194 159
3524 159 -137 -232 286 -165 -133 434 177 -247 212 -49 12 210 -85 -36 -91 199 -281 -29 -94 -229 -420 273
3546 273 -211 -78 353 -10 -125 28 102 -180 -22 -137 0 4 355 -154 -64 253 -231 -243 218 -2 51 224
3568 224 -150 67 284 -227 -357 116 -14 -286 46 273 -369 -23 292 -179 177 202 -125 13 447 -131
3588 -131 -223 -93 -383 -119 306 -160 -399 24 83 -418 -42 153 -211 -50 77 -266 -35 330 -244 -210 337
3609 337 -138 -316 482 -5 -203 170 124 -128 314 219 114 154 284 -116 415 551 -188 -87 316 -207 108
3630A08P1k50OJ88k16j87O11m06J47N1O5k24N2R5n15N16K93o34n1K08j22K25M59
3653D90n83p2L44k37j29L29j28q5J00j27NK83O5k53K23l46j88L71O0k1l27M68
3675B42m50j00M12k50j72N69l56J69K16l44j78M2K23k81K27L15l29q0J80j98J93
3696E0K07m30J1K53k04l44N94k15p7M23l9l06Kk1J42m00P35o68K46K98n29L55
3718H3K19k10k80N46m9l87R3J13l67O04j37n71N12Q9j85n7M91n86R2K45l38j70
3740b50M47m84M86n8l18P2J80j73m40P20K65o52M61j25l89N00Q3l74k3K99m89
3761b62j55Q00l58j94P39n09l19L94j63m4J09r9l11L77J46Lj41L30l95K51k77
3782g8j79J18L02k01j17K31k54J9K24n4k54K62J3j90rK37j65K99L7m02K19J67
$$ plain form
3630 108 179 -71 -65 123 -93 -280 331 -75 72 123 188 -36 16 111 -404 112 405 -229 -280 -72 -194 31 490
3653 490 -93 -165 179 -58 -187 142 14 -71 29 -98 -93 190 255 2 225 -121 -309 62 122 101 -226 242
3675 242 -208 -308 104 -146 -318 251 -105 64 280 -64 -242 -200 23 -258 -31 284 -45 -125 55 -143 50
3696 50 257 -173 -162 91 -113 -457 137 -78 -155 268 229 -77 -75 -96 46 -354 381 -287 -41 257 -272 83
3718 83 302 92 -188 358 309 -78 15 128 -239 365 228 -343 169 258 73 16 507 -79 13 258 -80 -250
3740 -250 197 -287 199 141 -177 -105 75 -98 -538 182 447 -205 256 131 -258 242 325 -49 -72 227 -262
3761 -262 -417 383 25 -169 570 61 -258 136 -27 -71 38 -61 -372 5 151 154 13 343 -52 199 -78
3782 -78 -257 -139 163 -38 -155 76 -178 -159 65 11 -243 19 32 -158 -167 70 -95 204 241 -161 58 225
3804B25j07l95L49l45J26K28j71r3O31m95r0K35j55j9K40J10o70N05K58n25J53
3825eK62n44M9N68r0m77L33L5l26K42L63o18L73k58j27K68L3k8o9M8k54K63L52
3848C93l59j22J37n4PJ45j74m0J31Om28P56j02m30L35j34l57R6M42r15K72O36
3870B41k59R8K97l74k18N19k61l63J88K82k85J43R5j1k1K54l77k7K80p5k50N14
3892C90o44M8N36k28n9K17m48R3J9K39j14J58j37k52JO01m70nJ32k46J8K26L1
3915A06j91N6j55k98P13j52m35K63j97O4P30o39J19J21Q9l22k75M74n1Q8j34j15
3937a41Q7K16k1m84L77J40m68N43m31J04Q6k9K34l84J74j41K75j54nk55M93j25
3959I1l72N38j00k63K08k05r2n2K41r9J53k04q4J18L49j43k70J30k38J41J24j69
$$ plain form
3804 225 118 -277 72 -273 -147 81 -90 -183 448 -47 -137 98 -57 -76 164 274 -396 109 367 -158 -5
3825 -5 257 -287 -238 330 240 -237 96 131 -195 47 410 -208 165 -93 -220 48 81 53 -16 32 -222 41 393
3848 393 34 -88 49 -5 2 147 -27 -67 64 70 -358 398 296 -134 201 67 -290 -194 248 -667 -395 241
3870 241 -18 80 377 3 -215 304 43 -320 -132 150 -135 8 103 92 71 325 -52 -79 201 126 -124 390
3892 390 -254 -206 330 102 43 260 -188 -95 -76 163 49 207 70 -182 -181 420 -50 -55 77 -169 -151 75 106
3915 106 -85 -29 -184 -482 231 79 -356 -93 -290 -226 504 -135 -16 105 194 -128 -403 71 20 108 -26 -141
3937 -141 -54 162 141 -343 34 174 -294 249 -182 -78 8 -21 213 -171 3 -138 137 -17 -22 -277 216 91
3959 91 -281 257 157 -106 102 -103 -195 -247 -6 -105 48 -156 -240 -122 227 84 -186 -56 -294 -153 -29 -198
3981a98K59l0j74M7K22m7j60J87k23J63N1j87k03L46K34k34M1L60l52l17M18k52
4003d9k57P85o24QK90k73J92J99j9n67K19L65o16M81l2j95o6M61l45J01K16l66
4025i2o9M30l89n7J88k70%N51m10k23N07m5k32m9K04j88KL60k76K0J53m0j58O6
4049a7J02m06O81l51j47K22p9kjj7k47K8M83k23N4J09k62J61J76m2l36K87Lk54
4073g8j09K83Op2j04l26N48l32P4J5K83l80L17l8l43N26k73o8K1K57p1l62lK0
4097b09O2L45p3l5m3o7o8K00R4l2l22K05m7O8M0k57K64l1L82n35K19j08M6Q6k08
4122b4q3J59P5m59K01L32l31j2O04l40k58O50n49l02M28k79J48O5M6k62L20l02
4144a73m1L36L6k36N4L02l09o6L12l50J12K84l34J95j28J39l34M17O3k04m23M74
$$ plain form
3981 -198 61 31 -143 -96 126 79 -81 106 -117 46 97 -90 -293 53 287 53 94 454 102 -215 203 -49
4003 -49 -306 479 -145 -137 153 -120 72 271 252 -315 -96 269 -347 134 102 -93 -159 302 -43 58 274 -92
4025 -92 -161 269 -120 -177 11 -259 -259 292 -118 -341 166 121 -111 -160 44 -144 -142 218 -58 -38 115 75 -83 -17
4049 -17 85 -321 360 9 -138 84 5 3 2 -15 -262 -234 249 26 80 189 -73 88 264 222 -114 173 176 -78
4073 -78 -187 96 102 30 -74 -400 148 -184 -110 -95 188 -192 125 87 -256 270 -3 -71 -50 207 136 -226 -229 -209
4097 -209 -147 198 125 90 47 -20 -88 112 206 174 -148 57 10 78 118 -139 125 94 476 -59 160 52 98 184 -24
4122 -24 -107 52 127 -332 -131 201 -130 -142 462 122 -136 514 -35 -337 91 -188 -40 25 71 -191 129 -173
4144 -173 -214 122 158 -78 -24 278 -31 -97 215 -135 -23 261 -73 122 -6 133 -201 216 279 75 -348 126
4166A26l25L29o3k7l3K4o2K38j80j86j82J69K78j10J03n4L1M4J99m93J06j26J05
4189h9J92L09o71K49J16l93K38K97o6k21r6J72J52j8j20r3J01J38l77K29o3q9
4211a03K33k56j36K11J76n3N0j11%j62J3j29K43L03j62k0mM8m52M06O3m64P9K79
4235E2P6l67M48l93j19N05j78p1K7q1L53k52k9k03N49m29m0J23J53k23O8M01o59
4258b89M63N3m41J27K34J39m75L17j64N3K89k17k34R6k20J94M6J19j39Q4J49k42
4280e8r6K67l09K97J65l01J87j08r7J25j6j61k97N23o7j40J72K3j83k7J03J50
4302A52j2m0J97j91o9n5j47K44k5l88N21j97m1N5J07j43k36L28j30K96N0m76j71
4325c71N60N4m50M63l21N8J72l3n46N79K8l21K62M9j66q4J87l62J69K35o22N04
$$ plain form
4166 126 -199 130 67 40 7 31 -31 207 27 -159 -341 -172 106 -4 99 45 76 120 319 -174 -68 -194 -89
4189 -89 103 412 -259 -10 106 -287 -49 248 182 -39 -135 37 189 171 51 -42 59 197 -180 49 -14 -103
4211 -103 130 -126 -262 -51 125 72 122 11 11 -151 -138 -267 -24 279 117 97 93 141 -311 95 158 -306 -227 52
4235 52 128 -239 209 -184 -303 202 24 -47 -20 -101 252 0 -29 -232 317 -112 -152 -29 124 -99 -31 370 -289
4258 -289 174 227 -214 -87 147 286 -189 128 -36 17 306 89 -145 -49 -269 -75 -29 90 -49 35 184 -58
4280 -58 -154 113 -196 101 266 -35 152 44 -53 72 56 -105 -402 121 54 -86 86 109 -74 -101 2 152
4302 152 140 100 297 106 37 -18 -165 79 54 -334 187 -10 -51 4 111 -32 -268 60 -70 226 276 -200 -371
4325 -371 189 243 -207 256 -65 -7 165 132 -414 165 193 -128 134 183 17 -67 120 -242 -73 162 -460 44
4347D4J85p6l39M27j69k30K94k74Q4J0k07J62P1p1n7L38m5j41J63Pj47oM9k25
4371a53j64N45r4o4q1O2j79J80K6j53N04l14k23j81L07p1n1J87l10K86L00m68
4393a09L25k28J62k26M20k66j27L50l61j35K62R6k24pJ60k42L30k32j53K80L30
4414D05l71k31L51N3k51J49m1l95M49j74N7J77j73k42L0L20n6j96J03j56K50j70
4436a12K31m4j22k03K11M4j41j61L64j63M10l07p1L5J07K20m10K7QP5Kn9J67j06
4460BK64l35q5QRK03p0J49l70K10K60o0J43m32J15l28O89m48L3q1q5j01N24m09
4484a95QM48k61j02o3P6k46N54k37O2n6N3N7k72K82j00P5L26m73k12M5J46j9K01
4508I7j50K00j61L06k83Q8j2l63j09N50O9k9k87N3J6K0R2m51M31p4J59j66k19
$$ plain form
4347 44 229 153 -186 241 72 -158 136 -138 -54 -44 -251 -89 -18 -89 -146 192 147 6 169 176 29 23 72 -153
4371 -153 -317 228 134 70 -11 51 -128 52 78 -75 429 115 -108 -289 18 -53 -104 83 -227 59 359 -109
4393 -109 216 -12 150 -76 344 78 -49 301 -60 -195 67 163 -61 -68 92 -150 180 -52 -205 75 405
4414 405 34 -197 154 207 -44 105 64 -331 118 -56 1 178 5 -237 -207 113 57 -139 -36 -192 58 -112
4436 -112 119 75 -47 -250 -39 5 -136 -297 67 -96 314 7 -64 -29 78 298 -112 -85 -77 -2 0 -59 108 2
4460 2 266 -69 -154 -146 -137 66 -4 145 -225 -15 245 185 328 -104 11 -317 372 -76 -43 -124 -209 -310 214 -195
4484 -195 -187 261 0 -102 -165 -89 -335 219 -18 44 -12 41 98 -174 108 8 83 409 -64 -276 -231 -85 -104 97
4508 97 -53 147 -14 292 9 97 85 -278 -387 163 232 203 -84 -31 -15 5 97 -354 77 3 162 -4 -223
4531b23K93J78k61J38nj0q4J93j60k68L93l00J68j33QP5j47J31J10j96L73n06
4553b33j21N68j86l31J27K11n2J67j23k05J81J90n25J88L47o9j73K4l1q1L80m99
4575b46P1K11J10k04L01j15j80L2j8q4L25j45k01J51R9q2mL76m21K0J11l1N3M4
4599A73l73J95J1M8k9j40J53j3k94O92o91k7M85k09J11k59j22K26L74k70m33N40
4621A48p2m8J24k05lL14o2k56J04l01M04r5K03n45J38Q1l5J45O2r3m39L67K46
4644A82l01K36J7N5m9l5l89L36K95l68j68N9M6J09k9J07J07j18q5R7l1K29l54
4667e2l81M89J9m6L62m19l01K88M00l55J39n86L98K77m41QM46j46M6l39J6K39
4689F1Ql0m23N17K08k6k52o9l08K12K57n1p7j56M40j15R7j95m17L22J93o3j15
$$ plain form
4531 -223 70 248 -13 125 120 110 26 219 59 -209 184 -116 52 -81 -73 2 -145 -14 96 -100 273 -233
4553 -233 -354 214 28 -303 -176 35 -17 150 27 -178 3 193 -332 -144 203 134 -39 -15 -46 -127 253 -246
4575 -246 -175 36 146 -58 243 128 -52 -20 -38 -122 203 58 -143 8 107 25 21 397 -24 -4 107 76 129 173
4599 173 -200 -5 6 54 25 -115 38 25 -269 423 -268 -295 190 -19 92 -167 -289 -63 311 41 -392 148
4621 148 76 28 152 -53 -56 258 196 -60 44 -257 147 52 255 -290 -152 -71 -106 39 101 8 -431 -64 182
4644 182 -119 117 134 189 140 105 -284 52 347 -21 -189 -130 -84 25 -4 103 210 92 7 104 73 302 -52
4667 -52 -433 56 75 29 391 -28 -329 -41 359 4 143 -443 -45 232 -209 -201 245 99 145 -194 -178 61
4689 61 69 39 -384 133 341 315 63 -6 -314 -102 155 104 27 -129 311 196 293 98 -319 3 196 133 18
4712A8L8n7J49L09m36NM6j88R2J20m89L84K60m86R0J41J58q2j36K28k3j56J69
4735A54k52J99J37m21M0p1J84L68m07J36ql01kM15J75k45j12J43j24l64J58K47
4757D9j58J30j13N6j78K15J4j0K19j13l13M5j09N11Ol60k0J85j76j97K24L97l66
4780f2j89J48J60l71L78j27k42L74j49l50L59Q3l51O89l30k70J66K29k47j6L46
4801B28j65j07J54j69J24o8J74k21M94k86j31o3J89r4K40j11J07l45J16N5Pk00
4823g2O9j34J08j02K17q3l8n0K08p5j90L21j95L9j98l3J02K09l0o2L15n36K99
4846H9K41J09j99l08Q9K3L3r8O1K1J13n6r4K46j33m8Q3O7k39j61K92j49Q0L9m14
4871c13M78J47m87k3N18l83Q1l4j18M8K45J05j89J51m06L64k72l2nj54L31j14
$$ plain form
4712 18 56 -1 148 457 21 26 72 -116 -24 96 -393 -9 251 -235 -145 -4 154 72 -64 164 141 -15 154
4735 154 -98 101 238 -183 -143 -214 -30 338 -69 67 59 -242 -244 171 346 101 -11 132 8 -356 -198 49
4757 49 -109 21 -92 -36 -214 1 15 5 224 111 -202 -157 -266 245 251 -109 -129 56 -120 -317 -93 304 -62
4780 -62 -251 -103 57 -314 64 -63 -305 69 -80 -430 -71 12 -339 350 20 -250 -84 145 -102 -118 228
4801 228 63 -44 110 -59 65 -3 171 -50 444 158 27 -36 153 59 299 188 295 -50 66 121 128 -72
4823 -72 -3 -137 -29 -131 86 3 -35 -85 123 48 -142 179 -16 23 -175 -208 -106 103 73 11 326 -210 89
4846 89 330 439 240 -68 21 44 77 -21 40 61 174 118 24 270 137 89 172 239 0 -161 131 -18 62 101 -313
4871 -313 165 312 -175 -198 320 -63 18 -16 -134 -86 159 264 75 226 -180 184 -88 -120 -125 -279 52 -62
4893f2k01M50J07k84j49j66K99j19mQ7j69J09Q0KL6l09N04j74k54L13o2J18n5
4916I7J8m65K16J26%j71O75n64L3J01j59J14j36k24K58m2K84m0J39n1m25L48n2
4939H0j4k49K36j03n0J25p8k25K76L04l88Q1K8j8m42L34j15K98l30oJ87j32NJ93
4963cK15n2n2N8j87l5J70K5k94j6M23j65J17K18n63K84j78k2J57k20j18J11M51
4986C24k65k58L75l23k72J42J21J03J71j89j31J18K33k94P4L95j99r2L06l45j0
5007a6l2o3K41P0Q6k74qk5j11L2L14k8m86N48m20j28M43k10j9R9Q1pj74p8K26
5032F1K29k87J03J23k92p4M85l65k63K01m2J07j23m7j21M30j98K29j61k16K7J86
5054hN1j52k56K68J32j00J56m36K97l31K94K88m73N45l51l14M52p7j75K23m44
$$ plain form
4893 -62 -263 187 294 10 -139 -305 -6 -125 -129 -42 -211 -102 -22 -20 16 -293 211 37 -217 96 34 152 97
4916 97 115 -350 -134 -8 -8 -179 496 -68 -35 66 -93 21 -115 -339 -81 -123 161 121 260 209 -216 132 80
4939 80 66 -183 53 -50 -100 25 -53 -278 -2 302 -86 -5 23 5 -437 -103 -218 80 -250 -256 -69 -201 -196 -3
4963 -3 212 160 108 166 -21 -56 114 139 -155 -171 252 87 204 422 -141 143 -35 -57 100 -120 -238 -127 324
4986 324 59 -199 176 -147 -419 -277 -156 -53 118 -71 -202 -84 149 -145 -71 324 125 33 339 -6 -16
5007 -16 -48 -111 130 200 286 12 4 -21 -132 -100 214 186 -300 248 -172 -300 143 -67 -86 13 94 87 -87 -165 61
5032 61 290 3 106 229 -63 -137 348 -17 -280 -79 -121 -14 -137 -184 -305 125 -73 156 -5 -221 -194 -8
5054 -8 43 -109 -365 -97 35 -65 91 -345 -48 -379 -85 203 -270 275 -76 -390 62 -15 -190 33 -411
5075d11L51LK87k46J0QK9j03L62l30J24J98l91j85K38K21k01J04k9j02P5mlJ36
5099A41k22L55p8l23K10J08Nk70K34p5m82K95j42Q3L25l5rj10k8P4k0O4k81K30
5123D9O6k34oL3k8J51j53K77K9J57k69l58j1L22NJ24j14K36j84J82l78J79N7q4
5147D8p6J47J68l56J95j67l7j83K61J23j69K91k96k5P7J28k59L34k06J8R7K1k53
5170a19M1M23j68l04L44m04P9k2K90l68K25j29J02l0j85K21K23j31l01L81j40
5191B8J20k91Q2K04l11J87L6r8P9q9n7M20k77j29j0k72M93k5k28L23j97K3L2J24
5215A67k22P0j94J83Kn3p4J80L2j23k63K66p3K80k92j03L96n5r5Qj04M80m40m4
5239g1J19J61o5J74l54j76K24nl19L21K00k4J5m0j18L6k09K34k47j23M64j46K48
$$ plain form
5075 -411 -60 -57 230 -16 -6 2 31 -72 290 -40 84 282 -109 -294 -56 165 -36 68 39 -63 12 8 5 141
5099 141 -81 274 196 -127 83 191 196 -74 160 85 -397 -102 -244 -161 164 129 120 10 -18 56 36 100 -181 49
5123 49 115 -119 -125 -92 -120 31 -122 155 184 341 72 -286 -297 25 30 154 40 276 92 274 -104 75 132 48
5147 48 -28 119 287 -69 126 -41 -78 -261 0 123 -46 245 -51 -76 1 129 -130 204 -2 16 113 134 -119
5170 -119 -78 345 177 -127 217 -187 -108 -130 160 -208 17 -112 -10 -40 -225 -4 219 88 -213 168 28
5191 28 148 -143 -61 143 -168 19 55 -43 36 -53 -110 310 33 -96 -106 -378 115 90 -138 185 -12 11 43 167
5215 167 -55 15 -179 4 6 -47 -121 59 91 -32 -295 -29 -102 178 -114 -217 179 124 29 37 -67 413 -27 -71
5239 -71 48 209 144 318 -36 -212 12 7 -312 9 209 185 200 160 42 78 -131 103 -144 -267 197 51 299
5262B99l53k41L96j47J2r0K00m8j26J11j3j46M26j2j75m13J06p6K39k33J11O5
5284a08P0j36O6J63q8K26j94Q1k03J34j20J37J41k28k00N64m30K31l03K41k17
5305a73K08J59j89N4Q5q3n8J93k25J35j30J09o6l9J04j1J6p2j72K69j52j49M85
5328B98l00j0j70J73k35K57R3m12L12L86m28k45M40l06k05M11j86k41L57m6P9
5349B2P0j45L25k88J38J6k08K85j08r2k37R8J63J50j77j04j26K47l09L75q1l36
$$ plain form
5262 299 -54 -295 101 -46 -34 -124 76 28 -98 13 0 -146 280 268 93 -320 -214 -290 -51 -284 -173 -108
5284 -108 -38 -174 -108 55 -33 193 -1 80 -123 11 -109 28 169 -59 -259 305 -125 106 -197 44 -173
5305 -173 35 194 5 59 144 61 3 196 -29 106 -24 85 19 -20 84 73 89 17 -155 114 -38 -187 298
5328 298 -2 -12 -182 -9 -244 13 106 -306 6 392 -36 -281 159 -147 -352 59 -127 -368 -11 -57 22
5349 22 92 -53 272 -16 122 138 -70 215 107 15 -222 -124 39 189 12 -92 -218 29 -280 95 14 -322
$$ [...]
8191I0
##END NTUPLES=NMR FID
##END=
