##TITLE=1H_DE-130_R_TFA
 200.13Hz, DMSO.
 8 sc
 23.6.2026
##JCAMPDX= 6.0         $$ Bruker NMR JCAMP-DX V2.0
##DATA TYPE= NMR FID
##DATA CLASS= NTUPLES
##ORIGIN= UXNMR, Bruker Analytische Messtechnik GmbH
##OWNER= pz
$$ XWIN-NMR		Version 3.5
$$ Tue Jun 23 14:46:56 2026 Russian Standard Time (UT+4h)  she@DPX200
##.OBSERVE FREQUENCY= 200.1313
##.OBSERVE NUCLEUS= ^1H
##.DELAY= (6, 6)
##.ACQUISITION MODE= SIMULTANEOUS
##.ACQUISITION SCHEME= undefined
##.AVERAGES= 8
##.DIGITISER RES= 18
##SPECTROMETER/DATA SYSTEM= spect
##.PULSE SEQUENCE= zg30
##.SOLVENT NAME= DMSO
##.SHIFT REFERENCE= (INTERNAL, DMSO, 0, 14.3821)
##AUDIT TRAIL= $$ (NUMBER, WHEN, WHO, WHERE, WHAT)
$$ ##TITLE= Audit trail, XWIN-NMR		Version 3.5
$$ ##JCAMPDX= 5.01
$$ ##ORIGIN= Bruker BioSpin GmbH
$$ ##OWNER= she
$$ F:/spectra/data/she/nmr/H-C/1/audita.txt
$$ ##AUDIT TRAIL=  $$ (NUMBER, WHEN, WHO, WHERE, WHAT)
(   1,<2026-06-23 14:45:18.82 +0400>,<she>,<DPX200>,
      <created by zg, POWCHK disabled, PULCHK disabled
       configuration hash MD5:
       00 E9 B6 7A A2 85 ED C7 34 08 36 98 17 FE 4E 26
       data hash MD5: 16K
       B9 43 5C 34 C7 DE 5A F4 54 92 6C A2 6C FB 82 23>)
$$ ##END=
$$ 
$$ hash MD5
$$ F0 30 28 24 B2 2B 82 3F 81 BC A5 CE B3 A2 14 A7
##$RELAX= 
##$RELAX= 
##$RELAX= 
##$RELAX= 
##$RELAX= 
##$RELAX= 
$$ Bruker specific parameters
$$ --------------------------
##$DU= <F:/spectra>
##$EXPNO= 1
##$NAME= <H-C>
##$PROCNO= 1
##$TYPE= <nmr>
##$USER= <she>
##$AMP= (0..31)
100 100 100 100 100 100 100 100 100 100 100 100 100 100 100 100 100 100 
100 100 100 100 100 100 100 100 100 100 100 100 100 100 
##$AQSEQ= 0
##$AQ_mod= 1
##$AUNM= <au_zg>
##$AUTOPOS= <>
##$BF1= 200.13
##$BF2= 200.13
##$BF3= 200.13
##$BF4= 200.13
##$BF5= 200.13
##$BF6= 200.13
##$BF7= 200.13
##$BF8= 200.13
##$BYTORDA= 1
##$CFDGTYP= 0
##$CFRGTYP= 5
##$CHEMSTR= <none>
##$CNST= (0..31)
1 1 145 1 1 1 1 1 1 1 1 1 1 1 1 1 1 1 1 1 1 1 1 1 1 1 1 1 1 1 1 1 
##$CPDPRG= <>
##$CPDPRG1= <>
##$CPDPRG2= <>
##$CPDPRG3= <>
##$CPDPRG4= <mlev>
##$CPDPRG5= <mlev>
##$CPDPRG6= <mlev>
##$CPDPRG7= <mlev>
##$CPDPRG8= <mlev>
##$CPDPRGB= <>
##$CPDPRGT= <>
##$D= (0..31)
0 0.7 0 0 0 0 0 0 0 0 0 0.03 0 0 0 0 0 0 0 0 0 0 0 0 0 0 0 0 0 0 0 0 
##$DATE= 1782211518
##$DBL= (0..7)
120 120 120 120 120 120 120 120 
##$DBP= (0..7)
150 150 150 150 150 150 150 150 
##$DBP07= 0
##$DBPNAM0= <>
##$DBPNAM1= <>
##$DBPNAM2= <>
##$DBPNAM3= <>
##$DBPNAM4= <>
##$DBPNAM5= <>
##$DBPNAM6= <>
##$DBPNAM7= <>
##$DBPOAL= (0..7)
0.5 0.5 0.5 0.5 0.5 0.5 0.5 0.5 
##$DBPOFFS= (0..7)
0 0 0 0 0 0 0 0 
##$DE= 6
##$DECBNUC= <off>
##$DECIM= 32
##$DECNUC= <off>
##$DECSTAT= 4
##$DIGMOD= 1
##$DIGTYP= 9
##$DL= (0..7)
0 120 120 120 120 120 120 120 
##$DP= (0..7)
150 150 150 150 150 150 150 150 
##$DP07= 0
##$DPNAME0= <>
##$DPNAME1= <>
##$DPNAME2= <>
##$DPNAME3= <>
##$DPNAME4= <>
##$DPNAME5= <>
##$DPNAME6= <>
##$DPNAME7= <>
##$DPOAL= (0..7)
0.5 0.5 0.5 0.5 0.5 0.5 0.5 0.5 
##$DPOFFS= (0..7)
0 0 0 0 0 0 0 0 
##$DQDMODE= 0
##$DR= 18
##$DS= 0
##$DSLIST= <SSSSSSSSSSSSSSS>
$$ [...]
##$SUBNAM0= <"">
##$SUBNAM1= <"">
##$SUBNAM2= <"">
##$SUBNAM3= <"">
##$SUBNAM4= <"">
##$SUBNAM5= <"">
##$SUBNAM6= <"">
##$SUBNAM7= <"">
##$SUBNAM8= <"">
##$SUBNAM9= <"">
##$SW= 18.0517328524113
##$SWIBOX= (0..15)
0 0 2 0 0 0 0 0 0 0 0 0 0 0 0 0 
##$SW_h= 3612.71676300578
##$TD= 16384
##$TD0= 1
##$TE= 0
##$TE2= 300
##$TE3= 300
##$TEG= 300
##$TL= (0..7)
0 120 120 120 120 120 120 120 
##$TP= (0..7)
150 150 150 150 150 150 150 150 
##$TP07= 0
##$TPNAME0= <>
##$TPNAME1= <>
##$TPNAME2= <>
##$TPNAME3= <>
##$TPNAME4= <>
##$TPNAME5= <>
##$TPNAME6= <>
##$TPNAME7= <>
##$TPOAL= (0..7)
0.5 0.5 0.5 0.5 0.5 0.5 0.5 0.5 
##$TPOFFS= (0..7)
0 0 0 0 0 0 0 0 
##$TUNHIN= 0
##$TUNHOUT= 0
##$TUNXOUT= 0
##$USERA1= <user>
##$USERA2= <user>
##$USERA3= <user>
##$USERA4= <user>
##$USERA5= <user>
##$V9= 5
##$VALIST= <valist>
##$VCLIST= <CCCCCCCCCCCCCCC>
##$VD= 0
##$VDLIST= <DDDDDDDDDDDDDDD>
##$VPLIST= <PPPPPPPPPPPPPPP>
##$VTLIST= <TTTTTTTTTTTTTTT>
##$WBST= 1024
##$WBSW= 4
##$XGAIN= (0..3)
0 0 0 0 
##$XL= 0
##$YL= 0
##$YMAX_a= 196826
##$YMIN_a= -162961
##$ZGOPTNS= <>
##$ZL1= 120
##$ZL2= 120
##$ZL3= 120
##$ZL4= 120
##$ABSF1= 10
##$ABSF2= 0
##$ABSG= 5
##$ABSL= 3
##$ALPHA= 0
##$AQORDER= 0
##$ASSFAC= 0
##$ASSFACI= 0
##$ASSFACX= 0
##$ASSWID= 0
##$AUNMP= <proc_1d>
##$AZFE= 0.1
##$AZFW= 0.1
##$BCFW= 1
##$BC_mod= 2
##$BYTORDP= 1
##$COROFFS= 0
##$CY= -3
##$DATMOD= 1
##$DC= 2
##$DFILT= <>
##$DTYPP= 0
##$F1P= 0
##$F2P= 0
##$FCOR= 0.5
##$FTSIZE= 0
##$FT_mod= 4
##$GAMMA= 1
##$GB= 0.15
##$INTBC= 1
##$INTSCL= 1
##$ISEN= 128
##$LB= 0.25
##$LEV0= 0
##$LPBIN= 0
##$MAXI= 10000
##$MC2= 0
##$MEAN= 0
##$ME_mod= 0
##$MI= 1.114404
##$NCOEF= 0
##$NC_proc= 0
##$NLEV= 6
##$NOISF1= 3.799351
##$NOISF2= 2.8
##$NSP= 1
##$NTH_PI= 0
##$NZP= 0
##$OFFSET= 14.38212
##$PC= 1
##$PHC0= -4216.443
##$PHC1= 6.592292
##$PH_mod= 1
##$PKNL= yes
##$PPARMOD= 0
##$PSCAL= 0
##$PSIGN= 0
##$REVERSE= no
##$SF= 200.129724274929
##$SI= 16384
##$SIGF1= 3
##$SIGF2= 2
##$SINO= 400
##$SIOLD= 16384
##$SREGLST= <1H.CDCl3>
##$SSB= 0
##$STSI= 0
##$STSR= 0
##$SW_p= 3205.1282051282
##$SYMM= 0
##$S_DEV= 0
##$TDeff= 0
##$TDoff= 0
##$TI= <>
##$TILT= no
##$TM1= 0
##$TM2= 0
##$TOPLEV= 0
##$USERP1= <user>
##$USERP2= <user>
##$USERP3= <user>
##$USERP4= <user>
##$USERP5= <user>
##$WDW= 1
##$XDIM= 8192
##$YMAX_p= 0
##$YMIN_p= 0
$$ End of Bruker specific parameters
$$ ---------------------------------
##NTUPLES= NMR FID
##VAR_NAME=  TIME,          FID/REAL,        FID/IMAG
##SYMBOL=    X,             R,               I
##VAR_TYPE=  INDEPENDENT,   DEPENDENT,       DEPENDENT
##VAR_FORM=  AFFN,          ASDF,            ASDF
##VAR_DIM=   8192,          8192,            8192
##UNITS=     SECONDS,       ARBITRARY UNITS, ARBITRARY UNITS
##FACTOR=    0.0002768,     1,               1
##FIRST=     0,             0,               0
##LAST=      2.2672688,     0,               0
##MIN=       0,             -162961,         0
##MAX=       2.2672688,     196826,          0
$$ Real data points
##PAGE= N=1
##DATA TABLE= (X++(R..R)), XYDATA
$$ [...]
1809C5k20J83J65k16k09M19j00K0m69N14j08L29n66J52P7r7L0N1k10K79m6j47
1831a34L9N3L88k57jJ09m18Q5K92O4k34J37l75J90L1j43P5P8K3n7k05K74K8m3
1855aJ76j34lJ79k23q1L59l70r2J61N8J2J49l67K64K9j07L2j8K08k95Q9l04K94
1879A5l6k62L80k03K38J30k24R4J33m0r0q6Q3j32k03K42k05r9Lr6N15n63L63J66
1903A23l5k2l09L68K3q0K9j85j05K71l4j38K73M6j82L6J94l77P4l3O0jj78K47
1927F5k00q6J76J16J59k65J0O2J77k09J91r2j15J2J40O5n6l56J95Kj05r3K57K73
1951C23n78L90Q0k91oL06j80j21j2j36K01j1j92R7K65j59k5J49Po8P5m7O1J50
1975B78j37n14L74N1J37m8r3J03l16m2K16l8j7O7j17L54j68m12K61l2KJ59p7J51
$$ y = [35, -185, -2, 163, -53, -262, 157, 57, 77, -392, 122, 14, 343, -223, -71, 6, -91, -61, -10, -220, 59, 13, -134, -95, -42, 346, 89, 88, 197, -221, -136, 156, 220, -14, 123, -252, -62, -31, -174, -99, -21, 2, -55, -260, 14, 42, -1, 175, 41, 38, 217, -6, -87, 272, -98, -190, -29, 29, 41, 190, -177, 87, 116, 9, 41, 23, 231, -64, 25, -279, 15, -21, -283, 97, -106, 132, 262, 38, 132, 265, 225, 135, 49, 132, 0, -203, 39, -166, -265, -262, -358, 157, -406, -43, 123, 88, 66, -243, 125, 148, 68, 97, -88, -193, 78, 44, -94, 179, 225, 43, 79, 273, -104, -30, -63, -3, -4, -182, 65, -135, -221, -45, 71, 230, -35, -25, 37, 214, 5, 196, 104, -11, 1, 141, 206, 150, -206, -11, -9, -114, -207, 50, 323, -255, 135, 215, -76, -82, 224, 44, -77, -89, -225, -24, -35, -227, -130, 135, -24, -49, 100, 107, 39, 114, 67, 128, 278, 141, -373, 1, 52, 189, 141, 48, 151, -165, -207, 9, -29, -46, 21, -96, 258, 90, -322, -61, -93, -91, 68, -9, 142]
1999A42k55j89L07k30L48%k94O6N3lPNN3K60j07j9l29L42l7P8m44L68l0k70M7
2024a31J60l6q9J44K08k42n0J03k08ML29j74J33P5k55O2j62j55L05l42N58k92
2046e5J23j4M4K86m76N1j60J62j27J32O6k13K73j32k8O0l2J80K1k17K23j39M6
2069G4p4L7J27l74k0K96L2k71K62j47JR7k45M43j56j54K36k33nr9K9J49M2J11
2093A58j95l0J72l1k22L28j31J35n8j44J27k90J11l3j65J97J83k43O7J71j98P5
2115a6Q0J0N0p5k77K08O2p3n7K8o3K87j23k23J23o7R1K04l36J36J52j62K98j85
2139G2k32K49j06j41Q6K8J03k03o3J39n8J92J28n56N90m11j22M75j70K9m7k35
2161b53K91O5m13J83n6J71M2k8k6j83J89k52K59K6p4k07L06l04L11j44K35j39
$$ y = [142, -113, -302, 5, -225, 123, 123, -171, -105, -52, -55, -48, -43, 10, 270, 163, 144, -185, 157, 120, 198, -246, 122, 92, -178, -131, 29, -7, -96, 48, 256, 14, -36, 67, -141, -137, 192, 18, 151, 226, -29, 33, -129, -284, 21, -321, 237, -55, 68, 54, 98, 384, -92, -41, -201, -39, -166, -34, 32, -181, 92, -40, -68, -8, -40, 140, 161, -56, 167, 28, 74, 0, 37, 164, -210, -230, 66, 98, -173, 89, -58, -57, 40, -205, 238, 82, -72, 164, -69, -74, -173, -144, 5, 47, 158, -37, -67, 105, 74, -148, 180, 49, 184, 126, -18, 109, -181, -70, -103, -268, -71, 112, -131, -64, 107, -91, -16, 64, 74, 124, 49, -228, -20, 42, -31, -88, -60, -123, 164, 41, -182, -59, -126, -35, 169, -167, -31, 121, -41, 257, 72, -160, 89, -17, -158, -72, -44, 59, -144, -207, -68, -126, 66, 194, -362, 228, -183, -305, 170, 0, 29, -18, -253, 38, 103, -310, -127, -183, -12, 30, 2, -24, -207, -18, -270, -11, 15, -59, -266, 40, -264, 47, -97, 138, -1]
2183aR0l63L93l34r2M90J1oP1l67K12j61PK67j54r8O3j31K27l90L61J07q1j17
2207DN4r7K08k74k0n9Q0J50l5J87k47K17l80K90k14K37j57J25N2k40K15k67K54
2230H3Q6k08R5k68K14j8J02Q2o01N13l2R2rj36P1L2j57J39p9k1p1P8J83k91L28
2255B07k68K47k92M7j02N0K42k08K59m44M61j23J20J00k15l34L57j02k34K55K44
2276B67k82J87j55o3J42j62J33NJ14m29M35m4j12J52j64l24K28Q2jK58k78J23
2298A12q0Mj20k1jJ03o4J58j09j20M93k74m7K88o05K79r0j43O14m01KJ4N7j40
2322i1k7qP5P0k93J16Q2o7J51J35j16lj61L82k93K62k70Q3J37p0K20k58n6l0o1
2347i1K35k26j2J50J18j90K87m22nL73J55l20J48j99m2kL4J97k68L97l03K32j21
$$ y = [-1, 89, -274, 119, -215, -307, 183, 194, 188, 259, -108, 104, -57, -50, 217, 63, -35, 28, -103, 124, -266, 95, 202, 121, 4, 58, -39, 169, -105, -125, -184, -104, 46, 11, 198, -49, 168, -212, 78, -136, 101, -56, 69, 121, -119, 96, -171, 83, 169, -39, 56, -212, 2, -16, 86, 168, -433, 80, 48, 140, 131, -5, 66, 98, -59, 80, 1, -20, -91, -13, 170, -121, 207, -61, 186, -106, -59, -161, -111, 131, -77, 182, -262, 199, 76, 196, 296, 81, -253, 104, 2, -232, 23, 267, -15, 172, 17, -46, 96, -66, 67, 72, 186, -243, 192, 148, 36, 188, 24, -300, -72, 10, 9, 267, -11, 112, 32, 36, -84, -105, -106, -3, -67, 91, -18, -138, 355, 81, 34, 322, -283, -4, -94, -237, 377, -24, -22, -8, 49, -91, -118, -126, -51, 19, -274, -158, -76, -143, 8, 143, 27, 24, -137, 245, -48, 214, -56, 27, 164, 94, 314, 56, 0, -30, -91, 144, -82, -94, 56, 174, -16, 271, -151, -156, 217, 372, 52, 200, 1, -41, -43, -9, 188, -80, 317, 14, 246, 125]
2370A25J22k92O5J57k83L96m08k31M77k5p8j06j21J56J0j17Jm4Q5M62m30m6M6
2393g9J92O3k10p1L48m41L9J97k32K87P5Q4l58K08J6j93J15M7K1r0j14K30r3r5
2417e4o5j46M91j29l4Q5j86j42J90J03k0m8p6j31K76J27k00J23q6l2Q8k58k2J83
2441C7K2r8q1M47l53Q1k33R3j30K07j22J46q7J87j97j50o6M70n8j15K27l49k4
2464a46K29l4O4k63L31j41M4k43O0Q5n3K4o7L61q7l50J78PQ4j18K8k32R7L11j91
2489b2k7j46K38J76l83J0J61J74j35p7j9j62qK9K48k42J6K4J79j05Ol3J44noL12
2515C47m80L18l74J44Q9pJ37j24J17J35L5k52l7j16M5K04k5J8m55L11j78L62l90
2538a76N9K40j74k35L31j50K74M7l13J22o04L55O54l59k5k86J33K07n6j05K37
$$ y = [125, 247, -45, 20, 177, -106, 290, -118, -349, 128, 103, 25, -81, -202, -46, -36, -153, -152, -196, -111, 351, -79, -125, -79, 113, 176, -34, -105, 243, -198, -159, 38, -194, 93, 168, 252, -106, 102, 118, -75, 40, 87, 108, 18, -96, 134, 41, -54, -119, -265, 226, 97, 63, 148, -38, -180, 10, 113, 93, 45, -31, -162, 114, 241, 41, 164, 78, 46, 134, -124, -146, 37, 59, -39, -120, 327, -26, 55, -178, -85, -215, -8, -130, 16, -71, 116, -81, -231, -297, 173, 115, 0, 227, -122, -146, 83, 49, 113, -150, 181, 40, 84, -159, -99, -14, -67, -43, -110, 251, 164, -186, -8, -1, 83, -35, -7, -239, -142, 169, -22, -49, -195, 43, 219, -164, -154, 7, 181, 46, -31, -50, -212, -220, -191, 57, -185, -169, -145, 34, -71, -65, -98, 46, 41, 35, 347, -133, 185, -189, -45, 44, 37, 174, 50, 167, 302, 337, 85, 48, -68, -23, 181, 156, 174, -281, 30, -148, 214, -176, -117, 123, -51, -286, 45, -105, 169, 216, -97, 25, -579, -224, 430, 71, 46, -240, -107, 100, 44, -61, 176]
2559A76j69k2K08K48o15K81L8q7j66J78r1J58n8p0M4r6l31J80L14j89J52k70L48
2582A61P9k73J00J08j36L48l66j43J41j61K34q1R6k44K4K53R0k04L7j2k73P1L54
2605B03k83j13J65q5J12j13J31P0j39J68m1q4Q7Lj75J29n0K91k95K58j16K1l2
2628A12j15j00j36K0m7J94L07n23K36n8QK35n0Ko5j50K01n2k0RJ3p9L6k88K57
2653e3K36m8j76j78K50L0j8k5n7n6P2k4K12k31j98K55J38J38n26J0L46l51L40
2676H6Nl35L31k50O9PK17l02L20k22oK29j08l7P1j1K2j57J83J2J4l2j60j74J85
2701d3k02L68J29k27N3jj30J00J71l41j10M6K94J62k60J68O6l67j88K71J26j48
2723f3K64k2k89J7Q2Q3Q3q3j23J41J26K5k95N5J63j67Q3l49K92L3m6j11K08K20
$$ y = [176, 7, -15, 193, 441, -174, 107, 145, 58, -108, 70, -21, 137, 79, 9, 53, -43, -374, -194, 120, -69, 83, -187, 161, 240, -33, 67, 175, 39, 387, 21, -122, 19, -142, 92, 11, 107, -137, -113, 140, 230, 26, 63, 51, -222, -151, 203, -80, -193, -28, -113, -1, -114, 17, 87, -52, 116, 75, -9, 78, 81, -94, 35, -15, 276, -19, 239, 123, 144, 112, -3, -103, -239, -219, -266, -72, 235, -288, -52, -110, -102, 133, 83, 85, 20, -130, 71, 19, -1, 8, 21, -58, -22, -310, -53, 183, 135, -41, -219, 31, 61, 43, 18, -39, -95, -23, -47, 165, -66, -264, -9, 129, 267, -259, -249, 97, -254, 86, 91, -244, 87, -163, -94, -87, 130, -172, 148, -74, -80, 149, 41, 4, 75, 64, 86, -71, 112, 124, 138, 106, -54, -228, -43, -245, 123, 252, 25, 78, 77, -53, 47, 218, -123, -233, -187, 107, 269, 9, 177, 243, -124, -312, -41, 85, -63, 201, 179, -110, -93, -11, 72, 155, 72, -51, 90, 216, 241, -54, 1, 164, -3, 80, -269, 23, 56, 10, -101, 107, 327]
2747C27N8j72j37o9kJ6q1j09L41l7k80L73o8j71J92k14K29l44J27J11k98P4J14
2770b0LJ08j7l5k01L42k31Q0k9J08j44M1J43k25L48k50k11J34J60Pj57j07P6J58
2794H1L4k20j04K60J2m5J34j57o8R8J13j61o8J31r2K9J09j19m5K95o5l13M14k74
2818b1l0n7M6K6m3J06N9L0j76K81On72M8K86R6j5M2k26J78K9J30l04O4j59K19
2843D3l6j29j39K01J12l5J1j56L87l13n2L2K12k11K89k29o5R5K15J31n99K02M
2866c0J19O0k93L4K00j24L40l27r6L36j44J23k80J55q2J13k83J22J16P3j31j83
2888a82K76j57J81j55L55l57o3k6L50j76j98P3p7J63j1o3j28J80M8K0k12J89K3
2911E3K25k54l88L24J03mj82M66j82l57P2J64rN9QO5j89j4j8o4Q9m3J2L4q9K25
$$ y = [327, 385, 213, 76, 7, 5, 21, -60, -169, 172, 135, -145, 228, 160, -11, 181, -33, 196, -148, -21, 90, -208, -134, -20, -17, 91, 74, 39, -162, 180, -51, 29, 0, 108, -36, 5, 148, -77, 271, 21, -190, -56, 104, 111, -46, -153, -77, 81, 115, -105, -209, 51, 63, 18, 152, -5, -73, 25, 138, -23, -91, 40, -52, -23, 86, -33, -78, 217, 152, -161, 253, -21, -51, -108, -62, -36, -79, 27, 86, 116, -60, 221, 227, -345, -297, -11, 85, 70, 112, -114, 64, 93, 223, -81, -17, -176, 43, 7, -122, -261, -60, 52, 17, 28, -128, 259, -54, -106, -74, 138, -73, 216, -13, -78, 17, 232, 363, -236, -34, -30, 89, 149, -144, -110, 90, -34, 306, -21, -117, 219, 75, 198, -82, 73, -9, 104, -179, -57, 59, 132, 1, -182, 94, -63, 118, -37, 318, -39, -102, -128, 222, 46, -152, -79, -156, 7, -4, -67, -195, -15, 33, 53, -159, 30, 53, 278, 24, -364, -40, 63, 59, -123, 343, 161, -196, -124, 40, 31, 90, 98, 163, -26, -40, -58, -122, -33, -76, -64, -30, -119, 106]
2937A06j17k2r8R3K7m18L76q6N17k59J4J14n76K06J05l1J3K4k55K25J17Ol1k55
2961b05L96p5l17J97J13R2N6j16k4k73J28J92L5k98J13j73L79k51k65L53L6l27
2983b34L85k82j9L23k95L15l77J18K37q3O3l52J36K41q8k38J31R8j15j8K78p3
3005A51j69l3M9j13j18J08K37l59M28k02m1N0k70K69Rj57J73L03j60q7k86K12
3027fL72k92j20J55j08L4j86J39q8M1K94j60j63N7n0l9J88k98L40j5Q1k44j15
3050a83J5J04P4j45J73j84Q9k67K53k11M55k3l30K06J23O4j65J06k8j31R1N8k32
3073h8L3J62O4k22K1n0%K40j46Q9m32N73r8j55L5J09K4m12K24j54K09N2P7j53
3097BJ72l00J62n9Jj27J57J16j22J09k48J20k99N3K61j71L27J03j35l08L62k36
$$ y = [106, -11, -33, -131, -38, -11, -429, -53, -139, 378, 119, 133, 247, -329, -123, -18, -49, -36, -12, -267, -42, 75, 81, 50, -205, 191, 116, -201, -4, 109, 201, 257, 141, 117, -156, -28, 164, 199, -99, 14, -159, 220, -31, -296, 57, 93, -234, 151, -131, -150, 173, -122, 193, -184, -66, 171, 88, 151, -201, -65, 176, 88, -150, -19, 79, -36, -54, 224, 151, -18, -51, -2, -115, -233, -125, 112, -247, 181, -21, -62, -12, -282, -13, -4, -161, 12, 315, 155, 68, -218, -6, 366, 74, -46, 109, 1, 35, -151, -12, -100, -59, 235, 75, -88, -31, -81, -120, 68, -230, 110, 95, 176, -68, -183, -168, -64, 10, -135, 38, -146, -57, -324, -71, -282, 173, 150, -180, 26, 149, 213, 48, 154, 126, -5, 86, 144, -88, -55, 107, 171, -51, -30, -80, -80, 160, 14, 103, -329, 244, 146, -9, 26, 135, 159, -253, -29, -183, 26, 78, 155, 2, 174, -126, 36, -23, -22, -149, 8, 124, 2, 111, -137, -17, -316, -263, -2, -173, 154, 257, 122, -186, 176, -60]
3119f0P0k0J13j1l26M99j30l57N16n13K00K08l78J92K21m1k20N7j71K9J56J3q7
3142d0M7JOJq8j04L75j1j44Q3j27J23j22k11K77j17L43j29k56J04O3l4n6J64q2
3167F6k03K89k60N2J81j90j8J29k8l8j93J79j87o0J17Q4J43j99J89M6l39M39k55
3190e6r2L19j11J69l4k89Q3j34L28l11N1J21P8j73J98j0j5L6j80J8Mj00K40j00
3214D0Q4k15k4J37o8l01J79J14L7q7K70k47J57q1J11J04j98J65k33m7p8K28j5
3237C2J20p6j28J45J9l4p7j00r3K38P7j4oj38J84l0K0J20J2j52M1J7j77Q9k5o8
3263dJ17l1j10k8P3j42L36k30p9L10k90m2J53j15j12K88n0k6n8K9j94J29K44k96
3287a28J62l5K7j84M24k02J0j95J0L77j6j94Q1n1j82j10J98l73M54j92j20L13
$$ y = [-60, 10, -10, 103, 92, -234, 265, 135, -222, 294, -219, -19, 189, -189, 3, 224, 183, -37, 20, -151, -122, 34, 47, -40, 7, 8, 14, 15, -73, -177, 198, 187, 43, 126, -1, 122, 0, -211, 66, -51, 292, 163, -93, 11, 74, 40, -16, 148, 66, -137, 152, -108, -56, 125, -65, -83, 46, 18, -20, -213, -34, -221, -281, -164, -80, 63, -136, 53, 99, -240, 199, -56, -148, 171, 60, 229, 195, -94, -11, -145, 183, -128, -77, 44, 122, -51, 147, 137, 122, 158, -22, -4, 0, -100, 140, 40, 124, -91, -115, 22, -46, -347, -168, -54, -17, -104, 166, -81, 76, -5, 106, 210, 12, 177, -56, -103, -181, 47, 32, 152, 76, -52, 93, 112, 78, 1, -99, -192, 46, 123, 109, 103, -35, 149, 119, 139, 259, 271, 119, 160, 177, 0, 89, 64, -4, 113, 82, -28, -56, 17, -125, 211, -19, -98, 212, -78, -120, 33, -82, -194, 94, 44, 18, -40, -11, -205, -76, 168, -128, 34, -1, 26, -158, 266, 64, 74, -121, -111, 266, 250, 56, 137, 86, -96, -206, -8, -381, 73, -119, -239, 74]
3309G4k02J06Q4o4M7J37l59L31j56j12L6q3J10O8j58K9L21l23J77k3J71j46N6
3332A21k88K44o5K3l2j53K44J36k56N5j67K77j84q1J58j9N4n0jk07J19J70J12
3355B10m60L22j71Q2mJ67l24J20N3K03k49k44L20n3l9Q7R2j30J56k59L2O3R6o9
3379AP7n8L1K64k01N6k06K6p0OP1j05K29j42j36J58Nmj5K4J31k17K10P3P7k03
3405H2k71K39l9j47R4K52k38j91K38j23K7N6m3j72K32K7Q6j99L6J59M8j65r5K37
3429A30J72k18J76n3j80n9K28j10L6J27j28j42j80J43J98m4k85K16j06K30j19
3450C2k3j32J91M6r6o5m8n4J89j87K13k62K31j9mL5J88j53j77j54K66N2j17J00
3474E2j94K91k99K04r5n2J84r1j57J77j06J85j96O2j02K19l87J99R9q6J90j33
$$ y = [74, -128, -22, 62, -2, 45, 182, -177, 154, -2, -114, -78, -161, -51, 17, -141, -112, 209, -114, 63, 40, 211, 65, 121, -167, 77, 12, 35, 3, -150, 94, 230, -26, 29, -138, 139, -45, -126, 32, 13, 67, 17, 16, -191, -72, 98, 210, -250, 72, -99, -17, -21, 146, -178, -58, -5, 198, -51, -295, 25, -28, -67, 20, 112, -18, 138, -121, -89, -26, 70, 1, 78, 20, 51, 315, 114, 170, -36, -10, -80, -74, -3, -108, 121, -21, -157, 1, 6, 2, -13, 11, 142, -75, 135, 208, 285, 82, -189, 50, 11, -136, -42, 210, -28, -219, 19, -104, -77, -21, -64, -236, -4, 23, 109, -90, -54, 105, 153, -12, -107, 130, 302, 84, 260, 207, 27, -32, 196, 86, 122, 249, 121, -21, -201, -58, 140, 96, -189, 27, -79, 151, 32, 9, -123, 68, 114, 18, -47, -95, -149, 40, -147, 66, -196, 35, 16, 12, 47, 235, 82, -95, -249, 17, 69, -48, 52, -142, 149, -150, 54, -41, -93, 91, 0, -157, 20, -86, 99, -97, -35, -137, 82, -305, -106, -7, -93, 97, -36]
3496c6r6L2O3J24L0m21L02K06k26P5k8p6q0J18K69m31J97j04J35jJ15k55J79L8
3520A29j23J2jj90J77J39nO5l50Q6M4J49p8M6j52J03L02k10l82L88r8m16N66q8
3544A13j44k22L10LJ10m45L98J73j89n2k70J78J9N9j12j4L4R7m01M48k95J45O
3567e1K7L5L9J72k75n8j58L33j52O5p8k12J19L19j27k17K92k3K35k56J7n3m1J01
3591E3J44p8L5l29QJ42J53K78m19M5K05m96K63J41Nk4l12J79j30J7j03K20j61
3614a64K08J76j44k9j30J24Qk6p9J33Q4j74j39R5pl29M28pk09L67n8k16Q5j55
3638a58L49l20P7J7q5K34j56n0J38J22j34j88L10k45J11M7mk3k57L71n3q4m75
3661d56P7M25N2j24J05j3j92J28K1P2L6j47j37J15L1K09j08j42j78M15k59n7L27
$$ y = [-36, -132, -100, -37, 87, 117, -304, -2, 204, -22, 53, 25, -51, -131, -13, 256, -175, 22, -82, 53, 52, 167, -88, 91, 129, 6, 18, 17, -173, 4, 143, 138, 203, -147, -61, -17, 132, 54, 100, -52, 51, 353, 143, -239, 149, 51, -365, 201, 113, -31, -253, 57, 60, 170, -275, 123, 296, 107, 55, -215, -37, -18, 41, -71, -85, -51, 46, -355, 93, -202, -57, -51, -24, 11, 50, 222, -53, -111, -269, 64, -88, -23, -101, -313, -194, 125, -2, -219, 73, 50, 285, 29, 46, -7, -48, 53, 197, 119, 154, -175, -167, -25, 128, 406, -13, 32, 237, -259, 4, 145, 150, 126, -186, -7, -137, -120, -223, -3, -164, 44, 220, 76, 47, -83, 41, 49, 23, -56, 77, 161, -13, -152, -57, -64, -393, 35, 28, -181, 186, 128, -88, -3, -158, 191, -129, -52, -35, -120, 114, -42, -92, 46, 168, 34, -154, 156, -89, 22, 69, 65, 42, -215, 156, 103, 19, -456, -379, 46, 98, -26, 79, 66, -126, 2, 23, 95, 131, -16, -153, -38, -7, 202, 94, -48, -226, 189, -70, -127, 200]
3684B00j63K5lJ45o1M6l91L54k66j21M68k25K35l47K48m05J12KK73k20j12K53
3706D7n0l9J19j79k60K17L84j82j22K23l29K08K01k68J28j86L27N3k66q4k4j07
3728a89L97k0m00J98L8K37k50n5O1lO1J45m05L00j94r9M13k29J9k35M27k24M9
3751D2k3j43K07K70l39J96J33p11M03Q4j73R3j83J92j86j91J61K79k09l5K93j72
3773a2q7J3R3J23k39P0J95j11k1l6j32L04k22P7j6n1n6K89m17L61j79k2K08l53
3797b21K86r2l0K7l3O0j10K38j97K09j84RO1j16r3L22n09K63l6K76l09j5J81m1
3821e4l3Q9Q2PQp7J1JN4J4k19n0o5J31J57j68J67K92l42O1Nk21K69j63L6K46l29
3848i1j02R7N5m4j75Q9K04l76K06L12k20J28r2L0j09J05j99L40k61K86j80j12
$$ y = [200, 37, 62, 59, 204, 143, 189, -202, 152, -114, -235, 233, 8, 243, -104, 144, -261, -149, -147, 126, -94, -206, 47, -3, -42, 77, -102, -362, -145, 239, 57, -65, 158, -171, 37, 238, -30, 98, -88, 239, 292, 26, -58, -82, -189, 208, 188, -212, -14, 24, 261, 11, -44, 17, 14, 75, 220, -185, 115, -79, -178, 235, 6, 25, -210, 217, -7, 42, 19, -124, 83, 353, 14, 210, 343, -368, 35, 119, -54, 39, -144, 48, -138, -329, -168, 111, -98, -133, 160, -12, -99, -86, 7, 130, -109, -39, 156, 45, 24, -12, -144, 160, -62, 15, -1, -52, -108, 181, -236, 125, -54, -76, 132, -221, 65, -27, -57, -30, -63, -3, -113, 125, -72, 137, -47, -38, 23, -93, -186, 136, -373, -110, -146, 130, -179, -194, -13, -54, -87, 2, 84, 91, 99, 22, 33, 34, 88, 102, -117, -167, -232, -101, 56, -112, 55, 347, 5, 66, 71, -150, 119, -44, -8, 238, -91, -193, -96, -41, -85, -260, -171, 33, -343, -137, 175, -45, 83, -9, 21, -88, 17, -182, 158, -103, 183, 3, -109]
3870a09J03L6r6J39l62M15rk94J93m0j48q3L32o2J98k7l19J83J0j4L4L5k55O8
3894g2O7l79J58J75L0QJ25jj20j52R7K44q8L6j25k4l5J8k46K36k5j67K52j35o4
3919a87K34R4j41J21j25L99m33L40j77k95J39l1L74l18j34j25O16m96Rj16J93
3940e9j1J72j95M5p5r2J96k07J52l0J42j0K1j83J14K5r5M1K65l6j11k4K6n6n4
3965c9o9K19l02J90J36j28pk17J89l26N12N4j90r6k26K72J17pl4N5k68M75m40
3988a30J16o1k16K53j34L3J76j51O0nj03J03M6n0J73l2R2k63J03j1l12K45J93
4011A25l45%J67k99L85j10j7j09J91j02J42k59J07K88J90k44k85J58mQ8R0O5k65
4034d3J07J27j31k27K67o2r6K50j66J41j74J54k83J00LJ29k88K33J86l76M01j74
$$ y = [-109, -6, 30, -66, 73, -289, 126, 117, -177, 16, -24, -172, -255, 77, 15, 213, 186, -133, 50, 60, 46, 80, 115, -140, -72, -5, -384, -226, -51, -21, -13, 112, 111, -9, -161, -64, 180, 92, 128, 3, -21, -56, -38, -284, -48, -73, -240, 12, -123, -187, 47, 141, 0, 121, -4, 395, -38, 302, 125, -170, -31, -62, 312, -6, -140, -265, 351, -145, -136, -252, -59, -70, 102, -93, -48, -123, -215, -19, -226, -74, -104, 38, 28, 49, -134, -20, 5, -90, -49, 216, 180, 69, 45, 71, 15, -39, -108, 111, -191, -1, 135, 7, 0, -217, -28, -354, 158, 212, 22, -74, -300, -28, 89, 82, 48, 103, -165, 310, -130, -14, -75, -291, -38, -172, -139, 37, -114, -54, -59, -162, -59, -13, -63, 110, 78, 170, -93, 10, -1, -313, -68, 125, -220, -220, -53, -352, 33, -77, -94, -203, -12, -114, 28, -231, -124, 164, 354, 110, -175, -17, -21, 67, 157, 222, -43, 64, 191, 60, -167, 100, 38, -58, 192, 26, 167, -7, 147, -136, -36, -33, 96, -192, 41, 227, -149, 252, 78]
4056G8O4j95K0N6J48k53J71LP3j73q6M54m71J13m5M9P1p2J16m35L74J0l15K57
4080A2pj97R3k8J06j79K6P2K02j36J2L9R0j56J77K32l90j03J03P0l49L24P6l14
4104b25K93o7l10L11K26q2j34m2nN0J28j58K21l15N03j54l44N08n08o5N20k16
4126A35j63l9J28p1K99p9j53q7N1J97J8n6j04j92K11j6q3J40N5n80M78K1k29K39
4150A20J50q6n19J74J44M9o0L4N6j52R3j69j76J02O4K45k2j24N3J21l57M7K50
4173C7n8N6r4M8kl5J11O1k53M46k38j82L47l16K40k24J04Kk93J53m1O4o6k7K60
4198A00l64L62Km48N32l82J82k53L04J03l4n3p9J47k24J7L9k50J29L42M0j84j4
4221A4Kp2L29j49o0Ll50J07M21j58k95M87k68j62K10R3k5j49r8L55j86o9J48m07
$$ y = [78, 142, -53, -33, 23, 171, -82, 89, 92, 165, -8, -94, 360, -111, 2, -43, 6, 77, 5, 121, -314, 60, 70, -245, 12, 5, -192, -99, -127, -21, -200, -174, -102, 100, -36, -24, 15, 105, -51, 126, 358, -32, -135, -32, 38, -311, 13, 89, -225, 68, 1, -309, 2, 228, 146, 12, -30, -35, 15, 143, -15, 206, -109, 394, 240, -104, 404, -104, -169, 351, 135, -28, -67, 61, -10, 289, 210, 57, -30, 21, 218, 236, 180, 76, -116, 95, 79, -4, 136, 191, -389, 89, 110, -119, 120, 270, 184, -335, -161, -17, 32, -28, 6, 62, -90, 3, -166, -342, -240, -176, 69, 47, -77, -24, 97, -260, -213, 37, -21, 35, -59, -11, -13, -48, 63, 124, -129, 317, 79, -103, 244, -72, 168, -56, 48, 50, -243, -90, -131, -67, -133, -160, 100, -264, 98, 100, -348, 184, -198, -16, -269, 35, 138, 104, 51, -28, 119, -105, -88, -49, -299, -170, 172, 212, 28, 14, 16, -56, 273, 124, 64, 67, -283, -176, 245, 87, -208, 279, 11, -151, 59, 152, 127, -22, -120, 235, 49, -20, 128, -279]
4245b79M81L8m89J89Q7l27M01l18K68P3p0m7r5m0P5J92k35J41O2J6k44N5K7M0
4269Aj18J60R8o6j2j13o9J46Jj48K03j72K91r2l9j1l0mnLqJ57k88K22j2q2L06
4296C19l86M14k06j34j17J04M7mp1N0J29o5j64J2P6J05q1o8O8kj08KJ53J77l02
4321e2K87j49j71K20k43%k33J26K35l2O7M6j65J67l72J31J58j54K91l12M4J41
4343C0o9Q2l45L65k7j22M4p3N42k85n8j98j63L14Q1j25q3L53k51M5q2r3Q4J81
4367A47k19O2K9l33K53J4J39r1P6J57k66q8J76P1m10L76o9J72M8j56R3l25P4L7
4391c3mj36p4K97M2k01k9J25PL7M4R6j14p2j2L03j44N0j26O1j49m4M91k03j30
4416H2J28r2p2k14P5J54j76J32m6j47J97n4J27J00k07j67K53j68j09J87j52J89
$$ y = [-279, 202, 240, -249, -60, 27, -300, 101, -217, 51, 124, 54, 7, -88, -128, -53, 139, -96, 45, 107, 123, -121, -66, -39, 1, -117, 43, 141, 75, 63, -50, -119, 27, 28, -120, 83, -89, 202, 110, 71, 60, 30, 26, 21, 24, 16, 173, -115, 107, 95, 13, 319, -67, 347, 141, 7, -110, -6, 41, 37, -34, 16, 145, 80, -84, -72, 4, 109, 28, -40, 28, 26, -82, -80, 73, 250, -52, 235, 86, -85, 135, -108, -108, -341, -215, 20, -12, 55, 101, -64, 103, -269, -138, 20, -134, 157, -155, -111, 30, -39, 43, -302, 63, 36, -86, -42, -115, 427, 142, 84, -114, -277, 37, 118, -7, -90, 263, 12, 57, -25, -118, -34, 147, -72, -10, 19, -314, -61, -47, 92, 1, 77, 234, -32, -120, 56, 127, -283, 93, 24, 196, 244, 88, 181, -144, -70, -33, -37, -173, -247, 50, 92, -109, -138, -13, -6, 31, 75, 171, 57, -15, -27, 276, 132, 182, 56, 117, -32, -76, 415, 212, 82, 210, 118, 46, -168, -93, 61, -115, 17, -29, -176, 21, -33, 94, 194, -13, -180, 73, -95, -204, -17, -169, 20]
4438B0j23M0JQJ49j64K9L7j40J07J59m6m4n5K3o6J26l31M25M3m0j12r0j33J30
4463d7L21k80k97J31J28Oj79K47j19l6L32m16L74j13j12r4J05M0j44K08j37K18
4485A36j9l33K41j85K59j44L32k07k59K73Jm0k07J80m3k01J63K11r5j55l4J92
4507F6p3o8J40j4j43P5K4R1j78L5NJ99q3j45lL23l97q2L76k83J35q5K49j60j15
4532a11L5m0M08m06m6K00o8J6k25M26l61j83L93J4J9k48J67K11k22q7L06k40K23
4555A81j56J44j18O6r0p2J88Q5j82j00K05k33L6N1J65m11J86K2J6qJ82l52K16
4578B1J23j68j10J28J3N0j00k32O9J55L1k8K41l18J83P9j20m47K70K07J14j1n9
4601I1k77K12J34J49j49j96J11lj74M11l04j86j96O06k03m3L21l00j13N6J10k70
$$ y = [20, -103, -63, -62, -54, 95, -69, -40, -3, -143, -36, 123, 77, 33, -22, 1, -65, 61, -270, 155, 198, 158, 46, -44, -177, -47, 274, -6, -303, -172, -44, -38, -217, 30, -89, -125, 207, -209, 165, 52, -60, -154, -49, -9, -153, 55, -82, 136, 117, -216, 25, -160, 99, -45, 287, 80, -179, 94, 95, 55, -152, 28, -15, -216, -53, 158, 63, -92, -126, 66, -7, -75, 65, 51, -92, -17, 7, 98, -80, -45, -40, 159, 76, -69, -72, 251, -146, -228, 148, -135, 0, -85, 164, 4, -111, -76, -116, 292, -114, -160, 40, -28, -12, -237, 189, -172, -355, 38, 52, 71, -177, -10, 201, -21, -108, 198, -42, 181, 25, 169, 51, 117, 27, -45, 143, 228, 46, -54, 151, -82, -46, 5, 170, -241, -55, -33, -17, -25, 157, -195, 21, 144, -24, -134, -6, 7, 57, -43, -275, -206, -51, -20, -48, 193, -125, 58, 137, 17, -430, -160, 47, 161, 150, 91, -186, 26, 160, 309, 160, -36, 75, 72, -102, 309, 5, -181, -377, 229, 26, -17, 304, 4, -109, -53, 57, -213]
4623b13K01K77k72J22m29K7K65K30j94m04K72M7j03J30k9j00L24k18J14K19l09
4644d3k8J07o7J40j84L52K6m74J64p4P3L1J2o3r4k4M14l32N1L5r5q6L06k57l0
4669a40j39O3L03N5j73j2J31k39J70pK4n9JL9J23K2m43J94K4n1J67j6Q5n6k2p
4695C7k29J77j60QL78j25O1k74j16M90j57o5K12k2j61j06r0P6j33L44l25J83J14
4718A17j59O6K9P1L8R6m27K93j85K69k78JO7L33m91J72j12j11L74k91K69l52K60
4741D9j86K44j9jp1j02J58l4J17n9k08j61J97J83l41J48l0K57J40l04kk9Q9J31
4765A66R0m12L05k85O6J03K6q6M6l9K7k3K58l97O0O5N3M6k14M93l86r2N54o27
4789b03L21m20J61K50j29N3P5j93p0K3L31O5k79j74L15k4j11k88L41p2K82j72
$$ y = [-213, -12, 265, -7, 115, -314, -287, -22, 208, 14, -390, -118, -71, -174, -44, -73, -173, 151, -67, 47, 266, -43, -71, 36, -31, 109, -75, 277, 303, -171, -7, -81, -8, 23, 35, -28, -122, -146, 268, -64, -13, 22, -73, -159, 147, -110, -140, -279, -216, 87, 142, -31, -43, 88, -151, 19, 12, 36, -23, -22, 17, 140, 162, -281, -87, -63, -114, 53, 37, 122, 66, 44, 37, -192, -15, -175, -167, 211, 86, 147, -127, -243, 247, 90, 25, 237, 215, 54, -52, -142, -66, -199, 145, -180, 3, 117, -42, 24, 53, 124, 162, 258, -169, 124, -61, 208, -70, -69, -2, 331, -160, 12, -100, -211, 163, -128, 141, -211, 49, -137, 107, 88, 87, 16, -86, 72, 38, 155, 96, -112, -273, -76, 107, -234, -86, -116, 141, 281, -23, -25, -54, 35, 166, 256, -156, 149, -136, -70, 33, 59, -27, 19, -20, 7, -16, 242, -155, -95, -30, 23, 69, -145, 348, -38, -130, 424, -203, 118, -302, -141, 109, -20, 33, 108, -85, -155, -132, 199, 264, -15, -189, 126, 102, -9, -297, 44, -28, 254, 82]
4811H2Kl9k6K08l03J25P2m07J74M51n08K54L74m88J63k16J11n0J32P9o9k55j81
4834c15L82N2J96n28J32Q9J61%n13K74J21k91L3J05K09j47K94L0j81l89L27j69
4856a28L2K41n4m9q5m6Mp7M20o5m93N6M2J46J57l34K26j51K2j38K67jj58k6L5
4881a57L40n67K69L41j91n0K04l38L8K82q4j48K8P0K38j43l86M22N7n27K31J16
4903D5r8O8p8J04k66K73J17q3O0r3q1N3l28J69K96k64J93l70M11K6l74O4K33J
4927G8k4n7j88J76k35K83M5O6j99RJ92k50L39l03r9J8J91J77l23K23k19R5J9J70
4951A84j88M2P3l4j93J38J64O0l05k58K73K9j80K70k45L06j84j53o9L00j19O7
4973b2J77l21K96m32J65N4K60j55J7j6L1J47l32J12J40Nj92J09j51L4Q4p9J04
$$ y = [82, 84, 45, 19, 227, -76, 49, 121, -286, -112, 339, -169, 85, 459, -29, 134, -82, 29, -21, 111, 190, 121, -134, -315, 67, 119, 315, -213, -81, 8, 169, 169, -344, -70, 51, -240, -207, -102, 107, -40, 254, 284, 103, -286, 41, -128, -96, 145, 91, 42, -43, -89, -85, -162, 258, 193, -300, -244, -202, -56, 101, -233, -7, -158, -136, -274, -7, -8, -166, -192, -157, 183, -384, -115, 226, 35, -15, 189, -149, -111, 171, 87, -61, -33, 37, 275, 132, -254, 168, 225, -302, -71, 45, -53, 15, -63, 41, -225, 48, 165, 82, 142, 49, -32, 21, -307, -138, 158, -106, 87, -283, 128, 154, -220, -156, 77, 78, 54, -3, -191, -15, -250, 33, 78, 144, -55, -46, 146, -104, 235, -68, -167, -149, 42, 219, -104, 119, -100, -5, 14, 184, -4, 38, 111, 77, -116, 22, 186, 246, -59, -317, -44, -15, -195, 75, -170, 136, -48, -201, -270, 30, -89, -22, 155, -166, 130, -302, -137, -83, 177, 22, 39, 23, 54, 201, -131, -19, 121, 126, -66, 43, -108, -74, 10, -69, 35]
4996C5qp1J20P9k62j25L81j59J05k17L2jn1Q5N1K71k87n6j75L03j01n5L91m60
5020a75J69M7k03K81k84J93j92J70j19J45L1l2Q8k23J19q5K78k85J63K63n87K91
5042E3K96j41p9j71J35Jj32M8l55L61O8k03K20rj63K42j88k25J66J58m0m6J77
5065A73l67M00k23m7J38o5M01o42J68J76j00q9J98j53n2O1m8K09k0j31j62J42
5087c3k06J19Q6J14k87K75j74J68k44L75j26p9O3K3J40m7r3o8K88k44j06j1K23
5110A56l4k44J22l7p3r9J03K30j34O2j27j7K57k01k58J59Q7J21j0k04K42j12j01
5133a12K59k66J52K23k88k2K00k44L25m14K97m27L95j19K61k71J22r2N3K98k64
5154F6R1j06r0K8k5n3J39k8J36k63J45J15l49J99j25L92m56L36j47J2n8J91o9
$$ y = [35, 27, -44, 76, 155, -107, -232, 149, -10, 95, -122, -90, -91, -142, -57, -6, 265, -22, -78, -253, 50, -51, -106, 285, -175, -6, 41, -162, 119, -165, 28, -164, 6, -113, 32, 63, 31, 119, -104, 15, -70, 208, -77, 86, 349, -238, 53, 349, 208, 129, -42, 93, 94, -38, 10, -345, 16, 84, -119, 101, 92, -71, 171, -17, -242, -76, 82, 42, -4, 173, -194, 206, -17, -64, 74, 9, 410, -232, -64, 112, 12, -77, 121, -32, -84, -23, -71, 138, 118, -13, -175, -33, -239, -120, -34, 80, -207, 68, -106, 62, -182, 193, 67, -12, 51, 74, 214, 167, 74, 6, 294, 50, -56, -67, 156, 122, -122, 0, -37, -110, -209, -106, 124, -10, 52, -75, -92, 165, -36, -294, -135, -48, 73, 63, -141, 101, -11, -112, 147, -119, 33, 256, -32, -54, 146, -98, 227, -187, 110, -317, 78, -41, 220, -51, 71, -21, 32, 330, 66, 157, 51, -39, -11, -36, -89, 50, 22, 158, -105, 40, 155, -194, 5, -120, 272, -184, 152, 5, 17, -41, 150, 81]
5177H1k21J03L4J90l4k79J80n0P6J15j88n4J50K49l99j80K53J05k7R3k33m1N0
5200b7K14Q1l90O1j91J19M8nn6Q3j3J80lr5J4k93J91r8M39j51l84J28K74j51L8
5225A3O6k7k5O5J54k41p2k92O22j52q1k5K2K05j44L8J19k10m4P4J00M0o9J15Q3
5250C34n29K15L61n29J79L7r9J47j48j83K88Q7j64j49L81j37l34K18kM1J79J2
5272B05j14J52j40o7L6o6M2k40J27J94P9r5j13J4Mj67j18J29L16m60M19J9j80
5295b4j83K43q0J82j41L3j9p4l1j66K9M6J85J71k24M5k18K05J94j60P9j11J08
5318H9L4j23K8k8K7p0J4J65K6j63k05K39l09K35M9L5j25j60K11j00K78N9l13l1
5342a38J34j46K20k53J70PJ42k05M0jJ42k69K73m0j65K27j24O2k14J21q9K3k17
$$ y = [81, -140, -37, -3, 187, 153, -126, 54, 4, 80, 195, 7, -47, 103, 352, -47, -227, 26, 131, 104, 197, -36, -77, -27, 187, 268, -122, -61, -252, -133, -85, -90, -146, -63, -76, 104, 101, 6, 20, -273, -82, -180, 259, 108, -276, -148, 126, -25, 13, 79, 52, 27, 92, 246, 5, -67, -359, 263, 111, 30, 5, 27, 232, 88, 126, 245, 35, -9, 65, 165, 205, 136, 251, 334, -195, 20, 381, -148, 31, 68, -31, 116, -32, -215, 73, 160, -4, -153, 228, 91, -243, -25, -27, 14, 193, 205, 91, 243, 103, 36, 72, 6, 48, -192, -65, 129, 208, 113, 0, 14, 18, -149, -267, -138, 178, -282, 137, 156, -24, -207, 36, -44, 138, -3, 30, 11, -63, -94, -260, -231, -185, 0, 171, -53, -8, -226, -21, 173, 13, 92, -19, 89, 123, 0, 28, 0, 27, -43, -29, 136, 162, -1, -206, 33, -276, -41, 8, 43, -82, -242, -31, -131, 147, 206, -107, -138, -4, -150, 70, -183, -13, -6, 136, -69, -29, -30, 112, -157, 116, 76, -89, 138, 14, 76, -138, -17, -106, -83, -300]
5365c00L25O1J21k49K87l38N1P2qJ22j66k05J14r6O2M16m20K0J51J9r9P6N4k61
5389a91L50k68K67n8O9l65K77k77J61j03K67j69J8J4Pn0J64q6J16k70L74l30K66
5412A83l27KLL52k21m3q2L94k85M42n29N6J93k47J95k43J99q3J99j29n4k38K13
5435e0n3J05l1N6K92m56O7N0J08Q2k74L02k32J13j94O3J40M4k49N0mj28M01k83
5459h1J05J39k84J80j08K16k27K81l87O1K7j5kN9l2K99j5m43K84j28J67j34J45
5482A07k0j86J62Q4J10m05J90j11L1J40k24L36j66q8J07j5Q1j82j65nP3M21Jm52
5506a76j32J22K57l7q9J78k82K74q3Q7j36N1lj49K16j19j2l8N5J42j22j28K91
5529A67k84o8K00j80J22K57l18J87n5j75K78k11L10m21J59M3l22M98k46J17q7
$$ y = [-300, 25, 86, 207, -42, 245, -93, -42, 30, 22, 144, -22, -227, -113, -209, -147, 269, -151, -131, 20, 39, -60, 16, 70, -191, 159, -109, 158, 100, 169, -196, 81, -196, -35, -138, 129, -40, -22, -8, -1, -51, 113, 27, 143, -127, 247, -83, 183, -144, -142, -139, 213, -8, -51, -133, 261, -24, 418, -111, -55, 138, -109, 86, -157, 42, -41, 158, 29, -25, -263, -50, -103, 2, -29, 27, 319, -137, -70, -20, 88, 170, -104, 198, -34, 79, -115, -52, 88, 132, -117, -67, -71, -199, 202, -81, 24, 163, -121, 59, -49, 167, -60, 221, -166, -105, -78, -93, -95, -36, -68, 231, 216, -227, 57, -71, 96, -38, 107, 87, -99, 63, 147, 257, -148, 42, -69, -38, 102, -122, 214, 48, -40, 67, 52, 133, -49, -214, -219, -146, 275, 276, -176, -308, -186, 71, 34, -55, 123, -159, 115, 32, 119, -17, 34, 31, -118, 98, -21, -33, -71, -16, 126, 4, -124, 167, -117, -185, 15, -165, -43, 214, -104, 83, 28, -147, 131, -80, 230, -191, -32, 11, -311, 187, -59, 58, -29]
5550b9L0J80l87K08P7j16n8M1Po2K98j13l74K32M5Pj06K17l37K82k40J36Q0l41
5574c23K19J32O1R4j38j32K8L48p2R8l24jL54n44J47R6k12L32p5k22K59O1n6j48
5598a8PJ83k83J55L4k23K38J60l43J59R8j72R1j76j8l02L49j36L55j69j76J54
5620c3K31l57K74j09J06L8j10j87N00j87L2J6m45J02K05j0K4k37P6k5j00L05J82
5643B91k17K1j12k04K90j51j33q8L06O6j96J37Q1Nq8p9j35K99K1j8j10R6%j65
5667h3MQ4N0k76K16M9p0K73m84K96Lo4m9M7K11j38k71M49k10j76OQ6J34Nj62m2
5693a12K50K3l08L15p3P3j42j56J36k20M48J65l66J95k46l4L8m8J39J11j74J17
5715A31j30k08M92m68L6l6K10K18k45O1q5nO8J11q9j55jQ2J82l5j59L29k95R2
$$ y = [-29, 1, 181, -206, 2, 79, -37, -95, -54, -47, -109, 189, 76, -298, -66, -21, -14, -120, 97, -240, 42, -198, -62, 18, -323, -104, 28, 89, 183, 45, -87, -59, 289, 217, 315, -9, -10, 344, -200, -53, 43, -169, 163, 88, -134, 125, 186, 130, -18, -11, 172, -111, 44, 78, -145, 93, 253, -90, 69, 167, -5, 86, -90, -108, -410, -61, -197, 158, -11, -187, -33, 198, -159, 115, 6, 112, 150, 40, -147, 353, 166, 198, 214, -231, -129, 76, 66, 90, -147, -71, -96, -196, 109, 291, 74, 95, -17, -221, 69, -82, -215, -303, 3, 69, -127, 10, 91, 96, 8, -71, -206, 93, 114, 96, -14, 82, 82, -83, -79, 5, 55, -221, -5, 44, -26, 247, -237, 59, 62, -2, -51, -4, 207, 69, -202, 247, 37, -139, -133, -47, 87, 92, -70, -112, 138, 161, -147, 168, 95, 168, 26, -130, 6, -214, 234, 399, 33, 228, -18, -52, -14, -62, 77, 188, 14, 131, 1, -207, 285, -183, -147, -183, 27, 245, 0, 61, -24, -29, 39, 150, 61, -94, -95, -13, 169, 134, -25, 304, 9, 101]
5739A01m1k42Q7J57j37L9j62k6K63O7j67J28j18K07J7p6M2l38J82q0n7L04p9k44
5763a73K54j41P3R6j33J39k94J24mK9mK12j9j54k02O4M9J57L8l34o1J76J66m5
5787A3n3L23l36p5Q8n7J49j87P6N8J40k69K42k21j04K47K3r8K0q5KJ77k51n2J25
5812a05K52n6k56J90j23J60j47K03o7J23q9k59J7Q8K5J00j28R1j8L8K17k61J10
5835A05J6n8k66J90M5p1j86K94j64q1K27m9J03n5J76m42K9J64j25J65J76j02k7
5858F4j62K38m0l62J82K7N4K4N3l1N8M9j74m7J16m2N5j94K14j54nJ07k08L40j94
5883c2m9j0J63O6j89J7L01m63M02k28o6k65J69r1L98j45K83k52j67N1j16J09J0
5906a04m7J04J97o1J70k90J07k90J76P2J2p3o5K00p0j18j6l3Mn3Q4Mk1R5K6k05
$$ y = [101, 60, -182, -95, 62, -75, -36, -198, -224, 39, 106, -61, 67, -51, 156, 173, 97, 139, -199, -17, -97, -154, 150, 71, -173, 81, -60, 13, 109, -24, 115, -179, -55, -59, -30, -34, 178, 159, 5, -197, -133, -84, 73, 111, -223, -284, -108, 58, 13, -40, 283, -53, -128, -40, -97, 52, -135, -59, -1, 139, -130, 112, -109, -213, 34, 57, -41, -21, -106, -104, 73, -178, -230, -105, 147, 91, -165, 25, -98, 62, -85, 118, 51, 174, 85, -174, -157, -69, -44, 56, -72, 19, 1, 39, 256, -5, 105, 121, 63, -203, -13, 32, -39, -225, 69, -95, -176, 51, 2, 105, 50, 226, -216, -187, -23, -148, 17, 193, 91, 64, -98, 140, 100, -262, -80, -53, 1, 25, 78, 47, 105, 154, -20, -67, 49, 7, 62, -132, 82, -72, -77, 30, -178, 162, -32, -81, -91, 72, 138, -51, -34, 267, -196, 206, -22, -88, -353, -184, -275, 123, -22, 261, 9, -158, -107, -223, -114, -104, -151, -47, 150, 89, 259, -31, 76, -214, -38, 34, 46, -27, -92, 108, 38, -80, -96, -129, -125, -178, -94, -90, -111, -16, 10, -195]
5932a95L6K53j25j31K9K08J02j95L84l16J05j18L8J44m12J30N1j80N92m30j84
5953b14M85k36j44J38P6J12k29l2R5l6K47l15j32L19j65m1K3J25m3K19ol27PJ53
5977G9R4k11J79m3Q4k74o6K39j55J8j11O0K9j2K50j57L11k89j47MJ26Nk5K81l05
6002c6J86k39p0K95j68J39k97M54l16K44k9j26L6K5N3k16P2r2k00K43J05j44k7
6025a08k5O2N8Qj28J28l00N26l49L28l53L04k45j7K48j29Lj54J38k11L82k36M9
6048b1J07on9O6J31m0k11j63K26j37L7n6M37k14j84K0L8l1J65r3K22j43j30M5
6072Fkj36K06l3j12M2K44M7k75k5r0N7J71j67K39l29R4P5j12J52r3K1M1j41K94
6097A74j07j52k0P4o9j73J82R6N8Nj20j48n1K40k00K38k18J10K02j84r5Q1J11
$$ y = [-195, -159, 94, -31, -162, -133, 75, 177, -18, 366, 50, 155, 37, 75, 219, -193, -63, -12, -192, 400, -30, -214, 271, 35, -109, 29, 105, 217, -12, -44, 51, 15, 262, -53, -185, 134, -31, -72, -49, 76, 33, 252, 246, -81, -74, 79, 173, -38, 141, 98, 182, -92, -158, 81, -74, -56, -167, -107, -78, -90, 160, 3, 314, 25, -122, -118, 8, 13, -12, 269, -36, 150, -89, -159, 136, -32, 107, -190, 264, -52, 192, 163, 37, 73, 98, 151, -65, 7, -85, -285, -42, 63, -81, -108, -133, -71, -13, -5, -133, -5, -305, 221, -128, 200, -153, 151, -94, -111, 137, 8, 11, -143, -5, -216, 166, -70, -21, 86, 80, 21, 87, 218, 178, -33, -196, 30, -107, -70, -126, 311, 97, -87, -67, -29, -60, 105, 12, 234, 91, -39, 6, 4, -132, 74, 41, -71, -29, 215, 262, -13, -38, -128, -71, 100, -67, 172, -157, -63, 12, -100, 52, -41, -20, 21, -120, 174, 67, -85, -105, -31, -100, -273, -91, 5, 63, 68, -52, -200, -251, -11, -211, 27, -191, -81, 121, -63, -158, -77, 34]
6120C4K33l18J54j12q4L01o9l89J87l9O5j07L11L7k74J00q5l5j17K08r3p1K63
6143A00k11j14J29j81J77R0K94n49K62k84M63p9r4j28L40j44j62PJ02J25k19L0
6165d6q6%p9p8L41j68K4J8Q0q3j62J23k56L15J91j19M0j43R8J41l13K03K7Olk27
6191a56k8L75k85j03M37n35L75M2j74j35J39K33j65k58N8J69J18J0j95l06M06
6212B2PQ4j70J61k86L48m41M02J18k86q9Q8N0j16K87k17jL8N6LJ22l02M7l1K32
6237A26J06l80K55l45K68j37L03m96J52j2J05J15j60J43M9Q2q7O2k04k7p4p2K07
6260b1P1j24OK45m24K81K91j19k74m6L69k66J11j20J8l6n7J43j52Q5rJ06J61k04
6284C5k41L38j41j5p0J71r3l2J56R9k59J47j67J05J1m6J16j53l0j2L39k26k4j65
$$ y = [34, 267, -51, 103, -9, -93, 208, 139, -250, -63, -102, -37, -144, 167, 204, -70, 30, -55, -90, -207, 1, -92, -163, 100, -111, -225, -96, -277, -100, -10, 284, -265, -3, -287, 176, 97, 3, -125, 215, 71, -91, -84, 18, 143, -76, -46, -132, -132, -211, -289, 52, -116, -92, -74, 6, -77, -239, -116, -372, -57, 134, 15, 55, -88, 10, 151, -162, 41, 68, 74, 71, -156, -184, 191, -94, -197, 240, -295, 80, 122, -52, -187, -48, 185, 20, -238, -180, -11, 107, 117, -78, -384, 22, 29, 113, -57, 104, -182, 166, -275, 127, 245, -41, -130, -42, 8, -108, 179, -38, -39, -1, 55, 58, 180, -122, -75, -106, 126, 232, -148, 107, -238, 30, -107, 196, -300, -148, -160, -55, 60, -100, 43, 92, 174, 87, 149, -55, -82, -156, -228, -21, 50, -74, -68, 177, -247, 34, 325, 206, -68, -114, 255, -11, 100, -20, -2, -38, -95, 48, -104, -19, -28, 78, 239, 35, -206, 132, -9, -24, -94, 77, -16, -48, 108, 207, -52, 95, -72, 33, 44, -2, 114, -39, -69, -81, 258, 32, 8, -157]
6308a57J61j07L70j2l57O8J34m7j98k1R4m4L28l23K46k38n7Q4r5J07K1J79o4k9
6332D3m01P29m55Q9o6J13J29k35M8J86j91J70n6k44QM7L2l1J27L8J8pj31lj15
6357a58L17l57L50K0j34r7Q0k24J98j64K55o5L07j17l35K23j98J08rK02k29J9
6379hJR2j84L38j9l10J75r3J23l02K75j05j1Q8MK22k87O1k45K91j45j52R9J96
6403A04L7l48K37j43P0K2R9r9J09J13k28j73J83k5J07k4j91Q8J38l7L8J38k73
6426e8j06K99J9Rm3l74M08j55J66k49j80J84k19K37M5r1L6rJ53P2k95L88k40K2
6450A9R0j57pJ87j14k0Q4kl56J73R4q4L4j44K02j56J91k2r7K06k32K52j8j7O1
6475A67j00O1K9r2J56l06j35J32j24K33l4j88L28m2j70Q9L4j6j31N6N9J7J84o4
$$ y = [-157, 4, -103, 267, 255, -102, -34, 100, 53, -145, -166, -72, -116, 212, -111, 135, -103, -160, -76, -171, -64, -43, 136, 72, 43, -358, 371, -84, 5, -61, 52, 181, -54, -6, 180, -11, 159, 103, -141, -133, -86, -54, -85, 42, 80, 98, 91, -40, -43, -158, 159, -198, 152, 172, 38, -59, 21, -203, -5, -169, 86, 21, 328, 211, -124, 99, -99, 9, 0, 202, -27, -8, -7, 85, -99, 239, 220, -90, 85, -8, 115, -187, 88, -17, -28, 60, 64, 286, -1, 60, -185, 106, -39, -191, -92, 104, 141, -207, 30, -113, -43, -21, 78, -21, 88, 201, -27, -200, -17, -42, 65, 41, -150, -62, 76, 39, 77, 215, -58, -164, 135, 154, 163, 120, -254, 154, -1, 165, -84, -264, -80, -299, -62, -17, -108, -72, -81, 72, 144, -151, 237, -3, 19, 109, -48, -55, 132, 18, -2, 82, 80, -276, -103, -9, -93, -59, -203, -1, -157, 34, 12, -85, 121, -111, 141, 123, 106, 167, 67, 128, 157, 65, 221, -85, -220, -88, -212, 21, -13, -201, 127, 85, -85, 4, 38, 22, -109, -53, 6, 23, 207, 143]
6499A43L3o5k22K11L1m09M24j11j46L42l40M5K65k99J37k34K09m5k7l5J82k42
6521a53K36q2J41k43k8J62pK26q0L2k62J8K10j13K5M9j93R1N1M3j86M5l13M41
6545A10J69l19R8k00K04j5j46J75O4p0r0R3M3J36j47j59K7j33K90j15L7L6l32
6568b44L70k08J43q0nQ0Q5j74J67k62J36l1Q4N9m4q9J60Q1j31k26K34l30N62n68
6592b31J28K76k33J81j14j15K15l49J68L25n84N95m47L44P4k31K35j75K27m16
6612a27J34j9N7J49l04j16Q0q3K84O0k46QK12N0pj27J31jl37J70j21l1L49P4j74
6637F5j4K66l03o0J05K9K23l09j98K59k27J67K8l8K7p1oJ43j33J70o3j38K43j88
6661b3j80N30m49j14L65q0J89k88j2R5o3K84n67N05j92l0j90J13j49M8K43M0j56
$$ y = [143, 176, 111, -111, 100, 131, -278, 146, 35, -111, 231, -109, -64, 201, -98, 39, -195, 14, -31, -58, -93, 89, -153, 83, 1, 142, -101, -129, 33, 26, 252, 172, 204, -58, -40, 170, 57, 82, 131, -62, 29, 80, 123, -63, -18, -331, 110, 279, -40, 58, -142, 62, 47, -99, 76, 140, 70, -20, 73, 116, 252, 105, -54, -27, -160, 130, 15, 52, 88, -244, 126, -82, 61, -19, -24, 56, 141, -33, 134, -128, 8, -23, 61, 120, 76, -13, 147, 228, 97, -129, 105, -225, 337, -231, -103, 173, -60, 121, 7, -108, 107, -242, -74, 251, -333, 262, -185, 159, 233, 2, 237, 62, 289, -127, 7, -12, 45, 194, -110, -226, -146, -229, 55, 115, -131, -123, 89, 139, 132, 5, 136, 135, -202, -32, -153, -184, 165, 239, 65, 51, 317, 14, -46, 59, 88, 311, 2, -196, 63, -164, 3, 31, -7, 20, -51, -57, 86, -47, 123, 60, -78, 165, -23, -203, 327, -122, -236, 129, 49, 238, -50, -62, 33, -30, 254, -313, 192, 0, -30, -220, -107, -256, -208, 35, 75, -81]
6684h1K96q7k33K13j58j82m4L80n9K9J21k88N9R8j05K3j98L29k61p9J89J43k16
6707a11j02L28k89K99M3K2J16j31j18j90J03L87j48j61j35O8j09K6k6N7K4k07
6729b54J1K78J01N3j10k37l4M00o3O1j24j40K81l18K2J8J98K5k61J77L4m1M4k81
6753a60j04L27k10K09k3r7L08j80Lj34J95J8j35o6J68o5L04l69rJ14M9j63k1J16
6777G5K15m70J20K09l96J60l5J68j7j75J64J31j94K3M6k42pj7L90l48P2L95l47
6800h0J51jj39n2K50m5m0j76R7j10Q1J85j27j12Q0L32k35N1j44R1j07K4MJ20M1
6825A39J9O2j46o2J1k7n4J10Q5m35K25J52j38j36M03j06j59O2J93r4l43K41J6
6848A8J97l36K72j55J41o4m7k29J73J90K10l66k11M2M4J82P9O7j94l14J87R7J06
$$ y = [-81, 215, 128, -105, 108, -50, -232, -276, 104, 45, 74, 195, -93, -34, 64, -41, -18, -216, 113, -148, -227, -38, 105, -111, -213, 115, -174, 125, 168, 190, 306, 175, 57, -133, -30, 357, 209, 48, -87, -19, -128, -102, -128, -71, -47, -254, -243, 35, 136, 189, 79, -158, -192, 208, 145, 206, 82, -58, 223, -95, -73, -55, 143, 168, -93, 84, 118, 77, 121, -160, -264, 63, -147, 62, 39, -58, 250, 70, 73, -61, 134, 152, 17, -49, 119, 54, 358, -11, -20, 94, 143, -20, -41, 75, 290, -180, -60, 149, -247, -87, -122, 46, 29, -146, 18, 149, -45, -22, 24, -218, -225, -242, 148, -200, -128, 267, -80, 71, 70, -69, -121, 129, 84, 44, -132, -35, -145, -64, 121, -6, -118, -38, 294, 59, 110, -34, 57, -50, -26, -22, 98, 139, 158, 220, 74, 12, 23, -4, -58, 52, 137, -298, -73, 79, -59, -195, 208, 102, -57, 5, 198, 104, -239, 2, 18, 215, -121, 151, -4, 137, 73, 26, -203, -30, 160, 370, 4, -207, -165, -121, 61, 140, 207, 13, -301, -114, -17, 89]
6871H9j86lJ36O5l18J40p2J42q4J70o5N7j51k8L86k88K57r6m01L21r7Q5k62J45
6895e8J0j12M23k80J23k9R3k06J93k75N07l67K27j28k7J21q5k93R1M7J45n1o5
6918DJ2oj64K25n2j30L04k28M4o6L5j17K22j31L9O3J05P9j63k3n4j46J82J31J59
6943C24j12l50P1MJ24K5j27K24n48L44j61J82N9k49K93k85J25l4J95J22j94l8
6965fm9M5k52L96k30L6J70K12l71n1L06j38Jj11Q1k14J89oK01j56k49J40M0J69
6989A53j18J63n5k49R6J9J90j97r6j82N7p9J55Q5k4J58l74J0K34J35k21K20J69
7012B49k29n4l6J17K28j54n2O9k86K53k98k5N14l53LJ03j66J4K0L61k50K70j44
7035A54j50j77K03j30M56k54k9p5k92J96J04j50o2l2K91r7J58j45O4l0mK3l13
$$ y = [89, -97, -100, 36, 101, -217, -77, -149, -7, -91, 79, 14, 71, -80, -108, 278, -10, 247, 151, -250, 71, -26, 59, -203, -58, -48, -160, 263, -17, 106, 77, 170, -36, 157, -118, 389, 22, 249, 121, 94, 215, 130, -163, -72, -25, 120, 69, 4, 16, 10, -154, 71, 19, -111, 193, -35, 9, -57, -22, -139, 83, -48, -9, 54, 159, 238, 75, 52, -2, -148, 34, 165, 324, 212, -138, -67, -63, 61, 86, -41, 183, -365, -21, -182, 0, 59, -190, 103, -182, -57, -91, 104, 226, 32, -6, -55, -10, -262, 134, -96, -60, 110, 322, -49, -100, 206, 68, 69, -42, 39, -175, 14, 8, 209, 53, -196, -56, -16, 153, 35, 198, 143, -106, -10, 9, 199, 2, -94, -276, -219, -298, -143, -58, -82, 76, -298, -288, -54, 81, -140, 80, 249, 20, -34, -70, 47, 275, 121, 69, 138, -148, 105, -193, -218, 296, -57, -54, 49, -117, -103, -83, 278, 28, 298, 154, 4, -173, 30, -100, 356, 102, 73, -2, -294, -98, 6, -144, -206, -238, 53, -44, 114, -31, 33, 3, -1, 22, -291]
7058b91K43k12L30l63M05M9j10j34j78L37j27J4K42j49l73N47j21P1k46K0R8l2
7080B0l6m0K76k40J95j80J29j78P4j23J54P7k48j41M52k98K10l31L21j3N5k35
7102a00O0K31k25p4L24k5k3l65K04J84j23j43j03K00R9j1j05R8p5k25Q7J02j06
7125a14L26N4k60M1k29M05j61O5k33L10J15m33L2J99j27L22k20j83j01M9K47j3
7147I1q9J11k22L24j21r3o7k0J29K1Jk16M9p0L68l51J25p1N7L5%Q4K5j94L63l57
7173h8J43L1j55K58p8j47R5J70l53J70k72L76K7k40j0J95O3l82J71J4j24L27N1
7196B42j55M4O5m97O20m46J10J8J78o2P0l86P7lJ90R8l89K06J26j08O1Oj10J00
7220E5K1q5n3L7M1Q4k14J89l5P7j07r4K00j01K28k70R3K01k63J43K6K6j58j64
$$ y = [-291, -48, -260, 70, -293, 112, 161, 51, -83, -261, 76, -51, -37, 205, 56, -317, 230, 109, 180, -66, -46, 52, 20, -16, -56, 220, -20, 175, -5, 124, -54, 20, -103, 51, 128, -120, -261, 191, -107, 103, -228, 93, 80, 135, -100, -40, 191, -34, -108, 216, 191, 168, -197, 7, 191, 68, -75, -178, 22, 121, 110, 5, 103, 28, -197, -110, -8, -114, 212, 266, 6, 47, -182, 223, 62, 127, -106, 204, 319, -114, -82, 117, -10, 312, 92, -91, -192, -143, 104, 91, 2, 113, -109, 215, 94, 1, -66, -86, 43, 64, 65, -151, -102, -172, 196, -155, -30, -101, -44, -9, -9, 75, 100, -94, 269, -88, 55, 86, -69, 189, 111, -36, 59, 229, -124, 46, -226, 150, 177, -63, -73, 122, 185, -197, -26, -12, -136, 191, 242, 87, 131, 196, -301, 319, -127, -17, 1, 179, 117, 187, -199, -122, -125, 65, 163, -226, -20, 106, -2, 59, 65, -45, 55, 76, -9, -62, -25, 16, 100, -114, 75, 40, 117, 10, -84, 116, 15, 243, -27, 66, 267, 4, 147, 173, 199, 41, -123]
7244a23K73k6J78l15J89m0l64K73l24k5N95l42q6K24J00n26L55p1j06%K18J38
7266A95l98J09L67k09k44K0J83o6O2j16M83k6k46k07K30p5J97j14k63L48k58Q7
7288E9j27o3M03k0k23q7l2P8k77L69m7j1k25L65m2j4j42M8N9k8j19mL9J00q2K36
7314B13l09M7J9j64L03j74R7J3q1J4L34m8j60R8p6n9k16j71J52J5M7K79l43J31
7338c9L33R3m16J48j13O7N7o0p8j44l3L2J07L33j66P2j3pk52K17k48K88k06M2
7362A4J4j96j25L51j07k8J72j3K00k99J14r7L4K43l91J25o6K39k69kO2L09j10
7385A74p2j09Mk8Q9j00J17j3l8J09q4nr7K40n46K04J97J26j61k44L31k18L22k62
7409f4P8M6L7n2L70n25p3L65p0o0j86L5K68k69L2J95k74J08N9KM2J46j29Kj44
$$ y = [-123, 150, 124, 302, -13, 176, 136, -228, 45, -279, -304, 291, -51, -137, 87, 187, -339, 16, -55, -161, -161, 57, 195, -203, -94, 273, 64, -180, -160, 23, -43, 19, -97, 386, 360, 114, -93, 137, 62, 259, 145, -118, 230, -28, 59, -68, -131, 272, 252, 29, -58, -90, -12, -289, 80, 33, 22, -203, 162, 120, 106, -36, 12, 71, 43, -76, -80, -41, 59, -23, 213, -96, -49, -30, -194, 109, -65, 32, 45, -36, -22, 312, 264, 104, 202, 126, 67, -149, -320, -168, -153, -106, 173, -170, -39, 294, 387, -29, 119, 6, 73, 130, 70, -8, -152, -185, -153, -46, 287, 121, 193, 180, 173, -79, 138, -110, 178, -28, 14, 28, -168, -293, 58, -49, -77, 95, 82, 282, -17, 97, 0, 34, 277, -114, 11, -55, 184, -85, -87, -25, 284, 174, 102, -7, -3, -31, 58, -42, 75, 62, 24, 133, 49, 44, -53, 187, -359, -155, 42, 168, 7, -237, 94, -124, 198, -64, 14, 60, 97, 45, 415, -110, -183, 182, 112, 52, -134, -99, 169, -100, -68, 127, -147, -39, 20, 22, 64, 210, 81, 83, -61]
7434f1k0p7MK12k78L29M7k2p8r3n6K91N1k96J19K77l70j10R0M4J70l25O8n1R0
7459d5k03L28k76P6J3M30k45O3n3j3J38l8k01K9J50m2j37J3ON7j23L06k09k87
7483b63J99j98j2K82N2j34J35j47J75l15L80l4mk57J04J8j04L84l49K64l2j07
7505C7J63j72m24K74l5k09M00nN0r2k3R6k02J16L8k2k43L45J1p2m38K23K80R1
7529A87k42Rm0J89j91P6J59j38K06m81K69r8K84j62j82K21J44j76j79Q0J05k05
7551a65L46o1O8j83N8l16L98j12J09q8j70J21p2q9J19j2K88p8j98n7J62m4l8n0
7575f4L8K7P4j9j75K13k55K88k81J67J5l84K0J41K19R0k47k75O95k68l45M15K
7598I1l37L17j40k09M85j50K78k30k35L35O2k26J9l79N02j91L8L4r3j58K65j68
$$ y = [-61, -81, -158, -154, 58, -220, 109, 156, 134, 56, -37, -93, 198, 249, -47, 72, 349, -21, -131, -41, 3, 173, -152, -84, -135, -45, -248, 80, -196, -120, -107, 323, 78, 141, 88, 75, 213, 175, -26, 3, 153, 111, -26, -13, -7, 50, -73, 233, 24, -263, -64, -262, -274, 8, 60, -74, 61, -86, 89, -226, 154, 120, 116, -141, -37, -19, -123, 261, -88, 176, 144, 37, 200, 28, -396, -122, -157, -366, 34, 29, 79, -13, -36, 60, -142, -26, 12, -10, -253, 92, 103, 31, -407, -184, 96, 187, -55, -46, -86, 103, -88, -12, 147, 9, 215, -266, 3, -95, 189, 27, -155, 66, 210, 34, -145, -65, 40, -165, 181, 120, 188, 5, 63, -253, 145, 33, 142, 54, -116, 5, -67, -156, -37, -49, 239, 161, -37, -94, 68, 24, -14, -64, -26, 1, 75, 56, -119, 94, -161, 127, -154, 13, 28, -356, -336, -195, 24, 114, -133, -408, 287, 19, -326, 89, 91, -246, 71, -69, -278, 207, 57, 335, 105, -130, 205, 267, 41, 60, -319, 183, -8, 30, 64, -29, -187, 78, -90]
7620i0JJ85j88Q4j12r7K57R8m09J14N8J53M8O4o2J73j94j45N3l89M49k34L34o5
7644H6o7J65Q2q1k7k62K49l47J34J57K21l36K02J9J12k45M5j28O0j70p0K51k0
7667C0Q3j32k09M58j54J03j99M1J15j11L5o2J12J4l06J37m2J78j79J54n8j66J73
7690A5J33q6k88M44m5j86J2k16M38k71K41j2r7J04pm10L56k4l22m4N68j79j01
7713B3n3P9k42K2O6rJ56n2O8j4l8J60l15j39K47J98K75m73L0J44j96L99l80N1
7737GJ07l42M98k62l71L46l3j05p8M31k16K41j99L73m81p2J20j73K25K19j39j24
7759b8j17qJ22O4R9l53M48k81n8J67q0K49m22J80p9K39j79P1O7j17J19j27M2j63
7783a45K58k53P3R5Q0N9m04J4L55m5K16l19m3K60l78L01k51K62k11j2K9r6m5J33
$$ y = [-90, -89, 96, -92, -8, -120, -217, 40, 138, -271, -157, -99, 54, 102, 166, 104, 277, 83, -62, -9, -398, 51, -183, 151, 86, 19, 184, 266, 185, 158, -104, 145, -202, -68, 89, 310, -26, 176, 195, 307, 62, 107, -21, 39, -131, -201, 50, 30, 113, -19, -228, 230, 76, 179, -20, 21, 136, 25, 60, -2, 110, 124, -182, -45, -87, 91, -88, 66, 8, -158, 15, 148, 62, -226, 218, 173, -13, -1, -217, 221, -50, 191, 179, 82, 186, 179, -231, 125, 101, -221, -265, 303, 124, 23, -30, 49, -193, -171, -105, -114, 42, -10, 58, 44, 6, 166, -149, -288, -41, 157, 432, -41, -11, 133, -63, 336, -44, 7, 114, -228, 270, 8, -363, -17, -50, -155, -233, 198, -18, 223, 24, 397, -84, -156, -36, -209, 16, 235, 96, -28, -145, -153, -31, 33, 132, -221, 227, -54, -112, 55, -25, 224, -198, -18, -97, 142, -37, 34, 101, -16, 103, -24, 18, -145, 113, -140, -67, 28, 108, 167, -237, -223, 132, 87, 303, -16, -59, 201, -177, 124, -127, 135, -76, -88, -59, -155, -200, -67]
7807f7R3m1J30p0k02R6M6k26K22J70j12j7NJ08k14J23j8J02k64K02r2K6K1j88
7831a67J89K4M6J10qr7j49K94j94o6O8Jl95M50N2m30M07L1l14K87j80J12O2j11
7855B2K22Q4l74K19l30J27o4QQ0J30j45j90J00K82r2j54J16j8J66m93L75q0k7
7878c6j36L42r6q7Lj84L04O0l01K85j79j80N1p9J31J0k6M7j7O6J9k04j61O64j24
7903A72q8j18J52j64L66k77jl44M39o2m7m9j07K34k30L7P4J29m21L4K97r5J44
7926G5m4j4OJ97k53j34mJ2k7O7q9N83n52N4K28j20R1k32K46k94J96L7k81K48P1
7951F7l27N25k82r1J02l15M21o5j14K00k6l5m4j08J85R1m77K98o8O6n8o0p3L14
7975A26J44n6l2j60K0K24o9j77p0r9JK14q6l3J11k7m6j37L01m22M56l71K67J65
$$ y = [-67, 26, -15, 115, 45, -157, -61, -15, -241, -19, 151, 39, 22, 27, 135, -79, 44, 26, 128, -136, 66, -26, 0, 21, -167, 22, 46, 92, 202, 194, 97, -52, 242, 48, -18, 50, 51, -344, 106, 158, -272, 135, 166, -148, 139, -41, 71, 133, 22, 244, 328, -46, 173, -157, -30, -94, -86, -6, 124, -21, -211, -111, 171, 79, -75, 41, 23, 189, -304, 71, -9, -36, -172, 170, 74, -13, -10, -194, 110, 170, -131, 154, -25, -205, -154, -233, -102, -92, -118, -71, -88, -22, -3, -207, -368, 296, 172, 84, -34, 118, -46, 320, 43, 42, -302, 137, 75, 28, -21, -128, 106, -124, -87, -13, 116, -305, -271, 26, -69, 75, 31, 17, 23, 220, -33, -167, -171, -159, -186, -119, -208, 375, -177, -123, 105, -15, 76, -156, 90, -204, -8, 29, -252, -4, 67, -260, 265, -17, -108, -6, -321, 100, 35, -79, 121, 95, 60, 16, -92, 93, 184, -293, 5, -63, 3, -55, -115, -188, 126, 270, 214, 182, 22, 42, 266, 197, 20, -50, -149, -148, 66, -20, -53, 58, 31, -15, -152, 149, -273, 183, -188, 79, 244]
7999B44l70K08j61R6J59m7o0J88k85j46J95j59R0J23j75n5K64k99J7J63p3Ol7
8022a14p4L59O8J6k64K3Q0j84J41m37N41L1k58K14l5j15k5l1J91l8R8r2j54j52
8046b11K30J31l55R8J2q6J75j03n9NN5J62j35N9j06J31k7QR1k01O7RK16O7k64
8071c1K13j70j4Pp0M17j95k65Q9L7q3q3K09j10JK30j39R4r4N2j95L5j94K03N41
8096D85n81k52L53K8j17NN1L6O5r0M3L17l64m0m3L14j42k86o2N09k68k0L9JJ02
8121H3k38J46L0N9n20M05J68j02o3J43l0k10k49L02j02l4K17J23l44j73J88K28
8143B7Q4j67L8M6j02K3K7J09o8K53p2k16O9q1l2K35k77K8J71O2kj60K02m56J90
8168f9L38k39j4l4n9O4q5L45l41K02k43j3K52m7j19k41M57R1m10K58n4L9n5
$$ y = [244, -126, 82, -79, 17, 176, 129, 69, 257, -28, -174, 21, -138, -48, 75, -100, -155, 109, -190, -173, -10, -83, -77, -114, -188, 171, 239, 255, -9, 14, 94, -90, 51, -386, 155, 186, -72, 142, 107, -8, -33, -64, 127, 89, 187, 95, -59, -211, 19, 150, -205, -107, -95, -181, -6, -109, -168, -163, -108, 54, -81, -22, -128, 3, -24, -16, 75, -126, -59, -50, 166, 233, -31, 182, 12, -2, 5, -65, 352, 157, -108, -19, 18, -65, -148, 61, -49, -48, 182, 43, 137, 43, 95, -100, -65, -259, -56, 485, -96, -348, 5, 33, -84, -79, -28, 8, 73, -17, 26, 343, -21, -61, -104, 210, 68, -218, -280, 229, -39, -59, -20, -19, 83, -155, -9, 21, 80, -440, -35, 133, 31, -32, 111, 81, -129, -378, -76, -178, -212, 5, 128, -216, -389, -201, 27, 111, -56, -18, 28, -74, -51, -24, 85, 17, 270, 198, -18, 51, -30, -62, 173, -104, -76, 95, 157, 155, -5, 197, -259, -69, 269, 30, 16, -18, -77, -13, -98, 247, -94, 108, -135, -148, 104, 57, -62, -303, 154, 245, -165, 93, 39, 78, 23]
8191B3
$$ Imaginary data points
##PAGE= N=2
##DATA TABLE= (X++(I..I)), XYDATA
0@%%%%%%%%%%%Qj6J6j6J9k7L2m0M8n6P2q8J04j20J36j57J81k08K40k75L15l60
33a92M08m60N19n84O56p34Q17r10J013j125J248j381J525j682J855k046K254k481
51a300K734l015L325l672M062m503N010n597O283p102Q100r346J0951j3106J6176
66I000k0931K9344m8650J76873N1190k30082J01249K13q6755q790M3280o4065
78d8124k6378K6590O376l5036L0967P790k6184J9018K3531k3834L7331L1418k4981
91a516p58K5637j214O112M865K48q848j4107J412P260j0971o423j426J496l086
106a319q649R525O866k2128J219J3109j3941J463J5984n415l201K572l133L026
120d022O528k24o372q49R065l639m706J4345k556j3974R588O747o253J801N14
$$ y = [0, 0, 0, 0, 0, 0, 0, 0, 0, 0, 0, 0, 8, -8, 8, -8, 11, -16, 16, -24, 24, -32, 40, -48, 56, -64, 72, -85, 96, -112, 128, -147, 168, -192, 216, -244, 275, -309, 347, -387, 430, -480, 533, -592, 656, -725, 800, -882, 973, -1073, 1181, -1300, 1434, -1581, 1744, -1928, 2134, -2369, 2641, -2956, 3327, -3775, 4325, -5021, 5930, -7176, 9000, -11931, 17413, -31237, 145636, 196826, -33256, 67993, 68206, -18549, -27339, 15941, -48124, -74502, -47912, -41536, -76572, -45605, -37815, -63999, -44981, -21450, -45284, -7953, 23465, -1516, -2274, 23363, 22149, 28261, 33126, 33374, 24526, 10419, 11831, 19091, 8120, 1697, 271, 1767, -1319, -9968, -443, 6423, -15705, -14486, -1377, -15318, -13855, 2129, -3286, -6487, -3915, -7048, -4022, 2506, 2282, -4090, -4939, 4126, 487, -4219, 10126, 7570, -6404, 3184, 9931, 3678, 5479, 5993]
135E993l452j276k051L591m66m649K332j72l531J751k78J047O3n770K244N274
151F50j159J680r41l621M258N75k967M197m18l708J797K130j27k493P57M043n313
168f60l409P834k02m940K576j091j560J652k24P79j078k128Q99p77K37K518l092
185b666R7K599k898J187M521j983j520O56R56O91q13J469J973m563m18L734j866
202A156n62K34j449j38j008m44K697r37j049K36j454K019J962k106J385J29k364
219a693K327J282m73k59p71R01k74k201K195J481l274n37O51L3R44K2l39m24j127
238a536J258J234j489J055j87j308P81N0p9J805m93j966L09K48J099o35o12J325
256H59j392j211K603N0j225N70m61k48J22J9J228o26j296R04l17J5J144q91k49
$$ y = [5993, 2541, 1265, -786, 2805, 2339, -2310, 22, -150, -3681, -1930, -2208, -1161, -1098, -6868, -4624, 650, -509, 1171, 230, -3391, 867, 1442, -1525, 2672, 2254, -1454, 343, 2473, 2346, -147, 610, 4653, -660, -4069, 3765, 3563, -1377, 1199, 108, -1452, 200, -24, 755, -323, -2451, -1552, -2329, -2092, 426, -2666, -2569, 30, -2868, -1681, 2840, 857, -663, -7, 949, 1640, 827, 2296, 4269, -294, -712, 3022, 1156, 594, 828, -621, -759, -1767, -2211, 486, -451, -1500, -1264, -2718, -699, 1263, -843, 542, 671, -1693, 634, 1916, 1443, 1184, 413, 1314, 1040, -1161, 1034, 2515, -759, -1296, -645, -612, 332, 354, 15, -409, -1536, -278, 956, -533, 522, 335, -973, -192, -142, -221, 1584, 1091, -875, -566, -318, 781, 146, -466, 859, -533, -1744, 859, 909, -316, 254, -207, -455, -333, -314, 914, 288, -1008, -104, -421, -406, 738, -153, -402]
275d02P52q79J05J105q23K9k53L01N20j036O88J184j645o04J200m3K8Q5l87M31
295C56o01mJ251j180M7M88m54J10J41l86Q14j06j060N15N14k18kq90N54L78q93
316f26R39N15j446O15M25m61o4p0J25L39q21M59P09q06M69m74k35L73L52l40P4
337E1n90J83L54J52J20m39k88P50k84l93O57m0m04K05m2K39j35r5P86r31K2N83
359D61l25j40M46o98J67R4K93k77P4j81K55m48M8N33r1j28Om19L89L55k83l42
381b11O3P2m8O1K41K91m71k24K7m1J84L82n19J82j58k45O63O4m65K06k53J36J29
404F6j23O14k47n05R4K82k76J78p4j03J69m37N31k8k73m2K47j31N7J10m3N8j91
427f7o2M6O1K28j13l4q3k44L47q8p5j45K85j3L50o98j96Q58m02q6K96k17L2Lk61
$$ y = [-402, 350, -529, -424, 681, -142, -113, -366, -65, 455, -581, 107, 1291, -354, -958, 242, 199, 227, 312, -75, 356, -245, -249, 1002, -178, -131, 357, -97, 13, 154, -232, 582, 476, -584, -69, 445, 227, 225, -665, -111, 267, -626, 313, 828, -618, -3, 422, -39, -103, -173, -48, 291, -530, -71, 638, -168, 301, -173, -408, -35, 317, -23, 51, -539, -356, -2, 150, 270, -169, -457, 293, 9, -384, 273, 233, -171, 34, -8, 231, 96, 1, 787, -144, -122, 461, 136, -4, 442, -256, -89, 5, 298, 21, 95, -86, 169, -279, -231, 302, 211, 83, 89, -330, 59, 414, 131, -211, -148, -76, -124, -63, 178, 469, -2, -226, -199, -240, -56, 326, -193, -11, -169, -414, 249, 313, -152, 54, -199, -63, 66, -57, 557, 310, -195, -101, 181, -95, 83, 9, -94, 75, -362, 169, 141, -132, -174, 73, -58, -1, 109, 66, 124, -67, -129, -83, -22, 206, 93, 59, -24, -268, 79, -9, -84, -229, 56, 43, 393, -305, -501, 357, -45, -131, 165, -52, -20, -17, -278]
452b78L37n5k40M08j34l58L30k04L09r3o8j23L82k68J04J15n2N6j01k02nN9K5
475e6J68kk94K62l74O9J99m31P45k48l31K54L22p4M5k8N7j5j16j69Q1k81J81j66
499b02Q7K58m83M66P8k42O0J62j61K0j99m3K94P5k22J96k40K25k5J09l28J68j86
522a33K98k67P3j6J3j15J03o9J67Mk35K45l1Q9j47J86k63l9K48j89J97m13M22
545A28M8k61o5n8J92O8k43n8M24l28K57r1L7J18k1l4m8k26K97j5k54J59o9j13
569a56N4J76K21j38p3L1l35L59j5j68k08K11R1q5q7J56j63R3K98k17q9J32l16
592b28R6J81j20P0k65J90J24l6R1j40o5K67k04K4k08K4J30l8K54k31K58l52K27
615D9o0N5j22RL20k88L31r5k36K7K3N9K08m64J71J30l37R5j7M35l75J38k09J37
$$ y = [-278, 59, 4, -236, 172, 38, -320, 10, -194, 115, 22, -46, -169, 213, -55, 49, 164, 112, 168, 67, -135, -140, -81, -56, 112, 110, -184, 78, -296, -227, -28, -459, 286, 38, -293, -39, 283, 209, 254, 226, 283, 268, 152, -17, 64, -217, -36, -202, -115, 143, -340, 126, 204, -38, 22, 184, 23, 43, -156, -199, 95, 170, -52, 144, -96, 129, 104, 213, -115, 53, -133, 165, -102, -29, -45, -32, -147, -44, -113, 54, 58, -177, 68, 37, 126, -21, 165, -98, -137, 111, -78, 119, -294, 128, 176, -85, -150, -208, -16, 52, -191, -249, 175, -153, 104, 13, 50, 168, 147, 113, 65, -161, 136, 121, -133, 26, -43, -156, -102, 74, 295, 157, 84, 115, -220, 139, 124, -44, -252, -41, 50, -35, -122, 34, -129, -36, 262, 45, -44, 88, -228, -132, 49, -71, -1, -266, -76, 48, 12, 103, -37, -102, 165, -39, -15, -223, -199, -69, -107, 147, -84, 174, -178, 49, -11, 44, -78, -69, 251, -37, 294, 199, -37, -10, 13, 72, 280, -184, -13, 117, -220, -125, -142, 293, -82, 56, -153, -16]
639a6m2j29OK16J19l00L47o9r0n0K34k59k9M9J68j15J28k12J75j07K28l38oo6
663a58j03N23k34m7o9J64Jj8m4O8K21l15r2j02K09K36l06j8J81k01Q2o0On6lK4
689a11J27l6J34k12k8J53K45m58J48J47j10l2k55M2J49o3M82j55j54j41K32p9
711B5k05M4J54j61J63J11Op4r9n5M20l25J48N8K7j85K7k80K66j06k2J75m3p1J1
736Ij88K07k33L26L7j73R0j68J45l1J01O6k05j31Q7O0J74n6j34P3N7k34L42k01
760B0JJ08k70M45l30l6J83k09ML19k66k41J68j26l4J00L07k79L11j09O6l98M24
783A58N6m53K96k32K95kLo5l16j80K63K57j13m3J22j89j10K9J99Q6l4K33k33m4
807a7J34j20K03k79M5J22o7o3K24j50J58j72Mj97l3J24k3J66k41K22k21j14K19
$$ y = [-16, -58, -187, -181, 35, 154, -146, 201, 132, 42, -8, 226, -33, -62, -13, 155, 40, 168, -44, 131, 24, 252, -86, -92, -158, -261, 262, 28, -19, -88, 76, 77, 59, 15, 83, 304, -11, -103, -205, 4, 240, -66, -84, 97, -104, -22, -82, -76, -132, -135, -111, 16, -20, 114, -98, -126, 27, 272, -186, -38, 109, -1, -33, -288, -246, -97, -160, 322, 167, 13, -128, 104, 25, -180, -136, 18, -143, 20, 131, 137, 63, -36, -91, 329, 4, 152, 210, 237, 52, 79, -201, 65, -41, -63, 112, 69, -2, 9, -179, 28, -205, 121, 158, -15, 75, -93, 52, 21, 122, 188, -17, -148, -61, -1, 173, 117, -17, 56, 113, -121, 221, 20, 21, 129, -141, 304, -26, -62, 121, -88, -84, 235, -31, -272, -104, -230, -264, -164, 143, -136, 175, 66, 132, -266, 158, 214, -239, 57, -175, 120, 118, 121, 56, -260, -440, -177, 80, -33, -76, 46, -143, -253, -224, -25, 61, 27, 260, 27, -17, 117, -3, 200, -79, -34, 88, 21, -42, 182, 32, 190, 18, 22, -175, -208, -84, -107, 59, -182, 40, -181, -295, -76]
830g6K20o9K28n07Q1K42j05m9l3K59l66l4K64j6l05K63J08j16J8J10k11L05k91
853h0K28k55j39M2K51j1j79K40J29j85oJ44k52O5p4O7r2PJ71j01j06K09N6l78
877b49K08L13j18Oj18R9j73n8K93l8q1O9j06k4j30k67L9J82J04J79j13j56L40
900B01n62K19pj2LK94M8j89K54l48J97P4k97J32n4O4k55NL00j17J20k61K34r9
924e6MJ30j33J69k4m24M01p9k9MJ0J55k27j02M91j84j96J75j62M9O3q5j95K95
948E0P4O1l18m2j2K54k14L13j48J25j71M4J64n1q0l72K23j17J81J45r2m6K01j26
972D6J23j76R4m3j41O3J91k3k04oN3K88m08K84j51J09l52K32M1K80k29m2K07m00
996a64l0M55l09K31m7l18J28q3K45o8k34L08j09Q8j80N2J43m1j30K51j59J39j01
$$ y = [-76, 144, 75, 303, -204, -123, 119, 14, -35, -68, 191, -175, -209, 55, 39, -266, -3, 105, -11, 7, 117, -94, 211, -80, 148, -107, -246, -204, 47, 36, -143, 97, 226, 41, 35, 179, -73, -8, -82, -15, -107, -100, 71, -30, -136, 73, 129, -249, -41, 272, 154, 160, 42, 141, -32, -90, 203, 165, 84, 153, 47, 23, -107, -374, -335, -153, -49, 130, 17, -139, 201, -361, -142, -149, -161, -158, 136, 184, -5, 249, -99, 98, 172, -125, 7, -47, 17, -238, -233, 67, -50, 70, -191, 43, -56, -52, 78, -55, 114, 90, -334, 67, -12, -41, -37, -27, 128, -99, -201, 290, 106, -90, 85, -77, -28, 35, -50, -245, 50, 124, 185, -133, -175, -187, 67, -147, 166, 18, 143, -28, 16, 180, 129, 49, -323, -100, -217, -36, 109, 17, -29, 172, 46, 169, -7, 87, 44, -97, -34, 157, 134, -70, -76, -23, 265, -143, 141, -10, 99, -253, -21, 20, 300, 71, 29, 236, -164, -194, 261, -48, 183, 136, -182, -54, -137, 108, 40, -194, 114, 5, 93, -87, -35, 108, 67, -63, 188, 29, 168, 67]
1019F7k27J60K78m15J83Qk66k0K32K14k67K19j5N8l14R8j44K53j70K51j52K1l21
1042b69M30p1k05q6K10J36l1l39J75l6K75m48L14K1l7k6J93m21J45J12k23J89
1064HlJ91k29J19J02l51J15L06l27J98j92J24p4j51P2L45k47n3K26k37j8m9OL01
1088A82k49q0L23p2n6J12l43L91k77J35j58qJ50K9n3q7J42q2o8j8J38O9J20l83
1112a43L24j87j4k2J55J34j30j65p9K12j87L4K54l1k97J76Jj87Qk6J53M0P3j7
1136G9k1L3j96R6n8M5kj54j3J30j16J08J9J18j47J17P3k99J18m2R4q8Q5k42L00
1161C7%j36L35j63j85L21j55J12j23j02r4L84l7r7K55l58J31j68J79Q2j0j15N
1184I8K36l53q8K42k76j16K14j97J31Mj01J76r3J91J15n19J34Q7K70k50L3p6L64
$$ y = [67, -160, 0, 278, -137, 46, 54, -212, -232, 0, 214, -53, 166, 151, 209, -105, -7, -151, 102, -68, 183, 31, 52, -269, 161, 90, -115, -201, 9, 145, 114, -225, -50, -86, 189, -259, 55, 76, 39, 13, 206, -215, -70, 42, -181, 8, 5, 196, -33, 86, 188, -163, -48, 258, -69, 129, -63, 61, -13, -164, -92, 253, 6, -47, 179, -58, -76, -125, -119, 182, -67, -147, 176, 104, 48, 160, -183, 208, -69, 66, -92, -100, 50, 79, 26, -61, 81, -1, -69, -87, 51, 120, 240, -143, 181, -6, -20, -42, 113, 247, 117, -48, -127, 85, -102, -68, 186, 155, -142, 34, 35, -152, -144, -170, -17, 23, 96, 79, 58, 91, -105, -9, -67, -22, -24, -178, -191, -61, -177, -69, -50, 68, -79, 38, 111, -188, -70, -112, -18, -106, -21, -263, 37, 37, -99, 236, 73, -112, 209, 54, 166, 43, -59, -153, 231, 194, 97, 352, -6, 125, -43, 136, 218, 208, 93, 98, 334, -19, -107, 135, -141, -257, -43, -240, -109, -105, -206, -30, -123, 68, 183, -336, -202, -115, 155, -95, -62, -138, 226]
1207B26k70k0O7l97K82J31m2Q2M1j09N3j0J84k78j88L31jj07R3q9O9j10K94l84
1231a52J77j94j8K67J44J9l58J07N8l46J01K46q9K5o5O7J28k16n1L32l02j16N3
1254a83J93j86J73j04r9L92j98l2J62K1J36k15K7J4K29l45K5q3M69l22K3j08n1
1277f2L1K87l14l9J43Qj42K46l1k81K48j60LJ30j29M8Q7N8j61J31k00O2K30l39
1301a46R3q9K62J02L8k82L04m47K45J5l19J28k1J52M0j96J50J06k68J74pj67K88
1324A55o10N84K1l91L40o5j80J98L60l57J84k35m7N0K3n5R7j52j55K3K92m0K5
1347F5J9j51J31K54j43k49j2K30l17J76k4Q1J4j93j03K02J91l4j47m8J66K0K9
1370A57K05l04j85l4m4J2L48l06R8p9J80j56K53n5p1q6l7J86L9j06J42l05L19
$$ y = [226, -44, -64, 3, -394, -112, 19, -23, 59, 100, -9, 44, 34, 218, -60, -248, 83, 82, -25, 68, -21, 48, -62, 232, -152, 25, -169, -187, 80, 224, 243, -115, -8, 50, -296, -195, 51, -38, -13, -78, -11, 117, -99, -150, 182, -120, -236, -183, 10, -176, -3, -107, -206, 186, -12, -44, 118, 139, 275, 60, 87, 101, 330, -15, 10, -73, 396, 74, 97, -11, -62, -31, 256, -58, -97, 46, 54, -88, 158, 127, -154, 94, -66, -63, 67, -62, -14, 73, 131, -30, 101, -99, -37, 193, -146, -53, -142, 120, 222, 260, -22, 282, -165, 80, 95, -224, -96, -117, 35, 75, -121, 29, 135, -133, 41, 34, -133, 155, -455, 129, 150, -241, 99, 34, -146, 52, 412, 55, 239, 4, -43, 7, 30, -25, 72, -80, -235, -212, 80, 40, 65, 84, -67, 64, 318, 175, -74, -86, 144, -173, 3, -21, 60, 74, -119, -222, -20, 171, 137, -10, -58, 108, 128, 157, 362, 58, -127, -161, -205, -193, 155, -151, -53, -132, 48, -108, 145, 90, 19, -67, -104, 82, 121, 15, 157, -148, 171]
1393A71j37j26N1K23m8m25L24J52k42J03J3J17k77J38K47j94k24K20q7j90L53
1414A62j53l7K08k01q3l2J6J08J45j46rL78o0l54L59k19j82K05l06L81o6m51L35
1437bJ47k71L65k45P9l5k89L24K13j85m06M48r6p7n8J6j01L81m8J88m30K13n8
1460G3J61l62J33O9J54k02N6N5k53J01K92l43r3L22j20j04J37m22K69J85j17p
1482a6K20k5l23O5J30j31r5J21k10k6K81k28J63J80j52j16J0J55pOj30K49j13
1505Hk57L06n3J66r1M3j72m6K36k24J77k43J51J25J08oj84J65k85K39j92J23j41
1528d7J81m6m6p8K48j92q7J10n1K13j37k23K80R3Ll44K90l69K35O7j65L88j94
1551A29j34J45j77j9Q8j45K05j66M3Q3J04o5j77J47L0L6Pj80N0p0r2O8K71k48
$$ y = [171, 34, -92, -41, 182, 134, -291, 33, 185, -57, 46, 59, 176, -101, 37, 284, 90, -134, 86, -1, -191, 162, 9, -28, 180, -21, -104, -136, -120, -12, 133, -13, -22, 356, 296, -58, 301, 82, -100, 105, -201, 180, 114, -337, -2, 145, -126, 239, -6, 73, 38, -251, 73, 286, 101, -305, 143, 47, -30, -88, -72, -173, 208, 160, 348, -82, 131, 73, 234, -128, 5, 74, 228, 26, 82, 137, -116, -15, 277, -66, -159, 163, 43, -61, 76, -346, -77, 108, -9, -16, 204, 179, -144, -79, 51, -80, -175, -54, -264, -290, -9, -237, -74, 106, -46, -162, -152, 3, -4, 2, -128, 121, 8, -249, 57, 4, 170, 79, 122, -50, -96, 140, -84, 93, -150, 1, 126, 234, 228, 44, 209, -76, 163, -29, 94, -47, 134, 88, 42, -36, 212, 20, -67, 43, -8, 205, 68, -155, 125, 218, 221, -123, 167, -202, 33, 100, -65, 323, 129, -5, 140, -37, -56, 32, -113, 92, -74, -31, 52, 156, 91, -86, 61, 91, 127, 134, -46, 4, -66, -158, -90, 181, -67]
1575f7R2j40J80m5j8q7J13M5O0o1j90J23o2J55k35k2K26J84m37J22m9k2J84k16
1599a67K49R0k70P8J09J79k32k00j4PK64o5p5o5J3q4J43N5L7j03k2k66M87J78
1623C26l70j16P7K17j45O4j43p6K75j19n8p1N9p3K18j70j05K21j07N9K02m6j7
1646A02o7k75L99k17j35J94Mo2J16k98K76J4j77N5p8L3q4M30k26m1q1L41m03L67
1670A87Nl72Q7N3p9J98j37J00m9p2j3K03p3l9nj33L53p4M7k10M1L7k65O73l82
1695H1R0q6l44K10J44l3j29LJ82j42L9J7k15K51k36J05r5M77m92L59l42J77j23
1718a02J93j37j72J34L05M1k86l01L15k44M07j12Q2l75K23k59J02L13k18P1j05
1739a25J93k25J18l7K9J40Q4l81M32j97l94M81k56k6J65j52O8M18m43J0O5j05
$$ y = [-67, 25, -115, 65, 20, 2, -85, 28, 73, 133, 72, -118, 5, -57, 98, -137, -159, 67, 251, -186, -64, -113, -135, 49, -167, 82, 172, -98, -20, 89, 268, 36, -164, -178, -171, 93, 28, -47, -112, -99, -183, -40, 15, 52, -51, -73, -339, 148, 326, -44, -160, -83, 134, -11, 53, -90, -166, 109, -10, -68, -139, -80, -153, 65, -105, -210, 11, -96, -37, 165, 119, 102, 35, -240, 159, -58, -193, 1, 5, -57, 59, -239, 37, 51, -126, -71, -149, -116, -200, 230, 4, -37, -118, 223, -180, 187, 192, -180, -93, -40, -119, 79, -58, 42, -7, -79, -92, 111, 38, -1, -6, -139, 214, 140, 187, -23, 18, 55, -210, 463, 81, 171, 85, -259, -49, 95, 62, -67, -64, 118, -24, 15, 32, -183, 68, -168, -63, -158, 319, -173, 186, -156, 21, -102, 91, -46, -218, -84, 221, 262, -24, -325, -10, -254, 153, 41, 123, -252, -29, -288, -186, 127, -91, -20, -125, 68, -157, -39, -76, -47, 93, 177, -204, 228, 31, -363, 118, -138, -164, 1, -151, -83, 335, -108, -98, -33, -138]
1761a38J54k9N35m10j14L05o00N16n37R5M14o8j85j98K19j06j68L24j9r6k7L40
1783B07j58j29J39n4O5kN5M7k5p3K61k06n1j04j29L93m76M5J50J44l04K36j13
1806h2J10j77L3J08j16%Q6J96j34K84j79O5j89K21o30J60M99k90J92j15j61L23
1828B04j51J67l69K61L4j63j33R2r0L21j70p5N8p5J32K01l80L14m80N03j82m28
1850d09M89J36k18n1o4k40M56m2kk59M28n11J33J10k18M66j88j70J60k04J6J88
1872Fk87K35N8l8m0p1P6J28j36q4P6K15N1k81J90k66K50L1j40q4J34n3J71k3n5
1897F3k20K46j6J32p5n9M2j61kl70L05J55j65J85j13L64k92J4k30K68J2J15l1
1920A67k24L11k46j08m8M3L02j86Nl32J25J24O2K39k62j14J67J95n6Ll05L45k89
$$ y = [-138, 16, -13, 522, 112, -2, 303, -297, 219, -318, -223, 191, 123, -62, -260, -41, -147, -315, 9, -10, -106, -133, 207, 49, -80, 59, 5, 70, 68, 123, 170, 145, 72, 333, 127, 76, -28, -157, 236, -240, -195, -45, 99, -205, 31, -82, 28, -149, -116, -8, -124, -124, -38, 158, 24, 308, 129, 194, 5, 226, -404, -244, 255, -35, 157, 42, -119, 204, 53, 220, -149, 112, 146, -17, -150, -58, -148, 173, 3, -72, -14, -89, 43, 244, -136, 178, -302, 201, 19, -409, 80, 216, -2, -53, -117, -357, 99, 57, 55, -204, 224, -287, -154, -44, -262, 204, 16, -154, 6, -198, -182, 6, -281, -46, 12, -26, -66, -137, -61, 67, -69, -153, -77, 138, 189, -92, 98, -168, 82, 113, -27, -111, 23, -30, 141, 118, 63, -157, 89, 73, 205, 130, 71, 113, -48, -50, -420, -115, 40, -125, 60, -53, 311, 19, 33, -197, 71, 83, 198, 167, -57, 254, 8, -100, -148, -105, 197, 11, 16, -316, -191, -67, -5, 234, -28, -142, 25, 220, 164, 167, -138, 207, -82]
1943h2J81k58J03M1j83L19m46M02P9j61P2Q7lk5Rk22m1j3k2O0J24K6j77K71l31
1968a90Q5L00n5j5j00Q0j7k25J68K5j21J63l0Jr9l6jJ79j75q3J00k35L53j71L29
1993B30m10J81j87O0K74k95J57R4j02J39O7n41M21n2k05L69j89R9N9j05N9r9k22
2016a98K1K97J14r2k24j5j17K68j17J35J2j6j84n8J50n0m7rm1N7L64m39j29L13
2040ej9L4k60L81j54J66j19J38l55M6K91j53K38j96K40j37k74J74l7L2O2J18m04
2063a93K70J01j19p6j97K60O7j54J1L8K22j45j54J01J89j09K8k20j66J65R3j95
2085a83L05l02K89OP8l14k1N3M54k47j91n3K79n1oJ7k80L65k92J00j05K61j53
2108Ik12M44l46J15J43m16J18L19m49M26q5k49K11k00K66j27J49k47n0L96l71
$$ y = [-82, 99, -159, -56, -15, -198, 121, -325, 77, 156, -5, 67, 154, 151, 126, 135, -87, -128, -141, -163, -103, 21, 47, -130, 141, -190, -105, 195, 140, 125, 25, 105, 88, -137, 31, 56, -65, 98, 68, 69, -30, -66, -67, 112, -63, -146, -46, -281, 72, -99, 230, -180, 1, -186, -126, 148, -147, 10, 104, 2, 141, 208, -333, 88, 36, -169, 200, 11, 110, 169, 64, 123, 24, -198, -177, 120, 234, 142, -82, -97, -214, 54, -63, 72, 84, 68, -116, -174, -24, -74, -121, -130, -171, -114, 250, -189, -318, -5, -24, 10, -250, 131, -23, 143, 24, 162, -193, -147, 144, -9, 229, 33, 273, 136, -138, 36, -1, 31, 93, 211, -193, 77, 178, 59, -17, -214, 46, 113, -41, -30, 8, 230, 85, -69, 32, 221, 112, 140, -80, -246, -81, 12, -183, 122, -180, 109, 115, 193, -121, -142, -89, 365, 118, -73, -126, 153, 102, 96, 113, -167, 198, -94, 6, -99, 162, 9, -203, 241, -105, 10, 153, -263, -145, 174, -275, 151, 66, -183, 28, -172, 94, -33, 116, -131, -181, 215, -156]
2129a56J76j79J39J39k23J42j17R3j22J63j81m0K22k51L67j93l8K06k31Q8J43
2150A47j89M3Q1j02j04P2kj25J09o2J20k8m5k38L39L12l37J77k44J33J2j42M07
2173C34m48n4K19J52m0j79k1j70L13j09o0j14L76j42j75q6J2O3J72k53L78k9O8
2196B07j34j66o9K12J00p7q1Q7N6j96j21J34J73n3k17L10oo0j34q7L23j80j5N59
2220E65m78j32N9k10K02k53J09%J09J01l89K42N6m9J38J34k4l45L97k90K83l64
2242a39J22L6J35Q4m22L87m07J2K12j70k3K11k93J73k01K78K2l00N86k27k4J58
2264B10k68R8j00R6q5q2K60k66L57pj33j32L3O4Qj04L8J39j73O1j21K54j97J36
2288H6j8q1P6k38L8o5J63j53L01l19J95j9k8l0j3K9J84j65K6J72L1l34J68L12
$$ y = [-156, 20, -159, -20, 119, -104, 38, -79, 14, -108, 55, -126, -166, 56, -195, 172, -21, -59, 147, -84, 4, 147, -42, 1, 82, -20, -124, -52, -54, -179, -70, -132, -12, -40, -85, -323, 16, 328, -9, 168, -76, 57, 69, -73, 334, -114, -168, 51, 203, 163, -16, -37, -207, 106, -3, -63, -177, 199, 57, -118, -204, -192, -129, 43, -210, 168, 139, 207, 73, -93, -162, 50, 150, 73, -8, 79, 135, -61, -182, -48, 125, 72, -145, 165, 159, 99, -35, -122, 201, 21, 6, 565, 87, -45, 14, -196, 6, -247, -138, -138, -29, 72, -317, -75, -19, -68, 70, 204, 180, -165, 232, -58, 225, -139, -17, 19, 154, 238, -184, 203, -204, -192, 20, -150, -173, 38, -255, -82, -283, -5, 17, -283, 303, 76, 52, 210, -58, 40, -60, 36, -49, -131, 129, -137, 220, 213, 80, -52, -19, 45, 53, -51, -13, 126, -47, 14, -107, 147, -50, 86, 68, -13, 63, -175, -137, -202, -39, -192, 109, -210, -15, -34, -62, -92, -105, -76, 108, -57, -31, 141, 172, -162, 6, 318]
2312C18j50k80J91j60J83J65m7k03l6K14j18R5K0l23R6L02k64j05J40o4q8P1j28
2335a71L87j12j16J4k55M72p8k60p3P6J88k7j43J67O2n2j46OR0lJ8j37J04l00
2359b89M48pj66J70l98L44J86j88K0M8k02L39k25k71J86l3R1j6k90L89J9K6j15
2382F6m82M41L2N3J15j64M0j55j4lj08R4J72m69J64L48n97M75q0K40m0j31O6l3
2406C0L0j27K16k31O5L3n7J42k47J80j95K66l47K71O1k2j15J42p6j49J2P8r4m6
2430a80K61j81K8P2O9k94M19m36K18Q9k44K97p7J24j70K15l53J26P9k30M8N6J36
2453G2j05K34k15m7j06J17n1J76j33k7N8L0O1j68K36l26M8o8K83j67O4j57J79
2476a2j9N6J1k06L12j09p3r0LJ76o2k51L01q2J21j30m4K4Q7M5L5o1l35L74j46
$$ y = [318, 168, -112, 79, -81, 102, 267, 220, 17, -19, 195, 77, 172, 192, -131, -35, 267, 3, -102, 38, -26, -114, -43, -171, 216, 104, -12, 2, -253, 219, 141, -119, -192, -116, 72, 45, -98, 69, 131, 79, -67, -61, 29, 26, 44, -93, 11, -289, 159, 152, -14, 156, -242, 102, 288, 100, 120, 168, -34, 305, 80, -191, -5, -38, 53, 37, -253, 136, 155, 181, 66, -416, 25, 57, 110, 225, 61, 101, -54, -68, -71, -179, -85, 87, -382, -218, 130, -467, 8, -72, 168, 128, -3, 63, 30, 60, -67, 149, -82, -17, 16, -41, 101, -146, 34, -161, 105, -242, 29, 90, 68, -47, 95, 19, -130, -118, -40, -134, -180, 81, -100, -72, 0, 69, -225, 194, -242, -24, 65, -179, 118, 41, 165, -5, 210, -143, -17, 62, -168, -120, -64, 72, -33, 201, -14, -61, -167, -50, -101, 75, -58, -85, -27, 3, 64, -104, 132, -194, -146, -214, 69, -98, -34, -191, -12, -31, 25, 36, -170, 142, 33, -40, -130, -127, 49, -13, -264, 37, -45, 76, -54, -98, -74, 13, 58, 93, 32, -303, 71, -75]
2501g5o0K53l00R1M4n9L89n60J68J43j38J03j62L47l72L42k52k2P9k35M74N2l93
2524a43o7M17j83J02j18L41l58k01J37n1J1M5n2O9j87L24K53l91J06Jm0L9k38
2547a84L27k13J57N9k71K37k96m4J65J37j48k9L47m9m22J32Q3j5O2j2q2j20K88
2570A09K4j57r2L3K04k6M6k12J72Q9k04J37K2j23k36M53L6m73J34J31J3L5Pj93
2594g1P2n7k65K75J39j6j49M7J92m34J93K51o3P6o7J71j53m99N79k8l45M45l74
2617h1j71L66k24K4K19k17N36n59J15L7m3k7K96l74P4J76k3q8j92MK01L0k24K82
2641A37L0K0l76L43J0l1k09J6J13J26k27L48N2j62k39m4K0J02QJ7Lm1q3j07K24
2666E0K4M1J53k86n2N1j41J17J51n7l1j70J72J32l45K79qJ16j41J05j6j57R7k01
$$ y = [-75, -135, 118, -182, -91, -47, -106, 283, -277, -109, 34, -104, -1, -163, 184, -188, 154, -98, -120, -41, -276, 198, 250, -143, -210, 207, 24, 126, 8, 349, -9, -210, -73, -124, -113, -68, -120, -51, -238, 86, 339, -52, 54, 55, 15, 54, -184, 143, -70, 87, 146, -125, 112, -184, -228, -63, 74, -74, -103, 244, 195, -227, -95, -12, -27, 35, 23, -59, -179, 109, 133, -24, -116, -83, 121, 95, 141, -71, 101, 190, -14, 123, 145, 22, -214, 239, 275, -198, -64, 67, 80, 115, 122, -71, 1, -56, -321, -46, 93, 77, -72, -25, 167, -267, -74, 177, 114, 190, 123, 294, 141, -358, 221, 193, -152, 293, -81, -252, 114, -110, -86, 133, -84, 452, -107, 8, 45, 2, -25, 271, -103, -29, 147, 124, 36, -156, -152, 49, 79, -145, 137, 167, 187, -189, 154, 164, 133, -76, -60, 53, 179, -48, 300, 352, 190, -49, -93, -73, 29, 37, 54, 57, 16, -67, -174, 50, 74, 115, 268, -18, -70, -19, -160, -43, 108, 51, 20, -150, 22, 154, -191, 88, 80, 196, 55, 160, 144, -13, 84, -117]
2690a17J1K80k80J22p2n8L04l3q2J34O2m94R8J40l06L70NjN4jM9j26J05k61j46
2715b43K25J51j3j06J20r3J76j9j68k3j28k09L65j52M4N9j87J06J67K28n03JK32
2738C0L9m3J27l4m83K42M8J75j51J27N6j89O5JQ3j80J15L9K5o1n9j39J28l9J81
2763A03r8L25n86L07j38L69l10j52Q7j48K28R0k2q2M3p2J66j77Q0jj52J63jM6
2787F8R3J69k04l6K7k02O2J27J57k55j26J73k55K38k50m0J95J14Q1q6j1K4L3p
2811H9j08K13k94K62m60K90q7L98l33k22L77k53L0k78L52L2J40j59k64L89p7J51
2833A88m05k01M90Q8K40k89k22n7J72J47k06K05j56J44J18j49j09j82L80l6j38
2854B2M6j84J23O5K24k53k85L25k85M34k59O8M6j08m1n8P4J35l74J69J13j51J03
$$ y = [-117, -106, 174, -106, 16, -56, -114, 190, 157, 75, 209, 271, -223, -125, 15, -291, 79, 84, 83, 137, 136, 185, 59, 164, -97, -243, -18, 133, 120, 14, 134, 41, 217, 198, 30, 7, -121, -330, 35, -117, -73, -14, -201, -95, 72, 300, -203, -202, 30, 69, 26, 153, 119, -364, -122, -74, 101, -50, 77, 133, -56, 9, 10, 93, -87, 28, 67, 92, 31, -28, -167, -39, -78, 103, 5, 330, -256, 51, -87, 282, -28, -180, -93, -241, -13, 77, 55, -27, 16, -56, 110, -67, 13, 12, -140, 23, 22, 68, 161, 330, 126, 90, 117, -85, -23, 104, 261, 6, -120, 53, -202, 36, -214, -254, -59, 55, 136, 50, 39, 63, 96, 89, -19, 194, -100, 162, -298, -8, -95, 303, -30, -252, 125, -128, -98, -376, -24, 8, 148, -11, -275, 114, 37, 188, -217, -418, 72, 160, 400, 111, -111, -168, 4, 151, -55, 150, -6, 138, 256, 107, -2, -184, 196, 160, 22, 68, -116, 7, 72, 296, 43, -242, 83, -202, 232, -27, 41, 87, -21, -62, -120, -46, 89, -285, -116, -3, -154, -51]
2877e1J93J25j76L32l97J90n44J91K17L0J14j51j07J46o7r6J48M4j82K6L3p1p
2900f0j19J71mk6o5K3J15J07k19l1P2J64k4J49K6m31O8J7K37j32n5k04K09L0R
2925B7r2J93j20k3P0n3N7j60l2K58j14K38q7p4J6j91J92J61n11L01q3m7J80k14
2949a08L8K62o9l90M81m23N60l76m7o6r5j2L05O0n6ql4J87j76O8k09K19l4k9p
2974D1k34K67l63L17q6J12q0J04o5j11L23j54o4K84l31l13M12J87j06j62RQ8P7
2997A52j01j5M1j01r2M2P9J90m38J65J5K4K5j34K15q4j2N18p03N14m42L36j75
3020A9l09L98k57L3K15J98k67O0r0Q3j6nn7K22m97K51p1j01L33j68pJ04Mk23J64
3045A6J14j76P2j0O8R6k17K74k69l7J22j65K10J03j31j96J65K01k11J43j05l7
$$ y = [-51, 142, 267, 91, 423, 26, 216, -328, -137, 80, 110, 224, 73, -34, 112, 45, -51, 97, 141, -41, -15, 18, -53, -60, -179, -8, -12, -38, -103, -80, 35, 142, -77, -108, -36, 128, 104, 253, 279, -152, -84, -67, 170, 38, -17, -221, -12, 18, 27, -65, 128, 8, -15, 55, 2, 59, -101, -133, 125, 11, 249, 162, 88, 104, -87, 105, 266, -245, 56, -27, -74, 106, -108, -70, 192, 123, -267, 214, -209, 351, -25, -72, -138, -233, -245, 60, 120, 64, 56, 22, 209, 33, 101, -108, 111, 77, 48, 41, -193, 74, -289, 28, -58, 54, -26, 78, 13, -98, 225, 71, 7, 291, -40, -353, 59, 246, 140, -22, -13, 75, 152, 51, 36, 77, -24, -116, -74, 5, 195, -243, -78, -63, -39, -14, -148, 67, -17, -29, 489, -214, 300, -142, 194, 19, -290, 108, -149, -116, 99, 297, 30, 90, 0, 83, 67, 62, 5, 227, -270, -19, -90, -191, 142, -26, -33, 71, 75, -148, 16, 130, -46, 26, 16, 84, 180, -37, 237, -32, -69, 53, -112, 98, 201, 70, -126, 39, 240, 29, 172, 67, 30]
3067C0m4m8L87l64J03L27n47q9L26o9n3J10j2o8K40k61j98L9M89k90k22K45k16
3090a85K04k02K76l24J22J13J23L2n91P07l8j57MK2m6k2op3J63j29J8p9j46Q2
3114a32K60O7k85J25m8r8l46M81k80N86l75j60J91K23k84p1J98P4l61P1K53k66
3136a77j8J30k65K28R1L39m47L9J24J17Q6l30k15J56J78P6j13Q8j14K5Pk5L1j65
3160a54J60L5p8l21K90R9r9m14O67k63p8K86l03K43M0l85M76k27j5r9K54j46P2
3183D0Q0j22Q8j16R8lo8K24m42jK01p4j07J62K13j17k60m6K18j19Q7L87n99K03
3207g3n1r2K01LP4k96N0n6K01K14j07k0o1J88M0k09Q1J4J91l41K67m36J00L9o3
3232a42J03K00j02J1l09J52J61j12J68k79J00R8J07j48j78oQ3qK66l15j26M25
$$ y = [30, -14, -62, 325, -39, 64, 391, -156, -245, 81, 12, -41, 69, 57, -11, 229, -32, -230, -191, 298, 8, -214, 31, -185, 19, -183, 93, -231, -109, 4, 127, 159, -432, 275, 237, 80, 84, 106, 60, 38, 32, -41, 122, -7, 11, -68, -214, -132, 128, 195, -90, 35, -13, -111, -457, 24, -256, 330, -45, -205, -14, 209, -75, -146, 52, 126, -235, -164, 89, -177, -195, -65, -330, -102, -11, 328, -119, -80, 44, 161, 247, -83, -298, -142, 36, 112, -1, 87, -27, -2, 5, -20, 11, -154, 6, 41, -37, -358, -68, 31, -68, -482, 185, -78, -156, 130, -173, 70, 110, -275, 201, -26, -41, -140, 114, -32, 40, 120, -2, 86, -30, 68, 65, -3, 221, -221, -222, -21, -95, -202, -40, 173, 56, -204, -250, -32, -151, -64, 323, -276, -73, -124, -216, -15, -12, 62, -234, -184, -240, -39, 175, 68, 48, -13, 175, 215, 6, 87, 101, 292, -49, 218, -218, -118, -79, -142, -39, 161, 59, 70, -239, -87, 74, -38, 130, -149, -49, 49, 156, 8, -170, -176, -93, -101, 165, -150, -276, 149]
3254A49k2j21K8q3MJ41r1rJ36k3n7l68J87L01l6l33K16j23K96l01n7K28l74M30
3278A18k27K64mk15L3K51l25K05jk55K97j05j18J83p2K22k54J09l5o2Lo6j14N0
3302a18k6J82j94K4j31K95k08J32j62L22p0R8k87M48m76k39L59j60J87j52L16
3323A40q5k62k0N08n46L39R1n32M58j94J60o3o6J47j19j83K54Q8PN0m59L35K1
3346F9k15L72j60jK6j15j10J40J89o6k67J98j98K78j20j54K53k02J34L6j33J17
3368G1p3N5q8j28K77j82J46j24J38q0k8k72K11p3L53r4Pk87R9q6j1K83O6j16n3
3393A1j73M3J00L6p8J2M5Lj62o0J72n03O83J08m83J36L04k57j74L79k72K08j00
3416b2Kk1l9J53J5j78Q0P1j02K36o9l94K75Pj96K66L34n62n9K46j11J90q2j14
$$ y = [149, 127, 6, 34, -49, -45, 96, 5, -4, 132, 109, 52, -316, -129, 172, 136, -197, 19, -104, 192, -109, -166, 62, -312, 118, -109, 155, 151, -64, -31, 220, -105, 100, 99, -156, 141, 36, -82, 101, 29, 251, -3, 106, 71, 9, 12, -54, -168, -118, -144, 38, -156, -132, -263, 32, -176, -44, -206, 116, 46, 144, -143, 305, -171, -410, -51, -211, -24, -176, 140, 55, -207, -227, 281, -265, 74, 165, -367, 91, -103, 57, -6, -72, 75, -44, -227, 27, 115, 122, 172, -287, 48, 69, -146, 226, 66, 65, 91, -24, -134, 6, 195, 129, -138, 60, -138, 140, 20, -134, 119, -83, 51, 87, -46, 71, -2, 53, -35, -163, 114, -68, 78, -46, 92, 12, -16, -288, -77, -150, 203, 109, 116, -171, -72, -158, -169, 114, 180, 64, 11, -162, -119, -19, 17, -61, -49, -4, -1, -163, -223, -51, -554, 129, 237, -246, -110, 194, -63, -237, 142, -130, 78, -22, -20, -41, -80, 73, 88, -90, -10, 61, -41, 195, 126, -268, 7, 14, -182, 84, 418, -144, -203, 43, -68, 122, 40, -74]
3440g4K62j67M9k8k15K64j85k7N7j7p6L06k11L00k11J3p4k5R8J94j7j16j82j94
3464b76M39m25K01K3J68j10P2o8J93j71j07m9O1K54j43k86J44J69l10K06J62r8
3486D9j36L3K3K90n46K85j70m7mN8O3k9L48j75n2J48q5j31J99k14nK79j76j91
3510a86L41j04m12M10j7J82k40j2l1J19P9k37K77k08J59J1O5l65KJ22j24J33r5
3533a31K56J2j59P6j50r9J09J10j69J52k07Q9K3J48lr9mjq7J48l44K99j58K0p
3558a76K50J18m50J50K41j69J81j59l6K33j85j73L69K7l69J53j23J71k33J01n6
3579a35J49M5j41N2j02K4J06K87k06n7k45K75j42J32J49j29j38M0j0j30L32l50
3601a94j8M80j14r1j71ko5M19m09J10M4J84k19k30K90N2r0k5j42K20J3j0L1k90
$$ y = [-74, 188, 21, 70, 42, -173, 91, -94, -121, -64, -81, -157, 149, -62, 238, 27, 40, -34, -59, 39, 233, 216, 100, -82, -276, 163, -262, -61, -38, 130, 20, 92, 24, 217, 46, -61, -110, -49, 205, 62, -224, -80, 89, -221, -15, 147, 49, -87, -54, -31, 259, -287, -2, -172, -219, -223, -165, -102, -131, 217, 42, -10, 138, 53, -78, 121, -93, -98, 181, 5, -186, 155, 51, -361, 49, 32, 214, -26, -38, -69, 50, 129, -108, 169, -39, 120, 131, 196, -169, -167, -45, -169, -36, -131, 125, 137, -22, 54, -96, -195, -86, 24, -145, 7, -200, -111, -88, 60, 57, -42, -46, -47, -134, 14, -330, -31, -189, -169, -176, 74, 192, -258, -108, 133, -36, 145, -14, -50, 183, -2, -175, 194, 221, -148, 5, -118, 53, -180, -79, -135, 14, 59, -82, -30, -132, -108, -2, 285, 79, 22, -223, 52, -90, 42, 191, 62, -76, -36, -46, -176, 156, -194, -212, 268, 154, 63, -108, -110, -175, 244, -165, -55, -11, 173, -46, -276, 14, 66, -24, -49, -191, 29, 42, 32, 63, -227]
3625b27L29m82N94l56o6N2M6k41O1P5L55m18J06N6L49m05Q6J99J8r1j88j58M74
3648A68k49Q0M2K26j30m8k52N0N0j24L29M9k5j54k50L00k01J49Kl71M95k44J35
3671B7j41Q6j87L18l04K60j46J40l39L23j7j27K72j17K9m9j24L72j38j79N6j11
3693i6K83J1k81NK1J26oM1k82L29l20J1M55l34J00J91k38K54j75j15J8J11m48
3716c39M07m8nJ37r1R7l02PM26k15j81J39J85p6k46L46j97n2k12J00L81k09l85
3739c33K45L49n52K95p9J14j58J69j82J55j17j9k2J3k56L52N0k53J49J90k99L24
3761A35j80O2K26k99o0q0J22L02j12ON1k30J22l0j62Q9O2P9m51M19L7M3l57M70
3785B64k76p9J41j08P7O5q0jq8M19l84r4J03J58j33n5L27j98J55k46L56m6l50
$$ y = [-227, 102, -380, 214, -142, -208, -156, -110, -351, -290, -215, 140, -278, -172, -116, 233, -172, -86, 113, 131, 40, -148, -306, 168, -81, -1, 41, 267, 137, 89, -163, -113, -63, -187, 142, 191, 166, 12, -238, 62, -139, 10, 12, -359, 136, -108, 27, -114, -28, -215, 103, -201, 59, -87, 53, -286, 37, 20, -107, 165, 48, 77, 28, -96, 276, 138, -41, 15, -96, 187, 198, -83, -78, -57, 69, 63, 104, -178, 151, -169, -158, 297, -37, 63, 254, 16, 270, 95, -20, -2, 109, -339, 68, 20, 15, 152, 61, 158, -144, -137, 289, 74, -107, 32, 217, 141, -105, 241, 44, -8, -220, -120, 261, 52, -333, -88, 261, -291, 4, -75, 39, -119, 50, -132, 23, -94, -113, -135, -122, -378, -26, 24, -229, -80, 110, -189, 135, -45, 17, 243, -56, -116, -196, -74, 228, 116, 122, 173, -57, 65, 35, -127, -38, 24, 103, -348, 71, 108, 151, -206, 264, -12, -91, 50, -58, 19, 84, 4, 3, -85, 334, -50, -144, -41, 117, -16, -71, 256, 58, 213, -33, 323, 277, -73]
3808g3L59m49R8M15l91N1N7k13Q3J41J2L9j75K66k5j83oq0O5q0M8J10k48L91j32
3833H0Q5j48L56l81j48J10M4N9k40J88J74m1k38J16N0k27KJ01J63r9k8j66L17
3856A29m52k0M26p1R5l9q4J74l87kN6J10K54j92J67l01M31k29l04J67K42k86J07
3879iq3l1n1L29J35k60k44K88PJ02j75J2L2j97j69K87j45J71N0l46K15M9k83K25
3903i1J13M6j09P3J0k7j12J27N8J22j02J71k93k1r5k1K71k23J45l26J00J03j10
3926a91K73m6P5j07J12l80K69J21k34N8L4J37l3j42N1k51K13O1P8j05J56j53J3
3949IQ5j33%j86L03q6nj3J96k31j01J38LN1J27m6q6k6M6j53J25l72M02j35J14
3974B6J38%j80k7M6O0K7j38J52l72L45M3k15j00L3M88l65L92l26p7j56J47l7O
$$ y = [-73, 286, -163, -65, 350, -41, 10, 67, -146, -63, 78, 90, 129, -46, 220, 195, 12, 6, -74, -9, -89, -41, 69, -179, 212, 80, 165, 17, 373, -8, -156, -46, -2, 57, -183, 5, 179, 138, -100, 16, 66, -161, -159, -58, 105, 6, -22, -188, 129, -323, -343, 83, 12, 107, 68, -16, 158, -229, -231, -175, -65, 189, -3, 164, -137, 294, 65, -239, -72, 170, -116, -9, -92, -123, -174, 155, 290, 30, -214, 74, 81, 183, 8, 20, 52, -145, -314, -27, -172, -1, 49, -297, -82, -33, -316, -91, 22, 68, -41, 32, 42, 15, -97, 30, 88, 210, 108, 279, -14, -35, -130, -151, 120, -103, 42, -284, -184, -81, -191, 82, 36, 111, 4, 116, -264, 5, 126, -108, -50, -16, 121, 88, -54, -3, -254, -41, 20, 98, -7, 149, -4, 9, 94, -39, -39, -225, 78, -8, -13, -26, 170, -61, -162, -24, -21, 30, 157, 111, 25, -1, 45, -108, 17, -355, 47, -88, 26, 164, 164, -16, -43, 3, 63, 90, -48, 104, -268, 77, 120, -95, -195, -162, 326, -39, 353, 27, -50, -206, -59, -96, -90]
3998i0J19q3r1O0K26j12k3j66K99m2k27o5J07n6J83k27J94Q2J32j39p5Q5j94j84
4022b87J42J88K00k62K04j66J7J46l64J02R1rL6L4k43j89L42k7K09p4k92K06j82
4045a78J78j83J68K15k05j28K49q7l33K00P4J9L63l30j3q7m1Q6K24m6J2j48J09
4068A18M4j95K05j77k1j32L62q8l06J62K52l50J09k73L49r8J4q8K11k34L62l04
4090g8K30P0k81Q4l44L56p6J54j61J9J16J1k24j3P0lm2L47j80J19j14j6J79O6
4114B89o03K20Q1K9q1J62kk14p0J53J52n5P4q4q1P4j51RM6n6K21k6J7k29J07J46
4140A28j60J11j14o7J77L9J08m09J39p8k5J99N6l02mJ80J95k20j9Q5N0N5k35J70
4164E9k27J86k39K44j79K00R1k93P9j34K32m3J09l84M05j22j14K70l4M5k41J02
$$ y = [-90, 29, -54, -145, -85, 141, 29, 6, -160, 139, 97, -130, -195, -88, -144, 39, -188, 6, 88, 220, 81, 6, 91, -103, -287, -145, 43, 243, -19, 185, 19, 36, 182, -182, -80, 11, 2, 38, 72, -171, -360, -18, -45, 164, 90, -202, 4, -178, 0, -183, -15, 200, -5, -133, 116, 29, -304, -104, -30, -11, 352, 22, 9, -78, -119, -33, 191, 145, 157, 9, 118, 162, -33, 172, -5, -26, -158, 204, 116, -190, -28, 224, -126, -17, -290, 59, -39, -25, -113, 98, -136, 226, -78, 152, 222, -59, 25, -319, 37, -39, 115, -46, -27, 89, 100, -124, -137, -67, -70, -112, 235, 55, 174, 60, 44, 223, 289, -314, -94, -13, 16, -65, 97, 95, -119, -189, -36, 116, 61, 135, 51, -30, 44, -107, -98, -52, -108, 113, 87, 104, -125, -18, 128, -32, 79, -35, -102, 75, 114, 222, -187, -48, -126, -151, 48, 104, -198, -202, -22, 173, -47, -66, 19, 69, 124, -111, 59, -168, 18, -221, 23, -156, 44, 135, -158, -79, -213, 19, -24, 85, -299, 106, -16, -130, 140, 106, 151, -90, 12]
4186A2N5J63q6l08J21qK34j97P6p7r4J66n2j30O7K06j85R7K79j44l02j36J39K94
4210A90l70K46m4j6M1q1J81k07MK51k26J04m1p1k21mK88K1k10J08k8K21j31J70
4234A75k33J02R6m6J76j01k59M8QK9J33j7l3l14J49J33J91k50K67j97J09k80J8
4257i6O3k52L89j82J50k62R9J71j21l7N9K04k13j48K18j58P5J7J09k0q4J0J46
4280A37m5n00O84j11k55L51l33J77n9J08j06O7l77O08r6m04K8j53M45Q1k36K67
4302B78j24m03J10J34M4j57K31k15K42j76kJ44j69j21K88j18j85J87J00k69P2
4323a09J99N3o1K00K5n21N2K80N4j24l16L2K66K7J79k68L3Q2m7K60m03O0J31j53
4347f9L35k88Q7j35L5J87j48j49K94k40K1J62p2o7j21K8K23k42O6J12j89M4R2
$$ y = [12, 67, 230, 144, -164, -43, -51, 183, -14, 62, -15, -109, 57, 5, -125, -58, 148, -37, 60, 339, 195, -107, -243, -104, 190, -180, 66, 22, 6, 47, -34, 147, -60, -56, 195, -31, 73, 32, -39, -260, -264, 24, 45, -165, -57, -85, 136, 5, 175, -58, 44, 140, 94, 270, 169, -90, -42, -34, -5, 128, 111, 78, -236, -87, 46, 237, -13, 254, 57, 166, -114, -96, -33, -285, 104, -78, 72, -190, -91, 80, -41, -78, -19, 185, -28, -176, 42, -116, -41, -24, 85, 65, -19, -9, 137, 92, -408, 276, 165, -90, 261, -72, 105, 46, 154, 48, 115, -262, 346, 250, -154, -126, -279, 166, 247, 11, 278, 154, -249, -139, -5, 39, -118, 113, -102, 140, -36, -38, 106, -63, -184, 104, -14, -199, -12, 88, -181, -109, 90, 143, 82, 282, 307, -214, -162, 118, 172, 48, -268, -236, 30, 57, 236, -32, 1, 83, 36, 296, -107, -47, 84, -69, 266, -22, 65, -70, -35, 152, 4, -145, 149, -91, -70, 92, 20, -47, -168, -140, 83, -159, -93, 19, -170, -126, -34]
4370c4m2J1L74k36O2JLk56J45J85n9j58J37kj9j23l2j35J49R2j16m3QL25l78K97
4396A56k49J57m67O33j21R4k80n9K60j68k35K95J42m58M01K2k74J90J24j16l9
4417Hj8k8R9j02J63j0m7j1L4K5j93%J95k32P7K40k87K49k48j05L70q8r8Q4j57
4442h0K01m9M5j43J1r1M59l75j58J75J08k61J04r7J11J39nJ66P2j49j37qr6J2
4466d6J35p0J20l76O12q5j86J17k22k50K72j39K87p1o1j7K7K39lm22J4P2P1k72
4490b54lN16m34k72M68j08j4k07J71Q0J94l87L09n1l10L60k26K08O8j21j59L4
4512a38K65K69m00J88j90M7om6J5R5k06Q3k43M06o9p3p2L15l98J67p2l53M71j31
4536g6P8l7K90j55q7j69j12J41J42j27J44n5J68l14l2K07r0J3J40J21k57j42J89
$$ y = [-34, -76, -65, 309, 73, 135, 136, 139, -117, 28, 213, 154, -4, 133, 131, 112, -11, -43, -178, -29, 63, -53, -96, -88, 237, -141, 156, -93, 64, -403, 230, 109, 203, -77, -136, 124, -44, -279, 16, 158, -300, 101, 123, -151, 39, 163, 47, 8, -10, -38, 61, -41, 122, 112, 65, 54, 88, 113, -80, -80, 115, -117, -40, 200, -87, 162, -86, -191, 179, 91, -7, 77, -80, 121, 72, 117, -26, -15, -106, 353, -22, -180, -5, 103, -158, -54, -151, -40, 99, 94, 260, 332, 183, 46, 38, -58, -46, 89, 19, 139, -237, 375, 290, 104, 221, -1, -251, 21, -118, 169, 98, 37, 20, 47, 286, 283, -139, -125, -53, 18, -254, -257, 259, -175, -447, 21, -87, -101, -308, -137, -57, 137, -250, 59, 8, -302, 58, -168, 40, 108, -13, -172, -138, 127, 396, -4, 184, -6, 41, 35, -11, 4, 99, -107, -24, -267, 139, 70, -3, -75, 240, -158, 9, -63, -416, 55, -76, 2, -35, 255, 100, 13, -156, -268, -127, 15, -112, 32, -23, 145, -169, -201, 6, -84, -71, 69, 190, -67, -209, -20]
4559b0K26k44R2k59J75J83q8j34L18p6J19m22J00K11k01R2j76J14Oj77J9M76l25
4582Ij23J01k1L47m96P2K22j51J7Q3k00KN2nj05L09j70m7J14j49N5N8K7l1p8J96
4608H8j89RJ45q5j46P7J40l61J63N7J68k09o0M83k49L4M4o1l24L48J21k9j63J24
4632A25j97j6j30R6J0j5j11K01mO1n9J4J40k53p8J30J12J52j61J24j60J57j65
4655b7k17L87l90L28j68J92l64K12p1q7J36P7j24J62J53n12M52j47J49J66j97
4676A10k48M3j31K77j43O8N4r5L4J36j31kp1K17O0j70k55J00J99kk12N1J20K21
4700B30k29o1P5j05L4J24J01n2n4J48p6j37M2j83N0L35n5l92L75j0j81K23l31
4723a29J15j85o9J83J34NK2MNm8Jq1J17j17J20m9j66J39J6k73K55m5j79M18m00
$$ y = [-20, 206, -38, 54, -205, -30, 153, 65, -69, 249, 173, 292, -130, -30, 181, -20, 72, -104, 10, 16, -161, -142, 334, 9, -114, -13, -34, 313, -183, -111, 111, -40, -23, 60, -140, -138, -86, -91, -196, 113, -57, -104, 10, -139, -84, -26, 1, -30, -108, 88, -101, -92, 53, -32, -178, -101, 39, -322, -159, -102, 66, -143, -203, 280, 31, 65, 109, 48, -276, 72, 193, 164, 1, 125, -72, -88, -218, -122, -112, -127, -238, -37, -41, 20, -39, -25, 115, -138, -216, -86, 26, 178, 17, 141, -19, 138, -27, -244, 143, -247, 81, -87, 105, -259, -47, -118, -205, -69, 8, -116, 46, 199, -313, 139, -8, 141, 307, 110, -138, -95, -226, 51, -92, -24, 30, -65, -31, 105, -26, -28, -99, 118, 178, 8, -247, -147, 52, 50, -162, -111, 9, 230, 1, -60, 15, -90, -56, 68, 169, 117, 63, 211, 135, -2, 40, -143, -93, 242, 187, -205, 170, 160, -21, 202, -129, -14, -199, -268, -85, 49, 54, 76, 80, 85, 37, 38, -43, 74, -43, 77, 28, -138, 1, 17, -256, -1, -46, -225, 193, -207]
4748b07L15j13j65O3J64k3j62oR9R1j33o0K59m4j65J68m4K54l15r2r8lL14J31
4772B28k30qOP9J20k74J24M7k67k37K67J7M92n59J87Q9k60J66J99k03l37K40o2
4795a76K36lP5j37L5l5j5R4O1m05L75p1l4k84L67k03Lj87K80L26m70K48j1j31
4819f2q1L12j65j02M17j36o8J55l77M0j58J62M1q2Nm1j00L08j30MJ68p2P8l14
4843a98J62L83l74Q0J80j23j02p8l6j0J69j41m1N3J7j61K20J5J68j56j66L0K1
4866h8J10r3R8J7J68l58j11O8J28j64L43j94R3k39L27k25j0J10J34j19K5j58K87
4889A49k29O4j37K61j64J23O9k76j46m8K53k85L61n8o5K82j77k0j68J44K13j06
4911D0m6N3j10J56l52L71j3r7j11J34K62l91N2J17j07l8M4k1q8J93J84m14K50
$$ y = [-207, 108, -5, -170, -107, 57, 34, -128, -134, -35, 56, -77, -137, 122, 78, -87, 81, 37, 291, -24, -116, -214, -217, 97, 228, -2, -10, -4, 75, 195, -79, 45, 92, -175, -412, -145, -128, 364, -195, -8, 81, -179, -13, 186, -17, -354, -114, -176, 60, 57, 132, -5, 30, -5, -20, 74, 135, -270, 105, 34, 0, -284, 83, -120, -117, -304, -24, 302, -168, 80, 69, -62, -143, 169, 4, -98, 319, 183, 115, 270, -107, -67, -225, -63, -22, -104, -99, -140, -240, 68, -62, -58, 110, 38, 116, -198, -36, 347, -27, 53, 233, 110, 8, -70, -106, -116, 53, -88, -129, -76, -59, -220, 0, 15, 183, 27, -139, -109, -88, 22, -71, 27, 44, 212, -146, -257, -189, -61, -225, 118, -76, 17, -222, 105, -120, -130, -20, 114, -5, 20, -138, 149, -80, -16, -153, 108, -56, 67, 136, -140, -286, -334, -81, -366, -5, -63, -128, 154, -23, -43, -211, -67, 146, 40, -6, 47, -63, 93, -259, 112, 99, 2, -109, 25, 287, -104, -52, 65, -42, -80, -36, -57, -145, 48, 232, -182, 68]
4934F8j08N2K28J2j96L5N0k69J87l10J40P6O0Q4k4l13L07j20J59K93m78o0J14
4957a3j41K94o3P4k94L70j57o0J14P7j54q3Q7j55R4m2M9j07J89m2j02K47r2j78
4981h8J0Ok98L43j33K94j02j63L1J30m8l17L71rj32O7Mk6K00m09L07M5k88J59
5005d6l3j02L63k27O1k50K34k63K19K55j24l72L47k03K92k54J67M4l15K05M1k03
5027a64J55n8K48l82K43N2J63l81K37l04L82j62O3j7J41m40K74J25j59J51k43
5048g6J29l69M87m41L99lo3n6j98J79k48L16K00j15j37j48K06J15j3k47P5o3K41
5071A70j58j75R7q2K74Q6M3k52J46o1l07K70j16K03L00o76N50m35J31J67q4K4
5093A15M7j7j20K6r1J10j76q6K54o7j64j55J34L41m02J16J49M4r1r9m3L27r3q4
$$ y = [68, -40, 12, 240, 252, 56, 91, 141, -128, 59, -251, -111, -35, 25, 109, 85, -228, 79, -41, 118, 411, -67, -127, -13, -154, 140, 77, 151, -143, 227, 70, 10, 124, 201, 47, -36, 51, -104, -10, -52, -3, -110, 79, 37, -65, 182, 90, -88, -78, -72, -370, -27, -160, 134, 32, -131, -100, 30, -18, -335, 36, 27, -105, -38, -34, -60, 140, -269, 38, 83, -205, -46, -79, -181, 182, -45, 16, -234, 0, -263, -44, 211, 87, -285, 62, -141, 151, -103, 64, 108, -207, -2, 39, -164, -9, -67, 181, -201, 42, 94, 257, -124, 113, -191, 191, 29, 92, 75, 216, -224, 50, 175, 16, 167, -76, 53, -316, 171, -270, 129, 126, 63, 7, -191, -12, -260, 56, 256, 141, 4, -144, 62, 177, 164, -83, -8, -71, 170, 12, -163, -66, -148, 126, 212, 255, 3, 149, 88, -219, 51, -65, 138, 438, -238, 312, -123, 8, 175, 91, 115, 162, 145, 25, 51, -40, 70, -106, -192, 62, -5, -169, -324, -190, 151, -251, -135, 14, 58, -33, -132, -175, 152, 59, -25]
5117b5j8j19L6J64j99K14O3p7lk28K89K15k12j50n8K66q6l02L99l72j02J32L40
5140A67j65J99j29N3J06m66J51j4kK81j23q9l6J41r6K08j22J25j17M4j20Jm6J65
5164A16k43J60k94L84j16l69Q12m49ql07M00k23J99N3k20O9MK15k18K41m5K32
5186C93m34J72j49K6J01j17j3K00l02J58J11q4k2j83R1J3j31M3J02J51k44J89
5208G1M2m63L54l22M07j71j3n7Q2J23j35j90L66k66K42J09m47J03R3K24j44P8
5230H6n7j69Q4J47j45o0M3K98l18L85l42N7k58j01N74m80J17K68n8j08J67m20
5252b90L53J18k40J34K08k21J26l21P3J04rk5J29j88j10L30j70r6m2J37q3R6j76
5275a63J11QQJ70k3n61K74o0J56j65L97j42k40L10P4j88k1j04J5L06m10K61J82
$$ y = [-25, -43, -162, -126, 38, -161, 53, 116, 39, 36, -192, 97, 312, 100, -50, -108, 158, 72, -230, 169, -203, -305, -173, 167, 2, 201, 72, 125, 231, -235, -84, -98, -100, 181, 58, -31, -67, 74, -22, 186, 64, 189, 72, 116, -4, -3, -49, 116, -127, 33, -261, 123, 7, -362, 450, 1, -7, -314, 86, -137, 62, 115, -105, -36, -32, 183, -35, 206, 161, 393, -41, 131, -18, 8, 109, -8, -21, 179, -123, 35, 146, 62, 40, -143, -52, -39, -170, -127, -25, 126, -118, 71, 113, -350, 4, -318, 89, -82, -95, -152, -70, 53, -82, -272, 94, -172, 70, 179, -268, -165, -72, 152, 8, 86, 29, -140, -56, 91, -54, -114, -71, 227, -91, 294, -48, 9, -249, -350, 224, -256, -139, 129, 71, -37, 130, -290, 63, 181, -59, 75, 283, 62, 188, -133, -60, 44, 35, 10, 139, -49, -159, 171, 1, -95, -137, 0, -83, 13, -163, -52, -44, -36, 134, 111, -450, -176, -236, -80, -245, 152, 10, -230, 80, 154, -34, -55, -159, -144, 162, -248, 13, 195]
5298A95k73M56m95J59r9J63j47J6K07l17L28k74r8K97j71K27j78j99J41J08k05
5319a59J75M2j10J93k16p0k79M66j1q1j01J19%J00j58K12Q1J8j41n5J20k13q3
5342a51J27K46n37K65P8j07K3rJ07N7L7j54J09k80M9R5J55j18j6j10M47k99q9
5365g5j07L18l31O1P3L0j36M50k96nO4j75j00J06r1M93k72m3K31j45l8q3P3k4
5389b2m3R8O6J55k68r6P7k30L31k26k12J68L65l60L82n10M1K54J75q9j77J78k1
5412C6j67j32L39l0l6J9r0K06m12L95Q4j96l0k07N67j44j77Rj68jJ38k17M36k20
5436Bq5J46k2k08Kn9K08J89j02%l99K50qJ91K20l06k2J0K4o9l7K4j39J34l3J28
5462C9j70J27j80L45J24k08K4Q7p6j62o3J38J07J6j39k8j76K84J13k08nq7K59
$$ y = [195, -78, 378, -117, 42, -57, 106, -41, -25, 182, -135, 193, -81, -179, 118, -53, 174, -4, -203, -62, 46, -159, 16, 58, -52, 141, -75, -145, -424, 42, 31, -50, -151, -32, -32, 68, -90, 122, 203, 221, 80, 25, 145, -68, -151, -24, 222, -315, -50, 28, -79, -56, -65, 42, 99, 136, -18, 91, -189, -140, -45, 110, -8, -24, -134, 313, 14, -75, -182, 136, -195, -134, -61, -31, -167, 283, -13, -18, 46, -129, -229, -123, -214, 279, 7, -36, 195, 50, 12, -71, 2, -22, -65, 33, 99, 254, -14, -110, -33, -263, 68, -158, -370, -202, 163, -197, 185, -325, -284, -30, 145, 56, -121, 57, 36, -131, -263, 76, 46, 10, 29, -61, 145, -267, 128, 212, 16, -14, -221, 346, 202, 25, 34, -134, -135, 3, -214, 222, 2, -83, 63, 41, -167, -165, -224, -16, 173, 71, 71, -328, -78, -86, 105, 325, 19, -3, 7, 31, -38, -75, -51, -190, -56, -89, 39, -131, -4, -184, 161, 285, 77, 101, 188, 112, -50, -113, 25, 132, 148, 9, -19, -195, 89, 202, -6, -11, -98, 161]
5485A61j24L09j10j52J09J48m15J58M4j19j85O8MM2L2j36L08m27J45Rk31M36m7
5508B7l1j82K94r8j54L62j06j8j09J70p9M4m5k48J3K14k00N3pL2j33J97J05k38
5532a37L36m33L36j33P7M1Q2j71L1j86j21M12nJ90l82J76m43K87k19J84K16m07
5554b69M0%K11k0k76M78j28N4M1M1j12j81J17M2m1K2n3J79j6J54l64P2m9Q7J14
5579A43O9k63J03kj25j84L51l2j77k0K98l30N9R9k1K27o1k7L0j90K24r5k1L47
5603D02n27J31M1j00R5k15J46J88j33l8q9j10K68j43k71L84Q7l64J91J82kk10
5625h7M53l2j67K36k46k70NK01L3k16N19n57K19j0j06o6J72J36j02Pj84K19r3
5648F4J0k82M64Ml8l82M57m32P4n4K36j16m9K66m06L13m0o0mk52L91k80R2K8k48
$$ y = [161, 37, 346, 236, 84, 193, 341, -74, 84, 128, 9, -176, -108, -104, -62, -30, -166, 142, -285, -140, -131, -362, 74, 27, -4, -186, 108, 10, -144, 218, 112, 94, -15, 155, 76, 120, 75, -173, -160, 54, -146, -93, -100, -68, -201, -4, 101, -137, 199, -234, 102, -31, 46, 87, 169, -2, 29, -157, -278, 134, 129, 319, -63, 113, -330, -43, -262, -78, 138, -269, -229, -229, -18, -38, -314, 164, 36, 90, 131, 172, 60, -121, -4, 38, -3, 19, -34, 145, 129, 283, -81, -9, -58, 29, 143, 212, -51, 52, 50, -75, -259, 92, 60, -117, -137, 161, -169, -110, -11, -32, 195, 134, 107, 137, -53, 171, 76, 55, 402, -125, 6, 47, -53, 42, -173, -27, 161, 28, -10, -99, -209, 59, -84, -355, 29, 116, -248, -57, 125, 123, -87, 366, 334, 167, 403, 157, -113, -108, 93, 126, -90, 429, -128, 91, 81, -25, -91, 81, 217, 115, 122, -62, 157, 64, 74, -208, 256, 260, 222, -160, 297, -135, -61, -115, 121, 5, -44, 222, -184, 129, 89, 29, 25, -227, 164, -116, -24, 4, -244]
5673b44J93Kj86J30J85k38K51k66J44J66p1j06J09M4o4j63L1J17N2j42JJ69j18
5696dm9K3N7l10L56j17j50J92J69j65m3J91k98J10j19K15l9N8j18j00L12o7l40
5719b36K90j86P5j4j29K07J14K0k81J90j56K31k60M56m46J17l8l8L18r6j40J43
5741A41p5J1l89K10K53k72K30l19K49K94j64m51L0N68k88j1K2j74J83J1m1KJ72
5764A92m18J62K04j22K2k83N0K52j90R4K47j64k39L20m5m8m4k5l8J62k52J80k14
5787a97J89m5Q9q0m7L6O9q8n3J14J86j78k53M61j72J49k99M3N9kR8j40k80L03
5811c8j33M7J9J57P3O3j53J17j01m0J49r6Pj82N2N8r6O3K45l79J56j67K50j19
5835d8R0m8M6n3J25j78qM0k4j10R5j99L17p4K46k61m4K17k65K25j37j5m1n2L37
$$ y = [-244, -51, -49, -235, -105, 80, -158, 93, -173, -29, 137, 66, -40, 69, 113, 49, -114, -83, 34, 86, -56, -55, 114, -4, -53, -30, 27, -283, 73, -44, -194, -2, 167, 2, -41, 150, -148, -38, -157, 58, 19, 77, -41, -141, 171, 104, -236, 54, -132, -57, -71, -200, 7, 121, 141, -140, 50, -106, 125, -135, 321, -125, -8, -46, -84, 234, 138, -2, 141, 66, 77, -312, -102, 151, -121, 109, -210, 39, 333, 169, -282, -252, 316, 28, 17, 39, -135, 48, 59, 18, 20, 192, -226, -64, 140, 18, 40, -243, -193, 59, -131, -37, 210, 46, -193, 127, 82, 34, -10, -35, -73, 89, -163, 17, -197, -8, -53, 36, -44, -91, -55, 14, -74, -127, -13, 173, -5, -258, 203, 31, 180, -119, -76, -17, -19, 79, -61, -341, -38, -171, -124, -105, 52, 125, 188, 35, 152, 51, 11, 160, 64, 71, -111, -59, -1, -97, -34, 211, -168, -12, -179, 71, -48, 42, -6, 40, -13, 112, -66, -74, -34, -58, -168, -73, -272, 45, -29, 217, -44, -88, 129, -136, 89, -48, -63, -104, -156, 181]
5860A81l41K55j38J57k00J11K1O4PL4j18l1j79J95k9j75P3j28L79n3O8k77R5j1
5884d0j27J20o1k4J21m2k1O5r3L20j23j50K58j78M2j53L17k25J74k81J06N9J9
5907H3k97k06O89k45J40j69mj53K22j97j82L94p4p1m7J86k62K17l2RJ65j28k7
5930A1K16k47R9n4m3K66l88K54J16l23N8J34Nj80J26jJ5p5q8K18q4j45L06k17
5954b1m2o0J06r3M7O7P7k68M9n1J70o3o0L36l11j8K5m7L72k69J79k44J45j57K90
5979A59k47k53N23p1k0k49K58OR9k10j52L06j55J09o9N6k83J6O4J89K32k09q0
6002A9J29j45J69j23pk77J80J2q3j2N7o0K44j6r2k09M35J4k11k32J55M9j18K01
6026G9R3l56J92l20J14M3L15K3j62O5j33Rj85J43M0K07j76M2j20o7M7J87m13K66
$$ y = [181, -160, 95, -43, 114, -86, 25, 46, 110, 117, 151, 33, 2, -177, 18, -11, -186, -113, -241, 138, 85, 153, -124, -29, -40, -167, -47, -108, -132, -11, -53, -74, -9, -102, 218, 95, -55, 203, 25, 67, -86, 231, 6, 180, -101, 5, 64, 83, -214, -420, 269, 24, 164, -5, -9, -162, 60, -137, -319, 75, 1, -70, -117, 69, -193, 24, -8, 1, 166, 38, 11, 227, -20, 79, 25, -18, 248, -140, 114, 230, -93, -35, 99, 104, -76, 50, 49, 64, -11, -99, 119, 35, -110, 196, -21, -63, -123, -17, -110, -63, 4, 81, -187, -138, -189, -19, -82, -142, 194, -117, -135, -110, -157, 215, -54, 125, -119, 26, -131, 159, -88, -341, 182, 111, 91, -158, 100, 106, 205, -5, -157, 149, -6, 103, 34, 90, -193, -177, -113, 76, 308, 99, 19, 148, 3, 172, 49, 42, -235, -55, -43, -126, -138, -81, -141, 103, 87, -5, -214, 221, 235, 24, -208, -53, -4, -122, 79, 172, -184, 8, -312, -198, -155, 160, 183, 21, 86, -47, -38, -223, -80, -40, 167, -9, 33, -87, -154, -107, 80, -333, -67]
6050f7J16r2JJ7Ok51K60j56K43j20j50K30K45k00j51J98J29nl13K13k47K18k25
6073a01m8J79j1p8K53k36L40m18j43M28k58L11j57O3k36P4J38o1%l2j85K44o5
6096AJ5k1P7k77p3O70n25L07j06j18J04K2k48L73m14M1J87j76L05j26K49k33j47
6119a13J47L84n10J94n1J04p5J01k82j13L73j16j17J02J01k22P0l2Qj4k8RL14
6142B34j34m00L99P6j95N3k49j4J45J29M1j18J7Oj73Q5m1J0L38o8l91L27o8K2
6166C1R4J23k27k30K03l0l69O10l71J61Q2K08j51k84j4n5N02n25L07j44K54l0
6188A45j33J54k31K47j09P8j46j05M1J25J19j26M7Q5j82q0O2O5J80j35j5l43P8
6211a79P0kL18Q1l41r3K25Q1k16J3p5J29k10J25p6J21M3J26o0j2P4k12K05J2j48
$$ y = [-67, 49, -43, -42, -25, -19, -270, -10, -166, 77, -43, -193, 37, 282, 82, -69, 129, 258, 253, -60, 153, -94, 124, -101, -149, 30, 19, -59, 194, -42, 298, -120, -263, 165, -93, 218, 61, 124, -112, -38, 100, 39, 39, 7, -178, 66, 1, 16, -5, 72, -205, -278, 392, -133, 174, 68, -50, 54, 76, -172, 201, -213, -172, 15, -161, 144, 18, 267, 34, -113, 34, 418, -92, 102, 51, 155, 80, 181, -101, -214, 159, 43, -74, 28, 129, -93, -23, -55, -47, -61, -89, -80, 234, 100, -300, 99, 175, -20, 33, -216, -230, -85, 44, 85, -33, -16, -10, -183, -98, -139, -129, 209, 141, -250, 77, 9, 31, 125, 248, 21, -209, -6, -36, -405, 205, -166, -5, 77, 285, 134, -150, -164, -219, 283, -242, 65, -79, 175, 145, 12, 166, -65, 182, 73, 151, 5, -100, -59, 66, 185, 59, 106, 191, 9, -71, -9, 56, 236, 101, 86, -257, -179, -109, -111, 207, 288, -53, -146, 79, 160, -56, -43, -118, 11, -199, -74, -150, -29, 14, 140, 80, 68, 142, -70, 135, 147, -1]
6236ak23J92J54k03q9L0K97l17R6M37m40J84K5k75j76L05q5r8K29k01L01j01K30
6259B71l23oK44j75N3JK5l88K15J94j54J07m11J30L97k70L10m58m6J41k6K71O5
6282A67j40L3l21K7K05J49j36L35k39Ko9O7r5j35J52J06k60O9O1j7P6%m8oN8O0
6308A01k1J37m59P6N9J2M6K63j08J66k23l4K18k11K9O8mJ0m20J52L55k19JMj73
6333a75K29K46j39m0j69O3J77j79k15N1L79l46J92j2j43k52K43J47P0n32L37J40
6355G2K75m66N3j99K28J21m4M0l2k47K88O6l27M7M3j00M85o4j10l42j11M05j76
6378i5L47k68j62J87ro9m2j92N32j96N2J46k68KJ85k8j10o8K0J63o4k35J59J3
6402@J14k6Q1k13L39k28K17m57J59n1k6M8k7Q0L66j57m6j50r9N3K6mj96J11l20
$$ y = [-1, -224, -32, 122, -81, -170, -140, 157, -160, -64, 373, -67, 117, 142, -133, -309, -4, -89, -187, 42, -159, 142, 41, 271, -52, -58, 186, 11, 64, 65, 90, -298, -83, 111, -43, 64, -347, -217, 180, -90, 220, -238, -284, -143, -169, 102, 167, 27, 60, -261, -234, -29, 120, -16, 319, 80, 82, 13, 80, -15, -150, 2, 108, -152, -83, -22, -39, 37, 37, -11, -17, 41, 101, 80, 217, -242, -166, -107, -95, -49, 214, 106, 272, 49, 15, 233, 22, 51, 119, 115, 125, -295, -143, 212, -7, -6, -2, -175, 54, 300, 161, 121, -48, 15, 192, 13, -202, -151, 228, -118, 74, 62, -81, -333, -90, 57, 127, -405, -68, 72, 347, -119, -66, -265, -37, 84, 40, 80, 48, -199, 89, 155, -172, -125, -82, -182, 303, 239, 129, -213, -324, 81, -95, 252, -16, -178, 9, 0, -69, -111, -303, 229, 33, 85, 231, -37, -35, 150, 122, 12, -56, -36, 127, 63, -172, -13, 0, 114, 88, 169, -44, 295, 67, 284, -173, -14, -65, -91, -43, -70, 10, 376, 219, 173, 23, -76, -23, 3, -1, -197, -86, -406]
6427d06J94J01M8nm2p5J86J61l3m30L17L3k09j34L99k28J28n8J45l46M72j27O4
6450A55k19K72m27K54N1P2n5j80j99J56L64j78r7J17l96J58K75j94J60k45K02
6471D6K6K40l20JJ37j62j57P4Q6j51Q9J03p2k1r2M8Q0K83j61J7J56k81K34r5o1
6496D7J24P6j76r6RJ10p7k80j5P3L80J6J0j18r9j23K43k39K05K9J40j93K2j33
6520f5J04j15m8k7Q9J78q7J18m0m47M09l6L6j05L7j01P2j03Q9l16L32j13P1K46
6544A78j09nk59L63q0lJ5j26MK19l1n3j81QK51j78k14J32J90Qr0j38j44K95p9
$$ y = [-406, -212, -111, -63, -68, -110, -185, 1, 162, 129, -301, 16, 49, -160, -294, 105, -123, 5, -53, 92, -254, 218, 91, 155, -64, 208, -219, 35, 86, 158, 103, -77, -276, -120, 244, 66, -31, 86, -310, -152, 123, -71, 89, -156, 46, 72, 312, -8, -7, 130, -32, -189, -115, -29, -180, -91, 12, -60, -81, -173, -125, -45, 238, 77, 94, 250, -31, 203, 108, 47, 171, 247, 71, -25, -16, 94, 17, -263, -278, -205, 175, 191, 201, 83, -16, -139, 104, -135, 70, 99, 239, 46, 68, -65, 39, -76, -124, -151, -62, 116, 29, 147, 107, -340, 69, 33, 69, -36, 1, -100, -28, -131, -42, -358, -26, -139, -68, 178, 69, 64, -195, 168, 88, 85, 100, -26, -22, 197, 166, 113, -68, -60, 191, 13, -201, -69, 121, 129, 39, -99, -243, 52, -27]
$$ [...]
8191G
##END NTUPLES=NMR FID
##END=
