##TITLE=1H_DE_11_krTFA
 DMSO-d6
 8 sc, 
 31.8.2023
##JCAMPDX= 6.0         $$ Bruker NMR JCAMP-DX V2.0
##DATA TYPE= NMR FID
##DATA CLASS= NTUPLES
##ORIGIN= UXNMR, Bruker Analytische Messtechnik GmbH
##OWNER= root
$$ XWIN-NMR		Version 3.5
$$ Thu Aug 31 14:40:54 2023 Russian Standard Time (UT+4h)  she@DPX200
##.OBSERVE FREQUENCY= 200.13135
##.OBSERVE NUCLEUS= ^1H
##.DELAY= (6, 6)
##.ACQUISITION MODE= SIMULTANEOUS
##.ACQUISITION SCHEME= undefined
##.AVERAGES= 8
##.DIGITISER RES= 18
##SPECTROMETER/DATA SYSTEM= spect
##.PULSE SEQUENCE= zg30
##.SOLVENT NAME= DMSO
##.SHIFT REFERENCE= (INTERNAL, DMSO, 0, 15.7039)
##AUDIT TRAIL= $$ (NUMBER, WHEN, WHO, WHERE, WHAT)
$$ ##TITLE= Audit trail, XWIN-NMR		Version 3.5
$$ ##JCAMPDX= 5.01
$$ ##ORIGIN= Bruker BioSpin GmbH
$$ ##OWNER= she
$$ F:/spectra/data/she/nmr/H-F/1/audita.txt
$$ ##AUDIT TRAIL=  $$ (NUMBER, WHEN, WHO, WHERE, WHAT)
(   1,<2023-08-31 14:39:50.85 +0400>,<she>,<DPX200>,
      <created by zg, POWCHK disabled, PULCHK disabled
       configuration hash MD5:
       00 E9 B6 7A A2 85 ED C7 34 08 36 98 17 FE 4E 26
       data hash MD5: 16K
       3C 34 12 78 EB 99 55 32 59 BB 7D 1A B1 04 94 47>)
$$ ##END=
$$ 
$$ hash MD5
$$ DF AA 9C A6 8E A1 EA 7E 8E 31 5B 8E 75 26 37 14
##$RELAX= 
##$RELAX= 
##$RELAX= 
##$RELAX= 
##$RELAX= 
##$RELAX= 
$$ Bruker specific parameters
$$ --------------------------
##$DU= <F:/spectra>
##$EXPNO= 1
##$NAME= <H-F>
##$PROCNO= 1
##$TYPE= <nmr>
##$USER= <she>
##$AMP= (0..31)
100 100 100 100 100 100 100 100 100 100 100 100 100 100 100 100 100 100 
100 100 100 100 100 100 100 100 100 100 100 100 100 100 
##$AQSEQ= 0
##$AQ_mod= 1
##$AUNM= <au_zg>
##$AUTOPOS= <>
##$BF1= 200.13
##$BF2= 200.13
##$BF3= 200.13
##$BF4= 200.13
##$BF5= 200.13
##$BF6= 200.13
##$BF7= 200.13
##$BF8= 200.13
##$BYTORDA= 1
##$CFDGTYP= 0
##$CFRGTYP= 5
##$CHEMSTR= <none>
##$CNST= (0..31)
1 1 145 1 1 1 1 1 1 1 1 1 1 1 1 1 1 1 1 1 1 1 1 1 1 1 1 1 1 1 1 1 
##$CPDPRG= <>
##$CPDPRG1= <>
##$CPDPRG2= <>
##$CPDPRG3= <>
##$CPDPRG4= <mlev>
##$CPDPRG5= <mlev>
##$CPDPRG6= <mlev>
##$CPDPRG7= <mlev>
##$CPDPRG8= <mlev>
##$CPDPRGB= <>
##$CPDPRGT= <>
##$D= (0..31)
0 1.2 0 0 0 0 0 0 0 0.06 0 0.03 0 0 0 0 0.0002 0 0 0 0 0 0 0 0 0 0 0 0 
0 0 0 
##$DATE= 1693478390
##$DBL= (0..7)
120 120 120 120 120 120 120 120 
##$DBP= (0..7)
150 150 150 150 150 150 150 150 
##$DBP07= 0
##$DBPNAM0= <>
##$DBPNAM1= <>
##$DBPNAM2= <>
##$DBPNAM3= <>
##$DBPNAM4= <>
##$DBPNAM5= <>
##$DBPNAM6= <>
##$DBPNAM7= <>
##$DBPOAL= (0..7)
0.5 0.5 0.5 0.5 0.5 0.5 0.5 0.5 
##$DBPOFFS= (0..7)
0 0 0 0 0 0 0 0 
##$DE= 6
##$DECBNUC= <off>
##$DECIM= 32
##$DECNUC= <off>
##$DECSTAT= 4
##$DIGMOD= 1
##$DIGTYP= 9
##$DL= (0..7)
0 120 120 120 120 120 120 120 
##$DP= (0..7)
150 150 150 150 150 150 150 150 
##$DP07= 0
##$DPNAME0= <>
##$DPNAME1= <>
##$DPNAME2= <>
##$DPNAME3= <>
##$DPNAME4= <>
##$DPNAME5= <>
##$DPNAME6= <>
##$DPNAME7= <>
##$DPOAL= (0..7)
0.5 0.5 0.5 0.5 0.5 0.5 0.5 0.5 
##$DPOFFS= (0..7)
0 0 0 0 0 0 0 0 
##$DQDMODE= 0
##$DR= 18
##$DS= 0
##$DSLIST= <SSSSSSSSSSSSSSS>
$$ [...]
##$SUBNAM2= <"">
##$SUBNAM3= <"">
##$SUBNAM4= <"">
##$SUBNAM5= <"">
##$SUBNAM6= <"">
##$SUBNAM7= <"">
##$SUBNAM8= <"">
##$SUBNAM9= <"">
##$SW= 18.05172834244
##$SWIBOX= (0..15)
0 0 2 0 0 0 0 0 0 0 0 0 0 0 0 0 
##$SW_h= 3612.71676300578
##$TD= 16384
##$TD0= 1
##$TE= 0
##$TE2= 300
##$TE3= 300
##$TEG= 300
##$TL= (0..7)
0 120 120 120 120 120 120 120 
##$TP= (0..7)
150 150 150 150 150 150 150 150 
##$TP07= 0
##$TPNAME0= <>
##$TPNAME1= <>
##$TPNAME2= <>
##$TPNAME3= <>
##$TPNAME4= <>
##$TPNAME5= <>
##$TPNAME6= <>
##$TPNAME7= <>
##$TPOAL= (0..7)
0.5 0.5 0.5 0.5 0.5 0.5 0.5 0.5 
##$TPOFFS= (0..7)
0 0 0 0 0 0 0 0 
##$TUNHIN= 0
##$TUNHOUT= 0
##$TUNXOUT= 0
##$USERA1= <user>
##$USERA2= <user>
##$USERA3= <user>
##$USERA4= <user>
##$USERA5= <user>
##$V9= 5
##$VALIST= <valist>
##$VCLIST= <CCCCCCCCCCCCCCC>
##$VD= 0
##$VDLIST= <DDDDDDDDDDDDDDD>
##$VPLIST= <PPPPPPPPPPPPPPP>
##$VTLIST= <TTTTTTTTTTTTTTT>
##$WBST= 1024
##$WBSW= 4
##$XGAIN= (0..3)
0 0 0 0 
##$XL= 0
##$YL= 0
##$YMAX_a= 120772
##$YMIN_a= -188892
##$ZGOPTNS= <>
##$ZL1= 120
##$ZL2= 120
##$ZL3= 120
##$ZL4= 120
##$ABSF1= 10
##$ABSF2= 0
##$ABSG= 5
##$ABSL= 3
##$ALPHA= 0
##$AQORDER= 0
##$ASSFAC= 0
##$ASSFACI= 0
##$ASSFACX= 0
##$ASSWID= 0
##$AUNMP= <proc_1d>
##$AZFE= 0.1
##$AZFW= 0.1
##$BCFW= 1
##$BC_mod= 2
##$BYTORDP= 1
##$COROFFS= 0
##$CY= 11.3945322036743
##$DATMOD= 1
##$DC= 2
##$DFILT= <>
##$DTYPP= 0
##$F1P= 15.7292609196834
##$F2P= 12.9074282941183
##$FCOR= 0.5
##$FTSIZE= 0
##$FT_mod= 4
##$GAMMA= 1
##$GB= 0.15
##$INTBC= 1
##$INTSCL= 1
##$ISEN= 128
##$LB= 0.24
##$LEV0= 0
##$LPBIN= 0
##$MAXI= 10000
##$MC2= 0
##$MEAN= 0
##$ME_mod= 0
##$MI= 1.114404
##$NCOEF= 0
##$NC_proc= 0
##$NLEV= 6
##$NOISF1= 3.799351
##$NOISF2= 2.8
##$NSP= 1
##$NTH_PI= 0
##$NZP= 0
##$OFFSET= 15.70392
##$PC= 1
##$PHC0= -21049.8
##$PHC1= 12.05272
##$PH_mod= 1
##$PKNL= yes
##$PPARMOD= 0
##$PSCAL= 0
##$PSIGN= 0
##$REVERSE= no
##$SF= 200.130013532006
##$SI= 16384
##$SIGF1= 3
##$SIGF2= 2
##$SINO= 400
##$SIOLD= 16384
##$SREGLST= <1H.CDCl3>
##$SSB= 0
##$STSI= 0
##$STSR= 0
##$SW_p= 3612.71676300578
##$SYMM= 0
##$S_DEV= 0
##$TDeff= 0
##$TDoff= 0
##$TI= <>
##$TILT= no
##$TM1= 0
##$TM2= 0
##$TOPLEV= 0
##$USERP1= <user>
##$USERP2= <user>
##$USERP3= <user>
##$USERP4= <user>
##$USERP5= <user>
##$WDW= 1
##$XDIM= 8192
##$YMAX_p= 0
##$YMIN_p= 0
$$ End of Bruker specific parameters
$$ ---------------------------------
##NTUPLES= NMR FID
##VAR_NAME=  TIME,          FID/REAL,        FID/IMAG
##SYMBOL=    X,             R,               I
##VAR_TYPE=  INDEPENDENT,   DEPENDENT,       DEPENDENT
##VAR_FORM=  AFFN,          ASDF,            ASDF
##VAR_DIM=   8192,          8192,            8192
##UNITS=     SECONDS,       ARBITRARY UNITS, ARBITRARY UNITS
##FACTOR=    0.0002768,     1,               1
##FIRST=     0,             0,               0
##LAST=      2.2672688,     0,               0
##MIN=       0,             -188892,         0
##MAX=       2.2672688,     120772,          0
$$ Real data points
##PAGE= N=1
##DATA TABLE= (X++(R..R)), XYDATA
$$ [...]
1744B68k36j05M1J50j23PJ81j97J02O4k07L6J60k72M75n24O2J10n2K00k08J02
$$ 268 32 -73 -32 118 -5 2 183 -14 88 152 -55 -19 141 -131 344 -180 -118 -8 -60 140 -68 34
1766C4pQ4n08M91M4j22J85j39K4l17K13k9R3l49L29N6j59K80o4j78Q1J25l34J75
$$ 34 27 111 -397 94 138 16 201 62 86 -231 -18 -47 46 -303 26 82 -77 203 139 -39 42 167 -167 8
1790HJ0J51n0j44K1O2j46K19k1j76M4J2j54J80j9j17l6K39q6j96M86j15k71J73
$$ 8 18 169 119 -25 -4 58 -88 131 110 -66 -22 -10 -164 16 -3 -120 -156 83 -3 -199 287 172 -99 74
1814G4k71M36k75j51J96K9j09J58o0l8J12J25k84k24M46j77q3R6M4l8K18l55M03
$$ 74 -197 239 -36 -187 9 38 -71 87 27 -11 101 226 -58 -282 164 -13 -96 0 44 6 224 -131 272
1837B72j72o2K00m4j50j21n1j33K98l59L99J12p3m15K74P4J20l39J19K03j84P3
$$ 272 100 38 238 194 44 -77 -128 -261 37 -322 77 189 116 -299 -25 49 169 -170 -51 152 -32 41
1859D1j42P8QK99l41k4K55j54NRJ65r2j60l9K38l03K73o5j37Lo9K05KK49n24J44
$$ 41 -101 -23 -15 284 -57 -81 174 20 25 34 199 107 -53 -92 146 -157 116 51 -86 -83 -152 53 55 304 -220 -76
1885g6l2K75j99j5j0J4l1M6J95j53KJ11k91Q4j34K82pj27k4P5j02K23j6Q4k13
$$ -76 -108 167 -32 -47 -57 -43 -74 -28 167 14 16 127 -164 -80 -214 68 61 -66 -90 -15 -117 106 90 174 -39
1910c9M3j87K53Q6k94K39k82J91j37L81N9k34o1j77Q8J11K07j69j50R1K9o6o7
$$ -39 4 -183 70 156 -138 101 -181 10 -127 254 313 79 18 -159 -71 40 247 78 -72 19 48 -18 -85
1933h5O8J82k71L8Ll6J07K8j51J01j46K89j36K3L3p2Q0k5m5K58l17R0QJ19k01
$$ -85 -17 165 -106 -68 -65 -101 6 34 -117 -16 -162 127 -9 14 47 -25 55 30 -15 243 -74 16 24 143 -58
1958e8K9o7o4K79j74j58M25l20O7J00j99K33j32J31j03jo2K07L6j34j1j09l4m9
$$ -58 -29 -96 -160 119 -55 -213 212 -108 -41 59 -140 93 -39 92 -11 -12 -74 133 169 35 24 -85 -119 -168
1982a68K9L36p9p2k16L92j72k1Q4j65J92m31L01N5j59L40l09Nk15L64k70J67r6
$$ -168 -139 197 118 46 -170 222 50 29 113 -52 140 -291 10 65 -94 246 -63 -58 -273 91 -179 -12 -108
2005a08M2M01l33N3J53l38M54m42r8J7K33k99J71K97l28J64q5Q8l21L02Qm4j63
$$ -108 -66 335 2 55 208 -130 324 -118 -216 -199 34 -265 -94 203 -125 39 -46 42 -279 23 31 -13 -176
2028a76J94j8l3J50l95K40p4J97l53K09p5K07q0j00J07J74j80o1J89L4k59J67
$$ -176 18 0 -33 117 -278 -38 -112 85 -268 -59 -134 73 -7 -107 0 174 -6 -67 122 156 -103 64
2050F4K52l38M7k2j09p1K56m0j33K67j92N3K6k11L32k18k39L61q8J9k17P4J6j8
$$ 64 316 -22 25 3 -106 -177 79 39 -94 173 -19 34 60 -151 181 -37 -276 85 -3 16 -201 -127 -111 -129
2074a29L44l9j16J13j26j44J60r7N3j56N2R8j35o1O8K65j17n3j13O7L0J00n5l
$$ -129 215 176 60 173 47 -97 63 -34 19 -137 -85 13 -122 -183 -115 150 33 -20 -133 -66 -36 64 9 6
2098FM08l73j75K24J6k97L28l33L04j71J11j70K45Lk62J41o9q7J93n4J28m49K65
$$ 6 414 41 -134 90 106 -191 137 -196 108 -63 48 -122 123 126 -136 5 -64 -151 42 -12 116 -333 -68
2121f8J61J3k87O2L7J60Q3j69j86N2J66Q8k06o9K05K0j40k8l7J37j5K46l13oK15
$$ -68 93 106 -181 -119 -82 78 161 -8 -194 -142 24 112 -94 -163 42 62 -78 -106 -143 -6 -21 225 -88 -94 121
2146A21j18j77K6P5j9J98j99R5N2P9j68K27k11N7pj78J99j81j9PJ44J35j75K15
$$ 121 3 -174 -148 -73 -92 106 -93 2 54 133 -35 192 -19 38 31 -147 52 -129 -148 -141 3 138 -37 178
2170A78k99K64k58K96o9j80j0J69J5j96k04L35Q3j72J03q6o8j36K04J63l00M91
$$ 178 -121 143 -115 181 112 -68 -78 91 106 -90 -294 41 124 -48 55 -31 -99 -235 -31 132 -168 323
2192C23l46J94r6k17O0Q2j33L70m86J59J02Mn5J16o8j7J41L2k71J13m1j3p4m3
$$ 323 -23 171 75 -142 -82 0 -133 237 -249 -90 12 16 -39 77 9 -8 133 165 -106 7 -34 -47 -121 -164
2216a64L7L83k70O1r3mk01K95J39j17n5l05K46J55q1l73J03K57J67k03M6j35J72
$$ -164 -127 256 -14 47 -46 -50 -251 44 183 66 11 -294 -48 107 26 -347 -244 13 180 -23 23 -112 60
2239F0j33L72m34K54j51l0O3K70j61r6K7m5N0K8K4j88J32lj56K08L5k41K41N2
$$ 60 -73 299 -135 119 -32 -62 1 271 110 14 41 -4 46 74 98 -90 42 39 -117 91 126 -115 126 178
2263A78m8nJo9j17K06j64p1K09k57K66j08n7K32j8j54k02LK19q1K2K07k92K54
$$ 178 130 125 126 57 -60 146 -18 -89 120 -137 129 21 -36 196 178 24 -178 -175 44 -37 -15 192 -100 154
2287A54l23K27J06j84J05p3j71L31o06N01o3J7k8M5O4q7j57Q7j9J04k80L31k01
$$ 154 -169 58 164 -20 85 12 -159 172 -434 67 4 21 -7 38 102 15 -142 -55 -74 30 -250 81 -120
2310a20P3K79p3j47k8j33L00o5k0k23J75JL09l35q3L00j73M3j91K99k55M0j14
$$ -120 -47 232 159 12 -16 -149 151 86 66 -157 18 19 328 -7 -90 210 37 80 -111 188 -67 -27 -141
2333a41k4J87k11K06p4j2J40j4n7j72J69j03K87j29j2J11J0k60j0j7j2J03M6o2
$$ -141 -165 22 -189 17 -57 -69 71 57 0 -172 -3 -106 181 52 40 151 161 -99 -109 -126 -138 -35 11 -51
2357e1L30k5l43R9r2K14J0K4j04k04J25j88K18k32L35k1j5j13m3N8J83r1j93j47
$$ -51 279 254 -89 10 -82 132 142 166 62 -142 -17 -205 13 -219 116 95 80 -33 -76 -18 165 74 -119 -266
2381b66N2J51K68o5J3j56q8J90K4rj47l3K6M1k6L7l30L11O8k65J12j58K79M3j16
$$ -266 -214 -63 205 140 153 -3 -91 99 123 114 -33 -66 -40 1 -25 12 -318 -7 61 -204 -92 -250 29 72 -44
2406d4J42j00n0J92j41l0J09m1o2p2K91mj61r6L5j29K62K35l26j65K63m4j55J88
$$ -44 98 -2 -52 140 -1 -31 78 37 -25 -97 194 190 29 -67 -32 -161 101 336 10 -155 108 64 -91 97
2430I7k07L0L6J36j78K18R9k83K07j43Mq4m9QL47m62jJ60J08n8kJ20k26K10k40
$$ 97 -110 -80 -44 92 -86 132 231 -52 155 12 16 -68 -117 -109 238 -224 -225 -65 43 -15 -17 103 -123 87 -153
2455a53R0O1l9J13j69J50m8M1N3q3q8K07l13J83J34k79M0r1J59J1k67N27l10J55
$$ -153 -63 -2 -41 72 -97 53 5 46 99 16 -72 135 -178 5 139 -140 -100 -191 -32 -21 -288 239 -71 84
2479H4Q3m2J01k40K78k32M0L1j16N9j26L1l3k9J54j24Q0J25k81J60K1j14K25j88
$$ 84 167 125 226 -14 264 32 72 103 -13 46 -80 -49 -82 -111 43 -81 -1 124 -157 3 24 -90 135 -53
2503e3o8p3K09R0J08K3j43l13O3P3K1K80n2p8o1Lj01j20L17k6j21K8l5Jr8m4R6
$$ -53 -121 -194 15 105 213 236 93 -220 -157 -84 -63 217 165 87 26 29 -72 -192 125 99 -22 6 -29 -28 -126 -170 -74
2530g4J28k52K36Kj18L10k82p2j26J35K79j83J87m4k6j41J6j6Pq1K16rr9j30m2
$$ -74 54 -198 38 40 -78 232 -50 -122 -248 -113 166 -17 170 126 100 -41 -25 -41 -34 -115 101 92 -7 -137 -179
2555a79J34p0J02J50R2m59J10N9J92j25q6P0j59L39m19K96j42R8j31RK39k85N7
$$ -179 -45 -115 -13 137 229 -230 -120 -61 131 6 -80 -10 -169 170 -249 47 -95 3 -128 -119 120 -165 -108
2578a08L90m91L99l02L15l32J98o6j39J76j33K72k43Q3l3O2j81K15J15j39o0r5
$$ -108 282 -209 190 -112 203 -129 69 3 -136 40 -93 179 -64 19 -14 48 -133 82 197 58 -2 -97
2600i7L60o3J50m59J32Q3k9k1j00o1K58l5J43m68O9K33L5k04k09N09j56j64J3
$$ -97 263 200 350 -109 23 106 77 56 -44 -105 153 118 261 -207 -138 95 130 -74 -283 226 70 -94 -81
2623h1J69j86p5K3N1L00k82j4j37L81k37j6j63L07l36M46j15j47K68k00K15o2
$$ -81 88 -98 -173 -150 -99 201 -81 -95 -232 149 -88 -104 -267 40 -296 150 35 -112 156 -44 171 109
2645A09k67K53j73N0K2p0Q2R0o1k62L37k5j43k8L07k29n6L0q4J00J35K6k93j6
$$ 109 -158 95 -78 -28 -6 -76 6 96 35 -227 110 85 -58 -86 221 -8 -64 -34 -118 -18 117 143 -150 -166
2669a66J24J50j61J42j55K16k09J15r3J50l65k1K08MK27j54J79j82n7J38l49K23
$$ -166 -42 108 -53 89 -66 150 -59 56 -37 113 -252 -273 -65 -61 166 12 191 9 -48 90 -259 -36
2691c6J75k26j4O1j3Q4j65J00O6r7Q7J03K69m97%l3K10J33j17j32L0j64Q1R1M5
$$ -36 139 -87 -101 -40 -53 31 -134 -34 32 -65 22 125 394 -103 -103 -136 74 207 90 -42 -12 -176 -95 -4 41
2716D1k06n0N63k84K7O9j24j16K60j22r4q9K95k06j44J27K01k32j4J14K26l69
$$ 41 -165 -215 348 64 91 160 36 -80 180 58 -36 -125 170 -36 -180 -53 148 -84 -98 16 242 -127
2738a27M20k45P8j44J0m3j62M07l2k4j32q9k01L05P9M2k76R3J81q8p5N2j23pl5
$$ -127 293 48 126 -18 -8 -51 -213 194 162 138 6 -83 -284 21 100 142 -134 -41 140 52 -23 29 -94 -101 -136
2763a36K35p6j32Om7N4J12j3Q4j75J93k9K34k57j54o2r4O2K18Q2l8p8m4L7p8J89
$$ -136 99 23 -109 -103 -150 -96 16 3 87 -88 105 76 310 53 -101 -163 -257 -195 23 105 67 -11 -55 -18 -96 93
2789I3j12m1n8P3P2j45J52k93M02j09k5p4J20j63J02Lj07K35j13J46J15m45J18
$$ 93 -19 -60 -118 -45 27 -118 34 -259 143 34 9 -65 55 -108 -6 -3 -110 125 12 158 273 -172 -54
2812e4J54r8m7J77j12k6J6J34o3R0k55K59j95K2K83m19J78n5N8j96K04n2j58Q8
$$ -54 100 2 -45 132 20 -6 10 144 81 171 -84 175 -20 2 285 -134 44 -11 47 -149 55 3 -155 -67
2836f7L7Q9k24K93l31L78m44J0K10Lj03J57j17j28J89O9J18m2Q4j28l6J04j10
$$ -67 -30 59 -165 128 -203 175 -269 -259 -49 -46 -149 8 -109 -237 -48 21 139 97 181 53 17 121 11
2859A1j67K73j04m2j61j0N31k61J78m74L99m18J88m7R1J27k65J65L2j59J16L6
$$ 11 -156 117 13 -29 -190 -200 331 70 248 -226 173 -245 -57 -104 -13 114 -151 14 46 -113 3 39
2881C9O4M1k57K55l02Q0J49P9l2Lj18J0q7M3J15j90J29q2j24L48m4j80J88q9j84
$$ 39 103 144 -113 142 -160 -80 69 148 116 119 1 11 -76 -33 82 -108 21 -61 -185 163 119 -61 127 38 -146
2906a46R2j0O2p6m6J6J34J83j25J5k58J17j34M69k69m0o9K13j27r9J0l16N32k87
$$ -146 -54 -64 -2 -78 -124 -108 26 209 84 99 -159 -42 -176 293 24 -16 -85 128 1 -98 -88 -404 128 -159
2930a59J22L93m41K13k15Ol1J84q4m7m1pJ44M8%k12j0J61O0l03L27Q2L9j86M6
$$ -159 -37 356 -85 128 -87 -81 -112 72 -12 -59 -100 -107 37 85 85 -127 -137 24 84 -219 108 190 229 43 89
2955H9k86L3K89j13n7k8K8L5j74P0Mk64L42ol4j29L21j12j27l0K6M6J14J62k46
$$ 89 -197 -164 125 12 -45 -73 -45 -10 -184 -114 -110 -374 -32 -38 -72 -201 120 8 -119 -149 -123 -77 37 199 -47
2980d7J65l12J81rk15M76l36k0N7J5J36n1J1L4J12l91L20K5l83L96j76J13j18
$$ -47 118 -194 -13 -22 -237 239 -97 -117 -60 -45 91 40 51 85 197 -194 126 151 -232 164 -12 101 -17
3003a7j0L3j85L23j89R8p8k5p2l3J26K78j43J01p6j68K8p2O3J22k80P1L80l81
$$ -17 -27 6 -179 144 -45 53 -25 -50 -122 -155 -29 249 106 207 131 -37 -9 -81 -18 104 -176 -105 275 -106
3027a06K29j08k52J64qn5K46Ok40J82p3j0l5J33J64m56P2L54k85k34K80q9J03
$$ -106 123 15 -237 -73 -81 -136 110 116 -124 58 -15 -25 -60 73 237 -219 -147 207 -78 -312 -32 -121 -18
3050a8l3j67K64j67K00Q6j95J6lJ62k58J22M8Q0j74O3j1J02p0K03k93K9N6q7r3
$$ -18 -51 -218 46 -121 79 165 -30 -14 -17 145 -113 9 57 137 -37 26 15 117 47 250 -43 -14 42 -45 -138
3075a38R1K77j98r3J47j33R4k69R8M8J50m10N36n8Mm1k5Om17N31k05o8K68l08
$$ -138 -47 230 32 -61 86 -47 47 -222 -124 -76 74 -336 200 142 146 105 80 86 -331 200 -5 -73 195 -113
3099a13L66k19j82N9K8J06J55r2k39J97j73K78l03R9N9j65QJ96J18j40J00l17
$$ -113 253 34 -148 -89 -61 45 200 108 -131 66 -107 171 -132 -33 26 -139 -131 65 183 43 143 -174
3121a74o7K57q7K3l7K68j33q7K18l41q5M68k52j21j2M29j31j62J29k25Q0J57k38
$$ -174 -241 16 -71 -48 -85 183 50 -37 181 -160 -245 223 -29 -150 -162 267 136 -26 103 -122 -42 115 -123
3144a23J79J23l74O8L07j65l6K36k12J75j45j87K70L1k88N8K61q1q9O8j69J31
$$ -123 56 179 -195 -127 180 15 -21 215 3 178 33 -154 116 147 -141 -83 178 97 8 76 -93 38
3166C8n5j49K76m3l88L11lR5pJ9M0l6n7k34P4L80l43O8j57K35j56Q8J7j1m9M0
$$ 38 -17 -166 110 67 -321 -10 -13 82 75 94 134 98 41 -193 -119 261 -82 -14 -171 64 -92 -4 13 2 -47 -7
3192gP9j36K74j38m4j06N3M3L21l53j14J66j71R3J64j03p7J06j05J96k33K60j90
$$ -7 72 -64 210 72 28 -78 -25 18 339 -14 -128 38 -133 -40 124 21 -56 50 -55 141 -92 168 -22
3215b2M7jj09K30k86J14K02k84l9L59k62J6J77L9j56K02k33J92k74q8J19j45N40
$$ -22 25 24 -85 145 -141 -27 175 -109 -148 211 -51 -35 142 181 25 227 -6 186 -88 -176 -57 -202 338
3238C38m1l82J1O9P1k6K08l72K44m0j05l01L60J87k37k9j59J69j73L01k03j77
$$ 338 297 -85 -74 -5 66 40 248 -124 120 80 -25 -326 34 221 -16 -45 -204 -35 -208 93 -110 -287
3260b87J3K19N6O7r5Nk58K08L5o0k6K55j73k04P5O4N4O1J28N7l59K84k15L33j71
$$ -287 -274 -55 1 68 -27 -22 -280 -72 -37 -97 -123 132 -41 -245 -170 -106 -52 9 137 194 -165 119 -96 237 66
3285F6j82K18l1j8p9k1O8N0j77M9J36J3L0k90l2J12J51j95J26J19MJ6k12J19k0
$$ 66 -116 102 71 53 -26 -47 21 71 -106 -57 79 92 122 -168 -200 -88 63 -132 -6 113 117 133 -79 40 20
3310B0k25L71k52j34L35k08J84k09M4J20J50J19j77k50J00K55l24L7J30j50q8
$$ 20 -205 166 -86 -220 115 -93 91 -118 -74 46 196 315 138 -112 -12 243 -81 -44 86 -64 -152
3331a52K17J11O9k74m5M5R5K5l08J65M7j30K49m54N81l81R0j69J74j58j8L17k12
$$ -152 65 176 245 -29 -74 -29 66 91 -217 -52 -5 -135 114 -340 241 -140 -50 -219 -45 -203 -221 96 -116
3354a16J15k12L52q9J6P9j45N2R8j53o6j97M95j55K9N2j74j44l3K33j7J29j93
$$ -116 -1 -213 139 50 66 145 0 52 150 -3 -69 -266 229 74 103 155 -19 -163 -196 37 20 149 -44
3377d4K54j78P7k09K4K19j98J22k98J49K59j08j92L6L2Q3k28L00j52J21j51O7
$$ -44 210 32 109 -100 -76 143 -55 67 -231 -82 177 69 -123 -87 -55 28 -200 100 -52 69 -82 -15
3399a5M6j96K41j62l5L12M0q0l20L1K86j26o8J82j41J94r6m5k4j13q3J5L43n9
$$ -15 31 -165 76 -86 -121 191 231 151 -169 -138 148 22 -46 136 -5 189 93 48 24 -89 -172 -157 186 127
3423A27j22p8mJ81k35J38JLJ94k61J14nJo3J77n9l47K14P8J2l9p0L4O3j3J24k50
$$ 127 5 -73 -77 104 -131 7 8 11 205 -56 58 53 54 -9 168 109 -238 -24 54 66 27 -43 -9 54 41 165 -85
3450h5K84o3J2l7Km9k5L7k5Q0N7O9j72j67R4l8J44j00k59J75J11j1j02lj18M1
$$ -85 199 136 148 111 113 64 39 76 51 131 188 257 85 -82 12 -26 118 18 -241 -66 45 34 -68 -71 -189 -148
3476a48K97k76J98k04j8K85k30K04l46Q1LO1J24k32J26M8J3j4O2Mq6m5L9J25j67
$$ -148 149 -127 71 -133 -151 134 -96 108 -238 -157 -154 -93 31 -201 -75 -27 -14 -28 34 38 -48 -93 -54 71 -96
3501i6j07L31j85j41J28K44j87L5j70P9L3J63l31L45k19J46k92O5J42j01J16K5
$$ -96 -203 128 -57 -198 -70 174 -13 22 -148 -69 -36 127 -204 141 -78 68 -224 -159 -17 -118 -2 23
3523B3M1j42q3K68j41k9R0Q0Q3L7j12k19l8j09L86q9m3m5Q4k0o1qJ90j44K42l25
$$ 23 64 -78 -161 107 -34 -63 27 107 190 227 115 -104 -142 -251 135 46 3 -42 42 22 -39 -47 143 -1 241 -84
3549h4O9q1K69j87J44k3J48k46j07Q5j66J83k57RQ7j20K40j85J96j3j8J10j10
$$ -84 -15 -96 173 -14 130 107 255 9 -98 -13 -179 4 -253 -244 -157 -277 -37 -222 -26 -39 -57 53 -57
3572e7J73N2l47K88k58L71q5j18k34K07j59J90l6k69M65m00J86k73K71R7m9r1
$$ -57 116 168 -179 109 -149 222 137 19 -215 -8 -167 23 -13 -282 183 -217 -31 -304 -33 64 15 -76
3594g6Q9J05K0j39k9J1O6k72K60n6j05J29L3K1J65m06K13m4J24r3J51m8rO2j00
$$ -76 13 118 138 -1 -30 -19 47 -225 35 -21 -126 3 36 57 222 -184 29 -15 109 16 167 119 110 172 72
3619G2j76J16p9J86k12N1j07n2N5J56j19J13j39K16Mm15K11J8K06K63k25q2Q8
$$ 72 -104 12 -67 119 -93 -42 -149 -201 -146 10 -109 4 -135 81 85 -330 -119 -101 105 368 143 61 149
3642A49o3m0k01M8K28j58p7J64r7K11j44j12k06J80Q8Rj39K48j3j36K44p1j82
$$ 149 86 46 -155 -107 121 -37 -114 50 -47 164 20 -92 -298 -118 -30 -21 -160 88 75 -61 183 112 -70
3665g0J99j02J5l3L4j08j60M23j81M6J15k96J3J46k08L12k47j4R8J35j29j66J37
$$ -70 129 27 42 9 43 -65 -225 198 17 63 178 -118 -105 41 -167 145 -102 -116 -18 117 -12 -178 -41
3688d1L7J7n6p4J50j21O5j43K22r8j06K88j47j36J49j26m4J67J40j28j5q5NJ03
$$ -41 -4 13 -43 -117 33 -88 -23 -166 56 -42 -148 140 -7 -143 6 -120 -164 3 143 15 0 -85 -80 23
3712B3j22J03k3k24L04N8j24j41P2K15j89K38l8j55K09k6j86k01K27N5j54J23
$$ 23 -99 4 -19 -243 61 119 -5 -146 -74 141 -48 190 152 -3 206 180 -6 -207 20 75 -79 44
3734D4k9q4K47o2m9m4O8k55J05J48k1j2K10Rl16J56k09K42k80J01J53J9k18O1
$$ 44 15 -69 178 116 67 23 91 -164 -59 89 68 56 266 275 -41 115 -94 148 -132 -31 122 141 -77 -16
3758a6M1j57P1p1K12j8k17K91p1j91J76K83m64K67k33K0J36J8L6k78J19p4Q8K47
$$ -16 25 -132 -61 -132 80 62 -155 136 65 -126 50 333 -131 136 -97 -77 59 77 113 -165 -46 -120 -32 215
3782B15j00j55J21j9q9K24j59R2J3p5j04O3m8j73J4P9K14r3J15J19m23J94oP0
$$ 215 115 -40 81 62 -27 197 38 130 143 68 -36 27 -21 -194 -180 -101 113 20 135 254 -169 25 19 89
3806H9l51M56k56m5J00J06K9k63J24M2p0k4Rkp8K83p1j77N4K3R2l0K1n0J92k68
$$ 89 -262 194 -62 -107 -7 99 128 -135 -11 31 -39 -63 -54 -56 -134 149 78 -99 -45 -22 70 40 61 11 203 -65
3832f5m5M0J44J76k96L0k7Mk5Q2n0K77o8M1q1k23J88k5l66M42m2J0l52R6J23%
$$ -65 -110 -70 74 250 -46 -16 -43 -39 -64 18 -32 245 177 218 137 -86 102 77 -289 153 111 121 -231 -135 -12 -12
3858a2M1N5J53j88l9l2j72L66o5n6J26j67n3k23N02m17J78p9L03j87m3R6j98L96
$$ -12 29 84 237 49 10 -22 -194 172 107 51 177 10 -43 -266 236 -181 -3 -82 221 34 -9 87 -111 285
3882B85j85j05p7K04m2k09J04j29K64j47P0k52n6K64p8K48k86l2L9j23J51q0N4
$$ 285 100 -5 -82 122 80 -129 -25 -154 110 -37 33 -219 -275 -11 -89 159 -127 -159 -120 -243 -92 -172 -118
3905a18J11k0O3N6O3l10nN9k59O55k40l6K5j49K31j20k15J66r8J66n2J49j43n3
$$ -118 -7 -27 36 92 155 -155 -160 -101 -360 295 55 19 44 -105 126 6 -209 -43 -141 25 -27 122 -21 -74
3929g4P9j0j45p1N26k64J67l25L32k48j43LJ35k02M00j24j37m7J28N5J55%k48
$$ -74 5 -5 -150 -221 305 41 208 -117 215 -33 -176 -173 -38 -240 160 36 -101 -148 -20 35 190 190 -58
3952e8J61k07J54l1j3j93J37J41j6j98K0R8mK41k79j9M7O4L9k02j13L11J17k89
$$ -58 103 -104 50 19 6 -187 -50 91 75 -123 -103 -5 -9 232 -47 -66 -19 45 84 -118 -231 80 197 -92
3976i2M8J28l80K84J31j52Q4j4K2j95K22r7k10J25K03J27k85J2P9L9n7k75j2K01
$$ -92 -44 84 -296 -12 119 -33 51 37 59 -136 86 -11 -221 -96 107 234 -51 -39 40 79 22 -253 -265 -64
4000f4J72m3l6M7j32J14n2O1r9J43k97J19J23j11j26K03Q2o8j83J15m4r7J32l
$$ -64 108 65 29 76 -56 58 6 67 -32 111 -186 -67 56 -55 -181 22 104 36 -147 -32 -76 -173 -41 -44
4024d4N2k79K02M0J49Ol00K5J10L9k5K19o1j04q2J84j42Q1K36m06K97l25K5N4
$$ -44 8 -271 -69 -29 120 126 -174 -149 -39 0 -25 194 133 29 -53 131 -11 70 306 -100 197 -128 -103 -49
4048d9J10L0k07J53l12K68j32J50J57j66M75l75k38J70j46K7k49M7L17k4l0J6
$$ -49 61 91 -116 37 -275 -7 -139 11 168 2 477 102 -136 34 -112 -85 -334 -287 30 6 -24 -8
4070hJ35j99j30K58r4J92q5j09L0Q7k37N8O6R9r5P6j86K53N6o0m3j94O7j25L65
$$ -8 127 -72 -202 56 -38 154 69 -40 -10 77 -160 -102 -36 63 -32 44 -142 111 167 107 64 -130 -63 -188 177
4095A77J13l52J09J48n2j08k08Q4J80k73kJ27j7j13P3jL08j98n1q0qrR5p8J28
$$ 177 290 -62 47 195 143 35 -173 -89 91 -182 -184 -57 -74 -187 -114 -115 193 -5 -56 -136 -144 -153 -58 -136 -8
4120hnR0j25P6j9m8K4J67j89O2n0O1r5Q9k23M8O5N7K0k09J21K80j49j61j73K50
$$ -8 -13 77 -48 28 9 -39 -15 152 -37 25 -25 36 -59 30 -193 -145 -80 -23 -3 -212 -91 189 40 -121 -294 -44
4146d4J10K37k80k6k84K94j75p1J90J50j51P1j70J33p2K42J5j28m0lN9K07k35
$$ -44 66 303 23 -3 -287 7 -168 -239 -49 101 -50 21 -149 -16 -88 154 169 41 1 -2 57 264 29
4169B9k0j29O1J57q9L5j39K77K9l86p3K80k15Q4L18J19m66J17m5J48k91J61KP9
$$ 29 9 -120 -59 98 9 44 -95 182 211 -175 -248 32 -183 -99 219 338 -128 -11 -56 92 -199 -38 -36 43
4193D3k50L69o3k66R5rJ85j43o9r8M76m58N0M9K2jO7j12K41J02l68R8M3n1J78
$$ 43 -207 162 99 -167 -72 -81 104 -39 -108 -206 270 -188 -138 -89 -67 -68 -1 -113 128 230 -138 -40 3 -48 130
4218A30Qm85K66K33J8k42K59j78o8k1K75j76j82K16O2j18m1O5j42J62O5j06J25
$$ 130 138 -347 -81 152 170 -72 187 9 -59 -80 195 19 -163 53 115 -3 -44 21 -121 41 106 0 125
4241A25k06P1J05j66K54r3j70Q0j37M6N3J21j95K05m9p9l30K64K50j47J32J62
$$ 125 -81 -10 95 -71 183 90 -80 0 -137 -91 -38 83 -112 93 44 -35 -365 -101 149 2 134 296
4263B96j68k47K10j01P8J65k03M6k11N8J01o3n1J2J59k93L51k52Q7l7P2M1j39
$$ 296 128 -119 91 -10 68 233 30 76 -135 -77 24 -39 -90 -78 81 -212 139 -113 -26 -63 9 50 -89
4286h9J8n6J32j24L26o7j18m8o7n3K68j79O4J25k24K0J44k48L75L7l36mJ10Q9
$$ -89 -71 -127 5 -119 207 140 22 -26 -93 -146 122 -57 7 132 -92 -72 72 -176 199 236 -100 -104 6 95
4310I5j37N9J52k10R0j01o8K43j2j38jK16k34q7J58r0j25J77K7q8R5J12K1j69
$$ 95 -42 17 169 -41 49 -52 -120 123 111 -27 -28 188 -46 -133 25 -65 -190 -13 14 -74 21 133 154 -15
4334a5J5J6n2P4j5k4n4J44l04L45q4l3PM8n2n6KJ94j63Q2L5j67L4O3j06O8R3j14
$$ -15 0 16 -36 38 23 -1 -55 89 -215 130 46 13 20 68 16 -40 -38 156 -7 75 110 -57 -23 40 -66 2 95 -19
4362a9j99J28J64j82j7J77j34J04J5j45R3j52j12M49j85j41J34K00j70p6J9j11
$$ -19 -218 -90 74 -108 -125 52 -82 22 37 -108 -15 -167 -279 170 -15 -156 -22 178 8 -68 -49 -160
4384a60J65r2Q1k53J88K17k07kp1J94j67L0j36L16J02l40n3L3J00r6K7p9L45j17
$$ -160 5 -87 -6 -259 -71 146 -61 -63 -134 60 -107 -77 -213 103 205 -135 -188 -155 -55 -151 -124 -203 142 25
4408B5J16q6o5q2K20q8l9O8J9j06K6j65j78L94n2n5q4o0K39J06k57L73l25K67
$$ 25 141 55 -10 -92 128 40 1 69 88 -18 8 -157 -335 59 7 -48 -132 -192 47 153 -104 269 -56 211
4432B11k44L32k93j35K02R1j9j6O2j98Jp3J52j24l5J87j59M6n7P4j33K62k44K43
$$ 211 -33 299 6 -129 73 164 145 129 191 -7 -6 -79 73 -51 -86 101 -58 -12 -69 5 -128 134 -110 133
4456A33m2N%j16Q8l0p3j8k65J72Q5qP8j22J44L1j31K46k01j53J86P5j96J57L7
$$ 133 91 96 96 -20 68 38 -35 -53 -318 -146 -61 -69 9 -113 31 62 -69 177 -24 -177 9 84 -112 45 82
4481H2j61J25j14J74L83p18L16r3O2k21J22m1j57K27o3n5M7M8j79J61PK0k60L35
$$ 82 -79 46 -68 106 489 -229 87 -6 56 -165 -43 -84 -241 -14 -77 -132 -85 -37 -216 -55 -48 -28 -288 47
4505D7J33k63RP9N4q6R8R8l39QL50o2K0O7k84J11l33L80k1J7j01j37J18o2J72
$$ 47 180 -83 -74 5 59 -27 71 169 -170 -162 188 126 146 213 -71 40 -293 87 66 83 -18 -155 -37 -99 73
4530G3j0j40J12k9Pkk15K83j85P5J20j32m6n7K59j80K22k65Q7L6j54K07j80K01
$$ 73 63 -77 35 6 13 11 -204 79 -106 -31 89 -43 -89 -146 113 -67 155 -110 -23 13 -141 66 -114 87
4554H7j42j08J22k83L82m3J23p3J81k16m43N07j74J90N6j72o3K06k60Q2K11r5
$$ 87 -55 -163 -41 -324 58 15 138 65 246 30 -413 94 -80 110 166 -6 -69 137 -123 -41 170 75
4576G5j12J41J42j88m5L1k13J24j05J44n2k2K04l7k11K8J02j96m6K08J0m6K65
$$ 75 -37 104 246 58 13 44 -169 -45 -150 -6 -58 -80 124 87 -124 -96 6 -190 -236 -28 -18 -64 201
4599B01l69R0M4R7K03j35J45k28j64J88r8Q6n7j34J58P2j80J43O5p2l12K7K41
$$ 201 -168 -78 -34 63 266 131 276 48 -116 72 -26 60 3 -131 27 99 -81 62 127 55 -257 -230 11
4622A1rj74K01k55J62m3r7M7M43j48j91K59k35j3Q9K21l22J13L3m0o2j27L07l47
$$ 11 2 -172 29 -226 -64 -107 -204 -157 286 138 -53 206 -29 -42 47 268 -54 59 92 52 -10 -137 170 -177
4646a77O2N7j6q9J66J4J01j02n5j00m8L45l8j01j47Q3m7O8P6Q8nl1k34R2J49N9
$$ -177 -115 -58 -74 -163 3 17 118 16 -39 -139 -187 158 120 19 -128 -45 -92 -24 52 140 135 104 -130 -38 111 170
4672A70r4k04O1P3j27L65k69N1K85n56R1J9N0r0J66J11j79J04j1J67j86j56K4
$$ 170 76 -128 -67 6 -121 244 -25 26 311 -245 -154 -135 -85 -175 -9 102 -77 27 16 183 -3 -159 -135
4695a35K26Nk91K54n6N0j39J18J65k07l4L70k80k00L51k24K93j21j38k22J25p1
$$ -135 91 96 -195 59 3 53 -86 32 197 -10 -44 326 46 -154 197 -27 266 145 7 -215 -90 -161
4717a61L19k02J97j6p1l47O9J91q0M8J9J51j14N9q3M1r6qO7L3j18J80N5k22K47
$$ -161 158 -44 153 137 66 -281 -212 -21 -101 -53 -34 117 3 62 -21 20 -76 -84 -17 16 -102 78 133 -89 158
4742A58k28J80J18l31M0Q4K8Q5m2j41J73j92j6J40j92J31j52q9L72l61K68k28
$$ 158 -70 110 228 -103 -63 21 49 134 92 -49 124 -68 -84 56 -136 -5 -157 -246 126 -235 33 -195
4764a95J12J28p7L9Rj41L3m4J56J87p8m1j41r7J17K5J94k88KK08j67j6KP7Q9j5
$$ -195 -83 45 -32 7 16 -125 -92 -136 20 207 129 88 -53 -150 -33 -8 186 -102 -100 108 -59 -75 -73 4 93 78
4790G8j07q2M1J29qQ9J60l78N2k82K80K3p8J33l9p0j08L17j04j29K90k51J86l04
$$ 78 -29 -111 -70 59 51 140 300 -78 -26 -308 -28 -5 -83 50 11 -59 -167 150 46 -83 207 -44 142 -162
4814a62L59j24J7r6p0O4K7M3R4j27j14K72j19P5j68J29k8np3J84l81LO0K37j63
$$ -162 197 73 90 -6 -76 -12 15 58 152 25 -89 183 64 139 -29 100 72 67 -6 178 -203 -200 -140 97 -66
4839f6K71q1m5n7j34P4L04L0m23K26j64J62r7J2%J62k88J40j67K12l14M03J02
$$ -66 205 124 79 22 -112 -38 266 296 -127 99 -65 97 0 12 12 174 -114 26 -141 71 -243 160 262
4862B62k80p5N4mo8K46j12J60M7k85nP8j09K19jj23l00K22M7P1K37l59M3P7J03
$$ 262 -18 -93 -39 -43 -111 135 23 183 230 -55 -60 18 -91 128 127 4 -296 -74 -27 44 281 -78 -35 42 145
4887A45k03K99p6N4K6k79M9k1Q5m7kj86Q1j4K8K47qk18J33j75J38J13k83o9K38
$$ 145 -58 241 165 219 245 -34 15 -6 79 32 30 -156 -75 -89 -61 186 178 -40 93 -82 56 169 -114 -183 55
4912E5j86K19j96j59K54R2k38n4J62jL23k21l5j80L62k57k8J04jm5J0L14k61j98
$$ 55 -131 88 -108 -267 -13 79 -159 -213 -51 -52 271 50 15 -165 197 -60 -88 16 15 -30 -20 294 33 -165
4936a65L18q0J52k15j46M46k82K4N1j45j22L42k40P1k8k22L3K01K01k10J54k15
$$ -165 153 73 225 10 -136 310 28 52 103 -42 -164 178 -62 9 -19 -241 -208 -7 194 -16 138 -77
4958g7O2p5m1J03J87o9P0k30L1J81j49j5J6j6PJ40j08N7J0j09l2J49o1j37N6j20
$$ -77 -15 -90 -131 -28 159 90 160 -70 -39 142 -7 -22 -6 -22 -15 125 17 74 84 -25 -57 92 31 -106 -50 -170
4984a70K93M0k51j27K67j31M05k71q7K34l22J04o6J88j2j80j8J03P4l13K57J48
$$ -170 123 163 -88 -215 52 -79 326 55 -32 202 -120 -16 -82 106 94 -86 -104 -1 73 -240 17 165
5006A65j27R4j89j05L0k3K59m7n8k02R1j9M32l17Q8j64K01p9K50m01K03j24k05
$$ 165 38 132 -57 -162 -132 -155 104 57 -1 -203 -112 -131 301 -16 72 -92 109 30 280 -121 82 -42 -247
5029b47J69K51l08K19r6p9J67o0j53J07J91k55J96k39J26L7n4j67J09N1N7q4J25
$$ -247 -78 173 -135 84 -12 -91 76 16 -137 -30 161 -94 102 -137 -11 26 -28 -195 -86 -35 22 -62 63
5052F3j33N1P1l44J49J98j97J51m27L45MJ80J41L4k46l4k7J50j53n2Q4P6j80L4
$$ 63 -70 -19 52 -292 -143 55 -142 9 -418 -73 -69 111 252 286 40 6 -21 129 -24 -76 8 84 -96 -62
5076f2K3K19k55K69j49m4n6m4K28QrQ0k68J98l12K05p3j98L95r4J7J19j40M1K4
$$ -62 -39 180 -75 194 45 1 -55 -99 129 137 128 208 -60 138 -174 31 -42 -240 155 61 78 197 57 98 122
5101A22j37J11j71R3K2j52lJ77M3k63J40l5J50j9j65p2K60p1O8k25O0J2q1K05
$$ 122 -15 96 -75 18 40 -112 -115 62 105 -158 -18 -53 97 78 -87 -159 101 30 98 -127 -67 -55 -136 69
5125F9j43K44k75J72j22P1R9L0j20p4J63p7J01j29rk55M65k04J62J20m08J67k20
$$ 69 -74 170 -105 67 -55 16 115 145 25 -49 114 37 138 9 0 -255 210 6 168 288 -120 47 -173
5148a73K45k3l48J10J23n0n6J54q9J96L4N4j62J09q9j19K25j42Q3k0Q9Lj92K07
$$ -173 72 49 -299 -189 -66 -116 -172 -18 -107 89 123 177 15 124 35 -84 141 -1 82 62 151 154 -38 169
5172A69j1j60j62k3K21k33K31J24k70J79J05q2n6p1J51N4q4k35Q5K08j10mm8R5
$$ 169 158 -2 -164 -187 34 -199 32 156 -114 65 170 88 32 -39 112 166 82 -153 -68 140 30 26 -22 73
5196G3L0P4j4p6j10K17j19j8k67J08o5j05K94N4K1J03k09l7j7r2K91j09M4K2k37
$$ 73 103 177 163 87 -23 194 75 57 -210 -102 -167 -272 22 76 97 200 -9 -46 -63 -155 136 27 71 93 -144
5221a44M5J44J33j78o4P3m3j96K77q9k0P9ln7J88q6L34o54N22m53J21K32j16j22
$$ -144 -99 45 178 0 -64 9 -34 -230 47 -42 -62 17 14 -43 145 59 393 -261 261 -192 -71 161 45 -77
5245g7J5P4JrN0q7pK59l31k2oJ97j73J54M8mK5j6K08p7k52l6K20o5k34J17M0M2
$$ -77 -62 12 13 4 54 -33 -40 219 -112 -134 -140 57 -116 38 86 82 107 91 299 222 -30 -66 154 89 -145 -28 12 54
5273E4M9O0j80n7O4j45OJ63J39o1k53J58P9k79J90j65N9N3P9J67j98K08j34j16
$$ 54 103 163 -17 -74 -10 -155 -149 14 153 92 -161 -3 76 -203 -13 -178 -119 -66 13 180 -18 190 56 -60
5297f0r7J58J64k80J53k62M01J69l51n8J20k86J21K06k0R6j68J3k06pK81p9J72
$$ -60 -157 1 165 -115 38 -224 177 346 -5 -63 57 -229 -108 98 78 174 6 19 -187 -194 87 8 180
5320A80p0j61O8p2Q4K32q2j50k5j39L04J2n7l06K39P3j55MK9k11j07K91J62k24
$$ 180 110 -51 17 -55 29 261 179 29 4 -135 169 181 124 -182 57 130 -25 -21 8 -203 -310 -19 143 -81
5344h1K4oK8m8j5NJ25J96j3l50J15J3r2L04r4k66J50K66n9m0l4Oj94k54N31j19
$$ -81 -57 -63 -35 -83 -98 -93 32 228 215 -135 -20 -7 -99 205 111 -155 -5 261 202 162 128 134 -60 -314 217 98
5370I8j07K16j84l5J9J84k46j30R4O7O7q6RR6K41k15j17J07q8o9QJ47p7k73L45
$$ 98 -9 207 23 -12 7 191 -55 -185 -91 -24 43 -43 -34 62 303 88 -29 78 -10 -79 -71 76 -1 -274 71
5395G1j97K42K8j31j64O3J84q7l0k4j43M1J92k06J60J0K4j17m9Q4n2J10j54j1
$$ 71 -126 116 144 13 -151 -88 96 9 -21 -45 -188 -147 45 -161 -1 9 33 -84 -133 -49 -101 9 -145 -156
5419a56Q4K20l57K37j04K15j8n6J07j88K82l82j32K34k45K98j73P1O9l5M6L81
$$ -156 -72 148 -209 28 -76 139 121 65 172 -16 266 -116 -248 -14 -259 39 -134 -63 6 -29 17 398
5441C98m15P2j43O3l8o1l1J53O6j38P9o3J70j76K12q2l5M0j06J21qk2j46RJ71
$$ 398 -17 55 -88 -25 -63 -124 -155 -2 64 -74 5 -58 112 -64 148 66 31 71 -35 86 78 56 -90 -81 90
5466I0k42M26l91j47o4L83J64k41J49Q2k91n9M2J63J66k08j8j2K1q0K02k55P6
$$ 90 -152 274 -117 -264 -328 55 219 -22 127 209 -82 -141 -99 64 230 22 4 -8 13 -67 135 -120 -44
5489d4J81P2r8j62N6l19N61k02J03n9j88J38l5J52j06m1K5n5K40j91q8q5M50m69
$$ -44 137 209 111 -51 5 -314 247 45 148 89 -99 39 4 156 50 9 34 -21 219 28 -60 -145 305 -164
5513a64M4m0J62M5p6J15j64j63J53l7L8j68L28j36K89m57K98j68r1L64l23R8K25
$$ -164 -120 -160 2 47 -29 86 -78 -241 -88 -125 -87 -255 73 -63 226 -231 67 -101 -192 172 -151 -53 172
5536A72j28p8n0J95j17k47K48j73M8MK54o5j18L20o7k24j48K05J2J35j68J32k71
$$ 172 44 -34 -84 111 -6 -253 -5 -178 -130 -126 128 63 -55 265 198 -26 -174 31 43 178 10 142 -129
5559a29R5L9O0n6N9K20m82J42K06n9j35M1r4k1K92j23k42L72L9k16l3k67K72L0
$$ -129 -34 5 65 9 68 288 -194 -52 154 95 -40 1 -93 -114 178 55 -187 185 224 8 -25 -292 -20 10
5583A0l2q1j2MK32m41L84l0j94M5j1p5K70J51m6j28j70k6K44q6N3rk14k9q6K11
$$ 10 -22 -103 -115 -111 121 -320 64 34 -160 -115 -126 -201 69 220 174 46 -124 -150 94 8 61 52 -162 -191 -277 -66
5609f6j54L59K0j79l7J85k18J22q2k04K67m64N26Lj25K14r6J3j01K16l96K73j67
$$ -66 -220 139 159 -20 -57 128 -90 32 -50 -254 13 -451 75 78 -47 167 71 84 -17 199 -197 76 -91
5632i1R2k61L97j55l2p3J0O2n8J58j29J25J43k00k66K62%O7n2J49k99K07O6l07
$$ -91 1 -260 137 -18 -50 -123 -113 -51 -109 49 -80 45 188 -12 -278 -16 -16 51 -1 148 -151 56 122 -185
5656a85J61N8RK94m00M2K77l54L23j8j32N3j55rK7J02j41K9K37j22q3k00K71j2
$$ -185 -24 34 43 337 -63 -21 256 -98 225 207 75 128 -27 -36 -9 93 -48 -19 218 96 13 -187 84 72
5680G2p1n6K7Po9l6J04%K27j78j1%n3N2J85j56n3j01J21R1j32p3p7k3L76l07L68
$$ 72 1 -55 -28 -21 -90 -126 -22 -22 205 27 16 16 -37 15 200 44 -9 -110 11 102 -30 -103 -180 -203 173 -134 234
5707B34j86j3p9j33L69j34j19n2J32J70p09M56k24K44J44k38J83l5r2j21L43l26
$$ 234 48 35 -44 -177 192 58 -61 -113 19 189 -520 -64 -288 -44 100 -138 45 10 -82 -203 140 -186
5729a86J17k16P4R6r6K47J50j69L0n8j11K03J7k6J06j17j80K31j23K87k40k09
$$ -186 -69 -285 -211 -115 -211 36 186 17 47 -11 -122 81 98 72 178 61 -119 112 -11 276 36 -173
5751a73J24j16L03j27n9J60J51k68QQ6l1K22m11M8J09k14K39j0NJ63k26j03j19
$$ -173 -49 -165 138 11 -48 112 263 -5 3 89 58 280 -131 -83 26 -188 51 41 46 209 -17 -120 -239
5774b39P4p5J93J44j22O6jK00k44rR5K1j11p6p0J44r3K06k34L95l04N3L0m4j56
$$ -239 -165 -240 -47 97 -25 41 40 240 -4 -13 82 103 -8 -84 -154 -10 -103 103 -131 264 -40 13 43 -1 -157
5799a57r8K43K03p2j42o4j94K40L76l41p8J20j50K85q7P1j19j34J41l2K6PJ61
$$ -157 -255 -12 191 119 -23 -87 -281 -41 335 -6 -84 36 -114 171 84 155 36 -98 43 11 37 44 205
5822B05J46l67q2K1J88j13Q2j9j91L1J55Q5k03qK89k15j30N5j76K9L02l8k17K42
$$ 205 351 -16 -98 -77 111 -2 80 61 -130 -99 56 141 -62 -70 219 4 -126 -71 -247 -218 84 46 -171 71
5846G1R1j3j71J91j3j62K5o1j12K69n0M8j1j56P2j01L43p8l81L33k84o7J81j2
$$ 71 162 149 -22 169 156 -6 19 -42 -154 115 65 113 102 -54 18 -83 260 182 -199 134 -150 -217 -36 -48
5870d8J31n9N7K3k17j47K08K43j47l37K01J06K0q7k7J92l12J46J83j16K71j35
$$ -48 83 24 81 104 -113 -260 -52 191 44 -293 -92 14 34 -53 -80 112 -200 -54 129 13 284 149
5892A49j13j27Q6L27j99j92LN5j72K0J13J37p4q3L2j12K00r5L2q8K11j74j23r5
$$ 149 36 -91 -5 322 123 -69 -66 -11 -183 -163 -50 87 13 -70 -38 -150 50 -45 -13 -101 110 -64 -187 -282
5916b82K89j12k5J75j47J14j27K55j24nR8k15K11ok02J53j40J20J20j10Q0q6k0
$$ -282 7 -105 -130 45 -102 12 -115 140 16 11 109 -106 105 99 -103 50 -90 30 150 40 120 34 14
5939A4j55K87l06Q7k23N25j4l75L3J50O7j89J66L8mk51R3M1o2K63j50l3q8J62
$$ 14 -141 146 -160 -73 -296 229 215 -160 -127 23 90 -99 67 105 101 -150 -57 -16 -78 185 35 2 -86 76
5963G6p4j59M9K12k73J81L8j61J0K88k21O1j67L23qj28K26k96k56M2L73Q2j94
$$ 76 2 -157 -108 104 -169 12 50 -111 -101 187 -34 27 -140 183 175 47 273 -23 -279 -237 136 218 24
5986B4J41n58L57j44j79M52l02J17n0K59j39o5K36l0k78K00j30J51J25l2k78J22
$$ 24 165 -393 -36 -180 -359 93 -209 -92 -142 117 -22 -87 149 119 -159 41 -89 62 187 155 -123 -1
6008ao0K77J5l15J64j95R3m54L29K43j26j40j21M38j39o0Pj94K12r4K63L8l24
$$ -1 -61 216 231 -84 80 -115 -22 -476 -147 96 -30 -170 -291 147 8 -52 -45 -239 -27 -121 142 180 -144
6031a44L55j18j79pK69j19l18L24M0k29K47j18j40q7Q8J60n2K83k91q9J96J1j03
$$ -144 211 93 -86 -93 176 57 -261 63 103 -126 121 3 -137 -224 -136 24 -28 255 -36 -125 71 82 -21
6054b1k3n5J42J69k06J32k19p6k7J55J34R1k52J42q5r5r9K02k56L23j9N4j28K80
$$ -21 -44 -99 43 212 6 138 -81 -157 -184 -29 105 196 -56 86 1 -94 -193 9 -247 76 57 111 -17 263
6078B63j19q4K6q6o5R4J3k37L63j97J13k15J81J28k78kL16k54L5p8J3N3l0j20
$$ 263 144 60 86 0 -65 29 42 -195 168 -29 84 -131 50 178 -100 -102 214 -40 -5 -83 -70 -17 -47 -167
6102a67K96q6jr1M4Q4j72J89j02L9J63k1j49n5m0o4K18O2j83K52l90K00l5K47
$$ -167 129 43 42 -49 -5 79 -93 96 -6 33 196 175 26 -29 -69 -133 85 147 -36 216 -174 26 -9 238
6126B38l85K30j07J59L5k61J58l7J3n3k26M24l41J30m7r8K64p4N5oK2j85LK09
$$ 238 -147 83 -24 135 170 -91 67 30 43 -10 -236 188 -153 -23 -70 -168 96 22 77 71 93 -92 -89 120
6150A20j89j01J4M8M0J52J0K32l54J09n9R9j56j5k4J22j20k7R2K09l71J60J30
$$ 120 -69 -170 -156 -108 -68 84 94 326 -28 81 22 121 -35 -50 -74 48 -72 -99 -7 202 -169 -9 121
6173A21k85L54k91N7J13j95P5J66r4j98K72j37J94j75j88K76j11j18O0K67M1m52
$$ 121 -164 190 -101 -44 69 -126 -51 115 21 -177 95 -42 152 -23 -211 65 -46 -164 -104 163 204 -248
6195b48Q5R8L0j60O1L66l09L8K14l01m0Q1L5m5K37j96J40k0j44m4J37j3Q5j05
$$ -248 -163 -65 -35 -195 -134 232 -77 -39 175 -126 -166 -85 -50 -95 142 -54 86 66 -78 -122 15 2 87 -18
6219a8Q5m7o6J9K01j19j3l9O1q0r1%K27m6J30j08k40K58k08K56j73l7q4J47K05
$$ -18 67 20 -46 -27 174 55 42 3 64 -16 -107 -107 120 74 204 96 -144 114 -94 162 -11 -48 -132 15 220
6244B20k20p3Q0j1q8L3J53O9k27j66L26k41K84j23O0k41J16N5j39L28j89r7K1
$$ 220 0 -73 7 -4 -92 -59 94 163 -64 -230 96 -145 139 16 76 -165 -49 6 -133 195 6 -91 -70
6267g0J92o5L93m14j23L2J13M0m9k25L57k55J08o3j95k7L30j21j7%L0J22J23k76
$$ -70 122 57 450 36 -87 -55 58 98 49 -176 181 -74 34 -29 -224 -251 79 -42 -59 -59 -29 93 216 -60
6291f0K31o9j17N6j0K3o3K08k64L84k80k23K07j83L58l39q2M61j10k02J83j64
$$ -60 171 102 -15 41 31 54 -9 199 -65 319 39 -184 23 -160 198 -141 -223 238 128 -74 109 -55
6313e5J5J25m9k08L5%K81k40Q7j88K42j11K4J79j38j17L20l47K21j24O6j81K32
$$ -55 -40 85 36 -172 -137 -137 144 -96 -9 -197 45 -66 -42 137 -1 -118 202 -145 76 -48 18 -163 69
6336F9n7j26R5J6M7J44n4j18r8P0j9m2K22m5O9K1m6n7j25J26r4jJ00j43j78J11
$$ 69 12 -114 -19 -3 44 188 134 16 -82 -12 -31 -73 149 104 173 194 148 91 -34 92 -2 -3 97 -46 -224 -113
6362a13K0K6m7J18J07k69P4L1Q1J54j42j07L9j1O9K71l16j12O9J37rj3R2l14L60
$$ -113 -93 -67 -114 4 111 -158 -84 -53 28 182 40 -67 -28 -39 30 301 -15 -127 -58 79 70 57 149 -165 195
6387A95k69L57l27j33K43K8o2j10J93r9l1J21m7q8J45p6rN5r6j59K95j74O3j80
$$ 195 -74 283 -44 -177 66 94 32 -78 115 16 -15 106 59 -29 116 40 31 86 -10 -169 126 -48 15 -165
6411a65L28j41N4j55J90P7k28J39Pk76N6J90j61j61J91Q2j51%K51L8j49j92L19
$$ -165 163 22 76 -79 111 188 -40 99 106 -170 -114 76 -85 -246 -55 27 -124 -124 127 165 16 -176 143
6434A43k15J32K5k03j18M0L13k5O6j19N6J4Q4j47N9Q2qm17K96k80J62j25P7J43
$$ 143 -72 60 85 -118 -236 -196 117 92 158 39 95 109 193 46 105 187 179 -238 58 -222 -60 -185 -108 35
6458C5n3m9M3j68K19J82p1p5n0L65l71R8n4K0l33m4O60l78J48j05j30K16m24M38
$$ 35 -18 -67 -24 -192 27 209 138 63 13 378 7 105 51 71 -262 -306 354 -24 124 19 -111 105 -319 119
6482A19j82J60k16J18j55L47k65J55o6j06O8j24R8J02J37m00J50J33M3J9j92n8
$$ 119 -63 97 -119 -1 -156 191 -74 81 15 -91 -23 -147 -49 53 190 -210 -60 73 116 135 -57 -115
6504a15N5MK10j33L00m73J62O7Mj28K87k54kj05p1J72l9N8r6o2J4J17J27l01M14
$$ -115 -60 -56 154 21 321 -152 10 77 81 -47 240 -14 -16 -121 -192 -20 -59 -1 -97 -159 -145 -28 99 -202 212
6529B12M0m01Q5J29q8j26J77l4rkn6J4k8K93k28n4K00m2j12m2J85k9n1o9m8L7
$$ 212 252 -149 -64 65 -23 -149 28 -6 -15 -17 -73 -59 -87 206 -22 -76 124 82 -30 -72 113 84 33 -36 -84 -47
6555d7K37j87r7J38%n4J60j71P9L7j64J26j34j1J64M5n2l44L57O4q3r4K1J96r0
$$ -47 190 3 -94 44 44 -10 150 -21 58 95 -69 57 -77 -88 76 121 69 -275 82 146 63 -31 -10 186 96
6580I6r3J11j73M5O2n7M9m05O05j65k37L18k19n5j0j68M61k73qJ21J19l08l8K4
$$ 96 3 114 -59 -14 48 -9 40 -365 240 75 -162 156 -63 -118 -128 -296 165 -108 -116 5 124 -184 -222 -198
6604a98L22k5l88L48P2n5O2j58P1p2j33P9J4J55J6j46L4L9j64J64Q5j13R9j65
$$ -198 124 99 -289 59 131 76 138 -20 51 -21 -154 -75 -61 94 110 -36 -2 37 -127 37 122 9 108 -57
6628e7J83k34O8k1P0l3k83M66p4k6n02L36K28j85J7J19j23k38N33n13L24k3k00
$$ -57 126 -108 -40 -61 9 -24 -307 159 85 59 -443 -107 121 -64 -47 72 -51 -289 244 -269 55 32 -168
6651a68K84j17k1j01J99J53j53j09o6J36L8l2j63J83N0J29l60K62j39K92l48M7
$$ -168 116 -1 -22 -123 76 229 76 -33 -99 37 75 43 -120 63 113 242 -118 144 5 297 -51 -4
6673dj61K48oQ2j15o9J64k80J24J04k3j40J3l7L68l66K01J03k40N7j05K24k89
$$ -4 -165 83 77 159 44 -25 139 -141 -17 87 64 -76 -63 -100 268 -98 103 206 -34 23 -82 142 -147
6696a47J07J01m5r6K04On9Lp1J20J6j32j78L55k53j5K88m51J79N4P1m9O7j02R
$$ -147 -40 61 16 -80 124 130 71 74 3 123 139 7 -171 184 -69 -84 204 -247 -68 -14 57 8 75 -27 -18
6721a8R1k01J86o6M3j8l42N41j16P3j29k44K55q3m6L3M5l1J46K1l25M56p3l66
$$ -18 73 -128 58 -8 35 17 -325 216 100 173 44 -200 55 -28 -74 -41 4 -27 119 140 -185 271 198 -168
6745a68K12j88N5J28m53L30k1K63j06J02j08K08j64o3J2n4j12J86k07J42R8n2
$$ -168 44 -144 -89 39 -414 -84 -105 158 52 154 46 254 90 27 39 -15 -127 59 -148 -6 92 40
6767D0p9n5K10k17J39j03J41q9k3M9k39M68l88J71j84K24j72p2J90Q9j97J17K31
$$ 40 -39 -94 116 -101 38 -65 76 -13 -36 13 -226 242 -146 25 -159 65 -107 -179 11 100 -97 20 251
6790B51l19L42m42J33J64j68pJ11o2k8M6R3j72J07k04O4o5J00P9j41M6JJ52r0
$$ 251 -68 274 -168 -35 129 -39 -46 65 3 -25 21 114 -58 49 -155 -91 -156 -56 23 -118 -72 -71 81 -9
6814iP2k55J68N0j35Q5j65M50r5l52L48m00J9L27p6r9K95m57K93l48N43ol43J80
$$ -9 63 -192 -24 26 -109 -24 -189 261 166 -186 162 -238 -219 108 32 -67 228 -229 64 -284 259 253 -90 90
6838I0k38J15j5%j3k2k1J8J02l5J5J34l81J58J57K20k63Jm4j06K80o5K9o2k16
$$ 90 -148 -33 -48 -48 -61 -83 -104 -86 16 -19 -4 130 -251 -93 64 284 21 22 -22 -128 152 87 116 54 -162
6863a62J56L5L8j52L69n08K93o1k35J37J56k8j24N3K92k63K78k56Q1M8k38J15
$$ -162 -6 29 67 -85 284 -224 69 8 -227 -90 66 38 -86 -33 259 -4 274 18 99 147 -91 24
6885B4k70L96k39n5O6J09P2J1K7l59K28l9J29k81J8l8J66R5O5K47k92j07J17K
$$ 24 -246 150 -89 -144 -78 31 103 114 141 -218 10 -29 100 -181 -163 -201 -35 60 125 372 80 -27 90 92
6909I2l6R7K0j71P3j88L0J18N7l46J25M2J33j15K56j95RQ1k03K94j51K70k88r8
$$ 92 56 153 173 2 75 -113 -83 35 92 -254 -129 -87 46 -69 187 -8 1 82 -121 173 22 292 4 -94
6933i4l6Q7k3p6K96j73O0m8J8j98J22j9J15K67j29r2M3k26P3K17k71K4J77k70
$$ -94 -130 -43 -66 -142 154 -19 41 -7 11 -187 -65 -84 31 298 169 77 120 -106 -33 184 -87 -63 114 -156
6957a56M3J34j40Q6M6l4P0j84P9J03j57j1K83o3m4r4J14j24J37j63K30p1Q1j15
$$ -156 -113 21 -119 -33 13 -21 49 -135 -56 47 -110 -121 162 99 55 -39 75 -49 88 -75 155 84 165 50
6981E0k14K65k25P7K2j7L6Q1J9P4k80j7O0J67o2l5j07K72j9j42n9J11j52M6r2
$$ 50 -164 101 -124 -47 -25 -42 -6 75 94 168 -112 -129 -69 98 36 1 -106 166 147 5 -54 57 -95 -49 -141
7006a41K96O6j32k71J49M9j05J39M1o0o8j28J59Q2n5O4j60Q0m3J8P5m7l7o9K70
$$ -141 155 221 89 -182 -33 16 -89 50 91 31 -37 -165 -6 76 21 85 -75 5 -38 -20 55 8 -29 -98 172
7031A72j17j50j30J3L08J11k18nR1l38Q8k8J95j24N8K46l10J77r0J4l0J44l72
$$ 172 55 -95 -225 -212 96 207 -11 -16 75 -263 -175 -203 -8 -132 -74 172 -138 39 -51 -37 -67 77 -295
7054b95M76k34j58K88L9j93n1L18q1j3j51J37j71n2J21J87j44l2P2k7J2j83O4
$$ -295 181 -53 -211 77 116 -77 -128 190 109 96 -55 82 -89 -141 -20 167 23 -9 63 36 48 -135 -71
7077g1K86k61l1k8J80l97L18O0P6k38J88k93K31j82J35q1K02J26l11J62Q1j58
$$ -71 215 -46 -77 -105 75 -322 -4 56 132 -106 82 -211 20 -162 -27 -108 94 220 -91 71 152 -6
7099fn1J09P0Jj20j20j4mJ94J19l4j44n4J26k93K30J8O7J32j33k4j06J23k59L21
$$ -6 -57 52 122 123 3 -117 -131 -135 59 178 144 0 -54 72 -221 9 27 94 226 93 69 -37 86 -173 148
7124A48Q6k31k06M55l77j85K91J04P6m19L11K4j35K67l47K43j50JM1q9L7K6p9
$$ 148 234 3 -203 252 -125 -310 -19 85 161 -258 53 77 -58 209 -138 105 -45 -44 -3 -92 -55 -29 -108
7147a08j10J93k71L08J04p4j16j03J67K4k7j26K89j02kJ23o2j26P7m6N0q2J2p8
$$ -108 -218 -25 -296 12 116 42 -74 -177 -10 14 -13 -139 150 48 46 169 107 -19 58 12 62 -20 -8 -86
7171h6K52k41j77J30m6J9Q3K7J46n5n3J04mo5l12M30j56p1Q8K62m31J66j35N8
$$ -86 166 -75 -252 -122 -168 -149 -66 -39 107 52 -1 103 99 34 -278 152 -4 -75 13 275 -156 10 -125 -67
7195f7J04J27q5j86j17L94L9j71j45K14j03J80j14j79n2pJ22J7j02J45K0J35k7
$$ -67 37 164 79 -107 -224 170 209 38 -107 107 4 184 70 -109 -161 -168 -46 -29 -131 14 34 169 142
7218A42k02R4j38L06K00n83L18l24J63J79l75K08P9j00M8j87K5J07J7J02n3j36
$$ 142 -60 34 -104 202 402 -181 137 -187 -24 155 -220 -12 67 -33 15 -172 -147 -40 -23 79 26 -110
7240a10L05k81k0K05k12L15j41L3l90L21J01o0j35J11M7ql30L52j02J16o0P8j98
$$ -110 195 -86 -106 99 -113 202 61 94 -296 25 126 66 -69 42 89 81 -249 103 1 117 57 135 -63
7263f3p3J69k90J66K97m90K17J08q0k75L45K12m82L40l40J35L72k34J7j03J19
$$ -63 -136 33 -257 -91 206 -284 -67 41 -39 -314 31 243 -239 101 -239 -104 268 34 51 -52 67
7284F7q6J7n7J17j14J06J44R9n9k36n7L8j66K70r0k0K10j84j02k6K7K74l39q3
$$ 67 -19 -2 -59 58 -56 50 194 293 234 -2 -59 -21 -187 83 -7 -27 183 -1 -103 -129 -102 172 -167 -250
7308b50J56L3M8Q2J13j72k68K22q0J2K23l4Kj62K2l2K63j80K00j97R9l73J67J97
$$ -250 -94 -61 -13 69 182 10 -258 -36 -116 -104 119 85 87 -75 -53 -85 178 -2 198 1 100 -273 -106 91
7332I1p6K5q6j69L05j20J70k09K11l6j76j28J8L05l85L75k71K10K5k07J19m6M4
$$ 91 15 40 -46 -215 90 -30 140 -69 142 106 -70 -198 -180 125 -260 115 -156 54 79 -128 -9 -55 -11
7355a1j00M0J14k07J69J84l52J22r1m6Q6K3R3k45j50J42K37J92m08L41kj25q2
$$ -11 -111 -71 43 -164 5 189 -163 -41 -132 -178 -92 -69 24 -221 -371 -229 8 200 -208 133 131 6 -76
7378g6j15K56j18P7n4J56O0k43k94M64j18KM5j37M2LJ30J82l13J55k57q8PN6J3
$$ -76 -191 65 -53 24 -30 126 186 -57 -351 113 -5 -3 42 -95 -53 -50 80 262 -51 104 -153 -241 -234 -178 -165
7403a65P5PJ09p6J41k6q3j94L37k32J68J5j76M7L25k83j14n0M2J44p6L5rJ28k26
$$ -165 -90 -83 26 -50 91 65 -18 -212 125 -107 61 76 -100 -53 272 -11 -125 -175 -133 11 -65 -30 -39 89 -137
7428a37M2K20j24m8K02l21m5J69K72k32l6j61J31j34J94L28m81J65p9M9J42km9
$$ -137 -95 125 1 -47 155 -166 -211 -42 230 -2 -38 -199 -68 -202 -8 320 -161 4 -75 -26 116 114 65
7451F5j95Q6O1j41J00J44k27L22l19J76j89j5L3J53j13J90l05J50K2m2J65k8L0
$$ 65 -130 -44 17 -124 -24 120 -107 215 -104 72 -117 -132 -99 54 -59 131 -174 -24 -2 -44 121 93 123
7474A23k75L6m0L23k48P8q1k12R0K40J17j65l0R8o3l6j35Q0K16k50J47J29L8k37
$$ 123 -152 -116 -156 167 -81 -3 -84 -296 -206 34 151 -14 -44 54 -9 -45 -180 -100 116 -134 13 142 180 -57
7498e7J90m53Q8K51qP3j28L01m21K34M4r6j78RK36q6j67J00N2J81l34L41l4l4
$$ -57 133 -320 -232 19 11 84 -44 257 -164 70 114 18 -160 -151 85 -1 -168 -68 -16 165 -169 172 138 104
7522A04k04n9K13j05J10J4j69P0k19N9K18R5k16j23J51PR0N4j99M7J66l64L56
$$ 104 -100 -159 54 -51 59 73 -96 -26 -245 -186 32 127 -89 -212 -61 -54 36 90 -109 -62 104 -260 96
7545I6m7j23m9mk9N9p6k2L46k10L4l1j26R3J87J67m38O7l5Q2L5K88q7k68K78k96
$$ 96 49 -74 -123 -127 -156 -97 -173 -195 151 -59 -25 -56 -182 -89 98 265 -173 -106 -141 -59 -24 264 177 -91 187 -109
7571a09L16j04J3J28j07L4J10r5k15J27j73J55j92K74j61j6K01k89J62n5J01k13
$$ -109 207 103 116 244 137 171 281 186 -29 98 -75 80 -112 162 1 -15 186 -103 59 4 105 -108
7593a08j32R8K12RJ20k74J83k05j35K77k02L7K19k12O7k04M39k18M2k18L57j15
$$ -108 -240 -142 70 79 199 -75 108 -97 -232 45 -157 -120 99 -113 -46 -250 189 -29 13 -205 152 37
7615C7k68K22j2Q7j84J85K42k47P9r1N5K0j4n4j00J53m4j75J82k22J90k9K7J31
$$ 37 -231 -9 -21 66 -118 67 309 62 141 50 105 125 111 57 -43 110 66 -109 73 -149 41 12 39 170
7639A70m14L60l74K07K8j00L5K46j39J35n7n4l3j4K5j60L17L8l00L6j67J11J53
$$ 170 -244 116 -258 -51 -23 -123 -88 158 19 154 97 43 10 -4 21 -139 178 216 -84 -48 -215 -104 49
7662D9j46J16n8J21P1r4q4J18j0K1r4n8N9J95k56Q4J31l25J64J42l52Q6K40j17
$$ 49 -97 19 -39 82 153 59 -25 93 83 104 10 -48 11 206 -50 34 165 -160 4 146 -206 -120 120 3
7686Cl3j01J5K34k13L0O6J3L26m39j7J06k8J3J95k70j8j15N06j68j57K78m32L02
$$ 3 -30 -131 -116 118 -95 -65 1 14 340 -99 -116 -10 -38 -25 170 -100 -118 -233 273 105 -52 226 -206 96
7710I6l34J49K51o9J61l36J23O9k74J68j21L9J67nj76J89J30l13K59l70J31k9
$$ 96 -238 -89 162 93 254 -82 41 110 -164 4 -117 -78 89 84 -92 97 227 -86 173 -197 -66 -95
7732i5P7P2l9J10j9Ml17J86k72K82L0j46K97j38j88J84q4R7r4j14J42j0Q2Q9k49
$$ -95 -18 54 15 125 106 110 -207 -21 -293 -11 19 -127 170 32 -156 28 -56 41 -53 -167 -25 -35 47 136 -113
7757a13P2j9j16K59j20O7j48J29O5j53L5l0K77l11M9P8Q6j43n3K52m69K91k8N8
$$ -113 -41 -60 -176 83 -37 30 -118 11 76 -77 -42 -72 205 -106 -57 21 107 -36 -89 163 -306 -15 -43 15
7781A5Rj35O7j8L47p6l58j48L84p3L43m07N8K34l13k73O15m30L64m31K66Qk03
$$ 15 24 -111 -44 -62 285 209 -149 -297 87 14 357 -50 8 242 -71 -344 271 -159 205 -226 40 48 -155
7804a55K37r4j46L36k53%M0O8J31j75K0j26R7l5J34J08n0l41K56l78J74J52j81
$$ -155 82 -12 -158 178 -75 -75 -35 33 164 -11 9 -117 -20 -55 79 187 137 -204 52 -326 -152 0 -181
7827a81J28QK03j80J31K37l13q9P0m5J07j39k0K39j23rO0k6o6Pj11j11N8j3L0
$$ -181 -53 -45 158 -22 109 346 33 -56 14 -31 76 -63 -83 156 33 24 84 58 -8 -1 -112 -223 -165 -178 -148
7852a48K57j85l3j5J93k9j01K04l69J33J40p6j10M7L5k8N9J7j64PK08K2ll2j32
$$ -148 109 -76 -109 -124 69 40 -61 143 -226 -93 47 -29 -139 -92 -57 -85 -26 -9 -173 -166 42 64 61 29 -103
7877a03O1L5l4KK8k0J8J10Kj93J26lj25P4K60j77k36J87j16l9KL40j53k32J99
$$ -103 -42 -7 -41 -39 -11 -31 -13 97 99 -94 32 29 -96 -22 238 61 -175 12 -104 -143 -141 199 46 -186 13
7902A3K3J28N8J5p7l70Q9J90J01m7k24J6K50j68M8M8k26J23K4J40l57L78k9q9
$$ 13 36 164 222 237 160 -210 -121 69 170 123 -101 -85 165 -3 45 93 -133 -10 14 154 -203 175 146 57
7926E7K33k72r1n6O7k2K33m92M17J6J58j26j35j15K05j66J54k4j72N9k6L4R7j35
$$ 57 290 18 -73 -129 -62 -84 149 -343 74 90 248 122 -13 -128 77 -89 65 41 -131 -72 -98 -64 33 -102
7950a02J76r1R4k27j9J76j12J34L97l45j70m7J49N0k51J59O7k56l6J74P6o5q3
$$ -102 74 -17 77 -150 -169 7 -105 29 426 81 -89 -136 13 63 -188 -29 38 -218 -254 -80 -4 -69 -152
7973a52M77m58L07l69M6N7o5K9P5Q9j36K28o5j7j44l2K19k11K7M8J12O9M9j76
$$ -152 325 -133 174 -195 -149 -92 -157 -128 -53 36 -100 128 63 46 -98 -130 89 -122 -95 -47 65 134 183 7
7997GJ8L9j81J88K49l55n4LR9J09l47K70M2q5q5n9m2rK22j60L57k24k11J74q6
$$ 7 25 64 -117 71 320 -35 -89 -86 13 122 -225 45 87 2 -83 -142 -184 -193 29 -131 226 2 -209 -35 -121
8022a21O1O1j25J96o6Q2r7o9J51j95Q1J16j18R6j02NN6K61l92J67J13k03n3k38
$$ -121 -60 1 -124 72 6 88 -9 -78 73 -122 -41 75 -43 53 -49 -44 12 273 -119 48 161 -42 -95 -333
8046c33J67K46k17K6J33j72L49j72N2j91N7K87k58K9n4o9L2J88J28l36J84k31
$$ -333 -166 80 -137 -111 22 -150 199 27 79 -112 -55 232 -26 3 -51 -120 -88 100 228 -108 76 -155
8068a55K82l21M18j35r2qj67J29L4J61k56R4N1k35J51j81L26m7J7m3j61J45N3
$$ -155 127 -194 224 89 -3 -11 -178 -49 -15 146 -110 -16 35 -200 -49 -230 96 49 66 23 -138 7 60
8091F0j01K07P9l34K22j79l5j1K20j48k1N6L5j67K34j90o9J61Rj29M7Oj93J7J63
$$ 60 -41 166 245 -89 133 -46 -81 -92 128 -20 -41 15 50 -117 117 -73 -142 19 28 -101 -54 -48 -241 -224 -61
8116f1K01j70n4n3O3J95O5k56J04K11j36j60K7j95M28l71J40O3J07j24j77M29
$$ -61 140 -30 -84 -137 -74 121 186 -70 34 245 109 -51 -24 -219 209 -162 -22 41 148 24 -153 276
8138B76j43j0j28N0MP6k66Q8K07l89K50Pj2r2jM5J37l72K25O9k12L6J47J56j43
$$ 276 133 123 -5 45 49 125 -141 -53 154 -235 15 22 10 -82 -83 -38 99 -273 -48 21 -191 -155 -8 148 5
8163Ej8k31J82j79L21j73J36l42LL97j28J66l8j34K78n03K92K5j62N6Mm7N7J88
$$ 5 -13 -244 -62 -241 80 -93 43 -299 -296 101 -27 139 101 -33 245 -258 34 59 -103 -47 -43 -90 -33 155
8187A55qN3k48j0
$$ 155 147 200 -48 -58
8191e8
$$ Imaginary data points
##PAGE= N=2
##DATA TABLE= (X++(I..I)), XYDATA
0@%%%%%%%%%%%%%%%%%pJ5j6J6j6J6k4L2l2L9m7N1n9O9q0R1j03J18j32J48j68J88
$$ 0 0 0 0 0 0 0 0 0 0 0 0 0 0 0 0 0 0 -7 8 -8 8 -8 8 -16 16 -16 23 -24 27 -32 37 -43 48 -55 63 -69 79 -89 99
39I9k10K33k60K90l20L56l94M34m78N28n84O42p07P79q59R48j046J158j285J429
$$ 99 -111 122 -138 152 -168 188 -206 228 -250 278 -306 336 -371 408 -451 497 -549 609 -676 753
59G53j598J799k038K330k698L177l831M784o339R496k9413L6284n7843m7164P7059
$$ 753 -845 954 -1084 1246 -1452 1725 -2106 2678 -3661 5835 -23578 12706 -45137 -92301 -15242
74a5242n0357l5908L1179m3154N363J05732j4709n571J04792O625m3398M5429
$$ -15242 -65599 -101507 -70328 -113482 -108119 -2387 -17096 -22667 82125 88750 45352 90781
86I0781k4738l8046O2260j4951n6554P7622K4398q1245M922J0471o3380j0114
$$ 90781 66043 27997 90257 75306 18752 96374 120772 39527 44449 54920 -8460 -18574
98a8574j5675m8095M3051K3449o1231L0868N2949n0159q505L3121l1577J3614
$$ -18574 -34249 -82344 -39293 -15844 -77075 -46207 6742 -43417 -51922 -18801 -50378 -36764
110c6764M4088l1403J8334P2854k2272k1833M1011j5704k3242J5215l3634o985
$$ -36764 7324 -24079 -5745 67109 44837 23004 64015 48311 25069 40284 6650 -335
122c35M9441l1247l5631N1490o884n5710R887p277l2470K1151o174k4300N0032
$$ -335 49106 17859 -17772 33718 26834 -28876 -18989 -26266 -58736 -37585 -43759 -68059 -18027
135a8027J9582l7922K3620K2713l0065J0736J1246k1010L7251L1937l3408J9080
$$ -18027 1555 -36367 -12747 9966 -20099 -9363 1883 -19127 18124 50061 16653 35733
147C5733M1699l5908k1524J4256k5347p469J3410k8373L837L6622l1297k7792
$$ 35733 77432 41524 20000 34256 8909 1440 14850 -13523 -9686 26936 -4361 -32153
159c2153K4908j7667k9213J5365o904k123M1330j637j5528M0817Q812l2109J2657
$$ -32153 -7245 -24912 -54125 -38760 -45664 -47787 -6457 -8094 -23622 17195 26007 -6102 6555
172F555J1301j3048J8772O281j4515K8699J0179l9466M95J2260l2231j1462P053
$$ 6555 17856 4808 23580 29861 15346 44045 54224 14758 15253 27513 -4718 -16180 -9127
185i127j6102Q818J3758k4543K499K3871k3017j4897J8988l241N4J9520k314P897
$$ -9127 -25229 -16411 -2653 -27196 -24697 -826 -23843 -38740 -19752 -22993 -22939 -3419 -5733 2164
199B164K9836j0454j4854K1195k010j9652Q027J491n194J4362o823j6793J4238
$$ 2164 32000 21546 6692 27887 25877 6225 14252 15743 10549 24911 18088 1295 15533
212A5533l341k9892l88N243j2959L871N010o260J5984Q162j8988M465J5406j2135
$$ 15533 12192 -17700 -18088 -12845 -25804 -21933 -16923 -23183 -7199 963 -18025 -13560 1846 -10289
226a0289k774J3831J600Q684J1989r144L673J4254j6151j3491R514l671q284N472
$$ -10289 -13063 768 2368 11052 23041 13897 17570 31824 15673 2182 11696 8025 -259 5213
240E213m094j329R595j1841j4918Q974k635j5431M976O410k9J0025J667l859J2690
$$ 5213 1119 -210 9385 -2456 -17374 -8400 -11035 -26466 -21490 -15080 -15109 -5084 -3417 -7276 5414
255E414K958j3917L808J0797m103K569P125l00O046J997j3892k138M791j2121
$$ 5414 8372 -5545 -1737 9060 4957 7526 14651 14351 20397 22394 8502 6364 11155 -966
269i66q464N117l26q44K153n206k68N203r263p832P689L437k052O285N401M680
$$ -966 -9430 -4313 -4639 -5483 -3330 -8536 -8804 -3601 -12864 -20696 -13007 -9570 -11622 -5337 64 4744
285D744O550k604m796O710J38p998K168O118n90J235j272m092J456m142j1766
$$ 4744 11294 8690 3894 10604 10742 2744 4912 11030 10440 11675 10403 6311 7767 3625 -8141
300h141k304L368l604j606L814K450J951q7m842P83M209l215j175O984O309K065
$$ -8141 -10445 -7077 -10681 -12287 -8473 -6023 -4072 -4159 -9001 -8218 -4009 -7224 -8399 -1415 4894 6959
316F959K409J282J390K77n480m498K165J276l278p8K447N76k809n241l672j106
$$ 6959 9368 10650 12040 12317 6837 2339 4504 5780 2502 2424 4871 5447 2638 -2603 -6275 -7381
332g381k258m389Q55N353L489J4J139K805J267k232k259J615M162K325M35L228
$$ -7381 -9639 -14028 -13173 -7820 -4331 -4317 -3178 -373 894 -1338 -3597 -1982 2180 4505 4940 8168
348H168M841J21m313k674j440k571l402k150R72L033m33l103K93j98m046m004
$$ 8168 13009 13130 8817 6143 4703 2132 -1270 -3420 -2448 585 152 -2951 -2658 -2856 -6902 -10906
364a0906j53J226K743K446J430M988M383k131k031J930o80j516P73J335K833L684
$$ -10906 -11059 -9833 -7090 -4644 -3214 1774 6157 4026 1995 3925 3245 1729 2502 3837 6670 10354
380A0354k499k287J468l441o538j746n87r21J818r3K48M132j096n384P78J235
$$ 10354 7855 5568 7036 3595 -2943 -4689 -5276 -6197 -4379 -4472 -4224 -92 -1188 -6572 -5794 -4559
396d559k460Q22L360K109N218K487k878J850K156n592k179K601j278Q50K438j415
$$ -4559 -7019 -6197 -2837 -728 4490 6977 4099 5949 8105 2513 334 2935 1657 2507 4945 3530
412C530L63K347n961m778J955k716l510L099R15Q49M141j434k569L955j073n111
$$ 3530 3893 6240 279 -4499 -2544 -5260 -8770 -5671 -4756 -3907 234 -1200 -3769 186 -887 -5998
428e998K988L293r03L598L099j549L538L4o408M73J780m899k65L024p12M81J642
$$ -5998 -3010 283 -620 2978 6077 4528 8066 8100 1692 2165 3945 -954 -1219 1805 1093 1574 3216
445C216m819j142J894n706k468M197m83J33M341p8M22M175l458l098M366l73k577
$$ 3216 -1603 -2745 -851 -6557 -9025 -4828 -5311 -5178 -837 -915 -493 3682 224 -2874 1492 1119 -1458
462a458M421K302p36L198j310m214J811j898o016J970J924l012K406J398l228
$$ -1458 2963 5265 4529 7727 6417 2203 4014 2116 -3900 -1930 -6 -3018 -612 786 -2442
477b442J436k77n922J103L340l114J819N114o48J559K865l597l48L242l953j415
$$ -2442 -1006 -1283 -7205 -6102 -2762 -5876 -4057 1057 409 1968 4833 1236 888 4130 177 -1238
493a238N363o16j337L688j606k844J724m071m251L846q04l625M354J246k624K277
$$ -1238 4125 3509 2172 5860 4254 1410 3134 -937 -5188 -1342 -2146 -5771 -1417 -171 -2795 -518
509e18l87m530L407R24m398L546M752k814K428K902l029K27J888m892N79M017
$$ -518 -905 -5435 -2028 -1104 -5502 -1956 2796 -18 2410 5312 2283 2510 4398 -494 85 4102
525D102l949k38M636k959j557K721m395k290L185k860k600N133j34k248L730K31
$$ 4102 153 -85 4551 1592 35 2756 -1639 -3929 -744 -3604 -6204 -1071 -1205 -3453 277 508
541E08k940K825q96k995L741J399k527L616K331k819J592M96m602J150J405m370
$$ 508 -2432 393 -503 -3498 243 1642 -885 2731 5062 2243 3835 4331 -271 879 2284 -2086
557b086J497K980k809J1J946l286o74J205l558J7L732k117L97M315q45j194L021
$$ -2086 -589 2391 -418 -407 1539 -1747 -2421 -1216 -4774 -4757 -1025 -3142 -2745 1570 725 -469 2552
574B552k059j685L061q06j668L946J26j932K460p95l241J453r91l884K702J118
$$ 2552 493 -1192 1869 1063 -605 3341 3467 1535 3995 3200 -41 1412 421 -3463 -761 357
590C57l690K884J153l398J106R88l434J560J840k636J925L568k162R29K846k665
$$ 357 -3333 -449 704 -2694 -1588 -600 -4034 -2474 -634 -3270 -1345 2223 61 990 3836 1171
606A171n91K456k348p80L358k015r78K675j133k449J852j886k519K521r26k427
$$ 1171 580 3036 688 -92 3266 1251 273 2948 1815 -634 1218 -668 -3187 -666 -1592 -4019
622d019L173M09k179K437L80k870K094O65k427K475J902k122J568K167k115K61
$$ -4019 -846 -437 -2616 -179 201 -2669 -575 90 -2337 138 2040 -82 1486 3653 1538 1799
638A799J151k824Q5J595k164p8K623k293q05J747k066j416J726j586q98K858p25
$$ 1799 2950 126 211 1806 -358 -436 2187 -106 -911 836 -1230 -2646 -920 -2506 -3404 -546 -1271
655a271p87K772m38j342J999n16j619J809O95j500K258O63j444Q16J83k305O06
$$ -1271 -2058 714 276 -1066 933 417 -1202 607 1302 -198 2060 2723 1279 2095 2278 -27 579
672E79K58k492Q17J271j877O97R94j903r4J317j860k33K301j190P5K463n70k28
$$ 579 837 -1655 -838 433 -1444 -747 247 -1656 -1750 -433 -2293 -2526 -225 -1415 -1340 1123 553 325
690C25J617j147q51J888r88q92J953K8j298J373l64j989Q31q04j539Q14K24j578
$$ 325 1942 795 -56 1832 844 -48 1905 1933 635 2008 1644 -345 486 -318 -1857 -1043 -819 -2397
708b397J613R09j826R29N62j884P29J097r63P59J917r71N98J237j247l40Q43j254
$$ -2397 -784 125 -1701 -772 -210 -2094 -1365 -268 -1231 -472 1445 474 1072 2309 1062 722 1565 311
726C11j54J284r54l30J193n22j101L92r55j144R05m39m64J182O45r81J114K02
$$ 311 157 1441 487 157 1350 828 -273 119 -836 -1980 -1075 -1514 -1978 -796 -151 -1132 -18 184
744A84j135P31K29j014J309P06m75P17J013j206M19k23j249k5L48p29r6J065o44
$$ 184 -951 -220 9 -1005 304 1010 535 1252 2265 1059 1478 1255 6 -19 329 -400 -496 569 -75
763g5n23P29j191o55N95m07l60J289J66m3Q16K39q20R61k88o73Q69P1j50Q08K52
$$ -75 -598 131 -1060 -1715 -1120 -1527 -1887 -598 -432 -475 341 580 -240 721 433 -240 629 700 550 1358 1610
784A610n61K8M1j003n09Rp25M96M12n47L95K84q70o4R5k09j79R38l16P35Q04j20
$$ 1610 1049 1077 1118 115 -394 -385 -1110 -614 -202 -749 -354 -70 -940 -1004 -909 -1118 -1297 -359 -675 60 864 744
806G44J26R8l07m15M54k69j62M62K44n54M08k66q88K77p14l96M87k11j39N27M55
$$ 744 870 968 661 246 700 431 269 731 975 421 829 563 -325 -48 -762 -1158 -671 -882 -1021 -494 -39
827c9n90J86M5l28L43K17q4N61O38L3j84K40j56j50l01k77j80M57l73K00J59m26
$$ -39 -629 -443 -398 -726 -383 -166 -250 311 949 982 798 1038 882 732 431 154 -26 431 58 258 417 -9
849im00k06j2m61k7L1J58O85K78o7kJ02K31m65m8L17K92L07L42l62J17K18o26
$$ -9 -409 -615 -627 -1088 -1115 -1084 -926 -241 37 -30 -32 70 301 -164 -212 105 397 704 1046 684 801 1019 393
872C93k91j97k33n5K33R6n1j80k06m37J72j94n0J39L27J21N32J48J76r8L3l70
$$ 393 102 -95 -328 -383 -150 -54 -105 -285 -491 -928 -756 -950 -1000 -861 -534 -413 119 267 443 345 378 8
894HL03M5j03K59K36j59q8K1m78k29j15j38k17J73K11K15k70N1k13J78n28J87
$$ 8 311 356 253 512 748 589 501 522 44 -185 -300 -438 -655 -482 -271 -56 -326 -275 -488 -310 -838 -651
916f51K63P6J77L53K69j08J58J07j07q9k12q0J16J28N6k22j87O9m03l3n73Q3M32
$$ -651 -388 -312 -135 218 487 379 537 644 537 448 236 156 272 400 456 234 47 116 -287 -320 -893 -810 -378
939c78k30J63K16J6NP0O8q9K27L2j2J87J99K7K66j60oq2l41m71N13K1n57L00M2
$$ -378 -608 -445 -229 -213 -208 -138 -70 -159 68 100 88 275 474 501 767 607 601 519 178 -293 220 241 -316 -16 26
964B6l27mJ57n00J33O3o6K1O60m89M51R3k72J68K97l04m23P87K5m64N46J25l04
$$ 26 -301 -305 -148 -648 -515 -452 -518 -497 163 -326 125 218 -54 114 411 107 -316 471 496 32 578 703 399
987C99n8j68l57K69k31l59M88J36l50R5k11p4M7J68m10L86L31k63J29M18k74R4
$$ 399 341 173 -184 85 -146 -505 -17 119 -231 -136 -347 -421 -374 -206 -616 -230 101 -162 -33 385 111 205
1009B05L94n75R6O70n42oK74m22M6l8j96k12L18l74j61K68q8k20M78J6m26L96
$$ 205 599 24 120 790 248 242 516 94 140 102 -94 -306 12 -362 -523 -255 -343 -563 -85 -69 -495 -99
1031i9j25k70O36m9J16K45k16J75J85k22k28M12k44l57j4K55l75J66K03o80J60
$$ -99 -224 -494 142 93 209 454 238 413 598 376 148 560 316 -41 -55 200 -175 -9 194 -486 -326
1052c26L48m56m0L62m32J97L71m52K78N79o57K00K87m05L62L25j81j46M69m78
$$ -326 22 -434 -474 -112 -544 -347 24 -428 -150 429 -228 -28 259 -146 216 541 360 214 683 205
1072B05r4L93l22m05L05j26j45k48M72m31K25qj22P6j41n0m9N24k15K45L25n67
$$ 205 111 504 182 -223 82 -44 -189 -437 35 -396 -171 -179 -301 -225 -366 -416 -465 59 -156 89 414 -153
1094a53N09q3j55rL89n31L42L09k86k20L44n34l05K09k75L1N37l49j03N41m30
$$ -153 356 273 118 109 498 -33 309 618 332 112 456 -78 -383 -174 -449 -418 119 -230 -333 208 -222
1115b22j23M54k15j56J46M75m10J71L44j50J05j60j94L03L8m60K2L11l35L48m3
$$ -222 -345 109 -106 -262 -116 359 -51 120 464 314 419 259 65 368 406 -54 -32 279 -56 292 249
1136B49l96J31L9m27j75K80L94m19L21n3l00N02k40O3J4M4L8L86k33j6N5qk62
$$ 249 -147 -16 23 -404 -579 -299 95 -324 -3 -56 -356 146 -94 -31 -17 27 65 451 218 202 257 249 -13
1159a3K77m20Q9J86J59l46J23r3m5o1Pj96j53L76k02K04M20k63o9J64J39j35J90
$$ -13 264 -156 -67 119 278 -68 55 -38 -83 -144 -137 -333 -486 -110 -312 -108 312 49 -20 144 283 148 338
1182C38l14j01K50J10Q6j10j34qJ81k02l48K24k58J36n9J60j74K58K43n96J92
$$ 338 24 -77 173 283 369 259 125 117 298 96 -252 -28 -286 -150 -209 -49 -223 35 278 -318 -126
1203a26K69o21L06L64n04O43o2m96K58J31k1K6Q5k14J96J54n15l5J89p5n04N05
$$ -126 143 -478 -172 192 -312 331 269 -227 31 162 141 167 252 38 234 388 -127 -162 27 -48 -552 -47
1225d7l03j6L14k8k18K29j51M4J46j94%K27j21P3M72j07k49L14k16k42L16r2O
$$ -47 -350 -366 -52 -80 -298 -69 -220 -176 -30 -224 -224 3 -118 -45 427 320 71 385 169 -73 243 151 157
1248A57J0j6j95P9m4n5j78o8P0m2J78j53J22J40J57l3Lk44R5L07l09l2k2L62j53
$$ 157 167 151 -44 35 -9 -64 -242 -310 -240 -282 -104 -257 -135 5 162 129 132 -112 -17 290 -19 -51 -73 289 136
1273A36K45j20l16J69j54q0K4O0j2N4j14M4k1lj53j8l0K33q3N1J48K77j83j00
$$ 136 381 261 -55 114 -40 -120 -96 -36 -48 6 -108 -64 -85 -88 -241 -259 -289 -56 -139 -88 60 337 154 54
1297E4j13K54l49K04n8M0N0K12k55r8M4j95o5M33Mk74P9k03J23m9k6MO4Q9n9K41
$$ 54 -59 195 -154 50 -8 32 82 294 39 -59 -15 -210 -275 158 162 -112 -33 -236 -113 -162 -188 -184 -120 -31 -90 151
1323A51r6j00K85l16K09Lj2J40l95L82k64J55K64l18j69Q4N1l01j1NK03J64k6
$$ 151 55 -45 240 -76 133 136 124 264 -131 251 -13 142 406 88 -81 3 54 -247 -258 -253 -50 114 88
1346H8j90N4k21K17j0J06J25K07j82Q2j26j48j52K02k40K65J5k1k49Q9n2K64j74
$$ 88 -102 -48 -269 -52 -62 44 169 376 194 276 150 2 -150 52 -188 77 92 71 -178 -89 -141 123 -51
1369e1p5J51l22K28k7o8j10K14M3N4L3k62K1J46K05J19K55o77K37K4p2o1R4j89
$$ -51 -126 25 -297 -69 -96 -164 -274 -60 -17 37 70 -192 -171 -25 180 299 554 -123 114 138 66 5 99 -90
1393i0R0J29r4m4k06L40m20J23M07l17K1QJ24K2j9m8k1K34k43j1K58l52K59L7
$$ -90 0 129 35 -9 -215 125 -295 -172 235 -82 -61 -53 71 93 74 26 5 239 -4 -15 243 -109 150 187
1417A87L2j60J17n6K05j90j25k2R8l41J93J60n7k21K57l69L76j64p1L32k02k95
$$ 187 219 59 176 120 325 135 10 -12 86 -255 -62 98 41 -180 77 -292 84 -80 -151 181 -21 -316
1439c16L75l0L62n75K98M6j91J94j37J21k0j65L2J6k16J81l8L5K93l42Rj38J18
$$ -316 59 29 391 -184 114 160 -31 163 26 147 127 -38 -6 10 -206 -25 -63 -28 265 -77 -68 -206 -88
1462h8m7o8L50k7j43O5k18K20M6j81J38j45L82l48J50J81j86K7k79j27R6J63J11
$$ -88 -135 -203 147 120 -23 42 -176 44 90 -91 47 -98 284 -64 86 267 81 108 -171 -298 -202 -39 72
1485G2j53k60N7N8l4L15k30j38L41j44J72R9K0j78K2q2NJ97k25K9J4J49l3p9O4
$$ 72 -81 -341 -284 -226 -260 55 -175 -313 28 -116 56 155 175 -3 19 -63 -58 139 -86 -57 -43 106 73 -6 58
1510E8L0j91J84k31J00o3j58K40K2P1j68Q8j2j83o1M83k18pK03r9j8j42R4r7K0
$$ 58 88 -103 81 -150 -50 -113 -271 -31 -9 62 -106 -18 -30 -213 -274 209 -9 -16 187 88 70 -72 22 -75 -55
1535e5k8K3r4P2O7K09j05k12QJ09o8R2k04L57o35N42j2j55J47N4k39L19j69QP4
$$ -55 -83 -60 -154 -82 -15 194 89 -123 -115 -6 -74 18 -186 171 -464 78 66 -89 58 112 -127 192 23 31 105
1560A05k65L92r8k00M0J52k94K57k47L34k69J52L7l19J21P2q6K82l33J65j65K52
$$ 105 -160 232 134 -66 -26 126 -168 89 -158 176 -93 59 96 -223 -102 -30 -116 166 -167 -2 -167 85
1582H5L7j65r6K6J33j9j35K44j68n4K41m9k37m1J20J8J69j38k06L80k8j24qq1
$$ 85 122 -43 -139 -113 20 1 -134 110 -58 -112 129 80 -157 -198 -78 -60 109 -29 -235 145 117 -7 -15 -96
1606i6Q1j03K29j71k5J75L2k85N30m82N11o7l26o7j35J93N8k0nK96k69L5o4M5
$$ -96 -15 -118 111 -60 -85 90 122 -163 367 -115 396 329 3 -64 -199 -6 52 32 27 323 54 89 25 70
1630G0j22K50mm5j99J5J42j98R8M1l4p2oM33n85L12j71M07m43K27r0L5k79L22
$$ 70 -52 198 194 149 -50 -35 107 -91 7 48 14 -58 -64 369 -216 96 -75 332 -111 116 26 61 -218 104
1654A04q6j62r6K95Q7j56n7l9pp2K16L67n76K3K09l3k29Q7K0J32j05j3K13l1k16
$$ 104 18 -144 -240 55 142 -14 -71 -110 -117 -189 27 394 -182 -159 50 17 -212 -125 -105 27 -78 -91 122 91 -125
1679a25K24j79K35j58J49j32j62J5J22K29k61k13K25k52J57J05j16K01J6j84J06
$$ -125 99 -80 155 -3 146 14 -148 -133 -11 218 -43 -256 -31 -283 -126 -21 -137 64 80 -104 2
1700B%K9k3k48L70q4j95J71m9J22j09M7J24N5J77l69O6J5J13k70j98J99J52k49
$$ 2 2 31 8 -240 130 46 -149 22 -27 95 -14 33 157 212 389 20 86 101 214 -56 -254 -55 97 -152
1724a52K14j22P0k07K69k04J81j65K47k6j23J14k3k31J82m5J91j98L7J77l25N23
$$ -152 62 -60 10 -197 72 -132 49 -116 131 105 -18 96 73 -158 24 -21 170 -28 9 186 -139 384
1746C84l05j82p5K62n5p5O5k17P9K67l41K85j14j88Q1j31J83R7K5p5K19j99j16
$$ 384 79 -103 -178 84 29 -46 19 -198 -119 148 -193 92 -22 -210 -129 -260 -77 20 45 -30 189 -10 -126
1769a26J43n4l2j59K83j45j49q3M59k97M51n17P9k4K73j08j03J38Kj42K0K41k21
$$ -126 17 -37 -69 -228 55 -90 -239 -322 137 -160 291 -226 -147 -171 102 -6 -109 29 31 -111 -91 150 -71
1792g1j25L55o33M74M4p5n8J1n3J99J48k75Q8k10K93j82j5J64j1j67J52j08J29
$$ -71 -196 159 -474 0 44 -31 -89 -78 -131 68 216 -59 29 -181 112 -70 -85 79 68 -99 53 -55 74
1815G4P4j93J80j48n4K0Q9o2J01p3m6J54j01Jj50O7j1o0M1K9J67o9K19k12Q4j90
$$ 74 148 -45 135 -13 -67 -47 42 -20 81 8 -38 116 15 16 -134 -67 -78 -138 -97 -68 99 30 249 37 121 -69
1841f9JO9j37K65m15N99j46M1l41r9K79J18j95o7J50n7l4K15l2j67j30pm0K70
$$ -69 -68 1 -136 129 -286 313 167 208 -133 -232 47 165 -30 -97 53 -4 -38 177 145 -22 -152 -159 -199 71
1865G1Qj50o5L4P5oJ15R2l3j86Q1QJ83j63l1M3j97J75m8J02k25R6j38J83K27l77
$$ 71 79 -71 -136 -102 -27 -33 82 174 141 -45 36 44 227 64 33 76 -121 54 6 108 -117 -21 -159 24 251 -126
1891a26M17j49j7j33Q5O7p8k32O4j55K23jL0OK6K8kJ82j52j98J91O8m68L42j60
$$ -126 291 142 125 -8 77 144 66 -166 -102 -257 -34 -35 -5 1 27 55 53 235 83 -115 76 144 -324 18 -142
1916a42J62M1k1l38K85j4j07Q0J10j33m1L13j88j41P5j6J33j43L13j39j4M8N2
$$ -142 20 61 40 -298 -13 -27 -134 -54 56 -77 -118 195 7 -134 -59 -75 58 -85 228 89 75 123 175
1939A75l82j4K44J18l79K62J22l13P8M6k9n4K13j80K8J05J07nj99L24k45j13M
$$ 175 -207 -221 23 141 -238 24 146 -167 -89 -43 -72 -126 87 -93 -65 40 147 142 -57 267 22 -91 -87
1962h7J07K2j26J01j51L21j87J60j32o9J47j30J7P2M4K24k88q5L9L6j9J96j97
$$ -87 20 42 -84 17 -134 187 0 160 28 -41 106 -24 -7 65 109 333 45 -40 -1 35 16 212 15
1985A5QK23k47M6K20l54R0P1k27K23k30o8J19J95j31J00p6j01n9K10n1j97L54
$$ 15 23 246 -1 45 265 -89 1 72 -155 68 -162 -230 -111 84 -47 53 -23 -124 -183 27 -24 -221 133
2008A33k41L51j86k1k4J13l20L13l4K05l57J3j78K78J05k05o7J02j2jK84l21L8
$$ 133 -108 243 57 36 12 125 -195 118 84 289 -68 -55 -233 45 150 -55 -122 -20 -32 -33 251 -70 -32
2031c2J12j10Qj58K09p5R5P7R1j15l7J60j22l2J42r9N3j61M5k32P0R4K45k01N8
$$ -32 80 -30 -22 -180 29 -46 49 126 217 102 65 225 103 71 213 114 167 6 51 -181 -111 -17 228 27 85
2056H5j69j1R3K13j50J42k07J1K7N9j27n2L26l65J5J12K15l10J08l4J05k36J54
$$ 85 -84 -95 -2 211 61 203 -4 7 34 93 -34 -86 240 -125 -110 2 217 -93 15 -19 86 -150 4
2079Dp4J62l6J55J1l25j39N6J61K85m20J18O1J53k77l7K07l53M15q6k07K86m27
$$ 4 -70 92 56 211 222 -103 -242 -186 -25 260 -160 -42 19 172 -105 -142 65 -288 127 41 -166 120 -307
2102c07M57j19p7N2o8R0ko0R5J20l57O4j04Q0q9L14k35J80rJ16k77J69Q9Lk27
$$ -307 150 31 -46 6 -62 28 26 -34 61 181 -176 -112 -216 -136 -225 89 -146 34 25 141 -136 33 122 125 -102
2127a02M3j80L80k97K20m7J17l49K26j38k2J60Q2l32J82O8kN0l43J72K44l3j07
$$ -102 -59 -239 141 -156 64 17 134 -215 11 -127 -149 11 93 -239 -57 11 9 59 -284 -112 132 99 -8
2150hJ22r9J88k67L1n0R8k19J16J83k1n4n8m3R0j15J22j07qK44j57j58M1J70k64
$$ -8 114 15 203 -64 -33 -83 15 -204 -88 95 74 20 -38 -81 9 -106 16 -91 -99 145 -12 -170 -129 41 -223
2175b23K14Q4K01k07r5j01m6L2mJ2j74M70o4pJ75k84k25R9J76m2pL6N4j42J99
$$ -223 -9 75 276 69 -26 -127 -173 -141 -145 -133 -307 163 99 92 267 -17 -242 -143 33 -9 -16 20 74 -68 131
2200A31k25o0J01m9N4l6r3J42n9P7j69L37j85J14j11j36L5K68L0j75J55j83k24
$$ 131 -94 -154 -53 -102 -48 -84 -177 -35 -94 -17 -186 151 -34 80 -31 -167 -132 136 166 -9 146 -37 -261
2223b61K5P37n10K0l9j05K56r6o4j06J53Oom6O5j88n1K54L39m41J09O2M8k74R1
$$ -261 -236 501 -9 11 -28 -133 123 27 -37 -143 10 16 10 -36 29 -159 -210 44 383 -58 51 113 161 -113 -22
2248b2k06J85K34j64p8q6J39J22k40j11K09J68j52J70l95k5M45l08L2J03j32J87
$$ -22 -228 -43 191 27 -51 -137 2 124 -116 -227 -18 150 -2 168 -227 -252 193 -115 -83 20 -112 75
2270G5nj28Q5l3J24J16k13j05K55m22L56k51K85M2j74N5j76K67k06K78j23k86
$$ 75 70 -58 27 -6 118 234 21 -84 171 -251 105 -146 139 181 7 62 -114 153 -53 225 102 -184
2292a84J02L6q8J59j62K32N1R6l00L0J13l2j2ln2l73L89L38p1j36k97K94Mj24
$$ -184 -82 -46 -134 25 -137 95 146 242 -58 -28 85 53 41 38 -14 -387 2 340 269 133 -164 130 134 10
2316A0q6K48k03J01N9M2j97O6K9q9R6j31l2PK16j25k4O4k82J22J59kO0l45K9L37
$$ 10 -76 172 -31 70 129 171 -26 40 69 -20 76 -55 -87 -80 136 11 -13 51 -231 -109 50 48 108 -237 -208 129
2342A29j35p7L74n84R6K04JM7kP1j23j13J88r1K01o4L9j63J80k88J92q2N2K9n4
$$ 129 -6 -83 291 -293 -197 7 8 55 53 124 1 -112 76 -15 186 122 161 -2 178 -110 82 0 52 81 27
2367B7L6m0k06M08l15o1O8j98L75n7o7q1K07k37j21L95J80m50K1qK05J22j16J48
$$ 27 63 23 -183 225 -90 -151 -83 -281 94 37 -30 -111 96 -141 -262 133 313 -137 -116 -124 81 203 87 235
2391B35l17j82K54j21J68J04k6j73K34j47q4m8J10J12l42K50rJ13k3j37J79J01
$$ 235 -82 -264 -10 -131 37 141 115 -58 176 29 -55 -103 7 119 -223 27 18 131 108 -29 150 251
2413B51j14k6l9k60L49m6R7j37J3j20j42K70M2k59L7K12k56J97k3j47K22nMo3
$$ 251 137 111 72 -188 161 115 212 75 88 -32 -174 96 138 -121 -84 128 -128 69 46 -101 121 116 120 57
2437E7%j9k04J5J25O6J31k29L5l8Q3k21M33l13O1m0N0N2L4l35M90l35J90k93L78
$$ 57 57 38 -166 -151 -26 40 171 -58 -23 -61 22 -199 234 -79 -18 -58 -8 44 78 -257 233 -102 88 -205 173
2462A73n9j26k10L19Q7l38K38m22J76J35P4j5j77p3J24J27K3j77M21k70n4m5M7
$$ 173 114 -12 -222 97 184 -154 84 -338 -162 -27 47 32 -145 -218 -94 33 56 -121 300 30 -24 -69 -22
2485b2K08l31K16oj77J22j14J25p3J34K7k58J00J70l3j62n8J86p7J08o8Q0k77
$$ -22 186 -145 71 65 -112 10 -104 21 -52 82 109 -149 -49 121 88 -74 -132 54 -23 85 17 97 -180
2508a80K97J07k85K10l02K13j02k14K82j31K92O0l41m9K56j41k07M02m26J78j0
$$ -180 117 224 -61 149 -153 60 -42 -256 26 -105 187 247 -94 -143 113 -28 -235 167 -259 -81 -91
2529i1J47j09R8pK41l35o0J87J9k30J64k13M6K93l5P5k15N3k07J36N3k50J06L60
$$ -91 56 -53 45 38 279 -56 -116 71 90 -140 24 -189 -143 150 115 190 -25 28 -179 -43 10 -240 -134 226
2553B26k02o0J6J8P8K9k41M08k80N5J89k17k9j60PJ08K9QK49m17Q3J86O5j27K10
$$ 226 24 -36 -20 -2 76 105 -136 272 -8 47 236 19 -10 -170 -163 -55 -26 -18 231 -186 -103 83 148 21 231
2578B31m4j42J39m09L01J59k70R2K1k48K57R3k78J92n8LJ27j32j30K08n4j23k
$$ 231 187 45 184 -225 76 235 -35 57 78 -170 87 180 -98 94 36 39 166 34 -96 112 58 -65 -67
2601f7J68j71J20q9P0j64K29k09J87J33k50L05j11k27K25l28K04m0M4k41L34l17
$$ -67 101 -70 50 -39 31 -133 96 -113 74 207 -43 262 151 -76 149 -179 25 -15 29 -212 122 -195
2623a95J18k3J96k46J24q2o3K61J19m8k75j53J96l5J4O5J03k30N0N7O3jj36K01
$$ -195 -77 -100 96 -150 -26 -108 -171 90 209 161 -114 -267 -71 -106 -92 -27 76 -154 -104 -47 16 15 -121 80
2647H0l31K25J94l44K56k52L45k06O5k24J84RM0k57K68J61m3k95j21L40l36L89
$$ 80 -251 -26 168 -176 80 -172 173 -33 32 -192 -8 1 41 -216 52 213 170 -125 -246 94 -242 147
2669A47m47J76K41j33J14k39j07L13k18K45j49o2R7J30k08j98J78J35J80l99K88
$$ 147 -300 -124 117 -16 98 -141 -248 65 -153 92 -57 -119 -22 108 -100 -298 -120 15 195 -204 84
2690H4k19K20Lj41J74m3J5l6j48J81J97k84Q7k08j08K62q1R0j47M7J9K97l31L27
$$ 84 -135 85 88 -53 121 78 93 57 -91 90 287 3 90 -118 -226 36 -45 45 -102 -55 -36 261 -70 257
2714B57n8j81K75n03M59l77L25k20n2K89k36q6J4L09l47J61J1j43j29L7J30J77
$$ 257 199 18 293 -210 249 -128 197 -23 -75 214 -22 -108 -94 215 -132 29 40 -103 -232 -195 -65 112
2736A12p6Q9M7n2k06J54p1O4j55L47l94K95j38P6o5j41jj8K13j0N6l91J94n5Q8
$$ 112 36 125 172 120 -86 68 -3 61 -94 253 -141 154 16 92 27 -114 -115 -133 80 70 126 -265 -71 -126 -38
2761c8J18r2l6L11l64M3L16j98q2J2J35p4k32M33j51J2r0j28J77n8J87j03N9l4
$$ -38 80 -12 -48 263 -101 -58 258 60 -22 -10 125 51 -181 252 101 113 23 -105 72 14 201 98 157 123
2785A23j4j41K7M2j66J78j66J5L6J30j03L35l33Q2p5K40K57l97J95l96O7j59J58
$$ 123 109 -32 -5 37 -129 49 -117 -102 -66 64 -39 296 -37 45 -30 210 467 70 265 -131 -64 -223 -65
2808f5Q6j99M58l40L4J56l3l78L60r9M3J04j54L08l10K3J38o7Q0O2k84R9L0k36
$$ -65 21 -178 280 -60 -26 130 97 -281 79 -20 23 127 -27 281 -29 -6 132 65 145 207 -77 22 52 -184
2832a84O9L5K75j16K6qj5J4O4k22Q9k7j10J23N8J58j00j21k4Kj6L6o9K03j89K28
$$ -184 -115 -80 195 79 105 97 82 96 160 -62 27 0 -110 13 71 229 129 8 -16 -14 -30 6 -63 140 -49 179
2858A79k8k45kl3j49K02J61r0j43K51l9k10J38K5J02l11L33m3k07K0J7Pj28K65
$$ 179 151 -94 -96 -129 -278 -76 85 -5 -148 103 64 -146 -8 17 119 -192 141 98 -109 -89 -72 -65 -193 72
2882G2l02L06K41l20l3j41K12j06J3Mk97N22j19j7K23M2k80j27M6Q6L6j00N2j20
$$ 72 -230 76 317 -3 -36 -177 35 -71 -58 -54 -351 171 52 35 258 300 20 -107 -61 25 61 -39 13 -107
2906a07j55K43O5J03j19j59J35m6K25r1k39j4p8L64l0J73l97Lk2K88j31K01m8
$$ -107 -262 -19 46 149 30 -129 6 -40 185 94 -145 -159 -237 127 97 270 -127 -124 -146 142 11 212 164
2929A64j60Q3k04M2O7K32k40nK12j88P4m2k34O9J94J26j68L8J42l21M05k31j00
$$ 164 4 87 -117 -75 -8 224 -16 -21 191 3 77 35 -199 -130 64 190 22 60 202 -119 286 55 -45
2952d5M21m56O8j9J06o3r7j71J1L26NK6n6k8kJ11j94K04j10j74K21M9J8P0k49
$$ -45 376 -80 -12 -31 75 12 -85 -256 -245 81 86 112 56 28 26 137 -57 147 37 -137 84 133 151 221 -28
2977b8j61l1M31j24j27P2l0j33K70r6J45l77K54J9m35L34M3J32k73r1J15J18j32
$$ -28 -189 -220 211 87 -40 32 2 -131 139 43 188 -189 65 84 -351 -17 26 158 -115 -206 -91 27 -105
3000a05J06l1K31j90k35K14Kp2J13J12j25P4q0j89K43K9J8r6k10oL59l06P8o9
$$ -105 1 -30 201 11 -224 -10 -8 -80 33 145 20 94 14 -175 68 97 115 19 -191 -197 162 -144 -66 -135
3024a35L53l2j45J34l72K09j05J66N1j66K56k80n6J68l9j11M7o8J04M0m2m8J74
$$ -135 218 186 41 175 -197 12 -93 73 124 -42 214 -66 -122 46 7 -104 -57 -125 -21 19 -23 -71 103
3047A03K3J6n9j00Pj11P3k1J25NJ33k23J05m7J51j76k3l7J51k9k91L14l7q0j54
$$ 103 126 142 83 -17 -10 -121 -48 -69 56 61 194 -29 76 29 180 4 -19 -56 95 66 -225 89 52 -28 -182
3072a82J31O9n7K06j22p7p9L75k79k04J90j66J06o4MJ27J51k76K26r6J79m9L6
$$ -182 -51 18 -39 167 45 -32 -111 264 -15 -219 -29 -195 -89 -153 -149 -22 129 -147 79 -17 162 113 149
3095A49N8k34j1J31o2J28l02MJ92j19P0j41P3j19M4R4J77k29K89k78pRO0K26l3
$$ 149 207 -27 -38 93 31 159 -143 -139 53 -66 4 -137 -64 -183 -139 -45 132 -97 192 -86 -93 -84 -24 202 169
3120A69j99J92j89r0J14Kp5K06q1P7r7R7j88O1q3K06j17o8J65m06J91l3K60l6
$$ 169 -30 162 -27 -117 -3 -1 -76 130 49 126 29 126 -62 -1 -84 122 5 -63 102 -304 -113 -146 114 78
3144G8J92k18m5R4PJ64l90K90k89Jj2R8J2o8K38k69L4K61j40l3j30J89q8j61J01
$$ 78 270 52 7 101 108 272 -118 172 -117 -116 -128 -30 -18 -86 152 -117 -83 178 38 5 -125 64 -24 -185 -84
3169h4J11r0L4l5j13K76k36j6J14qj74N69l02J77m4j21p3M9j07M4J88j56q4m2
$$ -84 27 -63 -29 -64 -177 99 -137 -153 -39 -47 -221 348 46 223 179 58 -15 34 -73 -29 159 3 -81 -123
3193a23j64K72j62L4M8J8j00K71j49j61K04J30o1N3j56l8j8L7J61k02K13j65r1
$$ -123 -287 -15 -177 -143 -95 -77 -177 94 -55 -216 -12 118 57 110 -46 -84 -102 -65 96 -106 107 -58 -149
3216a49J24l0l4K28q6j65K93l72K05J31n3k09R5M3J52k72J08j03j00J61mj3k8
$$ -149 -25 -55 -89 139 53 -112 181 -191 14 145 92 -117 -22 21 173 -99 9 -94 -194 -33 -37 -50 -78
3239g8Q7Q3j17rk6j07J73n2K2k5r5m2N3n3M16j43k01P1m8l0rK2K45K5L0j53N9
$$ -78 9 92 -25 -34 -60 -167 6 -46 -24 -49 -144 -186 -133 -186 230 87 -114 -43 -91 -121 -130 -108 137 162 192 39 98
3266I8j35N3l1l1J23j61n6J03Q6M0j24J88p0J1Rl90O8K63n9j76M06j52p1J8j23
$$ 98 -37 16 -15 -46 77 -84 -140 -37 49 89 -35 153 83 94 103 -287 -219 44 -15 -191 215 63 -8 10 -113
3291a13K29Pl8l29K30J82j52j73K36k55K77n3n9j37J19k00K39J42K2p3nj53J96
$$ -113 116 123 85 -244 -14 168 16 -157 79 -176 101 48 -11 -148 -29 -229 10 152 174 101 96 -57 139
3314A39rj43P3j33O9p8J51k45L7lR8J44j00J25p2m0K9l2J59l4k0l37OJ82MM6M0
$$ 139 130 -13 60 -73 -4 -82 69 -176 -139 -142 -44 100 0 125 53 13 42 10 169 135 115 -222 -216 -34 -30 16 56
3341E6l4J9o7J02k3K16j03j65Nnj42J52k0o1M2r1J69n7r8L24l59K32P0p7O0p3
$$ 56 22 41 -26 76 53 269 166 1 6 1 -141 11 -9 -70 -28 -119 50 -7 -105 219 -140 92 162 85 145 72
3367G2j26k02L15Q7l02J55M4J33k67J71l82K46J49k5nk11J72j50J98k22j19L16
$$ 72 -54 -256 59 146 -156 -1 43 176 -91 80 -302 -56 93 68 63 -148 24 -126 72 -150 -269 47
3389D7j70J81l3j94j38L20n4m8R2M5J46l06K66j50J40j08k78J25J96j12J08J48
$$ 47 -123 58 25 -169 -307 13 -41 -89 3 48 194 -112 154 4 144 36 -242 -117 79 -33 75 223
3411B23J81l38j13M6OO9q8q0o9J36j77O1J23j28K52r9j41L15p2pq9K06j40j34
$$ 223 404 66 -47 -1 5 74 -14 -94 -163 -27 -204 -143 -20 -148 104 5 -136 179 107 100 11 217 77 -57
3435e7o7L84r7j60K0k7k41N09j69J26l82K53l28J74Q2p6J48J20k25j09Q8j40J66
$$ -57 -124 260 163 3 23 -4 -245 264 95 221 -161 92 -236 -62 20 -56 92 212 -13 -122 -34 -174 -8
3458hj85M45o0k02Q1j00K45k12K06p7n9j70J08N0%Qj70L35l92L6J55m2j10n8Q1
$$ -8 -193 252 192 -10 71 -29 216 4 210 133 74 -96 12 62 62 70 -100 235 -157 -121 34 -8 -118 -176 -95
3483i5l1J19Q5J63j91r9k15K81M8J82j98m2M3Mk00K28Q0k41K4k0J22k30J75n3
$$ -95 -126 -7 78 241 50 -49 -264 17 65 247 49 7 50 54 -146 82 162 -79 -55 -75 47 -183 -8 -61
3507f1o6J6L0J36r9P2J83P7j70l8q2J39j82l56M39j24K34k16L6k04J21nl1L35
$$ -61 -127 -111 -81 55 -44 28 211 288 118 80 -2 137 -45 -401 38 -86 148 -68 -32 -236 -115 -120 -151 184
3531A84k20J0J30l5j37j29L88l26K98k87J63k8n8J4o4K88j57K04k35j06lJ82n02
$$ 184 -36 -26 104 69 -68 -197 191 -135 163 -124 39 11 -47 -33 -97 191 34 238 3 -103 -106 76 -426
3554d26N05q4J55k13M6J17k85R5K65l16K68j66J43j01k7j11J62k29J12K61r7j57
$$ -426 79 -5 150 -63 -17 100 -185 -90 175 -141 127 -39 104 3 -24 -135 27 -202 -90 171 74 -83
3576h3k1K57k54K1j14J72J57N2m56K82l49L13J50k35J15j60J12J65m73J79J53
$$ -83 -104 153 -101 -80 -194 -22 135 187 -269 13 -336 -23 127 -108 7 -153 -41 124 -349 -170 -17
3597a7R1o3l4K08j38n8K15m38L37j65J3j91K02N0l5%k4mM1k65L37m9j08J52k25
$$ -17 74 11 -23 185 47 -11 204 -234 103 -62 -49 -240 -38 12 -23 -23 -47 -51 -10 -275 62 13 -95 57 -168
3622a68K73l70L78k81K87o1k84K77J1q0O5K01j67J3k22K70j34K55m23K26m9Q4
$$ -168 105 -265 113 -168 119 58 -226 51 62 -18 47 248 81 94 -128 142 8 263 -160 66 17 101
3644A01j47O7O6j12K37m11J59k54L07r1l5J03Q5j80K68n22M39j74n5K21j63RK05
$$ 101 -46 21 87 -25 212 -199 -40 -294 13 -78 -113 -10 75 -105 163 -359 80 -94 -149 72 -91 -82 123
3667A23j92q2J59j91j95J52p3J03J72q1J65k40K48kl8r9n8J15L9N8r0K94k34L1
$$ 123 -69 -151 8 -183 -378 -226 -299 -196 -24 -105 60 -180 68 66 28 -71 -129 -14 25 83 -7 287 53 84
3691H4j62J15k78L02j6k99J53j0J30k56J76KP4R9k09K4O5p2O6K23J75l27j90q9
$$ 84 -78 37 -241 61 45 -254 -101 -111 19 -237 -61 -59 15 114 -95 -71 -6 -78 -12 211 386 59 -131 -220
3715b20J19K51k16J53O6r4j29O8K35l17J51om9L9J80j63M0j07J1Q1q3J42o5r7
$$ -220 -101 150 -66 87 153 59 -70 -2 233 -84 67 61 12 51 231 68 108 1 12 93 10 152 87 -10
3739a0J7M5J2q1Q5J1k38L18l49K46M8l64L35j58J1m5J17q0j09K51j36J97m0j22
$$ -10 7 52 64 -17 68 79 -159 159 -190 56 104 -260 75 -83 -72 -117 0 -80 -189 62 -74 123 83 -39
3763c9R3j13k21M41j92R0j92k2O7L22l6k46MM2O2k74J04j3J97l03L51r5P0Q5k08
$$ -39 54 -59 -280 161 -31 59 -133 -155 -88 234 198 -48 -44 -2 60 -214 -110 -123 74 -229 122 27 97 182 -26
3788b6J15q1J86r7P8k87J79k87L27j45J81k43O8J27M7j50L3K7j08J8Q4m4j02J22
$$ -26 89 8 194 97 175 -112 67 -220 107 -38 143 -100 -32 95 142 -8 25 52 -56 -38 46 2 -100 22
3812B2J98j47J11j57J07j67J74k30J10L1J13l16M12k93J33k10mO4O5p3P8nM4Q1
$$ 22 220 73 184 27 134 -33 141 -89 21 52 165 -151 261 -32 101 -109 -113 -49 16 -57 21 16 60 141
3836A41j99J8M2j09Q8j21L12m0r8J16l79K83j39O6m1K52j54k25K54q2J60j91j00
$$ 141 -58 -40 2 -107 -19 -140 172 132 34 150 -229 54 -85 -19 -60 192 38 -187 67 -15 145 -46 -146
3859a46K69j19j8lL3l0m6R7K06m99L11j36K17k7p8l1L10m80R0J69j33J50J4j34
$$ -146 123 4 -14 -17 16 -14 -60 37 243 -256 55 -81 136 109 31 0 310 -170 -80 89 -44 106 120 -14
3883a4j15K00m3Nl5r4J64r5J96l98L90oj09J03j01p5J54r3J10k18J76j72J21J93
$$ -14 -129 71 28 33 -2 -96 68 -27 169 -229 161 155 46 149 48 -27 127 34 144 -74 102 -70 51 244
3907B44j92P0j47o9J87p7K1o9O3qk4O8k76J5N7J68k2o3K3j88J01KJ39q9m7p8P3
$$ 244 52 122 -25 -94 93 16 37 -32 31 23 -1 67 -209 -194 -137 31 9 -54 -31 -219 -118 -116 23 -66 -113 -191 -118
3934a18N0K2Lm3j03J1J53l4N3j23J72l7r6l4K3o2j75M34K5j81pn1J64j92J42K8
$$ -118 -68 -46 -43 -86 -189 -178 -25 -59 -6 -129 43 6 -90 -124 -101 -163 -338 96 121 -60 -67 -118 46 -146 -4 24
3960B4m1Oj14J07J72j68k1k0l5P3p3J18j10K34l05L55k24O6R4j90jl0k9J62J51
$$ 24 -17 -11 -125 -18 154 -14 -35 -55 -90 -17 -90 28 -82 152 -153 202 -22 44 138 -52 -53 -83 -112 50 201
3985B01k70N8J04j24J69Nn5k9l49K10j45J25J95j85J52j66K49j11P7k45J74k09
$$ 201 -69 -11 93 -31 138 143 88 59 -290 -80 -225 -100 95 -90 62 -104 145 34 111 -134 40 -169
4007a69n9K59J96j83J23k00N5j53J13J46j7j62j6J65k4J06n6l18K17n3J3L4M3
$$ -169 -228 31 227 44 167 -33 22 -131 -18 128 111 -51 -67 98 74 180 124 -194 23 -30 -17 17 60
4030F0j52j31M36m51L08O2o6m7M7R7j73J19m7l28K97J60j91K21m58J53L3K42n0
$$ 60 -92 -223 213 -238 70 132 66 19 66 163 -10 109 62 -266 31 191 0 221 -237 -84 -51 191 141
4053A41j42L2p1k95L51l4j36K16j09P4j2j41j01K76K6j79J00J08j56K63k04M1
$$ 141 -1 31 -40 -335 16 -18 -154 62 -47 27 15 -126 -227 49 75 -104 -4 104 -52 211 7 48
4075D8j18o0L3M4J34j08j63N60m23L1p4p1Q7M7j21J54j45j15J60J30M2N4L9oj7
$$ 48 -70 -130 -97 -53 81 -27 -190 370 -53 -22 -96 -167 -80 -33 -154 0 -145 -260 -100 30 72 126 165 159 142
4100A42k33L27k49MM1n6L4Nk17j6M48o9k30J77k37J31K8j02k7J88k59M43j15k26
$$ 142 -91 236 -13 -9 32 -24 10 15 -202 -218 230 161 -69 108 -129 2 30 -72 -99 89 -170 273 158 -68
4124f8p9K34j84J37N9j03K18l08n9N72l37q2p3J63l11M05j61r9M4K26j43j77J60
$$ -68 -147 87 -97 40 99 -4 214 -94 -153 419 82 0 -73 90 -221 184 23 -76 -32 194 51 -126 34
4147C4l2J50m94L87n7L4P3Q2k33J83j49L44k99j74K39l3Q5Nj34o3K29l78J33J81
$$ 34 2 152 -342 45 -12 22 95 177 -56 127 -22 322 23 -151 88 55 140 145 11 -52 177 -201 -68 113
4171A13k42L04k1m74J33K30J7j9K4N5k49O7J0J64q3q1J54k32J41k65L05j1p7K51
$$ 113 -129 175 154 -320 -187 43 60 41 65 120 -129 -62 -52 112 29 -52 102 -130 11 -254 51 40 -37 214
4195B14l02q2L59k84R8j7m0J7L2J86j01m3j01J62j26k7L15k16k21l9L31m27QL22
$$ 214 -88 -170 189 -95 3 -14 -54 -37 -5 181 80 37 -64 98 -28 -55 260 44 -177 -216 115 -312 -304 18
4219A8o6M3M0j8j27l6R4J48k38L23l39k2K76q4N4p5nN0R7J20k26k2k1L4J01j20
$$ 18 -48 -5 35 17 -110 -146 -52 96 -142 181 -158 -180 96 12 66 -9 -14 36 133 253 27 5 -16 18 119 -1
4245aP2L6l64K92j89L68l48K51k31J06j90P5J83j36q6L16k97o9K19k27L19k16
$$ -1 71 107 -257 35 -154 214 -134 117 -114 -8 -198 -123 60 -76 -162 154 -143 -212 7 -220 99 -117
4267a17K2J46j12m9J37Lj30K15J52l04KQ4Q2m2O3j47r3n1K30k20K08j29m2L9K07
$$ -117 -95 51 -61 -110 27 30 -100 115 267 -37 -35 49 131 89 152 5 -88 -139 91 -129 79 -50 -92 -53 154
4292A54K3j31p9K74j02k41J18j17J55j63J75k2M8n7J27k43j00J81K42l29j25K71
$$ 154 177 46 -33 241 139 -102 16 -101 54 -109 66 44 92 35 162 -81 -181 0 242 -87 -212 59
4314E9K47m82R1O8K72o3j88q6K3J18L9n7j45K80m44J99J52l1jj3l6J21J59n26
$$ 59 306 -176 -85 -17 255 192 4 -82 -59 59 98 41 -104 176 -268 -69 83 52 51 38 2 123 282 -244
4338b44J72J74O4k76Q2qKop6RJ90l5k73J64J13R8k42n0k02O20k27k40L07k61J48
$$ -244 -72 102 166 -110 -28 -36 -34 -40 -116 -107 83 48 -225 -61 52 150 -92 -142 -344 276 49 -191 116 -145 3
4363CL2J6J09j83N4j91n8J22K44j11n3p3J36L5k11J49n8n7M7o4K64j41J57J1j86
$$ 3 35 51 160 -23 31 -160 -218 -96 148 37 -16 -89 47 82 -129 20 -38 -95 -48 -112 152 11 168 179 -7
4388gQ7j6l38K79j78J94QJ23l27K07P3Q0m3l37L00N5m8q5j7J25k39P5J30j46L5
$$ -7 80 64 -274 5 -173 21 29 152 -175 32 105 185 142 -195 105 160 112 27 10 135 -104 -29 101 -45 -10
4413a0j99J01J03k67J04J00K50k25K62k74J91l48o3K38J10r1K33m39K44k39J74
$$ -10 -209 -108 -5 -272 -168 -68 182 -43 219 -55 136 -212 -275 -37 73 -18 215 -224 20 -219 -45
4434d5p8j7J07o4K42j81P5nK7j66M35l49k0kJ93j57J91o8k51q0L45j71LJ28j55
$$ -45 -123 -140 -33 -97 145 -36 39 34 61 -105 330 -19 -39 -41 152 -5 186 118 -133 -213 132 -39 -36 92 -63
4459f3lj33L7K5K56L1j53KL17l50K72l17K36j10Pm7k01K81k89J35n1J48o7j85
$$ -63 -66 -199 -162 -137 119 150 -3 -1 316 -34 238 -79 157 47 54 7 -194 87 -202 -67 -118 30 -37 -222
4483b22L48k73M15k31j5P6j8l02K11K59j71J84m61K53k41K63j15o3Lr5J99q5L53
$$ -222 126 -147 268 37 22 98 80 -222 -11 248 77 261 -200 53 -188 75 -40 -103 -100 -195 4 -81 272
4506B72j39j71J26P6j75J24k7j12K88k38J16l07K75L8r6l3j41K61p9J99l76R1
$$ 272 133 -38 88 164 -11 113 86 -26 262 24 140 -167 108 146 50 17 -124 137 58 257 -119 -28
4528b8j16J33O8j75J41Q3k13N2P3O5r5M9R7k77K58J91k53j77J52j07R8L8j15J16
$$ -28 -144 -11 57 -118 23 106 -107 -55 18 83 -12 37 134 -143 115 306 53 -124 28 -79 19 57 -58 58
4552E8j66Q8j17J02J01p1L5J52l7j91J52r5K65l15R1K20k75pp7K06k18K44k18
$$ 58 -108 -20 -137 -35 66 -5 30 182 145 -46 106 11 276 -39 52 272 -3 -10 -87 119 -99 145 -73
4575g3O9Ql3J0Q3j28m6L74l28n9O3J28p7Q0j16M4j34J08P3K18l06L20l56o1N9
$$ -73 -4 4 -29 -19 64 -64 -110 264 -64 -123 -60 68 -9 71 -45 -1 -135 -27 46 264 -42 278 -78 -139 -80
4600h0N4j73L35j88O3N7n0j21JK05k3k55J56K72m81N20k90l4J78r6j37J42K1k50
$$ -80 -26 -199 136 -52 11 68 18 -103 -102 103 80 -175 -19 253 -228 292 2 -32 146 50 -87 55 76 -174
4624a74K94j28k6K7J12L4p1jr0J84j40j22J47k01L60l13K00jQ9j25j31l6P2O0
$$ -174 120 -8 -34 -7 105 139 68 67 -23 161 21 -101 46 -155 205 -108 92 91 180 55 -76 -112 -40 20
4648B0J15q0j11J3m3J19O6k57J99j30K12J77l44J18L9M1k96J33K78l49M9j23L01
$$ 20 135 55 -56 -43 -86 33 99 -158 41 -89 123 300 -44 74 113 154 -142 -9 269 -80 -31 -154 147
4671A47k80J20K8j40K5K06k24K90l99J98L17k14k25J15J79n20N76k98K00N9j01
$$ 147 -133 -13 15 -125 -100 106 -118 172 -227 -29 288 74 -151 -36 143 -377 199 -99 101 160 59
4692E9q4Qo5q6L66j64j18j06J88k42M54j02M2q4L7J6j1k17K42j02q7P4j77K03
$$ 59 -25 -17 -82 -168 198 34 -84 -190 -2 -244 210 108 150 66 103 119 108 -109 133 31 -56 18 -159 44
4716D4j85qJ94J95m01L82l75K02k3J28j46K55l46J43j19J99k60K24k19L28m4j17
$$ 44 -141 -149 45 240 -161 221 -154 48 25 153 7 262 -84 59 -60 139 -121 103 -116 212 168 51
4738E1j2O1l10n8M8J6K80K5r4n9K20p2j26J16P9k68nK41l86L03o3r0J50n6j0J7
$$ 51 39 100 -210 -268 -220 -204 76 101 7 -52 168 96 -30 86 165 -103 -108 133 -253 50 -13 -103 47 -9 -19 -2
4764bJ10j6j81q2K47j0j73L7M6K79k23K29k34j03K24k90K84r6J8p6jN6J62m40
$$ -2 108 92 -89 -171 76 66 -107 -70 -24 255 32 261 27 -76 148 -142 142 46 64 -12 -13 43 205 -235
4788b35L43k83K56J64j69J33J12j78j57j1n8L0K29j49k5m3j38K90l21J84L9J61
$$ -235 108 -175 81 245 76 209 321 143 -14 -25 -83 -53 176 27 2 -41 -179 111 -210 -26 13 174
4810A74j83k86L59l22J67K17k00J77j9j90K76j94nJ10k23K13m7M6k02J33M7q7
$$ 174 -9 -295 64 -258 -91 126 -74 103 84 -106 170 -24 -29 81 -142 71 24 70 -132 1 48 -39
4832c9k88K57J4J13K1j66K14k13n1R7J20k81O8J06k75L91j16N4J28l35K85lJ69
$$ -39 -327 -70 -56 57 78 -88 126 -87 -138 -41 79 -202 -134 -28 -303 88 -28 26 154 -181 104 101 270
4855B70j34n1r4mq2P5P6L5k60J33r2J01q4Q2j0l70M71n3M7J89m47O4K91k84J87
$$ 270 136 85 -9 -13 -95 -20 56 91 -169 -36 -128 -27 -111 -29 -39 -409 62 9 56 245 -202 -138 153 -131 56
4880E6l4o1J75l99J74K76k11L8M4k54L94k20p6J09k48K99j97K5L64m14K09P7j45
$$ 56 22 -39 136 -263 -89 187 -24 14 58 -196 198 -22 -98 11 -237 62 -135 -110 254 -160 49 126 -19
4903a9K13k26J27Q8J70n93L62l21J49o4J24j82R2J04j40K12l37K74p4q2K81j62
$$ -19 194 -32 95 183 353 -240 122 -199 -50 -114 10 -172 -80 24 -116 96 -241 33 -41 -123 158 -4
4925dJ49J91l33k7l3P9J51j81K33j51l8j39P0J31l56M88m37j6K20k55K22O0j1
$$ -4 145 336 3 -24 -57 22 173 -8 225 74 36 -103 -33 98 -258 230 -207 -223 -3 -258 -36 24 13
4948A3K6J38l01Q7J04j31R8j17O1k03L27j79K59l01J36L4j13J52k48R5K67l3p0
$$ 13 39 177 -124 -37 67 -64 34 -83 -22 -225 102 -77 182 -119 17 51 -62 90 -158 -63 204 171 101
4971A01M5k55j03J64L7r7J93j19N7p6J47j39j11K06q9J52k52L07l03L30j11j22
$$ 101 146 -109 -212 -48 -11 -108 85 -34 23 -53 94 -45 -156 50 -39 113 -139 168 -135 195 84 -38
4993c8L8L15l47L0M2o7R0J19j70l9O5m5n7L55m45M26j89K00k67m4J47j42M4J00
$$ -38 0 315 -32 -2 40 -27 63 182 12 -27 38 -7 -64 291 -154 272 83 283 16 -28 119 -23 21 121
5017A21R5j87n4j49M21k91l11O32k58o8j39J72K7m4J9J61j82j02K03l2M8m8kQ5
$$ 121 216 29 -25 -174 247 -44 -355 277 19 -49 -188 -16 11 -33 -14 147 -35 -137 66 34 82 34 32 117
5041A17m99L08kJ21Rj67J43j50J90J6j24J70k05j77K00L4j49L32J32m87j6K14
$$ 117 -382 -74 -76 45 54 -113 30 -120 70 86 -38 132 -73 -250 -50 -16 -165 167 299 -188 -204 10
5063A0l0j15R0j40j62M50p1K5o5K2O6j50J05j83J28r3J87l7m9O1J55j78K0J85
$$ 10 -20 -135 -45 -185 -347 103 32 57 -8 14 80 -70 35 -148 -20 -113 74 37 -12 49 204 26 46 231
5087B31l06N7j26J48O6j33k03J72J63j33Mj91M22k31K1K34l20L15k97K93j27j59
$$ 231 -75 -18 -144 4 70 -63 -266 -94 69 -64 -60 -251 171 -60 -39 195 -125 190 -107 186 59 -100
5109a00O0K23k18J51k45j75L69p3r9K92k39k12L66m3n6J00j57L16l08J90l21J69
$$ -100 -40 183 -35 116 -129 -304 65 -8 -107 185 -54 -266 100 57 1 101 -56 260 -48 142 -179 -10
5131a0J86Pm17M30l9j43R3k03M06l80R4M8mk10J75k1l9qR5k0P6m56K64m4J80j4
$$ -10 176 183 -234 196 157 14 107 -96 310 -70 24 72 68 -142 33 12 -27 -35 60 40 116 -340 -76 -120 60 46
5157D6l4P3J10k37p3J43o2K05j62N7O5n5k10K73j1l81M65l87J10q2R9q8J72n0
$$ 46 12 85 195 -42 -115 28 -34 171 9 66 131 76 -134 139 128 -253 212 -175 -65 -147 -48 -136 36 -14
5181a4%n3Q6N1n0j58k00L16Lpj64K31j8o8K06j06j20j1Q1m2L0R5j56J30j64J37
$$ -14 -14 -67 19 70 20 -138 -338 -22 -19 -26 -190 41 23 -45 161 55 -65 -76 5 -37 -7 88 -68 62 -102 35
5207C5j32K41O2k42j43l0K74J5l0K8Q4k44K01l6P2k18J59j03J37j28j53K83k64
$$ 35 -97 144 206 -36 -179 -209 65 80 50 78 162 -82 119 83 155 -63 96 -7 130 2 -151 132 -132
5230a32o1JO7P8J4j74L45k06j14L17j93N5j8j3J72j95r8J81k12J70J7j13J45o0
$$ -132 -193 -192 -125 -47 -33 -207 138 -68 -182 135 -58 -3 -21 -34 138 -57 -155 26 -186 -16 1 -112 33 -27
5254b7J50j76Km6k7K51j45R5j64J46l18O4j33L04R2k40L2K49j97J22o4K31j80
$$ -27 123 -53 -51 -97 -124 127 -18 77 -87 59 -259 -195 -328 -24 68 -172 -140 109 -88 34 -30 201 21
5277B1J07J17l26J4J9k7K00j10L2pj57K8O9j70MJ63q1Q3m4j3KK80p3k46L19k03
$$ 21 128 245 -81 -67 -48 -75 125 15 47 40 -117 -89 -20 -190 -186 -23 -104 -21 -65 -78 -76 204 131 -115 204 1
5303AK4j07L54j59j91M5J4JJ55k92k3J57o6J59j4J37k07J67m43N12k25J38J03
$$ 1 25 -82 272 113 -78 -33 -19 -18 137 -155 -178 -21 -87 72 58 195 -12 155 -288 224 -1 137 240
5326B40n0l2M0k42M2P5jj27M6K4Rk54L72k05JJ01J38k7l28O3Q6L36k83K5p9k7
$$ 240 190 158 198 -44 -2 73 72 -55 -9 15 24 -230 142 -63 -62 39 177 150 -178 -115 -29 307 24 49 -30 -57
5352e7J24J7n2l9lp9k5K38j02RJ01k02K52j76p4NN8j40L24%j30q3O4K8pj38p0
$$ -57 67 84 32 -7 -10 -89 -114 124 22 31 132 -70 182 6 -68 -63 -5 -145 179 179 49 -34 30 58 51 -87 -157
5379a57M8Q9J96k10J11m7K59m73K9J15k13J66J66k19K40rj48Q2j94J38J09m8k94
$$ -157 -109 -20 176 -34 77 30 289 -184 -155 -40 -253 -87 79 -140 100 91 -57 25 -169 -31 78 30 -264
5402b64l5K20N8j03K39j83Q0P6j05j43l2K74K6k11j1K96k36L65l28j98K15o4J49
$$ -264 -299 -79 -21 -124 115 -68 12 88 -17 -160 -192 82 108 -103 -114 182 -54 311 -17 -215 0 -64 85
5425H5k87L32p0j67L70j09J0J47k69kJ07j99l5J36k26j84M37r8j84K48K68m45
$$ 85 -202 130 60 -107 263 154 164 311 42 40 147 -52 -87 49 -177 -361 76 -22 -206 42 310 -135
5447a35R8n3J32j28lj00J55J90q8j53M3l0J54r9L2L8Q7l74L09k28O9K37k4J97
$$ -135 -37 -90 42 -86 -89 -189 -34 156 68 -85 -42 -72 82 -17 15 53 140 -234 75 -153 -84 153 129 326
5471C26n66K1L08l5j02J08q1J93j27J47j59j00Q8L4k3j26K68l09m6rL3J19J08
$$ 326 -240 -219 89 54 -48 60 -21 172 45 192 33 -67 21 55 32 -94 174 -135 -181 -190 -157 -38 70
5494G0L9l01L81J33k48N8k83K81n4J29j82p3M0K17l06J92l3k29J75j28j04K32
$$ 70 109 -192 189 322 74 132 -151 130 76 205 23 -50 -10 207 -99 93 60 -169 6 -122 -226 6
5516Fr9j22J85P5k51L15p7K1Nk8NJ9L3m03L57j6K3o3k7K25k15j82J9L64k9l40
$$ 6 -93 -215 -30 45 -206 109 32 53 58 30 35 54 87 -316 41 25 48 -15 -42 183 -32 -214 -195 169 140 -200
5542b00K78n6P4j4QK6k71K63j22L06J3j47m5k06J84K5k86K02R3r6k16L05o7j78
$$ -200 78 22 96 82 90 116 -155 108 -14 292 305 158 113 -93 91 116 -170 32 125 29 -187 118 51 -127
5566a27K00j81J95p1j10N3r6j43K1J40K84j67r4P2j47J02n5J86k66LJ14j16J95
$$ -127 73 -108 87 16 -94 -41 -137 -280 -259 -119 165 -2 -96 -24 -171 -69 -124 62 -204 -201 -87 -203 -8
5589hm7o3J51N1j66J31m0o4J57r4j20n0L93k10M9l19K03q0K09Q3j67j56L37r6
$$ -8 -55 -118 33 84 -82 49 9 -55 102 8 -112 -162 231 21 70 -249 -46 -126 83 166 -1 -157 180 84
5613H4p1K08k26q3P7M2J07Q8k88k36K99k21j8J13m3O3J02O6k16J12L0j92K96k61
$$ 84 13 221 -5 -88 -11 31 138 226 -62 -298 1 -220 -238 -125 -168 -105 -3 63 -153 -41 -11 -203 93 -168
5637a68J15J55j68K34k42Q6Q1p5P1k23K61k8l2lk1L11m95O6K2J03L9Q6l8k61K0
$$ -168 -53 102 -66 168 -74 12 93 18 89 -134 127 99 67 64 43 354 -141 -75 -53 50 89 175 137 -124 -104
5662a04M19l65j03L22r1j09k23K06O4j32J52o0K92l76N7o2m1J59R1j39j96L32
$$ -104 315 -50 -153 169 78 -31 -254 -48 16 -116 36 -24 268 -108 -51 -113 -154 5 96 -43 -239 93
5684I3r0P1k20P6J75j48O3k61L78j87L4K43j80j17K00j35k45L96j22j06J27l13
$$ 93 3 74 -146 -70 105 -43 20 -241 137 -50 -16 227 47 -70 130 -5 -250 146 24 -82 45 -268
5706b68J94PJ56j03Q8r1K2K29j73O0l44J6L56l03K45j11P5K2R8l88K48j46K08
$$ -268 -74 -67 89 -14 74 -17 5 234 61 121 -223 -207 149 -154 91 -20 55 77 175 -213 35 -111 97
5729I7l1o6K3j62K58J06L2m63L91j76nJ2n1m6N8k4K24l4j58Qk23K29O4j31J32
$$ 97 66 0 23 -139 119 225 257 -206 185 9 4 16 -35 -81 -23 -47 177 143 -15 -7 -230 -1 63 -68 64
5754F4J6J41k08q5J69J0k97J22j08M52m32O2M3p4J83o3k06J55J46n0J73k85J35
$$ 64 80 221 13 -72 97 107 -190 -68 -176 276 -156 -94 -51 -125 58 -5 -211 -56 90 40 213 -72 63
5777F3rp2J07j70o7J01K20j73j07K70l56J82K31q4J4k36oJ4q7q2Q1L52j46P4r5
$$ 63 54 -18 89 -81 -148 -47 173 0 -107 163 -193 -11 220 136 150 -86 -92 -78 -165 -247 -166 186 40 114 19
5802A9l28J77J75k76L45k32J78L6K0k15PJ61J07k31J67j45R4m0J2q1O9P8Nj45
$$ 19 -309 -132 43 -233 112 -120 58 94 114 -101 -94 67 174 -57 110 -35 59 19 31 -50 19 97 102 -43
5826d3J17J47j53K50k52k65J1J14j1L7j31K8J26n6k1J26m72M18k4J56k59M24l68
$$ -43 74 221 68 318 66 -199 -188 -74 -85 -48 -179 -151 -25 -81 -102 24 -448 -30 -54 102 -157 267 -101
5849a01L29m13K46No4R2k14J14j86K74rk45K88l44J48J70j05j65q2L66j86q1J78
$$ -101 228 -185 61 66 2 94 -120 -6 -192 82 73 -172 116 -228 -80 90 -15 -180 -262 104 -82 -163 15
5872A5k11K74j50L08j73N9l08K71j52J17k9p8L1j13M0J11j70J93N3k13j8K04k23
$$ 15 -196 78 -72 236 63 122 -186 85 -67 50 21 -57 -26 -139 -99 12 -158 35 88 -125 -143 61 -162
5895a62M4L27j5k14K3r7K36nr1j05J10r9m2k1n0k59M02K8J00k48nL27l23Q6J6
$$ -162 -118 209 194 -20 3 -94 142 137 46 -59 51 -48 -90 -111 -161 -420 -18 10 110 -138 -143 184 -139 -53 -37
5920c7p4J45j1k21J45j36J22J17J5J6Q7O9k5j07k5O3k78L71l38K15n0j51M8j34
$$ -37 -111 34 23 -198 -53 -189 -67 50 65 81 168 237 212 105 80 143 -135 236 -102 113 63 -88 -40 -174
5944a74O6K59o5j7Q7k62j6m7J47j47J58J37j01K6p3J06j84O9Q3j46P1O3J95l48
$$ -174 -108 151 86 69 156 -106 -122 -169 -22 -169 -11 126 25 51 -22 84 -100 -31 52 -94 -23 40 235 -113
5968a13L22r2k02Q7r6M7j30K52j9p4J06J4k05J27j36J24O9j55K40j68n9K47j17
$$ -113 209 117 -85 2 -94 -47 -177 75 56 -18 88 102 -103 24 -112 12 81 -74 166 -2 -61 186 69
5991F9j59j56O10m51j57q1K92J76k1o4j6j08J86j03j30K98r4pj20K6j52J77j44
$$ 69 -90 -246 364 -87 -244 -325 -33 143 122 58 42 -66 120 17 -113 185 91 84 -36 -10 -162 15 -129
6014a29J52k29q8J5J58J91K50m46J21R2k26Q6M4J42k01j7j72L40l07M26k46K60
$$ -129 23 -206 -294 -279 -121 70 320 -126 -5 87 -139 -53 -9 133 -68 -85 -257 83 -224 202 -44 216
6036B16l83K77l09K38l4q2K29k52j13L04k73L20j31n4L47m00P1j98L61o7k02Q7
$$ 216 -167 110 -199 39 5 -77 152 -100 -213 91 -182 138 7 -47 300 -100 -29 -227 134 67 -135 -48
6058d8J59j93M00r3l80K19o9k9L14j00k31R1O8J41j17j48P9O4p4K1O3j30k62L66
$$ -48 111 -82 318 225 -155 64 -5 -34 280 180 -51 40 108 249 132 -16 63 127 53 74 137 7 -255 111
6082A11l47K99l2n5q3K93l1nl85K97j9J36j05k01o5L54q2j19J82k86M00j98J74
$$ 111 -236 63 31 -24 -107 186 155 150 -235 62 43 179 74 -127 -192 162 80 -39 143 -143 257 59 233
6105B33k96N9j91L37K6p8j38j46K63p6n7J70J09m0k03j36J74r0n3K87l36K53j09
$$ 233 -63 -4 -195 142 168 90 -48 -194 69 -7 -64 106 215 175 -28 -164 10 -80 -133 154 -182 71 -38
6128c8K72l93J20j26L0K39k51Q9Rj46J32j9Pl05M21q0K68j17k19K8o5o8K50L3
$$ -38 234 -159 -39 -165 -135 104 -147 -58 -49 -195 -63 -82 -75 -380 41 -39 229 112 -107 -79 -144 -212 38 71
6152G1K65j65j85l4l11L62M5J13j10m5M7j00q4R5J4P2p9j36J9N2L40k72p8r9J96
$$ 71 336 171 -14 -48 -359 3 48 161 51 6 53 -47 -131 -36 -22 50 -29 -165 -146 -94 246 -26 -104 -203 -7
6177gJ37j14K3p9J32R9j63J58m46K18O3J3J14j97Q8K62m53K83j45J86l98K51L3
$$ -7 130 16 39 -40 92 191 28 186 -260 -42 21 34 148 -49 39 301 -152 131 -14 172 -226 25 58
6200E8j53K20l33J53L10k39J45k53Q1J36J4p0l86L85j04m3J04R6k03M9N9j63L9
$$ 58 -95 125 -208 -55 255 16 161 -92 -11 125 139 69 -317 68 -36 -79 25 121 -82 -33 26 -137 -98
6223i8K29l7R4j64n5j49K59j36J16K27l31N3j24k7K62j58k4rQ9k5n3J48q6r4O7
$$ -98 131 94 188 24 -31 -180 79 -57 59 286 -45 8 -116 -143 119 -39 -63 -72 17 -8 -61 87 1 -93 -26
6248b6k8o2K57k74l8R2J92j66r0L66j30l03p2K11k37M14p4j87M9o5P8k4N03l97
$$ -26 -54 -116 141 -133 -171 -79 113 -53 -143 223 93 -210 -282 -71 -308 106 32 -155 -106 -171 -93 -117 386 -11
6272a1j94J55J96O3j47N3r1k24R0J58k08K40K90k79K9k82N3n3k6K13k5j7l4J01
$$ -11 -205 -50 146 209 62 115 24 -200 -110 48 -160 80 370 91 120 -162 -109 -162 -188 25 0 -17 -51 50
6296E0O3k16J45k74j54M07K13k5m04K23j80J83ql0N3k6j91K59pj75Q7j99K30Q6
$$ 50 113 -103 42 -232 -386 21 234 209 -195 28 -152 31 23 -7 46 20 -171 88 81 -94 -7 -206 24 110
6320A10j1k37J83j51nMK18rr5k6j55K15M6j16K55j47j28r0J05P6j3p4j15J61J22
$$ 110 99 -138 45 -106 -111 -107 111 102 7 -19 -174 41 87 -29 226 79 -49 -139 -34 42 29 -45 -160 1 123
$$ [...]
8191A57
##END NTUPLES=NMR FID
##END=
