##TITLE=1H_DEPH-Gly_sum
 200.13MHz,D2O.
 8 sc
 
 19.2.2026
##JCAMPDX= 6.0         $$ Bruker NMR JCAMP-DX V2.0
##DATA TYPE= NMR FID
##DATA CLASS= NTUPLES
##ORIGIN= UXNMR, Bruker Analytische Messtechnik GmbH
##OWNER= pz
$$ XWIN-NMR		Version 3.5
$$ Thu Feb 19 16:00:46 2026 Russian Standard Time (UT+4h)  she@DPX200
##.OBSERVE FREQUENCY= 200.1313
##.OBSERVE NUCLEUS= ^1H
##.DELAY= (6, 6)
##.ACQUISITION MODE= SIMULTANEOUS
##.ACQUISITION SCHEME= undefined
##.AVERAGES= 8
##.DIGITISER RES= 18
##SPECTROMETER/DATA SYSTEM= spect
##.PULSE SEQUENCE= zg30
##.SOLVENT NAME= D2O
##.SHIFT REFERENCE= (INTERNAL, D2O, 0, 14.3821)
##AUDIT TRAIL= $$ (NUMBER, WHEN, WHO, WHERE, WHAT)
$$ ##TITLE= Audit trail, XWIN-NMR		Version 3.5
$$ ##JCAMPDX= 5.01
$$ ##ORIGIN= Bruker BioSpin GmbH
$$ ##OWNER= she
$$ F:/spectra/data/she/nmr/H-C/1/audita.txt
$$ ##AUDIT TRAIL=  $$ (NUMBER, WHEN, WHO, WHERE, WHAT)
(   1,<2026-02-19 15:59:03.79 +0400>,<she>,<DPX200>,
      <created by zg, POWCHK disabled, PULCHK disabled
       configuration hash MD5:
       00 E9 B6 7A A2 85 ED C7 34 08 36 98 17 FE 4E 26
       data hash MD5: 16K
       91 EE D3 9B D5 B2 EC D3 E0 DB AA 4D F3 45 11 17>)
$$ ##END=
$$ 
$$ hash MD5
$$ 37 65 6C D8 B8 25 8C 2F 76 A8 F7 37 5B 95 25 AB
##$RELAX= 
##$RELAX= 
##$RELAX= 
##$RELAX= 
##$RELAX= 
##$RELAX= 
$$ Bruker specific parameters
$$ --------------------------
##$DU= <F:/spectra>
##$EXPNO= 1
##$NAME= <H-C>
##$PROCNO= 1
##$TYPE= <nmr>
##$USER= <she>
##$AMP= (0..31)
100 100 100 100 100 100 100 100 100 100 100 100 100 100 100 100 100 100 
100 100 100 100 100 100 100 100 100 100 100 100 100 100 
##$AQSEQ= 0
##$AQ_mod= 1
##$AUNM= <au_zg>
##$AUTOPOS= <>
##$BF1= 200.13
##$BF2= 200.13
##$BF3= 200.13
##$BF4= 200.13
##$BF5= 200.13
##$BF6= 200.13
##$BF7= 200.13
##$BF8= 200.13
##$BYTORDA= 1
##$CFDGTYP= 0
##$CFRGTYP= 5
##$CHEMSTR= <none>
##$CNST= (0..31)
1 1 145 1 1 1 1 1 1 1 1 1 1 1 1 1 1 1 1 1 1 1 1 1 1 1 1 1 1 1 1 1 
##$CPDPRG= <>
##$CPDPRG1= <>
##$CPDPRG2= <>
##$CPDPRG3= <>
##$CPDPRG4= <mlev>
##$CPDPRG5= <mlev>
##$CPDPRG6= <mlev>
##$CPDPRG7= <mlev>
##$CPDPRG8= <mlev>
##$CPDPRGB= <>
##$CPDPRGT= <>
##$D= (0..31)
0 0.7 0 0 0 0 0 0 0 0 0 0.03 0 0 0 0 0 0 0 0 0 0 0 0 0 0 0 0 0 0 0 0 
##$DATE= 1771502343
##$DBL= (0..7)
120 120 120 120 120 120 120 120 
##$DBP= (0..7)
150 150 150 150 150 150 150 150 
##$DBP07= 0
##$DBPNAM0= <>
##$DBPNAM1= <>
##$DBPNAM2= <>
##$DBPNAM3= <>
##$DBPNAM4= <>
##$DBPNAM5= <>
##$DBPNAM6= <>
##$DBPNAM7= <>
##$DBPOAL= (0..7)
0.5 0.5 0.5 0.5 0.5 0.5 0.5 0.5 
##$DBPOFFS= (0..7)
0 0 0 0 0 0 0 0 
##$DE= 6
##$DECBNUC= <off>
##$DECIM= 32
##$DECNUC= <off>
##$DECSTAT= 4
##$DIGMOD= 1
##$DIGTYP= 9
##$DL= (0..7)
0 120 120 120 120 120 120 120 
##$DP= (0..7)
150 150 150 150 150 150 150 150 
##$DP07= 0
##$DPNAME0= <>
##$DPNAME1= <>
##$DPNAME2= <>
##$DPNAME3= <>
##$DPNAME4= <>
##$DPNAME5= <>
##$DPNAME6= <>
##$DPNAME7= <>
##$DPOAL= (0..7)
0.5 0.5 0.5 0.5 0.5 0.5 0.5 0.5 
##$DPOFFS= (0..7)
0 0 0 0 0 0 0 0 
##$DQDMODE= 0
##$DR= 18
##$DS= 0
##$DSLIST= <SSSSSSSSSSSSSSS>
$$ [...]
##$SUBNAM0= <"">
##$SUBNAM1= <"">
##$SUBNAM2= <"">
##$SUBNAM3= <"">
##$SUBNAM4= <"">
##$SUBNAM5= <"">
##$SUBNAM6= <"">
##$SUBNAM7= <"">
##$SUBNAM8= <"">
##$SUBNAM9= <"">
##$SW= 18.0517328524113
##$SWIBOX= (0..15)
0 0 2 0 0 0 0 0 0 0 0 0 0 0 0 0 
##$SW_h= 3612.71676300578
##$TD= 16384
##$TD0= 1
##$TE= 0
##$TE2= 300
##$TE3= 300
##$TEG= 300
##$TL= (0..7)
0 120 120 120 120 120 120 120 
##$TP= (0..7)
150 150 150 150 150 150 150 150 
##$TP07= 0
##$TPNAME0= <>
##$TPNAME1= <>
##$TPNAME2= <>
##$TPNAME3= <>
##$TPNAME4= <>
##$TPNAME5= <>
##$TPNAME6= <>
##$TPNAME7= <>
##$TPOAL= (0..7)
0.5 0.5 0.5 0.5 0.5 0.5 0.5 0.5 
##$TPOFFS= (0..7)
0 0 0 0 0 0 0 0 
##$TUNHIN= 0
##$TUNHOUT= 0
##$TUNXOUT= 0
##$USERA1= <user>
##$USERA2= <user>
##$USERA3= <user>
##$USERA4= <user>
##$USERA5= <user>
##$V9= 5
##$VALIST= <valist>
##$VCLIST= <CCCCCCCCCCCCCCC>
##$VD= 0
##$VDLIST= <DDDDDDDDDDDDDDD>
##$VPLIST= <PPPPPPPPPPPPPPP>
##$VTLIST= <TTTTTTTTTTTTTTT>
##$WBST= 1024
##$WBSW= 4
##$XGAIN= (0..3)
0 0 0 0 
##$XL= 0
##$YL= 0
##$YMAX_a= 142381
##$YMIN_a= -134729
##$ZGOPTNS= <>
##$ZL1= 120
##$ZL2= 120
##$ZL3= 120
##$ZL4= 120
##$ABSF1= 10
##$ABSF2= 0
##$ABSG= 5
##$ABSL= 3
##$ALPHA= 0
##$AQORDER= 0
##$ASSFAC= 0
##$ASSFACI= 0
##$ASSFACX= 0
##$ASSWID= 0
##$AUNMP= <proc_1d>
##$AZFE= 0.1
##$AZFW= 0.1
##$BCFW= 1
##$BC_mod= 2
##$BYTORDP= 1
##$COROFFS= 0
##$CY= -3
##$DATMOD= 1
##$DC= 2
##$DFILT= <>
##$DTYPP= 0
##$F1P= 0
##$F2P= 0
##$FCOR= 0.5
##$FTSIZE= 0
##$FT_mod= 4
##$GAMMA= 1
##$GB= 0.15
##$INTBC= 1
##$INTSCL= 1
##$ISEN= 128
##$LB= 0.25
##$LEV0= 0
##$LPBIN= 0
##$MAXI= 10000
##$MC2= 0
##$MEAN= 0
##$ME_mod= 0
##$MI= 1.114404
##$NCOEF= 0
##$NC_proc= 0
##$NLEV= 6
##$NOISF1= 3.799351
##$NOISF2= 2.8
##$NSP= 1
##$NTH_PI= 0
##$NZP= 0
##$OFFSET= 14.38212
##$PC= 1
##$PHC0= -3696.028
##$PHC1= -2.407683
##$PH_mod= 1
##$PKNL= yes
##$PPARMOD= 0
##$PSCAL= 0
##$PSIGN= 0
##$REVERSE= no
##$SF= 200.129724274929
##$SI= 16384
##$SIGF1= 3
##$SIGF2= 2
##$SINO= 400
##$SIOLD= 16384
##$SREGLST= <1H.CDCl3>
##$SSB= 0
##$STSI= 0
##$STSR= 0
##$SW_p= 3205.1282051282
##$SYMM= 0
##$S_DEV= 0
##$TDeff= 0
##$TDoff= 0
##$TI= <>
##$TILT= no
##$TM1= 0
##$TM2= 0
##$TOPLEV= 0
##$USERP1= <user>
##$USERP2= <user>
##$USERP3= <user>
##$USERP4= <user>
##$USERP5= <user>
##$WDW= 1
##$XDIM= 8192
##$YMAX_p= 0
##$YMIN_p= 0
$$ End of Bruker specific parameters
$$ ---------------------------------
##NTUPLES= NMR FID
##VAR_NAME=  TIME,          FID/REAL,        FID/IMAG
##SYMBOL=    X,             R,               I
##VAR_TYPE=  INDEPENDENT,   DEPENDENT,       DEPENDENT
##VAR_FORM=  AFFN,          ASDF,            ASDF
##VAR_DIM=   8192,          8192,            8192
##UNITS=     SECONDS,       ARBITRARY UNITS, ARBITRARY UNITS
##FACTOR=    0.0002768,     1,               1
##FIRST=     0,             0,               0
##LAST=      2.2672688,     0,               0
##MIN=       0,             -134729,         0
##MAX=       2.2672688,     142381,          0
$$ Real data points
##PAGE= N=1
##DATA TABLE= (X++(R..R)), XYDATA
$$ [...]
1439C20r26k41J71L5L50K15P40L66m44k76p07m38J10J07K29K69O24L35j73n61
$$ 320 -606 -847 -676 -641 -291 -76 664 1030 586 310 -397 -835 -725 -618 -389 -120 504 839 666 105
1459A05j00l81l00n87P72P65K28o7N9O8l43p21k07N2K90K51L88K10L80m02k91
$$ 105 5 -376 -676 -1263 -491 274 502 435 494 562 219 -502 -709 -657 -367 -116 272 482 862 460 169
1480A69n26k20K32l0Q5K18P18K85m35p22L5m3k95l30L52P51M88l48r6J87l74n36
$$ 169 -357 -577 -345 -375 -290 -72 646 931 496 -226 -191 -234 -529 -859 -507 244 732 384 288 475 101 -435
1502d35m00J23N17L05K54n2J36k3k53m94l49K62K33j8K76M28M65n00o70j96l6
$$ -435 -835 -712 -195 110 364 312 448 425 172 -322 -671 -409 -176 -194 82 510 975 475 -195 -391 -427
1523d27J53l82M70L15M30j27m8j64l12l50j47J56L04L12J51K62k66M8k74o36r8
$$ -427 -274 -656 -186 129 559 432 384 220 -92 -442 -589 -433 -129 183 334 596 330 378 104 -532 -630
1544f30J59L27J89J09K09L49m35m64k03J38k09K05K05L60L59p0l85l79l8m13J06
$$ -630 -471 -144 45 154 363 712 277 -187 -390 -252 -461 -256 -51 309 668 598 213 -166 -204 -617 -511
1565e11O8L36N06L6K03l24j33l89j70j32R6K02L19L65R6j51o7m30k04j20P2J15
$$ -511 -443 -107 399 435 638 314 181 -208 -378 -510 -414 -212 107 472 568 417 350 -80 -284 -404 -332 -217
1587b17J69L27q8O3j99j08l01j4j01L02K25J89N2J20l09Mm59k0Mk6J42M40K98
$$ -217 -48 279 191 254 55 -53 -354 -368 -469 -167 58 247 299 419 110 114 -345 -365 -361 -387 -245 195 493
1610D93k28K9j79j67l54J56j54K59L07K65k7k86J03k85k45j12J20L0L80P7L04
$$ 493 265 294 115 -52 -406 -250 -404 -145 162 427 400 114 217 -68 -313 -425 -305 -275 105 182 486
1631D86j19k10j21k98j72n0K21J78J99M27j75m0l79j26q7kM8J85K00J43n2J01
$$ 486 367 157 36 -262 -434 -484 -263 -85 114 541 366 326 -53 -179 -266 -268 -220 -35 165 308 256 357
1653C57m29n1m5j48M6J09K04K99N4k06R2l46k37MJ15P4J22K63L26n8m24j58j01
$$ 357 -72 -123 -168 -316 -270 -161 43 342 396 190 282 -64 -301 -297 -182 -108 14 277 603 545 121 -37 -138
1676a38j45PN4K20K45M6n4q6k33p8j42O5K17q0K89K10j45n3k31j15k57J25J51
$$ -138 -283 -276 -222 -2 243 289 235 149 -84 -162 -304 -239 -22 -102 187 397 252 199 -32 -147 -404 -279 -128
1699a28J87O4J16Kn7k31m0p5j2J20j67J94K43pp8n5o6j87K9j0n8K50J92k05K20
$$ -128 59 123 239 241 184 -47 -87 -162 -174 -54 -221 -27 216 209 131 76 10 -177 -148 -158 -216 34 226 21 241
1724B41j98j06j18j75J73p5K15K32Q6J0k48N1j85l8j78J23R5K74J36P9j19k60
$$ 241 43 -63 -181 -356 -183 -258 -43 189 275 285 37 88 -97 -135 -313 -190 -95 179 315 394 275 15
1746A5o9k20N1N2J82J72K1O4J3k45j72k00j5K72NK34m0J96nj82j66j80O6l2P0
$$ 15 -54 -274 -223 -171 11 183 204 268 281 36 -136 -336 -351 -79 -74 160 120 316 311 129 -37 -217 -151 -183 -113
1771a13R9J00J73j7j51j10r5k84J16Q4J77K25R3j01j32K9k82P1q8K56j49J16j
$$ -113 -14 86 259 242 91 -19 -114 -398 -282 -198 -21 204 297 196 64 93 -189 -118 -206 50 -99 17 16
1794A6R5P8j66j6l00J93k8J44nR3J15pj77q7j69j49J14J01L2K75M1N8O2k91j39
$$ 16 111 189 23 7 -293 -100 -128 16 11 104 219 212 35 -52 -221 -370 -256 -155 -123 152 193 251 313 22 -117
1819a17l1Nm0Q6J68J63j82N5j14o0O6j19o8J37J60M8l0l4j50Q8k64O3P2M3P4J90
$$ -117 -148 -143 -183 -97 71 234 52 107 -7 -67 -1 -120 -188 -51 109 157 127 93 -57 31 -233 -170 -98 -55 19 209
1845B09j46J09k0j62k70j33K18N9Q8J72p3L1n3j23j88J18o4M7J60K44n2J06j35
$$ 209 63 172 152 -10 -280 -413 -195 -136 -48 124 51 82 29 -94 -282 -164 -228 -181 -21 223 171 277 142
1868A42o7j73P8j64K14J68L9m8j99o8L7O1k39N9R7K8l4J31K00l82J71j36N7p4
$$ 142 75 -98 -20 -184 30 198 237 189 -10 -78 -41 20 -219 -160 -63 -35 -69 62 262 -120 51 -85 -28 -102
1892a02q9K51J71M8l49K23j03l21J00K06q4Q8j34K79j78j6j6J33k31J8P4o5M9
$$ -102 -191 60 231 279 -70 153 50 -271 -171 35 -49 39 -95 184 6 -10 -26 107 -124 -106 -32 -97 -48
1915d8M6P6P6L7l05N5j48KK20m2K6R4j8j07J70j66n1l1j9R4J77p5P9L0j58J8k96
$$ -48 -2 74 150 187 -118 -63 -211 -209 11 -31 -5 89 71 -36 134 -32 -83 -114 -133 -39 138 63 142 172 14 32 -264
1942b64j00K64J06lJ34oM3k02J05q9N2m0n4n8K27J50k83O9J24k28j65L4J07J61
$$ -264 -364 -100 6 3 137 131 174 -28 77 -12 40 0 -54 -112 115 265 -18 51 175 -53 -218 -184 -77 84
1966H4p2J83q8j26R2m7j16j09NK08J24j16J9L7k13J79j75J09j97n2J53J87K7K5
$$ 84 12 195 107 -19 73 26 -90 -199 -194 14 138 22 41 78 -135 44 -131 -22 -219 -271 -118 69 96 121
1990A21L2j67j09j47L71l08J13J31J45j59k2J50m6l6q8Q5ro3L4K1n5J34k82M3
$$ 121 153 -14 -123 -270 101 -207 -94 37 182 23 1 151 105 69 -19 66 57 -6 28 49 -6 128 -154 -111
2014a11Kp2K75r8J15j68M8J31l24J1K26j91J29J3J07q7J20l4N3k26J77j61N5L4
$$ -111 -109 -181 94 -4 111 -57 -9 122 -202 -191 35 -156 -27 -14 93 6 126 92 145 -81 96 -65 -10 24
2038B4O9J92j98R8k39p3m2q7J92k7K81j92N1k8j84J15m1n4K07j63O0K57k7l65
$$ 24 93 285 87 185 -54 -127 -169 -256 -64 -91 190 -2 49 21 -163 -48 -89 -143 64 -99 -39 218 191 -174
2062a74O0L8Q3j07P1Q4j13K28j06J48q9k32K0J22k09J80qO4k41J10K71k29l6J40
$$ -174 -114 -76 7 -100 -29 55 -58 170 64 212 123 -109 -89 33 -176 4 -4 60 -181 -71 200 -29 -65 75
2086G5j8j83Q3rK58j63K8l56L38j71J5Q3j04K63r8l2p1q8Q9l5KO0J9J74k31J25
$$ 75 57 -126 -43 -52 206 43 71 -285 53 -118 -103 -20 -124 139 41 9 -62 -150 -61 -96 -94 -34 -15 159 -72 53
2112E3J5P1j71j47J60qo7M7k6L99j17k06N7m5p5M0j4L5pK8j13pj5J7P5M0j25J3
$$ 53 68 139 -32 -179 -19 -27 -94 -47 -73 326 209 3 60 15 -60 -20 -34 1 -6 22 -91 -98 -113 -96 -21 19 -106 -93
2140i3J79O0j08j71J08Qm0m7M7J04j1N4j8J93k20p5K8K4j59J76q7K07L8k62J1
$$ -93 86 146 38 -133 -25 -17 -57 -104 -57 47 36 90 72 265 45 -30 -2 22 -137 39 -48 159 197 -65 -54
2165e4J30q3j64K95m6k6p4m7J58k3Pj56J16m1L6p6l9J27L6l9J8j96j50L48mk56
$$ -54 76 -7 -171 124 78 52 -22 -69 89 66 73 -83 33 -8 28 -48 -87 40 76 37 55 -141 -291 57 53 -203
2191b03P1K46nj61J9K2J5O7p0n7L9j61J44j4lR9K5k23J97j36J41L2P9l17K22j93
$$ -203 -132 114 109 -52 -33 -11 4 71 1 -56 -17 -178 -34 -48 -51 48 73 -150 47 -89 52 84 163 -154 68 -125
2217a25n2J24jj09K26j67J43J08k0n0k18O9l2M2M1M8q4l3P0J7j3j24J17R8m2J4
$$ -125 -177 -53 -54 -163 63 -104 39 147 127 77 -141 -72 -104 -62 -21 27 -57 -90 -20 -3 -16 -140 -23 75 33 47
2243D7n6K20j80J2l4p3q7J25M6J14k22m3K18J2j17O1j74L7J22J08j33J07k4m9
$$ 47 -9 211 31 43 9 -64 -151 -26 20 134 -88 -131 87 99 -18 43 -131 -94 28 136 3 110 86 37
2267C7j33J01j01K2P5p2L6qK49m4k37O1j0n7J5j6k7K08j64r4J91j3o8Q5n0n1O7
$$ 37 -96 5 -96 -74 1 -71 -35 -43 206 162 -75 -14 -24 -81 -66 -82 -109 99 -65 -159 32 19 -49 36 -14 -65 2
2294Bj6O7j9J64k68K23Q8l83J27K6q5R8r6K1o8p6j9K23R4j23l5J31j88m1L4lJ75
$$ 2 -14 53 34 198 -70 153 241 -142 -15 11 -74 24 -72 -51 -119 -195 -214 9 103 -20 -55 76 -112 -153 -119 -122 53
2321E3j28J0J25j25o6J32rQ3j82M5J00P5L4j95R8j05J09q3J19j46qJ37j55Q1M0
$$ 53 -75 -65 60 -65 -131 1 -8 75 -107 -62 38 113 147 -48 50 -55 54 -29 90 -56 -64 73 -82 -1 39
2346C9M1L9n4m5J6o2M4k04L13j31O2j22P2J60k35N7j12J98j53J01Oj30Q3NK4L2
$$ 39 80 119 65 20 36 -26 18 -186 127 -4 58 -64 8 168 -67 -10 -122 76 -77 24 30 -100 -17 -12 12 44
2372D4k9k78J92K0n3O5J04q4k4j0J24Rk82K41l3q0J30j25J20j24j65J33K35j01
$$ 44 15 -263 -71 -51 -104 -39 65 -19 -43 -53 71 80 -202 39 6 -74 56 -69 51 -73 -238 -105 130 29
2396B9j66K42k3j14J01m2O0k4q8J5j3j1J19k6q1J47j64L9J9M4J0M4Pk74K20K9
$$ 29 -137 105 82 -32 69 27 87 63 -25 -10 -23 -34 85 59 -22 125 -39 0 19 63 73 117 124 -150 70 99
2422I9j69J52j67K6r3J90j53J87p2J48q0j89J7R8J35K9k92J35Q0k2m7J5J3j31
$$ 99 -70 82 -85 -59 -152 38 -115 72 0 148 68 -121 -104 -6 129 158 -134 1 81 59 12 27 40 -91
2446i1K68k93M9pN7o7QJ92j64k09J08j2J16N0Q0j0oj45J93k08R1L6j9pP1o1j23
$$ -91 177 -116 -67 -74 -17 -84 -76 116 -48 -257 -149 -161 -45 5 85 75 69 -76 117 -91 0 36 17 10 81 20 -103
2473a03J71P8j05j49Pl7nK13j57K70j86m2J19j24J37p6J1J33J9j53j72O8Q6l8
$$ -103 68 146 41 -108 -101 -138 -143 70 -87 183 -3 -45 74 -50 87 11 22 155 174 21 -151 -83 3 -35
2497c5R0p4R1rN7r2K6j5q0p5J72k46J77Q7P0j52J0K63k48k3q4Q3L0N6k05J80j30
$$ -35 55 -19 72 63 120 28 54 39 -41 -116 56 -190 -13 74 144 -8 2 265 17 -6 -90 -7 23 79 -126 54 -76
2524g6O5p1p3N7mJ01j01L77k78n7kL9K9l1J13R0j43k81L49l6j96J66M4r2l4J1
$$ -76 -11 -82 -155 -98 -102 -1 -102 275 -3 -60 -62 -23 6 -25 88 178 35 -246 103 67 -129 37 81 -11 -45 -34
2550c4Q2o2m4K6O3rj4J9j43O8J42j56p4K43j34k8Kr7J11P2O6m2k77K10J3l7q2
$$ -34 48 -14 -58 -32 31 22 8 27 -116 -48 94 -62 -136 107 -27 -55 -53 -150 -39 33 99 57 -220 -10 3 -34 -116
2577a16Q9jJ64j67J65K8k49L7J02J27j11o4j9J6PK51k38j66K70j91m5O3M5K4P2
$$ -116 -27 -28 136 -31 134 162 -87 -50 52 179 68 4 -15 1 8 259 21 -145 125 -66 -111 -48 -3 21 93
2602I3j25j18J38j93K03n3j39J94m5J58n7j42MR1j23K06k48J23K7o0N7N7N5q7
$$ 93 -32 -150 -12 -205 -2 -55 -194 0 -45 113 56 -86 -82 9 -114 92 -156 -33 -6 -66 -9 48 103 16
2626A6J35l9j82o0K41m5j48J16Rj29O5m3oJ35L0r0J22k79J29J76j64m0q7O9j56
$$ 16 151 112 -70 -130 111 66 -82 34 43 -86 -21 -64 -70 65 95 5 127 -152 -23 153 -11 -51 -138 -69 -225
2651b25J43N1J6J17j12r7R4J09j38J3l6K17l7l1p9M5j0l1O9lj55o6J31p7O8Q2
$$ -225 -82 -31 -15 102 -10 -107 -13 96 -42 -29 -65 152 115 84 5 50 40 9 78 75 -80 -146 -15 -92 -24 58
2677E8o6j12K19q9j06m6K68k98P4O7qm9R4ll3J47k37K00k16J70ok0j6k04K50m8
$$ 58 -8 -120 99 10 -96 -142 126 -172 -98 -31 -39 -88 6 3 -30 117 -120 80 -136 34 28 8 -8 -212 38 -10
2703a0m5L5J42o7q0k3l2J22j09KJ17N0n2J9J9p5j2j08R3J52j32Rj65J10O0m5j5
$$ -10 -55 -20 122 55 -25 -48 -80 42 -67 -65 52 102 50 69 88 13 1 -107 -14 138 6 15 -150 -40 20 -25 -40
2730d0j01J61L9p4l1R9l99M27j77J46r0l3P6n1J42k31K23K1O7l6j18j1j18J13
$$ -40 -141 20 59 -15 -46 53 -346 81 -96 50 -40 -73 3 -48 94 -137 86 107 174 138 20 9 -109 4
2754DJ05%j06l3m4J05J16j74j86K25K8j95J18R3j90J35m3J22m4j74m3K2J39j34
$$ 4 109 109 3 -30 -74 31 147 -27 -213 12 40 -155 -37 56 -134 1 -42 80 36 -138 -181 -159 -20 -154
2778a54Q2N7kL8k9n8J18K9J5j78J44j13J9P8j36J14J0j89J99m2J6m1J73k7k03
$$ -154 -72 -15 -17 21 -8 -66 52 81 96 -82 62 -51 -32 46 -90 24 34 -155 44 2 18 -23 150 123 -80
2803h0M3n4K6n6K78j09or0r7J80n7o1J40o0J0k38K50m5N6j21K12j29r0j5K35n8
$$ -80 -37 -91 -65 -121 157 48 42 -48 -145 35 -22 -83 57 -3 7 -231 19 -26 30 -91 121 -8 -98 -113 122 64
2829F4k67K93m6j01K2p2J08L3l8o2ok6p2J90J42j32oj75P4L8QL7j58J63M7Qj81
$$ 64 -203 90 44 -57 -35 -107 1 34 -4 -66 -72 -98 -170 20 162 30 24 -151 -77 -39 -31 6 -152 11 58 66 -115
2856a15J36p5r2K12nr3J2p9j9K1J83Qr4J34k32J42L9j67K37j07o4P6j43P9R5m1
$$ -115 21 -54 -146 66 61 -32 -20 -99 -118 -97 86 94 0 134 -98 44 83 -84 153 46 -18 58 -85 -6 89 48
2882D8r3k3R4K0J09j78P5J2O7j84J16o2j99K67O7O8k15r8M0K06l06K17o3j48J8
$$ 48 -45 -68 26 46 155 -23 52 64 131 -53 63 1 -198 69 136 204 -11 -109 -69 137 -169 48 -15 -163 -145
2907a45J91L1o6K3r6P5L6l2j15J83Jo7J8M8j97J38j9J34j49L3L1j93l8J91p5J17
$$ -145 46 77 11 34 -62 13 49 17 -98 85 86 19 37 85 -112 26 7 141 -8 25 56 -137 -175 16 -59 58
2933E8k54K01j4J0J30j22P6J32k55m5K8J4J14r3qK3j04O6Q8K00l38J9n4K66j66
$$ 58 -196 5 -9 1 131 9 85 217 -38 -83 -55 -41 73 -20 -28 -5 -109 -43 45 245 -93 -74 -128 138 -28
2958b8Pj43K31k87K29J04l11M23l08R6l6M3R9k05L1J9j30J88o0J40m0q7M7Lq1
$$ -28 -21 -164 67 -220 9 113 -198 225 -83 13 -23 20 119 -86 -55 -36 -166 22 -38 102 62 -25 22 25 -56
2983e6J2l1Q7q5N1j2Q0K5Qr2L4M3k01J93j43P2M3q7l4N3J4j06N5J43j11J34l36
$$ -56 -44 -75 12 -73 -22 -34 46 71 79 -13 21 64 -137 56 -87 -15 28 -59 -93 -40 -26 -132 -77 66 -45 89 -247
3010b47M19Mj76O3r2J6R6l6k09J95l5o3J10r4l3R3O7r5J15j69J70r8n9m3J20N1
$$ -247 172 176 0 63 -29 -13 83 47 -162 33 -2 -65 45 -49 -82 11 78 -17 98 -71 99 1 -58 -101 19 70
3036G0L4k92K12r5N5l9L6O4o7pO7P7j68J94j23L0j11m8N6R1l4n7J72l06K19K4
$$ 70 104 -188 24 -71 -16 -55 -19 45 -22 -29 38 115 -53 141 18 48 -63 -111 -55 36 2 -55 117 -189 30 54
3062E4J9r4oJ5R9n3j5M1j85J59J8p9M5j8J81k43J24q7J5L9O0m3Q2k78j9J53J6
$$ 54 73 -21 -27 -12 87 34 19 60 -125 34 52 -27 18 0 181 -62 62 -25 -10 29 89 46 128 -150 -169 -16 0
3089@lN8J21j99pJ3L0J76k93J20o7p3N6j6R7j6Ko3K0j3J39j49O6n7J39j08K04
$$ 0 -3 55 176 -23 -30 -17 13 189 -104 16 -51 -124 -68 -84 13 -3 -1 -64 -44 -57 82 -67 -1 -58 81 -27 177
3116A77l28J01l7j3J37J09k52K06m6J6j19J50k75J61j43J21J70k29L7O4J11j58
$$ 177 -151 -50 -87 -100 37 146 -106 100 54 70 -49 101 -174 -13 -156 -35 135 -94 -57 7 118 -40
3138d0J17k03J58n5k5n6J98l56K22kj33J01nJ35r7L1m2M5mK3J12j83O2qN6p2n0
$$ -40 77 -126 32 -23 -48 -104 94 -262 -40 -42 -175 -74 -79 56 -41 -10 -52 -7 -11 12 124 -59 3 -5 51 -21 -71
3165g1J37L5j19KJ83j33j08P2j19K20j13M3n4J29k80R1o0J15j03K21j2P7k23R4
$$ -71 66 101 -18 -16 167 34 -74 -2 -121 99 -14 29 -25 104 -176 -85 -145 -30 -133 88 76 153 -70 24
3189B4k8k4m0K51r7j83K53j53J9q5R4LK9q9J94j46j0J48k85J20Q6L0j47JJ46k16
$$ 24 -4 -28 -68 183 86 -97 156 3 22 -63 31 34 63 -26 168 22 12 160 -125 -5 81 111 -36 -35 111 -105
3215a05L0J60qj50K9J35k2K39k79j13k4M7N4j3J35j96N8K7j7R3Nj31JN4j73J38
$$ -105 -75 85 77 -73 -44 91 69 308 29 -84 -108 -61 -7 -20 115 -81 -23 4 -13 80 85 -46 -45 9 -164 -26
3241b6m6K01r7J40j42p7O0j16N7OJ48q1j7Rj02NK19j79K3J57j52J34j6r2J03P8
$$ -26 -72 129 32 172 30 -47 13 -103 -46 -40 108 27 10 19 -83 -78 141 -38 -15 142 -10 124 108 16 119 197
3267A97k13k8l9J48or2k6N8P2j30J9l5QQ4j25K10r0L3l6J4j28M4K8JL8O1J41l54
$$ 197 -16 -44 -83 65 59 -33 -59 -1 71 -59 -40 -75 -67 17 -108 102 12 45 9 23 -105 -61 -33 -32 6 67 208 -146
3295a46J78p9l0J49j2m8m5N6j04k9J29j12K44j86j2N3j55K05j44J75k57K17j47
$$ -146 32 -47 -77 72 60 12 -33 23 -81 -110 19 -93 151 -35 -47 6 -149 56 -88 87 -170 47 -100
3318a00O8o9n1K17j07Q5o4O8l4O6j37K61q0j08p1J34k50K43q4oO2p4J78j51L8
$$ -100 -32 -101 -152 65 -42 43 -21 47 13 79 -58 203 123 15 -56 78 -172 71 -13 -19 43 -31 147 -4 34
3343C4N4j2mj26JJ44m8o1O3pj97M5K08m6o8J50l8j89J01r1J27r0m1J7N4j2R6k4
$$ 34 88 76 72 -54 -53 91 43 -18 45 38 -159 -114 94 48 -20 130 92 -97 4 -87 40 -50 -91 -74 -20 -32 64 40
3371D0q5J01J00k11o0K08j57J69L0k93J01R9j40K34l44J42J0N3j3L1pN2O7k46
$$ 40 -45 56 156 -55 -115 93 -64 105 135 -158 -57 42 -98 136 -208 -66 -56 -3 -16 15 8 60 127 -119
3395a19J9J89M9j81J8M5l4N7p4q8J16q7R3K8o2J43j17m7K08l54J75J82k67K0K48
$$ -119 -100 89 138 -43 -25 20 -14 43 -31 -119 -3 -90 3 31 -31 112 -5 -52 156 -198 -23 159 -108 -88 160
3420A60q4ok23k4J55R5k64J63O6J6m6O2j05O9k41K84q4MJ46k16J03k03R1n1K7
$$ 160 76 70 -153 -177 -22 73 -191 -28 38 54 8 70 -35 34 -207 77 -7 -3 143 -73 30 -173 -82 -133 -106
3445a06J48J18j04j22J03l0p7Q9M2j24M5j09J51j9O3k4q5J89Pk07%j7M4J44rj22
$$ -106 42 160 56 -66 37 7 -70 19 61 -63 -18 -127 24 5 68 44 -41 148 155 -52 -52 -69 -25 119 110 -12
3471a2q4N8J23oj1j72L9P4j69J01J28j42J59j18K04j39J04l51K12j15R9k3O0l7
$$ -12 -96 -38 85 79 68 -104 -65 9 -160 -59 69 -73 86 -32 172 33 137 -214 -2 -117 -18 -41 19 -18
3495a8K3J53j61J86j15j87N8O1Q0Rj35l9J90j60Q7K28l32P3j7R6o9k35L17M0j79
$$ -18 5 158 -3 183 68 -119 -61 0 80 89 -46 -85 105 -55 32 260 -72 1 -16 80 11 -224 93 133 -46
3520d6l9M8No0K43j18P1k88K86j12n2L4M5O7j25j00J9Q9Q2q9LrJ13j89J39m0N0
$$ -46 -85 -37 -32 -92 151 33 104 -184 102 -10 -62 -28 17 84 -41 -141 -122 -33 49 -40 -37 -46 67 -122 17 -23 27
3547B7RJ12j85L7J87j19Q7k77MJ71K1R5j65j10K61l06J47M7J1j93J53N0j49k0
$$ 27 36 148 -37 0 187 68 155 -122 -118 53 74 169 4 -106 155 -151 -4 43 54 -139 14 64 -85 -105
3571a05J43j19k3J6J66k5k63M9R0O6J04j27K7J06q2j25RK05k13J70j47J48Rn4
$$ -105 38 -81 -104 -88 78 53 -210 -161 -71 -5 99 -28 -1 105 23 -102 -93 112 -101 69 -78 70 79 25
3595B5j47Q4q3P1K3M5j10O0J24j57K16k22J71L7j37N9kj44KK6J93j61J30j03P2
$$ 25 -122 -38 -121 -50 -27 18 -92 -32 92 -65 151 -71 100 137 0 59 57 -87 -85 -59 134 -27 103 0 72
3620G2o4R1kj09j6k1J04j32K21k32O3J15n0j07J31j60k9O7P9p7K3kn6n5P6p6J16
$$ 72 8 99 97 -12 -28 -49 55 -77 144 -88 -25 90 40 -67 64 -96 -125 -58 21 -56 -33 -35 -91 -146 -70 -146 -30
3647c0k0n0J69p7N3K1r5J52l05J32p3k5L2J58q3j99K41R8j59J37r8j99K92p3J24
$$ -30 -50 -100 69 -8 45 66 -29 123 -182 -50 -123 -148 -116 42 -41 -240 1 99 -60 77 -21 -220 72 -1 123
3672A23r8p7K8k16K39O1o6Q2j58J05j55J84l8Mj3n9q0O8M4J3r8m1K38o0j74J53
$$ 123 25 -52 -24 -240 -1 60 -6 76 -82 23 -132 52 14 18 5 -54 -134 -66 -22 -9 -107 -148 90 30 -144 9
3698Ik5p6P4j15K2J37Q4j9%p9j2p5J1J13n8K01j22j12R7j42N4n1K3R5O1j56M2
$$ 9 -16 -92 -18 -133 -111 26 110 91 91 12 0 -75 -64 49 -9 192 70 -42 55 -87 -33 -84 -61 34 95 -61 -19
3725a9J07J7m9j45p1R6m1K15m1j24l6J84q3OR6j43J5r9Q5K0P3j36J07pj7R1j53
$$ -19 88 105 56 -89 -160 -64 -105 110 69 -55 -91 93 10 16 112 -31 -16 -115 -30 -10 63 -73 34 27 10 101 -52
3752e2k2R3N6n4J08q3P2nJ5j36m1J22n6J01j48L1L7j74J14P2Ok4j16J30qk86J17
$$ -52 -74 19 75 21 129 46 118 113 128 -8 -49 73 17 118 -30 1 38 -136 -22 50 56 32 -84 46 38 -248 -131
3779a31O6J1Rk5j23L05k47K46j45R7j36o0J94j63J02R0j06N7o3J54j35nJ56j00
$$ -131 -65 -54 -45 -70 -193 112 -135 111 -34 63 -73 -133 61 -102 0 90 -16 41 -22 132 -3 -8 148 48
3803D8Q0l67K17n3K26j67l7k0J41j13k9l1L3J43p3j9j0P8m7L9O3j2o5p3Ln4J75
$$ 48 128 -239 -22 -75 151 -16 -53 -73 68 -45 -74 -105 -72 71 -2 -21 -31 47 0 39 102 90 25 -48 -45 -99 76
3830G6j54l0J74j30Q3j34K15j38L0l6Oj73K87M5r6k7O6q8K2M0N2j8m5m4J0j23
$$ 76 -78 -108 66 -64 19 -115 100 -38 -8 -44 -38 -211 76 121 25 -2 64 -24 -2 38 90 72 27 -17 -7 -130
3856a30QK2o0K55P0n0j99J82k63J67l7nJ33n7r1R2o0J43k5m5l3p4K81k82J9J9
$$ -130 -122 -100 -160 95 165 115 -84 98 -165 2 -35 -40 93 36 -55 37 -23 120 95 50 17 -57 224 -58 -39 -20
3882b0q5Q0R2k49K74k9p1p1J94k55kK07j12l5O5J03n2n4l3p6J59n3q3J08J6k16
$$ -20 -105 -25 67 -182 92 63 -8 -79 115 -140 -142 65 -47 -82 -17 86 34 -20 -53 -129 30 -23 -106 2 18 -198
3908a98L98k78J75p3K6K2j84O2NL5M6j08J10L0n4R3K1k06J50l9Q4m5k4j95K98
$$ -198 200 -78 97 24 50 72 -112 -50 -45 -10 36 -72 38 68 14 107 128 -78 72 33 117 72 48 -147 151
3933A51p3j79R8N2j8R5j26K8k8r1J1m5R8L7Q6r3l5N6p3r6K24Q3j71J32j99P0P8
$$ 151 78 -101 -3 49 31 126 0 28 0 -91 -80 -125 -27 10 96 3 -32 24 -49 -145 79 162 -9 123 -76 -6 72
3960G2p1JJ5Q0j27m2K71k76p1Q2J84l3j55j34J42J45j89J15k0M6j45J59j90J10
$$ 72 1 2 17 97 -30 -72 199 -77 -148 -66 118 85 -70 -204 -62 83 -106 9 -11 35 -110 49 -141 -31
3984c1O2L2qj00O4o4Q9q8k6r5k2K08l3p3K07j68r4M0J18n0L2j22K10j11P0L0j97
$$ -31 31 63 55 -45 19 -45 44 -44 -70 -165 -187 21 -12 -85 122 -46 -140 -100 18 -32 0 -122 88 -23 47 77 -120
4011a20J2J0J59k07K54qr7j69J82O0k03R7m1J83j37o6K99k58r7J28M1k5l8oJ63
$$ -120 -108 -98 61 -146 108 100 3 -166 16 76 -127 -30 -71 112 -25 -91 208 -50 -147 -19 22 -3 -41 -47 116
4036A16p0j56N5K2O6K7j04Q3m8J18r0p7J3p1J97j15K6J54j43O9k44K04L2k01J34
$$ 116 46 -110 -55 -33 33 60 -44 39 -9 109 19 -58 -45 -116 81 -34 -8 146 3 72 -172 32 64 -137 -3
4061cO4q0m6J47o7po5o5J03J8J14k77J21J46l6K2j67J28n7jr9J32o1N6n9L6J7
$$ -3 61 -19 -65 82 15 8 -57 -122 -19 -1 113 -164 -43 103 67 89 -78 50 -7 -8 -107 25 -36 20 -39 -3 14
4088A4n3Q0j42J0K04k73J29Q5r8o1M8M0j06J57j45m4R4k16K30M4j61L15j26M5
$$ 14 -39 41 -101 -91 113 -160 -31 54 -44 -105 -57 -17 -123 34 -111 -155 -61 -277 -47 -3 -164 151 25 70
4112G0r9OP6k05P4k1P0K12j86p2J04k9m3j60K81p3P7K06k39Ql1N4r5j50K44j50
$$ 70 -29 -23 53 -152 -78 -99 -29 183 -3 -75 29 0 -43 -203 78 5 82 288 49 57 26 80 -15 -165 79 -71
4138g1J06j96J78J37k02R2j72K52k62J48o3J92k17K2J42j1m9j52J75j08j3j8L5
$$ -71 35 -161 17 154 -48 44 -128 124 -138 10 -53 139 -78 -56 86 75 26 -126 49 -59 -72 -90 -55
4161e5l2J32j2j69K42o4j75J11OL4l1rj2NOm0k2P4J5O6j46J69j42o9J27K7j57
$$ -55 -87 45 33 -136 106 42 -133 -22 -16 18 -13 -22 -34 -29 -23 -63 -85 -11 4 70 -76 93 -49 -118 9 36 -121
4188a21M2K10j00R3j86J44o4j71J17J5J3l3j2J4K1m9K9K8l5N2q3P2K5j20K57k44
$$ -121 -79 131 31 124 -62 82 18 -153 -36 -21 -8 -41 -53 -39 -18 -67 -38 -10 -45 7 -76 -4 21 -99 158 -86
4214h6N0jJ06q5o1K6K00k19M5J2O8mJk1l0Q1l08K04j36M0L3nJ30j08rR6q8Oj35
$$ -86 -36 -37 69 -16 -77 -51 149 -70 -25 -13 55 51 52 31 1 82 -226 -22 -158 -118 -85 -90 40 -68 -77 19 -69 -63 -198
4243a98J85j2N1j76J71l7p3R3O9l1p0J64j17q2O5j34N3J40K4pl38J78J10J16o0
$$ -198 -13 -25 26 -150 21 -16 -89 4 73 42 -28 136 19 -63 2 -132 -79 61 85 78 -260 -82 28 144 84
4268H4j57N7m2L9O3P9q5kj59j51K31j26j0O6R3L8J28j94n6J72K8o7j7J8l2l2J29
$$ 84 -73 -16 -58 -19 44 123 38 36 -123 -274 -43 -169 -179 -113 -20 18 146 -48 -104 68 96 29 12 30 -2 -34 95
4295I5o2j04o9K37j78j3J11j50L31k09Q6j19Q4L9n7j7K53l17o0j8J42j02R7q6
$$ 95 33 -71 -140 97 -81 -94 17 -133 198 -11 75 -44 40 79 22 5 258 -59 -119 -137 5 -97 0 -86
4319h6O8K8J3j20R1j07K19j92J60J16r5J2K0j97Nn3O4J7QK16m06L55l22J38N1
$$ -86 -18 10 23 -97 -6 -113 106 -86 74 190 95 107 127 -70 -65 -118 -54 -37 -29 187 -219 136 -186 -48 3
4344Cn8%j05J4J63N2P6j56n7J37p8K9J38k37J25j23J94j69J5l9R2k4J54l18J46
$$ 3 -55 -55 -160 -146 17 69 145 -11 -68 69 -9 20 158 -79 46 -77 117 -52 -37 -76 16 -8 146 -172 -26
4369b6J04k6p3o8J28K3j94M71l68J20k1L3j32K3M4J17k1q9q5K71k05J29j81O6
$$ -26 78 52 -21 -89 39 62 -132 339 -29 91 70 103 -29 -6 38 155 134 45 -40 231 26 155 -26 40
4393D0R2j72N5o8m6J34p0K8j13o7J16J42k15J07m4R7k2j50J71Q3l71K40R3p8r
$$ 40 132 -40 15 -53 -99 35 -35 -7 -120 -187 -71 71 -144 -37 -81 16 -6 -156 15 98 -273 -33 60 -18 -27
4418b7K25M4k01J40j80Q8j11j0Rj16N3R7q2PN7R0O8j16r7p6J47k5J62j48r0M5
$$ -27 198 242 41 181 1 89 -22 -32 -23 -139 -86 11 -71 -64 -7 83 151 35 -62 -138 9 -16 146 -2 -92 -47
4444d7P9O6j4j07n3J97k04J4Q7j57J62n8J75k8o7j30K2k7L9Q2q1J33R3k98J93
$$ -47 32 98 84 -23 -76 121 -83 -69 18 -139 23 -35 140 112 45 -85 -63 -90 -51 31 -50 83 176 -122 71
4469G1k05J99j55J64K6p8M8l7j7J11j22L8j32K9J37j91J65j40L14j86k32J65J42
$$ 71 -134 65 -90 74 100 22 70 33 16 127 5 43 -89 -60 77 -114 51 -89 225 39 -193 -28 114
4492A14p2j14P1J98m05M2K78o3L2j19P3O9j52j7kR9o2K63k13n8O9J11j04O1j7
$$ 114 42 -72 -1 197 -208 -166 112 49 81 -38 35 104 -48 -65 -67 32 -30 233 20 -38 31 142 38 99 82
4517H2o0k3m1o5J76j44j3K13Ok26K22j91K00j98J42n7K24k36l5J91k71N4M5J40
$$ 82 22 -1 -42 -107 69 -75 -88 125 131 -95 127 -64 136 -62 80 23 247 11 -24 167 -104 -50 -5 135
4541A35pj73Q3P6j64L51j93j46J4M0J43P8l26J49L8n1J79q8k73Q6j99L09R8j75
$$ 135 128 -45 38 114 -50 301 108 -38 -24 16 159 237 -89 60 98 47 226 138 -135 -49 -248 61 159 -16
4565a6J43M1k63R3J67k04n5j07K4L18j49r0K30J57n19P9r9M08mo8k97J65K54k28
$$ -16 127 168 -95 -2 165 -39 -94 -201 -177 141 -8 -98 132 289 -230 -151 -250 158 154 86 -211 -46 208 -20
4589b0J47J19l75K76k99K26j78p7N6M39m35J74j30J19m0j13K43j46K0L8O2k8O4
$$ -20 127 246 -129 147 -152 74 -104 -181 -125 314 -121 53 -77 42 2 -111 132 -14 6 44 106 78 142
4612A42j88J94M1j51p6Q8K4l8Q6m1o9pq6m9J18J45j64j60J08K73k15J33j65J54
$$ 142 -46 148 189 38 -38 50 74 36 122 81 12 5 -81 -130 -12 133 -31 -191 -83 190 -25 108 -57 97
4636I7J92j70k52J10j4O4r0Q7M7k19K08J3l7k41J53P9O0lk4n4m3j28J65Q7j77
$$ 97 289 119 -133 -23 -37 27 -63 24 71 -148 60 73 36 -205 -52 27 87 84 60 6 -37 -165 0 87 -90
4661i0J05l3L1j5j27mK18j5L0J0j8m6o3J10j18J45j82J92rk30jK7K5N1k7J01r9
$$ -90 15 -18 13 -2 -129 -133 85 70 100 110 92 46 -17 93 -25 120 -62 130 121 -109 -110 -83 -58 -7 -34 67 -32
4688c2M2o7q0Q3L9N8o0O0Q6n6k35R7J21n2M8j78O1R7j59R7J07j79J19Q6j39jJ41
$$ -32 10 -57 -137 -54 -15 43 -17 43 129 73 -162 -65 56 4 52 -126 -65 32 -127 -30 77 -102 17 103 -36 -37 104
4715A04k18J91nN4m8j16L0p0M6J93l83J84j74K82J9O0k02K16j84m6o9J84oK54
$$ 104 -114 77 72 126 78 -38 -8 -78 -32 161 -222 -38 -212 70 89 149 -53 163 -21 -67 -136 48 42 296
4739B96k84j50Q4J50j26j46K71k08N4l2M9J8kj95K53k28Q1J85q3Rm9j27J28m4
$$ 296 12 -138 -54 96 -30 -176 95 -113 -59 -91 -42 -24 -26 -221 32 -196 -115 70 -13 -4 -53 -180 -52 -96
4763i6q4N9j06J64Q3k8K7J64m30K28Q5N4l8j31M0r7R5J9J11pLj41J90k93j34K84
$$ -96 -180 -121 -227 -63 20 -8 19 183 -247 -19 66 120 82 -49 -9 -106 -11 8 119 112 115 -26 164 -129 -263 21
4789B1q8L10k69M2L2j36m8J61J83k98K60o4k95M9nK57Lj24k04J24K23j94J12r2
$$ 21 -67 243 -26 16 48 -88 -136 25 208 -90 170 106 -189 -140 -145 112 115 -9 -213 -89 134 -60 52 -40
4813d0K49j29k12J07j06K30o7j99L51j78r4J14j98M03k88j72M22m06K96J0k06
$$ -40 209 80 -132 -25 -131 99 32 -167 184 6 -88 26 -172 231 -57 -229 193 -213 83 93 -113
4834a13J32Rr7l6l2J76o8K3j02J82j29M6J0%O6j04m3J28l5J89j67k5J0K2k8j27
$$ -113 19 28 -69 -105 -137 39 -29 -6 -108 74 -55 -9 1 1 67 -37 -80 48 13 202 35 10 20 42 14 -113
4860a13m8R3lQ0L2k27J08L1r7K52k72k6J63J12q2MJ01m5l9j3n2MK34j36L2J00
$$ -113 -161 -68 -71 9 41 -186 -78 -47 -144 108 -164 -190 -27 85 3 7 108 63 24 11 -41 -37 197 61 93 193
4886A93k15J27M2k15J95K5m18N41m9j07j40p7N9l32P67j51k37j36j33K04k3P3
$$ 193 -22 105 147 -68 127 152 -266 275 226 119 -21 -98 -39 -371 396 245 8 -128 -261 -57 -80 -7
4908gj47K6L97k50k64N84k42K49p1m34k85N32k57J81J52J3J43l94K34k84J40j03
$$ -7 -154 -128 269 19 -245 339 97 346 275 -159 -444 88 -169 12 164 177 320 -74 160 -124 16 -87
4930h7J29l94J84K64o0m0j07J64K64m44K11l33j21K68L05J01J37j43o4q5j59P9
$$ -87 42 -352 -168 96 36 -4 -111 53 317 -127 84 -249 -370 -102 203 304 441 298 234 149 -10 69
4952F9j89K99m1n25M76j56L3L9k2K8J93j07l50L75l71R1J49J27O6j2j36l74L25
$$ 69 -120 179 138 -387 89 -67 -34 5 -17 11 204 97 -253 122 -249 -158 -9 118 184 172 36 -338 -13
4975a3r4J13j01p5J19J23j13J25P8p3ok97J86P9j19K02k03Q0k31L63k48R9M1j40
$$ -13 -107 6 -95 -170 -51 72 -41 84 162 89 83 -214 -28 51 -68 134 -69 11 -220 143 -105 -6 35 -105
4999a05R5p3J2J44n9J73q0j13Q9l4jl5O5j93J11j19J69n1k0k7J22j36p0N3J7j24
$$ -105 -10 -83 -71 73 14 187 107 -6 83 49 48 13 78 -115 -4 -123 46 -5 -25 -52 70 -66 -136 -83 -66 -190
5025a90L28r3l31J66oqJ24k42L06J22k27k89L89j29J71j12j49M0J15q4M3J45r2
$$ -190 138 45 -286 -120 -126 -134 -10 -252 54 176 -51 -340 49 -80 91 -21 -170 -130 -15 -99 -56 89 -3
5048cL0K06l17P2k11K22N8m0rR6j87j9Q8k13j1J53J75k58O3p3K03m1j6M9J8o7
$$ -3 27 233 -84 -12 -223 -1 57 17 8 104 -83 -102 -14 -227 -238 -85 90 -168 -105 -178 25 -16 -32 17 35 -32
5074c2m7K35j03j37k2K33k61P5O8K09l31J90j6K7j20J3k5j6J28o1n1J10j0j09
$$ -32 -79 156 53 -84 -106 127 -134 -59 9 218 -113 77 61 88 -32 -19 -44 -60 68 7 -44 66 56 -53
5098e3J18j26R7j22M9J79k16K4J07m6Np4N9q7m1J19%p1R7kj1J36j76M2O0p7p2
$$ -53 65 -61 36 -86 -37 142 -74 -50 57 11 16 -58 1 -86 -127 -8 -8 -79 18 16 5 141 -35 7 67 -10 -82
5125h2M6O4j48M6R2p5pPj3M3K3r4J18J48k0k67J51r6L1n7K12k9j23nL2N6l6N0
$$ -82 -36 28 -120 -74 18 -57 -64 -57 -70 -27 -4 -98 20 168 148 -119 32 -64 -33 -90 122 93 -30 -35 -3 53 17 67
5153F7j74K44j40P5o6j2R9j47l8J33j21J60L6j47J74k56J25J7j36J21rP5j23J62
$$ 67 -107 137 -3 72 6 -6 93 -54 -92 41 -80 80 116 -31 143 -113 12 29 -107 14 5 80 -43 119
5177A19j20j18o6Q8J65j91K56j15k2N9o9%j33J27J9R0j82R5J3J33j17j66L8o0
$$ 119 -1 -119 -185 -97 68 -123 133 18 -4 55 -14 -14 -147 -20 -1 89 -93 2 15 148 31 -135 -97 -157
5201a57J26R6o3o6K01k00N4P2K1k7j81J87J37j58J52j83J75k66J1J46M9j59J02
$$ -157 -31 65 2 -64 137 -63 -9 63 84 57 -124 63 200 42 194 11 186 -80 -69 77 126 -33 69
5224F9j05J85j04J1P5k16J73K9j83J61k01j0qJ76J5m9n8J01j71J78p2J3j6n0m9
$$ 69 -36 149 45 56 131 -85 88 117 -66 95 -106 -116 -124 52 67 18 -40 61 -110 68 -4 9 -7 -57 -106
5249a06j9N7J24K1p0P9j75l1J07J03p8qJ8L5j14J19Oj54j03K00R7M3l11L44j23
$$ -106 -125 -68 56 77 7 86 -89 -120 -13 90 12 4 22 57 -57 62 68 -86 -189 11 108 151 -160 184 61
5274F1k03J36l1N6M4nl3J44k75R0n5R2r6k7K34j69L1J12j29n9J9RJ26n6j5Jj8
$$ 61 -142 -6 -37 19 63 58 25 169 -106 -16 -71 21 -75 -102 132 -37 -6 106 -23 -82 -63 -54 72 16 1 2 -16
5301a6Q8r8m6O3q4Q9j3l8K5l0J90k0j48J26q4Q2p0O5n5J20j34L0L2j12L3K5k0
$$ -16 72 -26 -72 -9 -93 -4 -17 -55 -30 -60 130 110 -38 88 4 86 16 81 26 146 12 42 74 -38 -5 20 0
5328@N7j05o8J72J7j72l6%J21p2J08l5j25K41q4r4o2J46N3KP4k88R3p4K2M7J77
$$ 0 57 -48 -116 56 73 -99 -135 -135 -14 -86 22 -13 -138 103 19 -75 -137 9 62 64 138 -150 -57 -131 -109 -62 115
5355A15Q2j76r4O4o0j1j9J05j15J28qk2j6l3p8j9K24m7m2Rj13K64l51K01J08K1
$$ 115 197 21 -73 -9 -69 -80 -99 6 -109 19 11 -11 -27 -60 -138 -157 67 20 -22 -13 -126 138 -213 -12 96 117
5381A17n5j66J51m0j5m4RK2J00k06k8J66N1k0j98K20j02K8p5J22m1jQ5J22j52
$$ 117 62 -104 47 7 -8 -52 -43 -21 79 -127 -155 11 62 42 -156 64 -38 -10 -85 37 -4 -5 80 202 50
5406E0r1n5l2J18L0J5j06K2J62n0p6j01j0M3N1K28k12J30l09Q0J11Q5j48j2J24
$$ 50 -41 -96 -128 -10 20 35 -71 -49 113 63 -13 -114 -124 -81 -30 198 -14 116 -193 -113 -2 83 -65 -77 47
5431D7j59K35J3r9O3nm1k8j78K43Rm8q2R6rj9n4M8m8k11J19J38%M0j6J36k10j48
$$ 47 -112 123 136 37 100 95 54 26 -152 91 100 52 -30 66 57 38 -16 32 -16 -227 -108 30 30 70 54 190 -20 -168
5459a68J35N3J19j57j0J4M0o3M5j05J28j02J97p5L7j30K08j07p0j71J91m8P7o2
$$ -168 -33 20 139 -18 -28 -14 26 -37 8 -97 31 -71 126 51 88 -42 166 59 -11 -182 9 -39 38 -24
5483b4P2p1n5lj2J59j41J5Mk9K31m2k63K55n1j13O3j10J41k4M1P2j26o1j9o0J72
$$ -24 48 -23 -78 -81 -93 66 -75 -60 -56 -85 146 104 -159 96 45 -68 -5 -115 26 2 43 115 -11 -72 -91 -151 21
5510B1mJ72j96R5o2R1o7J20o0J29j63n4N9k09K17k67K41p3J72r9j61M6J40l7l3
$$ 21 17 189 -7 88 26 117 50 170 110 239 76 22 81 -128 89 -178 63 -10 162 63 -98 -52 88 51 18
5535A8o8J25o6P3j47P8Q5n4q7m7J15J06j42j19J38J72j33j9j03P6J10J6o5j34
$$ 18 -50 75 9 82 -65 13 98 44 -43 -90 25 131 -11 -130 8 180 47 28 -75 1 111 127 62 -72
5559g2P7j4N8k27N8J83m7Q8j07P4q2m9O5P2j8m7j93J76o9Q1K14j92J60j78m3J3
$$ -72 5 -9 49 -178 -120 63 16 104 -3 71 -11 -60 5 77 59 12 -181 -5 -74 7 221 29 189 11 -32 -19
5585a9M3R5j40m8K04p3j87J85j43J89j16R7P2k66O5n1j1O5k2Km5J61pl9MRKj23
$$ -19 24 119 -21 -69 135 62 -125 60 -83 106 -10 87 159 -107 -42 -93 -104 -39 -61 -59 -104 57 50 11 15 24 26 -97
5613i7J60j06R2l9O9oPo3j7N5M0r8n1M1R8m9j56j3J19o5K01j62M8J68o0j29N2
$$ -97 63 -43 49 10 79 73 80 17 0 55 95 -3 -54 -13 85 36 -120 -133 -14 -79 122 -40 8 176 116 -13 39
5640C9L8j0k24L2J41J38j42q9J42m8n1KM7n2J92j18l0mJ58k40Qm3K90j68j22p7
$$ 39 77 67 -157 -125 16 154 12 -77 65 17 -34 -32 15 -37 155 37 7 3 161 -79 -71 -114 176 8 -114 -191
5666a91K44j13J51m6j78N8O6m5J48j44R1K0o0L1j2q2OM1k5L0n0J3K4M8j18P3J78
$$ -191 53 -60 91 45 -133 -75 -9 -54 94 -50 41 61 1 32 20 -62 -56 -15 -40 -10 -60 -47 -23 25 -93 -20 158
5693A58j39j74L0J45l9M7j50K73m0k03J93j23K7P0p5j29K75k0j25Lj83J84O4o
$$ 158 19 -155 -125 20 -19 28 -122 151 111 -92 101 -22 5 75 0 -129 146 126 1 4 -179 5 69 63
5717F3j3j85K75k31J27m6L9Q4l9k8L13l13p8Q6r2n6J48N9k22P1M2J16l61M68k65
$$ 63 50 -135 140 -91 36 -10 29 113 74 46 359 46 -32 54 -38 -94 54 113 -109 -38 4 120 -241 227 -38
5742c8P5j28J01l2J29j1j7k7n6r6J34Qj18L2L4l8O4lp1Q6o3r1K34j2N0j46q3Q5
$$ -38 37 -91 10 -22 107 96 79 52 -4 -100 34 42 -76 -44 -10 -48 16 13 -58 28 -35 -126 108 96 146 0 -83 2
5770Bl9J11j9r9J82n3k96K13m2K8O3j4rj43r1J25P8J10j93l9K26n2r7J22k23N3
$$ 2 -37 74 55 -44 138 85 -211 2 -40 -12 51 37 28 -115 -206 -81 -3 107 -86 -125 101 49 -48 74 -149 -96
5796i6j9Q6qJ40k11m3L0L9K18k12N3L9q4l6j34Q8J62J52k03J34m0p1m9l3R5K5
$$ -96 -115 -29 -37 103 -108 -151 -121 -82 136 -76 -23 16 -68 -104 -238 -150 12 164 -39 95 55 -16 -65 -98 -3 22
5822B2k5M1k0K0k4j89J94J08k66N5M1J29p9o3o6o1L21j37r9J78j27R4J8j18N1
$$ 22 -3 38 18 38 14 -175 19 127 -139 -84 -43 86 7 -56 -122 -183 138 1 -98 80 -47 47 65 -53 -2
5847bK9J03j50M5P3j17N9L8p1Q8j03p6K39j08q0N9L2j16O7N3N8L4j21J54j34p2
$$ -2 27 130 -20 25 98 -19 40 78 7 95 -8 -84 155 47 -33 26 58 -58 9 62 120 154 33 187 53 -19
5873a9L2k1J04j24J77j43j31K35k2n7j40J55j09L0Q0j95R7J1k2O0KJ13r6L4j07
$$ -19 13 -8 96 -28 149 6 -125 110 88 31 -109 46 -63 -33 47 -148 -51 -40 -62 -2 0 113 17 51 -56
5898e6L8P5m4j43K08j03K6J47k43J14n9J20j88K04l09K30J81j04j2j40L8Q2mj95
$$ -56 -18 57 13 -130 78 -25 1 148 -95 19 -40 80 -108 96 -213 17 198 94 82 -58 -20 62 58 -137
5922a37k2P2K48j52Qp5O2M3l5L1J17j42j14K70j25o9J2o0MN9J31o1j16M5K28o5
$$ -137 -159 -87 161 9 17 -58 4 47 12 43 160 18 -96 174 49 -20 -8 -68 -64 -5 126 65 -51 -6 222 157
5948A57j25O1k31L7J61r0K1jp1P8m1J36o6q2J90j75R3J58j20j97kNK20j56N8K1
$$ 157 32 93 -138 -101 60 -30 -9 -10 -81 -3 -44 92 26 -56 134 -41 52 210 90 -107 -109 -104 116 -40 18 39
5974C9j20R3j06J8J6J28N6j7r8Q3k2O6j08j1o3J44nj22J05l6k80J91J23j3j68
$$ 39 -81 12 -94 -76 -60 68 124 107 9 92 70 136 28 17 -46 98 93 -29 76 40 -240 -49 74 61 -107
5999a07q4J73K27j95o1N8RQM3k4L6j41K6J37j55J25j82J41L1j11K6P4k11r4K29
$$ -107 -191 -18 209 14 -47 11 20 28 71 47 83 -58 -32 105 -50 75 -107 34 65 -46 -20 54 -157 -251 -22
6024b2R4m4j4q9R9N3j66J13J8J4r8l2J78o9P8j63K8K5k9K0j12P6k4J31k24L13
$$ -22 72 28 14 -75 24 77 -89 24 42 56 -42 -74 104 35 113 -50 -22 3 -26 -6 -118 -42 -66 65 -159 154
6050A54k08N8r5L3L0P3j73K20O0L1k02QM0j5pk8R5n9j65K07q2N0L1j22J02mj66
$$ 154 -54 4 -91 -58 -28 45 -128 92 152 183 -19 -11 29 14 7 -21 74 15 -150 57 -25 25 56 -66 36 32 -134
6077a34K5J81q3J4l32L15j18J10J32j93OK8Q8j01J47m0r0P2Jj00l3K2L8J42j34
$$ -134 -109 72 -11 3 -329 -14 -132 -22 110 -83 -77 -49 39 -62 85 45 -45 27 28 -72 -105 -83 -45 97 -37
6102c7OP0j10K77p7k01J01j54P9O7J27j82J33l6k19J64j76R9j79J39j5J83q6j78
$$ -37 -31 39 -71 206 129 -72 29 -125 -46 21 148 -34 99 63 -156 8 -168 -69 -248 -109 -124 59 -27 -205
6126b05K22q1Q2M1j19J24Pj47J0N8oq0J41r1j01J94n7p7Q0q6Q5R2j37o7l%J74
$$ -205 17 -64 18 59 -60 64 71 -76 -66 -8 -14 -94 47 -44 -145 49 -8 -85 -5 -91 -6 86 -51 -118 -121 -121 53
6153E3O5j18J29n9kk29N4J47P1mk16J20k4J1k3M1pj6L1K3n7K7k0L0k28Q9K79j41
$$ 53 118 0 129 70 68 -161 -107 40 111 107 -109 11 -13 -2 -25 16 9 -7 24 47 -10 17 -3 27 -201 -112 167 26
6181B6Kl6n1P0J8q5J02J9l7j55J44L3j85K44pj78k9P3J02j11J3o4K54j10j89J1
$$ 26 28 -8 -59 11 29 -56 46 65 28 -127 17 50 -135 109 102 -76 -105 -32 70 -41 -28 -92 162 52 -137 -126
6207a26K49j74M0q6L5N8lo7J5J00M0p3j43J36p8l8N7J49m7j16J15m8J29n1j61
$$ -126 123 -51 -11 -97 -62 -4 -7 -74 -59 41 81 8 -135 1 -77 -115 -58 91 44 -72 43 -5 124 73 -88
6232h8NP4qp6J33j58K26q9m7Q0J16j30j68J58K6k0j29J6j17J95r2M7N7r1O0Lq3
$$ -88 -83 -9 -17 -93 40 -118 108 19 -28 52 168 38 -130 28 54 34 -95 -79 -196 -1 -93 -46 11 -80 -20 -17 -100
6259a00L0Q8K08k8j36Ok00MK76n0j14r5L2J96j49K3j62L39j16q2K3N9J1j16N0
$$ -100 -70 18 226 198 62 68 -132 -128 148 98 -16 -111 -79 117 -32 -9 -171 168 52 -30 -7 52 63 -53 -3
6284cN6j72%P6K6j8J05j15M8j35J54J42k88J51j34J59R4j74j29J90k01L14k31
$$ -3 53 -119 -119 -43 -17 -35 70 -45 3 -132 22 164 -124 27 -107 52 146 -28 -157 33 -168 146 -85
6307h5Q1j02K93o6j94r1OR9J44m5j25J39J8n3j36J51J7n1o6K3J64j65R1j72Q7
$$ -85 -4 -106 187 121 -73 -164 -158 -59 85 40 -85 54 72 19 -117 34 51 0 -66 -43 121 -44 47 -125 -38
6332c8m7j12J80NJ22q8P8j74N6J01p3J11Q0k74J65l5m2J06j21Lm0K57k70L2J3
$$ -38 -85 -197 -17 -12 110 22 100 -74 -18 83 10 121 201 -73 92 57 15 121 0 3 -37 220 -50 -18 -5
6357eJ61j22Q4j71l0P1J48j01j26j0K85j52k17J48m3K43j88q7J29J13j09Q7m5
$$ -5 156 34 118 -53 -83 -12 136 35 -91 -101 184 32 -185 -37 -80 163 -25 -112 17 130 21 108 63
6380F3k3J51j56Kj64Q0P8J51j19jo3M1j86O0J1K04j10L5j70J83j40K3j47L08k21
$$ 63 40 191 35 37 -127 -47 31 182 63 62 -1 40 -146 -86 -75 129 19 54 -116 67 -73 -50 -197 111 -110
6405a10J9K87k10J83j19K0O9j1j35R1k41R8o5P3O2j08M8QJ01n4o2k00J30L13r5
$$ -110 -91 196 -14 169 50 70 139 128 -7 84 -157 -59 -124 -51 11 -97 -49 -41 60 6 -56 -256 -126 187 92
6430I2j37J01n1M1M5n8K9j04M3l0J3k5n0m1K47k9l1o2O9j29O2k2p7J3K98k94J6
$$ 92 -45 56 5 46 91 33 62 -42 1 -29 -16 -41 -91 -132 115 86 55 -7 62 -67 -5 -27 -104 -91 207 -87 -71
6457g1J74M4r4o1n6k31L63j79K19n2q7O6r6J0k2J52j88P1J49j24P6k1j60J88O
$$ -71 103 147 53 -8 -64 -295 68 -111 108 56 -31 35 -61 -51 -73 79 -109 -38 111 -13 63 42 -118 70 76
6482G6K9j27Lj00J30r1K13k88M5m9o6J82O9p0J0K09k86Q7J72j40q8Q8R5j60J51
$$ 76 105 -22 -19 -119 11 -80 133 -155 -110 -159 -225 -43 26 -44 -34 175 -111 -24 148 8 -80 8 103 -57 94
6507I4j21j27K25p9l8N4j54L64k45R8n1n6L8Q8q9r5k9J31n1n1K01j24O8j39N7
$$ 94 -27 -154 71 -8 -46 8 -146 218 -27 71 20 -36 2 90 1 -94 -123 8 -43 -94 107 -17 51 -88 -31
6532c1mJ91j38p7J32r0n0J78p0p5j00J95p8O8j17L1m0RJ53Rp6J9K3j93K92k00
$$ -31 -35 156 18 -59 73 -17 -67 111 41 -34 -134 61 -17 51 -66 -35 -75 -66 87 96 20 39 62 -131 161 -39
6558c9J75j03r3LJ7L5k3%J41j59pK6k3J7J50k60R3K9M2J27k37J35j85P7m4O4K4
$$ -39 136 33 -60 -57 -40 -5 -28 -28 113 -46 -53 -27 -50 -33 117 -143 -50 -21 21 148 -89 46 -139 -62 -106 -42 -18
6585a8L7K0J35j66M0j10K3p3JJ32k85K52q8J44M5o5L4M3p2KN8j1r9mO7n7nn9J4
$$ -18 19 39 174 8 48 -62 -39 -112 -111 21 -264 -12 -100 44 89 24 58 101 29 31 89 78 -21 -25 42 -15 -20 -79 -65
6614f5J25k25K33m1j27J87k1j04R2n9J73k03K5l3o5J15q8L3J13j41Q3n5K6R4j61
$$ -65 60 -165 68 27 -100 87 66 -38 54 -5 168 -35 -10 -43 -108 7 -81 -48 65 -76 7 -48 -22 72 -89
6639h9K9N4j03J88j23J21J04j19N2j91J26M0r8L8p7n7J75j06p7Q0J35j1r7RM0
$$ -89 -60 -6 -109 79 -44 77 181 62 114 -77 49 89 -9 29 -48 -105 70 -36 -113 -33 102 91 -6 3 43
6664D3n8PKJ07q4j35J4R1k2n1J09p3j33J69J9k8kJjn1M8K2k6K00k09LJ57j38o9
$$ 43 -15 -8 -6 101 17 -118 -104 -13 -35 -86 23 -50 -183 -14 5 -23 -25 -24 -25 -76 -28 -6 -32 168 -41 -38 119 -19 -88
6693h8J61j34j90J72l7J96j29Q7q9J64m9j06N5Qj43R5o1P6Q5N9j00n5j9L4N0N8
$$ -88 73 -61 -251 -79 -116 80 -49 38 -51 113 64 -42 13 21 -122 -27 -88 -12 73 132 32 -23 -42 -8 42 100
6719A00j21k5J28j34R3k03L10o0q9j2n5J72j84l8M5R9J0o8P3j54n7J83m3Qj5K5
$$ 100 -21 -46 82 -52 41 -162 148 88 -1 -13 -68 104 -80 -118 -73 26 36 -32 41 -113 -170 13 -30 -22 -37 -12
6745a2m7k00M51k50o7K14N4j53j3J13j47k3J93l05K78n1k26K65j49K53j87j1j8
$$ -12 -59 -259 192 -58 -125 89 143 -10 -23 90 -57 -80 113 -192 86 35 -191 74 -75 178 -9 -20 -38
6768c8J49j33O4J4r0O7k33J03K7L1N8J67Kj71k8n6p8M1m5J14J18j46r6J15J8J6
$$ -38 111 -22 42 56 -34 33 -200 -97 -70 -39 19 186 188 17 -11 -67 -145 -104 -149 -35 83 -63 -159 -44 -26 -10
6794a0N9K2o1j22L27k12r3m1K27j25j47O5J77n5p2nQ0R7j6P7l67K20P3j22j05
$$ -10 49 71 10 -112 215 3 -90 -131 96 -29 -176 -111 66 11 -61 -66 14 111 95 172 -195 25 98 -24 -129
6819a29J71J86k10P9k07M4L4j04K22j24J81j31n1K02j67Q5j07p9Q2r1qJ33R8p1
$$ -129 42 228 18 97 -110 -66 -32 -136 86 -38 143 12 -39 163 -4 81 -26 -105 -23 -114 -122 11 109 38
6843C8l3j47K02K7j88J05o5J52P1j76j2j15K97j56M6p7qMnJ48j99J47p4J03k44
$$ 38 5 -142 60 87 -101 4 -61 91 162 -14 -26 -141 156 0 46 -31 -39 -35 -40 108 -91 56 -18 85 -159
6868a59R6P7j5J11j05J6M4K2k02J70o2R5n3q4L5o8oqJ70Nn6p2L5n9Om3J95o9k06
$$ -159 -63 14 -1 110 5 21 65 87 -115 55 -7 88 35 -49 -14 -82 -88 -96 74 79 23 -49 -14 -73 -67 -110 85 16 -190
6897a90K32j67O8P7j15P5q7J54P0K9l0j16J6m6J18j40O6q9P1L5P9n0o8n1J46j55
$$ -190 42 -125 -57 20 -95 -20 -107 47 117 146 116 0 16 -30 88 -52 14 -75 -4 31 110 60 -8 -59 87 -68
6923f8J11m5kL9mJ26l85J58P7l6Mm2O9j82J21J24k9O1j56K0Q4j27J43K9j39J09
$$ -68 43 -2 -4 35 31 157 -228 -70 7 -29 -25 -67 2 -180 -59 65 36 97 -59 -39 45 -82 61 90 -49 60
6949F0o7O7k72J86J78k72J17P3l1J03j29M6j25MJ05j41n1J32o3L0L1J08k30J30
$$ 60 -7 60 -212 -26 152 -120 -3 70 39 142 13 59 -66 -62 43 -98 -149 -17 -80 -50 -19 89 -141 -11
6973a1J0k04J24m4P9R8k14O2J93j20J86p5j10j19K02K9p5P0q7j31K92j1j70nJ02
$$ -11 -1 -205 -81 -125 -46 52 -162 -100 93 -27 159 84 -26 -145 57 86 11 81 -6 -137 155 144 -26 -31 71
6998G1j26M9k0P2j07l1Q6M2n8m4J02n2j01J86j20J47p4k4r3J89j5R7k31q9L7J25
$$ 71 -55 -6 -26 46 -61 -92 -6 36 -22 -66 36 -16 -117 69 -51 96 22 -2 -95 94 79 176 -55 -144 -107 18
7024A8R6j47K3J73p9k02K35J8j47j34J24K09j03R2j93N6k1k78K28j41J96J06j84
$$ 18 114 -33 -10 163 84 -118 117 135 -12 -146 -22 187 84 176 -17 39 18 -260 -32 -173 23 129 -55
7047e5J65j52rj0m6K07k37K19N8j91M0np8P5J08r3R4J57k81Q0j8K2j60J03O0p5
$$ -55 110 -42 -51 -61 -107 100 -137 82 140 -51 -11 -16 -94 -19 89 -4 90 247 -34 46 28 50 -110 -7 53 -22
7073b2p8Q3J9K9o9r2J49j9p2L6r0L2J39j02j6M4J30o1j08L7J35j44j3O2L6K8P5
$$ -22 -100 -17 2 31 -38 -130 19 0 -72 -36 -126 -94 45 -57 -73 -29 101 40 -68 -31 104 -40 -53 9 45 73 148
7100A48M9j86q7J74J28k61J14k19J06R1j56J08j04J24J11j44m8q8J91m8k6m4m2
$$ 148 197 11 -76 98 226 -35 79 -140 -34 57 -99 9 -95 29 140 -4 -52 -140 51 3 -23 -67 -109
7123a09J3J20O6K8k78L4K71j05J13p3j41o2K21j7l5p8kL4J4NM3kN7l9l6j33R3
$$ -109 -96 24 90 118 -160 -126 145 40 153 80 -61 -123 98 81 46 -32 -34 0 14 19 62 60 117 78 42 -91 2
7150Bk0l0J82L5r6k1j34K03j7k57O0K11j95J05p6j9j9J93k12M26l02k9j16l3J76
$$ 2 -18 -48 134 169 73 52 -82 121 104 -153 -93 118 -77 28 -48 -67 -86 107 -105 321 19 -10 -126 -159 17
7175A7q5k9k41L33m4L2p0J59j13J26Pk4L6m99L89k29k15K72K67j58j55K52m4j14
$$ 17 -68 -97 -338 -5 -49 -17 -87 72 -41 85 92 68 104 -395 -6 -235 -450 -178 89 -69 -224 28 -16 -130
7199a30Qj92L7N13j43j14j42r6N24p12L81OQ8jk08j7M55p39J79J14k40N27j77
$$ -130 -122 -314 -277 236 93 -21 -163 -259 265 -447 -66 -60 28 27 -181 -198 257 -482 -303 -189 -429 98 -79
7222g9O8O2J2r1m00M21j59j93R21j078P52k3k41L41m66L02Q5K3m63N32j38k72
$$ -79 -11 51 63 -28 -428 -7 -166 -359 562 -516 236 213 -28 313 -153 149 234 257 -206 326 188 -84
7244h4M0j20K42L9P1J38o72K06K00j96R2nJ36K26j86n8J11k68K16l05K17k85L79
$$ -84 -44 -164 78 117 188 326 -346 -140 60 -136 -44 -49 87 313 127 69 180 -88 128 -177 40 -245 134
7267A34p3l30N26j80j62k2M70m73m40P01k69n5PJ95rL0N4J46l25Q2Q7j8j5m3%
$$ 134 61 -269 257 77 -85 -107 363 -110 -550 151 -118 -173 -166 29 20 50 104 250 -75 7 94 76 61 18 18
7292A8O5r9o3J96L4o7M8j04l7J51j68kO4j57K2L9O8KR7q2j10Q1j0Q1q0K5J5J2
$$ 18 83 -16 -79 117 151 84 132 28 -9 142 -26 -28 36 -121 -99 -60 8 10 107 25 -85 -4 -14 67 -13 12 27 39
7320C9n9K0J8k22J23J23K8r2N4j09J26Jk39J71k14L6K36j00KLJ3R6k00J69K9o9
$$ 39 -20 0 18 -204 -81 42 70 -22 32 -77 49 50 -189 -18 -232 -196 40 -60 -58 -55 -42 54 -146 23 52 -17
7346a7L4j01J32j66J32k6m3j7J48mj04K9K0o7J31L8Rk87l6K98p2L8pm2j72K06
$$ -17 17 -84 48 -118 14 -12 -55 -72 76 72 -32 -3 17 -50 81 119 128 -159 -195 103 31 69 62 20 -152 54
7372E4r5Q3k7mJ8j80J9J19m1J27p5r7L2L6m0l1M5K3N6J3K13r9j29Mj39J34j04
$$ 54 -41 42 15 11 29 -151 -132 -13 -54 73 -2 -99 -67 -31 -71 -102 -57 -34 22 35 248 149 20 24 -115 19 -85
7399h5J72j09K00o7j2J6j61M2lJ35j36J34n2l6k11J24q7J70q0J2j01n9J65J67
$$ -85 87 -22 178 111 99 115 -46 -4 -7 128 -8 126 74 38 -173 -49 -136 34 -46 -34 -135 -194 -29 138
7423A38j28j10K32o0j65j6J67n9M1n4L5j0P4r3Rk02J92l9J1J98k46J94n0%q8O
$$ 138 10 -100 132 72 -93 -109 58 -1 40 -14 21 11 85 -8 1 -201 -9 -48 -37 161 -85 109 59 59 -29 -23
7449b3K29j74J10j48J76k61Q1M4o4jP6j4qj42J10N4k1p4JJ12j30Jm4n5K35n3J79
$$ -23 206 32 142 -6 170 -91 -10 34 -30 -31 45 31 23 -119 -9 45 24 -50 -49 63 -67 -66 -110 -165 70 17 196
7476A96k98J39j1r9J31j46J00O6l5j23N4Q7j28J46J0k6k73K46J15m11J70J71j39
$$ 196 -102 37 26 -73 58 -88 12 78 43 -80 -26 61 -67 79 89 63 -210 36 151 -260 -90 81 -58
7499e8n3J06R6j24j41K92j14k2n3J1j0M1P2K9j31J27o2J58k47j5J22J3j31k3J52
$$ -58 -111 -5 91 -33 -174 118 4 -18 -71 -60 -70 -29 43 72 -59 68 6 164 -83 -98 24 37 -94 -117 35
7524C5n4l8J31j85K08r4L0m1j37K22J23l59J10q3m5J83j61J58J67k82J37j46K63
$$ 35 -19 -57 74 -111 97 3 33 -8 -145 77 200 -159 -49 -132 -177 6 -155 3 170 -112 25 -121 142
7547A42k04P3J4J33jj77K7J82k59O7l7L8K3p2k4pK3k1J20m6P6k35Q3J67n2r3J78
$$ 142 -62 11 25 158 157 -20 7 189 -70 -3 -40 -2 21 -51 -75 -82 -59 -80 40 -6 70 -165 -82 85 33 -60 118
7574A18k1o3q4R7lQ2p4j20O2p3K61j62Q9q9O3r8J00k9j24O1J8O8j53K5k8K8N2
$$ 118 97 34 -50 47 44 126 52 -68 -6 -79 182 20 109 20 83 -15 85 56 -68 -7 11 79 -74 -49 -77 -49 3
7601Cjm8lN2NJ2q9J13M7M0q8R0n6j31K6O7o0J8m8P6j20N0r0K35pj53J23j53J46
$$ 3 2 -46 -49 3 8 20 -69 44 91 131 43 133 77 -54 -28 39 -21 -3 -51 25 -95 -45 -135 100 93 -60 63 -90 56
7630E6j08J74p6Oj29L8p7K09j37nK4L2J04j5k92L93k67J01nk00J22O9o0j2R1R4
$$ 56 -52 122 46 52 -77 -39 -116 93 -44 -49 -25 7 111 96 -196 197 -70 31 26 -174 -52 17 -43 -55 36 130
7656A30o7q6l8n6J03L4q9P5j95J31J76j61Q5J20k83J08q6j36K59L6l7Jo4j17k0
$$ 130 63 -23 -61 -117 -14 20 -69 6 -189 -58 118 -43 42 162 -121 -13 -99 -235 24 60 23 24 -40 -157 -177
7681a77Q8M8K19j54j94J66O0j76J93J1r3m4J39r3j42Q7K77j73J31r8r9J8J32j9
$$ -177 -89 -41 178 24 -170 -4 56 -120 73 84 -9 -53 86 -7 -149 -62 215 42 173 75 -24 -6 126 107
7705A07j97Q6J0j7j5M2r0P5j38JJ64M0j08m2m8J33p6k4j42K79j3Jmj19kN1K67
$$ 107 -90 -4 6 -11 -26 16 -74 1 -137 -136 28 68 -40 -82 -130 3 -73 -97 -239 40 27 28 24 -95 -97 -46 221
7732B21r7j3o8j04j32L03n9M8M8j76Nn6r2L25o4j3n6N3k7j82J56Q7j05j07K01
$$ 221 124 111 43 -61 -193 110 51 99 147 -29 -24 -80 -172 153 89 76 20 73 46 -136 20 107 2 -105 96
7757I6p0q9q6K68p4N8J2j02k1j59R2J22j55O6o0K2Q7j66L01Jp9Q4m7q5Q7M0j10
$$ 96 26 -63 -149 119 45 103 115 13 -8 -167 -75 47 -108 -42 -102 -80 7 -159 142 143 64 148 101 16 103 143 33
7784C3O0k00Q2N6q0M3n1n6J08J77k88J35k6j0N9j29J11r2m1nJ03o1K37l45J22
$$ 33 93 -107 -25 31 -49 -6 -57 -113 -5 172 -116 19 -7 -17 42 -87 24 -68 -109 -114 -11 -72 165 -180 -58
7809e8J26j87K11k36lJ55O4j07J17j39K5J59K5k36J12N6o2M2j03m2r4J11J14j87
$$ -58 68 -119 92 -144 -147 8 72 -35 82 -57 -32 127 152 -84 28 84 22 64 -39 -81 -175 -64 50 -137
7833a37J71J35j73j8p0K30lj62k3k05J57J29k03J37j08K52p6k28K29j2R1k23k0
$$ -137 34 169 -4 -22 -92 138 135 -27 -50 -255 -98 31 -172 -35 -143 109 33 -195 34 22 113 -110 -130
7856a30N9K93m11K17qq8N5K3Kj6K9N9j91J84k2M4k31K02j32n5j22J78J29j52J93
$$ -130 -71 222 -189 28 20 -68 -13 10 12 -4 25 84 -107 77 55 99 -132 70 -62 -117 -239 -61 68 -84 109
7881A09j36J18p3Q2k29J46l2J32k68J71J26k43R6Q5j95Q4M4mM7j31L31j70k50
$$ 109 -27 91 18 100 -129 17 -15 117 -151 20 146 -97 -1 84 -111 -27 17 13 60 -71 260 90 -160
7904a60J29qmJ37j56J25L1k55O3o9K9J35O6Ln7L2M0j81j4K7j02J57J3j27O0K04
$$ -160 -31 -39 -43 94 -62 63 94 -161 -98 -167 -138 -3 63 66 9 41 81 -100 -114 -87 -189 -32 -19 -146 -86 118
7930A18L3j83m3jJ58j55O6J8l8j76J94kJ00k36J09O4j82J54k08M2J08J21J93m29
$$ 118 151 -32 -75 -76 82 -73 -7 11 -27 -203 -9 -11 89 -147 -38 26 -156 -2 -210 -168 -60 61 254 -175
7954a75L30j07k22J86j06Q0n3K23k82K29l01J05L8j96K57k35J98Q6o8j56J65N6
$$ -175 155 48 -174 12 -94 -14 -67 156 -126 103 -198 -93 -55 -251 6 -229 -31 55 -13 -169 -4 52
7976E2l3J32j66j75J47L97m60J3J75J49l21J22J13L2l20Q0J32n8m4Q8J5n7j07
$$ 52 19 151 -15 -190 -43 354 -106 -93 82 231 -90 32 145 177 -143 -63 69 11 -33 55 70 13 -94
7999i4mK03k49NJ97R0j03l5l9N2j19Q7P0j10N6qq7J44p2M7k15K08j01M4J7L4m2
$$ -94 -98 105 -144 -139 58 148 45 10 -29 23 -96 -9 61 -49 7 -1 -88 56 -16 31 -184 24 -77 -33 -16 18 -24
8026b4J30j26ol1L3N8J69n4r6j46J30p9q3L99k32n2l4J4r8K34l3j85K32j91oQ5
$$ -24 106 -20 -26 -57 -24 34 203 149 53 -93 37 -42 -125 274 42 -10 -44 -30 -128 106 73 -112 120 -71 -77 8
8052Hpr9J26q5q1mK22k26K74k25P1J81j66p6P5Kj29M8J67j59J05m1L4o9K19k11
$$ 8 1 -98 28 -57 -138 -142 80 -146 128 -97 -26 155 -11 -87 -12 -10 -139 -91 76 -83 22 -19 15 -54 165 -46
8078d6J16j36J71j39j09O5L4R3n0k16P1J50j8R9r0o5l0J23j3Rj18mO3R8j19J82
$$ -46 70 -66 105 -34 -143 -78 -44 49 -1 -217 -146 4 -14 85 -5 -70 -100 23 10 19 -99 -103 -40 58 -61 121
8104A21q1q3L8j44j6K27q7J00j14N1J02n5Oj22p1M9O9m6J38m8m1J70j77j43K74
$$ 121 40 -43 -5 -149 -165 62 -25 75 -39 12 114 59 65 -57 -128 -79 -10 -56 82 34 -7 163 -14 -157 117
8129A17J40l63K36n9l1j40j9K03j00r1J94j21j42K27K5k36J85K2j18J88L9o5j19
$$ 117 257 -106 130 71 40 -100 -119 84 -16 -107 87 -34 -176 51 76 -160 25 47 -71 117 156 91 -28
8152b8k4j04L80j28J5j72J04O6k37k6L03j71l6J1m5J78j42p0P9j19J53M6j2n2
$$ -28 -52 -156 224 96 111 -61 43 109 -128 -154 149 -22 -58 -47 -92 86 -56 -126 -47 -166 -13 33 21 -31
8176c1J22K9q2k62J59J1j05J84j11j42J32Q0nM5M4
$$ -31 91 120 38 -224 -65 -54 -159 25 -86 -228 -96 -16 -21 24 68
8191F8
$$ Imaginary data points
##PAGE= N=2
##DATA TABLE= (X++(I..I)), XYDATA
0@%%%%%%%%%%%%%qJ6j6J6j6K4l2L2m0M8n6P0p8Q8j04J20j37J61j84K08k40K72
$$ 0 0 0 0 0 0 0 0 0 0 0 0 0 0 -8 8 -8 8 -8 16 -16 16 -24 24 -32 38 -40 48 -56 64 -73 88 -96 112 -128 144
35A44l04L41l81M25m77N31n89O55p26Q02q87R80j081J193j314J447j597J759j937
$$ 144 -160 181 -200 225 -252 279 -310 345 -381 421 -466 514 -567 626 -688 759 -838 921 -1016
54a016K140k368K626k923L265l663M139m719N439o369P620r393J2131j6972K8059
$$ -1016 1124 -1244 1382 -1541 1724 -1939 2200 -2519 2920 -3449 4171 -5222 6909 -10063 17996
69A7996j01331j8190J57845k6341k0397O4205O8594q8076j13925k4895L5179o185
$$ 17996 -83335 -101525 56320 29979 9582 73787 142381 54305 -59620 -84515 -49336 -55521
81e5521R948N6209N9238J2079k620l3858p7072o3019J8705L0253j4507J6941J09335
$$ -55521 -45573 10636 69874 81953 79333 45475 -31597 -94616 -75911 -45658 -60165 -43224 66111
94F6111P3845n9926q5904R714J3772p8530o7548O5954J06690J5321l1294K0567
$$ 66111 139956 80030 -5874 3840 17612 -60918 -128466 -62512 44178 59499 28205 48772
106D8772K4771n2789q3541k5817K0918K3061L1991M7778L1091N577l087k9281
$$ 48772 73543 20754 -62787 -88604 -67686 -44625 -12634 35144 66235 71812 68725 39444
118C9444o9350n1194J7273L6666O11J0792O5117M8209m1073p1045j6328O957l0475
$$ 39444 -29906 -81100 -63827 -27161 -26550 -15758 49359 97568 56495 -14550 -30878 -23921 -54396
131e4396k6582M3174P5142L0382j0305o443q696l8535m9514k3148O942K5942L8203
$$ -54396 -80978 -37804 37338 67720 57415 50972 42276 3741 -45773 -68921 -61979 -36037 2166
144B166L5057J3023m088j0360k7232m6326k9693J4357L4188K1714K0351L2711
$$ 2166 37223 50246 46158 35798 8566 -37760 -67453 -53096 -18908 2806 23157 55868
156E5868J6931k7057m8723l1039j2040q564L454L0455M3021K6537K362j3666k3884
$$ 55868 72799 45742 -2981 -34020 -46060 -54624 -51170 -20715 22306 48843 51205 37539 13655
169A3655k9662k4726r416J0318K7551L4134K4827O351j1140k3407l1633k9946
$$ 13655 -16007 -40733 -50149 -39831 -12280 21854 46681 53032 41892 18485 -13148 -43094
181d3094j3704Q116K3858L0402K7327J5489k840j9687k7490k6432j5824K723J9698
$$ -43094 -56798 -48682 -24824 5578 32905 48394 45554 25867 -1623 -28055 -43879 -41156 -21458
194b1458K6676K4412J5036n41j8609k8112k7000j7582k162J6774K8225K6489J7206
$$ -21458 5218 29630 44666 44125 25516 -2596 -29596 -47178 -49340 -32566 -4341 22148 39354
207C9354O687q855k5907l0456j6845o08P933J6131K6483K4797M087j5715k1208
$$ 39354 46041 37186 11279 -19177 -36022 -36630 -28697 -12566 13917 38714 42801 27086 5878
220E878k0130k0444j1627Q302K4547K6280J9963J0034m344j8365k4229k0872j2745
$$ 5878 -14252 -34696 -46323 -38021 -13474 12806 32769 42803 38459 20094 -4135 -25007 -37752
233c7752J085J7226K5255J8582P363M6j0749k4409k5908j0214O718J3420J7390
$$ -37752 -36667 -19441 5814 24396 31759 31805 21056 -3353 -29261 -39475 -32757 -19337 -1947
246a947K3040J9429J023j6729k1386j8845j5486o282R089K0512K1365J4585L843
$$ -1947 21093 40522 41545 24816 3430 -15415 -30901 -37183 -28094 -7582 13783 28368 32211
259C2211q133j7977k0112j4895m755P147J8500K2556J6158M874n723j5410k1553
$$ 32211 24078 6101 -14011 -28906 -33661 -26514 -8014 14542 30700 35574 29851 14441 -7112
272g112j9917q548N270J4436J8111J7729J0796j992j3829j8620j6066r153J220
$$ -7112 -27029 -35577 -30307 -15871 2240 19969 30765 28773 14944 -3676 -19742 -28895 -27675
285b7675J1930J9249J8142J0076j051j1351j7994j9004j3560j519J0000J6883
$$ -27675 -15745 3504 21646 31722 30671 19320 1326 -17678 -31238 -32757 -22757 -5874
297e874J7874J3593M131p181j5842j7458j2483l691O249J4307J7921J3456M446
$$ -5874 12000 25593 29724 22543 6701 -10757 -23240 -26931 -20682 -6375 11546 25002 29448
310B9448o477j4375j7777j5170o553M013J3630J7648J5550Q356k002j1330j6224
$$ 29448 22971 8596 -9181 -24351 -30904 -26891 -13261 4387 19937 28293 26291 14961 -1263
323a263j5050q791J106J0359J5623J4671Q625l65j0177j5972j5844r663m86Q622
$$ -1263 -16313 -25104 -23998 -13639 1984 16655 25280 24915 14738 -1234 -17078 -26741 -27227 -18605
337a8605J5274J6620J2045K361p677j3579j5064j2405m553O238J3743J4590J0480
$$ -18605 -3331 13289 25334 27695 20018 6439 -8625 -21030 -25583 -19345 -5602 8988 19468
350A9468L994l848j2844j6580j2433l107N078J0726J4962J4814P203l913j1691
$$ 19468 23462 19614 6770 -9810 -22243 -25350 -20272 -9546 5416 20230 27433 23520 11829
363A1829j4306j2802q070L43R546J4303J3606P813j579r190j2553j2284r066j443
$$ 11829 -2477 -15279 -23349 -23006 -13460 843 14449 22262 20683 11493 -1060 -13344 -22410 -23853
377b3853R129J5928J3615O914J556m672j3168j6775j1158m68O522R853J2544J2078
$$ -23853 -14724 1204 14819 21733 23289 18617 5449 -11326 -22484 -22952 -16430 -6577 5967 18045
391A8045N115n857j2213j3092r405l686L382J0617J3803J2486N054m724j1204
$$ 18045 23160 17303 5090 -8002 -17407 -21093 -17711 -7094 6709 19195 24249 19525 8321
404H321j2783j0887p203K37R900J4863J1879N398q31o563j2215j2998p439R94
$$ 8321 -4462 -15349 -22552 -22315 -12415 2448 14327 19725 18894 12331 116 -12882 -20321 -19327
418a9327Q234J1888J1858P276R54o996j2383j3650q581m85N954J0551J2916J0343
$$ -19327 -11093 795 12653 19929 20883 13887 1504 -12146 -20727 -21212 -15258 -4707 8209 18552
432A8552K307n468j0121j1361j0359l787N559J0507J0352R016N620l041j2254
$$ 18552 20859 15391 5270 -6091 -16450 -20237 -14678 -4171 6181 15197 20817 17776 5522
445E522j3436p835l281O10P864J4437J2235L826k782p130j0865j1294o082J070
$$ 5522 -7914 -15749 -19030 -18420 -10556 3881 16116 19942 17160 10030 -835 -12129 -18211 -17141
459a7141O503J1058J2776O174m027p272o228j0441j2672j456J3128J3069M477
$$ -17141 -10638 420 13196 19370 15343 8071 1843 -8598 -21270 -22726 -9598 3471 7948
472G948M851P892j648j6348j5312l356K349O58N396J3387J1020J570n869q887
$$ 7948 12799 20691 19043 2695 -12617 -15973 -13624 -12966 -7570 5817 16837 18407 12538 3651
486C651j1115p917o46K701M527J1574J5600M096j0689r876r77o641j5136k751
$$ 3651 -7464 -15381 -16027 -13326 -8799 2775 18375 22471 11782 1906 929 -5712 -20848 -23599
500b3599J7369J6207N3k024O927R48j6301j6729q84P100L898N180J0276Q615Q11
$$ -23599 -6230 9977 10030 8006 14933 15881 -420 -17149 -18033 -10933 -7035 -1855 8421 17036 17847
515A7847n850j0821j2958n437M665M633J021Q608J6656M447j5405j3010J929m26
$$ 17847 11997 1176 -11782 -17219 -12554 -7921 -6900 1708 18364 22811 7406 -5604 -3675 -4101
529d101j2655m337J7533J8902m83o913J921J068j2579j5342k157P957P822O321
$$ -4101 -16756 -21093 -3560 15342 14859 7946 9867 10935 -1644 -16986 -19143 -11186 -3364 2957
543B957O434L908Q7l942j0335j3029l621Q609P294j52N217J3747L983j5057j5332
$$ 2957 9391 13299 13386 9444 -891 -13920 -17541 -8932 -1638 -1790 3427 17174 21157 6100 -9232
558i232J34K947o824l424J3552J6961K513p380l395j453p571j0304k751O393R786
$$ -9232 -9098 -6151 -12975 -16399 -2847 14114 16627 9247 5852 4399 -3172 -13476 -16227 -9834 -48
573d8Q052L623r69k001k995q712j1622k947R364R183J702K989Q552K650j1502
$$ -48 8004 11627 10658 8657 5662 -3050 -14672 -17619 -8255 928 2630 5619 14171 16821 5319
588E319j3551l046L068p51J95Q719J1645L506n398o763m822m914m805r94M520
$$ 5319 -8232 -11278 -8210 -8961 -8766 -47 11598 15104 9706 2943 -1879 -6793 -11598 -12592 -8072
603h072R306Q836K880l001l854l851o922q298j493P446Q755M063K134L125o97
$$ -8072 1234 10070 12950 9949 6095 2244 -4678 -12976 -14469 -7023 1732 5795 7929 11054 10357
618A0357q225r914l877J557L057M014O707O678K535l529o775p042m679j481J104
$$ 10357 2132 -7782 -11659 -10102 -7045 -3031 3676 10354 12889 9360 2585 -4457 -9136 -10617 -9513
633i513M639P236P013K175k906n297n185n429l860Q09N792P015N376K538n97l925
$$ -9513 -4874 2362 9375 11550 8644 3347 -1838 -7267 -11127 -10318 -4526 2489 7865 10403 9806 5881
649E881o522o473l577M64M264O024N696L709O66l567o034o034l699n60L166N575
$$ 5881 -641 -7114 -10691 -10227 -5963 61 5757 9466 10132 6565 531 -5503 -9202 -9762 -6596 -1021
665a021O095M031O91k709n049o310m871r39K747M916N271M960K511j995n466n715
$$ -1021 5074 9105 9796 7087 2038 -4272 -9143 -10082 -7335 -2419 2852 7812 10323 8328 2862 -2853
681b853m371j782J048M100N994N143K219j466m244n411m736k728M26L475N943
$$ -2853 -7224 -9006 -7958 -3858 2136 7279 9498 8032 3788 -1623 -6359 -9087 -8661 -5186 757
696G57N595K386p11k763m803n438l759p1L836M891M333L485R49k650n211n425
$$ 757 6352 8738 8027 5264 461 -4977 -8736 -8807 -4971 -80 4253 7738 8687 6037 826 -4599
712d599l158n99K190M493N328L908J140k139m420n107l854j385J339L947N276
$$ -4599 -7757 -8356 -6166 -1673 3655 7563 8703 6564 2144 -2963 -6817 -8202 -6863 -2916 2360
727B360M330J455j438l745m822m209k080Q09L859M817M360K136o73l039m837m470
$$ 2360 6690 8145 6707 2962 -1860 -6069 -8149 -7340 -3481 1336 5696 7832 7159 4120 -717 -5187
743e187k217J61K926M426M419K672K7k749m201m363k962l71K443M358M324K882
$$ -5187 -7404 -7243 -4317 109 4528 7200 7227 4478 277 -4086 -7048 -7419 -4976 -618 3706 6588
759F588O77j760l990m706l333o58J754L506M242L615J418j637l649m288l138j478
$$ 6588 7265 5505 1515 -3191 -6524 -7182 -5428 -1922 2320 5935 7353 5716 2067 -2221 -5359 -6837
775f837R73K963M552L747J747j013l441l808l557j988J17L048M276L809J757k94
$$ -6837 -5864 -2901 1651 5398 7145 6132 2691 -1117 -4674 -6662 -6545 -3497 779 4588 6345 6051
791F051k088l813m211k420J29K534L635L560K708M54k023l800m047k572k97J457
$$ 6051 3963 150 -4061 -6481 -6352 -3818 -183 3377 6085 6539 4516 716 -3331 -5903 -6200 -4743
807d743L481L783L244O36j434l455l703k853j180R60L325L772L055J079q44k818
$$ -4743 -1262 2521 5765 6401 4967 1512 -2191 -5044 -6224 -5264 -1939 1833 4888 5967 5123 2305
823B305l670l119j568O81K744L667L027J846l69k482l550l280j952L89J972L408
$$ 2305 -1365 -4484 -6052 -5371 -2627 1040 4067 5913 5544 3062 -488 -3768 -5720 -5331 -3359 49
839D9L471K140k91j801l351l165k361k98J751L560L070K079O66j445k963l382
$$ 49 3520 5660 5369 3568 217 -2948 -5309 -5607 -3856 -296 2774 4853 5519 4074 1111 -2271
855b271k664n42J622K534L123K607R24q70k909l326k306j159P45K320L224L172
$$ -2271 -4935 -5477 -3855 -1321 1802 4409 5333 4463 1554 -1772 -4078 -5237 -4492 -2172 1052 4224
871D224J168p61k395l003k824j598K76K274L138K889J323l53j515k800l123j686
$$ 4224 5392 4631 2236 -767 -3591 -5189 -4913 -2639 499 3388 4711 4358 2843 43 -3080 -4766
887d766j29K026K818K740J732L36j479k679l042j947l52J260K539K879K367M11
$$ -4766 -4895 -2869 -51 2689 4421 4757 3278 599 -2443 -4390 -4742 -3482 -943 1936 4303 4714
903D714j054k566k874k164n20P38K389K587K425R38n87k574k676k109j038L84
$$ 4714 3660 1094 -1780 -3944 -4464 -3726 -1337 1250 3675 4613 4026 1452 -1224 -3333 -4371 -3987
919c987J723L111K562J151o67j817k457k284j611O5J577K897K576J124k61j187
$$ -3987 -2264 847 3409 4560 3893 2076 -381 -2665 -4276 -4211 -2634 263 2839 3963 3702 2515
935B515k067k705k133j47K109K368J882J578P67p19k502l176j722K60J100J343
$$ 2515 448 -2257 -4390 -4537 -2428 -60 1822 3400 4167 3448 946 -2230 -3952 -3692 -2592 -1249
951a249K082K672J087j327k728k001j057q30m88J756L117K685P0j334j047j375
$$ -1249 833 3505 4592 3265 537 -1464 -2521 -3351 -3839 -2083 1034 3719 3789 2455 1408 33
967C3k186k145R4K725K719J138N24L34m50k444l104j414R69J943J168J120K046
$$ 33 -2153 -4298 -4204 -1479 1240 2378 2902 3236 2786 342 -2762 -4176 -3207 -1264 -96 1024 3070
984C070J363j356l505k259j23L68k29J080K833K882j49k334j514j055r00j866
$$ 3070 4433 3077 -428 -2687 -2810 -2442 -2671 -1591 1242 4124 3975 1641 127 -928 -1828 -3694
1000c694k19K628L425J012o35n01j73j526l133j637J546K569J359L94J050J096
$$ -3694 -3913 -1285 2140 3152 2517 2016 1843 317 -2816 -4453 -2907 -338 1021 1415 2465 3561
1016C561j065k999k703J12J088O14O06J963K532K27k389k513q48o6r72k14K199
$$ 3561 2496 -503 -3206 -3094 -2006 -1392 -786 1177 3709 3936 1547 -966 -1814 -1880 -2852 -3066 -867
1033h67L301J226j047j235o42j030k277j361J244K814J508L22L52L37q18k723
$$ -867 2434 3660 2613 1378 736 -294 -2571 -3932 -2688 126 1634 1956 2308 2645 1827 -896
1049h96k097l57J338J694Q53P30J686K96j904k575j098K48J98n6J638K491J113
$$ -896 -2993 -3350 -2012 -318 535 1265 2951 3247 1343 -1232 -2330 -2082 -1884 -1940 -302 2189 3302
1066C302q21j597j103q52j335o08R63K180J850O40o06m68q90j570j964j03J174
$$ 3302 2481 884 -219 -1071 -2406 -3014 -2051 129 1979 2619 2013 1545 655 -915 -2879 -2982 -1808
1083a808J765J146O71P78j35j488k408j003K72L37R93J243J831P81q16j387j530
$$ -1808 -43 1103 1774 2552 2417 929 -1479 -2482 -2210 -1873 -880 363 2194 2975 2159 772 -758
1100g58q90n54%Q88J853J354P64o35q69j338j288j020P6J042J428J332P98j4o51
$$ -758 -1648 -2202 -2202 -1314 539 1893 2657 2022 1153 -185 -1473 -2493 -2417 -1375 53 1385 2183 2169 1518
1119A518j441j517q22q2R34J231J230J073N2o51j119j297j235OM52R50J562R70
$$ 1518 77 -1440 -2262 -2344 -1410 -179 1051 2124 2176 1525 406 -891 -2126 -2120 -1668 -718 844 1814
1137A814M99p92r00j260j216k19M29R19J316J078N88k89j074j336j054p05M86
$$ 1814 2313 1521 621 -639 -1855 -2074 -1645 -726 590 1668 2256 1967 893 -443 -1497 -2202 -1716
1154a716O67J223J267N79j32q33j069j261n68j03N21J531J120N42J8m85r39j429
$$ -1716 -1049 174 1441 2020 1888 1055 -14 -1275 -1843 -1946 -1425 106 1226 1768 1786 1301 362 -1067
1172a067q16L1N98J079Q53R71K22m87r80j074q11l26L58Q64J155P76M44j59r77
$$ -1067 -1883 -1852 -1254 -175 678 1649 1871 1384 404 -670 -1481 -1807 -1449 -585 570 1346 1790 1631 654
1191F54j211q51l36K03P35J040J099N44k87p41r68j067m93k8R52R17O91P37k3
$$ 654 -557 -1408 -1744 -1541 -806 234 1333 1877 1590 849 -119 -1186 -1679 -1707 -755 162 853 1590 1567
1210A567m64j292q00m22r5N03R50R79O32Q1o32q68q20r04k4O04Q25P47Q75K26
$$ 1567 1103 -189 -989 -1411 -1506 -1003 -53 926 1558 1639 1007 139 -681 -1585 -1609 -1005 -180 567 1442 1668
1230A668l53r35j039o11l46K00Q34Q29P45N81j69p05j174o19k87J9Q71P85P90
$$ 1668 1315 380 -659 -1270 -1616 -1416 -582 247 992 1573 1404 699 -475 -1094 -1381 -1362 -491 294 1084
1249A084L10K9p91o38p10m81k54N10Q56Q52P63j20m86o02r22o90j79O46N13R46
$$ 1084 1394 1423 632 -6 -716 -1197 -1451 -941 -85 767 1530 1410 924 322 -600 -1290 -1469 -823 -310 636
1269F36O30J47o04n62q84m85l18N56N72P46O79L03r6j012o08o08l16R0O66P91
$$ 636 1266 1413 809 247 -637 -1122 -1440 -884 -312 434 1113 1416 1320 308 -300 -908 -1224 -1134 -468 323
1289C23M19N33k03m81p20q21m0j69N17N90Q63L24r1m08o35p14m68k5K18R07P44
$$ 323 742 1275 1072 591 -129 -950 -990 -1159 -642 -52 811 1135 1044 636 1 -713 -1181 -1206 -988 -81 663
1310F63N07n0m72n71o47o40K1K16P78M92P49J31k58o20p00o13o4L49J92Q95M33
$$ 663 1170 1120 648 77 -570 -1210 -1189 -973 -195 297 1046 1177 919 299 -401 -1014 -1078 -729 -537 358 791
1331G91K87n0o27n55o88l87J79M62P20O34K80j16n37m91o28m21L37P3N45Q95K13
$$ 791 1078 1028 401 -154 -842 -1229 -1050 -588 132 766 1046 930 393 -98 -726 -1147 -810 -737 -192 703 916
1352I16m9r8o76p01m17kJ56P21N72M02K16k50n75p06k01j57m3N33N86M29K72l8
$$ 916 867 769 93 -608 -1025 -1027 -871 -150 422 824 1040 790 215 -491 -692 -849 -892 -359 227 656 928 890
1374H90o43o58m66l8J74L39O09L94L09pl83o40m31l15r7N14M79M68L32o2k86l49
$$ 890 247 -411 -877 -915 -741 -402 207 601 910 903 520 -120 -551 -866 -963 -449 30 498 830 768 482 133
1396A33n16m61j67M99N62O66jl2p8m49n33o45m0L53M41N89K72L25j86n86l54k07
$$ 133 -383 -844 -1011 -512 50 716 715 683 605 156 -377 -1022 -1062 -709 -268 321 593 918 732 146 -208 -415
1418d15j69j86N46M30K74K29K1o12m88l6k52L6j4P73O14N5l79k40ln76n09K02
$$ -415 -584 -770 -224 206 480 709 730 118 -370 -406 -658 -622 -636 137 751 806 427 187 184 -392 -901 -699
1440f99L69M17J54M14J79l20k98p62k95m8M92K98L26J44L61J58o82p28n6J80j80
$$ -699 -330 87 241 655 834 514 216 -546 -841 -889 -397 -99 227 371 732 890 208 -520 -576 -396 -576
1461e76J2P42O58k1m42o5k19k88p19K04O44K96J45L5K65k08m39l93m71P9N46L60
$$ -576 -564 178 836 815 373 308 89 -199 -918 -714 -70 226 371 406 671 463 24 -369 -840 -761 -215 145
1483A45R8O3L03J14o85n98J8K24J02q4K57R47j44l36m24l3l75j99QN69L04K35
$$ 145 243 306 609 723 38 -560 -542 -318 -216 -300 -43 904 760 424 0 -33 -408 -607 -599 -30 274 509
1505E09M9j13k54j49l36l78M8N02M88p1L2K31K8n69o61j6K76P8J25M77L11j1m14
$$ 509 558 445 191 42 -294 -672 -624 -122 366 295 327 558 586 17 -644 -660 -384 -306 -181 296 607 596 182
1528A82l57j71j61m6K98K68J44N01N9m29k72l55r1n4k27M70O01J12j09m2j07l82
$$ 182 -175 -346 -507 -553 -255 13 157 658 717 288 16 -339 -430 -484 -711 -241 360 472 363 321 214 -168
1550a68j38l50L51J67K12L91m0k9k46k60l81J43l02L12M61K33K15j33j95l91j59
$$ -168 -306 -656 -305 -138 74 465 425 396 150 -110 -491 -348 -650 -338 123 356 571 438 243 -148 -307
1571c07j9m2J18L66L57k40O4j09M0l70k98KQ9K95K98K18k1o9l21k94r7j60K01
$$ -307 -326 -368 -250 116 473 233 297 188 228 -142 -440 -438 -349 -54 244 462 441 372 51 -243 -340 -500 -299
1594b99K71J99J30K55k54L4m50k37j36oK83K77K98Q3r3o3k48l93Q1j31K38J57
$$ -299 -28 171 301 556 302 336 -114 -351 -487 -493 -210 67 365 448 355 292 44 -349 -268 -399 -161 -4
1616dL06mK33k47l58j48k28OJ91J18L25M5J52j38k04n4l76n3N4M38N8K40o4R6
$$ -4 302 298 531 284 -74 -222 -450 -444 -253 -135 190 235 387 249 45 -9 -385 -438 -384 54 112 352 288 384
1640C84l19k18m1k45J55R1L14J26L1p1j40j93r7O2l11L58J97r4K46K28m49lk99
$$ 384 65 -153 -194 -439 -284 -193 121 247 278 207 67 -126 -223 -161 -472 -114 83 -11 235 463 14 11 -288
1663b88r6Q5j06L81K16J67j32k2q8k04j11j99J52K19K43J51j9j14j22j17l22P1
$$ -288 -384 -299 -405 -24 192 359 227 205 117 -87 -198 -397 -245 -26 217 368 349 235 113 -4 -326 -255
1685b55m1L5N16J01K6j74j1l42j50J13Nj49M18J32J07M9k47k28k11J93l22L53
$$ -255 -296 -261 255 356 382 208 197 -145 -295 -182 -177 -326 92 224 331 380 133 -95 -306 -113 -435 -82
1707h2M7K36Q1o3l1j42l17K0j93L44O9K59L0Q6o3j50k49o1r9J76K12J27j06L1
$$ -82 -35 201 282 219 188 46 -271 -251 -444 -100 -31 228 258 344 281 131 -118 -179 -278 -102 110 237 131 162
1731A62J07k83k05k3q3J4L29K39n2K8K2j08k41k4j36O7J04PK34ln2%j18j99R3
$$ 162 269 -14 -219 -242 -325 -311 18 257 205 233 255 147 -94 -118 -254 -187 -83 -76 158 155 103 103 -15 -214 -121
1756a21j18p1K23K86N4j88K07k55j7k05r1K11o4J94m8K43j53k1j73n1q9Q8n7M55
$$ -121 -239 -310 -87 199 253 65 272 17 0 -205 -296 -85 -149 45 -3 240 87 66 -107 -158 -247 -159 -216 239
1780B39j18J9N8k08j00j5j5J47q3J17L18j48l5j07qj79P4j44J21l8Q5L15r3P9
$$ 239 121 140 198 -10 -110 -125 -140 7 -76 41 359 211 176 69 61 -118 -44 -188 -67 -105 -20 295 202 281
1804B81k94k46Q3n8J23J49J76l8K3J15l78K8k77J07K53M3m4J37Q6k64J32k42K
$$ 281 -13 -259 -176 -234 -111 38 214 176 199 314 -64 -36 -313 -206 47 90 46 183 269 5 137 -105 -103
1827a03j40P7R1Q3O2N4J56j25j49k01K9m0K5J51K18o0qj42p2j34R9j36J31J81
$$ -103 -243 -166 -75 8 70 124 280 155 6 -195 -166 -206 -181 -30 188 128 120 -22 -94 -228 -129 -265 -134 47
1851D7N6j04K77k32j30pj43r7J88N5o7K81rLm9j09k12Q0J26q7J22J06J00j86K6
$$ 47 103 -1 276 44 -86 -93 -236 -333 -145 -90 -157 124 115 118 69 -40 -252 -172 -46 -133 -11 95 195 9 35
1876C5Q7k56p7r2K34qK15np3oJ15k69j40R5K35l9J63q1Q7j79k40J49l1N5j61J58
$$ 35 122 -134 -211 -303 -69 -77 138 133 60 54 169 -100 -240 -145 90 51 214 133 220 41 -199 -50 -81 -26 -187 -29
1902b9J25J26r8n3J14l81K05l02J93J65j27K69k09kQj63K1k2j3K3J01L9K5J01
$$ -29 96 222 124 71 185 -196 9 -293 -100 65 -62 207 -2 -4 4 -159 -138 -160 -173 -150 -49 -10 15 116
1926A16k38M3K2nlj5J81l7J2J23j25j30l5K4q0j35L36J6j5M9R4j37k33Rj56K26
$$ 116 -122 -79 -57 -62 -65 -80 101 64 76 199 74 -56 -91 -67 -147 -282 54 70 55 104 198 61 -172 -163 -319 -93
1952i3R7MO1Po6M5j32j24J62j38J61N9K49j45J1q5j89P5o6J09p3n9L55k20k2J11
$$ -93 4 8 69 76 10 55 -77 -201 -39 -177 -16 43 292 147 158 73 -116 -41 -107 2 -71 -130 225 5 -17 94
1978I4M5k87N5j90K62Nl5J91j48M6q0o7j49K15j51K09o6J29J43j58jk05J13Q2
$$ 94 139 -148 -93 -283 -21 -16 -51 140 -8 38 -42 -109 -258 -43 -194 15 -51 78 221 63 62 -143 -30 52
2002E2o8n3J39N9J00k39j20J70k62m8M7L17o5q6J61K60k95o0J01l64J60K19k05
$$ 52 -16 -69 70 129 229 -10 -130 40 -222 -270 -223 94 29 -57 104 364 69 9 110 -254 -94 125 -80
2025h0K5J46kO3q8j71KN1K2j37J05J75n0J8j64J13n0r0p4K30O9N2j20J4L8j62
$$ -80 -55 91 89 152 64 -107 -105 -54 -32 -169 -64 111 61 79 -85 28 -22 -112 -186 44 113 165 45 59 97 -65
2051f5j07L3P3J35J7L7j91R4o9M7l1m8J57o3p4K41k44J35r5Pj28J11j51j50J44
$$ -65 -172 -139 -66 69 86 123 -68 26 -43 4 -27 -75 82 19 -55 186 -58 77 -18 -11 -139 -28 -179 -329 -185
2076a85L50k3o1k71J01J33j23l4j24J41K63m8k7P1o5j81R8N2r8P6j3J03M6m4j22
$$ -185 165 142 81 -190 -89 44 -79 -113 -237 -96 167 119 92 163 98 -83 15 67 -31 45 32 135 181 137 15
2101A5j00J91k34M4J3K4KK55k16m0Q0o2j3m0L3J71M6q3Q3l03J20p7kP0J49j01
$$ 15 -85 106 -128 -84 -71 -47 -45 210 -6 -46 34 -28 -41 -81 -48 123 169 86 169 -134 -14 -91 -93 -23 126 25
2127B5j2j66K00j8j35J58k04R5Q9Lj24J46O3r6R4j99J38j50MJ01j10J15P0m6n3
$$ 25 13 -153 47 29 -106 52 -152 -57 32 35 -89 57 120 24 118 -81 57 -93 -89 12 -98 17 87 41 -12
2152a2m9L5j01O2M1m3J85j41J14j25J85k40J88q9k13J05J28M1L5q8M3J4k15N3
$$ -12 -61 -26 -127 -65 -24 -67 118 -23 91 -34 151 -89 99 10 -203 -98 30 71 106 18 61 75 -140 -87
2176h7q4J83OK09l06k4J29J8k21J06j15J64j0R5J66k11J9K2r0Ok6O5j46L0M0k9
$$ -87 -171 12 18 227 -79 -103 26 44 -177 -71 -186 -22 -32 63 229 18 37 59 -31 -25 -51 14 -132 -102 -62 -91
2202i1P4J79k40M9n9j39L26m1l6k9J05o4P7k27K9P3nk43L55P6k00N9K5j57p5K30
$$ -91 -17 162 -78 -29 -88 -227 99 58 22 -7 98 34 111 -116 -87 -14 -19 -262 93 169 -31 28 53 -104 -179 51
2228E1j20Ko3K36J25m3k31j60K01k8q9R4K70k44n5J00n7J62k32Mj07J99M3l3%
$$ 51 -69 -67 -130 106 231 188 -43 -203 -2 -30 -119 -25 245 1 -54 46 -11 151 -81 -77 -184 15 58 25 25
2253B5l3O6j17M7O6mq7J26k15J66M7l8n0Q0k7k26P4J9joJ47j07K8lQ7j35N5J35
$$ 25 -8 58 -59 -12 54 50 -37 89 -126 40 87 49 -1 79 52 -174 -100 -81 -82 -88 59 -48 -20 -23 64 -71 -16 119
2281A19o3l8J01j37n7L1J23k05M3J6k3J55J7K0m3l2k09J24N6p7O4p5R6k9j0m4
$$ 119 56 18 119 -18 -75 -44 79 -126 -83 -67 -90 65 82 102 59 27 -182 -58 -2 -79 -15 -90 6 -23 -33 -77
2307g7L7k4j30R4j3J85l06J07K14q4K18k74J4J35P7l38K34Q8k36K6o0J07l8%j41
$$ -77 -40 -64 -194 -100 -113 72 -234 -127 87 3 221 -53 -39 96 173 -165 69 157 -79 -53 -113 -6 -44 -44 -185
2332a85J25J11l4K04j02j40N8k81K42n5m6L4J09l2q6J21j04J23j37J57qp9J57
$$ -185 -60 51 17 221 119 -21 37 -244 -2 -57 -103 -69 40 8 -78 43 -61 62 -75 82 74 -5 152
2355A52j99l5j8J21J1l14K80k4R2K2r2j58P8QN3ml1J24r2J60r3j69Q0L2k6K6j46
$$ 152 -47 -82 -100 21 32 -282 -2 -26 66 88 -4 -162 -84 -76 -23 -27 -58 66 -26 134 41 -128 -48 -16 -42 -16 -162
2382a62M7K38j26n4Q2k7M1P1j09o6J32p0k52K76R5j55Q2N9k78K95n2j46n1J94
$$ -162 -115 123 -3 -57 25 -2 39 110 1 -65 67 -3 -255 21 116 -39 43 102 -176 119 67 -79 -130 64
2406F4K67k61o2n9J2LP7K9j06M8K08m72K21L5r7P9j95P8K21L3p9qp1o3P0n8K6
$$ 64 331 70 8 -51 -39 -36 41 70 -36 12 220 -252 -31 4 -93 -14 -209 -131 90 123 44 36 -35 -98 -28 -86 -60
2433f0J21p1p7J40N9j66J01p2Mk0J36k32K56k18K06j15OR4j32K64k61r4J92k4
$$ -60 61 -10 -87 53 112 -54 47 -25 -21 -41 95 -137 119 -99 107 -8 -2 92 -40 224 -37 -131 61 37
2457C7l4l6P8k1J04p1j91j8J50n4J34k21J13K3%MR3j59K6JJ20L8j28j67J09J14
$$ 37 3 -33 45 24 128 57 -134 -152 -2 -56 78 -143 -30 -7 -7 -3 90 -69 -43 -42 78 116 -12 -179 -70 44
2483D4m3j00J71j14P7o9O3L0k4J17j88m5J86j46J41j90M4J78n9r1j22K81j43%
$$ 44 1 -99 72 -42 35 -34 29 59 35 152 -36 -81 105 -41 100 -90 -46 132 73 -18 -140 141 -2 -2
2507bq5J85k35R3m5N2L0n1n7J00l3J31k45K04Q8j02J48q2k39N8J16J69j62Q2j60
$$ -2 -87 98 -137 -44 -89 -37 -7 -58 -115 -15 -48 83 -162 42 130 28 176 94 -145 -87 29 198 36 118 -42
2532d2O3j78K21k17K44J4lNj24J47j43J6J8k4q7J40k03Q3M1P0pk1j33J24R9K5
$$ -42 21 -157 64 -153 91 105 102 107 -17 130 -13 3 21 -3 -90 50 -153 -70 -29 41 34 13 -120 4 103 128
2558A28j13j0n7m7K21p5j37J31NR1j90K56o7j71K57j74Ok2l4N3QJ98l12J16p4
$$ 128 15 5 -52 -99 122 47 -90 41 46 137 -53 203 136 -35 222 48 54 32 -2 51 59 257 -55 61 -13
2583a3n9R2k91L36j50JQ2J03j06P8o9M8Q0k00J07N2j71J71o2j3L1L1j41O0l6J39
$$ -13 -72 20 -271 65 -85 -84 -2 101 -5 73 4 52 132 -68 39 91 -80 91 29 16 47 78 -63 -3 -39 100
2609A00k03QJ24q3k5J21J0N3r2p5K1j34J91o3R2J95k93j27K25j82J69o0j80L16
$$ 100 -103 -95 29 -54 -79 42 52 105 13 -62 -41 -175 16 -47 45 240 -53 -180 45 -137 32 -28 -208 108
2633A08j16pk1k5j03L61l46J07J53k70K32n8k1mj68L25j63Q8N7k27J20J5j52k0
$$ 108 -8 -15 -36 -61 -164 197 -149 -42 111 -159 73 15 -6 -10 -178 147 -16 72 129 -98 22 37 -115 -135
2657a35K26k60J95j77J76k3m8n5LK05p5O7k11J5P1r4K11j98J56m1L5pp7n8J83
$$ -135 91 -169 26 -151 25 2 -46 -101 -98 107 32 99 -112 -97 -26 -120 91 -107 49 8 43 36 -41 -99 84
2682H4j20Q5j43K60p8k7Nj79P8P4J7O2k35J28r8k5J01m6R2j24Q6n0Rj24J63n9
$$ 84 -36 49 -94 166 88 61 66 -113 -35 39 56 118 -117 11 -87 -112 -11 -57 35 -89 -3 -53 -44 -168 -5 -64
2708f4J17l6j28J72j82Q4K34l54J63K9J39k42j1J52p7J25j34J01j23J76j39r0
$$ -64 53 17 -111 61 -121 -37 197 -157 6 35 174 -68 -79 73 -4 121 -13 88 -35 141 2 -88
2730h8LJ52j63J19P2k36J62j06M3rp5K54k03O0J42p1k42J92o3k66L62m5q7J00
$$ -88 -85 67 -96 23 95 -141 21 -85 -42 -51 -126 128 -75 -15 127 56 -186 6 -57 -323 39 -6 -93 7
2754GJ58j20M3R5j1k01Qm6j8L4N9q4k7n4Q3J1J31N5j23J7k00J32J90k9j56o0J09
$$ 7 165 45 88 183 172 -29 -21 -67 -85 -51 8 -76 -103 -157 -74 -63 68 123 0 17 -183 -51 139 110 -46 -106 3
2781Cr2J49j10Q1N8Q1r0j05k0J35kk41K37j29N6n8r4J9N8M6K2j56J60P4op1J53
$$ 3 -89 60 -50 31 89 170 80 -25 -45 90 88 -153 84 -45 11 -47 -141 -122 -64 -18 4 -152 8 82 76 5 158
2808A58j02j26L6j02J09K6k6J08j01Nk21J65Q9j85J97o9jJ41j18k5j1K00k82M0
$$ 158 56 -70 -34 -136 -27 -1 -27 81 -20 -15 -236 -71 18 -167 30 -39 -40 101 -17 -42 -53 147 -135 -95
2832i5J43j23J3O6l3J27j67k3K16k30q6J50J26l9P1l4j33p7J22K4k0Q4k14J78
$$ -95 48 -75 -62 4 -29 98 -69 -92 124 -106 -192 -42 84 45 116 82 -51 -128 -6 18 -2 82 -132 46
2856D6j42M6J48k74J50n5pJ18j44R3j20K56j39P6j50K3N9j2o6J12j53J79Q3p5
$$ 46 -96 -50 98 -176 -26 -81 -88 30 -114 -21 -141 115 -24 52 -98 -75 -16 -28 -94 18 -135 44 127 52
2880E2k04L9K41k63J35K75j93J09k1k12KmqOk3J07j39J3Q1K6R6j77J82K5j18o9
$$ 52 -152 -113 128 -135 0 275 82 191 170 -42 -40 -44 -52 -46 -69 38 -101 -88 -7 19 115 -62 120 145 27 -42
2906d2l1q4R3J00L4p6Prn6r4q0J84l8J17j3J05r3lmO8k25J46k9M3m0n0L2K3j8
$$ -42 -73 -157 -64 36 70 -6 1 -8 -64 -158 -238 -54 -92 25 12 117 24 21 17 85 -140 6 -23 20 -20 -70 -38 -15 -33
2935c3L7PJ23j13r1J73j26J77k92L04j85q4J71k36J52k16K74m6rj18J81m2L4k4
$$ -33 4 11 134 21 -70 103 -23 154 -138 166 -19 -103 68 -168 -16 -232 42 -4 -13 -131 50 8 42 18
2959A8j83R0J38j19N2O6o7M3mj66K22m7p7J28j19LN2j12K7Q2p1M2Q2j15K95q2
$$ 18 -165 -75 63 -56 -4 62 -5 38 34 -132 90 43 -34 94 -25 -22 30 -82 -55 27 -44 -2 80 -35 260 178
2985A78k64KO4r1P9J19k9j72J45l4p5j4M2K21j61j6K07k6k22m4K2nP9M0M6m2p3
$$ 178 -86 -84 -20 -111 -32 87 58 -114 31 -3 -78 -92 -50 171 10 -6 201 175 -47 -91 -69 -74 5 45 91 49 -24
3012b4n9p9K6J54k31J24J25j75K53j88J71o4j5o9p9J18j54K4R2K02Jj41j86J74
$$ -24 -83 -162 -136 18 -213 -89 36 -139 114 -74 97 33 18 -51 -130 -12 -166 -142 -50 152 153 12 -174 0
3036@J76k37k8K21k14K71K8j36j53l8P4J35K4r6l5n1O3k3q7o3K32j5ro4k3P2J12
$$ 0 176 -61 -89 132 -82 189 217 81 -72 -110 -36 99 123 27 -8 -59 4 -19 -106 -169 63 48 39 -25 -48 24 136
3063A36j53KJ7n7K9l4L2QO4k3l7m5O9K3l0m4J5J12j58q5M9R1j43K80O3k09J0O0
$$ 136 -17 -15 2 -55 -26 -60 -28 -20 44 21 -16 -61 8 31 1 -43 -28 84 -74 -159 -110 -19 -162 118 181 -28 -18 42
3091D2J46j34o9j74J39Lk21L49j5Oj17M1O0m4j20j2J54n8Kk0j02N4lQ3K7J2o6
$$ 42 188 54 -15 -189 -50 -47 -268 81 66 72 -45 -4 56 12 -108 -120 34 -24 -22 -42 -144 -90 -93 -10 17 29 -37
3118c7k1P6L1M8r1K5p4r7L1J55P4n8N7k05O2K11J5o2k58K14r8M1qQ7L1k29j4k3
$$ -37 -58 18 49 97 6 31 -43 -140 -109 46 120 62 119 -86 -24 187 202 140 -118 96 -2 39 31 118 149 -80 -94 -117
3146a17J69J6j38J34M9k48K06k05K12j2k0l1j48J30J44j31j85J25J47M6k32Q5
$$ -117 52 68 -70 64 113 -135 71 -134 78 66 46 15 -133 -3 141 10 -175 -50 97 143 -89 -4
3168dM6r9n2J76j27k2k6l0N0K44j07j94K66j47j76L42L9j02k0j26P1j05oJ88q1
$$ -4 42 -57 -109 67 -60 -82 -108 -138 -88 156 49 -145 121 -26 -202 140 179 77 57 -69 2 -103 -109 79 -2
3193br1J3K14k97R7J41k19K41n6k3J65j54J58j24o9j41L00j11j6l4k7O6N7o8j38
$$ -2 -93 -80 134 -163 -66 75 -144 97 41 18 183 29 187 63 -6 -147 153 42 26 -8 -35 31 88 20 -118
3218a18J71k3o3m7J50oj92J67Jp6J3O8L7J7r9j9N0j64J89j46Q3J32K8j20l9m1
$$ -118 53 30 -33 -80 70 64 -128 39 40 -36 -23 45 82 99 0 -19 31 -133 56 -90 -7 125 153 33 -6 -47
3244d7k6N0Q5n9M6J32J41j90j37rO5k5R3L8m7j70J18k7l7J13ol2j8l0J22p9j37
$$ -47 -73 -23 62 3 49 181 322 132 -5 -14 51 26 119 157 110 -60 58 31 -6 107 101 69 51 21 143 64 -73
3271g3k4J47Ml9m8R2J2l3L3r0pN7j04K48j46Ln2J38j9J0jm6o3L1j07mJ70n6j60
$$ -73 -97 50 54 15 -33 59 71 38 71 -19 -26 31 -73 175 29 32 -20 118 99 109 108 62 -1 30 -77 -81 89 33 -127
3300a27J98o1p1P4J7r8J16p9k6J76q7R6j22j49J62r6P2j76L00N3j17j50L0J04
$$ -127 71 10 -61 13 30 -68 48 -31 -57 119 32 128 6 -143 19 -77 -5 -181 119 172 55 -95 -65 39
3324C9j19P3n8J34M9k61J52l1K3q0J23j01J57L2k49J6Q2j16N8M6L2m2J80q4q6
$$ 39 -80 -7 -65 69 118 -143 9 -22 1 -79 44 -57 100 132 -117 -101 -19 -135 -77 -31 1 -41 139 55 -31
3349c1J9j07K04j36J46j76l1M7j14M34k34j6J5k3J94j09j73P8Q5j17Q6M6q0j24
$$ -31 -12 -119 85 -51 95 -81 -112 -65 -179 255 21 5 20 -3 191 82 -91 -13 72 -45 41 87 7 -117
3373a17j65K89o2OM3L5L0j8M4r5j06P4J35q5k01J11L4P1P9j21K3L7n5Q8j28J00
$$ -117 -282 7 -55 -49 -6 29 59 41 85 -10 -116 -42 93 8 -193 -82 -48 23 102 -19 4 41 -14 74 -54 46
3399D6j27Q8j42J22J00k7J02k89N8M3j17P6O2N6j29k4N2P0j16oJ78q5j78J76q
$$ 46 -81 7 -135 -13 87 60 162 -127 -69 -26 -143 -67 -5 51 -78 -102 -50 20 -96 -102 76 -9 -187 -11 -19
3424a9J04qo0m0N7q2nj0l2K15j7r3j54J38P5j44n6R0q7L5J02o4k5K13N9j36n2
$$ -19 85 77 17 -23 34 -48 -53 -63 -95 120 103 10 -144 -6 69 -75 -131 -41 -128 -93 9 -55 -80 133 192 56 4
3451DK1j11j21J96m8J74j61J5j53L1J32P5J55l09P8j2j7K10j22J57k51K52j31
$$ 4 25 -86 -207 -11 -59 115 -46 -31 -184 -153 -21 54 209 -100 -22 -34 -51 159 37 194 -57 195 64
3474F4o4J31j75Q3n5l9J36l2p0N5j23J13q0n2J56j48J22l8M9n9K0O2o4K3Nj6p9
$$ 64 0 131 -44 39 -16 -55 81 49 -21 34 -89 24 -56 -108 48 -100 22 -16 33 -26 -6 56 -8 15 20 4 -75
3501g5pR7j54K31q2J5o3M7Lj42K84j62k1J76j72r6pK25j83J08M1j06M1kP3r7J1
$$ -75 -82 15 -139 92 10 25 -38 9 12 -130 154 -8 -29 147 -25 -121 -128 97 -86 22 63 -43 -2 -4 69 -28 -17
3528a7l3Q2p7J26j77N5N4l7Q7j3j09J76j00m7J31j44MP6j86J56J08j17J0j05M3
$$ -17 -50 32 -45 81 -96 -41 13 -24 63 50 -59 117 17 -30 101 -43 -39 37 -149 7 115 -2 8 -97 -54
3553e4j5k58L88j54M9P0j2J47j87j91J22P1J59j53J54Pj28j34K17j90Mk6K16M2
$$ -54 -69 -327 61 -93 -44 26 14 161 -26 -217 -95 -24 135 -18 136 143 15 -119 98 -92 -88 -114 102 144
3577A44j87om5J67o4o8M2r2K7J84k05J83o9K5O1j02l3j18K99k42J20L0J96l08
$$ 144 -43 -49 -94 73 9 -59 -17 -109 -82 102 -103 80 11 36 97 -5 -38 -156 143 -99 21 51 247 -61
3601f1n9J72j12J9R3q2P6j3k5j41J94m1j05O5j6M9k47L62k27Q9p1J9J46L9L8k12
$$ -61 -120 52 -60 -41 52 -30 46 33 8 -133 61 20 -85 -20 -36 13 -234 128 -99 -10 -81 -62 84 123 161 -51
3627e1j3J73j85J20q2k8J91j11QK7r9Mj41K17k03Q1nK41k69L5l5J39n5K88k55
$$ -51 -64 109 -76 44 -38 -66 125 14 22 49 -50 -46 -187 30 -173 -92 -97 144 -125 -90 -125 14 -41 247 -8
3652hK9O8j22p2j2Q5k5J87r2L6j32L2Q5K6j09L8K6L3r1J06j96L72l83R7j47K17
$$ -8 21 89 -33 -105 -117 -32 -57 130 38 74 -58 -26 59 85 -24 14 40 73 -18 88 -108 264 -119 -22 -169 48
3678D8Q3q2R3q0K7L9o6l7Mj17J15j7M1j73K89m8j88R2j6k9Lk4J82p8q5J05k56
$$ 48 131 49 142 62 89 128 62 25 29 -88 27 10 51 -122 167 119 -69 23 7 -22 -19 -43 139 61 -24 81 -175
3705a75J94j8J9K2l2K0m4m9P1PMl7j13P2K3J16o3p6J11j81O7R5p4L8n4R7k20J12
$$ -175 19 1 20 42 10 30 -14 -63 8 15 19 -18 -131 -59 -36 80 17 -59 52 -129 -62 33 -41 -3 -57 40 -180 -68
3733f8J24j31R2j30J09L9Q5j51J05j37N2P5p2Q4J1k92K82L5m7k4J6j21j36L29
$$ -68 56 -75 17 -113 -4 35 120 -31 74 -63 -11 64 -8 76 87 -205 77 112 65 41 57 -64 -200 129
3757A29j74m4j35L10j07K4J08j66L6K3m6JK4k00J77L1p1J53j5j3%j53K60j05m3
$$ 129 -45 -89 -224 86 -21 3 111 -55 -19 4 -42 -41 -17 -217 -40 -9 -80 73 58 45 45 -108 152 47 4
3782DR9j44QL6j63R7L1k12L46r0o4j5P2N6j11J43k53K3K80l62K56Q4m8p1rm3Q9
$$ 4 103 -41 -33 3 -160 -63 -32 -244 102 12 -52 -67 5 61 -50 93 -160 -137 143 -219 37 121 73 2 -7 -50 39
3809C9l3L2r3P7j11ln0J87j32QoO6j6N2m6P5j15N0L4P3j02j01Q4J17L1k54J80
$$ 39 6 38 -55 22 -89 -92 -142 45 -87 -79 -85 -19 -35 17 -29 46 -69 -19 15 88 -14 -115 -31 86 117 -137 43
3836D3P3j1k62J67l0J21j06j8O4R6j34M2pk5k05K02p6J3K4J7N1r8J37m6n5r9J63
$$ 43 116 105 -157 10 -20 101 -5 -23 41 137 3 45 38 13 -192 10 -66 -53 -29 -12 39 -59 78 32 -23 -122 41
3863D1P7p7r4M3L2R2j50L0r2J87k19K73j79P4M8j16N8j57K21k54o4R7O4K62k38
$$ 41 118 41 -53 -10 22 114 -36 -6 -98 89 -130 143 -36 38 86 -30 28 -129 92 -162 -226 -129 -65 197 -41
3888d1M3j02j2K9R3j28J26J05j06PJ67k95pP8M6J02k81J03J04K4M9kj89Pl1K18
$$ -41 2 -100 -112 -83 10 -118 8 113 7 14 181 -114 -121 -43 3 105 -176 -73 31 55 104 102 -87 -80 -111 107
3914A07k62J13n6l9J59n7j13J45J28l0q6n4O7j40K0M9l4J06n0j9K35j24j41O8
$$ 107 -155 -42 -98 -137 22 -35 -148 -3 125 95 9 -45 22 -118 -98 -49 -83 23 -27 -46 189 65 -76 -8
3938hJ1n0R2m3o3Q9k6j1M9j23Nm2J47J9N2k79J86n6RJ6j81L36p9q3K47l68J24
$$ -8 3 -47 45 2 -61 28 2 -9 40 -83 -78 -120 27 46 98 -181 5 -51 -42 -26 -207 129 50 -33 214 -154 -30
3965c0nJ0k0o2K63j92QJ3L10k43r3r7K01k42J72J70k83M5K20m8k09j4J28N1m0
$$ -30 -35 -25 -45 -107 156 -36 -28 -15 295 52 -41 -138 63 -179 -7 163 -120 -75 145 97 -112 -126 2 53 13
3990A3Mk1Q2L3j04J75j57Q3oj62K20k74J97j4j84J79j52O0q1J21r7Q2k0J8L5j28
$$ 13 17 -4 78 111 7 182 25 108 102 -60 160 -114 83 69 -115 64 -88 -28 -109 12 -85 -3 -23 -5 30 -98
4016i8P1O1rJ37r0m0O2k83K40O8q6J5P4n5q7Q6%m9o9k64L71m1j11L69j48j40L2
$$ -98 -27 34 25 162 72 32 94 -189 51 119 33 48 122 67 -20 66 66 17 -52 -316 55 14 -97 272 124 -16 16
4043A6lm5J85o3k9j9j08n6N7j30L50p4M9j78R4j25K29k40J46j31J19j11o4J22
$$ 16 13 -32 153 90 61 42 -66 -122 -65 -195 155 81 130 -48 46 -79 150 -90 56 -75 44 -67 -131 -9
4067iM5L2p4j68K73j58J25l8j30K42k44K99j62k27J72op6L09k61K28l11R6R4m6
$$ -9 36 68 -6 -174 99 -59 66 28 -102 140 -104 195 33 -194 -22 -28 -104 205 -56 172 -139 -43 51 5
4091Er4K33k62L02k45N8Q3k41J07p4Q3l5k1J94k17mJ41r3l4J17M4j06Q0J5r3R7
$$ 5 -89 144 -118 184 -61 -3 80 -161 -54 -128 -45 -80 -101 93 -124 -128 13 -80 -114 3 47 -59 21 36 -57 40
4117D0j07L3J49j15J45k22k8j0J46j95K04j14%J25M1j23j63J57R7pk21J62l6P3
$$ 40 -67 -34 115 0 145 -77 -105 -115 31 -164 40 -74 -74 51 92 -31 -194 -37 60 53 -168 -6 -42 31
4141C1J23j09l3J0Q3q8J04k05J4Q0o4J1J31j58J0K1j69K38L3o2j5m2P1M5J36j82
$$ 31 154 45 12 22 105 17 121 -84 -70 10 -54 -43 88 -70 -60 -39 -208 30 63 1 -14 -56 15 60 196 14
4167A4j33J93r1J27j48o1J72j52L7o9J16m2j12J60r4Q5N7r6N6j49K00p2J06j7
$$ 14 -119 74 -17 110 -38 -99 73 -79 -42 -111 5 -37 -149 11 -83 2 59 -37 19 -130 70 -2 104 87
4191H7p1J8j24O5K08l73K65j04n2Pj04K73j24K2j2O0J1Q4m9j19Q4p7%m9J21j30
$$ 87 16 34 -90 -25 183 -190 75 -29 -81 -74 -178 95 -29 -7 -19 41 52 136 87 -32 52 -25 -25 -74 47 -83
4217h3p6J13J79j40R7k9j49J29r1J42j82Q8O8j33n7J93q9L5J01q5p5m0J23Qn1
$$ -83 -159 -46 133 -7 90 61 -88 41 -50 92 -90 -2 66 -67 -124 69 -20 15 116 31 -44 -84 39 47 -4
4242dj44Q6J99l0j22J79j35m2r2K9R7N9j99J10oj41R3P4k21N1K02r2J41q4N7K2
$$ -4 -148 -62 137 107 -15 164 29 -13 -105 -76 21 80 -119 -9 -15 -156 -63 11 -210 -159 43 -49 92 8 65 87
4268H7m6P9k59J33Q1P4L1Rj89j14J52J04j78j19L56l66J82lj36O7J18k28J66Q1
$$ 87 41 120 -139 -6 75 149 180 189 0 -114 38 142 -36 -155 201 -165 17 14 -122 -55 63 -165 1 82
4292H2k2k72J97K25k90j3K26j61k3q6J56J06j81M5N5R2j45qj1j11K27j1PL4n6
$$ 82 60 -212 -15 210 -80 -93 133 -28 -51 -137 19 125 -56 -11 44 136 -9 -17 -28 -139 88 77 84 118 62
4317F2N4l3Q9j41j98J37J53j61M6O5j42q5L29k20J6j5L18l42qq0L05j86P5J6r6
$$ 62 116 83 172 31 -167 -30 123 -38 8 73 -69 -154 175 -45 -29 -44 274 -68 -76 -156 149 -37 38 54 -42
4342d2l3J0J32j31J52k59J10J43m1m4j07P3J71m3j38j00K42l7l8J17m4n0N6m3
$$ -42 -75 -65 67 -64 88 -171 -61 82 41 -3 -110 -37 134 91 -47 -147 95 58 20 137 93 43 99 56
4366E6j02j4J32j46j1J95j76J64M6p3j37K0o2O6Q8j44L6j6Q6O9j71J40M3j90J60
$$ 56 -46 -60 72 -74 -85 110 -66 98 144 71 -66 -46 -108 -42 46 -98 -62 -78 8 77 -94 46 89 -101 59
4391E9J31j11J8o5jM0m7Q6J8j98N5N6Q1m0p6Q3N5k33P1j19K64J4k6J69l85m1J05
$$ 59 190 79 97 32 31 71 24 110 128 -70 -15 41 122 82 6 89 144 -89 -18 -137 127 141 115 284 -101 -142 -37
4418c7N4k0p1N2K78m24K05j31Q7K4J7k54P9j7J41M8J5r4L9J9oJ05k14l9J0R8n2
$$ -37 17 -3 -74 -22 256 -168 37 -94 -7 17 34 -220 -141 -158 -17 31 46 -48 -9 10 4 109 -105 -144 -134 -36 -88
4445h8J78qKj75O7m1m2K29o6j19K60k64J7J36j67Q1o8j7J08k05J09J61j06k5J36
$$ -88 90 82 84 -91 -24 -65 -107 122 56 -63 197 -67 -50 86 -81 0 -68 -85 23 -182 -73 88 -18 -43 93
4470I3k05J31JK8J19j97j9l9L6L2r5K24n4o8j84R3L22k07J38P1j70J3l18M13j53
$$ 93 -112 19 20 48 167 -30 -49 -88 -52 -20 -115 109 55 -13 -197 -104 218 11 149 220 50 63 -255 158 5
4495EJ85j25p4j88M70k26Jj59K17j49J34j2Rj82j44K64j51K86jk04K39l19M6l2
$$ 5 190 65 -9 -197 273 47 48 -111 106 -43 91 79 88 -94 -238 26 -125 161 160 -44 195 -124 -78 -110
4519a10pM6j21n8J04K73Qj23R2n7j5n6J06J05l39L02j10J16m4Pj87j72J71N1Q0
$$ -110 -117 -71 -192 -250 -146 127 135 12 104 47 32 -24 82 187 -152 150 40 156 112 119 -68 -240 -69 -18 62
4544F2p4J10j94L40j64j11K41l50L76l95K28j00p5J99p5M9j05j09J78j00j3J22
$$ 62 -12 98 -96 244 80 -31 210 -140 236 -159 69 -31 -106 93 18 67 -38 -147 31 -69 -82 40
4566D0L1j00O1n4L1j21K65k19J75l37M01m40J15J82L28m40J01j21J84r7O9J1O1
$$ 40 71 -29 32 -22 9 -112 153 -66 109 -228 173 -267 -152 30 358 -82 19 -102 82 -15 54 65 126
4589A26L6m34M03j83J31o3J28r5o7Oj52K40K6o4r9K78j7j09j45P7j4j97J33R4
$$ 126 162 -272 131 -52 79 16 144 49 -18 -12 -164 76 102 38 -61 217 200 91 -54 23 9 -188 -55 39
4613C9p7j86J11K45j11o0Q6P6j43J27j15J26j73K0L4r6J23j03JK29j64n7L0M9
$$ 39 -38 -224 -113 132 21 -39 47 123 -20 107 -8 118 -55 -35 -1 -97 26 -77 -76 153 -11 -68 -38 11
4637A1L6j43J71k93L55j74o6L15k46l5m4K57j26K5r8J16j89J84j45K09l02K5K41
$$ 11 47 -96 75 -218 137 -37 -103 212 -34 -69 -113 144 18 43 -55 61 -128 56 -89 120 -182 -157 84
4660H4p8p1M7J37j92m1J12O2j36O2Q2o4qj39J47j4K53k40R3q8j57J32OJ01J12
$$ 84 6 -65 -18 119 -73 -114 -2 60 -76 -14 68 4 -4 -143 4 -10 243 3 96 8 -149 -17 -11 90 202
4685B02k27L6k1r2L0K1m1l9K16l2j4m0k7L9o7J3%J14j6j00o3K97j70O0N7j57Q8
$$ 202 -25 11 -10 -102 -72 -51 -92 -131 85 53 39 -1 -28 11 -56 -43 -43 71 55 -45 -108 189 19 79 136 -21 67
4712F7J7r4K7j10lK29m0k96J57N5r1Kl2J54Q0k72Q8O0R3k79J28j57L30r8l73M12
$$ 67 84 -10 17 -93 -96 133 93 -203 -46 9 -82 -80 -112 42 122 -150 -62 -2 91 -188 -60 -217 113 15 -358 54
4738E4j14L7K29k65R0J30k24j21O1K72k12j21J95j07M5J13k41K28j28K10j41J44
$$ 54 -60 -23 206 -59 31 161 -63 -184 -123 149 -63 -184 11 -96 -51 62 -179 49 -79 131 -10 134
4760A34m8k05N0P2k7M5m5j48K40j43j8J56j7j64L0l5Q3J57k16J88j09N5j24K69
$$ 134 86 -119 -69 3 -24 21 -24 -172 68 -75 -93 63 46 -118 -88 -123 -40 117 -99 89 -20 35 -89 180
4784A80k32R6k0j1M8j96K38k55J23l8j1O4m9L2M9k13Q1P0M1K2j31J56kL2j20p1
$$ 180 -52 44 24 13 61 -135 103 -152 -29 -67 -78 -14 -63 -31 18 -195 -114 -44 -3 19 -112 44 42 74 -46 -117
4810a17NP9J21m1k23K92k08O1o8J77j28R9j24J47n4mN2J4j65Q0J70m8r5k64L73
$$ -117 -112 -33 88 47 -176 116 -92 -31 -99 78 -50 49 -75 72 18 14 66 80 -85 -5 165 117 22 -242 131
4835A31l04L06k1j26n8l9J20pj72M8j0K15N1q7j0o8j2N7j1Q1j40J16J27k25J93
$$ 131 -173 133 112 -14 -72 -111 9 2 -170 -122 -132 83 134 47 37 -31 -43 14 3 84 -56 60 187 -38 155
4860A55n0k12K49n8k53J92P1q7K02l93J48J71p5J16k46J70j65J23k34k8J54J02
$$ 155 105 -107 142 84 -169 23 94 7 209 -184 -36 135 60 176 -70 100 -65 58 -176 -204 -50 52
4882E2m4mL9J48k97J82L1P6j64q3j75J73Pj19J02l5N08l89L5J5j14J02j14P3l29
$$ 52 8 4 43 191 -106 76 107 183 19 -64 -239 -66 -59 -178 -76 -111 397 8 43 58 -56 46 -68 5 -324
4907c24Q1O10n9j73j31K83k47R3J83l78J28O7J77k63l19N56k00l96M88j16p4M94
$$ -324 -243 367 308 135 4 287 40 133 316 -62 66 133 310 47 -272 284 84 -312 176 60 -14 480
4929D80j4m93j08K49j14J45L64r10M75k72K17J07l03k59O10r4j28j04J46J23J16
$$ 480 466 -27 -135 114 0 145 509 -401 74 -198 19 126 -177 -436 174 80 -48 -152 -6 117 233
4950B33j99q8L10l86J58p5mJ35l67K11lk29O9L7J52J74k52p0K62J93k39j60J98
$$ 233 34 -54 256 -130 28 -47 -51 84 -283 -72 -75 -304 -235 -198 -46 128 -124 -194 68 261 22 -138 60
4973F0k0m36P1M22j82J07m8J3Om0O1qj46J61j92J72J43j65R2N8k06P3l2l8M4J32
$$ 60 40 -396 -325 97 -85 22 -26 -13 -7 -47 14 6 -140 21 -171 1 144 -21 71 129 -77 -4 -36 -74 -30 102
4999A02j98N1j48K60j90J3R3N7q0r3N1j49K33q6Q3R8J88l37J9l9K00J4j0k38L6
$$ 102 -96 -45 -193 67 -123 -110 -17 40 -40 -133 -82 -231 2 -84 -1 97 285 -52 -33 -72 128 142 132 -106 -70
5024g0J58n3O6k61J0J31J52j42J6j84J75L6l5k6q6n9K41k04K50j42m9L26k34K9
$$ -70 88 35 101 -160 -150 -19 133 -9 7 -177 -2 34 -1 -27 -113 -172 69 -135 115 -27 -76 250 16 45
5048D5L1p1K2R3o9L9j41J12j27K8L9j11p2K08k8p3J65p3J77l03K36j9j37M8J20
$$ 45 76 5 27 120 51 90 -51 61 -66 -38 1 -110 -182 26 -2 -75 90 17 194 -109 127 108 -29 19 139
5073A39j81j04Q7j3M4J35j65O6RJ09k46N9L2J78j11qJ29k51O2nJ93K8l16J40J26
$$ 139 -42 -146 -59 -72 -28 107 -58 8 17 126 -120 -61 -29 149 38 30 159 -92 -30 -35 158 186 -130 10 136
5098A36k00J57j46r2P7M1J47j59k3K0K2o1J83J16j85K3l0K4p0R8n3m4J32j18J44
$$ 136 -64 93 -53 -145 -68 -27 120 -39 -62 -42 -20 -81 102 218 33 56 26 50 -20 78 25 -19 113 -5 139
5123A39Jj20L7j55K5J58k72L19j22k57L60k16J25j12K33r0n7q1n3J17J30l16K10
$$ 139 140 20 57 -98 -73 85 -187 132 10 -247 113 -103 22 -90 143 53 -4 -85 -138 -21 109 -207 3
5146Cj14J24j44K31q3l9l5O1P4j79P9O1J09o3l4j94K15N7l03K10N6p9j12P9k5
$$ 3 -111 13 -131 100 17 -22 -57 4 78 -101 -22 39 148 85 51 -143 72 129 -174 36 92 13 -99 -20 -45
5171d5J29q8R9k0j60J99k01J39L7j03j28K37j19L9j27j3j3K22j81N6Q5l4r0K52
$$ -45 84 -4 95 75 -85 114 -87 52 89 -14 -142 95 -24 15 -112 -125 -138 84 -97 -41 44 10 -80 172
5195A72m21M13k07O8J21k18R3Q5j05k20J92K60j52l1j47K01j9k78J71Q6j2k38
$$ 172 -249 164 -43 25 146 -72 21 106 1 -219 -27 233 81 50 -97 104 85 -193 -22 64 52 -186
5217a86J51q2P5k5J85j00J27j39L9q6O6lL1p4j21J40R0q4N3M0j95J95j80K91l23
$$ -186 -35 -117 -42 -67 118 18 145 6 45 -41 25 22 53 -21 -142 -2 88 4 57 97 -98 97 -83 208 -115
5242a15KJ05o3J50j43P6l0K1o1N6J00o4r8J34np0j17K18j04L0n3n6K25j30j2P7
$$ -115 -113 -8 -71 79 -64 12 -18 3 -58 -2 98 34 -64 70 65 -5 -122 96 -8 22 -31 -87 138 8 -4 73
5268G3j57K03l30L10k17J29k16K27q1K22n5jk03J50P2j68J05r2J93n4k09K05P4
$$ 73 -84 119 -211 99 -118 11 -205 22 -59 163 108 107 -96 54 126 -42 63 -29 164 110 -99 106 180
5291A80O3k31q2J74k00J00r4O2Mk2r9n5K96j79K40Pr6j0p6J87k80K7P3n3n4P6
$$ 180 243 12 -70 104 -96 4 -90 -28 -24 -46 -145 -200 96 -83 157 164 68 58 -18 169 -111 -84 -11 -64 -118 -42
5317d2j31K34j83O8j2r7K85k59N3j04J79l6j7j8K37j29l7N6j24J12k55L10k07
$$ -42 -173 61 -122 -54 -66 -163 122 -137 -84 -188 -9 -45 -62 -80 157 28 -9 47 -77 35 -220 90 -117
5340a17Q8J12j5q0Q6j11O1M2q3o3J51J1j40O2jk00J61J71k34J09N0lj6QJ18r7
$$ -117 -29 83 68 -12 74 -37 24 66 -17 -80 71 82 -58 4 3 -197 -36 135 -99 10 60 57 41 49 167 70
5366G0k5P4k21J06l9q4J17j0o2L2K11k13J21r6l6Q8j48Q3O0J36m5p9j3PNj40L00
$$ 70 45 119 -102 4 -35 -119 -2 -12 -74 -42 169 -44 77 -19 -55 33 -115 -32 28 164 119 40 27 34 39 -101 199
5393A99n6k47K01n2J4QK8m8r0K2M0j7m1QL7j63Q5k2r7K10j49J32j5j14K68k78
$$ 199 143 -104 97 45 59 67 95 47 -43 -21 19 2 -39 -31 6 -157 -72 -94 -191 19 -130 2 -13 -127 141 -137
5419a37J04J28j85kQ1k6J07j37Q5j2l7N4p3%m2J44kl0j07k4P3N4lmL7nL1p7m5
$$ -137 -33 95 -90 -92 -11 -37 70 -67 18 6 -31 23 -50 -50 -92 52 50 20 -87 -111 -38 16 13 9 46 41 72 -5 -50
5448e0L2J72k97P8J31k83K63o4N4j2l5k9J24j47P7j24O8K37k44l1J28l1k6n7m4
$$ -50 -18 154 -143 -65 66 -217 46 -18 36 24 -11 -40 84 -63 14 -110 -42 195 -49 -80 48 17 -9 -66 -110
5473a10J14J86l24J7R9j74K17J7k6j5n5K7P9j01M8J11k5k23J41j85K30J18k6j27
$$ -110 4 190 -134 -117 -18 -192 25 42 16 1 -54 -27 52 -49 -1 110 85 -138 3 -182 48 166 140 13
5497A3P0j26L3P1L2J1K9j79J49k01R0m6J10q2O9Lj30K7J71o9k32K79j71J19o0
$$ 13 83 -43 -10 61 93 104 133 -46 103 -98 -8 -54 56 -26 43 46 -84 -57 114 45 -187 92 -79 40 -20
5522b0R3J34k61n4K23k56K55J01k52K1P1j02R9Q6j91J79j45M6Q2o3Kj9m9K32j93
$$ -20 73 207 -54 -108 115 -141 114 215 -37 -16 55 -47 52 138 -53 126 -19 27 109 46 48 29 -20 212 19
5547A9r0J7m8K68r2r4Q6p9J11J6j65j02K17j61J45K1K5j02J04j10J90mj22Q7j16
$$ 19 -71 -54 -102 166 74 -20 66 -13 98 114 -51 -153 64 -97 48 69 94 -8 96 -14 176 172 50 137 21
5572B1N5j06J13k8qP6nk0o2N5j45Q5j69JQ3J1Q2R9k6r8j70O5QK30j69n0J59j73
$$ 21 76 -30 83 55 47 123 118 98 36 91 -54 31 -138 -137 -54 -43 39 138 112 14 -156 -91 -83 147 -22 -72 87 -86
5600h6J58n6j21K9q0N5N0j0L9O3j51P7J38j74K19j26L4k41J90J09m1mq1oMj6N5
$$ -86 72 16 -105 -76 -156 -101 -51 -61 -22 41 -110 -33 105 -69 150 24 58 -183 7 116 75 71 -10 -16 -12 -28 27
5627B7jO5j61J06n3j6R6p1k6Pj34Q7j01J26O0Nr8J56j30J36j52J40n4J06n9N3
$$ 27 26 91 -70 36 -17 -33 63 -8 -34 -27 -161 -74 -175 -49 11 16 -82 74 -56 80 -72 68 14 120 61 114
5653A14j3j54j0n5J66k58K16K06k82j30L35j97N8Nj15L51j13JPn9n9n4J92j44
$$ 114 101 -53 -63 -118 48 -210 6 212 -70 -200 135 -62 -4 1 -114 237 124 125 132 73 14 -40 152 8
5677HL1j50J24k9m2J45q7J13j18O1m4k1l4m4J03j10k1J74j31J69j75J03j33K07
$$ 8 39 -111 13 -16 -58 87 0 113 -5 56 12 -9 -43 -87 16 -94 -115 59 -72 97 -78 25 -108 99
5701I9j69N3q9P1j49K65j07J84Ok17K54j41KK9N4m8q0j8j15LJ27r7J42j00L4j15
$$ 99 -70 -17 -106 -35 -184 81 -26 158 164 -53 201 60 62 91 145 97 17 -1 -116 -113 14 -83 59 -41 -7 -122
5727a22L41j95M4J70k01q1O3j3j9K2PJ17J2j68j3m6JJ81j70K1M4O7j0p6P2j00
$$ -122 219 24 68 238 37 -44 19 6 -13 9 16 133 145 -23 -36 -82 -81 100 -70 -49 -5 62 52 -24 48 -52
5753e2l9P9Q2j43m0J95l6j09J46k24K00l09L01j99J51J2N5j44j5P9J50k43J35
$$ -52 -91 -12 70 -73 -113 82 46 -63 83 -141 59 -250 51 -148 3 15 70 -74 -89 -10 140 -103 32
5776C2m8l1J28j09q0k7K34l8r3P7K7k71L24j40J11k79K57j84J36op6j48K63j41
$$ 32 -16 -47 81 -28 -108 -135 99 61 -32 45 72 -199 125 -15 96 -183 74 -110 26 20 -56 -204 59 -82
5800h2O6r7K68k40L8j62K37J33p3o8j08K24j64J2N5n2q8J48n7n4j20K47k0l6k5
$$ -82 -16 -113 155 -85 -47 -209 28 161 88 20 -88 136 -28 -16 39 -13 -101 47 -10 -64 -184 63 43 7 -18
5825a8N4j58n2Q0MN0J53j65r9J58K6r4JQ8j2k7J31j08J58p5k3n0o9K8J82o6N3
$$ -18 36 -122 -174 -94 -90 -40 113 -52 -151 7 33 -61 -60 28 16 -11 120 12 170 95 72 22 -47 -19 163 97 150
5852A50j86L5L3n0K0K9K2j15J73m4j60J01Kr9RK20j94OR2j45N9J80j94J00j21
$$ 150 -36 -1 32 -18 2 31 53 -62 111 67 -93 8 10 -89 -80 140 -54 -48 44 -101 -42 138 -56 44 -77
5877g7L0N6Q6r8K70k61Q7m9N1%k07J59kj85K93Q4l00J66r2L4j40Q9l0Q3k64L31
$$ -77 -47 9 95 -3 267 6 93 44 95 95 -112 47 45 -140 153 237 -63 103 11 45 -95 -6 -36 47 -217 114
5903A14j77M4J70j90L9o3K20p3l20L34k13K66l4j58R2j2j13K4J25j49J40j20j77
$$ 114 -63 -19 151 -39 0 -63 157 84 -236 98 -115 151 117 -41 51 39 -74 -50 75 -74 66 -54 -231
5926b31J23J1J00j00N7j0L2J38p6k3k2J71l19j0J87j1k9N3j35L2j9J77j41K12
$$ -231 -108 -97 3 -97 -40 -50 -18 120 44 21 -1 170 -149 -159 28 17 -12 41 -94 -62 -81 96 -45 167
5950A67k80M5K27j80L3J3j39J60j48L34j54j68K06k1n4M9j74K8J35r0Nj14L24
$$ 167 -113 -68 159 -21 12 25 -114 46 -102 232 78 -90 116 95 41 90 -84 -56 79 -11 -6 -120 204
5973B04j44q5M9jj07P3J9j95J48M0j18J62j42J14k3j05Q8Ok16L21M1q3Q9k28M7
$$ 204 60 -25 24 23 -84 -11 8 -187 -39 1 -117 45 -97 17 -6 -111 -23 -17 -233 88 129 46 135 -93 -46
5998d6j5mJ53j19M4qn0O5J71q9j88l3J52N9k1j81RJ71j12n3K4Q5p8NR6j5k5j49
$$ -46 -61 -65 88 -31 13 5 -45 20 191 102 -86 -119 33 92 71 -110 -101 70 -42 -95 -71 14 -64 -59 37 22 -3 -152
6026a52J50j0N1M4j13KM1m3J10k8j18P1J39j54p3M0J78j56J22o1n6j4J32k0j57
$$ -152 -2 -12 39 83 -30 -28 13 -30 80 52 -66 5 144 -10 -83 -43 135 -21 101 40 -16 -30 102 82 -75
6051g5J41Lq9j20K76j18j14K7J27J45j55p0RQ7j37J56r8m4p7J92j71o0J41n4K2
$$ -75 66 69 -20 -140 136 18 -96 -69 58 203 48 -22 -13 74 -63 93 -5 -49 -126 66 -105 -165 -24 -78 -56
6076e6r1L74k06M3J6k30J26J6l1Lo7j34J59J67j3r0M0j68K21o7j16J41j27K03
$$ -56 -147 227 21 64 80 -150 -24 -8 -39 -36 -103 -237 -78 89 76 -14 26 -142 79 12 -104 37 -90 113
6100A13m3n6J05j86j24K20n3J05OJ73l92J06l5K55k53J02j29R0L7j43j23P9K03
$$ 113 70 14 119 -67 -191 29 -24 81 87 260 -132 -26 -61 194 -59 43 -86 4 41 -102 -225 -146 57
6123E7O5k32k2J91M7l5J02r3n4Q9k58R8P9P0Mo0j12j6L5M1LO7L8j74K7Q6M8j74
$$ 57 122 -110 -132 59 106 71 173 80 26 115 -143 -45 34 104 108 48 -64 -80 -45 -4 -1 66 104 -70 -43 43 91 -83
6151h3K88j98j78L3l3J55mP3j43m8n7L82j54k02J83p9J57j84j3o8PK50j93J15
$$ -83 205 7 -171 -138 -171 -16 -20 53 -90 -138 -195 187 33 -169 14 -65 92 -92 -105 -173 -166 84 -109 6
6175Fm1J79j43O5j93K73j25nj69k9K8K33Mq1q8J3p7L40k90K5L0k2J71n8Q6j30
$$ 6 -35 144 1 66 -127 146 21 16 -153 -182 -154 79 83 2 -86 -73 -150 190 -100 -75 -45 -67 104 46 132 2
6201Bj84K42j10J35l8k75K15Q5l8k08L10k48J79j41O7K5r9K1O2m0K13l06n0K07
$$ 2 -182 60 -50 85 47 -228 -13 72 34 -174 136 -112 67 -74 -7 18 -81 -60 2 -38 175 -131 -181 26
6225B6J34j83j17Q2Q7m4M9j70%K24m3p8m7K31k24ojR5o0%n8J36p1N7m0o2R2j91
$$ 26 160 -23 -140 -58 29 -15 34 -136 -136 88 45 -33 -80 151 -73 -79 -80 15 -45 -45 -103 33 -38 19 -21 -83 9 -182
$$ [...]
8191D1
##END NTUPLES=NMR FID
##END=
