##TITLE=1H_DEP0510
 
 8 sc, 
 6.10.2023
##JCAMPDX= 6.0         $$ Bruker NMR JCAMP-DX V2.0
##DATA TYPE= NMR FID
##DATA CLASS= NTUPLES
##ORIGIN= UXNMR, Bruker Analytische Messtechnik GmbH
##OWNER= root
$$ XWIN-NMR		Version 3.5
$$ Fri Oct  6 13:54:44 2023 Russian Standard Time (UT+4h)  she@DPX200
##.OBSERVE FREQUENCY= 200.13135
##.OBSERVE NUCLEUS= ^1H
##.DELAY= (6, 6)
##.ACQUISITION MODE= SIMULTANEOUS
##.ACQUISITION SCHEME= undefined
##.AVERAGES= 8
##.DIGITISER RES= 18
##SPECTROMETER/DATA SYSTEM= spect
##.PULSE SEQUENCE= zg30
##.SOLVENT NAME= DMF
##.SHIFT REFERENCE= (INTERNAL, DMF, 0, 15.7039)
##AUDIT TRAIL= $$ (NUMBER, WHEN, WHO, WHERE, WHAT)
$$ ##TITLE= Audit trail, XWIN-NMR		Version 3.5
$$ ##JCAMPDX= 5.01
$$ ##ORIGIN= Bruker BioSpin GmbH
$$ ##OWNER= she
$$ F:/spectra/data/she/nmr/H-F/1/audita.txt
$$ ##AUDIT TRAIL=  $$ (NUMBER, WHEN, WHO, WHERE, WHAT)
(   1,<2023-10-06 13:53:18.96 +0400>,<she>,<DPX200>,
      <created by zg, POWCHK disabled, PULCHK disabled
       configuration hash MD5:
       00 E9 B6 7A A2 85 ED C7 34 08 36 98 17 FE 4E 26
       data hash MD5: 16K
       C8 80 B1 13 DA 5A 80 05 5C 9B 98 A7 98 D5 AE 7F>)
$$ ##END=
$$ 
$$ hash MD5
$$ D9 DE 56 33 4B BB 71 16 6C 45 C5 E8 C8 8B 3B 5E
##$RELAX= 
##$RELAX= 
##$RELAX= 
##$RELAX= 
##$RELAX= 
##$RELAX= 
$$ Bruker specific parameters
$$ --------------------------
##$DU= <F:/spectra>
##$EXPNO= 1
##$NAME= <H-F>
##$PROCNO= 1
##$TYPE= <nmr>
##$USER= <she>
##$AMP= (0..31)
100 100 100 100 100 100 100 100 100 100 100 100 100 100 100 100 100 100 
100 100 100 100 100 100 100 100 100 100 100 100 100 100 
##$AQSEQ= 0
##$AQ_mod= 1
##$AUNM= <au_zg>
##$AUTOPOS= <>
##$BF1= 200.13
##$BF2= 200.13
##$BF3= 200.13
##$BF4= 200.13
##$BF5= 200.13
##$BF6= 200.13
##$BF7= 200.13
##$BF8= 200.13
##$BYTORDA= 1
##$CFDGTYP= 0
##$CFRGTYP= 5
##$CHEMSTR= <none>
##$CNST= (0..31)
1 1 145 1 1 1 1 1 1 1 1 1 1 1 1 1 1 1 1 1 1 1 1 1 1 1 1 1 1 1 1 1 
##$CPDPRG= <>
##$CPDPRG1= <>
##$CPDPRG2= <>
##$CPDPRG3= <>
##$CPDPRG4= <mlev>
##$CPDPRG5= <mlev>
##$CPDPRG6= <mlev>
##$CPDPRG7= <mlev>
##$CPDPRG8= <mlev>
##$CPDPRGB= <>
##$CPDPRGT= <>
##$D= (0..31)
0 1.2 0 0 0 0 0 0 0 0.06 0 0.03 0 0 0 0 0.0002 0 0 0 0 0 0 0 0 0 0 0 0 
0 0 0 
##$DATE= 1696585998
##$DBL= (0..7)
120 120 120 120 120 120 120 120 
##$DBP= (0..7)
150 150 150 150 150 150 150 150 
##$DBP07= 0
##$DBPNAM0= <>
##$DBPNAM1= <>
##$DBPNAM2= <>
##$DBPNAM3= <>
##$DBPNAM4= <>
##$DBPNAM5= <>
##$DBPNAM6= <>
##$DBPNAM7= <>
##$DBPOAL= (0..7)
0.5 0.5 0.5 0.5 0.5 0.5 0.5 0.5 
##$DBPOFFS= (0..7)
0 0 0 0 0 0 0 0 
##$DE= 6
##$DECBNUC= <off>
##$DECIM= 32
##$DECNUC= <off>
##$DECSTAT= 4
##$DIGMOD= 1
##$DIGTYP= 9
##$DL= (0..7)
0 120 120 120 120 120 120 120 
##$DP= (0..7)
150 150 150 150 150 150 150 150 
##$DP07= 0
##$DPNAME0= <>
##$DPNAME1= <>
##$DPNAME2= <>
##$DPNAME3= <>
##$DPNAME4= <>
##$DPNAME5= <>
##$DPNAME6= <>
##$DPNAME7= <>
##$DPOAL= (0..7)
0.5 0.5 0.5 0.5 0.5 0.5 0.5 0.5 
##$DPOFFS= (0..7)
0 0 0 0 0 0 0 0 
##$DQDMODE= 0
##$DR= 18
##$DS= 0
##$DSLIST= <SSSSSSSSSSSSSSS>
##$DSPFIRM= 0
$$ [...]
##$SUBNAM2= <"">
##$SUBNAM3= <"">
##$SUBNAM4= <"">
##$SUBNAM5= <"">
##$SUBNAM6= <"">
##$SUBNAM7= <"">
##$SUBNAM8= <"">
##$SUBNAM9= <"">
##$SW= 18.05172834244
##$SWIBOX= (0..15)
0 0 2 0 0 0 0 0 0 0 0 0 0 0 0 0 
##$SW_h= 3612.71676300578
##$TD= 16384
##$TD0= 1
##$TE= 0
##$TE2= 300
##$TE3= 300
##$TEG= 300
##$TL= (0..7)
0 120 120 120 120 120 120 120 
##$TP= (0..7)
150 150 150 150 150 150 150 150 
##$TP07= 0
##$TPNAME0= <>
##$TPNAME1= <>
##$TPNAME2= <>
##$TPNAME3= <>
##$TPNAME4= <>
##$TPNAME5= <>
##$TPNAME6= <>
##$TPNAME7= <>
##$TPOAL= (0..7)
0.5 0.5 0.5 0.5 0.5 0.5 0.5 0.5 
##$TPOFFS= (0..7)
0 0 0 0 0 0 0 0 
##$TUNHIN= 0
##$TUNHOUT= 0
##$TUNXOUT= 0
##$USERA1= <user>
##$USERA2= <user>
##$USERA3= <user>
##$USERA4= <user>
##$USERA5= <user>
##$V9= 5
##$VALIST= <valist>
##$VCLIST= <CCCCCCCCCCCCCCC>
##$VD= 0
##$VDLIST= <DDDDDDDDDDDDDDD>
##$VPLIST= <PPPPPPPPPPPPPPP>
##$VTLIST= <TTTTTTTTTTTTTTT>
##$WBST= 1024
##$WBSW= 4
##$XGAIN= (0..3)
0 0 0 0 
##$XL= 0
##$YL= 0
##$YMAX_a= 209402
##$YMIN_a= -221289
##$ZGOPTNS= <>
##$ZL1= 120
##$ZL2= 120
##$ZL3= 120
##$ZL4= 120
##$ABSF1= 10
##$ABSF2= 0
##$ABSG= 5
##$ABSL= 3
##$ALPHA= 0
##$AQORDER= 0
##$ASSFAC= 0
##$ASSFACI= 0
##$ASSFACX= 0
##$ASSWID= 0
##$AUNMP= <proc_1d>
##$AZFE= 0.1
##$AZFW= 0.1
##$BCFW= 1
##$BC_mod= 2
##$BYTORDP= 1
##$COROFFS= 0
##$CY= 11.3945322036743
##$DATMOD= 1
##$DC= 2
##$DFILT= <>
##$DTYPP= 0
##$F1P= 15.7292609196834
##$F2P= 12.9074282941183
##$FCOR= 0.5
##$FTSIZE= 0
##$FT_mod= 4
##$GAMMA= 1
##$GB= 0.15
##$INTBC= 1
##$INTSCL= 1
##$ISEN= 128
##$LB= 0.24
##$LEV0= 0
##$LPBIN= 0
##$MAXI= 10000
##$MC2= 0
##$MEAN= 0
##$ME_mod= 0
##$MI= 1.114404
##$NCOEF= 0
##$NC_proc= 0
##$NLEV= 6
##$NOISF1= 3.799351
##$NOISF2= 2.8
##$NSP= 1
##$NTH_PI= 0
##$NZP= 0
##$OFFSET= 15.70392
##$PC= 1
##$PHC0= -22509.45
##$PHC1= 9.852713
##$PH_mod= 1
##$PKNL= yes
##$PPARMOD= 0
##$PSCAL= 0
##$PSIGN= 0
##$REVERSE= no
##$SF= 200.130013532006
##$SI= 16384
##$SIGF1= 3
##$SIGF2= 2
##$SINO= 400
##$SIOLD= 16384
##$SREGLST= <1H.CDCl3>
##$SSB= 0
##$STSI= 0
##$STSR= 0
##$SW_p= 3612.71676300578
##$SYMM= 0
##$S_DEV= 0
##$TDeff= 0
##$TDoff= 0
##$TI= <>
##$TILT= no
##$TM1= 0
##$TM2= 0
##$TOPLEV= 0
##$USERP1= <user>
##$USERP2= <user>
##$USERP3= <user>
##$USERP4= <user>
##$USERP5= <user>
##$WDW= 1
##$XDIM= 8192
##$YMAX_p= 0
##$YMIN_p= 0
$$ End of Bruker specific parameters
$$ ---------------------------------
##NTUPLES= NMR FID
##VAR_NAME=  TIME,          FID/REAL,        FID/IMAG
##SYMBOL=    X,             R,               I
##VAR_TYPE=  INDEPENDENT,   DEPENDENT,       DEPENDENT
##VAR_FORM=  AFFN,          ASDF,            ASDF
##VAR_DIM=   8192,          8192,            8192
##UNITS=     SECONDS,       ARBITRARY UNITS, ARBITRARY UNITS
##FACTOR=    0.0002768,     1,               1
##FIRST=     0,             0,               0
##LAST=      2.2672688,     0,               0
##MIN=       0,             -221289,         0
##MAX=       2.2672688,     209402,          0
$$ Real data points
##PAGE= N=1
##DATA TABLE= (X++(R..R)), XYDATA
0@%%%%%%%%%%Qj6J6j6K4l2L8m6N6p2Q8j04J20j38J62j92K25k62L02l46M00m57
32b42N19n90O67p52Q46r51J064j187J324j474J636j813K007k217K446k700K978
49A561l279L611l976M380m829N327n888O524p244Q073r040J0184j1563J3257j5404
64h306J8224k2106K7832l7253N6414j56561J72409L7270j51630J05594k47517
75b05630L70905j38683j89527K38527j45442J69996j51819j20336L66952k54319
85e9376L7110k8336k5246K85250l39377M9620J41954j05731J62169k79719J44471
96a7211J52913k52695J51044j09788J17314N8207k98720K57591l0347k7757K5793
107B6344k02493K99919q3412j34293J28831j22573K02776j35228j02386K37331
$$ plain form
0 0 0 0 0 0 0 0 0 0 0 0 8 -8 8 -8 16 -16 22 -24 32 -40 48 -56 64 -74 88 -104 121 -141 161 -185 215 -242
32 -242 277 -313 354 -398 448 -503 561 -626 698 -776 860 -953 1054 -1163 1283 -1417 1561
49 1561 -1718 1893 -2083 2297 -2532 2795 -3093 3431 -3813 4260 -4780 5404 -6159 7098 -8306
64 -8306 9918 -12188 15644 -21609 34805 -121756 50653 87923 -63707 41887 -205630
75 -205630 165275 26592 -162935 75592 -69850 100146 -51673 -172009 194943 -59376
85 -59376 -22266 -50602 -75848 209402 -129975 -80355 61599 -44132 118037 -161682 -17211
96 -17211 135702 -116993 34051 -75737 41577 99784 -198936 58655 28308 551 26344
107 26344 -176149 123770 40358 -93935 34896 -87677 115099 -20129 -122515 114816
117A14816j62369P4696o7424k7885K27741k46798M9231N8325m3498J40855k40383
128a22693J02067J07067j39776J08833j39561J07532N9372j94646J63037o0527
138i295K4789K1016j56043K08230o5769o0050N9835r7878J72734r5410p0172J26682
150E8669r9229R5668p0977l2232J42110j44635N7303R45k3663J02391j60223P1523
162b350M9596o5385P3200j19506P9195M2804j03513R0473p1205M2292K2604r7128
174e8923J18318n8546q943L2320o9208J13643o5845l1679O1595o0372Q1883n5872
186a629k5684P4858p4511N6923k2542k1392O2313q4010N2447Q191l3933M6426
198C7457p2823N0682J8398m8192M5218n3990L5325J7755m8321N1585m3792J2604
$$ plain form
117 114816 -47553 27143 -40281 -68166 159575 -87223 -37992 20333 -23165 117690 -122693
128 -122693 -20626 86441 -53335 55498 -84063 23469 82841 -111805 51232 -9295
138 -9295 15494 36510 -119533 88697 22928 -37122 22713 -75165 97569 2159 -68013 58669
150 58669 -40560 55108 -15869 -48101 94009 -50626 6677 7622 -16041 86350 -73873 -2350
162 -2350 47246 -18139 55061 -64445 14750 57554 -45959 44514 -26691 15601 38205 -58923
174 -58923 59395 849 -8094 24226 -44982 68661 2816 -28863 32732 -27640 54243 -1629
186 -1629 -27313 47545 -26966 29957 7415 -13977 48336 -35674 16773 24964 -8969 37457
198 37457 -35366 15316 33714 -14478 30740 -23250 12075 29830 -18491 33094 -10698 1906
210A906K1354l8444N1524m1000l674K9757l1381M3492l5164j0334L3948l1059
222i075L5662k2714j4338L0384l1358L2122r817j9662K4571k8343K8667p95k2975
235g671K0564k4702K2455N920k2106J7214k2347J5194J1527j8770J3556k0087
247i253Q541J4808j4733J0725j6903K270J4955j0107R566j3520l716J3035m973
260F95R073j0655q148J0485r73Q099p504r659O878N54P233l169r180J936M54P206
276C325J185q035k959O6P235L950n990o106n24N992N090k498p225j957L585N287
292D21K010p129l941J097M838O037o240n359p83L244Q644m338n552k152L70R837
308A004j511m754l165k932R802J508l479l424n888Q464L905j769k764p991N921
$$ plain form
210 1906 23260 -15184 36340 -4660 -8334 21423 -9958 33534 -1630 -11964 21984 -9075
222 -9075 26587 3873 -10465 19919 -11439 20683 10866 -8796 15775 -12568 16099 15304 -7671
235 -7671 12893 -11809 10646 16566 -5540 11674 -10673 4521 16048 -2722 10834 -9253
247 -9253 -712 14096 -637 10088 -6815 -4545 10410 303 9869 -3651 -7367 5668 695
260 695 9768 -887 -9035 1450 477 8576 1072 -8587 -1709 -1155 6078 2909 -6271 -4335 -3881 3325
276 3325 4510 -3525 -6484 -6418 817 4767 -1223 -7329 -7853 -1861 3229 731 -6494 -8451 -4866 421
292 421 2431 -4698 -8639 -7542 -2704 3333 -2907 -8266 -9049 -5805 2839 -1499 -7051 -9203 -8833 1004
308 1004 -507 -5261 -8426 -11358 -1556 -48 -3527 -6951 -12839 -4375 -470 -2239 -5003 -12994 -7073
323g073N335J58j259r039K598N664K043O72q906q21M886L523K604p490l709L088
339g726M324M169m943n638N39M433N074j735o330k352M086N038J454n607m989
354a0203L420L767M143l223p156K333J550O254M16r177J261o40P253M113j0846
369f735J374k383N878P351j1001K897m537J911J1187r445M233p247k726J6238
383F995q297L881q133n925K0148r814L555m412r301J9871j2161O315K098j6361
397a1541J7093j0895J0422O209k5754J7535o206R339P188l0468K2439m773P81
410A369J1811k7162K4353j0307p641K4662k3509J7002j4850q042L7773k8435P261
423D285p895o191L9095l6821P753O645j5392L1129l4258J7115J3238l5360K9909
$$ plain form
323 -7073 -1738 -1580 -2839 -11878 -9280 -3616 -1573 -901 -9807 -10628 -5742 -2219 385 -7105 -10814 -7726
339 -7726 -3402 767 -4176 -9814 -9275 -4842 232 -1503 -7833 -10185 -6099 -1061 393 -5214 -10203
354 -10203 -6783 -3016 1127 -2096 -9252 -6919 -5369 885 1301 -7876 -6615 -7255 -2 4111 -6735
369 -6735 -5361 -7744 -1866 5485 -5516 -2619 -7156 -5245 5942 -3503 730 -6517 -9243 6995
383 6995 -1302 2579 -5554 -11479 8669 -1145 2410 -2002 -11303 8568 -3593 2722 4820 -11541
397 -11541 5552 -5343 5079 11288 -14466 3069 -3137 6202 13390 -17078 5361 588 1369
410 1369 13180 -13982 10371 64 -7577 17085 -6424 10578 -4272 -12314 25459 -2976 4285
423 4285 -3610 -9801 29294 -7527 226 6871 -8521 22608 -11650 5465 18703 -16657 13252
436A3252j8694J8426P446m8741M2188p134K372N404m3330N2226j3754j6281K3282
449A6662l2441M1185k6232j6342N0112l9346J7693j8990l705N8087o0505J0245
461c577P930p386M3501o6141K5343K4863l6793L5167m2860L4594J4556o4037N3390
474A8550j6338J3733n0o0588P7620j7917j9881J4426l9562P1873l8177k8208N1862
487B7343l9881L7942l7313q065P1356o9127J6465k967J429N4932q9638L0171K9480
500B2127k6658L4777p0159N0186K4595o6406M9413l2365L4403l31p2560Q5958
512C2980k3437r512L055m6838R5020m6701l2473M2689l6465O3002n6281j5958
524c0919P4357o3939L0861k4999K940O5781r5746L4637J8286j4616L9596q9672
$$ plain form
436 13252 -5442 12984 20430 -28311 13877 6743 9115 14519 -28811 23415 9661 -6620 16662
449 16662 -15779 25406 -826 -17168 32944 -6402 11291 -7699 -11404 46683 -13822 -3577
461 -3577 4353 -3033 40468 -25673 -330 24533 -12260 22907 -19953 14641 29197 -34840 18550
474 18550 2212 15945 15895 -44693 32927 15010 -4871 9555 -30007 41866 3689 -24519 27343
487 27343 -12538 25404 -11909 -19974 51382 -17745 -1280 -4247 -2818 52114 -37524 -7353 22127
500 22127 -4531 30246 -39913 10273 34868 -31538 17875 -14490 19913 19582 -52978 32980
512 32980 9543 31 3086 -43752 51268 4567 -27906 14783 -21682 41320 -14961 -30919
524 -30919 43438 -20501 10360 -14639 -11699 54082 -41664 -7027 11259 -3357 36239 -53433
536e3433N7161K8814n6123M1254n2507N2308P436p4344P4648l1292J1434m49n4736
549d9829R5753m5648k3427K8576l5448P6988o1441k1036O4008n0099M4529m3045
561b0119k549O7742q1822L7859k537q132M6368q9743N5356J9431m0590L8843o6225
574d6118N9631J1129o4107N9694m4329L3147K623n7908Q1294m6942L44J8211m1915
587c5246P7326n8169j1091M5402m3460N5981n1103m911N6868o1530M3911k4103
599a0125o366M7445p1626M9333j120k5279L8923o1825N2776L825m3824M5879m7747
612b9731L9677L627m6895N7287m4453J9429J2653m1525N8929m7133O067K7896
624A5828m0692N1712m3875N18L8214m6257M5488l2002n760L9997n0055M4005j9194
$$ plain form
536 -53433 3728 32542 -23581 17673 -34834 17474 24910 -49434 25214 -6078 5356 4907 -49829
549 -49829 45924 276 -23151 5425 -30023 46965 -14476 -35512 28496 -21603 22926 -20119
561 -20119 -22668 45074 -36748 1111 -1426 -9558 36810 -52933 2423 21854 -18736 20107 -46118
574 -46118 13513 24642 -39465 20229 -24100 9047 11670 -46238 35056 -11886 -11542 6669 -35246
587 -35246 42080 -16089 -27180 18222 -25238 30743 -20360 -25271 31597 -29933 13978 -10125
599 -10125 -16491 30954 -40672 8661 7541 -17738 21185 -40640 12136 15961 -27863 18016 -29731
612 -29731 9946 13573 -33322 23965 -20488 -1059 11594 -29931 28998 -18135 -12068 15828
624 15828 -24864 26848 -17027 -16509 21705 -24552 20936 -11066 -16826 23171 -26884 17121 -2073
637b073j6463L9878m7844M1300j0022k5805M1619m4420L4266q53l0824M1627m1847
650b1461K6662R133l4677L9236l7235J9535J6387l7791L7730l0492J0308K0321
662A7656l7302L7774k5222j137K4528l2650L5488k3001r981L1086k8978K8238
674A6499j8939j2579L4947l0590K1291q563j3956L1104l2472K0372K942k0326
686a0270K4331k7763K1451P918k8249K2605j8946J6628P473k9621K5665j4235
698c013N529R576k3029K5599j6273l420J7517j6636J8052j7566m419K4098j7045
711a030R761j1324l066K2068j9562Q525j994o984J5043j6563J1888K314j4551
724e475J1371q877J1956J000j8140J2793l741O337N71j4732J3496m959N99N229
$$ plain form
637 -2073 -18536 21342 -26502 14798 4776 -21029 20590 -23830 10436 9583 -21241 20386 -21461
650 -21461 5201 14334 -20343 18893 -18342 1193 17580 -20211 17519 -12973 -2665 17656
662 17656 -19646 18128 -7094 -8231 16297 -16353 19135 -3866 -13847 17239 -11739 16499
674 16499 -2440 -15019 19928 -10662 10629 2066 -11890 19214 -13258 7114 10056 -10270
686 -10270 14061 -13702 7749 15667 -12582 10023 -8923 7705 15178 -14443 11222 -3013
698 -3013 2516 12092 -10937 14662 -1611 -5031 12486 -4150 13902 -3664 -8083 16015 -1030
711 -1030 8731 -2593 -5659 16409 -3153 5372 3378 -3606 11437 -5126 6762 9076 -5475
724 -5475 5896 -2981 8975 9975 -8165 4628 887 7224 7795 -6937 6559 1600 2199 7428
738G428r565Q968p892r7J0858q252K636o806J744J1720r251L27k821P46Q430p602
754E71J926p66l230N604k742L101j846o185N178J436J850k967n749M670K363L59
770C573j752l834J949J531Q21M91k805j669J186K399J519k381l912J357L091J201
786B765j077m453P30K574P70J200m324q16J879N86L377m052k330J574L5M738l210
803c4l194J348j183N467j658l621J023k572N641J01l746R35l874N114J727l490
819b016J189m966L920L060k921J695n640K323L954k327K423n711M98M222j756
834b053L311n179j358L986j279M099m220k845L419j083M467k774l663K521j336
849c987M523r31l916J318j759M379Q26l777K09k011L766K065l031m49k244K595
$$ plain form
738 7428 -2137 6831 -1061 -1158 9700 1448 4084 -2722 -978 10742 1491 1818 -1003 -257 8173 571
754 571 2497 1731 -1499 4105 1363 4464 2618 -3567 1611 3047 4897 1930 -3819 851 3214 3573
770 3573 1821 -2013 -64 1467 2288 2779 -26 -1695 -509 1890 3409 1028 -2884 -1527 1564 2765
786 2765 1688 -2765 -2035 539 1309 2509 -1815 -2631 -752 -166 3211 -841 -3171 -1597 -1562 3176 -34
803 -34 -3228 -1880 -3063 2404 746 -2875 -1852 -4424 1217 1318 -2428 -1493 -5367 -253 1474 -2016
819 -2016 -827 -5793 -1873 1187 -1734 -39 -5679 -3356 598 -1729 694 -5017 -4519 -297 -2053
834 -2053 1258 -3921 -5279 -1293 -2572 1527 -2693 -5538 -2119 -3202 1265 -1509 -5172 -2651 -3987
849 -3987 536 -395 -4311 -2993 -4752 -373 453 -3324 -3115 -5126 -1360 705 -2326 -2775 -5019 -2424
865b424K736j604p53k587J207K986J05r40k754O2K588J564q21k472q13J384K799
882B63k50k015j489k24L950K55j697j406j768M436L48j161j73l622L896N81j24
899b00J452o081L172J580L43K616q011L219K486r62M002q087L349J997l309O939
915D505o880J790P93m635J0742o587j196J419m831J2626p570k865M583o469J1365
930F790p053j924P442j0945R719l177j152P562j5424J0524J603l888O841j5931
944i013J2144L015q872R656j3224R998J453j1107J5761j2367L667K176r564J9731
958A3454j5000j399P488r292J8454j6346j718J3009j4038J5693j2078o59J3935
971A1503k0733J6528m575l833J1841k3190J9985j30j1102J2928k0455J9735l54
$$ plain form
865 -2424 312 -1292 -2045 -4632 -3425 -439 -334 -1274 -4028 -3966 -1378 186 -635 -3107 -3920 -2536 263
882 263 13 -2002 -3491 -3715 235 490 -1207 -2613 -4381 55 403 -758 -931 -4553 -657 -76 -200
899 -200 1252 -4829 -1657 -77 266 2882 -5129 -1910 576 -386 3616 -4471 -1122 875 -2434 4505
915 4505 -2375 -585 208 -4427 6315 -272 -1468 -49 -4880 7746 176 -2689 1894 -4575 6790
930 6790 -263 -2187 5255 -5690 4029 852 -300 7262 -8162 2362 3965 77 6918 -9013
944 -9013 3131 6146 -2726 6930 -6294 3704 5157 -5950 9811 -2556 1111 3287 -6277 13454
958 13454 -1546 -2945 4543 -4749 13705 -2641 -4359 8650 -5388 10305 -1773 -2432 11503
971 11503 -9230 7298 2723 -1110 10731 -12459 7526 7396 -3706 9222 -11233 8502 8148
984H148j6131J9088j8396J3109M80j5582K4594k0692N515O462j4119K4573k3223
997f174K253J4025j6975K1577k0578J614J7521k2833K1017j3451j687J6871k6230
1010a3050K3603p374q774J7160k5268K4429m729j5115K1006k3870K0719k081j7788
1023a1132K5144k4638J5198L105j9002K6807k5645J0545R328k1150K6820k4477
1035i097O297J4382k3868K6781k1213J121J8113k5563K6468j7364m470K1767k6608
1048a3254K4424j2371q773K4207k8363K2034n142j3264K3857k8645K1190J452
1060G352j9816K3664k5137J8945M386k5163K6822k1039J1922O449k5306L0630
1072A3709k0826K647J2547k2154K9452k3354k411K2237k2682K2644k1056j583
$$ plain form
984 8148 -7983 11105 -7291 5818 6298 -9284 15310 -5382 133 6595 -7524 17049 -6174
997 -6174 -3921 10104 -6871 14706 -5872 -4258 13263 -9570 11447 -2004 -3691 13180 -13050
1010 -13050 10553 3179 -5595 11565 -13703 10726 5997 -9118 11888 -11982 8737 6656 -11132
1023 -11132 14012 -10626 4572 7677 -11325 15482 -10163 382 9710 -11440 15380 -9097
1035 -9097 -2800 11582 -12286 14495 -6718 -5597 12516 -13047 13421 -3943 -8413 13354 -13254
1048 -13254 11170 -1201 -9974 14233 -14130 7904 2762 -10502 13355 -15290 5900 7352
1060 7352 -12464 11200 -13937 5008 9394 -15769 11053 -9986 1936 8385 -16921 13709
1072 13709 -7117 -4470 8077 -14077 15375 -7979 -10390 11847 -10835 11809 -9247 -10830
1084a0830K7458k9324J8365j0498l111K3610l3559K2090k29j3368J8879k7734
1096a8251K6056Q46k4981K2726j7964J9936k504k6715L1510j6003O167J639j9219
1109a6757L2675k2795k065J5468j5468K2121k5557J429K6210k3269J2133j5161
1121a1036N568K3039l2387J4797r33k639J3827k8806K3828K011j8248J4339j5639
1134a2279K3072n396k4867K5596r179R487p210j7294L2095j6481j949N215r645
1147h835K3372k4347Q56J9682j5276J0168j8250Q983K0530k6898Q735l731O093
1160A082J1135k7931J7529K601p943P635j6226K1077l675j8034J6279o126J1493
1173H896r668j4292K5267q883o81l074n811K1463j7014j334R783p116R682j5832
$$ plain form
1084 -10830 16628 -12696 5669 -4829 -7940 15670 -17889 4201 3972 -9396 9483 -18251
1096 -18251 7805 8651 -16330 6396 -11568 8368 5864 -20851 10659 -5344 823 2462 -16757
1109 -16757 15918 -6877 -8942 6526 -8942 13179 -12378 -10949 15261 -8008 4125 -11036
1121 -11036 -5468 17571 -14816 -19 -952 -3591 10236 -18570 5258 7269 -10979 3360 -12279
1134 -12279 10793 5397 -19470 6126 -3053 6434 -776 -18070 14025 -2456 -4405 810 -8835
1147 -8835 14537 -9810 -8954 10728 -4548 5620 -12630 -3647 16883 -10015 -1280 -5011 1082
1160 1082 12217 -15714 1815 4416 -3527 4108 -12118 8959 5284 -12750 3529 -2597 8896
1173 8896 -772 -15064 10203 1320 639 -2435 -8246 13217 -3797 -5131 4652 -2464 7218 -8614
1187h614O528J4030j6811M787n169Q498P818k1256J0114K079P7L079j4663J4790
1201E287j009q853P614n863J0183o971q808J5219m797J175n579l279J5634r451
1215E02j884K019k137Q867j0226K044O552p291L663m475N067M355j1612M580J391
1230A415K226P75r658P162J491k672J857m686N568j828l651N925k631P77k711
1245f41j020P394m014j853k45L44N122m475q42J675j293K548k155Q12R42l396
1261a097K076P61O77p60l441K517J748m45j039j977J719J092m96m1j024k15O05
1278F60O37N44r19j663P04J554K24n91k010N41J658k13L62j892l09J543l22J358
1296A866j734j294J596m46J913j324j954J628q85K201m88k407J431j360K298M92
$$ plain form
1187 -8614 -2086 11944 -4867 -80 -5249 3249 11067 -10189 -75 2004 2081 5160 -9503 5287
1201 5287 4278 -4575 3039 -2824 7359 388 -8420 6799 2002 3177 -2402 -5681 9953 502
1215 502 -1382 637 -1500 7367 -2859 -815 5737 -1554 2109 -2366 2701 7056 -4556 24 1415
1230 1415 3641 4416 -5242 1920 3411 739 2596 -2090 3478 1650 -2001 3924 1293 2070 -641
1245 -641 -1661 5733 1719 -134 -379 -35 5087 612 -230 1445 152 2700 545 1357 2299 -1097
1261 -1097 979 1740 2417 1657 -1784 733 2481 2036 997 -980 739 1831 1335 1294 270 55 660
1278 660 1297 1841 922 -741 -37 1517 1741 1150 -860 -319 1339 1126 1488 -404 -713 830 508 1866
1296 1866 132 -1162 434 -12 1901 577 -1377 251 -634 1567 1079 -1328 103 -1257 1041 1533
1312A533k783J296j718K055J345k894J377k041J375K131k692J495k322N10K811
1327A478k355J577k377l80L262k103J702k052j287L311j887J904j448k174L106
1342B77j634K056p64k857K775j472J985Q6l200K293j445J757J003l250J743j489
1358b136J449J792l107J272j447R25K316k660R99j445K03K614j978Q57j457n14
1374b317K707j248O98j360j034K512o67O73j053j398J949k50Q27o14j645J180
1390a040P0J078k53j679M33K44J215J6j377j88J47J222K48p74p09j96J223L91
1408G1o5j099n96J255K73O72j213r82J244j25J368r94j355J213p22J967n10j780
1426a378J257j393K342J34k186J482k068K402Q13k555J914k614K021J530k837
$$ plain form
1312 1533 -1250 46 -1672 383 1728 -1166 211 -1830 -455 1676 -1016 479 -1843 -1333 1478
1327 1478 -877 700 -1677 -2057 1205 -898 804 -1248 -2535 776 -1111 793 -655 -2829 277
1342 277 -1357 699 -65 -2922 -147 -1619 366 452 -2748 -455 -1900 -143 860 -2390 -647 -2136
1358 -2136 -687 1105 -2002 -730 -2177 -1252 1064 -1596 -597 -2042 -1839 775 -1203 -346 -1803 -2317
1374 -2317 390 -858 -160 -1520 -2554 -42 -709 -36 -1089 -2487 -538 -788 39 -575 -2220 -1040
1390 -1040 -970 108 -145 -1824 -1391 -1147 68 84 -1293 -1481 -1334 -112 136 -638 -1347 -1543 -320 71
1408 71 6 -1093 -1689 -434 -161 511 -702 -1684 -440 -565 803 -191 -1546 -333 -1055 912 402 -1378
1426 -1378 -121 -1514 828 962 -1224 258 -1810 592 1405 -1150 764 -1850 171 1701 -1136
1441a136K556l068J188K309k921L171l441J41L302l066L437l428p61M229l632
1456a120L532k691j516M603m515L896j216k754M387m938M612N3m620M517m443
1471b213M672M87o056N778m109L131J106n965P080n069R89L270n240O750o473
1486a862J36O369n999N091n955N36P847q506M684k864m76O645r774O746j88m462
1502b032N670p712Q378n14q640P911m784O125j791q971J1511n205J332M85o255
1517d492J1663q786p12O558n911P252r866J863J0654j0569M089n054L440Q545
1531H674j4728O966N02j410M866j2283J1738J04r112O945n986J0518m475j1353
1545i034J3872m303L056m532o750J6904r686j978L393l671J1241j3938J313J1474
$$ plain form
1441 -1136 1420 -1648 -460 1849 -1072 2099 -1342 -1201 2101 -965 2472 -956 -1717 2512 -1120
1456 -1120 2412 -279 -1795 2808 -1707 2189 973 -1781 2606 -2332 2280 2333 -2287 2230 -2213
1471 -2213 2459 2946 -3110 2668 -1441 1690 2796 -3169 3911 -1158 -169 3101 -2139 4611 -1862
1486 -1862 -1726 4643 -1356 3735 -2220 -1684 6163 -2343 2341 -523 -999 5646 -4128 2618 2430 -2032
1502 -2032 3638 -4074 4304 3790 -4850 3061 -1723 4402 2611 -6360 5151 -54 1278 1763 -4492
1517 -4492 7171 -1615 -2327 4231 -1680 5572 -4294 -2431 8223 -2346 1743 -3311 129 8674
1531 8674 -6054 912 1414 4 4870 -7413 4325 4429 -4683 2262 -3724 6794 2319 -9034
1545 -9034 4838 535 3591 -941 -7691 9213 -473 -2451 942 -2729 8512 -5426 -4113 7361
1559G361q993M090r082O590J0599j7136N258K61L440M119j7031J2524K654o976
1573b322L621q398J4168l745j2806J2209k908N682p745q038J9278p909k950q86
1587b749j635J5135j5352j120R841n078N582j3094O791J1691j5330L659k570P584
1601C355M454j9300J1183L386k050M22j2004J6355j619j1018P265l579J0164q562
1615a548q965J7033n376o83n287j097J6781j3556k787N570q70P621j4626M252
1629c538J0616r965K638n612Q027N289j6589P651K531J667o69j2770J4091Q64
1643D231p460K513m622J1658n853q470J1300l392K580o365k148J4408r550k137
1657c307J155Q92Q874j3116J612P352m367L271q231O124N484j1051M828o52L624
$$ plain form
1559 7361 -1632 2458 -6624 -34 10565 -6571 -1313 -1052 2388 6507 -10524 2000 4654 -2322
1573 -2322 1299 -7099 7069 3324 -9482 2727 -181 5501 -2244 -10282 8996 1087 -1863 -2749
1587 -2749 -4384 10751 -4601 -5721 4120 -958 4624 -8470 -1679 10012 -5318 -1659 -4229 3355
1601 3355 7809 -11491 -308 3078 1028 1450 -10554 5801 4182 -6836 429 -3150 7014 -1548
1615 -1548 -10513 6520 1144 461 -4826 -5923 10858 -2698 -5485 85 -785 6836 -7790 -3538
1629 -3538 7078 -2887 -249 -5861 2166 7455 -9134 -1483 1048 2715 2046 -10724 3367 4231
1643 4231 -3229 -716 -5338 6320 467 -8003 3297 -95 2485 -3880 -6028 8380 -1170 -3307
1657 -3307 -2152 -1260 7614 -5502 -3890 3462 -905 2366 -5865 259 5743 -5308 -480 -1132 2492
1672B492K29j0931J0097R74l320J32n377J0445k980o201N664k716M745m702k930
1687d379R328n645j30q43K95P270q823L49L888j255L308p308L119M322n341K785
1703I40k736L001J319o701N555j93n84j80m266O902j350l238J896k084M676k622
1719C35k440M257k784J574j216n19M028m521O40J410m08K188m452J375K445j888
1735B4J354k508J364J543k727K141q37j17N73j961K882o28j520P75r06K324q01
1752I75j677J347p47J225l43j020J232j165N81N60o17N57j298M83J104o16M2q81
1770b58L19J015n36K5m43j75P09r1Q2k29o24M94L81m3o9p68K38O55j80J98p48
1791d8j61Q21k76M58o07o00R14l22N98l39r81R76m23O11Q3j264R08n18N67N65
$$ plain form
1672 2492 2721 -8210 1887 2861 -459 -327 -5704 4741 1761 -4440 1224 -1492 3253 -1449 -4379
1687 -4379 4949 -696 -826 -1669 -1374 5896 -2927 -2578 1310 55 3363 -3945 -826 3496 -1845 940
1703 940 -1796 1205 2524 -4177 1378 1185 601 421 -3845 3057 1707 -1531 365 -1719 2957 335
1719 335 -2105 2152 -632 942 -274 -793 3235 -1286 -646 764 356 2544 -1908 -533 1912 24
1735 24 1378 -1130 234 1777 -950 1191 354 237 810 -1151 1731 1103 -417 358 -548 1776 975
1752 975 -702 645 -102 1123 780 -240 992 -173 408 968 351 908 -390 93 1197 581 623 -258
1770 -258 61 1076 540 565 122 -53 656 565 647 418 -206 288 669 626 557 -211 27 682 502 700 -48
1791 -48 -209 612 336 794 187 -413 501 179 777 438 -543 433 10 621 704 -560 348 -170 397 962
1811I62j502Q08n52M18R63j590P16n15R8J315j537O50m81l17J617j370N64m03
1829a56p29J824j191M85k27j129J885r90M09L9j469J786q03L47L65j752J605o05
1847c06K54P16j924J353m54R8J077j945J070l22j13J381j866Q07k17l52J618j657
1865g82N54j31o28J764j358L35m2q79J794j062J82Q4j108J680p48J12K36j314
1883a311J457m40P6L79j432J189j99L9N11j414Q85n5lO87j314N80k6k3Q34j121
1903g01K73j5l8Q76q93J16r9r4Q83n90Pk29j44Q61l48n1l16j34P29j97M0l22j40
1926e26M21o9L13l32k95J48J50N73n31l61J20K62O08p45j04J91n1N23n77L33l8
1947A3o60Q11j66L97m83r57J457j13o9m56o85J710p09l15M26o29J101j173K62
$$ plain form
1811 962 -540 268 -284 134 1097 -493 223 -292 -194 1121 -416 234 -247 -564 1053 -317 247 -156
1829 -156 -885 939 -252 233 6 -1123 762 -228 181 220 -1249 537 -266 81 446 -1306 299 -306
1847 -306 -52 664 -1260 93 -361 -263 814 -1131 -61 -383 -496 885 -981 -174 -391 -743 875 -782
1865 -782 -228 -359 -987 777 -581 -246 -288 -1167 627 -435 -253 -169 -1277 403 -345 -233 3 -1311
1883 -1311 146 -294 -218 161 -1271 -82 -281 -242 269 -1145 -260 -315 -318 369 -945 -365 -391 -414 420 -701
1903 -701 -428 -443 -481 395 -498 -382 -481 -575 308 -282 -275 -504 -648 213 -135 -186 -502 -636 93 -104 -64 -386 -526
1926 -526 -105 -174 139 -193 -488 -340 -190 383 -148 -509 -389 -127 481 -264 -368 -177 -228 295 -282 51 13
1947 13 -647 164 -2 395 -88 -1045 412 299 230 -226 -911 799 90 -225 201 -428 673 -500 -238
1966b38J344j521M12n77R01J204k584P88M29L37N48k472J843L96j172Q64j208
1983g06J926q17j929K560o40N03j390j048L746j789p75L6j53K856l176LK092j363
2001f4J056k417J765K160l849J157j1J576M32m532L253R01j007J8k551M210q52
2018A245k945K452q40K099k489j871N132k121p29j014K76M618m685o49K320l69
2034D30J825m608J935L351l787R07j359K880J030n869L407J099J12q89m023N843
2050B284l14l214J091j079M365l144k903M979j524M34k674J51N747m892q48J220
2066c21Q32K823o200J634L659k474P35l276L575J998n740K585L19J519p40n033
2082d105N808K61k523o6j798N702k558l637L735r31K078l358j053N817l725m86
$$ plain form
1966 -238 1106 -415 -3 -580 321 1525 -1059 -271 158 495 1043 -1429 414 810 -362 502 -706
1983 -706 1220 403 -1526 1034 394 897 -493 -1541 2205 416 -359 -323 -476 2380 -796 -793 1299 -64
2001 -64 992 -1425 340 2500 -1349 -192 -203 1373 1805 -2727 526 1427 420 438 -2113 2097 1245
2018 1245 -1700 752 -88 2011 -478 -2349 2783 662 -67 -1081 -805 3813 -872 -1521 799 430
2034 430 2255 -2353 -418 2933 -854 53 -1306 1574 2604 -3265 142 1241 1353 464 -3559 2284
2050 2284 1970 -1244 -153 -1232 3133 -11 -2914 2065 541 975 -1699 -1548 4199 -693 -1541 -321
2066 -321 511 3334 -2866 -1232 2427 -47 688 -2588 987 2985 -2755 -170 149 1668 928 -4105
2082 -4105 1703 1964 -559 -625 -2423 3279 721 -2916 819 -112 1966 -1392 -2445 3372 -353 -839
2098h39k70Q82L854o149Q74K994j011J139m737L321K672m417J625j255K705L6
2114A424n014M581j07p17n53k541N655k001k768K003r43L400l302j577M396k394
2130d58P70j564K65L816m600O98J372k72J701m515K290K329k639J108k228K569
2146F42R24l880K757o25M82l9k703M064j253j508J083j253L222k269j471K715
2162H88j543J563j691m60K886k781J014Kl60J843l165J617J035j454J221k227
2178a612J857Q10k305J728j287R82M40k040K337j197j66Q49j430K138j400o09
2194i05J517j310J518j127n87J733j530J120m46o83J461j588J098Q2j016J226
2210E63j295R61K77j182J191j067N94M86j070J081j005L14P63j013Q21p78J68
$$ plain form
2098 -839 -1109 -227 3627 -2522 -1648 1346 335 1474 -3263 58 2730 -1687 -62 -1317 1388 1424
2114 1424 -3590 991 884 167 -386 -2927 2728 727 -2041 -38 -981 2419 -883 -2460 1936 -458
2130 -458 312 -1252 -987 2829 -1771 -1073 299 27 1728 -2787 -497 1832 -807 301 -1927 642
2146 642 1566 -2314 443 -182 300 261 -2442 1622 369 -1139 -56 -1309 1913 -356 -1827 888
2162 888 -655 908 -783 -1243 1643 -1138 -124 -122 -482 1361 -1804 -187 848 -606 615 -1612
2178 -1612 245 1055 -1250 478 -809 173 613 -1427 910 -287 -453 396 -1034 1104 -296 -905
2194 -905 612 -698 820 -307 -894 839 -691 429 -17 -700 761 -827 271 353 -663 563
2210 563 -732 229 506 -676 515 -552 42 528 -542 539 -466 -152 611 -402 419 -359 -191
2227a91Q35j031P30m42j20P20q56P72k81n03O85n16O62k53p26Q22k88L04j39o13
2247d29Q19l32mK31m32M58m08K8N95n23O8j94J60N68o40l5J47J6L39m71O9K13
2269B43k89K56o7M6L1m24L35K46j93p9k79L43K50l74N3j01Q7K16k96K15p4k42
2291i7L20j30K00j38l99M93j06P1k4m45N03j39%J95n12M14j49k9L98o19L09o1
2313E5p6N15o79K48K5k19O20o02J73N5l57P13n27N8J51m75P50m54jK36o04P34
2335C39l19p4L32p12O75j76j47M16p98O15m7k49N19p94M96L4l34O36p59L33J12
2356I8l85P31p31J86K21m53P67o51O8K91n43P72m96n8L42o26P72l53j66L85o61
2377d90P12k22k50M66o95N92r0k67N04p32M66P5l04N09p18L63J89l74N32o36K61
$$ plain form
2227 -191 644 -387 343 -99 -219 501 -355 417 136 -367 318 -198 464 211 -515 307 19 323 184 -429
2247 -429 390 58 54 285 -147 311 -97 -69 526 3 71 -123 37 605 -35 -70 77 93 432 -39 30 243
2269 243 -46 210 143 189 220 -204 131 377 184 105 -174 169 419 45 98 -3 84 300 4 219 145 -97
2291 -97 223 93 293 155 -244 249 143 214 190 -255 248 109 109 304 -208 206 57 28 426 -193 116 55
2313 55 -21 494 -185 63 88 -131 489 -113 60 115 -242 471 -56 2 153 -322 428 -26 -27 209 -395 339
2335 339 20 -54 278 -434 241 65 -82 334 -464 151 104 -145 374 -420 76 110 -224 412 -347 -14 98
2356 98 -287 444 -287 -101 120 -333 434 -217 -149 142 -401 371 -125 -183 159 -467 305 -48 -214 171 -490
2377 -490 222 0 -250 216 -479 113 23 -244 260 -472 -6 69 -235 274 -444 -81 108 -266 266 -370 -109
2398a09J89m06N96n10O6K22l90O28m41q1K65l63N88l77j24L11m02N06k56j31L05
2419H6m65M59r5j59K58m71M25j2j81K24m25L45L0j57K42m14K45P6j22K48l95J82
2441g6R0j33K45l21J44K6j37L06k29L2n3m5L55k46o5k0L8K86l06L2M9m2J63k34
2465a41K01lk36J61k8K54k28k81L71J3R9l19j01M86k30kp0L3K76m95K16K37j66
2488D7kl93N42J82n53J11r2N01j46n75N36q4O1j84j74P09n15k06K98K6L89q25
2510c47R4O67l15P2n45M15N07q10K88l0K12N6p83Q07O3m25N2l33R84l72p32O14
2532A39j21M66n47l96J028n51Mp9l4P76j043J47N63k71K77r20N81O24q66K98l56
2553b81N36K11j014P92j13o8O8o23J072m25n04M92l03P48o66l88R02n00L19l91
$$ plain form
2398 -109 80 -326 270 -240 -174 48 -342 286 -155 -236 29 -334 254 -123 -247 64 -338 168 -88 -219 86
2419 86 -379 80 -15 -174 84 -387 38 26 -155 69 -356 -11 19 -138 104 -310 -65 11 -111 137 -258 -76
2441 -76 14 -119 126 -195 -51 -25 -162 144 -85 -53 -106 -151 204 -42 -107 -127 -89 197 -109 -77 -28 -70 93 -141
2465 -141 60 57 -179 -18 -46 208 -20 -301 70 83 182 -137 -238 248 18 16 -54 -21 255 -240 -24 213 47
2488 47 45 -348 194 376 -177 -66 -158 343 197 -378 158 74 135 -49 -223 486 -29 -235 63 89 478 -347
2510 -347 -253 414 99 171 -374 41 548 -262 26 -4 208 264 -519 288 351 -74 -22 -355 629 257 -475 139
2532 139 18 484 -63 -459 569 18 22 -57 -91 685 -358 -211 352 81 358 -562 19 643 -223 75 -281
2553 -281 255 466 -548 244 131 63 131 -492 580 155 -349 143 -160 588 -78 -466 436 -64 255 -136
2573a36j02Q43q96L11J13k22N37r39N46L73o50M47n98N40K55q68O93m00K00K37
2593B84p37Q49m67j31N06o29P02m83j92O94p07N77l07k60O95p53N83j37m35O75
2613C27o45N41r6n36P59n82L31Jm83P99o71J55K96m29N74p37K72N52p01L73m16
2634c16L46M13r42N59p1j3J88p05Q24j20n32M00k68O30m07n86Q63k22Q9l42k20
2655d32R75o39j85K77n1M54q54J92P09n11Ol88N63M39j020K37K27K29o8q21P91
2676A30J88n01%j23P57l69o87O48J32N9n70j64J007l76m01KK53N19q25o2O41j25
2698A33j30m70N02N00q05l6K46L73r1q00N13M10k92k26j78O62p9o47L17K31J50
2719B83m74k55P57o6m04j33K34N03n22k91M31J15o3m07J77M82l91k02J37L03J1
$$ plain form
2573 -136 -238 605 -291 20 133 -89 448 -491 55 428 -222 225 -373 167 422 -446 247 -153 47 284
2593 284 -453 396 -71 -202 304 -325 377 -106 -298 396 -311 266 -41 -301 394 -359 224 87 -348 327
2613 327 -318 223 127 -409 350 -232 99 100 -383 416 -255 -100 196 -233 341 -396 -124 428 -273 100 -316
2634 -316 30 443 -499 60 -11 -24 164 -541 283 163 -369 31 -237 393 -14 -600 263 41 130 -212 -432
2655 -432 543 -96 -281 -4 -55 399 -455 -263 446 -65 -59 -447 116 555 -465 -228 -1 228 160 -661 130
2676 130 318 -183 -183 -306 451 82 -605 43 175 234 -336 -500 507 131 -270 -268 -15 504 -321 -383 258 133
2698 133 3 -467 35 535 -270 -306 -60 313 222 -578 -65 345 53 -173 -351 311 232 -415 -98 133 283
2719 283 -191 -446 311 245 -159 -292 -58 445 -77 -368 63 178 115 -292 -115 367 -24 -226 -89 214 225
2740B25n19J36M14j00k21j98L70J79m28J7J81J01j29k82L48J25k99l1L9L16j52
2761I2l35K70R0kj59j31L55j16j54J15j6J60k41m6L09j51k4r4O9K45k79mR0k6
2785A7J34k38R4J18j88J29p3O4O1k54K16j6n1Q7k29K28m0j17J81k10J47jj23K23
2809A59k36R3N1j48K48k34N1J15k03K59j84QJ20k27K75j40n2J41k13K66j26j03
2831h0K13k52K30p0j20K35k92J88J3j40K28k94J59P4j87K33k54J12J04k28K53
2852A25j95M0J30k45K76j67m2J75k34K78j51q4K09k34K24j00j10K33k61K14n0
2873C1j48K41k59J80L5k09K50k45J42O7k13K53k29Q3J12k17K40k04L6J60k38K34
2895A02j77J6J79k71K41j29m6J88k55K34q4j09K00k10J91n4j52K34k05J54j8j57
$$ plain form
2740 225 -294 -158 256 156 -65 -263 107 286 -142 -125 56 157 28 -254 94 219 -80 -111 -72 244 92
2761 92 -243 27 117 115 -44 -175 180 64 -90 25 9 169 -72 -118 191 40 16 -78 -9 236 -43 -47 43 17
2785 17 151 -87 7 125 -63 66 -7 57 118 -136 80 64 13 100 -129 99 59 -58 123 -87 60 59 -64 159
2809 159 -77 16 67 -81 167 -67 -16 99 -104 155 -29 -21 99 -128 147 7 -45 96 -117 149 23 -80
2831 -80 133 -119 111 41 -79 156 -136 52 65 -75 153 -141 18 92 -95 138 -116 -4 100 -128 125
2852 125 -70 -30 100 -145 131 -36 -78 97 -137 141 -10 -94 115 -119 105 5 -105 128 -133 81 31
2873 31 -117 124 -135 45 80 -129 121 -124 18 85 -128 125 -104 -21 91 -126 114 -90 -54 106 -132 102
2895 102 -75 -59 120 -151 90 -39 -85 103 -152 82 -2 -111 89 -121 70 16 -136 98 -107 47 29 -128
2917a28K39k18J19L3j59K30k25Q5R9j88J95j87P3J32k30K05j47K9J27k13K15j30
2939d4k7J49j93J94j07o5J76j88J80q8r5K11k07J60m8j00J88k01J47j3j29J96
2961I6j97J26L1j54J69j55R1N7j60J69j48N7Q7j77J92j46L3R6j59J72j32MJ36
2984H8j85J71j14k0J47j67J55q2m7J48j81J59n4q5J60j81J48k7r9J56j70J34j4
3007D0j33J79j50R0K1j31J89j68N1P1j25J63j91P2J05j50J34j37N6J19k02J48
3029E1o3QO8j81K04m9r1J00j12J93j02j44J94r6R7j16n1K52k05L7pkJ63k78R2
3054c8J46j14O0k15J99J18k66R4l0J36j4k77K72Pr5k1r1L11j44k03J79K6J22k70
3078a08n6L56j34r9n6R8K31l61J1J91Kj8k86K59J97k99j9kK60l7l86K50J15l5
$$ plain form
2917 -128 111 -107 12 45 -114 116 -109 -24 75 -113 82 -105 -32 100 -130 75 -72 -43 84 -129 86 -44
2939 -44 -71 78 -115 79 -28 -93 83 -105 75 -13 -108 103 -104 56 8 -92 96 -105 42 29 -100 96
2961 96 -101 25 56 -98 71 -84 7 64 -96 73 -75 -18 69 -108 84 -62 -29 67 -92 80 -52 -48 88
2984 88 -97 74 -40 -60 87 -80 75 -7 -54 94 -87 72 18 -67 93 -88 60 33 -66 90 -80 54 40
3007 40 -93 86 -64 26 47 -84 105 -63 -12 59 -66 97 -94 -22 83 -67 67 -70 -14 105 -97 51
3029 51 -12 -4 64 -117 87 38 -53 47 -65 128 26 -118 76 -20 77 -39 -90 162 -43 -6 -13 -15 148 -130 -38
3054 -38 108 -6 54 -161 38 156 -110 -16 -46 90 76 -201 71 78 -17 -38 -129 182 38 -165 14 40 162 -108
3078 -108 -164 192 58 -41 -97 1 232 -129 -118 73 75 57 -229 30 227 -72 -91 -93 167 130 -256 -6 109 74
3102G4j39j51M38j20k71R2Q7K23l43j22L99n1j14k06J71L41l89q7J69J33Km06
3124b70K30K79k36j14n2L39J5m40J64J91M0j98k27M51Jk90rQ2K97k94k29L56L6
3147A22p2k51P7M04k94j60J11J58R9m29J07L33j56r7j59L11J24m32J02J35J38
3168A71j52l09L81Q0k10o4j0L43k03k51K65L3M8k51m2L95k03j16RJ03J92l68K6
3191a33K49p9mk27K10J78l04N2J6J36j1l04K56O3j03k3j19L10j00k10J73k6J16
3214A16j69q9K84j37k6m0J7K17k75K0J32n6R4k34J25J36j90P9p2R9N5k42J86j7
3238A3j9L9j62K15n6j03J23j20J57r6j01K04j35O9k4p2J82j76N4M2p9J33j72P9
3262eP9j36J25j10M5P0j55J48q2RN8j46J69q5k7J02j36J27n9m4J24j37R4k2o0
$$ plain form
3102 74 -65 -216 222 102 -169 -77 10 233 -110 -232 167 116 2 -204 -33 308 -81 -168 1 134 136 -270
3124 -270 -40 239 3 -111 -163 176 191 -249 -85 106 146 -52 -279 172 173 -117 -126 -44 253 -41 -270 86 122
3147 122 50 -201 -124 280 -14 -174 -63 95 194 -235 -128 205 49 -48 -207 104 228 -204 -102 33 171
3168 171 19 -290 91 171 -39 -103 -113 230 27 -224 41 74 122 -129 -171 224 21 -95 -86 17 209 -159 -133
3191 -133 116 37 33 -194 16 194 -110 -58 -42 94 83 -221 35 98 -5 -28 -147 163 63 -147 26 0 116
3214 116 -53 -142 142 5 -21 -61 -44 173 -102 -82 50 -6 88 -146 -21 115 -75 4 -68 31 86 -156 30 13
3238 13 -6 33 -129 86 30 -73 50 -70 87 -9 -110 94 -41 28 4 -68 114 -62 -8 34 -45 88 -84 -5
3262 -5 74 -62 63 -47 -2 68 -87 61 -21 -12 46 -100 69 -16 -43 59 -77 50 -9 -53 71 -66 28 6 -54
3287e4J31j41Q7Jq1J28j18O4K6j23J40r4L1M0j00J20q9mQ4j11J13q4%Q0j13R7
3313C0m6k6R6j27R7k7l4R0j24R3j2m9R8j14P2Nq4J25r1M4Pp7J06r0L0M2r1J02
3341D5p2K0M8r2R3m8j1O4r3P8l8j6O3j03Q0k4l3P7j00P7j8l2Q0r0M9Om7P9p4K8
3371dK6o6R1q2L2K9p4Q6n4J0M0o7P3m7mM0q3Q4k7k3O1q9P3k9l5P9q5N5pm1P8p5
3403c5M1km5P5o3K4K2o6Q0o7L0L2p6R1o0jM9p2O5l7%N7r2R4k9l8P6j03Q0j7m7
3434c4P2p8N5Kn8J04j06M0K1n7Q5q2K9L6q8J08q6K0O0j02R9p2J4O9j12J11n6l
3462iO8j30J29m6o4J03r5R5m0p0J31j12O0nq1J48j36N1L9j06J43j41M8P7j29J30
3488E8j08K8R5j68J39p0nQ8j64J71n3o3J16j52J65n9j04J67j46J14m0j04J96j69
$$ plain form
3287 -54 77 -64 23 24 -57 71 -47 17 43 -80 60 -34 -3 37 -63 57 -32 -36 48 -63 50 -34 -34 46 -67 30
3313 30 -16 -42 54 -73 24 -3 -37 53 -71 22 10 -39 59 -55 17 22 -62 63 -28 16 23 -54 52 -38 -8 34 -57 45
3341 45 -27 -7 41 -51 42 -6 -17 47 -46 32 -6 -22 41 -62 18 -6 -39 38 -62 15 -3 -35 45 -45 4 10 -37 42 -32 -4
3371 -4 22 -44 47 -35 -3 26 -48 38 -16 -6 34 -33 40 -7 -11 29 -54 30 3 -20 41 -48 25 -4 -39 40 -45 10 3 -38 40 -35
3403 -35 6 4 -41 34 -29 -5 17 -49 31 -36 -6 26 -50 41 -19 -20 29 -43 22 -15 -15 42 -50 44 15 -23 53 -50 30 13 -34
3434 -34 38 -40 15 17 -41 63 -43 -3 18 -39 46 -36 -7 29 -59 49 -37 -17 43 -59 40 -32 -18 51 -61 50 -6 -9
3462 -9 59 -71 58 12 -52 51 -44 51 11 -59 72 -40 20 15 -66 82 -54 -3 36 -70 73 -68 -20 57 -72 58
3488 58 -50 -22 73 -95 44 -26 -31 57 -107 64 11 -52 64 -88 77 18 -86 81 -65 49 9 -95 101 -68
3512f8Q2J1r9J99k05M8J05j43J64j81O3J24k24J82j11L2J20k50K13o4m9J34k30
3535a47K46q2j26J93j80J98j03j43K76j96J07m1j16K91k63P2O6j36K22k62J03
3556b1J45k33K02j98J15J42l23K29q8K5J15l22L18p4j16J60k32K92j22j71K87
3577A30k14J76j24j25L60k95R0Jj01L08l59J22J42k04K27l00J67J68l48K63j56
3598g2J07J05l88L71r9o6J11k79L84j66j65K62k22K60j94j38M05l06J27p8p3L68
3620B54m09J22R7j47K57l78J96J70l22K43k13J91R1m05L67j23K9P4l40M23j63
3641A4j29K04k26L33k41j34L56k66J73j52o4L90m05J29K2p3K77m26K11J34k38
3662a11K22k86K43Q2l71L13j41R9M1l35M19j66n9J10k24L70k25j15K72k36K28
$$ plain form
3512 -68 14 25 -74 125 -80 -32 73 -70 94 -87 -24 100 -124 58 -53 -21 99 -151 62 -2 -51 83 -147
3535 -147 99 17 -109 84 -96 102 -1 -144 132 -64 43 2 -114 177 -86 -14 52 -84 138 -124 -21
3556 -21 124 -109 93 -105 10 152 -171 58 -30 -5 110 -212 106 32 -84 76 -156 136 14 -157 130
3577 130 -84 92 -32 -157 203 -92 -2 -1 -102 206 -153 -31 111 -93 134 -166 1 169 -179 84 -72
3598 -72 35 140 -248 123 24 -42 69 -210 174 8 -157 105 -117 143 -51 -189 216 -90 37 -41 -114 254
3620 254 -155 -33 64 -83 174 -204 -8 162 -160 83 -130 61 152 -253 114 -9 20 94 -246 177 14
3641 14 -115 89 -137 196 -45 -179 177 -89 84 -68 -132 258 -147 -18 4 -69 208 -218 -7 127 -111
3662 -111 111 -175 68 150 -221 92 -49 50 91 -244 175 9 -50 60 -164 206 -19 -134 138 -98 130
3683A30j98n7L46l38J56n7m6K73l89J85P2j61K16l12K22P6k72K45j82J55K5l06
3705b17L53j58QP6k25L41k13m3J78k11K52j96l0K39k53J72r7k5K21l08J78rq9
3728e6J88k77J96K7j64J89k04J49J3k16K58j69Q1L4j79K58j80K7Q4j70K22j65
3750e4KJ48j97J73j03k2J62k17J58n1m2J45j95J51l5r4J68j86J28j3r7J61j62
3773g2P9M0j25J59j36N2N2j29J54j18K5O5j31J45q4nQ1j36J43o7l1R3j22J18o1
3798a1k9R9j17P7j6l8R4j12O9J4n6P3j14Q1K5q1P1o5M2J3p6R7n6KK3n8Q5n5j0
3827b9L1m7P4o3lO5n5M4m0J7L6p1L6Kj2L5o7N7J3m4L3m2L6rk5M4k1Rnk4M9l6j2
3860b4J9lK3l5JJ5qKj3J7Nj7J3nQLk4L3ppNk8N6k8j1K1j6J2j8K8nj7J5oNKk3J7
$$ plain form
3683 130 -68 -125 221 -117 39 -18 -64 209 -180 5 77 -84 132 -180 42 118 -154 91 -91 64 89 -217
3705 -217 136 -22 -14 62 -163 178 -35 -78 100 -111 141 -55 -85 154 -99 73 -24 -49 172 -136 42 33 -56
3728 -56 132 -145 51 78 -86 103 -101 48 61 -155 103 -66 15 49 -130 128 -52 -25 59 -111 111 -54
3750 -54 -52 96 -101 72 -31 -53 109 -108 50 -1 -43 102 -93 58 23 -71 97 -89 39 26 -71 90 -72
3773 -72 7 47 -78 81 -55 -3 49 -80 74 -44 -19 46 -85 60 -24 -29 52 -84 59 -8 -39 54 -68 50 -11
3798 -11 -40 59 -58 19 3 -35 59 -53 16 30 -26 47 -67 14 39 -42 29 -36 6 19 -57 40 -16 -14 9 -49 36 -19 -29
3827 -29 2 -45 29 -34 -37 28 -27 17 -23 -6 30 -41 -5 -3 -15 20 -47 10 23 -21 12 -30 6 -3 -28 16 -5 4 -1 -25 24 -12 -24
3860 -24 -5 -8 15 -20 -19 -4 -12 -10 -23 -6 -1 -18 -5 -10 -2 1 -23 10 3 -4 1 -27 29 1 -10 11 -5 7 -11 17 12 -5 10 4 9 11 -12 5
3898EpQjj7J6klJ0j5nNKLj5NMLQk7K3J8l2K6j1Pjk3K4KqOj9K8kl3K9j6K5oj8J8
3939A4j3L%j5M1l7rK7j2Ql1LN2n0K7j6jL7n7K4K3l4K2m4N3J7o5N0l0K7%p3Q0j7
3973DKnm1R2n0k9N2l3N7p1k3J09o9K1l6oR6j24L5L2k9P4j30P4M8j12P0o0Q7J5
4003E0j50J22j5NNj09J67m8p0O4p1J31q9q5J71r7O4r1k1J96j70L2J2j6J34k32
4029a11P8J18j19Q1j60J41P9k28J31m8R1Kk29K44m5n3L7j36K72j43j13J72j06
4052d5J50j70o3K92j99L7n3JK39l28R6Q9o3J29k77J77J23k45J46j35J66L9l23
4075b17K95p2NJ7k41L61j34j23J39j37K75k26j03K99k04J21j44mL05l45J03L2
4097Bl6K13l78J88J28j95J58k52K45O2l31K78j39J16jk93L85j55m8Q9j92L39k29
$$ plain form
3898 5 -2 6 5 -12 4 2 -1 9 -6 -11 -6 -4 -1 -16 -11 -7 -4 4 -23 0 18 -14 12 1 8 7 -16 8 10 2 8 -11 17 15 -18 11 -5 20 14 -4 14
3939 14 1 4 4 -11 30 -7 -16 11 -1 7 -24 -21 31 -19 8 -8 -9 28 -29 -5 18 -16 6 -38 15 32 -33 17 -13 14 14 -59 21 4
3973 4 6 1 -40 52 2 -27 25 -8 49 -22 -45 64 -5 16 -20 -26 70 -54 -19 13 -16 58 -72 2 50 -62 8 -52 35 50
4003 50 -100 22 7 12 17 -92 75 27 -43 21 -50 81 -8 -93 78 -19 45 -46 -67 129 -41 -9 3 -13 121 -111
4029 -111 -33 85 -34 47 -113 28 107 -121 10 -38 53 55 -174 70 25 -28 9 -127 145 2 -111 61 -45
4052 -45 105 -65 -128 164 -35 2 -51 -50 189 -139 -43 46 -17 112 -165 12 135 -110 36 -99 67 106 -217
4075 -217 78 6 11 28 -213 148 14 -109 30 -107 168 -58 -161 138 -66 55 -89 -93 212 -133 -30 2
4097 2 -34 179 -199 -11 117 -78 80 -172 73 135 -196 82 -57 59 58 -235 150 -5 -53 36 -156 183 -46
4120d6r6K52k16K33j98o0L16l16J58o7m1K74l83J90P0j53K14l20K44N5k64K60
4142A06k15J57M2k91L59k08L6R9k63L60k35j5J84k61K92k11k9K47l10K58j35o3
4164i6K58l43K58o6j28K69l04K11k2j79L12l10J63M1k04L06l01J35J19k54K70
4185A35k34Q7J47l09K82j54M0J23l01L15j17q4J66k58L06j37j43K57k27K07j35
4206c4j19L38k79R0op1K75l43J17J26j52J56k62J80J38k95J82j15J38N1l27K98
4228H6n4m4N4k08L37j48j44J71j03K06k09j02L22j94N0r1J0K65l28P3Q7m7J26
4251A15k89J75J28k08Q9j21J91K7k94K22k5L0m1j71L01p9j26P9n8K11j89j07K40
4274A00r3L8j32L3K15k26K4K8K9Q1k37J26J04j16K7j06J65K1j86R7kO4n3j34J99
$$ plain form
4120 -46 -142 110 -106 127 -71 -131 185 -131 27 -40 -81 193 -190 0 70 -83 131 -189 55 110 -154 106
4142 106 -109 48 90 -201 158 -50 -14 85 -178 182 -53 -68 116 -145 147 -64 -93 154 -156 102 -33 -96
4164 -96 162 -181 77 11 -117 152 -152 59 37 -142 170 -140 23 64 -140 166 -135 0 119 -135 135
4185 135 -99 -12 135 -174 108 -46 -6 117 -184 131 14 -70 96 -162 144 7 -136 121 -106 101 -34
4206 -34 -153 185 -94 -4 -10 -81 194 -149 -32 94 -58 98 -164 16 154 -141 41 -74 64 115 -212 86
4228 86 32 -12 42 -166 171 23 -121 50 -53 153 -56 -158 164 -30 20 -71 -61 204 -124 -51 36 -11 115
4251 115 -174 1 129 -79 10 -111 80 107 -187 35 10 40 -1 -172 129 50 -76 3 -55 156 -33 -140 100
4274 100 7 45 -87 -54 161 -65 -41 -13 16 97 -140 -14 90 -26 1 -105 60 81 -105 -8 -10 54 1 -133 66
4299F6l9n8Nl9J71j33n4J14l1M3j20L7J36j22Mj0M4M9j41O2N2k4jr8J18J8j01
4326e2L9nO2m5o5R0j8j1l3mR1o6k3M0OJ6n8J5N9l9j0j9M8J3p5L5J1Oj5k3L7Ol2
4359a9NJ2K7j5l8L2NKk6PK7j5j7kK3pk2J8J3j9j9QJ8Lj9oJ9Pj6LRoOj2PJ7j4J2
4397HoRk4%J4jOppK3l5K3kj1J8l2K5%j1J5j5OolJ8j3nNkm%j1K7j5J2j0J1J8k5
4436gJ0Oj2NmJ3Mj7qJ4mQj5JJ7rJk0J5J2j3nPpKj0J3Qj4NoJ2Jl0J8OlJ0k2K8j5
4477ej9L2j7J4j4k0M1j3Jlj5O1m7jJ7j7L4n2J5M4o1M3m5K0M2p8M2KpK9q0P3on3
4511d3N3o2P3ro6Q4m4L0j5n2J17q4KL0m3R0q8J0O2p3P4o6NQ4j17P4m1pP4j21R6
4542B7j7l7P2j19J07j9o9J06j08O9pp2J41j24N2L0r6J35j12K3P6j36J30q3J6P7
$$ plain form
4299 66 27 -31 -26 -65 106 -27 -81 33 2 45 -75 -38 98 -24 -20 -30 14 63 -78 -16 36 12 11 -87 31 49 -52
4326 -52 -13 -18 44 -1 -66 24 6 -5 -38 -42 49 -17 -40 0 6 22 -36 -21 38 -1 -11 -30 18 31 -44 -9 2 8 -7 -30 7 13 -19
4359 -19 -14 -2 25 10 -28 4 9 11 -15 -8 19 4 -13 -15 8 1 -21 -3 10 -9 -28 -20 -2 1 -18 -24 -5 2 -14 -11 -2 -8 -2 -14 -7 10 -4 8
4397 8 2 11 -13 -13 1 0 6 -1 -8 15 -20 3 1 -10 8 -24 1 1 -10 5 -10 -4 -10 -13 5 -8 -13 -8 -10 -14 -14 -25 2 -13 -1 -11 0 18 -7
4436 -7 3 9 -3 2 -2 11 15 -2 -10 4 0 8 -7 -6 11 2 3 -17 -2 10 -3 -8 -1 -8 -6 -16 -3 5 -9 -4 -10 2 3 -27 -9 -3 -6 4 -18 10 -5
4477 -5 -24 8 -9 5 -9 -29 12 -1 0 -3 -18 43 -4 -5 12 -5 29 -23 -8 36 -25 18 -27 -7 35 -43 -1 1 -6 23 -57 16 10 -43
4511 -43 10 -52 21 12 -54 30 -14 16 1 -51 66 -18 -16 14 -29 61 -27 -17 45 -28 46 -20 -15 69 -48 26 -15 -22 52 -69 27
4542 27 10 -27 45 -74 33 14 -55 51 -57 12 5 -67 74 -50 2 32 -64 71 -41 -18 58 -78 52 -31 -15 62
4568F2j49J49p1l0J14j54J40o2o0J42j49J09n0n1J70j96Q6K7p1J33k02J26N5j43
4592g5J25j54J21O2k12J83p9N0K0j92K55r0n1N1j03K43j69j01J89r6J12j63k0
4615i4K71k33J9qN2J52l21J11J56j07L5k11K49Q2k97J20k1J68q1k84L31j4q9n1
4639f5r2L83k18j91J97nJ53k90m3L84j93n9r9J47K53m20L3J94J7ql45L02J89l14
4663i0J1l4L05o9m08K99R0lj89j44M75j48k69R7P8K51l85j19M05n7q2k44J95L52
4687C17m17o8J48J61J3m58K69K60k02j17j05M05j4m46J80J48J28k55k36M66j4
4708A63k33q3J01L42l40k09L06P0k1l29J17M03k95j38K9K35Q5m54J37K68n2j35
4730c3k17L71R9l72M4J00K21j90l04L63P2j35j59K2L79k19k28J67J08P4l32L1
$$ plain form
4568 62 -87 62 -9 -39 75 -79 61 -1 -61 81 -68 41 -9 -60 110 -86 0 27 -44 89 -113 13 68 -75
4592 -75 50 -104 17 79 -133 50 -29 21 41 -151 104 14 -37 14 -89 154 -15 -116 73 -23 89 -74 -94
4615 -94 177 -56 -37 -45 7 159 -162 -51 105 -2 33 -178 71 153 -144 -24 -45 123 42 -242 89 75 -14 -65
4639 -65 -157 226 8 -183 14 9 162 -128 -171 213 20 -39 -138 9 262 -158 -125 69 86 78 -267 35 224 -90
4663 -90 -79 -113 192 123 -285 14 104 101 -88 -232 243 95 -174 -77 1 252 -133 -252 153 96 14 -230 -35 317
4687 317 -100 -168 -20 141 154 -304 -35 225 23 -94 -199 206 192 -254 -74 74 202 -53 -289 177 163
4708 163 -70 -153 -52 290 -50 -259 47 117 96 -233 -116 287 -8 -146 -117 118 203 -251 -114 154 102 -33
4730 -33 -250 121 220 -152 -108 -8 213 23 -281 82 154 19 -140 -118 261 42 -186 -19 89 163 -169 -138
4752a38L40j40j20j01K14J52l53K6J69N4p6k54K68J36k26m9K1K47j11k65K06R1
4774I1pj82l9L10j17j67M7R0J27k44k1K04k9p6j17J43J43k07l6Q4P9l0j95J46
4798cJ04j03n6l5J76j9j90R9M9M8j12o8J81l4p1k1M4J07j30m5J13lqr4M7J08j10
4825b6rK0N7lj07N0O0l1m1l1J00pp6L1K2K7n6l4P4j2j9j3J1M4m6k9M2%kk8J0M8
4857B6l8mlK3Nl6K1K2lj5j7K8Qk6oJ9Mj0j0K1Kl2JJ9KqjlJ1j0Mj0J5Jk0K2mln
4896a0j3K7j5j0K8omj2NK0k5K0ljRj7PPj7J8moJ6l0J4lmQj3Q%qK2k0JnJ1J3k2
4935a4J2Jj1J8j9J0pNJ1j9PJ2nL%pOrLmJ7oj2J5ppJ2pjlQmKpLJpNJkjJjlPLJk
4983aMj9K6j6RPj8L5l3NJ4nPk7J5J6l2J5j4J9%m3N2Jj8J2m1O5l2k3K7j8L4l9j8
$$ plain form
4752 -138 202 62 -58 -159 55 207 -146 -120 49 103 27 -227 41 177 -49 -98 -77 170 59 -206 0 91
4774 91 84 -98 -137 173 56 -111 -64 26 153 -91 -112 92 63 -13 -130 13 156 -51 -87 -3 76 46 -149 -3
4798 -3 101 -2 -58 -93 83 64 -126 -27 22 70 -42 -110 71 37 -34 -55 -11 96 -34 -79 34 31 23 -71 -24 84 -26
4825 -26 -35 -15 42 39 -68 -18 42 11 -30 -61 39 32 -44 -13 9 36 -20 -54 20 8 -11 -24 -13 31 -15 -44 -2 -2 -4 -32 -22 26
4857 26 -12 -16 -19 4 9 -27 -6 16 13 -2 -19 9 17 -9 -15 4 8 -2 -12 9 11 -21 -20 -1 1 -7 -8 -11 0 -10 -6 -16 -1 0 -20 2 -2 -5 -10
4896 -10 -23 4 -11 -21 7 1 -3 -15 -10 10 -15 5 2 1 10 -7 0 7 -10 8 4 -2 14 -16 -2 -5 -9 -1 -14 -6 -6 -14 8 -12 -11 -16 -5 8 -14
4935 -14 -2 -1 -12 6 -13 -3 -10 -5 6 -13 -6 6 1 4 4 -3 3 -6 -3 -7 10 4 -8 7 0 -7 5 -2 -3 -6 2 -2 0 -7 -4 -3 -10 -5 -4 -6 -7 -6 -7 -10 -3 0 1 -1
4983 -1 3 -16 10 -6 3 10 -8 27 -6 -1 13 8 15 -12 3 19 -13 2 -12 7 7 -36 16 17 -1 11 -30 35 3 -20 7 -11 23 -16 -34
5018c4O8m3Nk1QQ1r8PL3j8M3q8N7N8p8J3l6P8J4j08O4J5J9k9q7J38k3p1K2k8J32
5049I3q8r0J27k4K2j04jJ72j13m2J5N7P8k14O9J10m1j3j37J65O7j90L9J9J20n8
5075C8k07K18K7o1p9l6K66j41j52J22L1J07k41k3K86j11p5j01J41K05l26lJ54
5098C9N8l5k88K39J64k19m1l1K86o0l46K22R3K0j89j22M15j03k21J5J13K52l67
5121a06j06L28Qq0k67J94L22l57q8J03K07om33K17K60j36j54j33M08J1m04J09
5143a03J50J76k75k49M59J6k18j47J08L99l52k23K86J14Om09J29M32k71j64l9
5164a75L20J20n14J24K51K2j67l03M60J09l74l0R1L41k50l44L73J04q0k77J9M94
5186C14k74k48J10K02J47m76M1L84j03j44k09L26K22m62J9J72J82j43l76L54J73
$$ plain form
5018 -34 34 -9 -4 -25 -17 64 -34 -27 6 -12 31 -57 0 58 -20 -7 -43 35 49 -59 5 20 39 10 -77 61 38 -33 -11 -39 93
5049 93 5 -85 42 18 40 -64 -65 107 -6 -48 -33 24 102 -112 -43 67 26 13 -124 41 108 -82 -43 -24 96 38
5075 38 -169 49 76 15 -64 -100 166 25 -127 -5 26 133 -108 -131 155 44 -31 -132 9 214 -112 -115 39
5098 39 97 62 -226 13 177 -42 -83 -114 172 112 -234 -12 81 101 -88 -210 205 102 -119 -104 9 261 -106
5121 -106 -212 116 124 44 -223 -29 293 -64 -152 -49 158 152 -281 -64 196 60 -94 -227 181 192 -212 -103
5143 -103 47 223 -52 -301 158 174 -44 -191 -83 316 -36 -259 27 141 147 -262 -133 299 28 -136 -175
5164 -175 145 265 -249 -125 126 148 -19 -322 138 247 -127 -157 -66 275 25 -319 54 158 78 -199 -180 314
5186 314 40 -208 -98 104 251 -225 -184 200 97 -47 -256 70 292 -170 -151 21 203 60 -316 38 211
5207B11k23j31j2M10j51l58K28J31O1l13n4M23j35k01k8J69K30l89n4K69J2n7
5229C8k86K33K44k89o4M7K21k9l54K16J63p7j29j21L60n8k65Q6P2J58k31j07K87
5252A15l4r4j03P8K42k57o4J14O1K9k47J28J73j61k4m7J60K9k48J22N2K9p9j14
5276a40K16j0j26J7JJ52j16q3J44l2J3r5RJ68j48nK4L1M8j53O6P0n2Pp6R3J8j01
5304f0O0j1L2oo9Q5k4k8K1l2P6n4m6O9k9K6l0j9Q1n8R%qL7m9L3Nl4L7k0J3Kl5
5337b6N5m6J8Pm0M9l0JJ9l0K7j0J0J4m4L0olPk6L5ok5J3KJ0j5j4K2NqLj0K8j7
5372aJjJ0Kk7J0J7qj5OK1mj8mJ1OpjJPk1LOJ3j0j4NJ7k4LLPJlmK1j8mnJ7J2k2
5414a1OOokrK3%j0nKJ7j1%mrPJ4k1QJKmjRk3NJ6j0J0kj2J1j3J5qmKJRlnJ9j6q
$$ plain form
5207 211 -12 -143 -155 255 104 -254 -26 105 166 -147 -201 222 87 -114 -142 27 257 -132 -186 83 95 38
5229 38 -248 -15 229 -60 -124 -77 144 115 -239 -23 140 63 -66 -187 173 115 -150 -64 8 166 -65 -172 115
5252 115 81 -13 -116 -38 204 -53 -117 -3 58 87 -160 -32 141 -20 -44 -91 69 98 -150 -28 24 53 -26 -140
5276 -140 76 66 -60 -43 -42 110 -6 -89 55 23 36 -59 -50 118 -30 -35 -11 20 68 -85 -19 51 -1 6 -70 23 41 -60
5304 -60 0 -11 21 15 -54 31 7 -21 0 -32 44 -10 -56 13 -16 10 -20 -39 42 -16 -7 -7 -15 22 -27 6 11 -23 14 -6 7 9 -26
5337 -26 29 -17 1 8 -32 17 -13 -12 7 -23 4 -6 4 18 -26 4 -2 -5 2 -24 11 5 -20 -7 -5 5 -10 -24 -2 3 -5 -2 -12 16 -1
5372 -1 0 -1 9 11 -16 -6 11 3 -12 -6 15 11 -7 -11 0 6 -1 -2 -1 6 -15 -12 -6 7 -3 -17 -12 5 -19 -16 -13 -6 -5 -8 -12 9 -9 -13 -18 -1 11 -11
5414 -11 -5 1 -5 -7 -16 7 7 -3 -8 -6 11 0 0 -4 -13 -6 8 -13 -5 -4 -2 -6 -7 2 -21 -16 0 -10 0 -2 -14 -3 -16 -1 -9 -13 -11 -10 -1 -4 -9 10 -6 -14
5458a4MQJ1k1J4Mj5OlJ3lj3oORonJ8lj6mkJ7%j6NJ0Jk6J7J9mk6J0OJ5j8qJ7Lq
5499dqOK3ml6K6J2lk9JL6pm2J7J7K1l8j5M6Ml6l0K9N2m8l4L5K6%n7J4N9k9l4j9
5534d9N9K6q0NM8L1l7p0R1L1p6k9K9Q9n8o6M6M6Nr1rJ30m1p3kP0N3j41j5J11J9
5565E2n9r2J03Q4j15n1N5R1l2j60Q2J09l0r4j6J50pj52K7Q5P0j38q1J82K1r9r4
5592a09R8J61j70r6J12R4k4j97P5J79r5j07j1J75L2k47N8J31M2j28j32K26M6j64
5616e1o2R0J70j43j69J68R0m4j71M0K46j25j41K8J45N5k43PK05j1j16j12J99R7
5640A52k30k5J11J28j10k10J99R9j10j07K4K18q9j98J02J16K2j94l2K47n5j25
5662f7l7J15J34k27l5J62K7m4j62J34J39j61m7K4J39k3k06J22Q4l6q2o1K03m8
$$ plain form
5458 -14 -10 -2 9 -12 2 6 -9 -3 -6 7 4 -9 -15 -9 0 -6 -11 7 4 -12 -16 -18 -1 -1 -17 -12 -2 -1 -27 -10 9 5 -21 -11 -5 10 -8 -16 1 4 -4
5499 -4 -12 -6 17 13 -23 3 15 12 -17 -16 20 13 -29 -12 5 26 -12 -27 19 23 -13 -43 -14 38 -10 -44 -9 17 17 -40 -26 33 4 -30 -49
5534 -49 10 36 -44 -39 9 40 3 -67 24 55 -21 -50 -21 68 10 -56 -10 36 41 -50 -59 71 30 -43 -45 25 78 -63 -78 33 52
5565 52 -7 -99 4 88 -27 -78 -23 68 36 -124 -42 67 37 -57 -73 77 70 -82 -55 30 100 -38 -119 63 84 -15 -109
5592 -109 -11 150 -20 -116 -4 90 66 -131 -56 123 28 -79 -90 85 117 -130 -72 59 101 -27 -159 67 113 -51
5616 -51 -113 -23 147 4 -165 3 93 49 -122 -82 164 39 -102 -74 71 126 -117 -110 95 84 -32 -144 55 152
5640 152 -78 -103 8 136 26 -184 15 114 4 -103 -79 139 50 -148 -46 70 92 -102 -134 113 58 -67
5662 -67 -104 11 145 -82 -117 45 72 28 -134 0 139 -22 -69 -45 94 71 -135 -13 71 35 -47 -108 95 47
5686D7j24L9L9R0j33o7J66l0k2p5L5J51j62qN8QL2j44R1O5p3Om1Q9J0j37J02Q
5714B0%j8o7J20n2l0L7l4O8p0j3P8o7M4k7qN4p2N3jn0M8m1M3j2p1Q8k8%Mm6J01
5746E1p1j8M6l1N2p5K3P9p7%j5N1M7j32N1M3mj7q0J16Qr0J6J4Q2p3q9J19Ol5n3
5777e6J5J22r5o2O5L2L3j44L7J16m9n5m8J31L8j47J8P3L6o8r4J39L8r3k6K4J08
5804H8q9q6Q5N8k4r9J5J33o0q6L3O3K2j23J3R6Oq0l7Q3N8j08k4P6L7m6r2J01M3
5833E6o3n3K8R4l9r2N1N6lp6rJ05k5o3nN9K9q0k0Q0Om5n6P7M5p3k8L1M4l5n5N9
5865@L9l7l6NO6l0m5J0L9Pm7oO2pm9JM2J0l3k3M2K1m0j8L1J4k4k1K4K4j5k2LL7
5899B4j3k9J0K6qk9J0J7jk1j5K4J9l9J3J2Mpj6J3J6j6LJJ0rj9L1Nj9qJ0J3Jj5
$$ plain form
5686 47 -77 -38 1 91 -42 -109 57 27 5 -70 -35 116 -46 -54 4 12 44 -100 -9 56 -17 -11 -52 37 47 -90 12 20
5714 20 20 2 -65 55 3 -27 10 -24 44 -26 -39 39 -28 16 -11 -19 35 -37 16 15 -35 13 -28 15 3 -68 20 -8 -8 -4 -50 51
5746 51 -20 -38 8 -23 29 -46 -23 56 -21 -21 -36 15 62 -70 -19 24 20 3 -77 39 47 -43 -27 -13 69 -4 -93 26 32 -3 -56
5777 -56 -41 81 -14 -76 -11 21 54 -90 -53 63 14 -41 -89 42 80 -67 -49 24 60 -8 -102 37 75 -18 -44 -20 88
5804 88 -1 -87 -2 56 32 -67 -52 81 21 -65 -32 31 53 -70 -57 39 45 -35 -72 11 69 -39 -63 13 50 4 -88 13 56
5833 56 -7 -60 -32 62 23 -69 -18 38 35 -41 -50 55 30 -33 -38 21 50 -30 -50 30 36 -9 -65 12 57 -16 -44 -13 31 -4 -59 0
5865 0 39 2 -34 -29 37 7 -38 -28 11 18 -29 -35 27 20 -29 -28 14 24 -9 -32 10 31 -9 -27 4 18 -6 -27 -3 21 6 -16 -13 24
5899 24 11 -18 -8 18 10 -19 -9 8 7 -14 -29 -5 14 -25 -12 0 4 -3 -19 -6 10 -6 -3 -2 8 -1 -20 11 16 -3 -11 -1 12 13 -2
5934bjLjj4OJ7oj3%J0%rQj0NkkRJooJ5j3NOKrkjlQpQQj4KjJ9j0j2LJ2kpmJ3rj6
5982b2K1lMj6kK0nqkMRj8mOQNj2MPlj0k0M4j4j4PJ7Nk6MJ8Oj2j5J8Qj4j9J3K9
6022A8j8j6RJ0Rk8JK4nj5j0K1Rk4j4K4J5j3l5K4K8k1j1JK8j0k4K0J0pj1j7M6%
6056A8k4mNL4m2j4L5Pj5k1J2L9l8lmJ9K1n4J2L3k0j0j9L6K2n6K3OK2k3l1N0j0
6089Fj2mmL9k5j9L6k7K1l7RM2l4%K%L5m7J8J2rNm1L7%l7L7k0K2nk6M0m2PJ7j2
6125a6K0l0J7K7m9L1oJ2Oo3N6Qk0lk2P6l2m9N4KRn6j2R3m2k3k1M1N8j12MP6j3
6158B1j6p8P7O7j00k6L2Q2l9j18Q7P0k7q9k1J66m5j22K9Q8M3j33n8J64J0q3o8
6185h7R5J23j66o2J10O6m7j63J15J34j00j07J4J74k5j87N4J41%j54p2K32J2j69
$$ plain form
5934 -2 -3 0 -1 -15 -9 8 2 -11 -11 -1 -1 -10 -2 -12 -7 -9 -11 -2 -1 -7 -13 2 -11 -6 0 2 -7 -9 -10 -13 -5 -12 -4 4 -10 -8 -9 10 0 -12 -9 3 1 -6 -10 3 -6 -22
5982 -22 -1 -4 0 -16 -18 2 -3 -11 -13 -9 0 -18 -22 -16 -8 -3 -15 -11 -4 -7 -17 -37 7 -7 -21 -14 3 8 -18 -14 4 10 -2 -17 1 9 -5 -24 -11 18
6022 18 0 -16 -7 3 12 -16 -15 9 4 -11 -21 0 9 -15 -29 -5 10 -3 -38 -14 14 -7 -18 -17 11 1 -23 -3 7 0 -11 -28 18 18
6056 18 -6 -10 -5 29 -13 -27 8 15 0 -21 -9 30 -8 -11 -15 4 25 -29 -17 16 -4 -14 -33 3 25 -31 -8 -2 20 -3 -34 16 6
6089 6 -6 -10 -14 25 0 -19 17 -10 11 -26 -17 25 -9 -9 -7 -7 28 -19 -1 11 2 7 -34 3 3 -34 3 -17 5 0 -26 14 -28 -21 -4 -16
6125 -16 4 -26 -9 18 -31 0 -6 6 12 -51 5 13 -7 -10 -32 44 12 -37 17 19 28 -28 -40 53 11 -12 -33 8 66 -46 -42 34 21
6158 21 5 -73 4 71 -29 -55 -23 59 20 -98 -11 59 32 -57 -78 88 43 -79 -50 38 81 -52 -110 54 64 -19 -87
6185 -87 8 131 -35 -97 13 79 32 -131 -16 118 18 -89 -75 99 74 -113 -59 82 82 -72 -144 88 100 -69
6209f9m0J22J35j88j08J82Q2r4j63J04K05j53j47O9J85k3k42N7K12l6j69n0K26
6232I7M6k40k3J64J12j93j33K18R4j63j35J32J90j42j89J35J50l9k29N2K34p3
6254F5j83jK13L5k37j9K09M6j59j42K19J16k05r9J29J72j29j91J47J51r5j64L8
6277h4K33p6j97M0J80K2k22j8K16kj48q1J73R5j83o4J21J08j08j48J38J21j08
6300Hj24N2J84n5j87P4J21%j59qJ82jj52k1J32O4j58o4J40P8j06j13J14R9r8j00
6326i8P7J11n7j33N8J12k9j05jJ16Mj16MJ03J7j08l4J17K2q9l0O5O5q8m9P3M4
6353E1l3p6M5P3m6p0K2P6rq7K8O1pm7k9O9J5o6qM4L0m7m1O0J5l3k8L0L6k6l7K5
6385a0L0j5l9K2M0j0l0LL0Jl8rM3%k9qL4ll0%J8Qok5J9J5j3rORnj2KK0oj8QOk
$$ plain form
6209 -69 -109 13 148 -40 -148 34 116 22 -141 -37 168 15 -132 -63 122 99 -143 -86 126 90 -79 -129 97
6232 97 143 -97 -120 44 156 -37 -170 48 142 -21 -156 -24 166 24 -165 -30 120 81 -148 -96 138 65
6254 65 -118 -119 94 129 -108 -127 82 128 -31 -173 46 162 -43 -142 -13 159 30 -161 -14 137 42 -122 -84
6277 -84 149 73 -124 -84 96 118 -104 -122 94 92 -56 -137 36 131 -52 -116 5 113 5 -143 -5 116 8
6300 8 -116 -64 120 65 -122 -48 73 73 -86 -94 88 87 -65 -86 46 110 -48 -112 28 106 0 -113 1 100 2 -98
6326 -98 -21 90 33 -100 -42 70 41 -64 -65 51 55 -61 -57 46 63 -45 -79 38 60 -29 -59 6 71 -17 -66 7 51
6353 51 18 -58 -13 60 14 -56 -34 42 33 -54 -26 35 28 -19 -48 21 36 -30 -38 6 36 -11 -52 8 23 -10 -38 -8 28 2 -35 -10
6385 -10 20 5 -34 -12 28 18 -12 -9 21 22 -16 -25 18 18 -11 -19 15 12 -18 -18 0 8 2 -23 -4 11 -2 -11 -5 4 -1 -13 -11 9 3 -15 -7 -1 -3
6424cqMJ0nKk2K4Npj3J9jr%OM%j4J0Kj2J1lLQj7PJoKOomLOljjRj0MlKpKKoOlQ
6474BojMkLJ0oJj%rPLKj4J1rMkl%OloKLlJ4k1PJ1j1KJM%kQj2PjjkRLqj0J4NJ0
6524B0k5MJ0lj2MNqmoJ2MMk4J2Oj%pJ7ok5RPOj3j2L3rqj4K3J6k7jJ5OLk7NL3r
6566A3k4lL1J3o0J9J7J3k8k0N3kk9j4J3L8k6m2L3K8j6l5%P1k5m0qN6J8q7K1N0
6598B8rk6m2O9L3o9j8L0P0o0o6O3N6m6o4K1R7l5r3L1P6J1j19MJ05J4r2m8R5P3
6628H9j19n4Q5O9o7j07R4Q8o4r4J8J48m2j30M5J08J1j41l3J65J9j38n3J41R1j51
6654b2q9J43P2r4j38J03J52r9j38M6J71l0j99M7J69rj66m9K09L5j90l7J48J01
6678A36j57j25J80R1j14j43J01J86j37j49P9J72m2k13L9K19l0j86k5K13M8k32
$$ plain form
6424 -3 -11 -7 3 -2 0 -22 2 7 0 -13 6 5 -4 -4 2 6 6 -8 2 4 -8 3 0 3 11 -6 1 2 -4 -2 4 -2 -6 -3 3 0 -1 -2 7 -3 1 -2 0 -7 -5 -3 -9 -3 -6 2
6474 2 -4 -5 -1 -3 0 10 4 5 4 4 -5 2 5 7 -7 4 -5 -1 -3 -6 -6 0 -3 -9 -7 -4 -7 7 -14 -7 4 -7 -5 -4 0 0 -2 6 -6 1 0 -1 -3 6 9 1 -9 5 10 20
6524 20 -5 -1 9 6 -6 -2 3 -5 -9 -15 -3 1 5 -19 -7 -1 -2 -2 -9 8 2 -23 -14 -7 -1 -14 -26 7 -2 -10 -24 -1 15 -12 -13 2 8 11 -16 -11 22 13
6566 13 -11 -14 17 30 -30 -11 6 19 -9 -29 24 22 -7 -21 -8 30 4 -38 -5 23 7 -28 -28 43 18 -22 -30 26 44 -43 -22 28
6598 28 19 -7 -49 20 53 -16 -34 -4 66 6 -60 3 59 13 -51 -30 67 32 -61 -30 46 57 -62 -58 47 61 -31 -79 16 89
6628 89 -30 -84 1 70 3 -104 -10 78 14 -80 -62 86 44 -86 -41 67 78 -63 -96 69 88 -50 -103 38 129 -22
6654 -22 -111 32 104 10 -128 -25 127 28 -110 -64 107 77 -122 -75 94 85 -81 -130 79 114 -76 -113 35 136
6678 136 -21 -146 34 125 11 -132 -31 155 18 -131 -52 120 78 -135 -96 123 93 -93 -118 95 143 -89
6700h9l0J83Q3j73j37K05J17j63j39J09K04j58j80J31J72p0k13M3K48n4j99j3
6722a23K21M1k50k4K10N8j61j30K00J20j96j17J50J58j23k02J41J68p9j85L1K30
6744A38n6k00K9J88K4k25k0K06L1j70q2J74J20j99r8J51J24j23j54J21J51j02
6766B8j44N6J77n0j82M7J70pj71j8J78K5j70l3J29P7j37q7J42O7j01r8R1J35j13
6791A1r9O0J15l9j53O3J31m1j17kJ39%j27lQ4N9j18m0J09M3q7o2P8Q2p9o6N5O4
6819F0m0q4M8P4l3p3K1P0kq6RN8K1o8k2P7K1o8k9M4M0m5l5M4L5l6k7K0L6j4m6
6850c0J4M1rl3lN2j6l5qM9Pm3j0L8Jj4k2L4%j0mRJ6rl2J9J6j7j6MK8j7rJ7ojp
6887fOMplLNNj6KJ0lNOrRnqMLPj5NqkJ5pqNJljJ1j2NjJOjr%N%jj5J1RqLkKQj2
$$ plain form
6700 -89 -119 64 147 -26 -163 42 159 -4 -143 -34 170 12 -168 -37 135 65 -148 -105 143 89 -110 -123
6722 -123 98 139 -111 -135 75 133 -28 -158 42 162 -34 -151 -1 157 34 -168 -27 141 62 -123 -92 138
6744 138 82 -118 -89 99 123 -102 -122 84 115 -55 -137 37 157 -42 -140 11 135 12 -142 -21 130 28
6766 28 -116 -60 117 67 -115 -68 102 95 -76 -94 84 109 -61 -94 35 112 -25 -112 30 97 -4 -102 -11 124 11
6791 11 -88 -28 87 48 -105 -42 89 48 -69 -71 68 68 -59 -62 22 81 -37 -77 32 75 -12 -74 4 86 7 -59 -4 60
6819 60 20 -64 -16 58 25 -48 -27 43 41 -45 -36 22 43 -25 -47 30 51 -17 -46 -2 38 -7 -42 2 37 1 -26 -6 30 16 -30
6850 -30 -16 25 16 -17 -20 32 16 -19 -27 22 29 -14 -24 14 15 1 -21 13 13 3 -1 8 24 15 -17 2 18 1 -15 -11 17 0 -9 8 2 1 -6
6887 -6 0 4 -3 -6 -3 2 7 -9 -7 3 0 5 11 2 11 6 -2 2 5 12 -3 2 -6 -8 7 0 -8 -3 -2 -5 -6 5 -7 -2 -3 -2 4 3 -6 -6 -1 -1 -2 -17 -6 3 -5 -2 -4 -2 6 -6
6939flJ4Oj3MNJj3J4m%Nj5J3J2nj1mJ6j3oJ0j4R%lRj3Mj4J1NoOj0J3l%rJ5qNq
6982djnJ1JLLj2%J5qoK1k2MOJ1j1j1QQqKj2KKqN%Pl%Qlj7J3MOk2J5NlnJJ4J0j4
7028A0j4OJ7j2j3J3PMj9nK2rk0J0J0Pk2KJ5nj4qK3K0l0j0J6J0ll6J6L1kl0j3N5
7064B9j0m9RM1J9n1j5L6J9k6j9K6L3l3l6K5L7k0m6J2O0j6m8mN7J3n9k6N9J8l6
7095am3O4K8n2m8M5O1n6m1L0N9j7o9OR3k2p4pQ3K7j00j2P2K9n8n3P0M9o8m9M1
7126a3Q3n3q3N1Q1k6r6QJ13k5r2%R2M5j28k7J04L9q9o4R6P5j03o5O5R6n1j20O7
7155b0R8l3j10RJ38k0j25QJ05L1j09n7J45K1j04n3R3Q0j06q5R6Q7o0j22O4J21
7181I2o7r6K2J25kj51J8J19J0j17l8J45L5j23n1J02Q0r9r6J07P3o6j01O6J17q2
$$ plain form
6939 -6 -9 5 11 -2 2 7 8 -5 9 5 5 10 -5 8 20 15 4 0 16 3 -3 7 -7 2 2 -1 8 -5 -1 -15 -4 1 -5 1 -9 4 1 1 -8 7 -1 4 -4
6982 -4 -5 -10 1 2 5 8 -4 -4 11 3 -3 18 -4 0 6 17 6 -5 3 11 3 5 -7 -5 -3 -11 -6 -6 1 -2 -2 6 3 -14 -1 3 9 -13 2 7 4 -1 0 14 24 10
7028 10 -4 2 19 7 -6 7 14 18 -1 -6 16 7 -13 -3 7 14 -8 -6 9 4 -10 -18 5 25 -5 -15 1 11 8 -28 -12 19 17 -13 -26 29
7064 29 19 -30 -21 20 39 -12 -27 9 28 2 -17 9 42 9 -27 -2 35 15 -31 -19 41 25 -23 -27 30 43 -16 -42 17 35 -1
7095 -1 -44 20 48 -4 -52 -7 54 -2 -43 -13 46 29 -40 -34 59 37 -37 -44 39 66 -34 -46 26 55 -3 -56 14 63 -5 -54 -13
7126 -13 70 17 -66 -15 66 40 -56 -48 65 40 -52 -52 40 85 -43 -70 34 73 -16 -80 16 91 -12 -77 -12 84 33 -87 -20
7155 -20 78 45 -65 -56 82 62 -63 -55 50 81 -28 -85 60 81 -23 -76 17 97 -9 -94 2 89 29 -93 -29 92
7181 92 25 -71 -49 76 74 -77 -59 60 70 -47 -85 60 95 -28 -79 23 103 4 -92 15 88 22 -79 -13 104 22
7207B2r0L4J10j3j39L7J03nr6m2J38J0j18rO5P1r4p5J05M6n6o1L9R4o5p6N3N9
7235D7mr7K4Q6k3n9j7P0L5j01RN8J2m1n2P2M5o9k6L0N1l7o1N5K2om2qO9l2l2J5
7267gK1J2m4oM8j4j4j4K8K0l4mRJ5Pm3L2Mj7J3j1L1j0k6J7j1J3pj3K3j9K1mk8
7301a2K4k4K7rj5K7j0%oj5L8l1L%NK7l8J0K1j8jj6K6K3n2J2J5J4j5l5L9K0l8l
7335gNL4j9m5K8L6k1j8j1M6j5l3NK4K4n4LM5j3k2k3K7L5n2lL0J9j6n0M0K2k2k3
7368b4J1N4k3m2J9K9ol3jL9kl2MK2K4n9%M2prl8L8J7l5j0J7L2j3n4L5L1j7k9m
7402b4M1j2k6J3J2J9l7%L7nl1mJ4L4l1j6J8K2k0l4L6Lnj6MK0j5j7J6OKk0JK2M
7437A1k2pK4Nl0%J8J6j6j8J5K0k2PQOk5KpM0k9rK4pMj8PJ6rqNlQk1J7qJ1j3JJ
$$ plain form
7207 22 -68 -34 76 63 -76 -39 64 59 -37 -79 59 69 -49 -58 7 78 -16 -91 14 60 4 -57 -18 76 11 -65 -12 47
7235 47 43 -54 -30 56 33 -26 -43 27 62 -39 -30 28 40 -1 -53 19 64 -5 -31 -1 50 13 -48 7 29 23 -19 -27 42 10 -22 -7
7267 -7 14 26 -18 -24 24 10 -4 -18 10 30 -4 -8 1 16 23 -20 12 16 -1 12 1 32 22 -4 13 2 15 8 -5 18 -1 20 16 -12
7301 -12 12 -12 15 6 -9 18 8 8 2 -13 25 -6 -3 -3 2 29 -9 1 22 4 3 -13 13 36 -16 -4 11 25 10 -25 14 34 -4 -7
7335 -7 -2 32 13 -32 -4 32 11 -7 -18 28 13 -20 -15 9 33 -21 -18 27 14 -8 -31 -4 31 -21 -24 6 25 9 -41 -1 21 -1 -24
7368 -24 -13 41 18 -24 -5 24 18 -15 -16 23 21 -11 -7 15 39 -20 -20 22 15 6 -32 6 23 -12 -22 -5 27 14 -40 -5 26 9 -20 -24
7402 -24 17 5 -21 -8 4 23 -14 -14 23 18 -13 -17 -3 31 0 -16 2 24 4 -30 6 9 4 -12 -8 12 -3 -20 -4 2 4 -16 -15 7 11
7437 11 -11 -18 6 11 -19 -19 -1 15 -1 -19 -4 16 -6 1 9 15 -10 -8 -15 25 -4 -13 11 4 8 -10 -3 13 4 -4 1 -2 6 -15 2 -6 5 -8 -7 -6
7477fLJK%JmRNj5OmKLpJ2j0J2lj9K9k3J5j%LpkJ2j3jQkJj5lJ9qMoQnpKNJ2qj5
7524a0NJRj1%J9j9LkJ7Mk2pK9pk0mJ8J3l2QPK7k0j4J2mJ3k7LK7nj9nJ5J0k1rK3
7563EMk0oJ8J7k9JNK4Kn3L2Njj9JL6j7k1PK7Kl8oM9j1j9lRK8l2j5K4NJm7K8L4
7601B7l2loL5km4J2K5Jk3j7M0J3m4jJ4L1k3l4L5J1j3k0LM0k9pLK0Ml3KM3k3mk2
7637b1K8K5m5oJ8K0qm1M0Nk8LlL2k3j8J7J0lj2mL9j9nj8J5J9l7J4J0J%j5J7Kr
7673@RqJ3j7j2J9qQkj1J9j7jJ9j4%kJ1J0l1J9Lj4Pk1L7j3j2J1lK4m0pM8k1pj0
7710a4K9K2n4MK7lkk8L0K1m1mJ1L1mo7N1J6j6l0qO6k2m6J1L2L3p1k3Q3jm0m0O5
7744A8M0p5k8M8M1k2p0M1O6m9m2%Q8j2r5K4O5Pp5k0J00Op4k6N2O0p5n9O7O5p1
$$ plain form
7477 -6 -3 -2 0 0 1 -3 6 11 -4 2 -2 0 3 -4 8 -2 10 7 -12 17 -6 9 8 8 11 4 2 14 1 0 8 6 7 -8 -11 8 0 4 -2 6 1 -6 -4 1 13 5 -10
7524 -10 -5 -4 5 -6 -6 13 -6 -3 -5 12 16 -6 -13 16 9 -11 -15 3 16 -16 -8 -1 26 6 -8 4 0 13 -14 -11 16 11 -8 -13 2 12 -9 -18 5
7563 5 9 -11 -17 1 18 -11 -10 -5 19 21 -32 0 5 4 -15 -14 22 5 -16 -9 18 20 -18 -24 25 14 -5 -8 1 29 -3 -18 6 11 12 -35 -7 27
7601 27 -5 -8 -14 21 19 -25 -13 12 13 -10 -27 13 26 -18 -19 -5 26 3 -31 4 15 2 -18 -15 25 -4 -11 -8 12 16 -17 -15 28 5 1 -21
7637 -21 7 32 -13 -19 -1 19 11 -30 10 15 -13 -10 -13 19 -4 -22 -5 5 2 -10 -14 25 6 1 -17 -2 17 -20 -6 4 5 5 -10 7 9 0
7673 0 9 1 14 -3 -15 4 -4 4 2 -9 10 -7 -8 11 -3 -3 -5 6 16 -15 4 7 -7 0 -21 16 3 -9 2 -1 23 -17 -24 24 3 -4 -14
7710 -14 15 37 -17 -13 14 11 9 -19 11 32 -9 -13 -2 29 25 -42 9 25 9 -21 -29 37 15 -31 -20 12 45 -26 -49 34 33 -7 -47 18
7744 18 58 -17 -45 3 44 22 -48 -7 59 10 -32 -32 56 44 -51 -27 38 45 -30 -50 50 56 -18 -44 8 68 -7 -66 1 66 -5
7775eo3N6P2m5o3K7P7k0r7K6R2j6p7j1R6Nr4pP7M0p6n9Q5M0p0n2M8R9p1q0N9O7
7807F0l0q1LJ10k9p8NQ3J8j12jQ0K7p6m7Q8L5q2l0O1O1o4o9N7Q3n3o9J9R7m3p3
7838e0K5P6mr5J1P3J2q3qO9L8r0j9O0M3n2n9M7O5o8l7L1O8l2p1L1N9j0o0j9Q7
7869C8Np2oP2Kn5k4N9K0n7j7L7M7n2k6L3L7k5n3L1M6k4m1PM1jm5J0L0kk6k1N4
7902B2Mo0oM3J2l2k0M0K1k4k4J3L6k5k3K4J7j6k1QL3j3l4RK8Ml7J0L0mj3j5K6
7935A3Jj7qK6Lk1j9J5J8j6j3K1Rj2k0K2Lqj2J6J4j0rnLJ2j5lKJ9nmQmrJ4Nrlj
7975AkJOjj1J4kj3J5%Lj0j3PNjrJ3mqKJ4j2jNMJrQPrJKlKjJqRQj9PqPOJJ1j5o
8024dJ1j3J3oJ%mjNp%rK1lj1MlJ2j9QJ3j0KjLPj1jRk%Lj3J6rJ0j2Nj0qRN%Qj4
$$ plain form
7775 -5 -68 -12 60 15 -48 -21 56 36 -61 -35 57 41 -36 -47 49 54 -40 -47 30 70 -6 -65 20 60 -10 -62 -14 85 14 -66 -7 60
7807 60 30 -51 -48 62 33 -45 -40 43 61 -51 -52 28 55 -21 -68 20 55 -27 -57 4 65 1 -68 -11 72 19 -50 -31 66 23 -50
7838 -50 -25 51 47 -48 -37 36 48 -35 -43 26 64 -26 -45 15 58 6 -53 -6 59 -9 -46 -15 53 21 -50 -19 40 30 -30 -49 38
7869 38 43 -29 -35 37 39 -16 -40 19 39 -18 -35 2 49 -3 -29 4 41 16 -37 -6 40 16 -25 -18 23 22 -23 -13 17 15 -11 -32 22
7902 22 26 -34 -40 3 15 -17 -37 3 24 0 -24 -11 25 0 -23 1 18 2 -19 -11 22 9 -25 -16 12 16 -21 -11 19 15 2 -13 13
7935 13 14 -3 -11 15 18 -3 -22 -7 11 -5 -18 3 12 0 -20 2 5 -3 -15 1 15 5 -4 -9 -6 6 -9 -12 -10 9 4 0 8 4 -5 9 14 5 2 1
7975 1 -1 0 6 5 -6 8 6 -7 8 8 11 1 -12 -5 0 -1 -10 3 -1 -9 -7 7 -5 -6 -1 3 4 -5 3 10 1 2 4 1 3 2 3 -5 4 12 -7 0 -8 -1 5 6 17 2 -4
8024 -4 7 -6 7 1 2 2 -2 -3 2 -5 -5 -14 7 4 -7 -3 -6 6 -13 -5 8 -2 0 -1 2 9 -2 -3 6 4 4 7 -6 10 1 11 -1 4 -6 -14 -5 0 0 8 -6
8069fOJpQj4POj4K1pj1PKNj1RjJopK7qj4MJ1Lj9J4Qj7%jKJ2qJ1nlKj5J0Mk4J6
8113aoJ0J9m2J7LNqj3L0ok8KJ3K1j8j1L7k3J2l0L4K6n0j0J0K3Kl8K5R%k0k1N8
8148C1j8l8K7J7J2m6j6N2Nj7l5K3M4m9j3K3K3jn7K9M6k7l5jN5Mp8L6K5J8o0k9
8180e0Q9kn3qK8O4q1l6O3J7j7
$$ plain form
8069 -6 0 1 -6 2 -12 -5 1 -13 8 1 -10 -3 -1 4 -7 2 1 2 -4 -11 16 8 -6 -2 9 12 -7 7 15 -2 -2 -3 -1 11 3 14 9 6 8 -7 3 7 -17 -1
8113 -1 -7 3 22 -20 -3 0 5 -3 -16 14 8 -20 -18 -5 16 -2 -13 24 1 13 -17 17 43 -7 -17 -7 16 18 -20 5 14 14 -6 -27 31
8148 31 13 -25 2 19 31 -15 -31 21 26 9 -26 -3 41 -8 -21 2 25 24 -33 -4 42 15 -20 -21 34 38 -40 -4 21 39 -21 -50
8180 -50 39 37 -16 -24 4 68 -13 -49 14 31 14
8191A4
$$ Imaginary data points
##PAGE= N=2
##DATA TABLE= (X++(I..I)), XYDATA
0@%%%%%%%%%%%%%%%%%Qj6J6j6J6j6J6j6K0k4K6l0L2l3L7m0M2m9N5n6O0o6P0p6
41d0Q1q5R2j01J09j17J26j35J47j62J77j96K23k51K86l34L94m70N70p07Q97j167
63f63J565k178L181m970Q602j8015P4293J29829l05326J39458j21591J42549J12706
76A59440l80729K88324l8271m0414O4968k44819L48606j09978j88733J90772j28985
87g9819K34970j84047j55593L23602j69819P4322r6884n9119L02172k83927M9334
98d4808P7331p6706J69390k84287J35449J54807k10153J11059j53265J58550R2709
109A30076k89461J84737m8454M4204L7457k27151K58907p2368q7524R9626j25281
120i5232K12346j39622j07572K10831j17619R6730j16367m7965K35455j87546
$$ plain form
0 0 0 0 0 0 0 0 0 0 0 0 0 0 0 0 0 0 0 8 -8 8 -8 8 -8 8 -8 12 -12 14 -16 16 -17 20 -20 22 -27 28 -28 32 -34 36 -40
41 -40 41 -44 48 -53 56 -61 65 -70 77 -85 92 -104 119 -132 154 -180 214 -256 314 -393 504 -663
63 -663 902 -1276 1905 -3065 5537 -12478 61815 191644 -113682 25776 -95815 46734 159440
76 159440 -221289 67035 28764 -11650 53318 -191501 157105 47127 -141606 49166 -79819
87 -79819 155151 -28896 -184489 139113 -30706 43616 -53268 -112387 189785 -94142 -44808
98 -44808 32523 -44183 125207 -159080 -23631 131176 -78977 32082 -121183 37367 130076
109 130076 -159385 25352 -23102 21102 58559 -168592 90315 17947 -69577 30049 -95232
120 -95232 117114 -22508 -130080 80751 -36868 59862 -56505 -104470 130985 -56561
130e6561M6180n879l7486J61940k11426Q6690P2157j12233J01715j43139J18093
141B0051N9880j81402J20445o3141P0817K4036j70756J64130n0013j0739M3405
152B6713j13331J54067q3145m6327J07032q8347R1925q6974k6863J42470j13621
163c6401M6301l7830j4695J20342j32833N1547J2799m6821Q6090j06584O8906
174A0821K2580r0098Q3245o1750N5250J0663j01408R8963m0322J8567J5868q3305
186f0926R7093m4740o131M3113o8071O9908m6213o927O5592p0394M1994k9330
198a5032l862O6381p4147L1647q264j4029N6801o3511L0831P74l0886N2804m3856
211a4349K5071M23m0510N4249k8787J3387K365m0595N1552k2027M409J0382l8764
$$ plain form
130 -56561 -10381 -16260 -53746 108194 -103232 -16542 55615 -56618 45097 -98042 20051
141 20051 79931 -101471 18974 -44167 26650 50686 -120070 44060 -5953 -16692 26713
152 26713 -86618 67449 -15696 -62023 45009 -43338 48587 -38387 -65250 77220 -36401
163 -36401 9900 -27930 -42625 77717 -55116 -3569 9230 -37591 48499 -58085 10821
174 10821 33401 -56697 26548 -35202 20048 30711 -70697 28266 -12056 6511 22379 -60926
186 -60926 36167 -8573 -14704 28409 -39662 30246 -15967 -22894 42698 -27696 14298 -15032
198 -15032 -18894 47487 -26660 4987 -3277 -17306 39495 -24016 6815 7589 -23297 29507 -14349
211 -14349 10722 11145 -29365 24884 -3903 9484 11849 -28746 22806 779 5188 15570 -23194
224b3194M1301j7178J988J8367l9102K9459j0377J260K2153l7943K0400m632j322
237A180K3961l2875J2911k083m252K5304k5739O065j236o352K5112j8452J144
250D688p34q262K2590j1134r38p88j0588J8676l881j199j676j2223J4644J718
264A0893r71k087j2006R953M273J47q16j0734M148M588K649J205r462j462M069
279D387N268K501p734n160K746O444L059m695o731L3O030L538o38o954l603M967
295C458L977L075o188o759L777L565N572m132q545K199K018O918q88r033K70j87
311i03P296K742q466j464k440O528N839o914k462m305M550P875m477k546n743
326d890J780Q659j564j860o462j264Q144J278o69o275l903O248L585Q65n209n693
$$ plain form
224 -23194 18107 929 2917 21284 -17818 11641 1264 2524 24677 -13266 7134 2502 1180
237 1180 25141 -7734 5177 3094 -1158 24146 -1593 4472 3236 -3116 21996 3544 4688
250 4688 3954 -4308 18282 7148 6210 5422 -5166 13510 9629 8430 6754 -5469 9175 10893
264 10893 9922 7835 -4171 5782 10055 10202 9386 -1348 2800 7388 10037 11242 1780 318 4387
279 4387 9655 12156 4422 -738 2008 8452 11511 6816 85 118 6148 9686 9048 2094 -1509 3458
295 3458 7435 10510 4322 -2437 1340 4905 10477 6345 -2200 -1 2017 8935 8047 -986 -716 -903
311 -903 6393 9135 669 -795 -3235 3293 9132 2218 -244 -4549 1 7876 3399 853 -4890
326 -4890 -3110 5549 3985 2125 -4337 -5601 2543 3821 3152 -3123 -7026 -778 2807 3672 -1537 -7230
342g230L251M976K523l487o368l89N504L922j652n627l971N067M641n9l203p052
358i154L426M712J285N25r704J041M891J825M321j1425j005N306L69P644j0945
373f888k259M880l248J1412q062m087L460p184J5914m812p540L362r597J8653
387D004l333j0578P083j2124J6711j898j0140J2736j7889J1763L419p940J5391
400G205k5210R248J1866j0083J4716k7202J0160J6445j8268J7408k1054P371J3706
413F308k4853K7365j4283m498J1376k2719L6572j5349j7910J9128j8062L3612
425A6687j8816k0412L2296k3784K1700j0813j3989L5896l8942J6609R396j4960
437i132K6579m6342K3958K4523l1338K0947l5157K7796K1255m7759L4081j9385
$$ plain form
342 -7230 -3979 997 3520 33 -6335 -6724 -1220 2702 1050 -4577 -8548 -3481 1160 1101 -2102 -9154
358 -9154 -5728 -1016 269 794 -8910 -7869 -2978 -1153 3168 -8257 -9262 -3956 -3587 4057 -6888
373 -6888 -9147 -4267 -7515 3897 -4165 -8252 -4792 -11976 3938 -874 -8414 -5052 -14649 4004
387 4004 671 -9907 -2824 -14948 1763 -135 -10275 2461 -15428 -3665 -246 -8186 7205
400 7205 -18005 -8757 3109 -6974 7742 -19460 -9300 7145 -11123 6285 -14769 -7398 6308
413 6308 -18545 8820 -5463 -9961 1415 -21304 15268 -81 -17991 1137 -16925 16687
425 16687 -2129 -22541 9755 -14029 7671 -3142 -17131 18765 -20177 -3568 5828 -9132
437 -9132 17447 -28895 -4937 19586 -11752 9195 -25962 1834 23089 -24670 9411 -9974
449i974J0649J2379m4096N4189k1285j7529K2275k7602N4431l6058k8447M8952
461A7884k6894L2903l4293j6906O2557m9855J8844m695j1410M7632o8178L1047
473a364K5770l4102K8424n5337M7751K6919o5812L7318k6674L4298R967o9382
485d2224O6395k0688n127J4108m4091P5321m2863k9589M9257k9871M8892n4798
497a5278j8528P8677n1528K0944k7412k425O8898q1578K8546J5359k1543L9370
509C3502p6249N6543K7108o5411L7900m0215N6017O863q4547P0001k1646J6222
521A6088J127o2722R0457m1038k0048L4530l8880O9436o3143j8348P5672n0476
533g345L2826m7487J546Q0808q2602K5827l817o076N3682q8560N0110K0446m7233
$$ plain form
449 -9974 675 13054 -31042 23147 1862 -15667 6608 -20994 33437 -2621 -31068 17884
461 17884 -9010 23893 -10400 -27306 35251 -14604 4240 -455 -11865 35767 -32411 -1364
473 -1364 24406 -9696 18728 -36609 11142 38061 -27751 9567 -17107 17191 27158 -42224
485 -42224 24171 3483 -1644 12464 -31627 43694 831 -28758 20499 -9372 39520 -15278
497 -15278 -33806 44871 -6657 14287 -13125 -15550 53348 -28230 316 15675 -5868 33502
509 33502 -42747 13796 40904 -24507 13393 -26822 29195 36058 -48489 21512 -134 16088
521 16088 17215 -45507 44950 3912 -16136 18394 -20486 48950 -14193 -32541 43131 -7345
533 -7345 25481 -22006 -20460 60348 -22254 3573 -244 -6320 47362 -41198 8912 29358 -17875
546a7875M0506n6826O1033P973p8736O2910k7638L3144n159p1019Q8536l3593
558C256n049J5608m7693Q0468n5699j4631N5638m8579M8076n3443M89P3976p4253
571b1836L1205k1628K198O0711q8007M3155N176k5471M7373p0628N5024M965n6239
584c4002N7517m4401M1623m501o2934P6896l6934J3436L720n1358P8423m6034
596h549k397K9871m7432N8726m6970J012M9589o0262M0878k8988L182M9715p1186
609c2811L9362q969j0413M4529o5485M2335k077k9492M8742n1372L5586k539l9850
622c2454N8402m2427K1154K053m1334O1957m0162R564J3922m3051N6232l6280
634a2424M657K5034m8705M8419k6910J99L0909n2365M2759j7411p152L5608n1018
$$ plain form
546 -17875 22631 -34195 26838 34811 -43925 18985 -8653 24491 19332 -51687 36849 3256
558 3256 -1793 13815 -33878 46590 -9109 -23740 31898 -16681 31395 -22048 -21559 52417 -21836
571 -21836 9369 -12259 -10061 50650 -37357 5798 10974 -14497 32876 -37752 17272 22237 -34002
584 -34002 23515 -20886 20737 16236 -46698 30198 -6736 6700 10420 -40938 37485 -8549
596 -8549 -10946 18925 -28507 30219 -16751 -15739 33850 -26412 14466 -14522 -11340 38375 -32811
609 -32811 6551 -2418 -12831 31698 -33787 8548 6471 -23021 25721 -25651 9935 7396 -32454
622 -32454 25948 -16479 4675 6728 -34606 27351 -12811 -3247 10675 -32376 23856 -12424
634 -12424 -7767 17267 -31438 16981 -9929 -9730 21179 -31186 11573 -5838 -12990 22618 -28400
647b8400L5791j0515j3566M0525m8131K6939l279j8202M2460m4585J9771M399
659C207k3848M1099l7805J5087R209l0927M0095k7584R253J0051l5083M1386j9044
672d904n5J1979l3174M0025j6288p582J9360l0375L1317j4267p964K7026l2660
685a7562K0408o641n588K7773l6339J5136L668q379K3317l3408J4908Q424j6365
698a0648K1781k3071J1917N510k1372K6218j3743K388K757j8314K9297j1732o596
711e608O884j3420K4062j2039p448J3321j4409J4619p075l176J4217j9353R367
724e8J832j985R753k0526R513P234n911O817j5214Q926N672r308R440q896L322
739F11K101p360J3295p031l506K280l157J2675p580n738M831k204Q382n481l704
$$ plain form
647 -28400 7391 -3124 -16690 23835 -24296 2643 -636 -18838 23622 -20963 -1192 3207
659 3207 -20641 20458 -17347 -2260 6949 -23978 16117 -11467 -2214 7837 -27246 14140 -4904
672 -4904 -4959 7020 -26154 13871 -2417 -9999 9361 -21014 10303 -3964 -11928 15098 -17562
685 -17562 2846 -3795 -9383 18390 -17949 -2813 855 -7524 15793 -17615 -2707 5717 -10648
698 -10648 11133 -11938 -21 5489 -15883 10335 -3408 -1020 1737 -16577 12720 988 -5608
711 -5608 1276 -12144 11918 -121 -7569 5752 -8657 5962 -1113 -4289 9928 -9425 -58
724 -58 1774 -211 9542 -10984 -1471 5763 -148 6669 -8545 381 6053 -3255 6185 -2711 611
739 611 2712 -4648 8647 1616 -1890 390 -2767 9908 2328 -3410 1421 -783 7599 2118 -1586
754a586M970m654N281l77j871J696o297M961L708k297j226n057M693M285k633
769C596j436k908K247L000q08k42k207j080K332K078R9k459k925J990L894l88
785D783j901l121P34M201m87l76k748j540M066N0J118k344l749L943M92J917j377
802C661n186L475L21K290L13o010K548j45K364K249o342J555o74J930M024o013
818C60P64j242R05N512n113J94j712m49O483l892q0j838k029O719k508O4j658
835D80l642O297j091L44j165m948N390%O44l33n628L979N32R96Q70n749K145O49
853b30J431K078n441L76N87J627K872m551q46J86J309L266k929j582o70P77L426
870A686j059j972j644L74L085N73j765k342RK025J909p93k937l72O66K974M58
$$ plain form
754 -1586 3384 -1270 4011 3634 1763 3459 -2838 2123 5831 3534 2308 -2749 1944 6229 3596
769 3596 2160 -748 1499 4499 3691 3449 1242 162 2494 4572 4671 2212 -713 1277 5171 4783
785 4783 2882 -239 495 4696 4209 3833 1085 -455 3611 3661 4779 2435 -1314 2629 3121 5038 3661
802 3661 -1525 1950 2271 4561 4874 -1136 1412 1267 3631 5880 -462 1093 419 2349 6373 360
818 360 1124 -118 787 6299 1186 1380 -332 -781 5702 1810 1730 -108 -2137 4582 2074 2138 480
835 480 -3162 3135 2044 2388 1223 -3725 1665 1665 2309 1976 -3652 327 859 1855 2725 -3024 -879 -230
853 -230 1201 3279 -2162 -1786 -1199 428 3300 -1251 -2097 -1911 -602 2664 -265 -1847 -2517 -1740 1686
870 1686 627 -1345 -2989 -2615 470 1043 -722 -3064 -3055 -1030 879 86 -2851 -3223 -2557 417 875
887H75l588l56n19L205J539l810M93j954K205K942l305J475l826P91N104l072
903a801J862n049j41O999m090K344m328j249P265n645M252k292m104O558n812
918e231O782j001q161P171m640P276p63j0645R713m744M727J085j0222J1249p431
933d835J892O163r627R558r846J537J1710j1940O865q285J801J3562j5638P493
947D10l819j721J2268j5963J1102j452r048J2976j2191J2306k580j4677J7612
960E223r525Q420k281j5293K1550j1562L479L465j4414K0210j5073K448J1883
973H530j7323J5516j4120M056J6654k3411J3692q276K054J6428k6281J6507l661
986C65n814J6946k2892J8178l805j3875K2035j8306J4274m358j6946K7744j7733
$$ plain form
887 875 -2713 -3069 -3588 -383 1156 -2654 -2161 -4115 -1910 1032 -2273 -798 -4624 -3833 1271 -1801
903 -1801 61 -4988 -5129 1870 -2220 124 -4204 -5453 1812 -3833 419 -1873 -5977 581 -5231
918 -5231 1551 550 -7611 -440 -5080 2196 1433 -9212 501 -4243 484 1569 -8653 2596 -4835
933 -4835 -2943 3220 -6407 3151 -6695 -5158 6552 -5388 1477 -6808 -5007 8555 -7083 410
947 410 -3409 -5130 7138 -8825 2277 825 -8223 4753 -7438 4868 2288 -12389 5223
960 5223 -4302 4118 1837 -13456 8094 -3468 11 3476 -10938 9272 -5801 -3353 8530
973 8530 -8793 6723 -7397 -3341 13313 -10098 3594 -4682 -2628 13800 -12481 4026 365
986 365 -5449 11497 -11395 6783 2978 -10897 11138 -7168 7106 2748 -14198 13546 -4187
999d187P869p3j7096K8566j9732M519Q033j9653K4813j8957M704J4375k5483K1774
1013I472j3887L404J6756k9784K1954q785k015J8785k9734K2054o447q527K3007
1026A6253k7721J9369m788j3385K7628k6276J5062j448j7107L0272k4961J1089
1038C987L278k1109L0833k2310P377P868k4952L0670j8824K745J2602k6981K8947
1051A4131j6097j514J8694k8631K4375j2330l599K3502l1718J9922n545o425K4348
1064A9113l3140J8743R62j3197K4189k9276J8204K891k1265K7715k2357J2980
1076E562J800k4509L4055j9120L084M859k1755L5419k1649l369J5021k1171K7750
1089A5977k1565j311K3669k8632J9435j1878J356K2450l6515J9692N81n269J6772
$$ plain form
999 -4187 3682 3609 -13487 15079 -4653 -134 7899 -11754 13059 -5898 -1194 13181 -12302 9472
1013 9472 -4415 -1011 15745 -14039 7915 -870 -2885 15900 -13834 8220 1773 -6754 16253
1026 16253 -11468 7901 3113 -10272 17356 -8920 6142 4694 -12413 17859 -7102 3987
1038 3987 7265 -13844 16989 -5321 2056 9924 -15028 15642 -3182 -437 12165 -14816 14131
1051 14131 -1966 -3480 15214 -13417 10958 -1372 -4971 18531 -13187 6735 1190 -5235 19113
1064 19113 -14027 4716 5678 -7519 16670 -12606 5598 8489 -12776 14939 -7418 5562
1076 5562 7362 -17147 16908 -2212 872 5731 -16024 19395 -2254 -5623 9398 -11773 15977
1089 15977 -5588 -6899 16770 -11862 7573 -4305 -2949 19501 -17014 2678 3259 -2010 14762
1102A4762l3998K4363M166j7954J8429k2698K1279j249k3937K9020j5717P377
1114C843k895j7881L5726k0201m716P698j1543K8564k5491l414K0668j7496J6236
1127I098j8137M172K1410l0044J4164k227K145J1949l2945K2526N793j1568Q453
1140D789k2040K5530k58k1593J8698j1911J3629o663j6702L0028j5334j574M38
1153b963o689K7249k4202m124J4614p798J4831k2118L679J9208j9435R294p958
1166f412N997J0852k6215J5943L410m163L256j9284K2504J364j5593Q160q524
1179h705J6328n887j4668J8774q307K999l714n310K0240j6445k557P268k137J1585
1193I464j8949K267J3763r134N228j0635O152R402j5957Q555r06Q38K282j3477
$$ plain form
1102 14762 -19236 5127 9293 -8661 9768 -12930 8349 7100 -16837 12183 -3534 3843
1114 3843 948 -16933 18793 -1408 -6124 1574 -9969 18595 -6896 -10310 10358 -7138 9098
1127 9098 -9039 -4867 16543 -13501 663 -1564 581 12530 -20415 2111 7904 -3664 4789
1140 4789 -17251 8279 8021 -13572 5126 -6785 6844 181 -16521 13507 -1827 -3401 -2963
1153 -2963 -9652 17597 -6605 -10729 3885 -3913 10918 -11200 -7521 11687 -7748 1546 -6412
1166 -6412 -415 10437 -15778 165 3575 -588 2668 -16616 5888 7252 -8341 -181 -8705
1179 -8705 7623 1736 -12932 5842 -2465 534 -3180 -8490 11750 -4695 -7252 16 -2121 9464
1193 9464 -9485 -7218 6545 -2589 2639 -7996 -1844 7558 -8399 156 -750 88 2370 -11107
1207a1107J4796M31q097K603n900J3624l864j0308Q744l435N757m137n253J1276
1221E130p485J59J885j264P069j0676J104P438l167K084p819L613O801o834K229
1236B67k332J841K758o367N626l89k969J318k415O456k012n226L140j45L771k622
1252G00l696M187j237J236l83j564K441k906J101K296j291j19k619J951K893j906
1268A084j007j117J507J838j332l93m28q6J028M26l8q28j142Q71J820l86j033
1285G84j152M40K251o15n83p93o75K259k78m7n30j875K296J71J48r9k676K134
1303A160L29J45P49l183J595M01J49J657l494R63N18o0K423l443M59N37o11L111
1321C405k954l0M28j262L689k278m96L84j909L965j555q20N61k544L776q31q87
$$ plain form
1207 -11107 3689 4120 -3977 -1374 -7274 6350 2486 -7822 922 -2513 3244 -893 -6146 5130
1221 5130 -2355 -2196 -311 -1575 5494 -5182 -4078 3360 193 2277 -5542 -1929 4872 -1962 267
1236 267 -2065 -224 2534 -3833 1793 1404 -1565 -247 -2662 3794 1782 -3444 -304 -449 3322 700
1252 700 -2996 1191 -46 1190 807 -757 1684 -1222 -121 2175 884 765 -1854 97 2990 1084
1268 1084 77 -1040 467 2305 973 580 152 66 1094 1520 1482 654 -488 383 2203 1817 784
1285 784 -368 72 2323 1708 1125 332 -343 1916 1638 1591 1061 -814 1482 1653 1801 1702 -974 1160
1303 1160 1489 1634 2383 -800 795 1196 1345 3002 -492 471 989 929 3352 -91 368 905 294 3405
1321 3405 451 421 849 -413 3276 998 502 886 -1023 2942 1387 567 1128 -1416 2360 1529 642
1338F42Q63l168L275p5q55J217l624K615N24q42J646l749J801Q59q20K165l588
1355a114Q53J032p87K590l214K8J067q52K832k601n45R39j103K904j712r05O16
1372B8j385K865p90j143K99j555K623r2j108J53j662K018M43p66J25j797J286
1389d58Q15k16Q1j825N88R50L09N7j655N2P25P25J43j253l84J68J126K91p98o54
1409a213n26J455L85l98n87j232J617L00k0j57j948J606J40K74N38k639J486j3
1427i32L54J416l200J315j03J20K348l566J202r9m96L228l607J127l3j508M086
1444A652l289R48M0k621M966k827M40L88l491N546k562k17J379m237N453k452
1460h84n10K911n285M592j855l25M134o833L971m10p27M458p727M256Q02k547
$$ plain form
1338 642 1505 -1663 1612 1537 682 1899 -1725 890 1414 572 2218 -1531 270 1129 309 2474 -1114
1355 -1114 -261 771 -16 2574 -640 -612 455 -397 2435 -166 -711 228 -875 2029 317 -588 28
1372 28 -1357 1508 718 -425 -126 -1681 942 850 -258 -105 -1767 251 694 -72 53 -1744 -458
1389 -458 357 141 222 -1603 -1015 -65 244 301 -1354 -1302 -577 148 291 -962 -1346 -1178 -52 239 -559 -1213
1409 -1213 -1739 -284 101 -297 -884 -2116 -499 -199 -219 -376 -2324 -718 -578 -304 234 -2405 -919 -932
1427 -932 -578 838 -2362 -1047 -1150 -1030 1318 -2248 -1046 -1145 -1641 1587 -2020 -893 -926 -2434 1652
1444 1652 -1637 -689 -649 -3270 1696 -1131 -691 -303 -3794 1752 -810 -1027 352 -3885 1568 -884
1460 -884 -1394 1517 -3768 824 -1031 -1356 2778 -4055 -84 -494 -1221 3237 -4490 -234 568 -1979
1476a979M965o990M388O57m718O854n568K859J9n404R327n387R4J118m762R936
1492E409o601j271M382n452P832o407j20O873q804N917k932O14O141j1893O972
1507F60J122k185M470j1029R085J659o986O227p259P565q92q609J1336n904J805
1522A065r95n621J4124r264k394M308l663J0732j1773n09R792p904O036p650L113
1537f03Q880j4422P130j02P82L943j5089J2584K480p057L512r084J3677j824j1708
1552f901J0485m884O268m771p787J6892q951k020J068k058J4097j5265j736J0530
1566D967m617O098j3085M373J2320j3792M496k943M697N365j7730J1697L415m557
1580G04J052j1171J6852p65j3101P340l590J0854o989j0702J6706o041J08l439
$$ plain form
1476 -1979 2986 -4004 384 1041 -3677 3177 -2391 468 487 -4917 4410 -977 -883 235 -4527 5409
1492 5409 -1192 -2463 1919 -3533 4299 -2108 -2228 4645 -4159 1758 -1174 -560 5581 -6312 660
1507 660 1782 -403 4067 -6962 2123 3782 -3204 3023 -4236 3329 2437 -6172 5164 -740 1065
1522 1065 70 -5551 8573 -691 -3085 1223 -2440 8292 -3481 -3990 5802 -2102 3934 -3716 -603
1537 -603 8277 -6145 985 883 1665 5608 -9481 3103 5583 -1474 2038 -7046 6631 4807 -6901
1552 -6901 3584 -1300 4968 197 -7590 9302 351 -1669 -601 -2659 11438 -3827 -5563 4967
1566 4967 350 6448 -6637 -2264 10056 -3736 760 -2183 2514 7879 -9851 1846 5261 704
1580 704 1756 -9415 7437 6672 -6429 911 -2679 8175 1186 -9516 7190 1149 1257 -2182
1594b182k456J6640j4862k414P650j525P755j6817M279J3217j0400K660p824Q172
1608A893P604j7659Q350J517R09L74j3576J6333K47j0061L271m129J4080p053
1622B100j1598J3040k778L470o969m016J6231j0571k143K732l5R077j5422K373
1636d509J0769n994J909r906P958Q559j3982M132p93M583J523j3363J1646Q86
1650C418m951R82n621J3143m824r373Q080j671O223p578n177J3080n960j43j944
1665b316m57R712j1266J076N729k785L228r630N841O910r066K201k948N554K551
1680D334j0730O720K59n65O37o206R130k430n227M220k042N851n215m302Q280
1695B714k879J163l295j200P763o138L84J395j188L898o492K954L643m487J738
$$ plain form
1594 -2182 -4638 12002 -2860 -5274 2376 851 8606 -8211 -3932 9285 -1115 1545 -6279 1893
1608 1893 9497 -8162 188 1705 2614 2988 -10588 5745 5992 -4069 -798 -4927 9153 2100
1622 2100 -9498 3542 764 4234 -2735 -6751 9480 -1091 -3234 -502 -537 8540 -6882 -4509
1636 -4509 6260 266 2175 -7731 227 8786 -5196 -1064 -1857 2726 4249 -9114 2532 3418
1650 3418 -1533 -551 -6172 6971 2147 -7226 854 -817 5406 -2172 -7349 5731 -229 -372 -2316
1665 -2316 -2773 6939 -4327 -3251 2478 -307 2921 -6709 -868 6042 -3024 -823 -3771 1783 4334
1680 4334 -6396 324 583 18 655 -5551 3579 1149 -4078 142 -1900 3951 -1264 -5566 2714
1695 2714 -165 998 -2297 -3497 4266 -1872 -1488 -93 -1281 2617 -3875 -921 2722 -1765 -27
1710b7l205M057K094o536L196n11J637N41m983M804r88j386J740k388L770k540
1726g25j981L983j699J276k307q67M468k638J11l69n94K996k857P35J077j787
1742a178J575j536J383R57k861J408j08Q67M08k628J642K07r8N96j666J200k00
1759c2m30J251j012K74m06j86J559q43m02j08j2J223n89m78J15k15P51J1l76%
1779I5m32M43N82l73j56l96J12Q89l25j99k18l39J006j38k08k8p96J031J04k75
1799C79K20j128R13K89l58N87j331O32M45m33R45j418K44O47n34J213j388p1Q02
1818F55p36J405j134l78Q67r72J553p81o60Q89j190J606l76r09R41j375J496K1
1836I22j068J041j516J242L94j131J136j614R00P24j147J251j610M89R86j154
$$ plain form
1710 -27 -3232 825 2919 -3617 -421 -932 705 1246 -3737 1067 79 -1307 433 -1955 1815 -725
1726 -725 -2706 1277 -422 854 -1453 -2320 2148 -490 -379 -748 -1342 1654 -1203 -468 609 -1178
1742 -1178 397 -1139 244 1201 -1660 -252 -360 507 915 -1713 -71 136 38 634 -1032 168 -32
1759 -32 -462 789 -223 51 -355 -541 1018 175 -227 -335 -347 876 287 -191 -76 -291 460 471 95 95
1779 95 -337 106 688 315 159 -237 -125 764 439 240 22 -317 689 551 343 315 -481 550 654 379
1799 379 599 -529 384 673 315 902 -429 203 648 215 1160 -258 -14 633 99 1312 -76 -147 655
1818 655 -81 1324 190 -188 679 -293 1260 479 -181 708 -482 1124 748 -161 780 -595 901 922
1836 922 -146 895 -621 621 1015 -116 1020 -594 306 1030 -117 1134 -476 13 999 -155
1852a55J343j485M6J154j143J419j248l66J237j146J451r14p03J193j124J407
1868I66n39r56J104j131J327j59j121J040j147J126K12j148R58j178Q60N36j074
1885c24Q37j147N59P84r49P56j077K58Q91q24P35r18o4Q63o18P37p73l20P69m49
1905b74P17n84m64N89l43P24l67n29L59k80P36j81n27J28k20O94j09l79J6k31
1925e25N12k0o2j03m33L89J29K75l57n98M76J89L54n33m76O33j50L15k89k31M83
1946b2p53O24K44l78Q8r65J188M34r98J73o68J307N0j303R62n42N21j12p95J722
1966G77j289l57P11j86J413k156j64J848p50O30j780O07J871k152Q50l07L62P35
1984F63k623K308M31j319K69j535L176m86k679J676n08J980j513j957L476j510
$$ plain form
1852 -155 1188 -297 -251 903 -240 1179 -69 -435 802 -344 1107 193 -510 683 -441 966
1868 966 427 -529 575 -556 771 612 -509 531 -616 510 722 -426 532 -646 214 750 -324
1885 -324 513 -634 -75 709 -240 516 -561 -303 588 -236 499 -419 -483 380 -238 499 -274 -594 175 -274
1905 -274 443 -141 -605 -16 -359 365 -2 -531 -172 -452 284 103 -424 -296 -516 178 69 -310 -294 -525
1925 -525 -13 -33 -95 -198 -631 -242 -113 162 -195 -793 -317 -128 226 -307 -783 -150 -300 15 -274 -505 -22
1946 -22 -775 -151 93 -285 -197 -1162 26 460 -538 -365 -1033 274 324 -979 -17 -559 -38 -150 -945 777
1966 777 -512 -869 -158 -344 1069 -1087 -1251 597 -153 477 -1303 -696 1175 -977 -127 -434 -72 663
1984 663 -1960 348 779 -540 -271 -1806 1370 884 -1795 -119 -627 1353 -160 -2117 1359 -151
2000a51m6l73l13L212l628j40K239n84J191l824J625L205l043N55j445K118J525
2017B123m611K670M92l34k0l067M776n14l329J523o11L698k692l214M600j000
2033D90N21k122p02N153l986n88J420O6K433n427J658L858k687K69l031L627K437
2050C389n673J958K26J710k69m893N315k7k404L59j439N350l038l687M164m63
2066E78J816l808j197O141l339o08m44O13L930n878R54L249j534P86m393L720
2082E86L111n315J160n95L093K97n943M440N73q70l49k902N817j946l423K764
2098D98o67L177l947j969N738k260J8k090M23M946n135K77J563k88J939n068K911
2115F6K649l641J078j997L558O75n322L262J1R02n86l651N034j136j823J169j434
$$ plain form
2000 -151 -197 -570 -883 2329 -1299 -1439 800 216 1407 -2417 -792 2413 -630 -75 -1520 598 2123
2017 2123 -2488 182 674 340 320 -2747 2029 1515 -1814 -291 -902 2796 104 -3110 1490 490
2033 490 1011 -1111 -1813 3340 -646 -1234 186 252 2685 -2742 -1084 2774 87 356 -2675 952 3389
2050 3389 -2284 -326 -100 1610 1341 -3552 1763 1736 -668 -309 -1748 3602 564 -3123 1041 578
2066 578 2394 -1414 -2611 3530 191 -417 -861 -248 3682 -2196 -1242 2007 473 1259 -3134 586
2082 586 3697 -1618 -458 -1053 2040 2337 -3606 834 1407 537 188 -2714 3103 1157 -2266 498
2098 498 -169 3008 -939 -2908 2830 570 588 -1502 -1079 3867 -1268 -991 572 284 2223 -2845 66
2115 66 2715 -926 152 -1845 1713 2388 -2934 328 339 1241 655 -2996 2038 902 -921 248 -1186
2132a186L760k970j795L904j650J072k456j17M424l605J53Q4J22K632m248J484
2148c92J692j863J352k517K462R62l610K193o75J316j15l241L455o74n02M42j933
2165a648L195j671j007K010j628J732j771l18K805k439P84o03l5K305k931R96
2181b24M61q35J637k270J360M97j794J782j268R08K15j992K190q68J20L94j679
2198a366K079q81k79R33j548J528p21k93J281j657J041k92l23J261j618Q37j7
2215c5n42J245j324N72O2o62J325j065K17J93o27J213r22N8M15p44R50n99N4M64
2235B48r35P68j37o6L35r71P57J60l48K87p02O30J46n33M84m08K04Q0l70O95m19
2256i5k42K64r2N36m85l31N03q6K13k73k02M60k82Q1J36j98J47k91J63L80l41
$$ plain form
2132 -1186 2574 -396 -2191 1713 63 1135 -1321 -1438 2986 -619 -466 -382 -260 2372 -1876 -392
2148 -392 1300 -563 789 -1728 734 1696 -1914 279 -396 920 805 -2436 1019 345 -157 285 -1648
2165 -1648 1547 -124 -1131 879 -749 983 -788 -1106 1699 -740 44 -559 -594 1711 -1220 -224
2181 -224 237 -598 1039 -1231 129 626 -1168 614 -654 254 469 -1523 667 -201 -81 313 -1366
2198 -1366 713 -168 -447 486 -1062 466 -255 -548 733 -924 117 -175 -498 763 -855 -18 -35
2215 -35 -577 668 -656 -84 -22 -684 641 -424 -207 -14 -641 572 -350 -292 123 -621 329 -270 -216 248
2235 248 -687 81 -56 -122 213 -758 -1 159 -189 98 -604 26 172 -361 123 -285 -81 -1 -371 324 -95
2256 -95 -337 -73 -165 371 -114 -445 58 -28 185 -88 -290 170 -112 -31 105 -93 54 -237 -74 306 -35
2277c5j02n3J90L40m26p8J63m4K52k48kJ60l25L12L3j21J13m28M10J62k95J68
2299A46l92L41J97l89L35l90J46K81l72M48m19m8M15l83M65l91j82N10m40M92
2319C70k69l21N34m85M94r7m83N63m80M46M5n84N95m98L45K26o30N78n19K31M09
2340D70o52N26m75J07N44o86N09m09m8O32o76N15l13k45O79o26N04k20m27P41
2360D50n92M47j01n28P31n49L73N7o27O93n02L01K25p10O35m37K01L63p46N97
2380B81l79O9M68o90N20l56n0O00o47M25k95j50O65o30L62j82k52O35n57L27n3
2401A11l96N74m50L38j4n12N63l32K42M4n33N47k99J68J32m88M53k94J15K68m71
2422b34L34k61R4L32m75K76k24N7L28m01K45k03k4L43l14J91j97m7L28k65J67
$$ plain form
2277 -35 -137 -190 0 340 -86 -164 -1 -45 207 -41 -43 117 -208 104 137 16 129 -299 111 273 -22 146
2299 146 -246 95 292 -97 238 -152 -6 275 -97 351 -68 -116 299 -84 381 -10 -192 318 -122 370
2319 370 101 -220 314 -171 323 226 -257 306 -174 272 317 -267 328 -170 175 401 -229 349 -170 61 470
2340 470 -182 344 -131 -24 520 -166 343 -66 -114 518 -158 357 44 -201 478 -148 356 136 -291 450
2360 450 -142 305 204 -324 407 -142 231 288 -339 354 -148 153 378 -332 303 -134 67 430 -316 281
2380 281 -98 -29 439 -251 269 -87 -137 463 -184 241 -54 -204 461 -169 193 11 -241 394 -163 164 111
2401 111 -285 289 -161 177 163 -349 214 -118 124 168 -365 182 -117 51 183 -305 148 -146 -31 237 -234
2422 -234 100 -161 -67 265 -210 66 -158 -101 227 -174 71 -132 -156 187 -127 64 -133 -180 148 -117 50
2443E0j49q9K69k38K22j05j58J75j24K63j30k42J85l8K20k01j52K39j02J15j18
2464a08KJ58l11J80P0K5k8l72L83J25j61r8j87M77r9k74J75j03K75l10n2M69l36
2487a00k1j47K27M15p00O3K14J51R7o96M40K36l22J12k77N39j78n41N74o3J53
2508A76m10k72R35l61k16p6K3P34p64n8M59k17K63o72M39N18q28K21q9M71J07
2529C83j071P06J91j03m5o87J002j52n88M47k80O27n64m21J057m84M6l50KJ046
2549G62r88mK62p2N87j031M10N06o35L75n09N92J96j034P35q6J66l9q33J053k27
2570A86k85K31n04Q92n24l34P31n69M45m19r8Q86q84K51k3j04P16r89L87K54m45
2591a99O10p20M16K06p09P74m73J68J96p24R00m55l8L54p01P95m14q3N10q08O78
$$ plain form
2443 50 -99 -188 81 -157 65 -40 -198 -23 -147 116 -14 -256 -71 -109 111 -90 -242 -3 -105 10 -108
2464 -108 -106 52 -259 -79 -9 16 -12 -384 -1 124 -37 -135 -322 155 56 -218 -43 -146 129 -181 -233 236 -100
2487 -100 -121 -268 -41 374 -326 -263 -49 102 199 -497 -57 179 -143 -31 -308 231 53 -488 86 23 176
2508 176 -234 -506 429 68 -148 -224 -201 533 -231 -289 170 -47 216 -456 -17 501 -327 -106 -195 276 383
2529 383 -688 18 209 106 61 -626 376 224 -364 83 -197 430 -134 -555 502 18 64 -286 -284 762
2549 762 -226 -230 32 -40 547 -484 -74 432 -203 172 -337 255 451 -583 152 66 232 193 -640 413 186
2570 186 -99 132 -372 520 -4 -338 393 -176 269 -150 -248 638 -246 5 -18 -122 594 -395 -8 246 -199
2591 -199 411 -309 107 313 -396 378 -95 73 269 -455 445 -10 -48 306 -395 400 -14 -97 413 -395 283
2612B83k37j24M93q43O62q9l26N37o97O02j49m52P53n71K90j42l04Q98p25K0J82
2633F1j96O70q44J39N33n03L64n07L40M21r06M95lR0R1q52Q45J02m61J32l90Q41
2655D62k53o89O50j59K38l95k78R92n54k60R6J39N96r49m6P03j69L5o52M48N86
2676E41q03Q4P3L71j5q89O67L38l14k48k68R21j47p59L06J88L58n44l88Q76j74
2697A74l10j61K21O30p85k23N62J07m0o75L01O71n16j87k5M26J41p69K97L81j10
2718A10k51l00O90Q1o52O3K39L62l69m57N51J60k34k38P2M99l23l36K98J94j5
2739A44m41O3N26j90k98k6K61K35m48o1L18mr1k46K48K32l86j9J60J49n7l86K56
2762f1K29j72p6j07K83Qk98J89J5M1q3j57L34q1j83Q3k3K40k04j61K56q0P3j13
$$ plain form
2612 283 46 -78 415 -428 234 145 -181 356 -341 261 112 -340 413 -158 132 -10 -314 584 -141 -121 61
2633 61 -135 535 -309 -170 363 -140 224 -283 57 478 -428 67 64 154 245 -607 238 340 -121 11 -379 462
2655 462 209 -480 170 11 249 -146 -424 568 14 -246 -150 -11 585 -364 -410 293 124 159 -493 -45 541
2676 541 -262 -178 -105 266 251 -638 29 367 53 -195 -463 458 311 -448 -142 46 404 -140 -528 348 174
2697 174 -136 -297 -76 554 -231 -454 108 215 175 -500 -199 472 -44 -231 -256 170 311 -458 -161 220 110
2718 110 -141 -441 249 330 -322 -259 -20 342 -27 -484 67 227 -7 -245 -173 326 3 -333 -35 159 144
2739 144 -297 -234 292 102 -196 -222 39 274 -174 -235 83 79 -12 -258 -10 222 -164 -183 -23 126 69 -317 -61
2762 -61 168 -4 -80 -187 96 104 -194 -5 10 51 -32 -189 145 64 -119 -36 -59 181 -23 -184 72 -8 65 -48
2786d8n8K42k24M6Q3r2J48k30R4J61k09J28j43P5J59k53J78r4j6J59k04J78p7
2809Cj06K27k00J53n5j38K52j98J23J2j93K46k02J25O4k50K52j76Q0J06k71K37
2831I1j13JJ51k67K36j22n1K37k74J96j06o7K80k80J34k6j19K90k84J27L9j84
2853a11K69k35J19O5k46K87j90P7Q7k71L00j60J4J23k77K75j36l0J90k81K25q8
2875Fn7K25l14K07n0r6K46k74J45Mj50K69k53J23J3j76K94k27Q5O2k08K91k04
2898c9M4J00k34K64j61K2J34k72K54j17j3J54k84K36q1n4J70k63K07m9j08K17
2920A27k41J62l3j30K53k38J08Kj09K40k39R2N2j63K42k00O0Q9k07K33j57N4P9
2943G6k05K30j21MR0k09K24j09k8J34k05J87q3m4J51k09J53m5n9J67k16J23j2
$$ plain form
2786 -48 -106 136 -88 -42 41 -51 97 -133 -39 122 -87 41 -102 -27 132 -121 57 -37 -53 106 -98 80 3
2809 3 -103 124 -76 77 22 -116 136 -62 61 73 -120 126 -76 49 113 -137 115 -61 19 125 -146 91
2831 91 -22 -21 130 -137 99 -23 -74 163 -111 85 -21 -88 192 -88 46 20 -99 191 -93 34 73 -111
2853 -111 158 -77 42 107 -139 148 -42 35 122 -149 151 -9 5 128 -149 126 -10 -40 150 -131 94 6
2875 6 -51 174 -140 67 17 -79 167 -107 38 42 -108 161 -92 31 44 -132 162 -65 20 82 -126 165 -39
2898 -39 5 105 -129 135 -26 -4 130 -142 112 -5 -18 136 -148 88 7 -47 123 -140 67 18 -90 127
2920 127 -114 48 15 -115 138 -100 8 10 -99 141 -98 -6 46 -117 125 -75 -15 74 -133 100 -57 -3 76
2943 76 -129 101 -20 -16 74 -135 89 -20 -48 86 -119 68 -15 -59 92 -117 36 -9 -68 99 -117 6 -6
2966fq2J88k03J13mj05J95j92R5K7j34J90j48O7L8j43J93j40L9N7j55J90j14J9
2990a5P9j70J89j11oJ09j88J67q4j0J15k00J62n8l2J27k11J70l7o4J39j79J34
3013B6k7j02J83j50Q6k9r1K31j85L7K6p5J86j91M6R8j35J43j50Q0J02k23J46n1
3037a9N0L5k21J95%o5M3j53K53j06j31J57r5J38j56m2K57j77Nl7L7K09k86K6J23
3062D0j7O4k49J70J48k28N6n5J93j8l17K39P7k5j17j40L61p2k30P9K5J93k47j24
3086a94L38p8p5j42R7L10l42o3J46R5L6l78J97K54j95o8j03L24K3m07J72J30P2
3109A49j81k29M46j4k64l3Q0L39l11k24L28M1k7l01R4M04l01j54P7K05R1m58J01
3132a42L36j05j44j86L45J36m22N7J47J63j65l12L81J02k23r4J6L78k01l18K72
$$ plain form
2966 -6 -88 100 -103 10 6 -99 96 -96 -1 26 -108 82 -66 1 39 -104 89 -51 -12 45 -110 80 -34 -15
2990 -15 64 -106 83 -28 -34 75 -113 54 -30 -40 75 -125 37 -21 -53 74 -137 33 -4 -68 71 -108 26
3013 26 -1 -103 80 -70 16 -13 -104 127 -58 -21 5 -70 116 -75 -29 69 -66 77 -73 7 109 -114 32 -19
3037 -19 31 66 -155 40 40 -25 18 -135 118 12 -119 38 -57 81 -75 -117 140 -37 -32 -69 -32 177 -109 -83 40
3062 40 23 87 -162 8 156 -72 -16 -71 122 104 -213 26 103 78 -39 -179 182 110 -120 -41 -16 177 -70 -194
3086 -194 144 66 -9 -151 -54 256 -86 -149 -3 92 128 -250 -53 201 6 -62 -165 159 182 -225 -53 77 149
3109 149 -32 -261 185 171 -93 -126 -46 293 -18 -242 86 127 100 -201 -107 297 -4 -158 -81 124 215 -243 -142
3132 -142 194 89 -55 -241 104 240 -182 -125 22 185 20 -292 89 191 -32 -126 -110 268 67 -251 21
3153B1R0N0l18k7M45j94j65j4J72J97m18PK85k8p5k86K92K09l57NL8K29o9l59
3177b70K95J02j15r2r6L65j14k58J53N9J35k45j23L69j19o4p3N8K47l08j8J73
3199F1j4N4k81J65K00k36J9m8J72K9l00J81O0k2l2j83K90n6j67J06n2J92j63j36
3223a61K50q5Pq5mK30k14NP6l8J33k25Q3J37j63R2j10R8Q1k32J66l0JN8j99K08
3249G9n1q2J01j20J57q0r3J65j22Q9n3o4J77j64N2K2o9J23j47P1O3j36J51j28
3273e9O2N7j52J58r4J8O5j32J59r5qR0j31J23o7l4J03j29J10l3n4J13j36Q9jq0
3299e8J05j20R2Oj10J45j03M6K2j00J31r1K1N3j01J19q5J1O5j02J00p1j3J02j17
3324e3Q8l5l0Q9j15R5k1n9R3j04O6jp3J08q7N1%p5J06q6M1K3q4J04q9K6M8q4Q7
$$ plain form
3153 21 111 161 -157 -184 261 67 -98 -112 60 257 -161 -154 131 103 28 -258 34 243 -114 -109 -71 158 89 -270
3177 -270 25 127 12 -80 -176 189 75 -183 -30 29 164 -81 -204 165 46 -18 -91 -33 214 -94 -112 61
3199 61 47 101 -180 -15 185 -51 -32 -80 92 121 -179 2 62 40 8 -175 115 59 -108 -2 -54 138 -25 -161
3223 -161 89 4 11 -74 -78 152 -62 -57 19 -19 114 -111 -28 109 -54 38 -72 26 107 -125 41 11 12 70 -129 79
3249 79 28 -54 47 -73 84 4 -89 76 -46 43 -10 -74 103 -61 -9 13 -56 67 -80 -9 54 -82 69 -59
3273 -59 3 60 -92 66 -28 -10 55 -77 82 -13 -21 69 -62 61 -6 -40 63 -66 44 11 -43 70 -66 23 22 -58
3299 -58 47 -73 19 25 -85 60 -43 3 25 -75 56 -35 -14 39 -62 57 -28 -17 48 -54 46 -25 -38 64 -53
3324 -53 35 0 -30 59 -56 39 18 -41 52 -52 14 13 -60 48 -39 12 12 -63 43 -43 -2 21 -63 41 -48 -22 26 -58 29
3353B9o1ON2p9Q1m6jN7r4R4l2l3P5r5P5j5l6Q1r1N6kn0P9q4M6On4P1o8K1L2n7
3385c7P2o7J8L2p0P4n3%N6p5Q4m1j3O7r1O0k7j3O9q0N5pm3Q7q6O0j6n3R5q3L6
3416A0Qn5Q7p0K3J9o2R1p6J2L5p8Q8n9RN3r7R0l9k2P7r8P4j3n8R1q6P9l3m3R9
3447E6r1O0j1o3J19r7L6J8o3J01r7L4M7j03J06q3L7O1j45J18n2j2P2j34J24l9
3473am2Q7j11J15n2p1J53j29P6j5q0J49j29O0J5q9J55j45N1O6j25J50j35M6R7
3498I6j78J48q5K2R0j97J65l9m6R7j81J85n2j06J64j70J54o1j05K06j69Q7j0j08
3522i3K18k02N4O7j24J95k02P6J23j97J73j49N9J15k47K10q0oJ23k69K54n2j15
$$ plain form
3353 29 -32 -26 26 -53 28 -18 -19 38 -56 38 6 -27 48 -47 28 13 -23 58 -33 23 21 -29 50 -34 12 18 -36 35 -33 -12 20 -37
3385 -37 35 -32 -14 18 -52 22 -31 -31 25 -50 34 -7 -20 47 -44 16 -11 -24 45 -35 20 13 -30 57 -29 31 15 -38 57 -26 10
3416 10 18 -37 50 -20 3 22 -40 51 -25 -13 22 -56 32 -27 -18 35 -62 28 -11 -33 44 -54 20 7 -51 40 -46 33 0 -43 56
3447 56 -35 25 14 -49 70 -27 9 27 -36 65 -32 2 49 -54 52 -31 6 67 -78 40 -12 -24 48 -86 38 -1
3473 -1 -43 44 -67 48 -4 -75 78 -51 25 10 -70 79 -50 10 25 -64 91 -54 -3 63 -62 88 -47 -1 96
3498 96 -82 66 -19 3 93 -104 61 22 -24 73 -108 77 25 -81 83 -87 67 6 -99 107 -62 25 15 -93
3522 -93 125 -77 -23 44 -80 115 -87 -11 112 -85 88 -61 -2 113 -134 76 -4 -10 113 -156 98 46 -69
$$ [...]
8191c9
##END NTUPLES=NMR FID
##END=
