##TITLE=1H_DEApr26_150
 200.13Hz, DMSO-d6+CDCl3.
 8 sc
 
1.1.2026
##JCAMPDX= 6.0         $$ Bruker NMR JCAMP-DX V2.0
##DATA TYPE= NMR FID
##DATA CLASS= NTUPLES
##ORIGIN= UXNMR, Bruker Analytische Messtechnik GmbH
##OWNER= pz
$$ XWIN-NMR		Version 3.5
$$ Wed Apr  1 13:37:24 2026 Russian Standard Time (UT+4h)  she@DPX200
##.OBSERVE FREQUENCY= 200.1313
##.OBSERVE NUCLEUS= ^1H
##.DELAY= (6, 6)
##.ACQUISITION MODE= SIMULTANEOUS
##.ACQUISITION SCHEME= undefined
##.AVERAGES= 8
##.DIGITISER RES= 18
##SPECTROMETER/DATA SYSTEM= spect
##.PULSE SEQUENCE= zg30
##.SOLVENT NAME= CDCl3
##.SHIFT REFERENCE= (INTERNAL, CDCl3, 0, 14.3821)
##AUDIT TRAIL= $$ (NUMBER, WHEN, WHO, WHERE, WHAT)
$$ ##TITLE= Audit trail, XWIN-NMR		Version 3.5
$$ ##JCAMPDX= 5.01
$$ ##ORIGIN= Bruker BioSpin GmbH
$$ ##OWNER= she
$$ F:/spectra/data/she/nmr/H-C/1/audita.txt
$$ ##AUDIT TRAIL=  $$ (NUMBER, WHEN, WHO, WHERE, WHAT)
(   1,<2026-04-01 13:36:05.00 +0400>,<she>,<DPX200>,
      <created by zg, POWCHK disabled, PULCHK disabled
       configuration hash MD5:
       00 E9 B6 7A A2 85 ED C7 34 08 36 98 17 FE 4E 26
       data hash MD5: 16K
       3F BD 0D 91 8F 3C 8D C7 2F EC E2 37 E4 DC F0 E3>)
$$ ##END=
$$ 
$$ hash MD5
$$ 32 FC C3 F3 E6 C6 A5 A6 7C CA 82 CB BF 07 82 52
##$RELAX= 
##$RELAX= 
##$RELAX= 
##$RELAX= 
##$RELAX= 
##$RELAX= 
$$ Bruker specific parameters
$$ --------------------------
##$DU= <F:/spectra>
##$EXPNO= 1
##$NAME= <H-C>
##$PROCNO= 1
##$TYPE= <nmr>
##$USER= <she>
##$AMP= (0..31)
100 100 100 100 100 100 100 100 100 100 100 100 100 100 100 100 100 100 
100 100 100 100 100 100 100 100 100 100 100 100 100 100 
##$AQSEQ= 0
##$AQ_mod= 1
##$AUNM= <au_zg>
##$AUTOPOS= <>
##$BF1= 200.13
##$BF2= 200.13
##$BF3= 200.13
##$BF4= 200.13
##$BF5= 200.13
##$BF6= 200.13
##$BF7= 200.13
##$BF8= 200.13
##$BYTORDA= 1
##$CFDGTYP= 0
##$CFRGTYP= 5
##$CHEMSTR= <none>
##$CNST= (0..31)
1 1 145 1 1 1 1 1 1 1 1 1 1 1 1 1 1 1 1 1 1 1 1 1 1 1 1 1 1 1 1 1 
##$CPDPRG= <>
##$CPDPRG1= <>
##$CPDPRG2= <>
##$CPDPRG3= <>
##$CPDPRG4= <mlev>
##$CPDPRG5= <mlev>
##$CPDPRG6= <mlev>
##$CPDPRG7= <mlev>
##$CPDPRG8= <mlev>
##$CPDPRGB= <>
##$CPDPRGT= <>
##$D= (0..31)
0 0.7 0 0 0 0 0 0 0 0 0 0.03 0 0 0 0 0 0 0 0 0 0 0 0 0 0 0 0 0 0 0 0 
##$DATE= 1775036164
##$DBL= (0..7)
120 120 120 120 120 120 120 120 
##$DBP= (0..7)
150 150 150 150 150 150 150 150 
##$DBP07= 0
##$DBPNAM0= <>
##$DBPNAM1= <>
##$DBPNAM2= <>
##$DBPNAM3= <>
##$DBPNAM4= <>
##$DBPNAM5= <>
##$DBPNAM6= <>
##$DBPNAM7= <>
##$DBPOAL= (0..7)
0.5 0.5 0.5 0.5 0.5 0.5 0.5 0.5 
##$DBPOFFS= (0..7)
0 0 0 0 0 0 0 0 
##$DE= 6
##$DECBNUC= <off>
##$DECIM= 32
##$DECNUC= <off>
##$DECSTAT= 4
##$DIGMOD= 1
##$DIGTYP= 9
##$DL= (0..7)
0 120 120 120 120 120 120 120 
##$DP= (0..7)
150 150 150 150 150 150 150 150 
##$DP07= 0
##$DPNAME0= <>
##$DPNAME1= <>
##$DPNAME2= <>
##$DPNAME3= <>
##$DPNAME4= <>
##$DPNAME5= <>
##$DPNAME6= <>
##$DPNAME7= <>
##$DPOAL= (0..7)
0.5 0.5 0.5 0.5 0.5 0.5 0.5 0.5 
##$DPOFFS= (0..7)
0 0 0 0 0 0 0 0 
##$DQDMODE= 0
##$DR= 18
##$DS= 0
##$DSLIST= <SSSSSSSSSSSSSSS>
$$ [...]
##$SUBNAM0= <"">
##$SUBNAM1= <"">
##$SUBNAM2= <"">
##$SUBNAM3= <"">
##$SUBNAM4= <"">
##$SUBNAM5= <"">
##$SUBNAM6= <"">
##$SUBNAM7= <"">
##$SUBNAM8= <"">
##$SUBNAM9= <"">
##$SW= 18.0517328524113
##$SWIBOX= (0..15)
0 0 2 0 0 0 0 0 0 0 0 0 0 0 0 0 
##$SW_h= 3612.71676300578
##$TD= 16384
##$TD0= 1
##$TE= 0
##$TE2= 300
##$TE3= 300
##$TEG= 300
##$TL= (0..7)
0 120 120 120 120 120 120 120 
##$TP= (0..7)
150 150 150 150 150 150 150 150 
##$TP07= 0
##$TPNAME0= <>
##$TPNAME1= <>
##$TPNAME2= <>
##$TPNAME3= <>
##$TPNAME4= <>
##$TPNAME5= <>
##$TPNAME6= <>
##$TPNAME7= <>
##$TPOAL= (0..7)
0.5 0.5 0.5 0.5 0.5 0.5 0.5 0.5 
##$TPOFFS= (0..7)
0 0 0 0 0 0 0 0 
##$TUNHIN= 0
##$TUNHOUT= 0
##$TUNXOUT= 0
##$USERA1= <user>
##$USERA2= <user>
##$USERA3= <user>
##$USERA4= <user>
##$USERA5= <user>
##$V9= 5
##$VALIST= <valist>
##$VCLIST= <CCCCCCCCCCCCCCC>
##$VD= 0
##$VDLIST= <DDDDDDDDDDDDDDD>
##$VPLIST= <PPPPPPPPPPPPPPP>
##$VTLIST= <TTTTTTTTTTTTTTT>
##$WBST= 1024
##$WBSW= 4
##$XGAIN= (0..3)
0 0 0 0 
##$XL= 0
##$YL= 0
##$YMAX_a= 204793
##$YMIN_a= -305036
##$ZGOPTNS= <>
##$ZL1= 120
##$ZL2= 120
##$ZL3= 120
##$ZL4= 120
##$ABSF1= 10
##$ABSF2= 0
##$ABSG= 5
##$ABSL= 3
##$ALPHA= 0
##$AQORDER= 0
##$ASSFAC= 0
##$ASSFACI= 0
##$ASSFACX= 0
##$ASSWID= 0
##$AUNMP= <proc_1d>
##$AZFE= 0.1
##$AZFW= 0.1
##$BCFW= 1
##$BC_mod= 2
##$BYTORDP= 1
##$COROFFS= 0
##$CY= -3
##$DATMOD= 1
##$DC= 2
##$DFILT= <>
##$DTYPP= 0
##$F1P= 0
##$F2P= 0
##$FCOR= 0.5
##$FTSIZE= 0
##$FT_mod= 4
##$GAMMA= 1
##$GB= 0.15
##$INTBC= 1
##$INTSCL= 1
##$ISEN= 128
##$LB= 0.25
##$LEV0= 0
##$LPBIN= 0
##$MAXI= 10000
##$MC2= 0
##$MEAN= 0
##$ME_mod= 0
##$MI= 1.114404
##$NCOEF= 0
##$NC_proc= 0
##$NLEV= 6
##$NOISF1= 3.799351
##$NOISF2= 2.8
##$NSP= 1
##$NTH_PI= 0
##$NZP= 0
##$OFFSET= 14.38212
##$PC= 1
##$PHC0= -3710.619
##$PHC1= 12.19231
##$PH_mod= 1
##$PKNL= yes
##$PPARMOD= 0
##$PSCAL= 0
##$PSIGN= 0
##$REVERSE= no
##$SF= 200.129724274929
##$SI= 16384
##$SIGF1= 3
##$SIGF2= 2
##$SINO= 400
##$SIOLD= 16384
##$SREGLST= <1H.CDCl3>
##$SSB= 0
##$STSI= 0
##$STSR= 0
##$SW_p= 3205.1282051282
##$SYMM= 0
##$S_DEV= 0
##$TDeff= 0
##$TDoff= 0
##$TI= <>
##$TILT= no
##$TM1= 0
##$TM2= 0
##$TOPLEV= 0
##$USERP1= <user>
##$USERP2= <user>
##$USERP3= <user>
##$USERP4= <user>
##$USERP5= <user>
##$WDW= 1
##$XDIM= 8192
##$YMAX_p= 0
##$YMIN_p= 0
$$ End of Bruker specific parameters
$$ ---------------------------------
##NTUPLES= NMR FID
##VAR_NAME=  TIME,          FID/REAL,        FID/IMAG
##SYMBOL=    X,             R,               I
##VAR_TYPE=  INDEPENDENT,   DEPENDENT,       DEPENDENT
##VAR_FORM=  AFFN,          ASDF,            ASDF
##VAR_DIM=   8192,          8192,            8192
##UNITS=     SECONDS,       ARBITRARY UNITS, ARBITRARY UNITS
##FACTOR=    0.0002768,     1,               1
##FIRST=     0,             0,               0
##LAST=      2.2672688,     0,               0
##MIN=       0,             -305036,         0
##MAX=       2.2672688,     204793,          0
$$ Real data points
##PAGE= N=1
##DATA TABLE= (X++(R..R)), XYDATA
0 0 0 0 0 0 0 0 0 0 0 0 0 0 0 0 0 0 0 -7 8 -8 8 -8 12 -14 16 -16 22 -24 28 -32 37 -42 47 -54 60 -68 76 -85 95
39 95 -105 118 -130 144 -160 178 -195 216 -238 263 -290 317 -352 386 -427 471 -523 582 -651 729
59 729 -823 935 -1077 1257 -1499 1834 -2338 3184 -4856 9461 -50129 -163012 -67119 83170
73 83170 177952 185683 161402 140268 167496 192938 139073 7819 -105983 -153869 -136134 -105099
85 -105099 -122934 -195883 -223155 -140534 -3687 85956 97974 71188 64960 96534 124364 92418
97 92418 18537 -21898 13523 82691 113952 74089 -8233 -70930 -79506 -65808 -81020 -124214
109 -124214 -151093 -135298 -80299 -14450 23667 26664 41595 102869 174459 191066 134050 45790
121 45790 -11326 -14469 -3841 -23776 -58803 -68220 -51209 -36151 -40468 -65738 -99475 -110460 -74272
134 -74272 -9859 39112 50813 48338 66708 109942 142913 129793 79867 33878 9515 -13695
146 -13695 -58070 -111876 -147048 -142456 -94089 -31082 6996 14314 15779 25733 38698 45103 38570
159 38570 22843 18402 36661 58479 58633 36547 6470 -10169 -4148 2968 -19670 -63844 -91021
172 -91021 -86856 -68502 -51644 -33969 -9057 27459 66119 86545 80766 59089 30954 8404
184 8404 4252 13289 10421 -10639 -25359 -18851 -8317 -14084 -33846 -49141 -46264 -32163 -23994 -27179
198 -27179 -26657 -10828 16249 48356 76758 89045 78274 57698 37500 12724 -20600 -53542
210 -53542 -73312 -73529 -54835 -31560 -18953 -15918 -8351 7388 22783 27840 20153 9437 8402
223 8402 16703 20607 17523 17745 24298 28746 26437 16924 -2072 -29469 -54336 -63991 -57857 -43083
237 -43083 -29500 -16656 5381 34079 51711 46400 32748 25941 23768 14828 1375 -8421 -13274
250 -13274 -13450 -9445 -2764 2560 2149 -6596 -16752 -21260 -23997 -31883 -37594 -27242 -3343 20018
264 20018 36974 46694 48804 45224 38362 24523 3195 -17662 -31663 -37196 -36389 -32840 -26834 -17782
278 -17782 -5606 5855 11950 14054 11920 4087 -3389 -1726 6088 9247 10228 16665 26575 30314 22784
293 22784 6807 -8399 -18906 -27927 -37756 -41919 -35122 -23661 -12186 2705 20251 31840 33110
306 33110 28192 23691 18407 8114 -5404 -14976 -13485 -5630 -1109 -298 2118 4638 934 -7005 -14158
321 -14158 -20051 -25569 -24396 -16320 -4628 7930 19366 28660 34717 35323 29901 17593 2746 -11182
335 -11182 -21278 -25591 -25128 -22764 -18637 -9078 3677 8824 6138 3937 3378 262 -4074 -5282 -1519
350 -1519 5108 10767 15590 21053 24084 19632 7492 -3897 -11098 -19178 -28764 -33450 -27182 -16190
364 -16190 -6166 2540 11657 18693 22254 19517 13255 8168 3298 -2237 -6155 -3680 1133 2779 2745
379 2745 3751 3504 -717 -7208 -13965 -19052 -20518 -18027 -12338 -5123 4313 13664 20832 25801 25124 19258
395 19258 11431 4182 -4154 -12494 -16409 -14614 -12424 -10100 -4798 1403 3477 1118 -2125 -3513 -3826
410 -3826 -5756 -7347 -3946 4526 11977 15324 17619 20910 19021 10345 502 -7470 -14880 -21708 -24779
425 -24779 -21529 -13809 -5198 1110 6129 11560 14396 11166 5626 2297 252 -1744 -2006 520 4036
440 4036 6956 9017 9366 7388 2363 -5034 -12290 -17655 -19951 -19850 -15336 -6901 2162 9622 16229 20350
456 20350 18975 12992 7359 3209 -1737 -6730 -8619 -6429 -3097 -1604 -832 919 2128 -215 -5665
471 -5665 -8934 -9741 -10426 -11101 -7094 1566 10007 14968 18277 19749 17969 11666 2484 -5070 -10776 -13565
487 -13565 -15426 -14321 -10428 -5414 -1691 1173 4506 6528 5398 2904 894 -1233 -2643 -1895 724
502 724 4694 9188 12001 12479 9860 4363 -2565 -9728 -14004 -16142 -16663 -13804 -7230 -1460 2674 6883
518 6883 10668 12134 10722 8003 5161 2170 -1524 -4280 -3937 -590 2573 3049 3483 4582 1463 -5516
534 -5516 -11494 -13822 -14230 -12532 -8065 -851 6336 11787 14012 15279 14524 12217 6640 941 -3017 -6799
550 -6799 -10527 -11772 -9686 -6244 -2793 808 2814 2335 543 -2850 -5227 -5667 -3705 -659 3944 9316
566 9316 12489 12136 10709 8048 3361 -1797 -5719 -8457 -10498 -11828 -11474 -8862 -4993 -953 2298 5667
582 5667 7880 6897 3496 916 430 110 390 2149 6163 8186 7377 4175 1188 -2041 -6925 -10420
598 -10420 -11371 -10459 -9627 -7808 -4607 236 4960 8297 11182 13071 12155 8017 3256 -372 -3825 -6077
614 -6077 -5714 -3455 -1095 -437 -734 -1650 -3424 -5119 -6680 -6607 -4537 -1580 412 2679 6542 8874 9401
631 9401 9557 9625 7151 2854 -2153 -6534 -9602 -10690 -9863 -7101 -2313 1532 2679 2729 2658 774 -1303
648 -1303 -2614 -975 1375 2899 4346 6641 7495 6844 5185 3186 1045 -2406 -6886 -10225 -11397 -11328
664 -11328 -9861 -5550 314 5101 7701 9052 9275 6679 2956 658 -477 -512 10 1 869 1137 423
681 423 -1496 -2645 -2787 -4063 -5613 -6446 -5420 -4519 -2328 536 4298 8619 10005 10212 8453 5020
697 5020 764 -3217 -6265 -6240 -5641 -4957 -4129 -617 -17 -119 -499 4 901 -492 -812 -963 -1035 309 1533
716 1533 4077 6044 7233 6578 4771 2181 -1488 -6048 -8363 -8491 -8533 -6214 -3750 430 2935 4262
732 4262 4543 4638 4939 3504 1474 144 597 -161 -1230 -1156 487 1595 649 391 -859 -2947 -5489 -7220
750 -7220 -6806 -5021 -2083 1058 4593 7526 8132 7195 5697 3813 1206 -1667 -3548 -4017 -4545 -4852 -3813
767 -3813 -1936 -337 452 994 596 649 -638 -1914 -1903 -508 986 2354 4388 6044 5953 4423 1767
784 1767 248 -2236 -4782 -6366 -6061 -4866 -4509 -2836 -842 1799 3248 3413 3832 3919 2755 911 177
801 177 200 303 66 828 1793 1461 -134 -1328 -2714 -4117 -4903 -5322 -4409 -2635 -951 786 3096 4817
819 4817 5745 5503 4774 3770 1902 -370 -2489 -3523 -3926 -3479 -3313 -1707 -530 78 -523 -483 -577 -933
837 -933 -1583 -1122 509 1978 2994 3670 5132 5043 3935 1850 333 -1587 -3756 -5371 -5995 -4862 -3846
854 -3846 -2650 -499 1786 3168 3012 2610 2227 1418 -41 252 703 938 1464 1930 2028 2082 865 -1115
872 -1115 -2569 -3588 -4810 -5434 -4617 -3242 -1201 535 2534 4712 5388 5145 4068 2907 1204 -152
888 -152 -1495 -1954 -1719 -1623 -1478 -1036 -324 -291 -1304 -1889 -1815 -1979 -2148 -1632 -132 1393 2726 3812 4388
907 4388 5009 4044 2596 635 -812 -2423 -3902 -4208 -4009 -3189 -2424 -1068 502 1045 1312 1099 1071 945
925 945 692 10 689 1540 2055 2318 2307 2530 1470 144 -1199 -2214 -3650 -4694 -4519 -3559 -2081 -839
943 -839 1139 2273 3641 3695 2950 2273 1391 551 -555 -1047 -862 -461 -271 104 452 53 -430 -1406 -2188
962 -2188 -2977 -2960 -2537 -1706 100 1589 2468 3408 3961 3804 2562 1335 469 -1103 -2281 -2683 -2489 -1767
980 -1767 -1371 -982 -269 238 122 -508 -434 -354 -544 -818 15 1451 1891 2291 2651 2951 2319 720 -386 -1308
1000 -1308 -2167 -3171 -3016 -2641 -1546 -912 -406 425 1421 1716 1056 1211 1205 574 241 29 458 783 799 811
1020 811 734 561 -6 -1105 -1890 -2169 -2647 -2507 -1761 -474 169 1048 1767 2531 2118 2037 1092 826 151 -695
1040 -695 -1097 -1233 -476 -500 -237 -87 545 91 -760 -1267 -1404 -1378 -1270 -666 397 1567 1805 2010 2267 2499
1060 2499 1378 333 -634 -965 -1767 -2233 -1842 -1110 -516 13 355 998 739 35 -243 -360 -383 -626 -181
1079 -181 623 1329 1678 1652 1674 1139 216 -862 -1553 -2027 -1995 -1969 -1403 -418 95 771 1240 1506 1146 1428 494
1100 494 310 -219 -304 -570 32 710 883 660 501 339 -163 -822 -1428 -1675 -1089 -1169 -621 355 657 1429 1215
1121 1215 1698 1597 1259 374 -33 -462 -832 -1776 -1452 -735 -245 -13 483 429 48 174 -777 -514 -619 -463
1141 -463 -88 369 1008 1250 1176 1244 1468 723 -281 -770 -1270 -1515 -1680 -1582 -897 127 411 713 1351 1554
1161 1554 832 83 -61 -279 -272 -211 -121 173 604 623 536 517 250 -330 -955 -1044 -1117 -1348 -872 -257 454 836 1185
1184 1185 1434 1389 973 356 -227 -467 -921 -847 -510 -135 168 2 390 259 -241 -99 -483 -604 -401 -412 -205
1205 -205 187 512 881 962 1026 975 437 -277 -754 -681 -1171 -1035 -873 -653 148 385 587 371 769 121 191 17
1227 17 -132 20 -8 -360 26 242 -25 296 608 123 114 -682 -1061 -642 -820 -401 -176 382 741 894 526
1248 526 826 671 115 -197 -90 -648 -704 -1002 -544 115 106 339 589 290 68 -334 -538 -526 -469 -276 -121 889
1270 889 838 1058 774 269 107 -545 -617 -1018 -1082 -692 -469 -202 614 605 500 692 696 830 -55 -254 -420 -183
1292 -183 -255 -116 204 456 283 336 56 102 -144 -954 -671 -775 -387 63 111 539 870 710 420 667 394
1313 394 2 -374 -314 -561 -533 -712 -110 127 136 -4 449 45 204 -95 -319 -233 0 168 357 500 712 450
1335 450 368 149 485 -106 -568 -733 -666 -476 -747 -39 -75 212 667 767 640 668 141 -131 -287 -201 -195 -116 112
1358 112 65 362 393 -179 -292 -206 -414 -704 -340 -445 -317 -21 694 676 752 877 626 434 167 -441 -838 -621
1380 -621 -555 -638 -360 -168 -52 339 -16 112 208 -98 -216 -334 -14 235 152 289 710 792 625 431 -114 -467
1402 -467 -598 -935 -960 -635 -380 47 315 542 351 462 233 256 206 178 -166 72 -140 437 56 92 227 21
1424 21 -123 -315 -504 -546 -548 -426 -75 -173 17 528 604 541 499 464 303 248 -61 -418 -523 -27 -453 -379 -68 128
1448 128 -118 -149 150 83 -4 -457 -44 -23 20 234 287 528 620 268 359 190 -75 -160 -757 -615 -276 -462 -540
1471 -540 -112 210 314 225 518 275 319 77 -10 -40 138 352 90 470 243 270 17 -308 -59 -460 -889 -713
1493 -713 -661 -184 99 324 686 379 219 157 50 -139 -216 -409 -437 116 60 -52 157 80 -134 -393 -183 -91
1515 -91 -247 -209 -340 -17 227 611 229 587 514 364 282 -9 -180 -304 -53 -289 -366 -90 -167 92 60 160
1537 160 75 24 206 -111 -308 79 86 -57 -46 48 234 266 279 12 -34 -203 -526 -194 -528 -570 -152 -274 15
1560 15 298 388 536 470 -10 250 90 -392 -165 -101 -101 -34 106 139 509 -83 -91 -123 -93 -201 -70 -282 101 398
1584 398 31 267 449 443 338 -91 318 -231 -89 -186 -93 -93 -111 -192 102 118 37 76 125 143 -365 -118 -35 -8 72
1609 72 293 168 190 326 80 -168 -43 -55 -448 -537 -377 -104 -104 113 -107 6 -80 88 293 282 301 -59 -355
1632 -355 -36 42 -288 -29 -65 111 -176 -166 117 -14 -139 -311 -65 94 -202 128 -28 152 455 208 -95
1653 -95 77 -308 -280 -393 -99 -163 157 -50 143 305 60 -315 96 197 -88 -332 93 -13 -130 397 78
1674 78 200 198 -57 251 135 -190 -374 -308 -74 36 -67 44 -4 443 377 -106 -10 -105 12 -320 -263 -15 -78
1697 -78 171 280 72 67 104 -276 -125 -132 -585 -213 -222 13 203 -10 51 9 193 272 -6 20 -266 -387 -36 -219
1721 -219 -241 62 -140 380 293 214 50 -151 -168 -20 -180 -81 -153 72 119 24 -118 311 55 -114 18 -290 -494
1744 -494 9 -184 -13 7 91 -11 44 291 219 206 -159 -239 -366 -290 97 -37 192 293 4 60 117 -68 -67 -222
1768 -222 -320 -211 -193 -13 13 -187 -89 128 209 19 67 -177 -167 41 -87 -84 -239 -113 29 -159 171 145 -274
1791 -274 -104 -127 -196 -182 -179 242 -45 106 268 -24 12 90 -196 25 -109 56 -68 -126 -114 -18 237 -129 -32 108
1815 108 179 -34 -130 -413 -86 53 -110 192 -79 -53 204 -234 -17 167 104 -248 149 90 194 -131 44 4
1837 4 27 -33 -116 -223 -144 46 172 189 -313 118 -213 43 34 -27 70 -35 169 -138 83 210 -338 -295 104 76
1861 76 -118 231 159 85 24 -184 -252 -353 112 57 -181 -110 143 226 214 -152 -1 47 148 -73 -162 237 -340 -161
1885 -161 33 42 -71 101 80 160 -83 38 -1 -269 39 -116 138 149 60 143 65 -215 184 -267 -178 -37 -99 131
1909 131 13 -63 101 279 -187 -23 -112 -347 -13 94 41 -59 -132 -217 80 -65 11 179 96 52 -88 117 2
1932 2 114 116 149 -185 202 -114 241 135 4 -96 42 -59 -214 -161 103 -73 75 -115 262 65 282 183
1954 183 -105 56 -55 45 -276 -6 -11 -2 7 195 -194 -13 159 -350 -320 -50 -147 -56 -63 46 235 264 132 23
1978 23 195 128 71 -11 70 -121 -125 19 238 -36 47 -118 51 3 -169 25 -163 112 -54 -89 28 -140 130
2001 130 40 211 44 26 0 -69 -51 -31 37 -141 -117 246 -25 24 6 -262 114 -280 -104 -44 -45 -159 151 -45
2025 -45 17 87 175 11 283 4 89 18 -130 -310 -43 -168 12 -27 203 -25 -72 41 96 16 88 -275 -195 151
2049 151 -28 -188 -186 39 -202 97 -45 27 -106 97 -21 -25 83 -76 68 161 278 -59 7 5 -106 112 -264
2072 -264 -367 109 -270 -159 62 -210 41 23 63 85 -9 -115 -132 -198 -105 38 -135 120 113 30 28 249 -9 -110
2096 -110 -26 -113 20 51 53 49 103 105 -73 107 -25 -50 -233 -43 -303 -38 -123 235 -179 168 168 128 -96 -362 46
2121 46 -244 -42 192 219 82 66 -99 301 -59 -88 -150 21 143 58 -10 -27 -8 -185 -100 61 -116 41 216
2144 216 -335 223 -169 -44 212 -56 -47 -20 -8 -261 -64 -115 -140 155 -278 62 -123 211 52 65 59 -87 -3
2167 -3 103 106 71 457 234 -250 216 -40 -327 2 -77 81 150 74 -488 -94 -343 106 24 -284 -55 13 15 280
2191 280 66 218 -293 432 -135 39 110 -151 -120 4 148 58 -115 -45 -48 -1 170 -36 -13 -71 154 -329 -25
2214 -25 221 145 -63 184 55 -47 107 -78 19 29 150 -228 -88 38 -213 -59 -185 -148 101 -8 272 -84
2236 -84 -68 -140 -168 -98 -83 -43 -54 59 -66 -69 211 84 8 -89 -337 -123 149 -243 -338 124 116 -68 0 22 -8 112
2262 112 -62 -7 135 131 -137 -73 72 182 -126 -12 -44 19 -15 65 40 155 7 -1 39 81 -40 -57 -142 35 -218
2287 -218 30 -64 -166 73 -208 6 -136 81 -303 109 -66 3 -159 -122 -50 246 -191 67 52 -164 -216 130
2309 130 -131 -38 107 164 -20 -31 340 217 61 26 13 -56 69 -171 -120 31 -3 122 94 7 -135 188 62
2332 62 -118 -58 153 -4 -170 205 100 16 168 -38 284 2 48 -17 -137 42 -248 339 -26 224 233 126
2354 126 173 -1 10 -10 -206 59 58 -35 14 -38 -82 27 34 -53 -165 150 -85 77 -78 32 9 401 -62 141
2378 141 99 -118 10 -214 50 -169 87 20 -215 -366 99 9 88 31 127 44 -103 -148 52 -100 267 -17 16
2401 16 -38 198 -68 -271 185 147 107 -330 -201 -59 61 -97 62 -185 296 -76 -85 7 -337 130 -109 -97 -13
2424 -13 55 -276 -60 58 279 236 -233 -30 336 142 67 356 -45 -147 -227 132 -74 183 122 46 57 -187 107
2447 107 -182 134 25 -117 101 135 145 -84 53 -33 64 25 -5 79 -187 68 29 35 11 190 -150 -107 -171 9
2471 9 42 1 -136 127 80 92 13 78 -205 -27 127 -349 -120 70 42 -242 74 -64 -30 7 -10 -81 -256 -161 -144
2496 -144 169 82 -114 -279 142 -34 238 -55 234 -46 -4 111 -176 18 87 144 23 93 -172 61 36 -132
2518 -132 44 -167 56 -99 -56 -83 -9 -2 -109 -10 103 -105 -162 55 -119 -311 -80 105 -6 -126 -86 33 93
2541 93 -82 71 -76 110 82 -147 55 -146 213 162 -205 -77 136 83 -248 -155 -129 -116 321 -191 -67 -123 -52
2564 -52 191 4 -135 -179 330 -98 -46 -64 60 37 139 -10 146 -24 -74 -148 -130 -143 -106 -39 155 203 -14 -253
2588 -253 -75 141 6 182 88 -122 -337 159 115 -132 31 140 -31 73 232 109 -65 -172 18 259 202
2609 202 144 -186 103 101 -63 172 99 87 -163 -92 22 94 45 -255 -267 -164 9 35 -188 -214 -8 -21 -179 -118
2633 -118 55 -44 -161 42 106 262 66 -113 249 -28 95 142 -25 -81 -13 -116 219 240 -115 -164 -192 42 -167
2656 -167 -98 -164 -83 -105 -152 -201 162 55 2 2 156 -56 66 25 356 275 62 -208 -210 -29 -238 -87 1 -131 -169
2681 -169 -192 336 -192 66 223 -93 188 58 63 -82 -190 -54 30 -141 -223 134 -32 74 86 -77 -32 190
2703 190 18 179 27 358 -29 2 293 102 233 -18 -11 5 167 12 29 -67 -58 75 -5 8 71 133 -55 72
2727 72 -107 -265 168 83 176 94 -32 44 -172 87 68 85 -7 -4 89 -33 39 14 -46 124 -118 -241 -163 -109 9
2752 9 -101 -25 148 58 -28 -103 -24 177 -102 -256 -183 345 90 1 -307 52 227 1 32 -74 -73 -135 -145 45 -150
2777 -150 -131 24 -63 117 68 -161 46 -9 -68 -86 -34 -71 -269 185 106 -45 -14 -101 -14 23 150 36 127 -106 73
2802 73 -50 148 -209 -17 -93 20 57 226 60 -182 -4 -76 -211 69 33 49 64 0 332 76 -239 23 -23
2825 -23 -181 24 101 -38 142 95 -38 125 -62 -130 80 159 11 -90 229 92 -38 -365 -237 -119 134 39
2847 39 -52 231 -272 41 37 95 156 -35 172 -86 -46 -3 20 90 64 -209 -156 76 -205 -33 -62 -33 141 -159 -333
2872 -333 -116 -39 131 -206 134 42 -68 190 -46 -62 261 84 31 39 -236 115 63 -36 -201 144 42 46 -104
2895 -104 158 -125 128 53 90 74 27 -104 -212 126 120 -29 -217 180 -242 -137 45 149 -113 -282 23 -6
2917 -6 -96 232 130 18 -302 -174 66 -3 -8 -282 57 -61 -44 -61 32 -105 -96 -311 179 88 102 -46 -50 -4 -227
2942 -227 70 103 141 -100 -95 -214 117 -86 -153 22 222 -105 104 -10 -125 -114 247 14 -187 142 19 -33
2964 -33 68 170 20 -110 303 165 -253 -8 -19 148 110 -203 -43 37 119 86 -99 -84 25 -39 325 -115 276
2987 276 -133 187 124 85 -135 -144 182 -60 260 8 69 -33 -48 -64 153 -138 241 67 -146 221 -332 -226
3009 -226 120 -33 -33 -185 279 96 101 127 -83 89 158 -131 -249 -44 -314 6 99 340 92 -40 -1 159 99
3032 99 84 -48 134 -41 214 30 26 14 -32 21 -14 83 -53 112 -161 15 92 -36 13 237 22 15 -11 -153 -124
3057 -124 -278 -14 7 -140 127 -110 27 44 -9 36 -155 -166 -48 62 24 261 -196 -5 51 209 -184 117
3079 117 154 -122 184 89 343 20 185 119 -127 76 215 72 122 127 -170 -205 -107 53 20 35 -119 365 202
3102 202 240 235 -199 89 -176 -73 187 66 -251 118 134 121 -90 -20 -299 -115 161 418 -60 45 -159 -16
3124 -16 103 -275 -43 -227 78 213 113 17 -83 -179 149 94 93 344 40 43 -9 264 132 -87 143 97 -79
3147 -79 127 -2 166 -131 -25 130 151 -87 157 46 58 33 -185 8 -283 -141 21 201 -165 46 -23 153
3169 153 11 -87 -67 30 -135 -14 -78 -65 -108 -75 -62 161 -101 87 -156 61 1 89 -58 -15 -288 22 125 202
3193 202 42 -156 288 -375 -31 -54 -275 -82 84 120 -30 -69 62 6 -74 78 35 -131 -152 144 171 45 -52
3216 -52 -94 -45 -77 -226 193 199 44 -60 -85 -51 -211 -279 149 67 32 109 -154 48 -37 -23 -291 29 206 -150 142
3241 142 -309 89 52 -64 -17 50 116 92 -24 74 -42 156 -131 220 347 -163 -46 54 -79 60 59 -19 -63
3264 -63 -93 172 230 143 182 163 -358 -42 -162 -49 -201 112 -130 75 103 -59 -132 88 73 -67 99 -272 -76
3287 -76 -4 26 -122 -76 -49 155 -60 -55 106 -211 75 75 -27 257 75 144 201 -109 -86 212 17 -366 176 -130
3311 -130 -6 212 -122 95 -12 -72 -1 -73 -72 116 -145 119 90 238 -12 180 87 -160 -46 12 31 -114 178
3334 178 -69 -174 58 123 137 -139 158 9 150 130 156 -17 37 -193 -72 -93 38 -169 205 -219 -236 6
3356 6 63 134 -104 208 119 -137 39 -85 -153 -296 56 164 -104 77 74 -59 227 -54 95 -256 -172 -167 -124 -145
3380 -145 -154 54 203 190 32 -9 -17 9 65 -37 -117 95 -26 -145 55 -127 211 -21 -148 22 -129 -183 -101 49
3404 49 -104 -177 -159 -330 -1 -95 31 -39 -182 -99 38 94 -124 -77 -131 -24 192 -25 -341 -142 193 153 -80
3427 -80 163 -141 -201 -98 -138 74 131 40 239 -117 102 12 74 88 -235 -22 179 149 149 -94 68 -75 7 293
3451 293 76 26 138 -16 5 -225 38 91 72 -243 26 79 -130 -42 161 -180 -84 28 -131 172 -88 203
3473 203 84 28 -82 -174 -103 93 -81 145 -27 4 43 193 103 -311 157 59 -5 85 12 -18 -60 130 -347 194
3497 194 108 272 97 140 133 259 326 -241 77 -4 70 -44 -50 36 53 -107 22 13 69 418 -143 66 206 56 241
3522 241 -165 79 18 20 16 -45 330 -179 36 238 -40 -129 5 38 99 -160 174 102 26 -70 -20 -166 152 -118
3546 -118 -93 12 170 -274 -62 59 161 151 6 64 108 108 12 117 -141 -201 -156 -301 173 56 -224 38 -22
3569 -22 25 -47 38 -67 -119 -160 84 -102 208 -16 3 -38 226 18 36 13 144 141 -120 24 -103 -133 177 -74
3593 -74 -82 23 162 20 178 97 166 27 -271 35 -100 -107 -270 -272 -13 -529 -156 -131 -120 1 -278 68 136 8
3617 8 -288 -158 -4 -105 -239 18 155 -70 -64 -104 -65 80 262 -69 132 104 -124 -11 84 0 169 95 115 -114
3641 -114 -1 -52 161 -29 -36 28 -123 45 -15 139 21 -83 69 131 139 -118 -8 -33 72 225 -23 -51 -58 -191
3665 -191 249 156 -33 -3 51 -38 -77 -118 -107 59 -19 248 69 80 -36 236 -208 -58 -225 24 166 97 -69
3688 -69 35 86 103 178 138 -67 -127 -133 169 -12 -194 -165 -276 -153 108 -85 -75 -225 89 22 145 39 -47 287
3712 287 -264 -190 -91 -112 53 -1 -130 58 65 43 -140 -219 224 -136 339 -120 35 100 202 -30 -9 -142 228
3735 228 44 -6 150 42 242 -148 76 -7 -225 -29 377 12 60 -303 255 76 -116 129 -159 145 267
3756 267 1 303 246 -256 35 291 -71 -53 -8 97 -43 37 1 -209 137 -107 54 -66 16 -288 -150 -135
3778 -135 174 172 -190 41 103 -4 -88 135 21 -2 -153 38 -137 -169 -336 38 97 -17 246 -180 -50 120
3800 120 -100 -238 -24 48 -42 -43 -157 163 -155 -10 -132 144 -166 -283 -32 -58 -229 -90 206 -170 -58 -50
3822 -50 245 284 129 -109 -70 -153 163 -92 -259 234 39 125 -75 -134 162 54 304 -256 -73 127 -27 105
3844 105 101 34 -47 -70 -262 -172 -298 134 70 -31 77 183 93 24 -3 31 200 -25 -30 -456 117 101 138 91 162 60
3870 60 -249 266 -90 -13 18 51 169 -91 -79 4 109 73 -45 148 192 261 148 140 -271 -42 -82 -86 -52 121 55
3895 55 -109 217 -70 0 -203 -159 187 88 143 -137 -27 2 -29 0 -92 -78 -187 141 128 33 -11 44 -123 55 -82
3920 -82 70 -90 63 220 -103 -7 46 27 -259 37 -1 218 223 181 160 -288 -23 -15 -176 216 202 -59 9 -70 135
3945 135 188 97 43 114 -45 -98 -22 101 267 -69 87 -18 32 -158 113 109 -187 -140 -145 71 -59 24 91 -105 50
3970 50 150 -227 91 -146 -338 -406 206 80 121 161 228 -245 95 241 -101 -8 -45 99 308 -34 -77 67 -124
3993 -124 169 45 258 -4 -147 -111 197 -64 -119 -13 -19 -229 -202 47 -124 93 67 75 -7 -35 67 70 341 -30
4017 -30 -163 373 -47 -105 -202 -168 -215 148 -134 5 107 -80 -124 -89 183 -67 1 250 -109 120 -71 68 226
4040 226 -43 -228 3 -94 -118 1 -240 -34 -133 -43 173 -174 9 61 195 -377 -40 119 152 -133 -118 282
4062 282 -17 63 -102 -75 64 -67 81 205 -19 13 121 15 25 -242 262 71 15 -62 23 257 -54 -49 -264
4085 -264 -94 269 -60 -89 41 116 -66 -42 -88 -43 -52 -42 -374 -86 11 57 140 -39 -208 23 -264 324 20 -62
4109 -62 311 -91 -153 73 158 79 61 79 203 -86 47 19 42 207 -336 21 176 -83 55 172 -57 -126 8
4132 8 -58 47 -21 -145 -105 272 -65 184 291 259 -37 87 221 123 -186 43 127 91 -74 -102 64 -206 197
4155 197 -31 82 150 89 209 -336 -71 -92 9 121 -417 194 280 21 -139 110 355 153 16 221 -73
4176 -73 113 -64 -234 79 -96 -72 -2 86 3 2 105 -327 -71 -87 -133 45 108 -138 101 287 104 146 40 59
4200 59 128 -89 -25 123 -232 25 46 29 -53 -101 36 219 29 -131 -151 -70 24 101 -303 -123 49 -135 188 78
4224 78 -227 285 232 11 161 40 234 -205 65 48 75 -190 -64 -170 200 -235 -134 189 48 33 -206 215
4246 215 137 -81 11 54 218 -130 -107 164 19 76 -278 150 157 -44 81 -103 -12 224 -104 -133 -25 199 -127
4269 -127 -109 125 167 -99 207 124 89 6 177 63 42 -144 -254 72 60 -71 169 -33 152 -10 41 -273 149
4292 149 152 -78 -84 -46 83 -60 99 -46 -260 138 79 131 -109 158 -21 38 18 201 294 8 -125 -88 -69 -318
4316 -318 -8 -44 125 -58 116 201 -85 -116 -57 -16 153 130 -81 -134 142 24 197 19 64 21 124 -66 -118
4339 -118 157 108 -90 80 -229 -77 5 -80 -58 27 -65 -51 -164 -180 -19 9 -12 -138 55 10 36 41 139 59 -57
4364 -57 -91 -21 31 216 -98 -98 -208 71 225 -58 1 -99 -107 134 119 -68 153 143 -287 73 -86 39 -157 40
4388 40 73 -193 -154 180 6 289 -112 -225 -297 170 43 -73 -82 85 -327 308 86 21 151 -105 74 -49
4410 -49 19 -178 18 27 -57 283 185 -131 435 -310 71 129 118 134 -110 -192 -70 -128 94 49 38 -21 311 202 -122
4435 -122 13 77 -80 102 259 -168 -263 37 -35 -28 210 133 -120 109 -115 50 75 37 141 54 313 -99 178
4458 178 21 7 -4 -113 89 21 -1 79 -61 90 85 -248 275 -297 -146 -227 -39 -56 -61 73 -216 69 74 204
4482 204 55 -125 -258 151 -205 -23 114 89 -147 -39 -161 -173 -353 155 -116 221 -11 36 201 -111 -45
4503 -45 -66 96 -19 -143 -22 2 -36 94 67 158 -87 -182 -75 -69 -51 52 68 12 220 -37 -32 -36 -132 227 -193 21
4529 21 -47 106 1 -159 -48 39 98 140 -1 53 89 361 -82 133 187 -22 -74 -226 -21 -28 -122 49 -122 -338
4553 -338 150 -50 97 -109 -28 173 22 -28 -284 -53 216 98 95 -58 333 -231 -118 -49 -139 -34 -79 -35 47
4576 47 103 308 -10 32 -34 -6 146 -141 112 141 5 -96 -18 -33 -87 -265 123 -45 -27 144 65 126 -98 313
4600 313 72 -10 43 -47 -56 24 47 -249 85 -333 29 -138 -311 -172 164 16 -73 -227 -143 -253 48 177 48
4623 48 127 -167 -24 -33 301 79 218 51 -9 55 -12 50 -95 -267 -40 81 -20 -22 -41 55 190 -188 -177 -19
4647 -19 130 -156 268 16 -27 60 165 171 -77 -69 -121 -162 -118 -42 -16 -122 31 -97 -181 436 167 169 52 239 -91
4672 -91 -18 7 88 39 -320 -174 -69 -54 -47 -145 73 -106 10 -7 -11 155 -126 34 259 47 -146 44 -111 120
4696 120 -192 81 34 72 -138 -237 125 213 53 128 23 -169 -42 182 183 -86 5 36 -254 -105 52 138 91 -112
4720 -112 231 140 125 173 -119 250 193 28 23 -16 -135 -84 29 49 79 -136 -11 161 -38 181 117 63 128 -142
4744 -142 -275 -35 -215 -22 -26 136 187 133 185 -211 -5 -141 -62 -38 123 149 -273 -258 127 -17 -32 4 -141 -223
4768 -223 -60 -91 -85 23 171 -216 129 -196 99 61 72 144 -87 4 109 -253 329 -115 244 -85 6 -158 135
4791 135 16 -99 41 72 270 -76 121 -296 120 180 63 -57 83 85 -20 148 -70 44 100 -88 157 -25
4813 -25 -75 -54 -122 115 142 -21 -68 99 331 -21 -240 137 -242 52 -5 -11 -155 -126 210 8 -239 -55 -157
4836 -157 76 21 -98 -75 -43 -56 6 216 18 77 -386 56 101 -36 -49 85 59 -141 63 -67 73 -180 -147
4859 -147 -20 -74 156 182 30 116 -50 -35 -104 -19 -78 -31 -327 133 -248 -156 25 20 -82 -9 -134 -54 112 -29
4883 -29 -97 158 -195 39 -40 98 -238 -262 175 -122 -3 124 -64 -255 54 71 -142 45 -45 186 73 204
4905 204 268 6 162 -170 110 101 16 52 63 273 80 167 -53 66 40 23 146 -122 19 77 113 -40 101 165
4929 165 -182 193 -10 -50 132 -33 -103 -133 -29 41 50 -111 73 -127 -243 -423 -165 -117 44 -65 -68 -163 25
4952 25 -74 3 175 -36 47 147 125 41 83 90 -143 -100 47 -85 133 -60 -130 -54 -68 -189 135 413 -168 62
4976 62 -205 27 256 60 207 -76 -74 35 4 -125 -268 32 -214 99 -20 72 -124 107 -82 -7 11 -187
4998 -187 194 -112 -185 -126 -37 238 17 -116 155 142 -19 48 95 58 -102 -143 102 129 -84 -158 29 -66 73 120
5022 120 -79 30 24 -9 -19 47 18 99 -89 -14 -76 -75 -212 109 4 -46 283 -128 45 150 92 198 -138 156
5046 156 270 141 162 71 -112 78 0 159 48 182 -176 57 29 -63 -43 -280 12 -86 -36 165 9 55 121
5069 121 -163 191 248 76 228 -42 11 142 62 153 -150 13 74 139 -231 -227 58 -14 -388 -1 114 -76 12
5092 12 -8 -300 -126 -72 85 231 77 -55 120 -211 -123 137 -35 66 -153 68 -317 90 -67 193 -108
5113 -108 -109 -57 -43 34 1031 -128 499 -48 58 297 -846 61 286 331 -362 379 -117 -95 85 119 -166 117
5135 117 203 261 -111 385 -80 -477 -76 -39 87 -202 -74 -60 49 -186 -182 29 14 53 -82 -188 10 92 -37
5158 -37 96 -217 104 -181 -128 -30 172 44 40 122 69 -5 93 16 -83 -13 178 361 -55 405 54 -2 80 4 -113
5183 -113 -157 -15 92 220 250 -166 193 16 -87 -238 -46 62 230 -174 262 -10 -200 9 145 -173 55
5204 55 22 -136 419 -108 34 -48 -2 -116 -64 -54 -46 18 -78 91 -169 -52 -6 177 -18 -201 -85 -118 21 -202
5228 -202 -202 -131 -479 -227 230 93 261 -88 126 24 -204 -410 -53 -232 -132 65 -1 39 15 -30 -41 -223 -126
5251 -126 -19 33 -153 201 14 -61 237 79 33 -66 106 338 304 -366 -99 -158 221 -49 -293 185 -126 -8
5273 -8 240 -10 -283 -252 -153 -252 -158 112 131 107 -47 12 89 -197 270 229 -10 85 -59 129 213 106 -50 135
5297 135 225 196 275 188 461 97 131 -287 -51 -41 20 312 81 -14 157 -62 -155 239 226 40 -53 52 -202 -76
5321 -76 11 63 164 217 85 220 -66 -109 -122 99 -88 23 -93 174 -134 399 55 126 123 104 188 -54 -67 29
5345 29 -139 -73 336 -196 197 -122 78 66 -126 -58 -280 145 13 -25 -26 -306 92 146 -128 -91 146 120 64 81
5369 81 -91 -121 -71 48 -135 -61 39 52 -153 270 43 19 262 -343 154 -33 23 -26 211 28 179 100 2
5392 2 55 13 -75 63 -77 0 71 42 85 212 138 -113 96 -26 -43 1 -5 -76 263 184 59 56 87 87 200 -317 -143
5419 -143 75 -42 -4 63 24 -5 90 71 11 227 46 -195 306 -126 -131 -309 -186 370 -32 -165 118 82 -218
5442 -218 244 297 140 57 -93 24 -245 224 -111 -53 145 51 89 -52 -133 -174 200 291 -5 110 22 153 -243
5465 -243 -65 -218 90 -21 -17 75 -11 -96 16 -133 -22 -181 1 -54 62 -251 79 -169 25 244 81 -131
5487 -131 11 64 -110 11 1 271 -7 111 -126 172 59 -198 7 -106 -91 221 -6 -157 163 86 -60
5508 -60 93 -161 -166 -322 -187 180 59 94 -249 184 -97 233 216 206 112 -153 281 158 -105 110 -185 -106 104
5531 104 259 137 -100 -75 -204 59 -33 71 129 -202 7 -147 -89 -218 13 54 -18 116 66 6 179 -81 -222
5554 -222 -177 26 -179 -63 26 43 198 196 110 42 -83 -162 10 4 -164 176 -34 -152 -137 49 166 10 -140 -19
5578 -19 40 60 283 294 294 -94 -136 64 -197 -276 52 -118 92 91 475 -44 131 198 238 -284 299 -97 195 44
5602 44 -178 -75 308 18 177 44 49 -123 -84 44 -143 167 -191 120 119 -42 -60 -7 -382 101 -7 462 27
5625 27 -174 -96 -51 -66 -42 -45 -74 149 -185 359 191 -1 -75 -248 173 -233 -7 187 -324 -37 29 -45 219 124
5649 124 81 -4 30 66 -15 254 229 -64 126 3 66 -29 52 188 60 29 6 60 133 33 -98 23 -34 68 -93
5674 -93 -234 169 -130 278 -150 -13 -72 56 -109 59 -44 -75 -25 13 51 -19 -64 32 165 -230 -82 -59 289
5697 289 247 293 229 -246 -27 -176 -16 -24 -87 -38 -63 125 261 -142 162 -156 93 -88 -127 -100 -136 -67 -43 60
5721 60 -342 -55 -158 13 8 -99 -113 261 119 19 -239 -68 -64 -218 -48 -3 14 67 145 -76 -153 -34 -59 -55 -64
5746 -64 102 99 5 -92 -59 -10 -74 -156 -113 -4 81 242 -121 22 173 95 383 -150 -209 -128 323 -162 0 -107 24
5771 24 60 158 -159 -46 -68 -128 -51 13 -75 -151 65 91 -165 -8 120 31 337 160 70 -45 -163 144 276 78
5795 78 96 124 85 56 20 -102 238 -109 -111 135 72 135 -94 -207 -116 29 -36 65 267 57 -174 148 -12 -180
5819 -180 -58 -118 33 -107 217 -25 -16 241 50 39 144 -79 -176 -67 -81 284 -208 325 27 80 -95 46
5841 46 -94 101 -29 125 148 -47 -57 -140 45 -1 -136 -126 -132 -64 -48 -28 -139 -238 -30 26 9 -197 2 178 16
5866 16 -83 50 138 55 -79 -67 -197 -121 -97 167 231 -149 76 -90 60 -38 -265 34 -33 -293 -121 16 -81 -33
5890 -33 78 -46 114 215 -175 -73 45 -73 -84 19 -172 12 16 -138 -81 123 54 31 -190 -300 -305 -151 182
5913 182 -183 133 -95 128 -172 49 79 77 -5 -106 37 -283 291 390 129 -65 100 33 -43 -110 16 -330 -8
5936 -8 227 -41 -29 136 -309 -75 -3 77 18 178 -38 -92 37 -5 109 -40 89 -176 -28 159 -39 126 -106
5959 -106 14 -160 -200 14 57 150 69 -85 116 187 190 153 70 162 -91 110 85 102 -120 113 -289 164 -269 -148
5983 -148 -96 -14 240 -75 105 41 -135 -21 -18 -148 7 114 -101 157 37 47 -163 163 172 -17 229 47 -81
6006 -81 -111 132 -44 20 -251 -6 164 -145 -102 -396 -55 30 -62 124 -274 1 36 -5 52 -43 -119 -52 -158 -139
6030 -139 258 50 130 -118 -270 -106 -208 -242 142 139 -35 -138 -138 86 48 302 45 -112 168 -68 87 191
6052 191 -108 -179 53 168 72 12 -20 -110 -172 -36 35 10 -130 -71 -211 71 75 -26 69 145 128 -99 112 -48 57
6077 57 88 114 -87 -47 -31 171 66 42 189 70 154 46 68 20 -205 124 -31 -55 -42 -186 -52 241 -37 114
6101 114 -68 -206 177 207 71 -22 -101 -30 -111 -104 137 -134 202 -267 -119 194 141 -310 51 -53 -113 91 -111
6124 -111 14 -171 197 67 -229 -71 -206 21 -160 1 -93 37 70 -6 -87 -75 -80 -256 225 -154 -5 11 237
6147 237 -168 -14 -178 134 280 -74 121 -235 163 -117 -102 113 -51 107 -101 20 -38 42 -41 -151 8
6168 8 -228 -88 160 -101 -208 -115 -110 168 -64 -129 -102 0 -266 0 -134 -104 -31 49 -114 37 275 114 78 -250
6192 -250 81 117 -67 88 21 53 -83 -54 -83 87 88 -55 -119 15 -170 199 -92 39 -359 32 -217 -81 -22
6215 -22 66 16 -46 -42 -44 71 15 22 -1 -15 -106 48 -55 92 -215 310 -193 -35 124 -187 67 -9 58 65 -29 103
6241 103 -374 9 150 -1 40 230 27 -123 329 -92 -68 299 36 -127 91 108 102 24 8 -91 67 130 78
6264 78 251 -527 -74 21 -173 5 9 55 -139 92 -154 186 78 -431 235 56 -204 9 -165 4 94 2
6286 2 88 -379 50 -181 199 -242 -112 25 167 -148 -97 -22 -59 -91 218 98 49 263 65 15 56 136 -348 -388
6310 -388 137 55 120 176 285 -122 -8 27 -37 -120 -6 -116 184 11 -172 143 -43 232 -283 -44 228 -40
6332 -40 -28 -208 -36 -83 44 118 64 -17 -151 97 -55 7 183 294 -212 34 -98 -183 125 -52 115 95 -323
6355 -323 -16 -4 -101 -28 169 -91 11 -90 86 -31 27 -61 14 -234 9 175 -41 -125 25 529 -74 99
6377 99 31 246 -133 -167 68 -188 -107 28 172 -26 -80 9 192 -122 81 156 109 26 -79 -85 55 257 -150 57
6401 57 151 62 121 258 27 -158 63 13 -130 -215 -10 -125 8 -247 -126 -11 -5 140 -155 -126 -128 2 194 -95
6425 -95 19 65 -38 -147 -335 40 -369 352 -60 131 -14 93 185 65 204 -38 28 166 -72 -53 -72 -4
6447 -4 72 48 -138 -67 167 -228 5 -86 118 55 -52 158 -120 119 4 70 7 77 131 65 -382 -213 -38 -28
6471 -28 206 -40 245 -59 337 -46 74 169 -53 84 12 40 86 250 40 42 -148 43 314 171 160 -111 -255
6494 -255 187 268 102 159 -141 42 -198 362 49 -41 102 -53 167 -30 184 270 52 63 -54 -5 123 96
6516 96 -60 105 73 -45 483 31 -73 -180 -33 -155 -118 -166 -195 42 39 269 -32 46 -83 -33 -55 -207 -175 -92
6540 -92 -31 141 48 40 -405 51 314 -84 276 7 -144 339 86 -74 -186 56 53 -214 -375 -153 158 67 -30
6563 -30 155 159 185 115 94 33 76 58 78 143 -71 114 17 307 134 -62 -67 -60 -89 67 -112 70 -139 72 -109 20
6589 20 104 2 24 -422 165 -348 25 -4 -118 62 -16 364 -46 61 140 238 -179 -143 -162 -105 316 -78 56
6612 56 -3 -101 198 84 302 -179 -228 149 -104 188 205 79 276 79 -145 142 290 -16 119 132 323 -100
6634 -100 -109 148 -137 38 43 143 -34 -166 500 127 121 -89 235 43 118 160 32 -117 -25 -121 10 78 162 354
6658 354 74 -218 16 87 89 -163 41 -45 257 21 148 19 -107 -4 -30 -108 245 164 261 -59 32 -101 28
6681 28 87 -21 217 319 264 -170 86 -102 -109 168 -51 -91 246 91 -207 -172 67 338 -280 -58 59 136 23
6704 23 -46 194 176 2 -3 3 -18 -168 -322 -149 151 44 278 296 196 -158 -18 -216 19 -34 -287 -254 328 169
6728 169 -227 184 -43 -79 -331 -254 -33 -59 -14 -36 -60 -17 -259 -151 -68 75 316 5 -269 -108 73 212 -78
6751 -78 141 -143 -19 -34 0 62 -162 137 38 108 -105 -51 131 115 -247 37 305 -71 -193 49 -74 -82 -52 134
6775 134 -25 7 59 -205 27 -41 -133 -5 -34 -26 -22 -15 -121 149 -36 -190 77 -346 -104 3 -160 4 -111 -146
6799 -146 10 186 -368 150 -186 165 95 -282 -26 118 167 32 133 108 -73 -28 206 -218 -60 181 46
6820 46 267 54 -36 -235 -230 -203 -24 -161 -69 226 -55 -190 -14 -97 -104 -198 -189 -43 254 119 -50 -113 198 39
6844 39 -290 174 -120 -32 -53 32 -194 -59 20 166 -175 -51 149 266 62 15 -47 37 -121 102 -127 382 21
6867 21 227 17 -165 14 -108 -57 331 -46 -108 -39 165 -172 73 84 -3 87 -73 -39 -30 -78 102 -130 58 -87
6891 -87 -98 218 -242 18 112 155 120 51 -21 -239 -84 317 32 116 -54 -94 -29 -31 47 -27 -15 -132 29 -46 111
6916 111 -161 -203 22 -27 208 238 -16 73 -11 -149 -110 145 128 -194 284 -84 160 -219 -342 33 217 -113
6938 -113 136 -41 -332 91 -150 62 242 135 170 45 13 -8 -103 195 25 74 -108 140 224 -55 123 817
6960 817 64 375 18 -46 115 54 -55 -82 -327 162 302 283 104 -84 62 117 23 -77 1 -41 198 292 166
6983 166 -288 45 127 292 -220 -47 83 -5 59 126 -244 32 -191 -111 262 210 72 36 245 -55 -351 65
7005 65 -83 69 -12 181 41 -43 140 115 -4 -109 -73 -17 -134 330 -83 155 10 6 -2 -272 -140 117 -70
7028 -70 -139 -116 22 -205 -6 117 -289 85 343 -31 188 -3 -32 -92 -30 284 -146 177 205 185 154 -10 120
7051 120 -76 -238 -59 465 226 -99 130 58 -34 194 142 -101 201 10 272 -118 93 -137 84 26 -209
7072 -209 238 -165 -81 -229 155 154 -30 124 76 27 8 -160 -45 -193 -88 202 -26 139 161 161 -33 -273 34
7095 34 157 -78 221 139 272 93 133 2 -215 -55 -1 272 51 -5 83 -118 -85 308 -123 -7 -8 174 158
7118 158 175 277 -37 -144 -3 -22 -290 86 -329 -120 152 152 -78 -139 282 -67 -168 -178 -51 -40 114 -89
7140 -89 -216 163 -151 147 3 77 -13 18 -22 -101 -141 -67 168 -1 41 58 -39 47 36 5 -133 -70 -163 391 -195
7165 -195 91 -3 12 143 221 162 112 39 -49 -50 222 280 -183 -132 -27 -83 -150 55 101 90 -117 194 -108 -125 124
7190 124 -67 50 -85 296 51 44 47 35 -5 -62 -181 -65 -112 -163 33 -59 245 -58 -81 -1 45 66 10 -213 -345
7215 -345 -199 -119 258 53 -165 -93 -63 -23 -39 -4 333 110 16 124 -132 -213 34 -6 -173 -209 -51 -33 -117 -174
7239 -174 108 114 -62 -30 -168 -48 16 -113 -35 156 59 30 66 178 -18 -108 122 294 31 39 -174 -100 234 -66
7263 -66 210 -224 122 -89 -189 -23 33 40 -2 -76 -149 67 20 -74 21 -61 -119 122 325 29 -59 -36 -223 194 -84
7288 -84 -123 199 117 57 42 -7 116 -25 -129 43 22 -218 63 -325 -2 -190 7 -178 38 -1 175 -63 -150
7311 -150 114 18 -16 -59 133 -16 -148 49 -123 -76 33 -132 48 -142 93 195 64 87 -8 -41 9 -101 -202
7334 -202 -154 136 -224 -119 -67 -22 -134 -70 -135 71 123 -237 118 -250 40 0 271 -79 148 -140 218 111
7356 111 -61 59 -109 -200 0 94 -170 -164 268 42 113 -35 -63 -263 86 240 -144 -32 -30 -215 -164 269 -23
7379 -23 189 -176 35 -204 216 -41 -82 170 22 104 27 -128 86 13 -21 -194 110 -96 136 129 -46 141 63
7402 63 201 -81 -86 -50 144 -21 -36 -107 -27 75 30 -63 10 -151 -123 -27 -54 -146 -101 -36 -84 155 -60 -297 333 13
7428 13 -208 -205 78 140 21 60 -122 149 64 37 -80 88 76 -146 -169 -70 37 -48 68 40 31 114 -174 155 140
7453 140 -58 4 -92 73 -56 -172 0 5 -64 -394 -99 -212 -62 -57 12 -223 76 -180 -53 237 -171 -196 339
7476 339 246 58 -17 240 -282 109 -117 -72 360 128 -416 -9 -89 159 -77 250 -114 -151 216 94 -65 -136
7498 -136 203 -48 78 -75 42 205 28 204 42 -253 168 73 200 -27 56 -112 3 -39 166 -40 -167
7519 -167 17 -67 -25 31 20 -104 -203 -98 -122 220 -140 -146 -37 -101 -31 105 -60 -20 376 -49 75 -70 -43 36
7543 36 -77 -182 314 6 335 37 25 216 -8 -117 -118 66 168 170 -301 4 159 90 303 -59 -131 -64 146
7566 146 -119 -32 168 -90 73 -21 -63 109 -143 12 -195 69 47 158 206 -128 -123 -61 221 -155 -114 118 -252
7589 -252 -176 134 167 -38 -69 81 -51 11 -102 0 -79 -32 291 75 174 -2 115 -251 -202 32 -74 -216 -15
7612 -15 -50 106 86 48 -211 -154 14 -39 -363 -2 158 42 297 -140 156 92 25 125 199 1 -154 -21 178
7635 178 -158 -52 -62 -171 -102 12 105 -35 13 11 -139 -43 298 -136 -122 -85 289 -96 -57 -21 -121 45 -240 -56
7659 -56 -24 -68 20 77 20 -215 86 120 -86 223 200 -13 -262 11 57 -162 -53 21 182 131 275 4 295 -196
7683 -196 28 -213 -125 230 68 129 58 -64 27 -165 -113 1 -16 122 -6 174 147 128 178 173 80 239 160 115 173
7708 173 113 101 -54 -16 -117 -144 -191 -215 -245 203 -149 -120 137 199 -55 -17 92 44 -69 -73 204 117 108 -37 171
7733 171 -9 114 -50 -192 -186 100 -203 -15 129 108 14 -76 -11 133 36 -215 -36 -161 74 -158 -176 19 -40
7756 -40 -80 -81 34 -184 57 63 9 15 -229 -40 -163 -335 -46 25 -54 -82 79 -225 -151 172 304 -114 229 30
7780 30 -79 120 173 97 -80 259 147 -2 -6 22 -32 366 -269 99 114 -76 -98 184 -114 -83 34 80 -56 -45
7804 -45 211 -72 -50 1 -237 91 182 -5 -211 -146 -259 129 25 131 -159 12 -126 245 86 98 -115 104
7826 104 92 18 124 -161 3 68 148 52 92 -138 376 83 34 -174 -106 -168 67 -6 277 56 205 -244 -49
7849 -49 51 -158 4 -193 210 -298 155 91 -97 -63 204 -122 8 -7 175 -45 254 13 -29 114 234 57
7871 57 -13 -264 -84 143 1 -92 -280 142 50 32 -28 273 -102 -22 -125 -298 -139 46 97 -21 -15 -75 -205 -198
7895 -198 -160 -89 -55 167 -147 77 88 -10 142 -26 75 119 113 315 -141 24 5 -319 -82 -25 155 -29 204
7918 204 118 -76 -125 35 422 35 35 33 -156 -113 -133 104 -62 -29 19 35 -79 85 -11 88 86 -206 -10 18 -61 -60
7944 -60 23 61 -193 -110 96 -125 -153 -24 110 -2 -138 -217 -41 -176 -88 118 49 -31 8 -62 91 260 23 -201
7968 -201 42 -35 12 147 -107 11 -304 -78 -228 -160 -111 -210 -240 57 288 -13 -74 21 -29 -78 -105 94 40 9
7992 9 82 -144 -24 -35 -201 -102 24 114 55 -80 -119 173 53 -36 -135 216 21 255 -88 35 144 81 -59 -79
8016 -79 -18 -130 -229 -20 273 -135 -12 -16 82 93 142 -101 -211 150 22 384 117 62 -30 -100 82 4 113 -233
8040 -233 64 137 8 21 30 193 12 -138 137 -168 27 -192 138 -386 21 160 -107 16 -128 -193 213 65
8062 65 212 -105 165 140 278 57 -54 11 185 -175 -50 -61 -194 -138 138 129 69 -121 35 117 -87 -214 -71
8085 -71 97 -112 66 -7 165 -23 265 -311 -207 -136 -2 -145 -37 -7 320 -100 33 181 187 -41 218 59
8107 59 78 68 -79 -132 66 -44 101 -62 -40 109 -210 -119 202 -193 -453 -188 -91 -44 43 31 -319 161 -42
8130 -42 173 86 104 -111 -173 55 -212 -35 117 98 142 -82 55 77 -125 95 -112 253 -2 -10 14 5 12 -184 -153
8155 -153 66 -142 -154 -50 31 -8 -136 -93 60 107 -9 41 -67 209 -212 130 -48 -97 132 -87 -142 -14 -54
8178 -54 194 -128 -39 -51 -211 174 231 45 109 57 -59 178 43
8191D3
$$ Imaginary data points
##PAGE= N=2
##DATA TABLE= (X++(I..I)), XYDATA
0 0 0 0 0 0 0 0 0 0 0 0 0 -8 8 -8 8 -16 16 -23 24 -32 32 -40 48 -57 72 -80 96 -109 128 -144 166 -189 214
33 214 -241 273 -309 344 -389 432 -482 536 -598 662 -733 813 -894 990 -1091 1203 -1323
50 -1323 1460 -1605 1771 -1954 2161 -2393 2655 -2959 3310 -3726 4227 -4842 5618 -6636 8030
65 8030 -10073 13369 -19585 35542 -172375 -305036 -78632 -45814 -30594 -41658 26352 103162
77 103162 182204 154680 89927 50256 86959 124431 134178 66583 -31855 -86512 -40336 14111
89 14111 -2778 -93989 -169760 -182592 -130876 -80602 -70116 -75358 -22378 89287 189491 204793
101 204793 147293 73159 39813 50795 61805 28620 -30496 -66989 -64189 -43985 -33171 -54076
113 -54076 -94300 -104954 -61433 -11600 -12672 -55338 -79051 -37714 51803 126478 144095 131077
125 131077 130276 132186 102781 39428 -35968 -100281 -131270 -119028 -88961 -78167 -91997 -95093 -57642
138 -57642 8377 58179 63704 46335 46405 69856 80934 59364 27001 13555 26220 48620 52579
151 52579 19094 -38578 -82648 -98861 -98773 -91785 -82264 -66798 -33871 17962 63858 78226 67924
164 67924 57563 59736 71249 67467 29692 -20704 -42557 -32476 -20037 -19831 -22862 -20253 -12460
177 -12460 -9060 -19935 -42668 -60299 -61348 -42432 -3814 39757 63158 62249 63318 76733 79592
190 79592 53226 12226 -19569 -32275 -38494 -52925 -70962 -75095 -56639 -28289 -1919 17075
202 17075 24190 17083 9864 13270 19205 18510 17469 24379 38783 51859 49826 26252 -5925 -28084
216 -28084 -37426 -44285 -55188 -64039 -62395 -43638 -15169 7873 22450 37080 52818 59341 53121
229 53121 38529 17596 -6428 -21831 -21642 -11914 -4537 -5187 -8837 -5870 -390 -5613 -24654 -38856
243 -38856 -34624 -21032 -11991 -5413 7166 23711 38142 48004 52968 48826 33417 10160 -11460
256 -11460 -24644 -34330 -45899 -50302 -37420 -14242 1826 7406 8267 7990 6557 5282 2995 -513
270 -513 -497 6699 16821 25168 29327 27400 21156 13105 2091 -13802 -30297 -42850 -50592 -48206 -32991
285 -32991 -11795 4336 16002 29765 41853 42105 30112 14490 2625 -2891 -6609 -10953 -11363
298 -11363 -5214 290 970 782 1278 -4112 -15427 -24351 -24420 -19951 -16055 -10556 1220 19122 34908
313 34908 39651 35303 28984 21212 7075 -9229 -20603 -26682 -29780 -27466 -18382 -7935 -930 3316
327 3316 5846 6677 5344 2483 -2330 -4479 -1976 3491 10097 16862 20343 19339 18159 15004 4324
342 4324 -11531 -22715 -27795 -30329 -30403 -24281 -12347 404 10329 18544 23951 25817 20400 10494 3255
357 3255 671 -2429 -7386 -7871 -1990 4615 5238 2401 -434 -4325 -9900 -16917 -21180 -20271 -14869 -8354
373 -8354 604 13058 23891 27724 25939 22971 17383 7000 -4898 -13806 -18569 -19165 -15839 -11301
387 -11301 -5839 -816 3147 3940 2659 -313 -5587 -8125 -6230 -2486 1577 7988 16358 20664 20154
402 20154 17716 13187 3713 -8431 -17830 -22186 -22821 -21919 -18348 -10580 760 9194 11118 12164 13786
417 13786 11346 4668 -246 -989 -915 -815 1846 6023 9326 9489 5270 -742 -5820 -10495 -16736 -20984
433 -20984 -19020 -13098 -7182 -171 8690 15224 18357 19023 16884 12189 5408 -1657 -7457 -9818 -9788 -7962
449 -7962 -4966 -266 2774 2052 601 -1923 -5982 -11158 -12012 -8673 -4537 -392 5694 13168 18430 19090
465 19090 16969 12845 7811 179 -9575 -15597 -17418 -17204 -16030 -10798 -2083 4684 6935 7219 6704 4629
481 4629 525 -3272 -3340 -695 3217 6106 8662 11406 11379 8010 2804 -2210 -7458 -13206 -17385 -17787
497 -17787 -15307 -10658 -4078 3937 10899 15182 15907 13522 8567 2803 -2390 -5429 -5119 -3054 -963
512 -963 1377 4650 4688 1425 -2142 -4598 -7383 -10758 -12219 -11016 -7750 -3763 984 7180 14233 18081
528 18081 16470 13072 9892 3655 -4758 -10275 -11189 -9838 -8364 -5546 -2633 -206 145 -1343 -2168 -1744
544 -1744 -1590 -2287 -1121 1606 4061 5652 7850 10875 11687 9842 6927 1801 -4415 -10953 -15203 -16274
560 -16274 -14446 -9912 -4489 1389 6234 8184 7330 6074 5302 3196 1228 586 1613 1824 1420 1776
576 1776 2985 4367 3444 800 -1989 -5135 -9881 -14105 -14194 -10681 -5410 -373 5534 11445 14091 12646
592 12646 9242 6468 3255 -209 -2737 -3392 -2846 -3309 -3976 -3187 -2504 -2121 -2704 -3572 -4374 -4999 -6314 -5610
610 -5610 -2581 1985 6217 10662 14704 14633 11418 6040 415 -4577 -8672 -10671 -10371 -8115 -5883 -4241
626 -4241 -2012 590 2317 2166 2468 3219 2439 661 -290 469 1917 3775 5611 7047 7621 5462 745
643 745 -4429 -7809 -10129 -11674 -10642 -6942 -2610 -106 2487 5350 6906 6600 6521 5693 4867 2613 220
660 220 -1754 -1638 -1346 -846 50 1596 573 -1857 -4643 -6755 -8376 -8761 -6652 -2540 2309 6145 8710
677 8710 10092 10451 8607 5474 2563 30 -3394 -6651 -8077 -7334 -6534 -5058 -2191 958 3095 3263
693 3263 1984 -271 -1243 -2166 -2282 -266 3070 5909 6925 7155 5937 4240 848 -3259 -5273 -6485
709 -6485 -8291 -8540 -6419 -5035 -1437 1572 3717 6352 7765 5557 3383 1561 -276 -2263 -2100 547
725 547 1676 2388 2352 2062 -378 -2972 -5217 -5954 -6150 -6071 -4777 -2783 1238 2987 4824 7367 8593
742 8593 8014 5626 2965 408 -2812 -5543 -6742 -5496 -3789 -2043 -539 518 854 355 -565 -1116
758 -1116 -975 -301 42 1203 2923 3993 4056 4456 4526 3471 1089 -1200 -3242 -5063 -6843 -7826 -6261
775 -6261 -3585 -688 1596 3473 5236 5055 3371 1797 1584 691 -180 -329 302 949 976 607 533 157
793 157 -1073 -3305 -4090 -4467 -4981 -4848 -3047 260 2868 4703 6565 7377 6442 4429 1132 -715 -2354
810 -2354 -3856 -4362 -3519 -2463 -1633 -1148 -492 168 -216 -798 -1409 -916 -639 -61 1274 2654 4424 4994
828 4994 4654 4422 2774 646 -1907 -4192 -5034 -5667 -5590 -4394 -1915 166 914 2051 2942 3026 2663 1538
846 1538 1338 1047 451 443 907 1524 1903 1110 370 -49 -1377 -3557 -4747 -4760 -4617 -3622 -1680 616 2643
865 2643 4034 4751 5023 4928 3357 1505 163 -685 -1881 -2906 -2623 -1852 -1439 -1089 -635 -99 -828 -1399
883 -1399 -2053 -1768 -1328 -604 740 2211 4130 4486 4995 4369 3559 1474 -852 -2956 -4199 -4556 -4829 -4103
901 -4103 -2472 -711 385 1212 1954 2372 1584 952 13 512 589 527 1325 2899 2866 2295 1502 647 -1279
920 -1279 -2896 -4211 -4729 -4375 -4013 -2814 -621 1454 2484 3574 3831 3892 2964 1235 471 -290 -544 -1317
938 -1317 -761 58 -8 -23 -351 -746 -1484 -2379 -2901 -2894 -2159 -1201 -309 1167 3186 3680 3828 3841 3166 1992 555
959 555 -1104 -2016 -2516 -2865 -2548 -2002 -1116 -110 151 144 613 177 -213 -192 18 177 562 1192 2522 2669
979 2669 2632 2322 1612 487 -1050 -2552 -3071 -3064 -3028 -2633 -1772 -3 1075 1368 1748 2260 1970 1076 292 246
999 246 121 -78 316 714 1067 1126 316 -80 -690 -1689 -2738 -3022 -2352 -1967 -1407 -153 1441 2408 2943 2912
1019 2912 2523 1763 500 -496 -1211 -1000 -1235 -952 -533 -149 -17 -175 -187 -477 -938 -1565 -1238 -930 -530 612
1039 612 1144 2099 2681 2466 1791 1370 902 -300 -1747 -2058 -1772 -1843 -1412 -935 69 478 766 236 419
1058 419 148 -235 -253 173 743 619 831 1447 1573 1312 956 196 -417 -1271 -1904 -2106 -2231 -1660 -1254 -606
1078 -606 635 1288 1561 1906 1333 1250 519 -284 -494 -259 -107 -312 -162 278 280 234 -215 -137 -868 -1885 -1854
1099 -1854 -1380 -967 -257 449 1233 2250 2723 1967 1222 717 -304 -1043 -1395 -1491 -1209 -788 -433 -226 396
1118 396 704 300 -23 -28 -314 -960 -676 -233 313 836 1375 1765 2123 1275 638 -66 -911 -1571 -2250 -1945 -1280
1139 -1280 -878 -240 460 1144 1006 934 605 837 266 -331 -216 -188 -221 19 220 692 820 465 -63 -534 -908
1160 -908 -1145 -1399 -1338 -557 75 151 757 1415 1151 1219 833 431 453 -328 -560 -501 -713 -962 -328 -308 448 268
1182 268 149 102 -220 -441 -705 -752 -184 268 394 692 1165 1049 595 403 11 -291 -739 -1080 -974 -1136 -857
1203 -857 -697 -111 1019 674 949 841 515 -133 -357 -372 -571 -95 352 379 272 429 232 -120 -416 -693
1223 -693 -799 -941 -865 -557 -94 138 555 957 1222 903 446 512 -105 -426 -854 -854 -435 -89 -38 353 290 289 158
1246 158 -322 -297 -244 -833 -557 -85 307 425 806 589 872 680 -20 60 -341 -830 -891 -988 -589 -147 120 354
1268 354 535 467 501 208 -140 -108 -57 -150 -229 274 -32 225 168 331 84 -106 -279 -339 -521 -598 -686 -160 -219 301
1292 301 605 1166 971 840 361 49 -51 -594 -520 -659 -409 -21 -485 -61 278 416 169 224 -345 43 -383
1313 -383 -312 -56 161 580 369 716 579 665 214 -515 -220 -747 -1197 -954 -502 84 -103 528 827 635 678
1334 678 444 76 99 -91 -403 -495 -83 -112 102 311 418 182 -94 -293 -796 -350 -463 -658 -105 350 432
1355 432 822 778 674 495 126 192 -132 -373 -532 -687 -511 -189 -202 -35 -45 499 265 -140 -91 212 -151 -156
1377 -156 150 443 552 448 488 377 491 49 -306 -369 -824 -679 -854 -375 -430 -288 -67 360 568 461 555
1398 555 100 33 -110 8 -308 67 -69 39 -128 284 105 -90 -475 -706 -479 -717 -516 -440 211 319 367
1419 367 771 899 487 415 164 28 -165 -530 -432 -298 -449 17 -156 11 -102 146 -169 -294 -48 -252 -123
1440 -123 59 290 604 501 480 825 315 -51 -266 -297 -660 -827 -628 -427 -66 170 99 114 154 204 288 63
1462 63 52 -64 87 -189 325 351 140 88 -31 -74 26 -554 -525 -510 -503 -433 -349 35 252 509 463 607 655 287
1486 287 255 0 196 -63 -207 -479 -202 -1 257 129 63 -143 -298 -170 -284 -14 -37 39 386 371 541 545
1508 545 347 393 23 -16 -189 -424 -552 -382 -457 -102 -63 80 13 55 209 133 139 -107 -82 9 213 327 444 123
1532 123 355 427 105 -182 -278 -380 -358 -307 -327 -351 -161 190 288 250 632 230 235 155 90 137 -22 -106 -338 118 76
1557 76 112 -74 152 9 -214 -249 -409 -292 -128 31 -47 361 401 547 112 318 177 -180 -223 -234 -225 -355 -159
1580 -159 -413 -72 -174 44 254 -103 -13 -86 5 69 -125 -89 -28 264 113 441 -16 188 81 109 -133 -442
1602 -442 -194 -292 -327 -194 -34 69 53 242 640 54 74 116 -130 -85 -222 -455 188 57 151 -37 110 -289
1624 -289 -62 21 -241 14 -292 -63 -118 141 431 250 413 202 257 -190 -345 -457 -88 -246 -183 -192 40 213
1646 213 297 208 204 -69 82 -141 -42 -209 99 -63 233 244 252 223 238 167 -88 125 -176 -288 -49 -45 -181 417
1670 417 220 2 264 -125 88 40 7 123 -179 -79 -80 217 5 -175 -78 256 141 38 -303 -450 -407 -397
1692 -397 1 158 201 41 26 181 140 267 65 130 -179 -196 -209 -234 -138 83 190 203 150 -53 -63 277 295 -70
1716 -70 -52 -101 40 366 168 508 456 107 -63 103 122 -429 -198 -127 -69 64 36 -84 160 88 141 345 -224
1739 -224 21 -205 146 -30 -271 72 105 105 124 -15 8 288 -17 -169 -218 -109 -106 -68 -79 4 335 437 107 -45
1763 -45 182 -68 20 35 -352 -72 -67 -134 337 275 -347 164 12 -229 -211 -230 0 -103 134 79 164 31 -19 127
1787 127 -39 40 -372 -170 108 25 -243 -258 -77 -125 -4 86 -2 -69 -29 143 94 215 99 -26 13 170 -22
1810 -22 318 84 -89 -118 -60 -114 -293 -29 58 -175 -90 12 91 -167 92 -88 32 -68 -87 -1 -87 -103 -95 231
1834 231 287 -59 159 103 -4 -109 -187 -357 -144 9 -177 220 -89 228 241 224 267 107 144 -248 -138 77
1856 77 -196 -174 -166 398 132 53 -196 -55 -110 -285 -43 -124 27 242 42 -241 -233 -102 -20 180 -48 193 -183
1879 -183 166 260 -1 116 -64 -8 -37 155 -30 59 -103 -266 -72 96 -184 -13 31 146 138 25 -26 113 109
1902 109 3 -12 -17 5 -80 -208 70 -7 16 87 18 -91 140 -78 70 13 57 66 -23 185 330 78 45 -120 154
1927 154 -292 90 -135 -190 180 62 137 -98 -56 147 91 38 -130 -47 -136 -146 -26 -260 146 -124 209 29 -60
1950 -60 -95 46 -117 -137 -243 -145 25 332 -149 -9 180 223 67 179 279 113 89 -282 -354 -56 -78 72 185
1973 185 20 171 -262 -155 -215 33 -77 -78 215 212 49 -153 71 -194 322 178 -8 -104 -141 -242 -44 136
1995 136 -38 -19 150 25 115 153 -96 25 19 -227 21 104 -269 -35 -8 -5 -14 -268 -55 59 -248 22 196 -52
2019 -52 -132 245 -263 -192 99 -92 -148 -43 94 235 124 -91 -77 -5 45 -212 -290 296 16 89 -64 -145 -163 -157
2043 -157 22 -91 17 45 53 15 69 144 19 46 145 -38 -220 -321 -237 -122 -231 -144 -36 -78 44 -42 113 -210
2067 -210 -116 57 86 115 -101 -23 2 -2 37 -24 -353 -245 121 33 -59 -253 147 -179 -374 -33 -124 60 83 77 264
2092 264 44 -121 48 -149 115 31 -386 -4 114 127 -43 106 -31 -133 -105 66 -271 112 181 -79 -17 72
2114 72 82 31 230 11 -154 -75 -150 -271 -7 55 206 -65 -163 -28 -44 282 286 -73 132 75 -9 -129 65 -9
2138 -9 159 -35 145 63 -218 -107 -130 169 274 89 233 -32 -113 185 115 4 -138 150 17 -90 356 105
2160 105 1 -73 26 -34 193 17 -123 -73 -261 5 -123 -197 165 144 92 80 -8 -132 -245 -200 -233 -37 -133 -205
2184 -205 -7 -66 289 70 82 -15 9 -61 -308 -120 51 28 -110 191 71 -138 -25 97 187 -56 -165 25
2206 25 -11 -185 -446 -166 -99 -8 222 -31 -54 100 -99 -296 41 -114 35 -414 99 70 93 279 23 125
2228 125 -64 100 -72 -27 6 212 -241 161 80 -53 59 63 110 -163 -134 51 -204 -215 -228 -39 -188 25 75
2251 75 -43 24 -112 -50 107 -177 -129 -10 -25 257 -62 -223 47 -73 -46 -39 -203 -78 64 -31 -71 210 12
2274 12 -40 236 85 60 147 264 125 -66 24 -146 -112 -206 47 132 -29 -107 40 263 137 169 173 172 -165 -67 143
2299 143 -123 275 -118 -200 88 104 -74 -112 272 -113 20 118 -35 39 -61 401 -98 -76 -77 36 -107 267 -4
2322 -4 -170 -149 114 48 55 196 -254 51 -273 63 123 -208 -193 126 361 -122 -192 -170 96 -74 190 150 0 128
2346 128 -43 -250 21 -96 36 -29 168 56 -179 36 17 73 -17 154 164 -29 -102 176 255 150 135 -80 -145
2369 -145 -59 -118 -11 128 231 -191 146 -57 -86 143 26 -105 -81 151 71 -85 184 -59 47 255 -98 24
2391 24 -23 -29 45 -283 91 80 15 82 77 -33 -109 -85 90 -18 -164 -170 -127 141 -131 -123 43 -106 -94 -223 181 150
2417 150 -48 99 125 -222 -238 84 -21 91 -26 -149 43 -25 188 42 -213 -27 -96 -11 -216 99 318 -95
2439 -95 -210 29 216 -95 26 38 -72 46 72 278 -62 -12 192 265 -59 32 98 66 53 -57 -169 -49 150
2462 150 -23 -117 130 -23 156 78 38 -220 -18 221 185 -61 -3 -56 -135 97 276 -199 -148 -84 161 -73 68
2485 68 -249 -97 167 -327 -141 -161 176 -100 15 -167 -293 28 150 30 295 41 -166 188 -70 -441 -80
2506 -80 -41 46 -169 49 -92 -124 165 40 149 -147 199 -389 232 58 226 -272 -184 -4 -11 164 -200 -58
2528 -58 -168 114 -44 112 -200 35 -61 -54 -168 -65 12 -63 103 16 -106 114 81 172 -56 -54 -132 104 -171 -385
2552 -385 148 49 247 193 60 -134 228 -77 -77 -31 119 234 -309 -4 79 17 -130 -187 103 -126 -163 -308 -54
2575 -54 32 281 158 304 24 -98 -105 42 203 255 353 -162 -5 21 -157 95 86 -56 -72 -85 -193 140 -31 106
2599 106 278 132 193 218 -128 -201 103 24 -42 102 90 77 0 123 4 -312 178 -105 -196 -196 58 -10 -100 -114 -201
2624 -201 -126 -254 110 -104 45 -43 52 145 420 140 -260 -84 114 -8 -14 203 -100 -105 32 245 91 -137 -30
2647 -30 237 -91 20 -35 172 -43 -58 31 157 -232 -344 97 32 292 -9 9 -27 -144 38 398 -305 -125
2669 -125 -201 13 157 -231 28 -71 99 60 -156 25 -100 186 138 -134 47 -34 181 -281 129 -147 14 -1
2691 -1 37 -29 21 111 89 -159 181 343 -274 -110 23 -102 115 48 -80 -27 -15 20 182 224 -16 -125 -128 148 -37
2716 -37 237 328 30 24 59 42 -86 -93 31 -131 -50 171 -36 42 116 166 -34 205 -79 65 31 -267 40 184
2740 184 -94 26 169 80 -198 -67 -106 2 -105 -141 196 179 -44 -122 68 -2 129 3 60 -72 -118 -140 -31
2763 -31 199 -13 -87 33 -151 -236 -76 40 -146 224 -180 -136 -227 -157 59 -150 37 7 86 -151 92 77 104
2786 104 203 -88 126 143 167 -51 20 8 7 -141 -6 -191 -204 -109 -94 93 88 -152 -57 81 -170 88 47 -41 -23
2811 -23 1 -65 -174 -38 42 67 108 132 -127 7 107 -47 76 -140 138 305 -18 -84 121 -205 -42 -81 -193
2834 -193 57 45 -89 35 6 130 -138 209 -103 12 -30 -222 97 -30 23 -190 158 -27 -98 -32 49 130 -26
2857 -26 -94 128 105 -60 -282 -57 259 -125 -161 -108 -244 -52 92 71 -25 5 70 20 99 173 0 -141 -18 92
2881 92 -96 -96 2 30 91 -68 97 256 58 -50 157 72 285 -127 3 69 69 246 127 105 -195 136 -5 64
2905 64 -4 -11 -132 -13 104 -83 -17 40 -113 141 -65 257 11 -36 304 -58 90 -50 -135 22 56 230 108
2928 108 195 220 257 125 83 18 -29 -230 -38 -152 -152 67 60 61 -442 63 287 -227 -84 14 20 239 55 -26 -91 225
2954 225 48 172 56 141 31 -120 27 -38 -174 144 -68 81 310 261 -301 -192 40 -220 29 -87 -18
2975 -18 154 158 132 91 -127 -177 46 -30 -17 82 -116 -127 38 124 -44 65 -40 -20 -101 111 -247 -88 252 127
2999 127 202 154 -67 -93 56 102 -57 164 -85 -7 42 73 -50 -111 10 -73 -124 -124 216 86 135 -242 -79 203
3023 203 250 -81 50 -167 -97 48 306 50 -28 194 -1 302 104 40 -314 131 131 -326 -86 -244 49 -52
3045 -52 -26 115 169 -105 -129 -98 -11 -113 183 24 -150 -137 185 258 -141 -10 -33 52 36 -135 -94 -280 111 247
3069 247 -158 -28 172 -124 41 -83 -52 -190 -20 156 8 28 -395 -8 97 66 113 1 -199 178 -292
3090 -292 -42 270 103 -36 49 134 26 -53 50 85 -10 271 15 -167 149 30 -136 -195 -125 116 -243 -100
3112 -100 148 -52 -67 -72 272 -195 -65 33 -185 -87 55 -185 40 15 -39 33 -22 360 44 -38 49 -115 -279 234
3136 234 -65 -60 15 116 -58 -158 122 -221 21 -111 52 164 -121 -225 117 -53 -71 -18 118 155 -103 50
3158 50 -148 70 142 -101 -226 221 -9 146 44 105 22 203 -177 -317 -212 99 155 -24 -73 -235 -70 -111
3180 -111 -102 57 164 179 -37 -387 -246 -115 243 131 -94 -166 134 160 -33 -86 -124 88 74 -45 233 -35 -36
3203 -36 65 -50 127 -90 -258 -1 52 -231 71 -16 168 279 -1 -234 -118 65 -56 294 -117 32 63
3224 63 14 -250 -21 53 -19 -9 -43 -61 -21 -253 -65 84 11 130 109 74 164 135 -234 -190 -22 76 216 157 173 232
3250 232 56 38 6 -13 121 -63 62 -259 56 45 -119 -183 -28 -52 88 -301 -177 -22 -43 139 -127 -165 327
3273 327 17 -226 -2 214 -175 1 -35 47 -42 8 73 -177 -183 -95 75 -227 22 -285 -113 -99 53 58 -246 -69
3297 -69 44 262 94 191 217 45 -122 134 -133 -147 -136 -49 -59 -55 100 -40 195 -77 -147 -163 -109 -10 -24 125 29
3322 29 192 -1 73 -15 -155 5 -59 48 -40 -197 259 -178 -158 145 17 -88 -63 59 -21 70 26 -178 -5
3345 -5 -20 54 4 55 17 -72 -196 -57 -84 16 104 10 -60 69 130 -55 124 -42 113 38 -11 -41 51 -265 -186 9
3371 9 -3 24 -4 82 112 251 -136 115 178 -102 78 -206 -33 65 -30 -3 -116 36 78 5 6 -37 -107 178 3 -132
3397 -132 -315 -199 -257 182 -57 -201 -43 143 -46 338 58 -149 -104 -126 -75 -56 45 37 42 -26 220 -64 113
3420 113 85 125 77 195 198 -131 -85 -89 -167 61 29 -7 91 60 30 273 -398 -63 -41 92 161 56 173 -183 146
3445 146 -169 170 -36 96 244 -102 -162 -121 68 -24 -48 22 3 -117 -77 -30 -198 -195 -129 -156 -259 -80 -136 -350
3469 -350 -120 -220 166 -73 51 -8 -42 92 46 -167 65 -154 160 58 -141 94 -36 150 122 205 160 4
3491 4 -38 26 -60 -155 2 94 -161 -101 -76 67 179 27 250 26 299 34 120 140 -278 -207 107 77 66 6 150
3516 150 75 -73 315 -77 44 -81 -153 113 140 -47 -222 -44 70 -223 -28 185 -177 -139 44 -230 18
3537 18 -278 -177 44 91 -47 -205 -74 -87 -163 -141 149 103 255 34 -22 7 101 -4 195 -8 67 113 162 77
3561 77 -78 -131 -271 100 -9 -100 200 -39 239 64 -419 28 27 37 -145 -143 -196 -35 135 203 144 61 145 75 57
3586 57 -18 -197 -239 185 59 -206 137 21 289 -234 -50 -238 -30 -69 -177 -7 -52 -133 -215 18 -73 63 -26
3609 -26 30 26 -92 -124 54 46 -144 114 27 -272 -77 214 -113 -99 114 -241 93 -222 226 -25 110 193 167 -105
3633 -105 67 -192 -182 150 -68 -365 50 -259 -236 -50 53 -197 -70 -144 -176 173 -167 112 -113 97 -294
3654 -294 69 198 -197 -146 -90 -45 -149 -144 113 -85 -166 104 168 -220 13 74 92 4 256 411 -42 -30 -75 59
3678 59 51 187 64 -197 -59 -280 -46 -3 225 228 -103 -178 369 -6 9 85 110 -50 -109 65 -9 262 -190 -138
3702 -138 -166 -182 38 103 73 -105 -28 143 -94 325 -36 178 -18 12 -105 42 -64 -70 92 208 81 -8 130
3725 130 2 154 145 -85 23 13 250 63 -255 -86 -63 57 106 114 124 -94 -100 36 52 164 98 4 255 111
3749 111 27 130 256 47 218 -31 339 -148 173 128 61 -71 -29 61 78 71 -162 -18 63 -170 -202 -31 136
3772 136 -323 166 -85 -1 -4 -4 25 37 -94 -168 133 -32 -83 15 -59 -285 156 -35 -33 38 -82 -32 -109 -293 130
3797 130 200 -248 1 120 -162 -21 -6 -40 26 181 -241 206 -213 -30 -142 -92 -110 -76 14 -157 524 -42 76
3820 76 152 83 107 74 121 -31 78 106 50 25 86 275 -222 -124 -79 -148 -127 252 104 78 -89 -150 13 -47 -139 27
3846 27 -58 -154 46 10 -173 -85 159 -132 140 -22 93 -140 98 19 133 108 165 -33 -246 364 -78 124 99
3869 99 35 166 29 282 -18 -345 -337 -192 84 189 -24 159 183 58 199 -91 169 20 100 278 276 321 -70
3892 -70 -156 34 -297 168 -203 68 68 277 85 -83 -20 207 154 108 13 -154 213 64 40 14 -51 -168 -57 125
3916 125 111 -152 -99 -174 -147 -159 19 64 -197 -227 104 -203 -141 101 -204 31 118 162 -250 -129 -141 -10 -22 188
3940 188 -128 32 156 156 -126 -239 -25 185 128 -136 -359 -150 -54 66 224 297 -93 -3 19 -87 53 120 -205
3963 -205 83 -19 -44 78 60 204 -90 232 -263 139 117 20 132 -108 52 112 -120 22 -82 71 231 81
3985 81 161 -65 -90 167 167 205 161 -70 41 -355 -27 -75 -75 -100 -122 -146 -108 -71 308 44 73 -142 -27 148 195 6
4011 6 -154 -248 193 35 148 -244 -239 99 324 137 -114 30 -24 -154 1 74 2 156 -159 53 -95 -39 6
4034 6 -76 70 130 -161 112 -234 -53 -275 19 -73 77 -179 100 -92 -70 -229 -209 66 168 58 72 28 21 -40
4058 -40 -69 181 -102 -199 -4 -276 147 -35 -118 -120 -122 -288 175 -116 -43 172 -150 150 -181 237 -258 7 145
4081 145 45 177 195 -42 404 7 242 142 253 69 -39 -122 3 140 -51 -43 114 -126 -23 -134 -97 -7
4103 -7 -182 99 45 -43 107 -149 -213 84 -140 165 6 -37 186 297 -30 -166 -116 -21 -178 101 -87 -102 -72
4126 -72 100 234 -114 106 -70 -187 35 302 123 -293 44 9 6 84 127 41 -192 72 213 -207 51 103 122
4149 122 57 250 -252 -30 199 -31 -133 129 124 123 -69 -87 251 58 2 190 -76 51 -284 70 -10 -120 49
4172 49 150 42 -183 -285 -50 -24 -396 41 -84 -196 111 -76 57 148 -75 19 -170 73 24 -147 6 -5
4194 -5 150 23 -34 86 152 28 266 308 -145 -298 -1 -59 100 30 -19 332 -149 275 -255 165 -62 -173 -25
4217 -25 -64 -12 -38 51 -241 123 142 -26 67 85 -281 75 127 417 -223 76 -160 -122 227 33 -42 178 11 114
4241 114 196 -70 -46 12 44 -143 -41 108 152 -170 106 -4 -144 172 -186 -42 31 -207 -103 219 -67 157
4263 157 80 -99 -73 104 222 197 -114 95 39 -235 527 -247 -6 -61 -178 100 190 80 71 85 157 -117 54
4286 54 -94 -17 149 1 29 -45 74 174 -202 98 -50 65 28 -128 15 -123 -146 -104 54 -186 15 -107
4308 -107 -326 37 22 -112 -148 144 125 -9 232 -145 79 137 -10 -21 -204 283 44 178 -173 -72 96 27
4330 27 -40 -5 59 -29 -12 15 33 -166 135 -28 -140 59 62 -200 107 64 78 112 166 -94 67 2 -173 -227 -11
4355 -11 -54 -127 269 -146 64 -205 -48 110 76 7 -56 -9 11 32 -31 -123 45 -281 -198 20 261 16 -88 -313
4379 -313 267 41 -287 -11 99 -86 16 103 51 -8 20 176 -75 -47 -208 -49 26 78 -148 76 -63 -126 -120
4402 -120 74 118 -78 -248 83 -55 -133 160 81 -102 -16 48 -16 -12 -15 126 41 -72 -223 64 264 24 -145 -217
4426 -217 -24 8 192 -39 23 94 177 67 -19 92 -207 94 -2 -113 172 -172 -154 -4 69 65 106 19 -55 -137 101
4451 101 61 15 72 50 -29 126 8 119 -37 128 9 -36 -52 20 -66 -99 197 -217 -198 42 -133 -208 -41 59
4475 59 55 168 244 91 -264 9 -13 -75 -55 24 -125 35 -218 116 49 -12 80 -4 18 -168 234 130 -97 -24 43
4500 43 91 121 38 -86 -2 33 106 -101 -88 226 -219 64 -72 41 -210 -197 153 31 251 -136 -53 110 -67
4523 -67 -36 -122 203 -209 268 -9 172 73 28 -69 -104 3 -54 -9 41 144 313 52 -82 -25 296 66 -71 -197
4547 -197 17 5 -235 -13 71 29 -172 -7 -157 -75 100 -86 -71 24 8 186 177 -175 -175 -118 -335 -146 103 -107
4571 -107 65 -221 194 -308 126 275 169 137 21 62 59 -129 137 97 176 110 5 -161 -34 -102 -142 219 124
4594 124 -36 184 110 -40 -37 -55 -190 94 68 -63 -36 -16 167 104 69 392 -27 33 -179 74 32 -57 -315 99
4618 99 90 2 166 -23 28 -6 27 114 -130 269 268 -51 70 -98 -3 -26 38 4 306 -241 -176 4 126 26 -59
4643 -59 -104 -165 136 120 106 60 74 -125 61 75 69 82 -246 19 -69 189 55 -274 -129 -27 -252 45 113 358
4667 358 25 -239 -21 -7 78 204 57 132 196 170 -264 52 -150 50 5 162 -99 -21 130 -230 -56 316
4689 316 -15 55 -179 -107 23 -91 35 137 -21 -177 -97 116 147 -16 83 277 117 -18 -240 255 70 -34
4711 -34 -35 -132 -16 66 -160 -18 101 -43 -7 12 105 245 154 369 -86 92 -48 32 190 -152 56 211 60
4734 60 -46 -262 -28 40 -148 148 31 -126 105 -140 67 -37 -79 228 184 -142 -192 349 109 193 -90 182
4756 182 144 -217 134 -103 125 7 -146 35 174 -269 10 -192 68 228 -6 -13 -36 -42 37 -15 -65 124 55
4779 55 138 -299 -232 -177 -60 4 126 -18 -62 -64 99 61 278 -126 -136 17 33 -256 -156 270 57 -62 -86 -80 70
4804 70 -27 162 99 112 -317 81 -44 -153 -70 -19 164 4 -17 149 172 143 7 134 49 -25 7 -70 -39 167 155
4829 155 -268 -23 40 80 119 112 13 -128 186 79 -45 123 20 -70 169 132 39 77 63 77 97 -35 78 -197
4853 -197 -153 -131 -157 -170 -91 242 65 -107 -171 263 103 -138 155 -111 -190 195 -67 -156 -203 48 -204 284 -289
4876 -289 2 78 -55 382 -215 201 -55 -130 -149 81 -29 158 -211 -183 -185 -138 -74 266 31 -223 163 -66 -172
4899 -172 -52 -170 -245 45 -121 -26 -26 -97 -197 136 -249 377 133 269 196 90 -67 -37 -31 -42 30 89 -62 -176
4923 -176 9 149 267 -26 99 -76 -11 404 31 117 74 258 30 -38 -140 -95 29 87 88 -126 -118 -18 -123
4946 -123 -79 66 203 -548 -66 97 -288 -35 -159 140 43 183 -166 -125 -110 -293 261 -395 -63 -63 1 27 107
4969 107 -198 -163 -177 3 310 -88 -53 0 -4 -38 -68 -252 80 -26 -1 -80 54 -59 48 1 -14 91 144 -29
4993 -29 -23 -34 22 -282 64 43 9 -84 13 -32 -317 3 80 172 129 155 67 96 117 84 -222 116 119 -162 -72 -39 198
5020 198 -39 265 -45 -174 150 -126 106 -217 -3 77 -89 -99 -153 49 61 -29 -57 18 30 -189 225 351 -26
5043 -26 -28 -2 -32 -55 31 -7 -149 -288 77 167 3 115 -236 -90 -130 -153 57 30 -9 -50 -19 79 -264 -301 -283 -24
5069 -24 -164 53 -54 21 64 -40 -183 -7 38 132 17 207 -24 -65 -48 -249 -8 103 -90 -84 319 -129 -136 26
5093 26 -314 -34 -17 -79 -33 -93 102 41 95 246 -22 423 177 -4 -90 134 112 73 -20 46 -11 -65 -177 18 295
5118 295 239 -61 204 -22 307 -330 440 -411 -500 -672 -357 -212 -253 171 -61 -23 -85 218 -736 -714 195 -446
5140 -446 -56 -305 -1 -161 20 48 -237 -63 93 -69 24 56 -199 -28 -232 -80 129 -22 0 25 -143 159
5162 159 -5 120 -107 133 -34 -107 -181 -217 -102 38 -192 -3 288 -87 -159 -54 -52 19 187 201 -254 -21 -239
5185 -239 38 -147 -216 -446 -34 -77 -21 20 106 -234 -128 -13 -401 -94 -71 51 94 -11 87 -33 46 -87 159
5208 159 -257 33 40 59 41 20 182 83 -186 44 -222 -214 -123 -174 102 -222 62 13 89 -289 -133 -92 -30 294 121
5233 121 201 -109 -237 -180 52 -462 329 59 -16 211 87 -40 -22 -13 -35 179 187 -90 -65 -199 0 -2 -29 -11 -20
5258 -20 99 97 -39 -69 -226 -65 -202 259 23 -148 -171 -73 55 -137 133 66 -322 -99 248 85 -131 -215 132
5281 132 4 26 -96 -45 -75 -331 -66 74 71 30 -112 142 -149 134 5 -179 -108 -67 -133 -149 11 66 96 -236
5305 -236 10 113 89 3 21 140 -107 -109 68 131 67 131 -117 36 -68 -216 207 53 46 176 137 298 27 27
5329 27 -1 149 186 -90 -38 -141 23 -93 -83 -300 296 -69 223 316 -295 38 84 -164 -190 -149 17 44 -1 203
5353 203 -246 12 2 -14 92 -86 -176 -300 -94 -194 195 108 -174 -67 8 -36 -186 -114 6 -36 127 44 -215
5376 -215 68 82 176 113 69 -189 -89 -161 64 -61 -59 36 -82 125 -59 -240 59 81 83 4 190 -212 -158 15
5400 15 99 104 -79 19 -269 -23 -51 141 -307 33 -189 -5 -77 192 -207 -69 -128 215 212 -44 -19 146 63 27
5424 27 203 -68 -78 -76 -247 -58 86 -35 143 -115 57 215 216 180 -255 9 -68 -207 222 199 -12 64 104 -232
5448 -232 -82 169 -149 -84 -101 0 146 193 49 -127 119 -90 -32 167 176 413 -290 84 -60 98 168 -325
5470 -325 21 114 47 -108 -181 198 -19 -42 -188 -62 31 -3 69 59 -142 -65 -125 83 15 -78 15 99 11 -103 -189
5495 -189 -132 56 -54 -261 -147 248 -112 188 43 79 298 206 266 0 93 74 160 -259 -5 177 176 -21 111
5518 111 83 94 24 -31 -344 -235 18 -73 238 -139 -115 0 -74 83 -48 189 -150 162 -75 -145 105 -56 28
5541 28 -131 -210 43 239 83 102 151 -20 -3 -146 376 16 62 134 17 292 150 -101 51 59 -187 -166 43
5564 43 -51 -50 -107 -138 -73 -92 27 -99 318 -60 77 157 -135 -7 123 6 -64 21 115 304 -137 20 -46 70
5588 70 -67 -192 -185 -96 -8 -85 -166 -99 -31 -210 115 256 -98 169 327 -40 -31 77 -159 154 159 50 136 -50 65
5613 65 -96 129 61 -18 -28 -66 11 -283 -10 96 154 -52 -32 -288 9 -99 100 226 -122 -100 242 6 -189
5636 -189 106 -89 247 -1 190 18 -144 115 -11 70 121 96 25 36 -7 -45 -103 52 13 14 -7 93 -37 -220
5660 -220 -92 179 -60 -85 36 -32 59 87 339 7 47 73 -70 293 91 -47 88 90 -225 153 -65 -3 -79
5683 -79 -228 76 -46 307 105 111 41 8 -72 105 -48 126 74 -223 84 -4 -240 63 -33 248 -55 48 103
5706 103 53 229 311 -107 -34 -42 -50 206 -145 11 35 64 -69 -44 -14 -148 35 106 5 127 229 -107 69 5
5730 5 -240 51 -292 425 -11 139 97 70 43 23 24 33 -50 -124 -29 186 83 77 -168 -139 27 -70 229 -128 169 -35
5756 -35 129 28 -167 68 109 74 3 61 110 -195 41 -169 -114 16 -101 -120 -15 233 258 -263 53 200 46
5779 46 71 138 -308 -187 -56 56 -120 -116 129 200 -13 -20 114 -39 116 -156 -137 270 -192 180 -3 -66 -19 380
5803 380 -187 205 81 -113 -92 -2 206 154 139 52 -97 -30 140 -5 -5 156 219 -56 37 79 242 -106 172 52
5827 52 127 -126 -131 -28 89 259 111 -27 -89 15 89 255 25 85 54 322 193 -14 -295 327 -31 -221 -253
5850 -253 -54 -86 -15 144 -122 -116 -201 -214 -48 -135 -16 27 -150 105 -24 135 131 58 -225 -140 -86 53 -135 69
5874 69 108 -73 95 -186 31 211 276 -20 21 -25 -291 -28 163 195 46 -1 41 194 46 36 101 -101 75
5897 75 21 78 -37 121 -167 -151 142 -194 237 -95 -108 -105 -10 30 -176 -28 17 41 272 15 -88 9 -241 340
5921 340 28 26 -296 126 -56 13 -158 -107 168 -17 57 -100 -33 297 195 136 41 -21 117 129 -1 20 -184 -100
5945 -100 -217 235 -6 -24 87 -170 135 83 1 -114 -100 -30 47 50 -257 -73 91 -11 -118 -128 -181 32 206
5968 206 -177 256 147 -147 -16 -42 -109 217 110 -73 203 127 -254 24 53 -11 68 78 7 -101 51 -87 -362
5991 -362 175 205 19 -61 -163 -81 47 264 -172 -8 132 46 164 -329 194 100 -16 76 -186 76 -33 -193
6013 -193 -153 183 -5 -92 83 -73 74 92 -22 -183 -20 -153 99 118 -76 -69 -188 -35 146 -153 -42 127
6035 127 -67 -108 141 42 44 -183 229 20 -7 -145 109 72 -143 -147 9 -294 -142 100 210 -106 -137 -135 58 -102
6059 -102 27 179 71 -39 -83 57 135 51 74 -18 -105 -128 -292 61 -443 57 -91 -2 -99 -154 -204 -51 137 -160
6083 -160 -202 -87 -11 190 56 -65 50 -175 98 2 -74 173 -47 25 -16 34 116 -37 195 5 -130 50 -9
6106 -9 60 41 -155 9 132 1 121 71 21 -19 -164 -196 358 -16 5 189 -68 -14 1 256 100 -203 -302 -140
6130 -140 105 -41 -17 -152 -45 -165 144 145 76 98 -124 -51 -158 -171 25 93 -99 138 -22 125 -109 117 82
6153 82 -19 363 -70 196 -151 -4 -160 -140 281 -33 -39 47 47 -112 -38 -15 146 177 73 -23 78 -241 -116 5
6177 5 17 -4 -325 149 27 -25 273 136 -1 -73 -32 34 12 -91 -127 89 176 -309 56 -107 -40 55 53 -31 132
6202 132 -73 -331 190 336 -366 -281 -298 -119 -27 -209 153 29 62 -73 64 137 124 167 12 -23 -121 -95 141
6225 141 -55 104 214 -103 -133 174 77 -29 9 -43 -180 121 -53 143 159 0 109 29 256 226 40 -38 -163
6248 -163 18 82 -276 -20 12 158 83 138 56 -90 78 -301 16 -92 10 207 -130 2 157 -320 174 -85
6270 -85 4 -109 -5 80 -74 -111 173 101 -112 16 -103 -281 -140 -47 12 -108 176 -287 -32 -68 -167 -290 159
6293 159 90 14 -180 40 129 -78 -109 -9 -124 -105 -155 15 -51 94 -58 4 49 18 -89 -69 102 -52 3 122
6317 122 64 -60 300 170 282 26 18 -278 56 -79 -41 47 180 132 123 -199 -149 5 -30 -65 168 82 108 34 89
6342 89 -92 -83 -118 -239 197 78 14 29 76 3 54 21 -83 131 -207 -29 59 61 40 216 3 -39 -19 152 375
6367 375 90 124 76 -17 31 -205 127 225 -156 177 4 68 118 185 -99 -203 141 114 -88 274 137 -121 0
6390 0 73 135 9 132 4 9 -111 -101 204 338 -165 -256 -159 -28 -148 1 -119 56 -191 121 154 87 -120 -113
6414 -113 216 114 -131 -6 19 61 96 83 -51 -46 47 -140 55 211 141 -286 -77 46 113 145 -20 74 -299 32
6438 32 -145 48 -94 -46 -103 -68 -105 -172 22 -137 277 -248 -73 -219 -43 -84 75 -101 115 -206 -102 -52 -113
6461 -113 255 185 -95 8 197 -73 -253 116 -4 -182 -22 -2 10 114 73 4 -192 42 158 77 -91 -83 232
6484 232 18 10 8 -164 189 -151 -2 4 -113 -9 135 -188 -136 255 -86 300 -165 -73 240 -59 -229 172 -182
6507 -182 -260 213 -198 -67 83 55 -155 -153 62 -341 -287 47 303 -12 107 -2 -160 66 -123 -161 65 -89
6529 -89 38 21 114 5 14 -89 5 -92 12 -40 99 -29 -108 -22 203 142 -87 -149 -10 240 9 73 -112 104
6553 104 -36 294 47 -114 200 -98 -12 22 8 324 -108 -65 114 67 30 -74 -1 15 -62 4 185 81 -2 54
6577 54 -194 -15 -119 -384 269 150 -94 153 -72 131 65 -234 -73 -151 111 -173 -117 39 -255 -12 108
6598 108 -83 -6 -13 -56 9 -284 76 24 15 253 218 88 154 -105 324 -63 12 105 113 189 -109 171 104 -68 -31 -33
6624 -33 148 268 -21 -55 -136 111 61 26 196 157 -183 78 -7 13 -122 15 10 19 148 -54 -79 -167 201 53 -22
6649 -22 -61 -213 130 -19 209 45 -198 -90 56 -201 -38 -316 29 109 68 64 -56 50 -178 176 -149 88
6671 88 -190 57 -83 -220 -151 -32 21 184 99 68 -44 -95 -251 -67 -39 26 -210 -79 297 96 105 135 -17 25
6695 25 22 9 128 184 -88 -163 201 -161 -181 -27 -173 43 36 -15 148 -150 18 54 -174 -44 1 93 231 -6
6719 -6 -5 35 -42 -61 -137 -112 -39 -2 -10 95 -68 -327 55 222 -6 -142 -75 137 -200 32 162 -149 313 -190 -68
6744 -68 248 -6 236 82 44 11 5 103 29 97 -66 104 -124 30 89 48 -6 -318 101 178 -83 194 245 148 -228
6769 -228 -315 323 84 161 -53 -94 77 198 27 -17 166 -181 15 35 204 -92 122 198 -86 -91 6 89 -10 -4
6793 -4 -109 121 -134 283 15 -66 -55 42 62 115 56 -144 84 93 -266 203 -174 323 51 -40 -279 -39 75 -92
6817 -92 -5 -137 273 -58 32 190 227 64 177 -151 154 277 28 -63 -167 -297 -322 -216 -176 -60 164 297
6839 297 125 115 -30 -133 -122 -75 58 -48 -318 -14 -89 397 41 -39 279 291 -65 218 -5 99 81 16 214
6862 214 51 -134 77 31 -40 -80 147 -42 -58 32 -193 -174 -113 -148 294 -9 -38 192 101 -151 -89 53 54 42 18
6887 18 186 -55 -183 -129 -215 145 -69 -14 163 -50 110 52 84 -151 33 -201 337 130 114 54 7 23 101 1
6911 1 -207 23 -207 -367 18 38 -42 -113 -133 -17 -97 69 117 87 -83 -28 -20 -18 228 147 -30 92 -112 -235 -16
6936 -16 72 -27 34 -160 -66 161 -10 -142 175 48 302 -20 -17 -203 51 180 -286 271 -149 78 134 272 147
6959 147 993 61 72 344 -54 119 -205 109 53 -2 165 -205 254 57 142 81 325 -7 -81 -104 -134 14 -40
6982 -40 171 63 45 -26 -175 -246 -122 -63 -298 43 -10 30 45 51 -169 -19 28 6 14 80 -85 -65 -12 150 -56 -86
7008 -86 -201 -74 114 -32 20 230 143 -35 -177 -159 -184 72 68 117 99 265 -158 43 69 -150 55 -19 215 -79
7032 -79 56 -7 -80 61 -123 -276 -35 191 -223 -126 -22 206 79 15 250 -181 -3 89 -7 -36 54 -22 -190
7055 -190 -160 124 -137 72 -119 168 -140 125 -115 1 50 -53 191 56 134 -111 34 -57 -127 39 30 -235
7077 -235 85 26 241 -210 158 -24 -98 309 -223 59 122 -68 121 -72 81 -230 -186 -26 102 -112 46
7098 46 42 -12 151 -253 -308 123 -146 -107 -19 -131 -69 -37 -49 228 -87 -19 -122 41 146 180 -18 3 203 60
7122 60 18 77 250 115 132 104 41 117 66 -26 28 -91 -37 4 82 -169 -233 -21 -107 153 -20 -128 -106 155 73 97
7148 97 -55 -109 -5 -75 -12 19 -195 13 43 74 157 -123 91 169 -98 -87 -52 -111 -61 -85 122 -26 -139 -111 -47
7173 -47 289 6 -135 -172 -63 -88 226 -166 -242 285 270 120 -129 57 -36 138 220 172 -64 -159 174 -190 -25
7196 -25 63 -113 -112 -287 -80 63 254 121 234 217 219 215 161 195 79 -21 -41 13 228 124 -271 213 -109 -55 122
7221 122 69 -40 50 -256 -115 -101 -232 62 -283 -158 11 99 -318 -236 -84 186 -203 -50 137 110 25 136
7243 136 59 -12 85 -143 -16 -1 160 30 185 243 -147 -261 -130 207 84 308 3 -203 111 53 -20 -139
7265 -139 -251 -76 -339 -150 -38 125 85 6 -77 -174 284 -321 -286 -68 -50 -184 -48 124 98 -106 -76 -32 160
7288 160 314 -29 -190 180 71 258 -89 -61 2 173 -249 57 -18 89 11 -233 -52 66 300 -204 -119 -125
7310 -125 -35 59 -17 -266 -95 130 -69 -64 100 -114 270 -165 -51 -128 41 14 -108 -108 -42 70 -186 -49 -274
7333 -274 62 -60 141 343 -62 -59 252 -47 213 -115 -49 -68 105 -208 -81 -200 -96 53 170 69 -18 209
7355 209 -120 -26 -11 398 63 -52 -112 71 166 -39 21 52 0 4 -65 11 -25 -79 87 -231 64 49 123 -19 -191
7380 -191 107 -270 -219 97 138 104 -41 -85 193 -74 -99 -148 42 74 16 40 237 123 -115 163 27 -48 -54 -105
7404 -105 108 91 151 284 321 35 -202 137 -100 -85 -4 191 -125 109 -10 0 -15 -119 98 73 175 99 43
7427 43 -37 42 37 436 82 -91 -19 -255 -25 -93 116 -108 109 214 -265 86 169 56 114 113 20 169 -74 75
7451 75 -76 -47 90 -75 64 157 -232 -228 -226 74 29 -88 -74 139 77 -628 -197 -1 -100 -48 61 -166 214 150
7475 150 -57 -48 -261 99 321 60 -67 -191 -316 -223 36 111 162 31 114 -26 36 264 30 21 50 -240 8
7498 8 263 -83 153 -116 -40 71 -24 91 -216 -81 -44 -28 -83 -6 -114 138 -146 -179 -190 58 126 -231 17 34
7522 34 -135 51 135 -36 70 -120 -358 -58 -153 -253 172 124 149 140 153 -14 74 8 -11 -226 -101 157 -255 -230
7546 -230 -122 107 41 14 -96 76 -64 -57 179 44 198 -50 82 138 -14 -185 66 57 123 -22 -70 -198 -24
7569 -24 -10 35 175 2 -62 34 189 62 -198 -323 14 -228 188 -51 138 181 -49 112 -161 -11 -76 -71 -155
7592 -155 38 94 -51 39 6 194 256 -65 -35 292 -31 123 -223 119 -1 -141 139 241 97 -109 97 50
7614 50 31 -46 -138 -142 42 280 -9 -160 64 -62 -309 -55 210 -118 116 -32 76 36 187 157 74 4 -58 12
7638 12 200 173 280 107 -107 73 -139 78 174 -37 -115 -253 229 56 -277 -159 146 33 -10 174 342 -166
7660 -166 187 267 40 -103 324 79 22 -8 -106 -84 3 236 25 167 -32 -152 -32 54 136 46 15 -20 -78 31
7684 31 250 127 -161 20 248 110 49 -59 -219 -38 197 -3 37 214 60 -10 -22 228 99 60 -380 92
7706 92 -330 36 50 -36 -58 229 52 -52 -80 -83 21 -71 8 -35 -35 66 -67 -231 84 -20 20 -103 72 234
7730 234 -102 -255 251 89 -347 -84 33 -162 -163 -182 -36 71 35 106 -98 327 -162 27 -30 -62 107 -98
7752 -98 -177 -118 199 -40 -3 20 -181 20 162 -220 199 -226 96 -77 -72 137 226 -32 -123 160 44 -11 280
7775 280 122 152 129 -11 141 -105 -9 -147 180 -252 24 222 46 -63 -89 -39 73 165 -135 34 67 159 -49
7798 -49 -397 130 -172 57 17 -337 122 -157 55 168 52 -107 -15 -25 74 -13 -255 -135 -185 134 -134 -54 12
7821 12 163 162 66 -58 1 -128 10 -186 136 -88 172 -257 -117 7 134 -144 -211 29 -142 169 -31 161
7843 161 -29 -10 -185 41 -52 8 -19 -110 -159 68 215 110 33 29 239 -11 108 16 -139 61 0 -3 183 -84
7867 -84 74 98 -86 -52 -39 189 -119 -7 -62 68 244 80 4 86 87 -318 249 94 157 -365 -22 -77 -229 -187
7891 -187 118 -56 -112 37 -34 196 85 -50 98 -556 -16 98 14 141 200 -477 -57 -17 -36 65 20 -193
7913 -193 90 18 -89 -73 66 277 -22 72 40 43 138 231 -35 127 -27 36 -109 -19 -91 -88 -160 94 -154 73 204
7938 204 38 108 -11 -14 -105 201 -107 151 -8 132 47 -329 -152 -178 -54 49 -97 -109 -83 -50 99 -102 216
7961 216 187 4 177 -91 -219 -35 327 -4 -148 109 53 39 175 69 294 -110 -44 52 104 139 -140 -15
7983 -15 -32 175 131 19 -22 -155 68 -145 88 -54 -342 -123 146 -237 11 101 -142 307 -110 -6 -179 10
8005 10 -254 132 -245 -52 7 -69 82 33 227 60 -79 280 172 138 0 150 38 45 -28 -256 13 -268 114
8028 114 142 50 -92 -119 119 152 53 51 78 -9 83 -110 164 78 97 -103 -81 -24 -98 126 62 240 -44 -94 -152 21
8054 21 -19 -303 38 -220 12 -9 -29 -231 -24 51 -36 -26 -156 -150 -100 53 160 -55 149 362 2 18 -216 67
8078 67 -127 124 -78 -58 157 -77 68 78 -171 -90 83 -86 -178 132 -29 -146 -260 -52 2 235 -100 28
8100 28 -243 -216 178 239 -76 95 142 229 -159 -94 344 -4 23 124 234 -137 296 -17 108 -139 73 136 -187
8123 -187 -256 51 -82 127 -23 27 2 -40 144 -157 -61 226 -448 -105 -121 54 4 -76 -125 -185 127 -15 -22 46
8147 46 -142 122 21 82 170 105 43 -332 247 -203 -62 10 -367 -28 -203 -53 -92 35 151 -137 299 -115
8169 -115 74 -41 -229 165 258 -35 -33 23 -5 -163 -73 213 54 129 -80 103 16 -139 122 -197 -104 221
8191B21
##END NTUPLES=NMR FID
##END=
