##TITLE=1H_DE2_k
 CDCl3
 8 sc, 
 4.7.2023
##JCAMPDX= 6.0         $$ Bruker NMR JCAMP-DX V2.0
##DATA TYPE= NMR FID
##DATA CLASS= NTUPLES
##ORIGIN= UXNMR, Bruker Analytische Messtechnik GmbH
##OWNER= root
$$ XWIN-NMR		Version 3.5
$$ Tue Jul  4 16:23:02 2023 Russian Standard Time (UT+4h)  she@DPX200
##.OBSERVE FREQUENCY= 200.13135
##.OBSERVE NUCLEUS= ^1H
##.DELAY= (6, 6)
##.ACQUISITION MODE= SIMULTANEOUS
##.ACQUISITION SCHEME= undefined
##.AVERAGES= 8
##.DIGITISER RES= 18
##SPECTROMETER/DATA SYSTEM= spect
##.PULSE SEQUENCE= zg30
##.SOLVENT NAME= CDCl3
##.SHIFT REFERENCE= (INTERNAL, CDCl3, 0, 15.7039)
##AUDIT TRAIL= $$ (NUMBER, WHEN, WHO, WHERE, WHAT)
$$ ##TITLE= Audit trail, XWIN-NMR		Version 3.5
$$ ##JCAMPDX= 5.01
$$ ##ORIGIN= Bruker BioSpin GmbH
$$ ##OWNER= she
$$ F:/spectra/data/she/nmr/H-F/1/audita.txt
$$ ##AUDIT TRAIL=  $$ (NUMBER, WHEN, WHO, WHERE, WHAT)
(   1,<2023-07-04 16:22:08.43 +0400>,<she>,<DPX200>,
      <created by zg, POWCHK disabled, PULCHK disabled
       configuration hash MD5:
       00 E9 B6 7A A2 85 ED C7 34 08 36 98 17 FE 4E 26
       data hash MD5: 16K
       CC 25 38 6C 82 A6 55 D3 61 8B 9B 5B F0 AA 6C 98>)
$$ ##END=
$$ 
$$ hash MD5
$$ D0 8A 96 F4 A6 97 46 D7 7E 5A 9C 8A 02 86 49 A3
##$RELAX= 
##$RELAX= 
##$RELAX= 
##$RELAX= 
##$RELAX= 
##$RELAX= 
$$ Bruker specific parameters
$$ --------------------------
##$DU= <F:/spectra>
##$EXPNO= 1
##$NAME= <H-F>
##$PROCNO= 1
##$TYPE= <nmr>
##$USER= <she>
##$AMP= (0..31)
100 100 100 100 100 100 100 100 100 100 100 100 100 100 100 100 100 100 
100 100 100 100 100 100 100 100 100 100 100 100 100 100 
##$AQSEQ= 0
##$AQ_mod= 1
##$AUNM= <au_zg>
##$AUTOPOS= <>
##$BF1= 200.13
##$BF2= 200.13
##$BF3= 200.13
##$BF4= 200.13
##$BF5= 200.13
##$BF6= 200.13
##$BF7= 200.13
##$BF8= 200.13
##$BYTORDA= 1
##$CFDGTYP= 0
##$CFRGTYP= 5
##$CHEMSTR= <none>
##$CNST= (0..31)
1 1 145 1 1 1 1 1 1 1 1 1 1 1 1 1 1 1 1 1 1 1 1 1 1 1 1 1 1 1 1 1 
##$CPDPRG= <>
##$CPDPRG1= <>
##$CPDPRG2= <>
##$CPDPRG3= <>
##$CPDPRG4= <mlev>
##$CPDPRG5= <mlev>
##$CPDPRG6= <mlev>
##$CPDPRG7= <mlev>
##$CPDPRG8= <mlev>
##$CPDPRGB= <>
##$CPDPRGT= <>
##$D= (0..31)
0 1.2 0 0 0 0 0 0 0 0.06 0 0.03 0 0 0 0 0.0002 0 0 0 0 0 0 0 0 0 0 0 0 
0 0 0 
##$DATE= 1688473327
##$DBL= (0..7)
120 120 120 120 120 120 120 120 
##$DBP= (0..7)
150 150 150 150 150 150 150 150 
##$DBP07= 0
##$DBPNAM0= <>
##$DBPNAM1= <>
##$DBPNAM2= <>
##$DBPNAM3= <>
##$DBPNAM4= <>
##$DBPNAM5= <>
##$DBPNAM6= <>
##$DBPNAM7= <>
##$DBPOAL= (0..7)
0.5 0.5 0.5 0.5 0.5 0.5 0.5 0.5 
##$DBPOFFS= (0..7)
0 0 0 0 0 0 0 0 
##$DE= 6
##$DECBNUC= <off>
##$DECIM= 32
##$DECNUC= <off>
##$DECSTAT= 4
##$DIGMOD= 1
##$DIGTYP= 9
##$DL= (0..7)
0 120 120 120 120 120 120 120 
##$DP= (0..7)
150 150 150 150 150 150 150 150 
##$DP07= 0
##$DPNAME0= <>
##$DPNAME1= <>
##$DPNAME2= <>
##$DPNAME3= <>
##$DPNAME4= <>
##$DPNAME5= <>
##$DPNAME6= <>
##$DPNAME7= <>
##$DPOAL= (0..7)
0.5 0.5 0.5 0.5 0.5 0.5 0.5 0.5 
##$DPOFFS= (0..7)
0 0 0 0 0 0 0 0 
##$DQDMODE= 0
##$DR= 18
##$DS= 0
##$DSLIST= <SSSSSSSSSSSSSSS>
$$ [...]
##$SUBNAM2= <"">
##$SUBNAM3= <"">
##$SUBNAM4= <"">
##$SUBNAM5= <"">
##$SUBNAM6= <"">
##$SUBNAM7= <"">
##$SUBNAM8= <"">
##$SUBNAM9= <"">
##$SW= 18.05172834244
##$SWIBOX= (0..15)
0 0 2 0 0 0 0 0 0 0 0 0 0 0 0 0 
##$SW_h= 3612.71676300578
##$TD= 16384
##$TD0= 1
##$TE= 0
##$TE2= 300
##$TE3= 300
##$TEG= 300
##$TL= (0..7)
0 120 120 120 120 120 120 120 
##$TP= (0..7)
150 150 150 150 150 150 150 150 
##$TP07= 0
##$TPNAME0= <>
##$TPNAME1= <>
##$TPNAME2= <>
##$TPNAME3= <>
##$TPNAME4= <>
##$TPNAME5= <>
##$TPNAME6= <>
##$TPNAME7= <>
##$TPOAL= (0..7)
0.5 0.5 0.5 0.5 0.5 0.5 0.5 0.5 
##$TPOFFS= (0..7)
0 0 0 0 0 0 0 0 
##$TUNHIN= 0
##$TUNHOUT= 0
##$TUNXOUT= 0
##$USERA1= <user>
##$USERA2= <user>
##$USERA3= <user>
##$USERA4= <user>
##$USERA5= <user>
##$V9= 5
##$VALIST= <valist>
##$VCLIST= <CCCCCCCCCCCCCCC>
##$VD= 0
##$VDLIST= <DDDDDDDDDDDDDDD>
##$VPLIST= <PPPPPPPPPPPPPPP>
##$VTLIST= <TTTTTTTTTTTTTTT>
##$WBST= 1024
##$WBSW= 4
##$XGAIN= (0..3)
0 0 0 0 
##$XL= 0
##$YL= 0
##$YMAX_a= 479788
##$YMIN_a= -287429
##$ZGOPTNS= <>
##$ZL1= 120
##$ZL2= 120
##$ZL3= 120
##$ZL4= 120
##$ABSF1= 10
##$ABSF2= 0
##$ABSG= 5
##$ABSL= 3
##$ALPHA= 0
##$AQORDER= 0
##$ASSFAC= 0
##$ASSFACI= 0
##$ASSFACX= 0
##$ASSWID= 0
##$AUNMP= <proc_1d>
##$AZFE= 0.1
##$AZFW= 0.1
##$BCFW= 1
##$BC_mod= 2
##$BYTORDP= 1
##$COROFFS= 0
##$CY= 11.3945322036743
##$DATMOD= 1
##$DC= 2
##$DFILT= <>
##$DTYPP= 0
##$F1P= 15.7292609196834
##$F2P= 12.9074282941183
##$FCOR= 0.5
##$FTSIZE= 0
##$FT_mod= 4
##$GAMMA= 1
##$GB= 0.15
##$INTBC= 1
##$INTSCL= 1
##$ISEN= 128
##$LB= 0.24
##$LEV0= 0
##$LPBIN= 0
##$MAXI= 10000
##$MC2= 0
##$MEAN= 0
##$ME_mod= 0
##$MI= 1.114404
##$NCOEF= 0
##$NC_proc= 0
##$NLEV= 6
##$NOISF1= 3.799351
##$NOISF2= 2.8
##$NSP= 1
##$NTH_PI= 0
##$NZP= 0
##$OFFSET= 15.70392
##$PC= 1
##$PHC0= -20631
##$PHC1= 11.05272
##$PH_mod= 1
##$PKNL= yes
##$PPARMOD= 0
##$PSCAL= 0
##$PSIGN= 0
##$REVERSE= no
##$SF= 200.130013532006
##$SI= 16384
##$SIGF1= 3
##$SIGF2= 2
##$SINO= 400
##$SIOLD= 16384
##$SREGLST= <1H.CDCl3>
##$SSB= 0
##$STSI= 0
##$STSR= 0
##$SW_p= 3612.71676300578
##$SYMM= 0
##$S_DEV= 0
##$TDeff= 0
##$TDoff= 0
##$TI= <>
##$TILT= no
##$TM1= 0
##$TM2= 0
##$TOPLEV= 0
##$USERP1= <user>
##$USERP2= <user>
##$USERP3= <user>
##$USERP4= <user>
##$USERP5= <user>
##$WDW= 1
##$XDIM= 8192
##$YMAX_p= 0
##$YMIN_p= 0
$$ End of Bruker specific parameters
$$ ---------------------------------
##NTUPLES= NMR FID
##VAR_NAME=  TIME,          FID/REAL,        FID/IMAG
##SYMBOL=    X,             R,               I
##VAR_TYPE=  INDEPENDENT,   DEPENDENT,       DEPENDENT
##VAR_FORM=  AFFN,          ASDF,            ASDF
##VAR_DIM=   8192,          8192,            8192
##UNITS=     SECONDS,       ARBITRARY UNITS, ARBITRARY UNITS
##FACTOR=    0.0002768,     1,               1
##FIRST=     0,             0,               0
##LAST=      2.2672688,     0,               0
##MIN=       0,             -287429,         0
##MAX=       2.2672688,     479788,          0
$$ Real data points
##PAGE= N=1
##DATA TABLE= (X++(R..R)), XYDATA
0@%%%%%%%%%%%%%%Qj6J6j6J6k4L2l6M4n2O0p1Q3r6J10j26J44j62J86k10K34k64
$$ 0 0 0 0 0 0 0 0 0 0 0 0 0 0 0 8 -8 8 -8 8 -16 16 -20 24 -28 32 -39 44 -52 58 -68 76 -86 100 -110 124 -140
36a40L00l36L75m20M66n18N72o32P00p74Q55r42J038j144J261j387J527j687J864
$$ -140 160 -176 199 -221 245 -273 299 -333 367 -407 448 -494 544 -600 661 -726 801 -886 978
55I78k064K294k556K860l222L658m192M864n743O950q706J1501j6640K9006j09591
$$ 978 -1086 1208 -1348 1512 -1710 1948 -2244 2620 -3123 3827 -4879 6622 -10018 18988 -90603
70i0603j06773K47935q5861j01410L18292O8454m75965m6631M19422j8935k98375
$$ -90603 -197376 50559 -35302 -136712 181580 250034 -225931 -272562 146860 127925 -170450
81a70450J10600J92966q8728j02269j8032J9112J80200L5176l25105n7409M28717
$$ -170450 -59850 133116 44388 -57881 -75913 -56801 123399 158575 -166530 -223939 204778
92B04778O2402m24939m5351L20164j4196j77221P2604N9131r0051m65J6478k5021
$$ 204778 267180 -157759 -203110 117054 102858 -74363 -1759 57372 -32679 -33144 -16666 -41687
104d1687J09226M3768k17476o2870K18877K5167j43567Q8063R9054j72798j15577
$$ -41687 67539 111307 -106169 -169039 49838 75005 -68562 19501 118555 -54243 -169820
115a69820J29989J15150J2923l4203j10481m2059J29219L8032j29097J8753J51795
$$ -169820 -39831 75319 88242 54039 -56442 -98501 30718 68750 -60347 -41594 110201
126A10201m8015j59081M0108J28418k9226r5899K861O8975L8773l7370p4551K961
$$ 110201 62186 -96895 -56787 71631 42405 -53494 -50633 18342 57115 19745 -54806 -51845
138e1845P1338n860n7280M3082O9784o6556r9039M4046J08423O845p4897l1457
$$ -51845 19493 13633 -43647 -565 69219 2663 -96376 -52330 56093 62938 -11959 -43416
150d3416L6551J8081k7098P596N1329l91o5124l3952L7329N9393O513n9482k7835
$$ -43416 -6865 11216 -15882 -8286 43043 42652 -22472 -56424 -19095 40298 46811 -12671 -40506
163d0506N5036J5245o7585P07P7690r723p0245J4483M9529j0755k8307j2424J225
$$ -40506 14530 29775 -37810 -37103 40587 30864 -39381 -24898 24631 13876 -14431 -26855 -25630
176b5630M6046L1810o0315m3050N7304J8862n8549K2425P3009l9765p3790K6659
$$ -25630 20416 52226 -8089 -51139 6165 25027 -33522 -11097 61912 22147 -51643 -24984
188b4984M0714n796Q677m762m0875J3317L5876l5057r137O4873j7460q4868L1966
$$ -24984 15730 9934 18611 13849 -27026 -13709 22167 -12890 -22027 42846 25386 -59482 -27516
201b7516P6812l3549m4607K6628M471j3798K7502j400l5536K0377J8065m4041
$$ -27516 49296 15747 -28860 -2232 2239 -11559 15943 14543 -20993 -616 17449 -26592
213b6592J0224O8493k5360p6028K2006N0587j4835o095J8656k6549k5185K5926
$$ -26592 -16368 52125 26765 -49263 -27257 23330 8495 2400 21056 -5493 -30678 -4752
225d752J0786n851K6145p673o0461O448O5119l636l8861J5199N771l2813J0226
$$ -4752 6034 183 26328 18655 -41806 -35358 29761 26125 -12736 2463 8234 -24579 -14353
238a4353L9243n522k0400m619j4999O066M3472J039m6447n310K6489o523n127
$$ -14353 24890 19368 -1032 -5651 -20650 -14584 28888 29927 -16520 -21830 4659 -1864 -6991
251f991K6767K03l6466j0940J9929J7121J1081n045l1579j4198K6086J9541o266
$$ -6991 19776 19979 -16487 -27427 -7498 9623 20704 15659 -15920 -30118 -4032 15509 9243
264I243p38k175k4200p830L1700K3186j3906k2131q836K726J5641J4376l679j3078
$$ 9243 8505 6330 -17870 -25700 6000 29186 15280 -6851 -15687 -12961 2680 17056 13377 299
278B99q370p838L541K4538J5251k2508k9443L102K2798J1804j941q635j2061p091
$$ 299 -8071 -15909 -12368 12170 27421 4913 -24530 -21428 1370 13174 11233 2598 -9463 -16554
292a6554P473J5437R566l677j7950j5295Q913K4286P785j2868j2158m963r98J1329
$$ -16554 -9081 6356 15922 12245 -5705 -21000 -12087 12199 19984 7116 -5042 -10005 -11003 326
306C26J6678J91j8965j5683K931J7307J3465m198j7126r900N076Q760O550M573
$$ 326 17004 17195 -1770 -17453 -14522 2785 16250 12052 -5074 -14974 -9898 -1138 5412 9985
320I985m406j5866p989J1660J7917L727j2157j3808j914J0726J1612K101o078
$$ 9985 5579 -10287 -18276 -6616 11301 15028 2871 -10937 -12851 -2125 9487 11588 5510
333E510q731o405K749J2468R718o788j5175n512Q566R289K180k964o332p867r27
$$ 5510 -3221 -9626 -6877 5591 15309 8521 -6654 -12166 -3600 5689 7869 4905 -1427 -9294 -10221
348a0221J0067R600j439j1330r210L129J1881P011m440q214l518J198M580P997
$$ -10221 -154 9446 8007 -3323 -12533 -9404 2477 9488 5048 -3166 -6684 -5486 -906 7091
362G091K651p922r392O76Q406P220k5p058p586M0O632M876K9l742n616m169M238
$$ 7091 9742 1820 -7572 -6896 1510 8730 8705 1647 -5939 -5899 733 5609 5638 1896 -3720 -7889 -3651
379c651Q982K152q148o983J718N038L896K092l760p269m21O058M716J950j985
$$ -3651 5331 7483 -665 -7648 -5930 -892 3004 5096 1336 -5933 -6354 -296 4420 6370 4385
394D385q748m701Q981R434l111m765j375n928o28J2874N134r452n895j37k706
$$ 4385 -4363 -9064 -83 9351 6240 1475 100 -5828 -6456 6418 11552 2100 -3795 -3932 -6638
409f638O497J1543o483j3824L183O352l704M867P392j2292r279J2121O097n697
$$ -6638 -141 11402 4919 -8905 -5722 630 -3074 1793 9185 -3107 -12386 -265 5832 135
423A35M138r06j4627L505J9524k576j1482M429m309j0934J5108J7396j4297j2489
$$ 135 4273 3367 -11260 -7755 11769 9193 -2289 2140 -2169 -13103 2005 19401 5104 -7385
437g385O115m727k908K0892M775k2770l389Q499p460M779K1508r277k4349P916
$$ -7385 -1270 -5997 -8905 11987 16762 -6008 -9397 -898 -8358 -3579 17929 8652 -15697 -7781
451g781J1809q144O049J1711j8055j0350J9648L141j2745Q764L301j9773M747
$$ -7781 4028 -4116 1933 13644 -4411 -14761 4887 8028 -4717 4047 7348 -12425 -7678
464g678K4222q052j5533Q116l095j1816J9436J6221k1365j2005R306n658M49K4439
$$ -7678 16544 8492 -7041 1075 -2020 -13836 5600 21821 456 -11549 -2243 -7901 -7452 16987
478A6987o7k7373j886J0454o108P936J9583j2325k2076P665P031m211J1937P781
$$ 16987 16920 -10453 -12339 -1885 -7993 -57 19526 7201 -14875 -7210 -179 -4390 7547 15328
492A5328k0011p516J5438K20p054R781n87j4124N790J2611q047o364N636n195
$$ 15328 -4683 -12199 3239 3459 -3595 6186 5599 -8525 -2735 9876 1829 -4535 1101 -4094
506d094l019J5675L944j5878n334L531k118Q998J4035q476j6138p33K182L597
$$ -4094 -7113 8562 12506 -3372 -8706 -5175 -7293 1705 15740 7264 -8874 -9607 -7425 -3828
520c828J3744M998j4612r179J655Q11Q191J2132n880j2718l61J229K35R528K581
$$ -3828 9916 14914 302 -8877 -7222 -6411 1780 13912 8032 -4686 -5047 -3818 -3583 5945 8526
535H526j0280j672N618l896j343O346l859n265Q863L361r245j54K150p943N110
$$ 8526 -1754 -3426 2192 -1704 -3047 3299 -560 -5825 3038 6399 -2846 -3000 -850 -8793 -3683
550c683J5505m078j2525J558k210n719J5878J2866j4471r727N483o130j719K0603
$$ -3683 11822 7744 -4781 -3223 -5433 -11152 4726 17592 3121 -6606 -1123 -7253 -8972 11631
564A1631L584j8731q49N764j0596M526J8635q021j4463J0239Q90j3477R927J1530
$$ 11631 15215 -3516 -4365 1399 -9197 -4671 13964 5943 -8520 1719 2609 -10868 -941 10589
578A0589j5657j612J7072q197j3910J2536K735j3487J1634J4099j6890r218J2722
$$ 10589 -5068 -6680 10392 2195 -11715 821 3556 -9931 1703 15802 -1088 -10306 2416
591B416m559o887J9992N114k2430j525J0141q901K041K1254p842k0456Q701N993
$$ 2416 -2143 -9030 10962 16076 -6354 -7879 2262 -6639 -4598 16656 8814 -11642 -2941 3052
605C052j2506R240J5369j5963j0223J5168k720j1868J3484O347j6879L215J4402
$$ 3052 -9454 -214 15155 -808 -11031 4137 1417 -10451 3033 9380 -7499 -4284 10118
618A0118j1448q152J3490k210r882J4425O344j8445k389J1206n429j011J5724
$$ 10118 -1330 -9482 4008 1798 -8084 6341 12685 -5760 -8149 3057 -2372 -3383 12341
631A2341l821j7899L443P586o459O683J1818j2291j3216Q890L313m890J0187L456
$$ 12341 8520 -9379 -5936 1650 -4809 1874 13692 1401 -11815 -2925 388 -4502 5685 9141
645I141j4791k838J1288k744l278Q492k511r719O641O502p823r09N701n124j506
$$ 9141 -5650 -8488 2800 56 -3222 5270 2759 -6960 -319 6183 -1640 -2549 3152 -1972 -3478
660c478J0039p16r359O24K075k854O380O738q061q289K582J862J445P403J57j0179
$$ -3478 6561 5845 -3514 -2890 -815 -3669 2711 9449 1388 -6901 -4319 -2457 -1012 6391 6548 -3631
676c631l230L610J223L828N469n012q212K004L502M35M440N37q079j856O220J135
$$ -3631 -6861 -3251 -2028 1800 7269 2257 -5955 -3951 -449 -14 4426 4963 -3116 -4972 1248 2383
692B383j461J989l310m290M808M789m004j599N60m196R67Q128k78n940p83r27
$$ 2383 922 2911 -399 -4689 119 4908 904 -695 -135 -4331 -3364 4764 4486 -1454 -2237 -3164
708c164j892O377O016n428o093R56lJ417P160P56q199k159L086K84K414M587m111
$$ -3164 -5056 1321 7337 1909 -4184 -3228 -3231 -1814 5346 6102 -2097 -4256 -1170 -886 1528 6115 2004
725B004o481K080L593j102K870R53o819k553O213K059k854J198j619m504K913
$$ 2004 -4477 -2397 1196 94 2964 3917 -2902 -5455 758 2817 -37 1161 -458 -4962 -2049
740b049O110k396k962Q34k118j179N942K777n056k420J523j166K066M902j348
$$ -2049 4061 1665 -1297 -463 -2581 -3760 2182 4959 -97 -2517 -994 -2160 -94 4808 3460
755C460n556n90J978M6L067K042m769l660K768K044n73J625o07m084p77M184J140
$$ 3460 -2096 -2686 -708 -662 2405 4447 -322 -3982 -1214 830 257 1882 1275 -2809 -3586 598 1738
772A738j110j08j995k001K884L330j405j661n81j001Q82L253Q86k833j523J01
$$ 1738 628 520 -1475 -3476 -592 2738 1333 -328 -909 -1910 -1028 2225 3111 278 -1245 -1144
788a144N27J879J868j981k801J27J463J066R49p96k359j406J314K030Q21q49j914
$$ -1144 -617 1262 3130 1149 -1652 -1525 -62 1004 1953 1157 -1202 -2608 -1294 736 1557 708 -1206
805a206j250Q83K537Q76j253j393q62O4K524J288q75k175n02M78J792J255k79
$$ -1206 -2456 -1573 964 1840 587 -806 -1668 -1604 920 2208 1333 -842 -1344 -866 926 2181 1902
822A902k224j342N83J533J765m27k199j549O12J140J727J13k107k048M65J868
$$ 1902 -322 -1664 -1081 452 2217 1790 -409 -1958 -1346 -206 1521 1634 -473 -2521 -2056 -188
838a88J433L09j423k225n8J667J787N51j249j939o83J612K667M5j689j430j026
$$ -188 1245 1554 131 -2094 -2152 -485 1302 1853 604 -1335 -2018 -406 2261 2306 617 -813 -1839
855a839Q17K635J125j907k248l66O75J722J699j378k438o49J003J203J592j08
$$ -1839 -1022 1613 2738 831 -1417 -1783 -1108 614 2313 935 -1503 -2152 -1149 54 1646 1538
871A538k644j494J306J758J259J60k040k595Q85K949J016k78j007k532o39K976
$$ 1538 -1106 -2600 -1294 464 1723 1883 -157 -2752 -1867 1082 2098 1820 813 -1719 -2358 618
887F18K045p63j510j237j459J553L005J25k159j214j014K89K248J959j642k521
$$ 618 2663 1900 390 -847 -2306 -753 2252 2377 218 -996 -2010 -1721 527 2486 844 -1677
903a677k74K45J830K084j279k355jJ236K53J735K85k615j942K338J256K87Q20
$$ -1677 -1951 -1706 124 2208 929 -1426 -1427 -191 62 1797 2082 -533 -2475 -137 1119 1406 2226
920B226j794l012R92L155j05n9n16l175q87L564J935j741l75q69k574J239L822
$$ 2226 432 -2580 -1588 1567 1462 1403 887 -2288 -3175 389 2324 583 208 -661 -3235 -1996 1826
937A826j73k059K18r33j423L137K538k763j643J817r95m66L401o89m154J588K555
$$ 1826 1653 -406 -188 -1121 -2544 593 3131 368 -1275 542 -453 -919 2482 1793 -2361 -773 1782
954A782k116P61J964l202k951M281J911k848J311K32m850O11N509m79k512J694
$$ 1782 -334 427 2391 -811 -3762 519 2430 -418 893 1125 -3725 -3114 2395 1916 -596 1098
970A098j857l635L869M095l156j126K380k821k110N280J228m754J287K406l938
$$ 1098 -759 -4394 -525 3570 414 -712 1668 -1153 -3263 2017 3245 -1509 -222 2184 -1754
985a754K45M978k695l468L807R61l966J862J931m542l43N740j275l440L308j205
$$ -1754 -1509 3469 774 -2694 1113 2074 -1892 -30 1901 -2641 -2984 2756 1481 -1959 1349 144
1001A44m850L822N095l740j620K998l431k441O061K024m764N67K026m715O40O067
$$ 144 -4706 -884 4211 471 -1149 1849 -1582 -4023 2038 4062 -702 -135 1891 -2824 -2184 3883
1017C883j880l775K961k09m089L053K911m467m45M558k271k883L901m89m354L060
$$ 3883 2003 -1772 1189 980 -3109 -56 2855 -1612 -2057 2501 230 -2653 1248 759 -3595 -535
1033e35L692l648j041K765k876k033O056J044m347R39J060m312J576O076k432
$$ -535 3157 -491 -1532 1233 -1643 -3676 2380 3424 -923 16 1076 -3236 -1660 4416 1984
1048A984l532K544r02l562M168L200m233r59K751k945j040M554l59m227K410J710
$$ 1984 -1548 996 94 -3468 700 3900 -333 -1292 1459 -1486 -2526 2028 1669 -2558 -148 1562
1064A562l399P52L094l232j522M635j80l255K079J71l811K109M931k442k444K076
$$ 1562 -1837 -1085 2009 -1223 -2745 1890 1710 -1545 534 705 -3106 -997 3934 1492 -952 1124
1080A124k026k680M891K887m395N5J341l988R3N953q69m126K018k75l651K972
$$ 1124 -902 -3582 1309 4196 -199 -144 1197 -2791 -2698 3255 2386 -1740 278 3 -3648 -676
1096f76L787l703j361L616k009k170L761P01m563J744L766l345k77K940k653k486
$$ -676 3111 -592 -1953 1663 -346 -2516 1245 1946 -2617 -873 2893 -452 -729 2211 -442 -2928
1112b928M459J626l789O24J513m296M36N422j129l323K089r67l802L466M036l204
$$ -2928 1531 3157 -632 -8 1505 -2791 -2355 3067 1938 -1385 704 -263 -4065 -599 3437 233
1128B33j772K506k406j811M885J106m140Q04K088l195K38M615k410k883L131M43
$$ 233 -1539 967 -1439 -3250 1635 2741 -1399 -595 1493 -1702 -1464 3151 741 -2142 989 1432
1144A432l099J943J986l698k71M434j800k452K778p37l596K480L475k927r05J847
$$ 1432 -1667 276 2262 -1436 -1707 2727 927 -1525 1253 516 -3080 -600 2875 -52 -957 890
1160H90j970j850M492P91l165L94J253l326J099M354j620k516J698K7k500K170
$$ 890 -1080 -2930 1562 2353 -812 -418 835 -2491 -1392 2962 1342 -1174 524 551 -1949 221
1176B21K442l016p37K493j272j497K718j49l108J491J988k062m39J896k040j106
$$ 221 2663 -353 -1090 1403 131 -1366 1352 1203 -1905 -414 1574 -488 -927 969 -1071 -2177
1192b177L051M50k330P00O82k567R38L387j080j864R70k07j826K390J714k186
$$ -2177 874 1324 -1006 -306 376 -2191 -1253 2134 1054 -810 160 -47 -1873 517 2231 45
1208D5o19J358j172o28K462l81j904L87J085j336M67J497j428j108J133M77j226
$$ 45 -574 784 -388 -1016 1446 1065 -839 -452 633 -703 -236 1261 -167 -1275 -142 335 -891
1225h91J144J81j999L74K151n51r17P61o80m99J279J206j510P5J67q61K76J631
$$ -891 253 434 -1565 -1191 960 409 -508 253 -427 -926 353 1559 49 124 291 -570 -294 1337
1243A337j20j856N54qn14J038N06r09r54M85J05p9P57J36j260m54J481k64J36
$$ 1337 1217 -639 -85 -93 -607 431 937 28 -926 -441 -336 -415 342 478 -782 -1236 245 -19 117
1262A17K78p74o31R56R85p70j16L41j142j2J837j06p55j2m19m55R85P86p25q42
$$ 117 395 -379 -1010 -54 931 161 45 386 -756 -768 1069 963 208 196 -223 -678 307 1093 368 -474
1282d74J29l47L6J358%j167m94P10M0L28L48l64q71K67M88R9N29j50q89l49Q10
$$ -474 -345 -692 -656 702 702 -465 -959 -249 -209 119 467 103 -768 -501 -13 86 615 465 -424 -773 37
1303C7P23r6l28j84p85K82R93j65j82l30l98j15R86K8m08l96j2l36M00P11K2q88
$$ 37 760 664 336 152 -633 -351 642 477 295 -35 -433 -548 438 466 58 -338 -350 -686 -286 425 447 -441
1325d41j89K21K10O19K70o40n57M27J8M73L70m32q99J52O71L10j1m02j23o59O80
$$ -441 -630 -409 -199 420 690 50 -507 -80 -62 411 781 349 -550 -398 273 583 572 170 47 -612 68
1346F8N54k31j83k86n02N0O94K51o09P6l19k03Q32L74l92k98N6k80M72O76m68
$$ 68 622 391 208 -78 -580 -530 164 415 -194 -118 -437 -640 192 566 174 -124 -68 -348 124 800 332
1367C32l51j19R8L03L18Q7p01m89K65N01j95L96l08m78l93Q00K49k73K6n83m47
$$ 332 -19 -138 -40 263 581 668 -33 -522 -257 244 49 445 137 -341 -734 66 315 42 68 -515 -962
1388i62R43M21l41l06P2j82j99J106Jn80J07J15m18M52P67o18r27O57j58L0N56
$$ -962 -19 402 61 -245 -173 -355 -554 552 553 -27 80 195 -223 229 996 378 -549 108 -50 -20 536
1409E36m4j107J82N68j40j05O52o07r85N59R26o81K41L81q97m28J075M76q78N04
$$ 536 492 -615 -433 135 -5 -110 542 -65 -1050 -491 435 -246 -5 376 -521 -949 126 602 -276 228
1429B28J64r54L24J123q47l40O45p3n79R32J09j384K25P55l83m6J098q48j198
$$ 228 392 -562 -238 885 38 -302 343 270 -309 623 732 -652 -427 328 -55 -101 997 149 -1049
1448a049Q45P25q87N28M30j468k97J421K07q29J030L4j856P13J537r00m98J130
$$ -1049 -204 521 -366 162 592 -876 -1173 248 455 -374 656 690 -1166 -453 1084 184 -314 816
1466H16n11j195J428K00j162L44Q22j182q4J753r99j397J092P04j312J013N03
$$ 816 305 -890 538 738 -424 -80 742 -440 -524 1229 230 -1167 -75 629 -683 330 833
1483H33j696l09J452k50l18R42m0j865P95J723j058m98J524j178j603K156M83
$$ 833 -863 -1172 280 30 -288 654 614 -1251 -456 1267 209 -289 1235 57 -1546 610 1093
1500A093j593Q33P14j887J09J563l20j187J075m1j522J178J060j578m05J494n41
$$ 1093 -500 333 1047 -840 -731 832 512 -675 400 359 -1163 15 1075 -503 -908 586 45
1517D5r45J596j14k041R23J464j069j16J653j512j446K002O27j367P32R76k153
$$ 45 -900 696 582 -1459 -536 928 -141 -257 1396 -116 -1562 440 1067 -300 432 1408 -745
1534g45l08K207p01j035J688p33j963J297J479j678j61J807j363j055J770J92
$$ -745 -1053 1154 453 -582 1106 373 -1590 -293 1186 -492 -653 1154 -209 -1264 506 698
1550F98j888Q58J368j940M15J745j537r69J612N43j681J208O92k148J19K165j056
$$ 698 -1190 -332 1036 -904 -489 1256 -281 -1250 362 905 -776 432 1124 -1024 -905 1260 204
1567B04q01J621n20k143J533J411j739K60J256j737o59J717j8j395J195R02k139
$$ 204 -597 1024 504 -1639 -106 1305 -434 -174 1082 -655 -1314 403 385 -1010 185 1087 -1052
1584a052J77J866j069j116K092l53j299R88J017j981M02J527j012q38J627p21
$$ -1052 -875 991 -78 -1194 898 545 -754 234 1251 -730 -328 1199 187 -651 976 255
1600B55j350Q05J000j096J85J185j385q21J598K24j503J095K96j665M44J470q66
$$ 255 -1095 -290 710 -386 -201 984 -401 -1222 376 600 -903 192 488 -1177 -733 737 -129
1617a29j56J100o21j428J166R36j170Q0J241j102o76J526k96j481J481L32j292
$$ -129 -285 815 194 -1234 -68 868 -302 -222 1019 -83 -759 767 471 -1010 471 803 -489
1634d89K96J175j666l10J717k10j103R90P7j590N53J356j077k45J293r30j101
$$ -489 -193 982 -684 -994 723 513 -590 400 477 -1113 -560 796 -281 -526 767 -163 -1264
1651a264J442K89n33J10P35j197o8J191k10q57R34j71r53O22P72r86m80R95k20
$$ -1264 178 467 -66 44 779 -418 -486 705 495 -362 572 401 -552 70 842 -144 -624 371 151
1670A51r41R67K56j273L55R98o25k15P51o55p58J006M64q66M49M50j125k27J364
$$ 151 -790 177 433 -840 -485 513 -112 -327 424 -231 -989 17 481 -385 64 514 -611 -838 526
1689E26o7o34P25j28j059N84P20n47l10N90n57k23O51K46o87J89J71p01J90P30
$$ 526 459 -175 550 422 -637 -53 667 120 -190 400 -157 -380 271 517 -170 19 190 -511 -321 409
1709D09n45m75N23K42l62J70L60o87j88Q29j15l04O45k86j012O12P31m07OL53
$$ 409 -136 -611 -88 154 -208 -38 322 -365 -553 276 161 -143 502 216 -796 -184 547 140 146 499
1729D99n03p49R92K50p85L33j14j80K0N78l28n90O77j09k39L27K62o38j41O05
$$ 499 -4 -753 239 489 -296 37 -77 -257 -237 341 13 -577 100 -9 -248 79 341 -297 -438 167
1749A67r5p3M10j72o04M18M69m38j1L77m90m48O95J72l69J97j33o73L54N43m56
$$ 167 72 -1 409 237 -367 51 520 82 71 448 -42 -490 205 377 8 205 72 -601 -247 296 -160
1770a60N2J4j18l22N23K34j91l42L26m7j88N24ml81j29M13k01P8L98l35l01M38
$$ -160 -108 -94 -212 -534 -11 223 32 -310 16 -31 -219 305 301 -80 -209 204 3 81 479 144 -157 281
1792B81j18j56J69N4p35K82N49l89l7O2L86r03M38L31k48K68k39l60K71K78J1
$$ 281 163 7 176 230 -505 -223 326 -63 -100 -38 348 -555 -117 214 -34 234 -5 -365 -94 184 195
1813A95k25j16J31J17j90L95Q1k49j4j76N65k17o1j19k17K27k12n4K14m4k38M6
$$ 195 -30 -146 -15 102 -88 307 388 139 125 -51 514 297 236 117 -100 127 -85 -139 75 31 -207 -161
1835a61K8K14m04M64o26L32M5k9J07K09jl60K02K50j65P6k29K84j17j61K97k13
$$ -161 -133 81 -323 141 -485 -153 -108 -137 -30 179 178 -182 20 270 105 181 -48 236 119 -42 255 42
1857D2k95O3K05J7K59l50j38J71J37m0q6N4l49j39K33K10j95J21j00k40M88P7
$$ 42 -253 -190 15 32 291 -59 -197 -26 111 71 -15 39 -310 -449 -216 -6 -201 -80 -180 -420 68 145
1879A45l02L70k52k32J11O72o6m14n9J17j47p8M30j72k29r1P2j09M61K4k22o6
$$ 145 -157 213 -39 -271 -160 512 446 32 -27 90 -57 -135 295 123 -106 -197 -125 -234 227 251 29 -37
1901c7k5r1n8L25o4l42R2%P0K08m9J30m46L93K39k94K04l02n4j21M43l4n64L36
$$ -37 -62 -153 -211 114 50 -292 -200 -200 -130 78 29 159 -287 106 345 51 255 -47 -101 -222 221 187 -377 -41
1925d1J10k70J33K09l79J01K41j50k30L65K3l52K3L20j42J97P2l71m9L00m3l04
$$ -41 69 -201 -68 141 -238 -137 104 -46 -276 89 112 -240 -217 103 -39 158 230 -141 -190 110 67 -237
1947b37N35k4p30K62L03J77m15L70j75j40J45j72j18J70J56l40k1L77N7q13L28
$$ -237 298 274 -456 -194 109 286 -129 241 66 -74 71 -101 -219 -49 107 -233 -254 123 180 -633 -305
1968c05M47m03L70K30l58j85K25Jl27O68J2m23O2J18k74P7M12j78m13N57j98m75
$$ -305 142 -261 109 339 -19 -204 21 22 -305 363 375 -48 14 132 -142 -65 347 169 -244 313 115 -360
1990c60N39K8k05m69L93K7r2K59l9m90L64J10m84n5M71j42j98M74J01j97J26o1
$$ -360 179 207 2 -467 -74 -47 -139 120 81 -409 -45 65 -419 -474 -3 -145 -343 131 232 35 161 100
2012A00n0j96P02k20p35J48L48k75O45k99m99j56L64J01m57P35J0n63J9M38k63
$$ 100 50 -146 556 336 -399 -251 97 -178 467 168 -331 -487 -123 -22 -479 256 266 -297 -278 160 -103
2033a03n7M24j32m93N73j66m72L10O46n51P5M91m83m86L24J31l91O14K24q21L45
$$ -103 -160 264 132 -361 212 46 -426 -116 530 -21 54 545 62 -424 -100 31 -360 254 478 -343 2
2054BJ55j76q9Q41n24m23J97J13l27L0M88m60k68M72j32MJ99J46l39JN41k98n39
$$ 2 157 -19 -108 733 209 -214 -17 96 -231 -201 287 -173 -441 31 -101 -97 102 248 -91 -90 451 153 -386
2077c86Q11j83m45M19K75p47L62K98l91k04L82j48l85L67K57n45M27J58m82k43
$$ -386 425 242 -203 216 491 -256 106 404 13 -191 191 43 -342 25 282 -263 164 322 -160 -403
2097d03M27k32p6L90K05m51l6M43l01J44K54l51k33O7M92l73L63l0k82k47N25
$$ -403 24 -208 -284 106 311 -140 -176 267 -34 110 364 13 -220 -153 339 -34 329 299 17 -230 295
2118B95k38l16K54K90k92J94p9j29l47M88j4l91L75q4j66k05N08l30o3K86J61
$$ 295 57 -259 -5 285 -7 187 108 -21 -368 120 106 -285 90 6 -160 -365 143 -187 -250 36 197
2139A97m29M46L00q28j3Q67m74k01K46m98K75N46l15k88K62O6j49m73M74o2m7
$$ 197 -232 214 514 -314 -327 540 66 -135 111 -387 -112 434 119 -169 93 159 10 -463 11 -51 -98
2160i8K96k25m01K24L05k10j02M55r5n44N80J73o96M33N25q94J30J16o5J07K69
$$ -98 198 -27 -428 -204 101 -109 -211 244 149 -395 185 358 -338 95 620 -274 -144 -28 -93 14 283
2181B83k2m86K17J31l34L20l3K0m31M31P7l16M12l99J2j81K67Q4k57K33J07k64
$$ 283 261 -225 -8 123 -211 109 76 96 -335 96 173 -143 269 -130 -118 -299 -32 52 -205 28 135 -129
2203a29L0M49l72qK01j49J78j68L03l16j06J81m4l2K74l49j93J21K13l83M00k3
$$ -129 -99 350 -22 -30 171 22 200 32 335 19 -87 94 50 18 292 -57 -250 -129 84 -299 101 78
2225G8j44j0K74m53J91L41l84k59K77K25k53O0K27j45M3J35j23k20R4J3kk4K70
$$ 78 -66 -76 198 -255 -64 277 -107 -366 -89 136 -117 -57 170 25 68 203 80 -140 -46 -33 -35 -59 211
2248B11k51L1Mr2J24J20n4j24m1P6o7j36M67m51K57k17K66j85J68J60j46j5M7
$$ 211 -40 -9 -5 -97 27 147 93 -31 -72 4 -63 -199 268 -183 74 -143 123 -62 106 266 120 105 152
2271A52J30j59k0N5j81j18K11%j32K62j42j25K39J17l28ll7Q8p1q1J76m28L06
$$ 152 282 123 103 158 -23 -141 70 70 -62 200 58 -67 172 289 -39 -42 -79 9 -62 -143 33 -395 -89
2294h9K78k66K5J21j67m6M40k45r4j5K66k46L41k08k00Q9J1j1j0j01K21p8J40
$$ -89 189 -77 -52 69 -98 -144 296 51 -43 -58 208 -38 303 95 -105 -16 -5 -16 -26 -127 94 16 156
2317A56k24P2m8j77L04k96j0K7J80k03J97J38l49M10k83K47j02J36j84k24K83
$$ 156 -68 4 -44 -221 83 -213 -223 -196 -16 -219 -22 116 -233 177 -106 141 39 175 -9 -233 50
2338E0k30J64K7J97j79m9m4L45l86J06J76p7q9O7k41J24l8Q7j12M00m22k6J3K25
$$ 50 -180 -16 11 208 29 -20 -64 281 -105 1 177 100 11 78 -163 -39 -77 10 -102 298 -124 -150 -137 88
2362H8K8j92K99j73j17J25j8k76N79l40R6N3j1l03L02j19k50q6N04k38J11j80
$$ 88 116 -76 223 50 -67 58 40 -236 343 3 99 152 141 -162 140 21 -229 -315 189 -49 62 -118
2384a18J92j31K05k49R7j37Q3K3k13L68R3k41o1rJ57Q0k05M4J2K53l06N0o8K80
$$ -118 74 -57 148 -101 -4 -141 -58 -35 -248 120 213 -28 -89 -98 59 139 -66 -22 -10 243 -63 -13 -81 199
2408A99j54n9K79m47l3M43k54J72m38M17k52J15j33J90q7J2J54j85L11j44k42
$$ 199 45 -14 265 -182 -215 228 -26 146 -292 125 -127 -12 -145 45 -42 -30 124 -61 250 106 -136
2429a36L38j0k18r0P4K29l74N98j48n78K10j44K69k73M33j70j01K43m58K03J92
$$ -136 202 192 -26 -116 -42 187 -187 411 263 -315 -105 -249 20 -253 180 10 -91 152 -306 -103 89
2450H9q9j78K91k75N2j84K78j1J17N6M2j73Rk8j25j53K50L40p27M23K41k41l03
$$ 89 0 -178 113 -162 -110 -294 -16 -27 90 146 188 15 24 -4 -129 -282 -32 308 -419 4 245 4 -299
2473b99L35K15o60K35L59l67l5M12n00J77K50o0k77M43m07J33M3J99q4k03J38
$$ -299 36 251 -409 -174 185 -182 -217 195 -305 -128 122 62 -215 228 -179 -46 -3 196 112 -91 47
2494D7j89J14K34l8m54N28k20j89K14L10k69J2J65l44p8L53J68n29j1N33n19J69
$$ 47 -142 -28 206 168 -286 242 22 -167 47 357 88 100 265 -79 -157 196 364 -165 -176 357 -162 7
2516GL41n8n00P8J82l6j08J78j29p6r5L56j38K2j1l35K19K58J21l67J96l38K89
$$ 7 348 290 -210 -132 50 14 -94 84 -45 -121 -216 140 2 24 13 -322 -103 155 276 -91 105 -233 56
2539E6P0J00l36J55j84j81L3O66k87m08J59L1j53R7M70l27K5R9K2l81J01J81K86
$$ 56 126 226 -110 45 -139 -320 -287 379 92 -316 -157 -126 -279 -182 288 -39 -14 85 107 -274 -173 8 294
2562B94l53K04j19j91K89j89l6j31M41k09J48j41j22r0K83nk69J74Mj79R6K36
$$ 294 -59 145 26 -165 124 -65 -101 -232 209 0 148 7 -115 -205 78 73 -196 -22 -18 -197 -101 135
2584A35l80K0L80k02Q1J19K2j68%r2J13k22K86K1j39J71l33l1L03k42J13N5k58
$$ 135 -245 -225 155 -47 34 153 175 7 7 -85 28 -194 92 113 -26 145 -188 -219 84 -158 -45 10 -248
2607b48J79j40K24l8q0P4L1j65Q6K50n6j64lK31l10K2M09j32l67M46m2k69O7K04
$$ -248 -69 -209 15 -23 -103 -29 2 -163 -77 173 117 -47 -50 181 -129 -107 302 170 -197 249 207 -62 5 209
2631B09M8k73L28n75J80K60m09K35Q9r6L1p2m2R9o1J01k40j96L26L0j45J10j38
$$ 209 257 -16 312 -263 -83 177 -232 3 92 -4 27 -45 -87 12 -49 52 -188 -384 -58 -28 -173 -63 -201
2654b01j30L99J68j86j36Q6K6n1NM31m24p5L73l77J37J31j07k31K10pp6q8K56
$$ -201 -331 68 236 50 -86 0 26 -25 -20 411 -13 -88 285 -92 45 176 69 -162 48 41 -35 -123 133
2677A33k43j64P3M22k85J08L92m10O8N0k44m9L53k30k3l5M7r9R4J76k41K43J6
$$ 133 -110 -274 -201 221 -64 44 436 26 94 144 -100 -149 204 -26 -49 -84 -37 -136 -42 134 -107 136 152
2700A52O8k63L4J18n8m87P77l94L07k79R1J2r2P9k86J36L83n0l06J17l7q0J06
$$ 152 220 -43 -9 109 51 -436 341 -53 254 -25 66 78 -14 65 -221 -85 298 248 -58 59 22 -58 48
2723D8MM3Q6l54m8L19j55K88l22J25L0K9k02J95N3k58L61m86L22j54O0J8j58M46
$$ 48 52 95 181 -173 -221 98 -57 231 -91 34 64 93 -109 86 139 -119 242 -244 78 -76 -16 2 -156 290
2747B90j87J9k49K12l3m20K05K4J07J83j25j55L67k71LR3L9l21K93j91K03J56
$$ 290 103 122 -127 85 52 -368 -163 -139 -32 151 26 -129 238 -33 -30 63 102 -219 74 -117 86 242
2769B42j70k41n9K07J53k20O3k43K86K3j55j18J17K94k72L4n9l6L27J0K6q4K16
$$ 242 72 -169 -228 -21 132 -88 -25 -268 18 41 -114 -232 -115 179 -93 -59 -118 -154 173 183 209 125 341
2792C41j36k45J16j6m8j19j00K14K38l41J45p9j6r6K24k44J9J00n4N7Q6j44J88
$$ 341 205 -40 76 60 12 -107 -207 7 245 -96 49 -30 -46 -142 82 -162 -143 -43 -97 -40 46 -98 90
2815I0l31L64Qj86N1K16j46j50N1J48l00p9J26J40L4j59J79L9j36Q9l3M04l87
$$ 90 -241 123 131 -55 -4 212 66 -84 -33 115 -185 -264 -138 2 36 -123 56 95 -41 48 15 419 32
2838C2m1n1j87J71K14J2l17K80n4j31K48j3k48K15l26p4K50k0J57n8J0JO0n4K9
$$ 32 -9 -60 -247 -76 138 150 -167 113 59 -72 176 163 -85 130 -196 -270 -20 -40 117 59 69 70 130 76 105
2863A05j40P8Q4M6K9k98K59J35q7j90M3o7Q6jj05l6P2j14j0L43n51J95M06j74
$$ 105 -35 43 127 173 202 -96 163 298 211 21 64 -3 83 82 -23 -59 13 -101 -111 232 -319 -124 282 108
2887A08p5P4j21j38K48J55j28k20K1J4J31j80l5J91N6j14K31l24n5J12j44L46
$$ 108 33 107 -14 -152 96 251 123 -97 -76 -62 69 -111 -146 45 101 -13 218 -106 -161 -49 -193 153
2909A53Rl3L3j95J32p2j82M25k47o3K98k60k14J60M9K37j17j36l5j7R2J07j94
$$ 153 162 129 162 -33 99 27 -155 270 23 -40 258 -2 -216 -56 -7 230 113 -23 -58 -75 17 124 -70
2932g0R6j62m1M64j58j20j11j0J13R2k62L21j90r7K34k01J2K69k46J87j67O3n0
$$ -70 26 -136 -177 287 129 9 -102 -112 1 93 -169 152 -38 -135 99 -102 -90 179 -67 120 -47 16 -34
2955c4n1J06O1J30m89M33j40p3O1k65L56j26Rj28J01L63m59M81l60j6K88j57L4
$$ -34 -85 21 82 212 -277 156 16 -57 4 -261 95 -31 -22 -150 -49 314 -145 336 -24 -40 248 91 125
2978A25k73K77k6m82L09j17K43J01K15m50J08r3J78j70J68n3k25J87j44ml17N00
$$ 125 -148 129 103 -379 -70 -187 56 157 372 -78 30 -63 115 -55 113 60 -165 22 -122 -126 -443 57
3000E7k50K61j53L1m1K31J19k39j94K70j59N2K71k42Q7j06l4l4M5J27J9l2J99
$$ 57 -193 68 -85 -54 -95 136 255 16 -178 92 -67 -15 256 14 101 -5 -39 -73 -28 99 118 86 285
3023B85m21J17n6J59k42L08j55P0k02R5k4n0L03k57O0J0p7k9L1K06j98m0K1J48
$$ 285 -136 -19 -75 84 -158 150 -5 65 -137 -42 -66 -116 187 -70 -10 0 -77 -106 -75 131 -67 -107 -86 62
3047F2j05rk46J02K73K65j34n44L75po2K1r0L09m91J78m0K00P6rk41p4M11k45
$$ 62 -43 -52 -298 -196 77 342 208 -336 39 32 -30 -9 -99 210 -281 -103 -143 57 133 124 -117 -191 220 -25
3071b5q2K22k9N2j11J09j68K33k25J66j56r6K59j86L00j9k13j83L01k27J7L21
$$ -25 -107 115 86 138 27 136 -32 201 -24 142 -14 -110 149 -37 263 244 31 -152 149 -78 -61 260
3093B60j13k49J60j28J10K5k06j0K7J32m3j76J03O8J53j79q1K44m9N8l6m3j62
$$ 260 147 -102 58 -70 40 65 -141 -151 -124 8 -35 -211 -108 -40 113 -66 -147 97 48 106 70 27 -135
3116a35R1k43M58j27P2k06q9J08j35J31J10j20k4j45K35K71m81K63r0N11m13j49
$$ -135 -44 -287 171 44 116 -90 -179 -71 -206 -75 35 -85 -109 -254 -19 252 -229 34 -56 455 42 -107
3138a07o9K83m1j82mN1R7M7N6p4l80L91j02K14k57o0j5N2r8K56N7k06j5k6J52
$$ -107 -176 107 66 -116 -120 -69 28 75 131 57 -323 68 -34 180 -77 -137 -152 -100 -198 58 115 -91 -106 -132 20
3163B0L3j73J75l3r3M09k34o8k09K05L8j74L2Q6j44J30j09J57l5o2r0O4Q6J68
$$ 20 53 -120 55 22 -71 338 104 36 -173 32 70 -104 -72 14 -130 0 -109 48 13 -49 -139 -75 11 179
3187A79p2j52K22j98J50j43q4J30k09J8J25N0j47R6N9j05L98k67j33j49J48L1
$$ 179 107 -45 177 -21 129 -14 -98 32 -177 -159 -34 16 -131 -35 24 -81 317 50 -83 -232 -84 -53
3209e3K95l27O1n2R7JJ56j39p6J40m6J56j90J25k39L0P9M0k16J6K64j00o1l3P6
$$ -53 242 -85 -24 -76 21 22 178 39 -37 103 57 213 23 148 -91 -61 18 58 -158 -142 122 22 -39 -72 4
3234DO7j1j99J64l2J94k90L98k90j4L65m22rK32n8l6j44J44M0j73J94J18k81M9
$$ 4 71 60 -139 25 -7 187 -103 295 5 -9 356 -66 -75 157 99 63 -81 63 103 -70 124 242 -39 10
3258A0j00j20M23k67k8Q6j75J19O9n1L1O0J1mR1o5J17j16p6j56K30j50k7M1K40
$$ 10 -90 -210 213 -54 -82 4 -171 -52 17 -34 -3 57 68 64 155 90 207 91 15 -141 89 -61 -88 -47 193
3283A93k14N4o7J07j42k57N27l25M02l12J7k56K30K22l61N2j43K25K40k28K62
$$ 193 -21 33 -34 73 -69 -326 201 -124 278 -34 -17 -273 -43 179 -182 -130 -273 -48 192 -36 226
3304B26j73j80M59l67q5J45Q7j14p0P7k05L59j34k35M04k08JQ5l7K6k87L09k36
$$ 226 53 -127 332 -35 -120 25 112 -2 -72 5 -200 159 25 -210 194 -14 -13 72 35 61 -226 83 -153
3327a53J9KJ59j20K69j18k65K53j68J95l1Q7j46M2k23R9J50j57J39qm1J0j66J73
$$ -153 -134 -132 27 -93 176 58 -207 46 -122 73 42 129 -17 25 -198 -99 51 -106 33 25 -16 -6 -172 1
3351Aj03K70j08j12J69l57J41K10j90nN4K0n0K0q1K50j65J15l2J22j41o0o2J74
$$ 1 -102 168 60 -52 117 -240 -99 111 -79 -84 -30 -10 -60 -40 -121 129 -36 79 47 169 28 -32 -94 80
3375H0j83N3OJ61j72r9J75n4n0O2l11L24k7o8K33j74K35j89J3j07J90o9k71L44
$$ 80 -103 -50 -44 117 -55 -154 21 -33 -83 -21 -332 -8 -35 -103 130 -44 191 2 15 -92 98 29 -242 102
3399A02q1k82J47J38j99K25q0K35m33L92K0j24j87N1P8K29k57n4L54j80l18K74
$$ 102 21 -261 -114 24 -175 50 -30 205 -228 164 184 60 -127 -76 2 231 -26 -80 274 94 -224 50
3421E0j5j16P3L3j63o8J90J02K91k5n46K82r9j49J13J28K17k75o0J0J14k26K59
$$ 50 35 -81 -8 25 -138 -206 -16 86 377 352 -194 88 -11 -160 -47 81 298 23 -37 -27 87 -139 120
3444A20r3J26n2l82M35j55J23j2J0p4O0j50j91J87j33L62m34L36j99K46l6J91
$$ 120 27 153 101 -281 154 -1 122 110 120 46 106 -44 -235 -48 -181 181 -253 83 -116 130 94 285
3466B85l90J59k3J35k17O1k49N07m18L21k94p6M29l97L32k95K31j01J46l52J65
$$ 285 -105 54 31 166 -51 10 -239 268 -150 171 -123 -199 230 -167 165 -130 101 0 146 -206 -41
3487d1Q9L0j90J37J32k35r0K56j08O2Q1j71r1J84p5K55j65n6K90l46o6P1M5k54
$$ -41 48 78 -112 25 157 -78 -168 88 -20 42 123 -48 -139 45 -30 225 60 4 294 -52 -118 -47 -2 -256
3511b56L39o6j89J99m1j02r3J36r7K01J94l48M0L6j6pJ43P1j82q2P5j19N8O4J08
$$ -256 83 17 -172 27 -14 -116 -209 -73 -170 31 225 -123 -83 -47 -63 -70 73 144 -38 -120 -45 -164 -106 -42 66
3536F6r8J32l4j52K98k80j21J87J53j21o0l9l8lJ35l4j34M1J09L16p1k09J29J9
$$ 66 -32 100 66 -86 212 -68 -189 -2 151 30 -30 -69 -107 -110 25 -9 -143 -102 7 323 252 43 172 191
3560A91m4k03L5N9O9j6j8q0j7l1J20k47J98j52K53O3k64J93J43j47j38p9J80r2
$$ 191 147 -56 -21 38 107 91 73 -7 -24 -55 65 -182 16 -136 117 180 -84 109 252 105 -33 -112 68 -24
3584b4n8JN9j28M87l95p6K35k2q7N3J40j44n3K2j48M06l12kR5o2P3o0N4J2P1l29
$$ -24 -82 -81 -22 -150 337 -58 -134 101 79 -8 45 185 41 -12 10 -138 268 -44 -46 49 -13 60 0 54 66 137 -192
3611a92J35J48p2j47K36J4l5k35K90p2K7l43M55j21j45J96m7j40J55J01r7k70
$$ -192 -57 91 19 -128 108 122 87 -148 142 70 97 -246 209 88 -57 139 92 -48 107 208 111 -159
3633a59J75K93k57l3kJ33k44j44M22l9j28m3J03k56J78l0O3m4j35R6k8M5%J58
$$ -159 16 309 52 19 17 150 -94 -238 184 145 17 -26 77 -179 -1 -31 32 -12 -147 -51 -79 -34 -34 124
3657A24l09L45m3j79J87n7k7R4j70m4M2J14j09O0j86K80k14M6J32j35J14q9L8
$$ 124 -185 160 117 -62 125 68 41 135 -35 -79 -37 77 -32 28 -158 122 -92 -46 86 -49 65 -24 14
3680A4L5r3j62J08K00j18l9P9k72J45L3J84k79K97k09R4J05j14N7j17J16R9k92
$$ 14 49 -44 -206 -98 102 -16 -55 24 -248 -103 -70 114 -165 132 -77 17 122 8 65 -52 64 163 -129
3703a29Q6P1J3l2j27K33l28L54L5j18k86L05J59j45k54Q5K19n20K83m0m5K40J07
$$ -129 -43 28 41 9 -118 115 -213 141 176 58 -228 77 236 91 -163 -78 141 -379 -96 -136 -181 59 166
3726A66j81P6o9k6J11j42N5j15J7K78r5k64K97O1m00M45m88L82p6Q8k1j76L7N9
$$ 166 -15 61 -8 -34 77 -65 -10 -125 -108 170 75 -189 108 169 -231 214 -274 108 32 120 99 -77 -40 19
3750A9O5k22O4L27l49J48J88l97K49p5q3r8M5K8R3M5l29L36L4k0k15J73k7q5J72
$$ 19 84 -138 -74 253 -96 52 240 -157 92 17 -66 -164 -119 -91 2 47 -282 54 88 68 -147 26 -1 -86 86
3775H6k2n9J42q5j60J38P1k05P0rl4Pr7P7rN1m0J62J26k60o6J18j6Rj62J27R8
$$ 86 64 5 147 62 -98 40 111 -94 -24 -33 -67 -60 -157 -80 -89 -38 -78 84 210 -50 -116 2 -14 -5 -167 -40 58
3802E8j29j49J87J60j71J27l47L71o9J45k33O5K9j5J28j68j0PK33l61J18R0j66
$$ 58 -71 -220 -33 127 -44 83 -264 107 38 183 -50 15 44 29 157 -11 -21 -14 219 -142 -24 66 -100
3825a00J91J44m44J01K62k02J63k28M3J29m8q9J5j12L39k93j42K71l8k10L60k29
$$ -100 91 235 -209 -108 154 -48 115 -113 -70 59 11 -78 -63 -175 164 -129 -271 0 -38 -248 112 -117
3847a17J37k2j44L11j24Q9n8jJ36j33j73K85j77oj5J74j31rk45J00p2P6L57k09
$$ -117 20 -2 -146 165 41 130 72 71 207 74 -99 186 9 3 -12 162 31 22 -223 -123 -195 -119 238 29
3871B9L5k8%l9Q7L1k57J33k30K03n5K79j86l11K79o7J47k46L39m71M27p1j16Q0
$$ 29 64 36 36 -3 84 115 -142 -9 -239 -36 -91 188 2 -309 -30 -97 50 -196 143 -328 99 28 -88 -8
3895hp6O2m9K69l16J93j15J59k10J98o5j26R1q6N6P5j42q4L57j38K0j06J38lM
$$ -8 -84 -22 -71 198 -118 75 -40 119 -91 107 42 -84 7 -79 -23 52 -90 -174 183 45 65 -41 97 94 98
3920I8K44m44J13q1K20j67O3n5n9P2p1K26k13j39O0J35j2j9Oj40K74n5j86J03
$$ 98 342 -102 11 -70 150 -17 46 -9 -68 4 -67 159 -54 -193 -133 2 -10 -29 -23 -163 111 56 -130 -27
3944b7J42p0J06j10N3o2j61K15o4J7R9k20J33p4M6j39J71p7L4n0o4K63k75K19
$$ -27 115 45 151 41 94 32 -129 86 22 39 138 -82 51 -23 23 -116 55 -22 12 -38 -102 161 -114 105
3968A05k30J14j33K9j87K46L80l61j12N9K23j11l8k07L70m5q4j70L93j50k4k57
$$ 105 -125 -11 -144 -115 -302 -56 324 -37 -149 -90 133 22 -16 -223 147 102 18 -152 241 91 67 -190
3990a90n1P7L38q1j23N4j32K88q4J11l34k2K53k68K84k05J73l5J2Mj04J4q0K74
$$ -190 -241 -164 174 93 -30 24 -108 180 96 207 -127 -149 104 -164 120 -85 88 53 65 69 -35 -21 -101 173
4014A73j64j09L92k71J10O9q1k92R3j66K54r8J42r4l4q9L58j48Oj05o4P2J92j73
$$ 173 9 -100 292 21 131 200 119 -173 -80 -246 8 -90 52 -42 -76 -165 193 45 51 -54 -118 -46 146 -27
4038b7qJ53N2k59J26pJ06K0j68J84j57j18J69J87n18M04j64j64K08k39M88k05
$$ -27 -35 118 170 -89 37 30 136 156 -12 172 15 -103 66 253 -265 139 -25 -189 19 -220 268 63
4060F3l03J7J01j31K84p4J72J44j47m02L44K24q9k81K50N3k55qNl9J19K6R3o8
$$ 63 -240 -223 -122 -253 31 -43 129 273 126 -276 68 292 203 -78 172 225 -30 -38 -33 -72 47 73 166 98
4084I8m0Q7q1j08n0j38QjM02l8k90L00j76J96k8o9m2O6J07N4j78j89J8J66J33
$$ 98 58 145 64 -44 -94 -232 -224 -225 177 139 -151 149 -27 169 141 72 30 96 203 257 79 -110 -92 74 207
4109B07j97j55n5J0M05j36O6k33J10j19J83p2J92k56M6p7MJ16J28j49k31J29J50
$$ 207 10 -145 -200 -190 215 79 145 -88 22 -97 86 14 206 -50 -4 -81 -77 39 167 18 -213 -84 66
4132F6j42P9J67k13O2O1n0M1p3j78J58M0j19l2J82L10k64L4J2k21r2K13O8n1k35
$$ 66 -76 3 170 -43 19 80 30 71 -2 -180 -22 18 -101 -133 49 359 95 129 141 -80 -172 41 109 58 -177
4157a77Q5R6l4J74n8k11J5L53k12j11Q9j92q4K58Q8j00O2O6NJ94l42j9K7K45q2
$$ -177 -92 4 -30 144 86 -125 -110 243 31 -80 9 -183 -267 -9 79 -21 41 107 112 306 -36 -55 -28 217 135
4182A35k96J21L41m76N5P3p4L29n0k04J12o4n2P1Q6j44R3M2j81RN9p0j07KN8K35
$$ 135 -161 -40 301 -175 -120 -47 -121 208 158 -46 66 2 -50 21 107 -37 56 98 -83 -74 -15 -85 -192 -190 -132 103
4208A03o9O1l2l01K49J00k09Q1j00O1P3j20j17J14O7J26j18K25o6n1j10%M6J07
$$ 103 34 95 63 -238 11 111 -98 -17 -117 -56 17 -103 -220 -106 -39 87 -31 194 128 77 -33 -33 13 120
4232A20J11j8j83K88j34k51P1o8m8M7j5J17j84N8J23j6N7K6j71Q3J26K2j61J25
$$ 120 231 213 30 318 184 -67 4 -64 -112 -65 -80 37 -147 -89 34 18 75 101 -70 13 139 161 0 125
4256A25j54K6k11L04Q9j89o8j23O9K60j12j6j87J68Lk00J56j46J80k5K84m62L56
$$ 125 -29 -3 -214 90 179 -10 -78 -201 -132 128 16 0 -187 -19 -16 -216 -60 -206 -26 -51 233 -229 127
4279A27o4j84O1l5J63J9p1j67L99j92J1P8j51L79l59N6m15M66j78J01r0j7j32
$$ 127 63 -121 -60 -95 68 87 16 -151 248 56 67 145 -6 373 14 70 -345 121 -57 44 -46 -63 -195
4302a95O7P0K63j41j41Q5J39r1r4l7J39j46j39L9lm0J11J28j31j74K99j77J63
$$ -195 -128 -58 205 64 -77 8 147 56 -38 -75 64 -82 -221 -182 -185 -225 -114 14 -117 -291 8 -169 -6
4325fQ4N4k0j56L6k06%Q4J15J45j10N3j65R2j20K09J54l61J94P9r3J29j07j36
$$ -6 78 132 112 -44 -8 -214 -214 -130 -15 130 20 73 -92 0 -120 89 243 -118 76 155 62 191 84 -52
4349e2K22j29L3q2J20K13q2k33j97K81j29J93l07R1p5J66J1m01M41o1O5oO1k60
$$ -52 170 41 74 -8 112 325 243 10 -187 94 -35 158 -149 -58 -133 33 44 -357 84 23 88 82 143 -117
4373a17J90j00j78K70j32q6Q0r3mN0Q3K3J09o1K1m7R7J0J33p4p2j9p3m7R5j7q0
$$ -117 73 -27 -205 65 -67 -153 -73 -166 -170 -120 -37 -14 95 34 55 8 105 115 248 174 102 83 10 -37 58 41 -39
4400c9nj38J83OJ2O8K37l67Q6j23L5J10j42J29j66K80k27j90L14N2l50L41j21
$$ -39 -44 -182 1 7 19 87 324 -43 43 -80 -45 65 -77 52 -114 166 -61 -251 63 115 -235 106 -15
4423a5k21J44M3J0K32l08R4Q7j98K26j21J71k8j51Q5JJ47l4k70R4J1K25k35j03
$$ -15 -236 -92 -49 -39 193 -115 -21 66 -132 94 -27 144 116 -35 50 51 198 164 -106 -12 -1 224 -11 -114
4447a14J72k17K2P1K79l63L49Nk69P8r5q3K93k28J02KJ32j04lk5l4k21K61M1k13
$$ -114 58 -159 -137 -66 213 -150 199 204 -65 13 -82 -165 128 -100 2 4 136 32 29 4 -30 -251 10 51 -162
4472a62J94J36j52k8j97K55m1o2J88K1k17P8N8k03o7R1K36q6j3J36n17N67j39
$$ -162 32 168 16 -12 -209 46 5 -57 131 152 -65 13 71 -132 -199 -108 128 42 29 165 -352 215 76
4495G6k6j15J5L18j67j40NP2j00j86K68J03k71L80m57L43j23m2j30J36j30M07
$$ 76 50 -65 -50 268 101 -39 -34 38 -62 -248 20 123 -148 232 -225 118 -5 -47 -177 -41 -171 236
4517B36n42M04j82J95k98L61r4k40J66m4j18J3K01n3J24j67l26M52p1P4j12k57
$$ 236 -306 98 -84 111 -187 174 80 -160 6 -38 -156 -143 58 5 129 -38 -364 88 17 91 -21 -278
4539b78K23p8J81Qj66K93j54O2R3j08L3j64K25j19q7J18j43j85N6J02Qj09J63
$$ -278 -55 -133 48 56 -110 183 29 91 184 76 109 -55 170 51 -36 82 -61 -246 -190 -88 -80 -189 -26
4562b6J50p3l82N79l4k67K91k91J35j75K44L3k15j45p0J13o7j08L31J56o2j38
$$ -26 124 51 -331 248 214 -53 238 -53 82 -93 151 184 -31 -176 -246 -133 -200 -308 23 179 117 -21
4584b1j27j09K26m8M5j60J88J02k01R5J65O4j80j98k2K79l19R3P5K22n2OJ0J1
$$ -21 -148 -257 -31 -79 -34 -194 -6 96 -105 -10 155 219 39 -159 -181 98 -221 -128 -53 169 117 123 133 144
4608A44k11l44M69J26Lk79J61l1k41N10k11k48K79j03j96J83K9J03j90J84NMj21
$$ 144 -67 -411 58 184 187 -92 69 38 -203 307 96 -152 127 24 -172 11 40 143 -47 137 142 146 25
4631B5k65L67K5o8N1r8P1j67J11J62j83p7j16R8j9K17j71q8pJ71j82M50l11j04
$$ 25 -240 127 152 84 135 37 108 -59 52 214 31 -46 -162 -64 -83 134 -37 -125 -132 39 -143 307 -4 -108
4655a08n8J88q6K60j98K3J00p3n5r6J5L33k26j44Q1lk2J8L67k70P1k76K65k73
$$ -108 -166 22 -64 196 -2 21 121 48 -7 -103 -88 245 19 -125 -44 -47 -69 -51 316 46 117 -159 106 -167
4679a67L29j25j05m7K21J36j63o3K76k95j77J87J67k94J29J4M3k60M1K58j23M6
$$ -167 162 37 -68 -115 106 242 79 16 292 -3 -180 7 174 -120 9 23 66 -194 -153 105 -18 28
4701B8K3K4J44k08j90R3r7K24J46j35J19k33K7j32L66k40J29o6j6L2j14L23l65
$$ 28 51 75 219 11 -179 -86 -183 41 187 52 171 -62 -35 -167 199 -41 88 22 6 38 -76 247 -118
4724a18L7rj75R1J19M3j59K00k21K87j49k0O2J58k24j05K30j15nL31m31J51L7
$$ -118 -81 -90 -265 -174 -55 -12 -171 29 -192 95 -54 -74 -12 146 -78 -183 47 -68 -73 258 -173 -22 15
4747A5P3j31J10o4J29Lj97L11l12K91l47j02K37q5n9J07J18qm7q3K5j33J63p0
$$ 15 88 -43 67 3 132 135 -62 249 -63 228 -119 -221 16 -69 -128 -21 97 89 42 -41 -16 -149 14 -56
4771e6L4K96l48Q8j3JJ32l59M13p1k92K22n1N4P6j68J01p0J21L5k00o5M3MJ20
$$ -56 -22 274 -74 14 1 2 134 -225 188 117 -175 47 -4 50 126 -42 59 -11 110 145 -55 -120 -77 -73 47
4796D7j54K68Mk39N3J99j79j17L65k26j64J96K4m07L33M27p22K63j3Q0o6rkJ23
$$ 47 -107 161 165 -74 -21 178 -1 -118 247 21 -143 53 77 -330 3 430 -292 -29 -42 38 -28 -37 -39 84
4820H4J3j35J64l4o7Jn1J37K4l06J32J31j54R1j03L39m27K04M7o8K35k39J00m2
$$ 84 97 -38 126 92 25 26 -25 112 136 -170 -38 93 -61 30 -73 266 -161 43 90 22 257 18 118 76
4844G6p5L2j75J64K53k81j11L9p1Q8JM8J71l27L83m29M21l40J96o9K0O6m76M95
$$ 76 1 33 -142 22 275 -6 -117 -78 -149 -61 -60 -12 159 -168 215 -214 207 -133 63 -6 14 80 -396 99
4868I9q1j7j72L55o4j92L37P8k04j79j92K32m0J76k30Q1J49o8j7q6j8J51L2j83
$$ 99 18 1 -171 184 120 -72 265 343 139 -40 -232 0 -40 136 -94 -13 136 68 51 -35 -53 98 130 -53
4892e3j6l5J92j75J06N4j03J19l6Q0J97l68J58k76P8L82m86L72k03o1J16J8j18
$$ -53 -69 -104 88 -87 19 73 -30 89 53 133 330 -38 120 -156 -78 304 -182 190 -13 -74 42 60 -58
4915e8l6P5j50K58k17Q2J10K79m21K17n9q4L9j7j91K49j4k40K16J39q4J3r6n7
$$ -58 -94 -19 -169 89 -128 -46 64 343 -78 139 80 -4 35 18 -173 76 62 -178 38 177 93 106 10 -47
4939d7L0j2J67j30J17j11J10j22K60j81K4k67J89j45J02N8l14M93k50k01K84k18
$$ -47 -17 -29 138 8 125 14 124 2 262 81 105 -162 27 -118 -16 42 -272 221 -29 -230 54 -164
4961a64J42j80O9J71k35K54j83M6K98k14q8L4K7k3k4J73k0o8P3k95J48MK03k6
$$ -164 -22 -202 -133 38 -197 57 -126 -80 218 4 -84 -50 -23 -46 -70 103 83 15 88 -207 -59 -55 148 122
4985A22j31J94l85O5J82l73L54l61K39oJ8K05k61K56r8j44L15j13k2p5Q5J04p9
$$ 122 -9 185 -200 -135 47 -326 28 -333 -94 -100 -82 123 -138 118 20 -124 191 78 56 -19 66 170 91
5008I1q1Nj17K26p7M3k17N0K13l34J56o9j89M01J21j73m5Q4r9L26k89o3J41l46
$$ 91 10 15 -102 124 47 90 -127 -77 136 -198 -42 -111 -300 101 222 49 4 88 -11 315 26 -37 104 -242
5032b42L64j27Q5J02j46O9J9j23p7J67J8l02K08k98K43J23q4J26j63oL1p8J81
$$ -242 122 -5 80 182 36 105 124 1 -76 91 109 -193 15 -283 -40 83 -1 125 -38 -44 -13 -91 90
5055I0j16J00N1J03j03j34qR4k04O2N3j69O5O9L1JO1o6N9N8j8m6o2K47k87k11
$$ 90 -26 74 125 228 125 -9 -17 77 -127 -65 -12 -181 -116 -47 -16 -15 46 -20 39 97 79 33 -29 218 -69 -280
5081b80P4M36l27P9J1p7K97Nj33n5J77O4j68r7N0q4j61J87j38M53l32J11k70N5
$$ -280 -206 230 -97 -18 -7 -84 213 218 85 30 207 271 103 6 56 -28 -189 -2 -140 313 -19 92 -178 -123
5105a23k1L6J54N1j10N9J7j43J41l07K53j21k3L29r5j05J38j03m21J90J69o5R3
$$ -123 -144 -108 46 97 -13 46 63 -80 61 -246 7 -114 -137 192 97 -8 130 27 -394 -204 -35 -100 -7
5128gj41J54mO8j28j11J68j02j41M06l04L58j46p8m5K8p7P5L6J11j51L1N0J77
$$ -7 -148 6 2 70 -58 -169 -1 -103 -244 162 -142 216 70 -8 -53 -25 -102 -27 9 120 -31 0 50 227
5152B27L2j06J60m58L96k87J52k50K9j12K67j89K13j85k3J00j0j24J61M0k14M33
$$ 227 259 153 313 -145 251 -36 116 -134 -105 -217 50 -139 74 -111 -134 -34 -44 -168 -7 33 -181 252
5174B52k33J51j63o6J10N1k6j38Q6j25O1q0j27L53j76j49J40J22K6M9J79j13n9
$$ 252 19 170 7 -59 51 102 76 -62 24 -101 -40 -120 -247 106 -70 -219 -79 43 69 118 297 184 125
5197A25j32r9n4Q2K03k1k0j0k3n4J6q4Q8p7J15K04k64J06O2k14pJ41j24L26m86
$$ 125 -7 -106 -160 -78 125 104 84 74 51 -3 13 -71 17 -60 55 259 -5 101 163 -51 -58 83 -41 285 -201
5222b01J00J69j05r0Mj71J77r4P8M27k73J2n7K28k73J78k97K22j69N6K79j8j71
$$ -201 -101 68 -37 -127 -123 -294 -117 -211 -133 294 21 33 -24 204 -69 109 -188 34 -135 -79 200 182 11
5245A1n3L0j20J96m6K41j58j8j92j0K22j84R6j02L22l85Q4j52J64L47k57l69L35
$$ 11 -42 -12 -132 64 18 259 101 83 -109 -119 103 -81 15 -87 235 -150 -66 -218 -54 293 36 -333 2
5268BN7o6qnj22K49j13N0J79k10K29k72K37m72K56M1mj02J80n2L6M9m89N57j26
$$ 2 59 -7 -15 -20 -142 107 -6 44 223 13 242 -30 207 -265 -9 32 28 -74 106 54 90 139 -350 207 81
5293H1o9Q3kj55J14j11q6J54J85Q0l81J69Kj80Q2O2j04OK86l91K00o4J45j52J40
$$ 81 12 95 93 -62 52 -59 -145 9 194 274 -107 62 64 -116 -34 28 -76 -70 216 -175 25 -39 106 -46 94
5318I4ql54K48N3j33J90L1L3j9j45J22j90K05J98m35J43K6Q2q3O6K17l18j91M77
$$ 94 86 -268 -20 33 -100 90 121 154 135 -10 112 -78 127 325 -110 33 59 141 58 124 341 23 -168 309
5342C09j39k58L63m25r9J04L63q5j50m1J10j44Q5J48k09n3J45j45O0l5M4J5L25
$$ 309 170 -88 275 -150 -249 -145 218 133 -17 -58 52 -92 -7 141 -68 -121 24 -121 -61 -96 -52 -37 288
5365B88k23k04K60m5j40o2j02J96j0kn2J80k35L0K92k88R0%K18M4K5k13j25n0
$$ 288 65 -139 121 76 -64 -126 -228 -32 -42 -44 -96 84 -151 -121 171 -117 -27 -27 191 235 260 47 -78 -128
5389a28J12rj64MJ82K0k8k7j82L59r1j17K14l6l1R2j75J95l01L38j72j34J43j21
$$ -128 -16 -25 -189 -185 -3 17 -11 -38 -220 139 48 -69 145 109 78 170 -5 190 -111 227 55 -79 64 -57
5413e7j61K13N4J14o4j67J8q8Q2q9J85J07j6q2O6j3K6l24L71j59j10K70l05K07
$$ -57 -218 -5 49 163 99 -68 -50 -138 -56 -145 40 147 131 49 115 102 128 -196 175 16 -94 176 -129 78
5437G8N1r4n6P5j91j0K41l6KP1q9j48K72j67j67R6J75qm0m4Q0k66K48Qj71J64
$$ 78 129 35 -21 54 -137 -147 94 58 60 131 42 -106 166 -1 -168 -72 103 95 55 11 91 -175 73 81 -90 74
5463G4j3o8q8PL5J8k09R8J55k2j57K39j59K07j00l2j39J62k06K24K46k04J31m71
$$ 74 61 -7 -95 -88 -53 -35 -244 -146 9 -13 -170 69 -90 117 17 -15 -154 8 -198 26 272 68 199 -272
5487b72L32Mn7o8K18p5J45o1J56o28L03R1O2l9j95o0K50n4k71K78m39L10k60K27
$$ -272 60 64 7 -61 157 82 227 166 322 -306 -3 88 150 111 -84 -144 106 52 -219 59 -380 -70 -330 -103
5511a03J26l48M91j39j82J08o2J98j87J72k8N7o4k43J91J66P0k44q1L6j40J84
$$ -103 23 -325 166 27 -155 -47 -109 89 -98 74 46 103 39 -204 -13 153 223 -21 -102 -66 -206 -22
5533b2J12l05J39MP1N7J9j19J02l2J63j04jj83L46l05M0J43j47M8J24R2k51j33
$$ -22 90 -215 -76 -72 -1 56 75 -44 58 26 189 85 84 -99 247 -58 -18 125 -22 26 150 242 -9 -142
5557a42K13l1P0j83k23K01J7N2P4L8q9L7MO1m1j00K00j55k0J52OJ35k83k0p8q4
$$ -142 71 40 110 -73 -296 -95 -78 -26 48 86 -3 34 38 99 58 -42 158 3 -17 135 141 276 -7 -27 -105 -189
5583a89J16j39K69p8p9n8K40p9j71P9rJ84P5l04m9K72o4N1J77j17o8j30J56r0
$$ -189 -73 -212 57 -21 -100 -158 82 3 -168 -89 -98 86 161 -143 -192 80 16 67 244 127 59 -71 85 -5
5607ej06L42k41L8rL3k89J62R5j61J40J0n3J91l26L6J08j7J85j64j36J93Q2j12
$$ -5 -111 231 -10 28 19 52 -237 -75 20 -141 -1 9 -44 147 -179 -143 -35 -52 133 -31 -167 26 108 -4
5631dN0j8k3J54k04k6k6J68k45jj57N25k47m7J27k0M2j13J62j86J78k91J95J9
$$ -4 46 28 5 159 -45 -71 -97 71 -174 -175 -332 193 -54 -101 26 6 48 -65 97 -89 89 -202 -7 12
5655A2PP7q9O6q0J45k51o3K61k64J89m8J11K3j92P8J09PJ3k5K2j15j02L21k43
$$ 12 19 96 7 73 -7 138 -113 -176 85 -179 10 -38 73 96 -96 -18 91 98 111 86 108 -7 -109 212 -31
5680c1P7j14M28n41P7J79J13r5k15K32l39J10L3j9K35o5N2l8L2r5k07J87M6J6
$$ -31 46 -68 360 -181 -104 75 188 93 -122 110 -229 -119 -86 -105 130 65 117 79 111 16 -191 -4 42 58
5704E8o0M6j31O2j51K45k32q4L16o1J7J16o1j63O8m7J90j9l58J64K79k48j24J79
$$ 58 -2 44 -87 -25 -176 69 -163 -247 69 8 25 141 80 -83 -15 -62 128 109 -249 -85 194 -54 -178 1
5728Aj17k20N06j85J32r6K0L9l1k23K37p1q7LK15L8k65J25J05j38R4q7J59j63
$$ 1 -116 -336 170 -15 117 21 41 80 49 -174 63 -8 -95 -92 123 161 -104 21 126 -12 82 -5 154 -9
5752iJ14k03K05J08m70L30J48p2q5j5k87Rj9L41m0l1j47J39L26l59r5L26k70J34
$$ -9 105 -98 107 215 -255 75 223 151 66 51 -236 -227 -246 95 55 24 -123 16 342 -17 -112 214 -56 78
5776G8L4q0j02K5q1K4q5j88K07K66p8mr0Q5N8n1qj20J22J64k13P1j4n8j07K57
$$ 78 112 32 -70 -45 -126 -102 -187 -375 -168 98 20 16 -74 11 69 18 10 -110 12 176 -37 34 20 -38 -145 112
5802A12j12K04j54l03L82l49K35Nm3k4N3N9k19K93p4J8o1J62m9j46L7k96K56J5
$$ 112 0 204 50 -253 129 -220 15 20 -23 -47 6 65 -154 139 65 83 22 184 135 -11 26 -270 -14 1
5826Ak14M07J16m74J66j59M33l53J68j11N7o3o9Q9p1K27k68nj5K01J7K50m35Q2
$$ 1 -213 194 310 -164 2 -157 276 -77 91 -20 37 -26 -95 -6 -77 150 -118 -123 -138 63 80 330 -105 -23
5850b3K21k37KMj9j20L76k81n2K72k97J22J69j69lJ22K2R0j30j25O3j5j70Q7k7
$$ -23 198 -39 -37 -33 -52 -172 204 -77 -129 143 -154 -32 137 -32 -35 87 109 199 69 -56 7 -8 -178 -91 -118
5875a18J3J82Qk9j52J97k69k00J55M4J29Q9P0J88k52O2J8m9k86L05j14K57k74
$$ -118 -105 77 85 56 -96 101 -168 -368 -213 -169 -40 49 119 307 55 117 135 86 -200 105 -9 248 -26
5898b6k37J60j85K57K01j06o0k57L12O0l37J91J20J64l64L8M83o33L60l01K43
$$ -26 -263 -103 -288 -31 170 64 4 -253 59 119 -218 -27 93 257 -107 -69 414 -219 141 -160 83
5919H3kP8p2j12J45j49J83q8j92J21K3n3N8l54L46J50J20r2k52j30J37J86o4J71
$$ 83 81 159 87 -25 120 -29 154 66 -126 -5 18 -35 23 -331 15 165 285 193 -59 -189 -52 134 70 241
5943B41L2l74R1J30j1O0m27L17K4k20J62j42N9r3L03q0M8l5J06k64K21j6l80K95
$$ 241 273 -101 -10 120 109 169 -258 59 83 -137 25 -117 -58 -151 152 72 120 85 191 -73 148 132 -248 47
5967D7k64J9L33J09k73kJ34J80l72RJ71r2J88l03j39J44Q3R3j05k70L17K01k93
$$ 47 -217 -198 135 244 -29 -31 103 283 -89 -80 91 -1 187 -116 -255 -111 -28 65 -40 -310 7 208 -85
5990h5O9K08p4k86M20l53lP5m6L05k22Q6k8m3K8r1J15L0L2Nj48J5j79J70K08k67
$$ -85 -16 192 118 -168 252 -101 -104 -29 -75 230 8 94 66 23 51 -40 75 105 137 142 -6 9 -170 0 208 -59
6016e9MK41j23l5j77M96l69K0J30k35k60K50j11o0L74j68J27R9j93o1O9P3K6k8
$$ -59 -55 186 63 28 -149 347 -22 -2 128 -107 -367 -117 -228 -288 86 -82 45 144 -49 -110 -41 32 58 30
6040C0l61L47j08J31q9j1K27m64K86l0k2N8J15j05k12p6L92j31J37l10K92Ql0
$$ 30 -331 16 -92 39 -50 -61 166 -298 -12 -42 -64 -6 109 4 -208 -284 108 -23 114 -196 96 104 74
6063G4j93j88L33l4J80l70K54J07j52R1l02M94m09O6LN4q2j14N1K10J19j68R5
$$ 74 -119 -307 26 -8 172 -198 56 163 11 102 -200 294 -115 -49 -46 8 -74 -188 -137 73 192 24 119
6086A19o2j12j95J79PpN4K19l54J11j60J67L47m55K47n8K07l35J41k92L06l4p5
$$ 119 57 -55 -250 -71 -64 -71 -17 202 -152 -41 -201 -34 313 -142 105 47 254 -81 60 -232 74 40 -35
6109c5J17l13J64J7J91q0l4J59n02K41j04L43k56L4J34R8%j84L5R3J17k07m7k43
$$ -35 82 -231 -67 -50 141 61 27 186 -316 -75 -179 164 -92 -58 76 174 174 -10 25 118 235 28 -19 -262
6133b62L52J06R4k30J82k18n1O9j78J77L2K15l32J8K37j43K5M7q5k38J21m5J79
$$ -262 90 196 290 60 242 24 -27 42 -136 41 73 288 -44 -26 211 68 93 140 55 -183 -62 -107 72
6156G2l7J9m9n0j19K85k51J78Kj23K40K7j89M1j10J70k8k10J40K39k92q7J57L9
$$ 72 35 54 5 -45 -164 121 -130 48 50 -73 167 194 5 46 -64 106 78 -132 8 247 -45 -132 25 64
6180F4j1k5R2O4j18l0N5l65K79jJ03l7j35k8K77k08j79J81j04m0J3n5j07o4O75
$$ 64 53 28 120 184 66 36 91 -274 5 4 107 70 -65 -93 184 -24 -203 -22 -126 -166 -153 -208 -315 -379 296
6205B96m49M5J38n7K9J9k54J22j0Q7Q4J90q5l53J4K2K82p5n9l9J79N2l27K27j87
$$ 296 -153 -108 30 -27 2 21 -233 -111 -121 -34 50 240 155 -198 -184 -162 120 45 -14 -53 126 178 -149 78 -109
6230a09q3O4J66k06K39j4j27N7J4J03m6N5%j76j55K59j15K2j45K03K84j36k92
$$ -109 -192 -128 38 -168 71 57 -70 -13 1 104 58 113 113 -63 -218 41 -74 -52 -197 6 290 154 -138
6253a38J23j10K52q6o9J03j34p4J07J87n6j10l6K5M6J39l5M7j45j02K5J74k06
$$ -138 -15 -125 127 41 -28 75 -59 -133 -26 161 105 -5 -41 -16 30 169 134 181 36 -66 -41 133 -73
6276g3M9L4m3j00J94n8j45l9K09j18J53qP1K13p2l73q0L01j06J48j07O0k68R3
$$ -73 -24 10 -33 -133 61 3 -142 -181 28 -90 63 55 126 339 267 -106 -186 115 9 157 50 110 -158 -65
6300f5M14n9k54K21m0j80j53J08n0J3j33m3L94m36M84m46J6K93k34jJ84j11J27
$$ -65 349 290 36 257 217 37 -116 -8 -58 -45 -178 -221 173 -263 221 -225 -209 84 -150 -151 33 -78 49
6323D9J1k4N0j84k4M7L02N3k74j15L50m00K32k02J44j00J29p3j35J32q4J20Kn2
$$ 49 60 36 86 -98 -122 -75 227 280 6 -109 241 -159 73 -129 15 -85 44 -29 -164 -32 -116 4 6 -46
6347d6q3K66j92m4o4Q7L23j57K30k83j44M15o01K38j64m9J28J01R5O6j34j74j52
$$ -46 -129 137 -55 -99 -163 -76 247 90 320 37 -107 308 -293 -55 -219 -268 -140 -39 56 122 -12 -186 -338
6370c38M41Kj89j45L9K19J29j76O6K07n3j8q2j31r8J71l44K49m5J07L69n18j4
$$ -338 103 105 -84 -229 -190 29 158 -18 48 255 202 184 102 -29 -127 44 -300 -51 -96 11 380 -138 -152
6393a52J30J20J5j81J8j05kJ41K19k70K76k2L6m55K90o2p6j06K31l6j48J92k98
$$ -152 -22 98 113 -68 -50 -155 -157 -16 203 -67 209 187 223 -232 58 -4 -80 -186 45 9 -139 53 -245
6416b45L12j66K59l66J64M1k37J93k4P7K98j82l65J66J54m8L1j23k7J90l0q7q
$$ -245 67 -99 160 -206 -42 -1 -238 -45 -69 8 306 124 -241 -75 79 31 62 -61 -88 102 72 -15 -23
6439b3n4M5J47j21l37L70K63j00k51P5k89L20j57K92k53O5M0J1m6q0j2K09m9j44
$$ -23 -77 -32 115 -6 -343 27 290 190 -61 14 -275 45 -112 180 -73 -8 32 43 -3 -83 -95 114 65 -79
6463g9M56k46J71j91K6k55J22R6j79l1Q0J7J39o3P9k56j09K92k81M00l20K98j72
$$ -79 377 131 302 111 137 -118 4 100 -79 -110 -30 -13 126 63 142 -114 -223 69 -212 188 -132 166 -6
6486fp6R9P6k82P2L97m10J54M8j21j26K3N0J89N4l81J19lj06N67m00Q2J31l69
$$ -6 -82 17 93 -189 -117 280 -130 24 72 -49 -175 -152 -102 87 141 -240 -121 -124 -230 337 -63 19 150 -219
6510b19O6N9K37j43pl0j41M76m78J33L3MM6j63J60P4k1J62r3l42M6L55j34qk56
$$ -219 -153 -94 143 0 -7 -37 -178 298 -180 -47 -14 -10 36 -127 33 107 86 248 155 -187 -141 214 80 72 -184
6535a84K63n3L9J76k43R8k48L53j23M7k84j07L72k22J24J60k21j20K11O8j26m2
$$ -184 79 26 65 241 -2 96 -152 201 78 125 -159 -266 106 -116 8 168 -53 -173 38 106 -20 -62
6557f2j63L37j19j46l3J81K40l40j63L76L9j23K30l04L7k9L99m70J23J87j43j32
$$ -62 -225 112 -7 -153 -186 -5 235 -105 -268 108 147 24 254 -50 -13 -42 357 -113 10 197 54 -78
6579g8J55l7k5k03K12n5n8J13k2l8N1N1qPO0J02l25m9J05K85l7l85K11k28J29
$$ -78 77 40 15 -188 24 -31 -89 24 2 -36 15 66 58 65 125 227 -98 -147 -42 243 206 -179 32 -196 -67
6604f7L26k23k9j54K80j17q8Q8J53Lj6j38m4J12k36K31j53L18k65l6p7J41j05
$$ -67 259 36 7 -147 133 16 -72 16 169 172 156 18 -26 86 -150 81 -72 246 -19 -55 -132 9 -96
6627i6m4M91k72J12j59j51L15m73J91K59j4r2j71M61n04K48m4J52j86j48Q7L9
$$ -96 -140 351 79 191 32 -119 196 -277 -86 173 159 67 -104 357 -147 101 57 209 23 -125 -38 1
6649Aj12N4P8o6L3l2j8RN8k59J33K13j85J08j09J05l8J24j33N8O0O3j35j04J15
$$ 1 -111 -57 21 -45 -12 -44 -62 -53 5 -254 -121 92 -93 15 -94 11 -27 97 -36 22 82 145 10 -94 21
6674B1J6J70k76J67J38m54J53N7j8J33k55K80l56J30J74p5J12k05J48k0n5k7P2
$$ 21 37 207 -69 98 236 -218 -65 -8 -26 107 -148 132 -224 -94 80 5 117 -88 60 40 -15 -42 30
6697C0m3K09j53k39M28L4j20j01j94k47K67K17l12M93l90N0Pl16L99n3JK03k4
$$ 30 -13 196 43 -196 232 266 146 45 -149 -396 -129 88 -224 269 -121 -71 -64 -380 19 -34 -33 170 146
6720A46j76J29k10J24j00J07Rk8J98j39P2J70l36J41mK03l40M6K59l12K98m6p8
$$ 146 -30 99 -111 13 -87 20 29 1 199 60 132 302 -34 107 103 306 -34 12 271 -41 257 211 133
6743A33j65r6J83j46K21l62K42J17n8J84n37L77j76J37j15Q4L3j17J05J51j95
$$ 133 -32 -128 55 -91 130 -232 10 127 69 253 -284 93 -83 54 -61 23 56 -61 44 195 0
6764@j45J4J7L4J23P9j55N4J38m6n1n0j52P1K38j59J66j80J51j5l33J22K34k92
$$ 0 -145 -131 -114 -80 43 122 -33 21 159 113 62 12 -140 -69 169 10 176 -4 147 132 -201 -79 155 -137
6788a37M8R7N6j2j73j3M8K5o5R1J84j4J71o6j80Nj48R4K1J30l61M13l53n3K58
$$ -137 -89 8 64 52 -121 -134 -86 -61 -126 -35 149 135 306 240 60 65 -83 11 32 162 -199 214 -139 -192 66
6813F6j99M3l9K47k05K34K2j78l3K2n5J20P2l7p3J38q6J3j69P6k86L66K50Mm15
$$ 66 -133 -90 -129 118 -87 147 169 -9 -42 -20 -75 45 117 80 7 145 59 72 -97 -21 -307 59 309 313 -102
6838a02J14j1q2QpJ85j83J76L9p1l2Q5o2r2Q0Kj04N8j6M2j78K29j10j65K90P7
$$ -102 12 1 -81 -73 -80 105 -78 98 137 66 34 119 57 -35 45 47 -57 1 -15 27 -151 78 -32 -197 93 170
6864A70j14j58K5J31k7j8j33J2J87j52J06q9j27J06K06l44J36J36M2k22J62l3
$$ 170 56 -102 -77 54 27 9 -124 -112 75 -77 29 -60 -187 -81 125 -219 -83 53 95 -127 35 2
6886BK2j34P2lk11J55m2J97j21K58l58j7J91J58k46J89K10n49K02J28j44j26l1
$$ 2 24 -110 -38 -41 -252 -97 -139 58 -63 195 -163 -180 11 169 -77 112 322 -227 -25 103 -41 -167 -198
6909a98K44q7J34R2k25Qp6q6L33l97L52o6k2J45k21j05M67m25K4J71o7p2J55l3
$$ -198 46 -41 93 185 -40 -32 -108 -194 139 -258 94 28 6 151 -70 -175 292 -133 -109 62 -5 -77 78 45
6933D5o9o0N9Q7n7o4o8J44j14k36K01O0P8N6j0j70m1J21J15j84J14K31k22N7p7
$$ 45 -24 -84 -25 62 5 -59 -127 17 -97 -333 -132 -72 6 62 52 -118 -159 -38 77 -107 7 238 16 73 -4
6958dj71J31J22o8M7j23K2L00k48m5m0Q6k4O2l23O1m4K29l7j87L60l2o9o6J80
$$ -4 -175 -44 78 10 57 -66 -44 256 8 -37 -77 9 -15 47 -276 -215 -259 -30 -67 -254 106 74 5 -61 119
6983A19j64Q1p5j65L66j40j23K42o6k9l8J16l96R5L87k59jL62n71J79J85J81m12
$$ 119 -45 36 -39 -204 162 22 -101 141 75 46 8 124 -272 -177 210 -49 -50 312 -259 -80 105 286 -126
7006a26J55M4R8L5n16J91j89N39pr9j76J58r4k9J29L3k35J20P5o4J22j36k5o1
$$ -126 29 73 171 206 -310 -119 -308 231 224 125 -51 107 13 -16 113 146 -89 31 106 42 164 28 3 -58
7030e8j45K77k10L14J0j52j60J90K30j37r8K0j67o0J46Q0M5k62K58k1q9L04m64
$$ -58 -203 74 -136 178 188 36 -124 66 296 159 61 81 -86 -146 0 80 125 -137 121 100 11 315 -149
7053a49J20K43j71q0k59M08K9j86O0j79K62j50j59K91M8j06J49l39R0J95l02K32
$$ -149 -29 214 43 -37 -296 112 141 -45 15 -164 98 -52 -211 80 128 22 171 -168 -78 117 -185 47
7075D7k09J85L8n2j24K42j17L03l16j40J71l20J33N6J27j45K25j92J93o9j87J02
$$ 47 -162 23 61 9 -115 127 10 313 -3 -143 28 -292 -159 -103 24 -121 104 -88 105 36 -151 -49
7097d9j35Q6n7L61k69j18J56J73j1j64j4M2j24qQ0K42m32L51r6m1j17N2Lk1K57
$$ -49 -184 -98 -155 206 -63 -181 -25 148 137 -27 -41 1 -123 -131 -51 191 -241 110 14 -27 -144 -92 -89 -110 147
7122A47r7K7o6j6k4o7J20J62j40l10L83J39k29q1L7pJ73L6j58K02r7j20j7K53
$$ 147 50 77 11 -5 -29 -96 24 186 46 -264 119 258 29 -52 -15 -22 151 187 29 231 134 14 -3 250
7146B50k34O0JNPj37K21j69j68J93n2L2J00k49J89N5p2M2j9o7O3k34J17R2m6L10
$$ 250 16 76 77 82 89 -48 173 4 -164 29 -23 9 109 -140 49 104 32 74 55 -12 51 -183 -66 26 -20 290
7172B90l96J93k0j32Q2K7j98J20J93j35J8j55M7J7K95m09K55L3k01K20j75j30
$$ 290 -106 87 67 -65 17 44 -154 -34 159 24 42 -113 -66 -49 246 -163 92 125 -76 144 -31 -161
7194a61J04j50M38j19k5j15p9J27M%m3qk7J19l81L29j1j84K02O3J78n1j82k57
$$ -161 -57 -207 231 112 87 -28 -107 20 24 24 -19 -27 -54 65 -316 13 2 -182 20 83 261 210 28 -229
7218b29J19K75j2qp6m2P1J28k24K9k7J62j8l22J68M9P9k46R0R5M0j63k7m6J68
$$ -229 -110 165 153 145 69 27 98 226 2 31 4 166 148 -174 -6 43 122 -124 -34 61 101 -62 -89 -135 33
7243C3Q2k43K03o6o3K8n7M13k02K0k56j7K7p2J94n6n1L92n31M8L78k57J74j04
$$ 33 115 -128 75 9 -54 -26 -83 330 128 148 -108 -125 -98 -170 24 -32 -83 309 -222 -174 204 -53 121 17
7267A7kr8J52Pp1l4p5J5K90k71L9l9K7N7l5J4J59j78K0L10j25j04PJ31j93p8m8
$$ 17 15 -83 69 76 5 -29 -104 -89 201 -70 -31 -70 -43 14 -21 -7 152 -26 -6 304 179 75 82 213 20 -58 -106
7294a06J7K12k61K58n5k06K84l29Q2N1J94q3j45LR5o2J45j09n1M4o4K8l8q9M01
$$ -106 -89 123 -138 120 65 -141 143 -186 -104 -53 141 58 -87 -84 11 -51 94 -15 -66 -22 -86 -58 -96 -185 216
7319B16j46O1P7p7j87j5p3R4n7J11J03q4j94K93k04K11k49p7J70J13o5j69L0k4
$$ 216 70 131 208 131 -56 -71 -144 -50 -107 4 107 23 -171 122 -82 129 -120 -197 -27 86 21 -148 -118 -142
7343a42Q2j00K68j15o8j04J72qkQ0l9P3j3K7l98J44K52L5N0k01PJ05k01K12J27
$$ -142 -60 -160 108 -7 -75 -179 -7 -15 -17 63 24 97 84 111 -287 -143 109 144 194 -7 0 105 -96 116 243
7368B43k01p2l9N5M8J41l85K48j82K4j41M26k53O3o2J1K07j14J05l60L05j26n
$$ 243 42 -30 -69 -14 34 175 -210 38 -144 -120 -261 165 -88 -25 -87 -76 131 17 122 -238 67 -59 -64
7391f4Rj50J27K06k15M15m41L14j52Q6Jj82o3k0K56K55j81m32K39o4K26k17J04
$$ -64 -55 -205 -78 128 -87 328 -113 201 49 135 136 -46 -109 -129 127 382 201 -231 8 -56 170 -47 57
7414E7J81l43K63k76J26K02j13N3l23K09m4J7j01m7K94j38m3q0l5J92j14J88j01
$$ 57 238 -105 158 -118 8 210 97 150 -173 36 -8 9 -92 -139 155 17 -26 -106 -141 51 -63 125 24
7437B4Q5m33L37j18j0j5N8O5j38L03k44mJ40j95R6k0J41l46J91J44J38k62Q0l6
$$ 24 109 -324 13 -105 -115 -130 -72 -7 -145 158 -86 -90 50 -145 -49 -69 72 -274 -83 61 199 -63 17 -19
7461a9O7K28k37m0o4L95k91K9j5j4J05R5j3j43j88o0J94J20r8r6j65n6J20K67
$$ -19 48 276 39 -1 -65 330 39 68 53 39 144 239 226 83 -105 -165 29 149 51 -45 -210 -266 -146 121
7485A21j77M8Rk49J37K70l10l8K81J63k53J33j03j11M5N5p2%K56n45M78k8k09
$$ 121 -56 -8 1 -248 -111 159 -151 -189 92 255 2 135 32 -79 -34 21 -51 -51 205 -340 138 110 -99
7508i9J61o3K71o3j51j43J0o5Q5Qj35L35l20J70J41o4j52J53j62J63p3j17J21
$$ -99 62 -1 270 207 56 -87 -77 -142 -57 -49 -184 151 -169 1 142 78 -74 79 -83 80 7 -110 11
7531A1n0J15p2lq2L4J56j03N9k35L20N5m33L89N3k50J89j82O5K3k68Q4J50j3J02
$$ 11 -39 76 4 1 -81 -47 109 6 65 -170 150 205 -228 161 214 -36 153 -29 36 59 -209 -125 25 12 114
7556A14k64J63l2M3j49J62p1K96m0j00j16k2k38J29J35J28j66K0l74L05Ql7M6
$$ 114 -150 13 -19 24 -125 37 -34 262 222 122 6 -16 -254 -125 10 138 -28 -8 -382 -77 -69 -106 -60
7579f0J5J06l57L21j88Q3K38K6k06q2M7J38J01q9P9O6k25K2J2j72J30O7j99L12
$$ -60 -45 61 -296 25 -163 -80 158 184 -22 -104 -57 81 182 93 172 238 13 35 47 -125 5 72 -127 185
7603A85j46q2o4mq2L2n7K89J87k25K62j34l34J35P1l1J28l85K12J9p3rj1J65o
$$ 185 39 -43 -107 -111 -193 -161 -218 71 258 33 295 161 -173 -38 33 2 130 -255 -43 -24 -97 -106 -117 48 42
7628D2l9j62J83J0K8mn0k6L0j82N22l71Q6p9j08L6j17J72L3J13j96J64j62L5J29
$$ 42 3 -159 24 34 62 58 8 -18 12 -170 352 -19 67 -12 -120 -84 -201 -29 4 117 -79 85 -77 -42 87
7653H7m6j82M32j68p7k06J00q5J85%J63j76l7J59n2O0m07L39p0j06K65k41J16
$$ 87 41 -141 291 123 46 -160 -60 -145 40 40 203 27 -10 149 97 157 -250 89 19 -87 178 -63 53
7676E3l32L45j00J27j14J41k97m4j17K62K69j87J17J38l9j65k02J37J36j15k23
$$ 53 -279 66 -34 93 -21 120 -177 -221 -338 -76 193 6 123 261 222 57 -145 -8 128 13 -210
7697b10r2M94p6j91P5P0p0j99M74k48l7K11l04K51k2k1k1J23m71N13K2l82J80
$$ -210 -302 192 116 -75 0 70 0 -199 275 27 -10 201 -103 148 126 105 84 207 -264 249 271 -111 69
7720F9j31P9M8j59L47k01l8o4J9m1J70K5j09j2k6J24j22K8J9L3l3j79J38J81n4
$$ 69 -62 17 65 -94 253 52 14 -50 -31 -72 98 123 14 2 -24 100 -22 6 25 58 25 -154 -16 165 111
7745A11k08J25K15l77kK63j0j53P9j63J73m6J13p8o7M1K2J49j77N8o7j98J06K57
$$ 111 -97 28 243 -134 -136 127 117 -36 43 -120 53 7 120 42 -25 16 38 187 10 68 1 -197 -91 166
7769A66k91m1J49N2m4J02j36J00J1k9k71K55k2k07J68L14m71R4M21l37P1N4j47
$$ 166 -125 -166 -17 35 -9 93 -43 57 68 39 -232 23 1 -206 -38 276 -195 -101 320 -17 54 108 -39
7792c9K3K06Qj74p9R8K53k72P2o8PL0K08k16j32L36j08k49J68J9j05R6j13O5k67
$$ -39 -16 190 198 24 -55 43 296 24 96 28 35 65 273 57 -75 261 153 -96 72 91 -14 82 -31 34 -233
7817b33K01o9K49K38o32K20j19K70j11N7J33l03K80l57N5J62k30J26M4K86m64
$$ -233 -32 -101 148 386 -246 -26 -145 125 14 71 204 -99 181 -176 -121 41 -189 -63 -19 267 -197
7838a97K66o5Q2l73L74k24K54k15J94K71l00n4p8J58k05K3J26L5m4k1j64J39M6
$$ -197 69 4 86 -287 87 -137 117 -98 96 367 67 13 -65 93 -112 -89 37 72 28 7 -157 -18 28
7861B8Q9r4j58M3J02k29M59j75j61K43l49J43Q0q3J05j44K84j22m01L67j26O1
$$ 28 117 23 -135 -92 10 -219 240 65 -96 147 -202 -59 21 -62 43 -101 183 61 -340 27 -99 -38
7883c8O5O5l28oJ21J22o1j7P2L9j99K66q5j67J1L66j05j54j12j62K96K19j89j32
$$ -38 27 92 -236 -242 -121 1 -60 -77 -5 34 -165 101 16 -151 -140 226 121 -33 -145 -307 -11 208 19 -113
7907a13KL81k26N1l25K40J6k61k01K40J60Nk35K83j77J8J71O6j25J69q0j12N6
$$ -113 -111 270 44 95 -230 10 26 -235 -436 -196 -36 -31 -266 17 -160 -142 29 95 -30 139 59 -53 3
7930Cq9J27N2Kj04p0K73k18j47L74j28J14k34j63K33jQ3r2R6k75N8J97J19k02
$$ 3 -86 41 93 95 -9 -79 194 -24 -171 203 75 189 -45 -208 25 24 107 15 111 -164 -106 91 210 8
7954Hm4M8L4O1l7m0J7k15J96k42M32j52%m1N7j17J23k2m1j12k52K08M08k62n7
$$ 8 -36 12 46 107 70 30 47 -168 28 -214 218 66 66 25 82 -35 88 66 25 -87 -339 -131 277 15 -42
7979d2K49k4j98l4K50q3j03J9J00Q5l67J58j19mK7J27o8P4J04Jk38K9m1k80N52
$$ -42 207 183 -15 -49 201 118 15 34 134 219 -148 10 -109 -113 -86 41 -27 47 151 152 -86 -57 -98 -378 174
8004A74Ql14R2j19N30m22n8m8M7O9m3J1J75q9K58k04r6J19k16J47n8n4Q6J39k28
$$ 174 182 -132 -40 -159 371 -51 -109 -157 -110 -41 -84 -73 102 13 271 67 -29 90 -126 21 -37 -91 -5 134 -94
8029i4o6J25j00J96k7j9j79QL99n1p1j59O4q4k2o1M6J83J66m70L66k2j69L0P1
$$ -94 -160 -35 -135 61 34 15 -164 -156 243 192 121 -38 26 -58 -80 -141 -95 88 254 -216 150 128 -41 -11 60
8054F0mK3j00k26J59K71o5k11Q5J11j24R8j16pM0J8J58k49J10Q6k50L42q3j67
$$ 60 56 79 -21 -247 -88 183 118 -93 -8 103 -21 77 -39 -46 -6 12 170 -79 31 117 -133 209 126 -41
8078d1K01n1j21J57l69K55Pj48K11kl79L66J14l37J97r4J0p3Qj38L65Q9k04L78
$$ -41 160 109 -12 145 -224 31 38 -110 101 99 -280 86 200 -137 60 -34 -24 -97 -89 -227 138 227 23 401
8102D01m57p5K86rk0k45M17l19J44N1j96K9K5P3Q4l38L63k28K73m17J14J25n7
$$ 401 -56 -131 155 146 126 -119 298 -21 123 174 -22 7 32 105 189 -149 214 -14 259 -158 -44 81 24
8125B4Q0r9L88k57RK3j48J17k1j79K78k29J11o2Q4k83k3K33k2l62O45l48J68o1
$$ 24 104 5 393 136 145 168 20 137 116 -63 215 -14 97 35 119 -164 -187 46 24 -338 307 -41 127 66
8149F6n7j15J35j88n3N9j8l7L81r7l56M53j94JJ4qj13K75o2r4l73L03J03L1j73
$$ 66 9 -106 29 -159 -212 -153 -171 -208 173 76 -280 173 -21 -20 -6 -14 -127 148 86 -8 -381 -78 25 56 -117
8174a17J39m0K12J5j51k7r9K62j4k20K25l60K74n6o3q9K90
$$ -117 22 -18 194 209 58 31 -68 194 180 -40 185 -175 99 43 -20 -109 181
8191A81
$$ Imaginary data points
##PAGE= N=2
##DATA TABLE= (X++(I..I)), XYDATA
0@%%%%%%%%%qJ6j6K4l2M0m8N6p2Q8j04J27j52J78k15K54k96L45l99M60n29O09
$$ 0 0 0 0 0 0 0 0 0 0 -8 8 -8 16 -16 24 -24 32 -40 48 -56 71 -81 97 -118 136 -160 185 -214 246 -283 326
31C26o94P88q98J013j138J282j440J611j798K002k227K474k741L032l352L702
$$ 326 -368 420 -478 535 -603 679 -761 850 -948 1054 -1173 1301 -1440 1592 -1760 1942
47A942m085M503m959N462o019O634p317Q079q935R907j1018J2301j3804J5593
$$ 1942 -2143 2360 -2599 2863 -3156 3478 -3839 4240 -4695 5212 -5806 6495 -7309 8284
61H284j7768K0475k3952K8609l5196M5304o2941J02356l46483J18795O42305l88468
$$ 8284 -9484 10991 -12961 15648 -19548 25756 -37185 65171 -281312 -162517 479788 91320
73I1320k81581J09112J30134n9306j0188r9823J23152K42841j61894l71196K23774
$$ 91320 -190261 -81149 48985 -10321 -20509 -120332 2820 245661 83767 -287429 -63655
84f3655L35664k30272k49783K46819J03365k01910O60J50392o7803p5680P448
$$ -63655 272009 41737 -208046 38773 142138 -59772 -59112 91280 23477 -52203 -44755
95d4755k4726R4648J50763k09241k43488K55086K61723k50932j84852K20351Q4006
$$ -44755 -69481 25167 175930 -33311 -276799 -21713 240010 -10922 -195774 24577 108583
106A08583j92348l3146J42045R1234r038j55403j52437J56916K26334j13807j56773
$$ 108583 -83765 -116911 25134 116368 107330 -48073 -200510 -43594 182740 68933 -87840
117h7840J32676N4510j96069k9248K01479M8053j27112n2193L8400L4567L226
$$ -87840 44836 99346 -96723 -125971 75508 123561 -3551 -55744 -17344 17223 20449
128B0449n1372k9139P9528M4796r7679m0974J09445K3145j24906k7224J23716
$$ 20449 -30923 -60062 19466 64262 -33417 -74391 35054 58199 -66707 -93931 29785
139B9785O0404p1486p3304J0113N8100K0714l4601k293M6743j4445q1278m038
$$ 29785 90189 18703 -54601 -44488 13612 34326 -275 -2568 44175 29730 -51548 -55586
151e5586R8112M9179p5024q0068L1681O8494k2409m6399M2690L9407o1635m9987
$$ -55586 42526 91705 16681 -63387 -31706 36788 14379 -32020 10670 50077 -11558 -61545
163f1545M2901M5232o731k6841k3290J8894M6094k4729o1021L6473O1108m5222
$$ -61545 -18644 26588 19857 -6984 -30274 -11380 34714 9985 -51036 -14563 46545 1323
175A323l6677O4830J7552p5092j6629N4564K1701k209j1019m4376n305N6244m985
$$ 1323 -35354 29476 47028 -28064 -44693 9871 31572 29363 18344 -26032 -31337 24907 19922
188A9922m7788M1462L9669p9016m0733Q1508L0798n2921o948J3091j9961J9295
$$ 19922 -27866 13596 53265 -25751 -66484 15024 45822 -7099 -14047 -956 -20917 -1622
200a622K6946l6323p606M3492k6161m0977O0474L4309p3531k2998O1564O998k7709
$$ -1622 25324 -10999 -18605 24887 -1274 -42251 18223 52532 -20999 -43997 17567 24565 -3144
213c144J5897m031l2811J6558K4029j6352J1958K1316n3398l6680O5647L9640
$$ -3144 12753 8722 -24089 -7531 16498 146 12104 33420 -19978 -56658 8989 48629
225D8629m8328j7683K3335j8779j2815L7516J1092k3138q75j0489k1046L6725
$$ 48629 301 -17382 5953 -12826 -25641 11875 22967 -171 -1046 -11535 -32581 4144
237D144M1717l9716l9988K7977J6156j7539J4936J8501k8603k2187J6530J4309
$$ 4144 45861 6145 -33843 -5866 10290 -7249 7687 26188 -2415 -24602 -8072 6237
249F237Q572Q048k4359l0459J9346L1405p796r012Q424j6843k4912K0780L7484
$$ 6237 14809 22857 -1502 -31961 -12615 18790 10994 1982 10406 -6437 -31349 -10569 26915
262B6915l403k6867j5908j593J6205K3633j231k0760o682M67l711J3348K4627
$$ 26915 23512 -3355 -19263 -20856 -4651 18982 17751 -3009 -9691 -9224 -12935 413 25040
275B5040o420l2142j0652J7419J8257O177o174j7330j1395O657J5312J0341L94
$$ 25040 18620 -13522 -24174 -6755 11502 17679 11505 -5825 -17220 -10563 4749 15090 15484
288A5484j4409k0713K1K5387J5682j1426j6572m884N78N548J4604P463j1300j8092
$$ 15484 1075 -19638 -19617 5770 21452 10026 -6546 -11430 -10852 -5304 9300 16763 5463 -12629
302a2629o363J1520K1017P486j7282j9845J160J4527R169L097k894j3370j1361
$$ -12629 -18992 -7472 13545 21031 3749 -16096 -14936 -409 8760 11857 8963 -4407 -15768
315a5768O222J8094Q284p816j4990p981O386J3281O423m105r006r724k271J2312
$$ -15768 -9546 8548 16832 9016 -5974 -13955 -7569 5712 12135 8030 -976 -10700 -12971 -659
329f59J5326j759j6779j0882N394J1894P428k323p530q006j440P371J0151K972
$$ -659 14667 12908 -3871 -14753 -9359 2535 9963 7640 110 -7896 -9336 -1965 8186 11158
343A1158p307j1120l722Q994J2280Q47r484p837o97M603P369N407n386j0719m392
$$ 11158 3851 -7269 -10991 -1997 10283 11130 1646 -6191 -6888 -2285 5084 10491 5105 -5614 -10006
358a0006O235R496M027o189j0144k395O250O470J796r91n606p576J474J0503O620
$$ -10006 -3771 5725 9752 3563 -6581 -8976 -2726 3744 5540 4549 -1057 -8633 -7159 3344 9964
373I964n314q387k531L693N224M367j533o808m194K227N503M175j60p217p425
$$ 9964 4650 -3737 -6268 -2575 2649 7016 5483 -1325 -5519 -3292 2211 6386 6226 -991 -8416
388h416L656R872J667n367k974l653j840P533Q224m274p968j941q49L711J1132
$$ -8416 -4760 5112 6779 1412 -1562 -5215 -7055 478 8702 4428 -3540 -5481 -6330 -2619 8513
403H513J477j3581n059O703J665K037Q667n397j4430K834J1196j017n68L324j0188
$$ 8513 9990 -3591 -8650 -1947 -282 1755 10422 5025 -9405 -6571 4625 3608 3040 6364 -3824
418c824p174J3417P118j0255n96L224j1031J447J9270j982j7143J247M416n872
$$ -3824 -10998 2419 9537 -718 -1314 1910 -9121 -7674 11596 9614 -7529 -6282 -1866 -7738
432g738J1335J3809j6422j5621J1208L865m425J5442M560k4987o133J7530j04
$$ -7738 3597 17406 984 -14637 -3429 436 -3989 11453 16013 -8974 -15107 2423 2319
445B319j865J4220p859k4271Q976J7950p995j587J0161j4442j2367K0453Q832
$$ 2319 454 14674 6815 -17456 -8480 9470 1475 -112 10049 -4393 -16760 3693 12525
458A2525j8260K105Q608j3798R79K2274o595k0660Q408O379r670J3597J4712k3154
$$ 12525 -5735 -3630 4978 -8820 -7841 14433 7838 -12822 -4414 1965 -7705 5892 20604 -2550
472b550j6066J6615N154m127J5871j203k8050k294J9864n85K58J3246j3031k3345
$$ -2550 -18616 -2001 3153 -974 14897 13694 -14356 -16650 3214 2629 2887 16133 3102 -20243
486b0243J0919J6407n795K800O221j7851q611J8524M960j0343M715K478j2119
$$ -20243 -9324 7083 1288 4088 10309 -7542 -16153 2371 7331 -3012 1703 4181 -7938
499g938L742J4355q028r991P953R34m491J1308L449j7483n562J0422K972M145
$$ -7938 -4196 10159 2131 -7860 93 1027 -3464 7844 11293 -6190 -11752 -1330 1642 5787
513E787P493j0780j7268M284J0652L048O685O88j6952r035Q973P028M933O183
$$ 5787 13280 2500 -14768 -10484 168 3216 9901 10589 -6363 -15398 -6425 603 5536 11719
527A1719q703j3863K823P573J239N072K117j0974l415Q453j005l127N466j069
$$ 11719 3016 -10847 -8024 -451 788 5860 7977 -2997 -6412 2041 1036 -2091 3375 2306
541B306o287P049L951j0663j799N987l437J856J2617n668j6103K109O196k370
$$ 2306 -3981 3068 7019 -3644 -5443 544 -2893 -1037 11580 5912 -10191 -8082 -1886 -4256
555d256J0088R739j6813j3108J0127K762k370J5127K679k1926l306J2915m094
$$ -4256 5832 15571 -1242 -14350 -4223 -1461 -3831 11296 13975 -7951 -11257 1658 -2436
568b436N87J5680p004j8162R121P753j2159N458J3129j3301p551J6526l522j6589
$$ -2436 -1849 13831 6827 -11335 -2214 5539 -6620 -1162 11967 -1334 -8885 7641 4119 -12470
582a2470J0897R137j2903M456J3873j5740j2746J5883L019q863J3234N415k2886
$$ -12470 -1573 7564 -5339 -883 12990 -2750 -15496 387 3406 -5457 7777 13192 -9694
595i694m153J7970k883l369J5961n837k2951Q384J4121j0222K588J4308j3822
$$ -9694 -13847 4123 1240 -2129 13832 7995 -14956 -6572 7549 -2673 -85 14223 401
608D01j4269J5941M306j3953Q937R251j6099k014J6226p863j1969J3155L394j1805
$$ 401 -13868 2073 6379 -7574 1363 10614 -5485 -7499 8727 864 -11105 2050 5444 -6361
622f361Q809Q154j7740m653J5935n27o152J1254k256j8481M296J3621m205N7R118
$$ -6361 2448 10602 -7138 -11791 4144 3617 -2535 8719 6463 -12018 -7722 5899 1694 1751 10869
637A0869j0817j3623J1276Q983o377L192L822j3965l702J4304J12p410O092N7
$$ 10869 52 -13571 -2295 6688 311 3503 7325 -6640 -10342 3962 4074 -3336 2756 2813
651B813j0160N027Q753p825l619O788j609l727Q095N49j0787Q90O647j294K604
$$ 2813 -7347 -2320 6433 -1392 -5011 1777 168 -3559 4536 5085 -5702 -4812 1835 541 3145
666C145M830q264q746O128N843o2K888j238j0271j960P317L239K38K137n788p534
$$ 3145 7975 -289 -9035 -2907 2936 2874 5762 4524 -5747 -7707 -390 2849 3087 5224 -564 -8098
682h098L922O572l83N41l04o847j488Q016J827l852L32r78l067M357N185m831
$$ -8098 -4176 2396 2013 2554 2250 -4597 -6085 1931 3758 -94 238 -740 -3807 550 5735 904
698I04l460K354j404O85O313l86q246q53L035q1L958M134p009o674L193L359J113
$$ 904 -2556 -202 -1606 -921 5392 5006 -3240 -4093 -1058 -1139 2819 6953 -56 -6730 -3537 -178 935
715I35L479p31q682j436O315J594k4K496l942o087L397N594r69l51Q34m804j986
$$ 935 4414 3683 -4999 -6435 -120 1474 1450 3946 4 -6083 -2686 2908 1939 1588 2422 -2382 -4368
732d368O936K521n017n34N18l259K899N551k953n248J264L39p69M799J823o426
$$ -4368 2568 5089 72 -462 56 -3203 -304 5247 2294 -2954 -1690 -1351 -2120 2679 4502 -1924
748a924k908L338J107P70L109j883n689M86M425M54Q79P59m359k621L801L345
$$ -1924 -4832 -1494 -387 383 3492 1609 -4080 -3594 831 1285 2164 2923 -1436 -4057 -256 3089
764C089j386m72n88l184J57M768R07l095q48o43j075K873K536k083l112J57P13
$$ 3089 1703 1231 643 -2541 -2384 2384 3291 196 -652 -1295 -2370 503 3039 956 -2156 -1999 -1286
781a286N74K700k69l338j210J748J350J167J014k516k668J258K696R02k84j258
$$ -1286 -712 1988 1719 -1619 -2829 -1081 269 1436 2450 -66 -2734 -1476 1220 2122 1838 580
797E80k103k16K194K167q82j485j496n31J502K055l56j910j403qR85J904R33j853
$$ 580 -1523 -1739 455 2622 1740 255 -1241 -1772 -270 1785 1429 -481 -1884 -1892 -907 997 1930 77
815G7k327M11R39K270M09j440j916r1J237J806R41j153k103n92J430J493Q16p71
$$ 77 -2250 -1839 -900 1370 1779 339 -1577 -1668 -431 1375 2316 1163 -940 -1532 -102 1391 2207 1436
833A436k302j075J292K249L81j309j741j471R11K444Q89j269j438r16K7K211J990
$$ 1436 -866 -1941 -649 1600 1981 672 -1069 -2540 -1629 815 1704 435 -1003 -1919 -1892 319 2309
850B309j224j810j129K62J685J916L53k685j529N25J890J454O73j863k744P78
$$ 2309 1085 -725 -1854 -1592 93 2009 2362 -323 -1852 -1327 563 2017 2690 827 -1917 -1139
866a139J419J040N53j109k235j236K195K081k10r71j741j373J413L040M24j810
$$ -1139 280 1320 1873 764 -1471 -2707 -512 1569 1359 388 -1353 -2726 -1313 1727 2151 341
882C41j742q20O26K940J769k069k259n41N27J929K149o45k832j052O31R76J918
$$ 341 -1401 -2221 -1595 1345 3114 1045 -1214 -1755 -1228 701 2850 2205 -627 -1679 -1048 -72 1846
899A846Q38k543k382Q21J583Q09J138j873k764L54K443M40Q3k03k361j262L238
$$ 1846 2684 141 -2241 -1420 163 972 2110 237 -2527 -2173 270 710 793 590 -1771 -3033 205
916B05J809j055l60j142k088J826L266k13j728n35j953l5L825J769l080j496p3
$$ 205 2014 959 599 -543 -2631 -805 2461 2248 520 -15 -1968 -2003 1822 3591 511 -985 -1058
933a058r79J392L548r10l576L30O09j069K551K174l642j906K053M91p89K272r4
$$ -1058 -2037 -645 2903 1993 -1583 -1253 -644 -1713 838 3012 -630 -2536 -483 8 -781 1491 1397
950A397l855J170L400j476j076K090j840l216M554K646l702n80J318l195K0N611
$$ 1397 -2458 -1288 2112 636 -440 1650 -190 -3406 1148 3794 92 -488 830 -2365 -2345 3266
966C266p1m632Q48J05k856L067M402l895l102K954j204j722M281J882n221L6L468
$$ 3266 3195 -1437 -589 -484 -3340 -273 4129 234 -2868 86 -1118 -2840 1441 3323 -1898 -1862 1606
983A606k737n32M560j417m483L566K335m263M90L326l691j094N470q49m261J694
$$ 1606 -1131 -1663 2897 1480 -3003 563 2898 -1365 -875 2451 -1240 -2334 3136 2287 -1974 -280
999b80J121m200K788N000m072l539K954q38k321N342K257n772q35L498k850j96
$$ -280 841 -3359 -571 4429 357 -3182 -228 -1066 -3387 1955 4212 -1560 -2395 1103 -1747 -1943
1015a943N781j415n211K576J964l892J760L980l738k052M446p86m039K965J731
$$ -1943 3838 2423 -2788 -212 1752 -2140 -380 3600 -138 -2190 2256 1470 -2569 396 2127
1030B127m615K044M257m162k758L658j042k634N198J576n717k99K980k675P64
$$ 2127 -2488 -444 3813 -349 -3107 551 -491 -3125 2073 3649 -2068 -2367 613 -2062 -1298
1045a298N713k345m810J864J197k593L325L569m707k151L365j208j941M419O77
$$ -1298 4415 2070 -2740 -876 321 -2272 1053 4622 -85 -2236 1129 -79 -2020 2399 3076
1060C076n113J391K837l472l12L527j859k449M012N89m224R18J999k993J000M930
$$ 3076 -2037 -646 2191 -1281 -1593 1934 75 -2374 1638 2227 -1997 -1079 920 -2073 -1073 3857
1076C857k892l954K771n8k162L980K938n226j569L097j910n17N365n29n627J709
$$ 3857 965 -2989 -218 -276 -2438 1542 4480 -746 -2315 782 -1128 -1645 3720 3191 -2436 -727
1092g27J956l065J465M159l368l325L618j13l099L288J209m446Q19M255k767k377
$$ -727 1229 -1836 -371 3788 420 -2905 713 600 -2499 789 1998 -2448 -1629 2626 -141 -2518
1108b518L627q26l217M297K148m678l85K592k560m9N005m15n220J658R51k824
$$ -2518 1109 283 -2934 1363 3511 -1167 -1552 1040 -1520 -1569 3436 3021 -2199 -541 410 -2414
1124b414K508M107l620l184K881o36k025L930J749n270j91L371k414n32M055j193
$$ -2414 94 4201 581 -2603 278 -358 -2383 1547 3296 -1974 -2165 1206 -1208 -1740 2315 1122
1140A122l907K519K232l424R37K442k922q16M247p27l407J869P70k751J703L591
$$ 1122 -2785 -266 1966 -1458 -521 1921 -1001 -1817 2430 1703 -1704 165 935 -1816 -113 3478
1156C478l106k400K410o34j887L962J024m109m92K120j865R3L812j097l753J622
$$ 3478 372 -2028 382 -252 -2139 1823 2847 -1262 -1754 366 -1499 -1406 2406 1309 -2444 -822
1172h22J539k155J253K814l045j182K814o62j598J957N26k627P70K500j745j341
$$ -822 717 -1438 -185 2629 -416 -1598 1216 554 -1044 913 1439 -1188 -418 2082 337 -1004
1188a004K134j036j709K639R66k912j49J587j818M55K793j009k656P95Q14j283
$$ -1004 1130 94 -1615 1024 1990 -922 -1071 516 -1302 -847 1946 937 -1719 -924 -110 -1393
1204a393J775J668k368j361K041l36n67J769J51k450K91J810j004j3J183j085
$$ -1393 382 2050 -318 -1679 362 26 -541 1228 1379 -1071 -780 1030 26 13 1196 111
1220A11j298J691L01j313M36O61j595J52K170q51j580Q76q4q07J358J344j950
$$ 111 -1187 504 805 -508 -72 589 -1006 -854 1316 465 -1115 -239 -323 -1130 228 1572 -378
1237c78r19J142j82K4J285j52j850N61Q48o06N86Q45j065j056J079N56m64J56
$$ -378 -1297 -155 -337 -313 972 820 -1030 -469 379 -227 359 1204 139 -917 162 718 254 410
1255D10K73j519j88J691l07n99L65n28n75Q36Q57p21n78K36k68P0J372M2j223
$$ 410 683 -836 -1024 667 360 -239 126 -402 -977 -141 716 -5 -583 -347 -615 -545 827 869 -354
1274c54k03M12p1P54P16o05j309N77L7J71Q18j3j488j61O97L90O5L44j104m82
$$ -354 -557 -145 -216 538 1254 649 -660 -83 -46 125 943 930 -558 -719 -22 368 433 777 -327 -809
1294h09M22O97o0k55p3n72k40R95M73m91k64o3l72M36J129k13p69k52P4L6R01
$$ -809 -387 310 250 -5 -78 -650 -890 105 578 87 -177 -240 -612 -176 953 740 -29 -281 -207 -171 730
1315G30O7o10o65L28qK68Q72p16j077oP55N2M53Oq45m49N80M32m6K12n43l40O9
$$ 730 797 187 -478 -150 -158 110 982 266 -811 -817 -62 -10 443 449 -396 -845 -265 167 121 333 -210 -550 -481
1338d81P04O44m77l43m92L09N00M57l23m14r5j68P3P69j45q23J10j18K20K09L70
$$ -481 223 867 390 47 -445 -136 364 821 498 84 -11 -179 -106 663 518 -305 -195 -313 -93 116 486
1359D86p00l40j8J51L37O36l19q88N7P17K0K61K06q26l52O18P25m09n4l05l85
$$ 486 -214 -554 -572 -421 -84 552 233 -655 -598 119 139 400 606 -220 -572 46 771 362 308 3 -382
1380c82J09R17O3p79K55k34k92L61M66n30j56k2j50R5M14K43q78J19M93k88J37
$$ -382 -273 644 707 -72 183 -51 -343 18 484 -46 -202 -224 -374 -279 135 378 -500 -381 112 -176 -39
1401c9O09n29p96O94N08k36J27K29j019j60J257j16n32L26j88j079P13J146p72
$$ -39 570 41 -755 -61 447 211 338 567 -452 -612 645 529 -3 323 135 -944 -231 915 143
1420A43l53L49o54j88J086J89p87j54L34k16k80J456p82o95O29M04o49M68K81
$$ 143 -210 139 -515 -703 383 572 -215 -369 -35 -251 -531 925 143 -552 77 481 -168 300 581
1439E81j145J52R08k86m98R90k43j262N47R03p67m0M77p41p77J505M53q85k00
$$ 581 -564 -412 496 210 -288 702 459 -803 -256 647 -120 -160 317 -424 -1201 304 757 -128 -328
1458c28N97j311K08J823q61p83J263n91n89Q50Q17j304o87J655r90j01J247m43
$$ -328 269 -1042 -834 989 128 -655 608 17 -572 278 1095 -209 -896 759 -231 -332 915 472
1476D72j257P83R24j247K84O75j211o36J647L82j473Q89J79j830O56J689o81r65
$$ 472 -785 -2 922 -325 -41 634 -577 -1213 434 816 -657 232 411 -1419 -763 926 245 -720
1494g20J251p52j260J624J196j878J50J160j132m96K196o93j671J099Q15j533
$$ -720 531 -221 -1481 143 1339 -539 -389 771 -361 -857 1339 646 -1025 74 889 -644
1510f44N47J339j400q77J546jj307R51O54k201Q33J557p61j036J788j032j638
$$ -644 -97 1242 -158 -1035 511 510 -797 154 808 -1393 -560 997 236 -800 988 -44 -1682
1527a682J798J127j647K43J196j816k97K183p3j738J084K03j914J051J844j499
$$ -1682 116 1243 -404 -161 1035 -781 -1078 1105 1032 -706 378 581 -1333 -282 1562 63
1543F3q04J569p37j256J355J141k397M85J683j731m95J719o02j642K025O28j776
$$ 63 -741 828 91 -1165 190 1331 -1066 -581 1102 -629 -1124 595 -7 -1649 376 1004 -772
1560g72M15J120j829j37K220l55j378J132J5j567O30J931j289n09J244p49j563
$$ -772 -357 763 -1066 -1203 1017 662 -716 416 431 -1136 -506 1425 136 -373 871 122 -1441
1577a441K093N92j820L49R37j511j11K092r73j449J628L20j737O93J171j599J6
$$ -1441 652 1244 -576 -227 710 -801 -912 1180 207 -1242 386 706 -1031 -338 833 -766 -750
1594g50J728o96j097J214Pj457Q58J729j596j48J134j136r60J896N62j791O77
$$ -750 978 282 -815 399 406 -1051 -193 1536 -60 -208 926 -210 -1170 726 1288 -503 174
1611A74K98j333L5J767m44j234Q79Jj272Q18J261j256k31J001n27p76J293K95
$$ 174 472 -861 -826 941 497 -737 142 143 -1129 -311 950 -306 -537 464 -63 -839 454 749
1629G49j547O13J027j256n6J518j182q33J625K03j424N55L21j031J29J621o51
$$ 749 -798 -185 842 -414 -470 1048 -134 -967 658 861 -563 -8 313 -718 -589 1032 381
1646C81j048R78j47j244J054P89j037l47J050q86k83J372O1j262O70L64j261M70
$$ 381 -667 311 164 -1080 -26 763 -274 -621 429 -457 -740 632 693 -569 101 465 -796 -326
1664c26J313j004o47J193q4j033N01Q85j247L41Q07q10m26Q01j93j005J336J08
$$ -326 987 -17 -664 529 445 -588 -87 798 -449 -108 699 -111 -537 264 71 -934 402 510
1682E10o88j0N34r69j45J062Q9o23R4L77p87M09Q91n49m73R02m66n95Q67N10j054
$$ 510 -178 -188 346 -623 -768 294 383 -240 -146 231 -556 -147 744 195 -278 624 158 -437 430 940 -114
1703a14j35P04p02J08O20l71q74O63N81o91J23K77m26l87R72j59o18L06J12n20
$$ -114 -249 455 -247 -139 481 110 -764 -101 480 -211 -88 189 -237 -624 348 189 -429 -123 -11 -531
1723e31K74M57om23O35l98m66O59N50o13k45L24m07K8N37k49l51L4M12n31L92
$$ -531 -257 200 194 -229 406 8 -458 201 751 138 -107 217 -190 -162 375 126 -225 -191 221 -310 82
1744H2K9o45J94L07j8j95K54M12j029N51R0j49JK36j54k68L86K47l03j6L17m41
$$ 82 111 -534 -340 -33 -51 -246 8 420 -609 -58 32 -117 -116 120 -34 -302 84 331 28 12 329 -112
1766a12K75K94l33m23N02m78K26O3M49n09l55M14j12j00K50P4l97J36N2K06j13
$$ -112 163 457 124 -299 203 -275 -49 14 463 -46 -401 13 -99 -199 51 125 -272 -136 -84 122 9
1787IM28m90k59M19J02q6r2J99m01L79o3J48k41J06l1j74J67L67m39p6L6j27j45
$$ 9 437 -53 -312 107 209 123 31 230 -171 208 145 293 52 158 127 -47 120 487 48 -28 8 -119 -264
1810b64J88L3J8j75L2j04L04P4k67p7K8K84k06O0L24n02N8M81j79r0P4J4k16M43
$$ -264 -76 -43 -25 -200 -168 -272 32 106 -161 -238 -210 74 -132 -72 252 -250 -192 289 110 20 94 108 -108 335
1834C35m7q7l53K88k98j97L90J38l83P4q0k07K03L39j69j76O2Q0o4J60M01l69
$$ 335 288 201 -152 136 -162 -359 31 169 -214 -140 -220 -427 -224 115 -54 -230 -168 -88 -152 8 409 40
1856D0l20M07K02K8l29J07j55k35M85P1l72o8R7k03J35M35l44l2J1k45J13L35
$$ 40 -280 127 329 357 28 135 -20 -255 230 301 -71 -139 -42 -245 -110 325 -19 -51 -40 -285 -172 163
1878A63l05M6q2Q1R2L05j91k69m2L24n6q8L49k18k44J32j30J29m3L47l35l00N32
$$ 163 -142 -96 -178 -97 -5 300 109 -160 -202 122 66 -22 327 109 -135 -3 -133 -4 -47 300 -35 -335 197
1901A97k79J21P5J05n43L58J95k03j45K79j43k86J01K35j8k29J79J7K09l35L32
$$ 197 -82 39 114 219 -324 34 229 26 -119 160 17 -269 -168 67 49 -180 -1 16 225 -110 222
1922B22o40N78j18k47M05K5k74J3J00p5M5M5K17o82L96J21j62j39J98r3k21K88
$$ 222 -418 160 42 -205 200 225 -49 -36 64 -11 34 79 296 -386 10 131 -31 -170 28 -65 -286 2
1944BJ32k47P5J35o97M70M70r8l98N51j55l52l2M53k97j84L91j85j09L09L45o43
$$ 2 134 -113 -38 97 -600 -130 340 242 -156 395 240 -112 -144 309 12 -172 219 34 -75 234 579 -64
1966f4l05M86p4k50O23m37k47K78j0k53M51j00m58Q3N61j84m26O11k59l73J19
$$ -64 -369 117 43 -207 416 -21 -268 10 0 -253 198 98 -360 -277 284 100 -326 285 26 -347 -228
1987b28L84j39j29N69n92k62N95J06l19j3M22m69p6K77k49k51M27m5m41P00j96
$$ -228 156 17 -112 457 -135 -397 198 304 -15 -28 394 -75 -151 126 -123 -374 53 8 -433 267 71
2008G1m58J46K07J3j07K4j48j0K98L13l85P4L93m24k63N16K43o32J67N4m23K78
$$ 71 -387 -241 -34 -21 -128 -104 -252 -262 36 349 -36 38 431 7 -256 260 503 -129 38 92 -331 -53
2030e3J23j64k27N92qn65L04K19n76L36L85n96j51O89l28m69M83K0l19L02K55
$$ -53 70 -94 -321 271 263 -302 2 221 -355 -19 366 -230 -381 308 -20 -489 -6 14 -305 -3 252
2051B52l25m6L38q3j60M12j82k54J18K14k14j08O84m34n31O27l5p54K4P20n75
$$ 252 -73 -119 219 136 -24 388 206 -48 70 284 70 -38 646 212 -319 308 273 -481 -457 263 -312
2072c12o5L26l1k68K61J96k58N8L82m08M0L51k60m0J05n2l50J99M52j95p5J77
$$ -312 -377 -51 -82 -350 -89 107 -151 -93 289 -119 -79 272 12 -28 77 25 -325 -126 326 131 56 233
2094B33l90j58N17p5r0K38m1n95K60K76j27l32M14J02n48K15L54k08j05M01m44
$$ 233 -157 -315 202 127 37 275 234 -361 -101 175 48 -284 130 232 -316 -101 253 45 -60 341 -103
2115a03n7K92o4q3K19Om40K50J97r4m32O34r5m51J36K04l75M8O02m50j40M97l28
$$ -103 -160 132 68 -15 204 210 -230 20 217 123 -309 325 230 -221 -85 119 -256 -208 394 -56 -196 301 -27
2138b7k75J90L95m77R6L52p24K08M67l2l96P2L40m64J48K98k44k45O44j12k20
$$ -27 -302 -112 283 -194 -98 254 -470 -262 205 173 -223 -151 189 -275 -127 171 -73 -318 326 214 -6
2159fj04L51l48n5M08l57J9K08l1n26L55J74j57NK95n88J09O35j90m35M86J70
$$ -6 -110 241 -107 -162 246 -111 -92 116 85 -441 -86 88 -69 -64 231 -357 -248 387 197 -238 248 418
2181D18n25p5O93l39k98pJ01M3K30j22P0k27K82k74J50L98m16k28L60j16k71J49
$$ 418 -107 -182 511 172 -126 -133 -32 11 241 119 189 -38 244 -30 120 518 102 -126 234 118 -153 -4
2203dK07n16J29L46k0j67j95K76m11N20j88J0j9M49m92k30L50P6K34J13l27k53
$$ -4 203 -313 -184 162 142 -25 -220 56 -355 165 -23 -13 -32 417 -75 -305 45 121 355 468 141 -112
2225a12j24L98k88L7J03j54k2L07J48k14%r7l5j18J91k05k41M98L45k29j2j5j08
$$ -112 -236 162 -126 -89 14 -140 -162 145 293 79 79 -18 -53 -171 20 -185 -426 72 417 188 176 161 53
2248E3j3j22L87l33l3J76k23j58M84j2k56K91n8l30M14m5k08l40L44j35N6K02
$$ 53 40 -82 305 -28 -61 115 -108 -266 218 206 -50 241 183 -147 267 222 14 -326 18 -117 -61 141
2270A41k09P7q4l4P2m8K54J13j57L1m3k5n7Nj26j8K03l1L4l9k96K11m9O2J17j6
$$ 141 -68 9 -75 -109 -37 -85 169 282 125 156 113 88 31 36 -90 -108 95 64 98 59 -237 -26 -75 -13 104 88
2296H8J0k01j17M32l66J81r0K47j2l71K41n5J0o5N4j42K66J66m65L02K4l9j49
$$ 88 98 -103 -220 212 -154 27 -63 184 172 -199 42 -13 -3 -68 -14 -156 110 276 -189 113 137 98 -51
2319e1L42j53r5k67K66j57l0M13j57k19k19L27j20J50j07j6j48L92k67O7J68j68
$$ -51 291 138 43 -224 42 -115 -145 268 111 -108 -327 0 -120 30 -77 -93 -241 151 -116 -49 119 -49
2341d9J34l91N23N2l6l25l9J92j3J29j76J3J01K1J5km1q2k0p8r1J04j34m9L05
$$ -49 85 -306 217 269 233 -92 -131 61 48 177 1 14 115 136 151 149 108 26 6 -72 -163 -59 -193 -242 63
2366F3k90J24p6K80k04k8ML32j30l55M07N9l65K92j71J27k04NJ23K25l4n30K39
$$ 63 -227 -103 -179 101 -103 -131 -127 205 75 -280 127 186 -179 113 -58 69 -135 -130 -7 218 184 -346 -107
2389a07J63j65J42q5m1k9P3j23L10l04K29J89m07K14n7NJ39k26P1j97j56L24Q0
$$ -107 56 -109 33 -52 -93 -122 -49 -172 138 -166 63 252 -155 59 2 7 146 -80 -9 -206 -362 -38 42
2412D2j2J41k32L9K57l24K66k50J26O8l47L37j68J5p2j5M81n50J01j62Q7R1L5
$$ 42 30 171 -61 -22 235 -89 177 -73 53 121 -226 111 -57 -42 -114 -129 352 -198 -97 -259 -172 -81 -46
2435d6N6K31k29J05m4j4NR3kO5j17J25j17q8J47m10P7M61k19j19n5o8K5J28K20
$$ -46 10 241 12 117 73 59 64 157 155 220 103 228 111 23 170 -240 -163 298 79 -40 -95 -163 -138 -10 210
2460B10l49M3K47j33j91N6J44P2m87M77j4l47J66J73k68M14k17k07O9P0Mk11N47
$$ 210 -139 -96 151 18 -173 -117 27 99 -388 89 75 -272 -106 67 -201 213 -4 -211 -142 -72 -68 -279 268
2483B68j4k49r1J80j97p4J98j85K81j84M8J3m2J40l36j11L59O1j14J94j08l69
$$ 268 254 5 -86 94 -103 -177 21 -164 117 -67 -19 -6 -48 92 -244 -355 4 65 -49 145 37 -332
2505c32M68J9l00L33j00r7q9K42j98l3J73K8k4j70L58m35k14M64j95j99K50j17
$$ -332 136 155 -145 188 88 -9 -98 144 -54 -87 86 114 90 -80 278 -157 -371 93 -102 -301 -51 -168
2527a68J90j76L16j23o8J90j44p3J94j04j76K26K9k37K6L61k11K19k07J30n73
$$ -168 22 -154 162 39 -29 161 17 -56 138 34 -142 84 113 -124 -98 263 52 271 64 194 -379
2548c79L82L27l47q1J43n9k42j7K9k4J45M75n32pJ14J33l97M37J9k93k9N57m22
$$ -379 3 330 -17 -98 45 -14 -256 -273 -244 -268 -123 352 -180 -187 -73 60 -337 100 119 -174 -203 354 -68
2571f8J87l3k17K0K83j67q8O1K57k91O2J93l62j48J55K85k83K7K92j76r0L09n1
$$ -68 119 86 -131 -111 172 5 -83 -22 235 -56 6 199 -163 -311 -156 129 -154 -127 165 -11 -101 208 157
2594A57j79nJ86l46Q1J29j36P9L29m9j17L1L4l87J33M30m44ML45l25k17R1M24
$$ 157 -22 -27 159 -187 -106 23 -113 -34 295 246 129 160 194 -193 -60 370 -74 -70 275 -50 -267 -176 248
2617B48l78K52O8k93J93MJ50l89J67M7j39N9k0r8J46N14n68k15R4K93m00K03K5
$$ 248 -130 122 190 -103 90 94 244 -145 22 69 -70 -11 -31 -129 17 531 -37 -252 -158 135 -265 -62 -37
2640c7j67K39K27k73M9Q3k39J69o7K15o3k80N3j79J42Q1K48j58k72N15n47J38
$$ -37 -204 35 262 -11 38 121 -118 51 -16 199 136 -144 -91 -270 -128 -47 201 43 -229 286 -261 -123
2662a23L25k67k31K00K90j40K44j48k32m8J39kJ30j9j39j57L81j95O9j05J20j00
$$ -123 202 -65 -296 -96 194 54 298 150 -82 -130 9 7 137 118 -21 -178 203 8 77 -28 92 -8
2684hR8k54K9k7K43J47o7k97L46j57m08J83L41OLrk11J2K73L2j72Q3r0m1k19K61
$$ -8 90 -164 -135 -162 81 228 161 -136 210 53 -355 -172 169 175 178 169 -42 -30 243 275 103 186 96 55 -164 97
2710I7k58K10o6j30J56q5j8J3J7l4QJ60m5Q7m20M27J56m15L25k18j05J13r2r0
$$ 97 -161 49 -17 -147 9 -76 -94 -81 -64 -98 -90 70 25 112 -308 119 275 -140 185 -33 -138 -25 -117 -207
2734b07M19n8K5k97j32L75l06L06j06l1k13L85k25J3J42p0o9q6j29K71J38pR9
$$ -207 212 154 179 -118 -250 125 -181 125 19 -12 -225 160 -65 -52 90 20 -49 -135 -264 7 145 138 237
2757B37k51l36O17j88k65M96l67N8J17r0j43K45K00m63K66r9Q4k03n6K39O5J70
$$ 237 -14 -350 267 79 -186 310 -57 1 118 28 -115 130 330 -133 133 34 118 -85 -141 98 163 333
2779C33l96J44j3J83k61J78l08R8J52j67P1j07J56K77k11l45L42j31k0J63m35
$$ 333 -63 81 68 251 -10 168 -140 -42 110 -57 14 -93 63 340 129 -216 126 -5 -25 138 -297
2800b97M24J82m38K68j31Q1j99M52n21N67n20p9kQM57j12j61J59k6l13M70k63
$$ -297 127 309 -129 139 8 89 -110 342 -179 388 -132 -211 -213 -205 252 140 -21 138 112 -201 269 6
2822FP2l62L40j6L7L7j59Q2j74K48J83j87j76q5J38n2p9L04l48J6K22l30J59P0
$$ 6 78 -284 56 40 77 114 -45 37 -137 111 294 107 -69 -154 -16 -68 -147 157 -191 -175 47 -283 -124 -54
2846e4l9o6j4K16k95N02L8m66L5J30k09K12K95l41L5q5K26k61J35j17L37l05M06
$$ -54 -93 -159 -173 43 -252 250 288 -178 -143 -13 -222 -10 285 -56 -21 -106 120 -141 -6 -123 214 -91 315
2869C15r9r4j91P0j94j34K52J95l20J42Q0Q0k51Q5L24k57K4j80K03J12j27j09
$$ 315 216 122 -69 1 -193 -327 -75 120 -200 -58 22 102 -149 -64 260 3 27 -153 50 162 35 -74
2891g4j08K20N1Q5K94m35M6J18j34J07j33r3P8p9K02L3k94J30j9n8m4N3J25l61
$$ -74 -182 38 89 174 468 33 79 197 63 170 37 -56 22 -57 145 178 -116 14 -5 -63 -107 -54 71 -290
2915b90L59j37J22J3j72k04J67J97j17M7j11Q7o0J61K29k0m68L32Pj94J53J35
$$ -290 69 -68 54 67 -105 -309 -142 55 -62 -15 -126 -39 -99 62 291 271 -197 135 142 -52 101 236
2937B36l20r4K08k57J98J60pk34J19JJ43j44L1l5J14k57o1J57J0J28q9j5K19j45
$$ 236 -84 -178 30 -227 -29 131 124 -110 9 10 153 9 40 5 119 -138 -199 -42 -32 96 7 -8 211 66
2961F6m50M06k01K88J00m22M00q2j80j4J25p4J73q1L8j41P4R0rm6j04N8k7j55
$$ 66 -384 22 -179 109 209 -213 187 105 -75 -89 36 -38 135 54 92 -49 25 115 106 60 -44 14 -13 -168
2985a68K5J18j2K40j73Om5K51m73L4J74J03o3J64l82L52q6p5J2J8r9K73j84K9
$$ -168 -143 -25 -37 203 30 36 -9 242 -231 -197 -23 80 17 181 -201 151 65 -10 2 20 -79 194 10 39
3009C9P8p8k5j24m8P6L2jj62K59J77k67L48k22j25K12k24k03K58J9j0o6k3K53
$$ 39 117 39 14 -110 -158 -82 -50 -51 -213 46 223 -44 304 82 -43 169 -55 -258 0 19 9 -57 -80 173
3033A73k67K60m25K56j64J14l9K30k27Q3j00J55L6j45L25p9j7k99J93j18Q7R0
$$ 173 -94 166 -259 -3 -167 -53 -92 138 -89 -6 -106 49 85 -60 265 186 169 -130 63 -55 32 122
3055A22j53J29q6J66j79q3J88j30j9K24J03m58K15l07O8K7L23j13M2k2q7J86q7
$$ 122 -31 98 12 178 -1 -84 104 -26 -45 179 282 -176 39 -268 -200 -173 150 37 79 57 -30 156 69
3078F9m9j9k05L62l90L70k90L00k8j55K09k32L2J46j90k3K96k08K1j7O9l9k56
$$ 69 20 1 -204 158 -232 138 -152 148 120 -35 174 -58 -26 120 -70 -93 203 -5 16 -1 68 29 -227
3101b27K29M7k56J39N4k1k2j5j11K31j93K06J09O2j28J24k70J96r8O9J54j65P1
$$ -227 2 49 -207 -68 -14 -35 -57 -72 -183 48 -145 61 170 232 104 228 -42 154 56 125 279 114 185
3124A85l04K73K6k90K16j81Q6K90l84q5J37j42L1K12j11k20J77R4l95O05J5K2
$$ 185 -119 154 180 -110 106 -75 11 301 -83 -168 -31 -173 -142 70 -41 -261 -84 10 -385 220 235 257
3146B57k15qL03m15K23J24k73k17K19J08j40j9O4J16j32o6L1o5J86k48K3J24o6
$$ 257 42 34 337 -78 145 269 -4 -221 -2 106 -34 -53 11 127 -5 -71 -40 -105 81 -167 -144 -20 -86
3169h6LL3J9J55k23K35m5O4l70L54k77J32M14l00l59J24J13j12q4Q7J39m0J71
$$ -86 -83 -50 -31 124 -99 136 91 155 -215 139 -138 -6 408 108 -251 -127 -14 -126 -210 -123 16 -24 147
3192A47Oj3j90k6J50J9K1k52O9L70k78q6J69k06P3J07J82l85J73j88N1K46k38
$$ 147 153 140 -50 -76 74 93 114 -138 -69 301 23 -63 106 -100 -27 80 262 -123 50 -138 -87 159 -79
3215g9j71L36J2J30k82p2Q3O8p6n5L27l10J08P4p7k22K08P0j53R9r8M4J67j34
$$ -79 -250 86 98 228 -54 -126 -43 25 -51 -106 221 -89 19 93 16 -206 2 72 -81 18 -80 -36 131 -3
3239cl11K99J18k23k84M82K1k99K08j6p7J35Q2K0k16n5Q3K4R1j71J00j41K13r8
$$ -3 -314 -15 103 -120 -404 78 99 -200 8 -8 -85 50 132 152 -64 -119 -36 -12 79 -92 8 -133 80 -18
3263a8n9p4J91k61K55J94q6k06J37o0J82k80ll2r2K63k04L79l13%J13J32l49P2
$$ -18 -77 -151 40 -221 34 228 142 -64 73 13 195 -85 -88 -120 -212 51 -153 226 -87 -87 26 158 -191 -119
3287a19J77j27K32j57j36K50q1r2j4J47l78J35p0L03J06j89Q8p1J31R8j26j95
$$ -119 58 -69 163 6 -130 120 39 -53 -67 80 -298 -163 -233 70 176 -13 75 4 135 233 107 -88
3309h8K37J15K2l62J3K14k31P9M4J7k23K27L7k0o0l0L1n0J01J68k23m9j02L30
$$ -88 149 264 286 -76 -63 151 -80 -1 43 60 -163 64 101 81 21 -9 22 -28 73 241 18 -31 -133 197
3333A97j57R4j34n5J58l76L78j14J77k34j42L20p8J63l33J79j45K56j98j5K27
$$ 197 40 134 0 -55 103 -273 105 -9 168 -66 -208 112 34 197 -136 43 -102 154 -44 -59 168
3354A68p5k06J29N8j04Po9J51nQ6k03J01k3Pj99R0J14J20q4o5J46j98j53J57j
$$ 168 93 -113 16 74 -30 -23 -92 59 54 140 -63 38 15 22 -177 -87 27 147 63 -2 144 -54 -207 -50 -51
3379e1K08O4j22J1k0J4J3j86K67n9l78J50k35L76J11k16O9j07qK22j80L9Q2o2
$$ -51 157 221 99 110 90 104 117 -69 198 139 -239 -89 -324 52 163 -53 16 -91 -99 123 -57 -18 64 2
3403Bn5J45j40l6J48k43J26K6J00j1l5Q8k13J30j92J25N2j54M82m17L5j15O7M45
$$ 2 -53 92 -48 -84 64 -179 -53 -27 73 62 27 115 -98 32 -160 -35 17 -137 345 -72 -37 -152 -85 360
$$ [...]
8191a11
##END NTUPLES=NMR FID
##END=
