##TITLE=1H_DE18kwshTFA
 CDCl3
 8 sc, 
 27.9.2023
##JCAMPDX= 6.0         $$ Bruker NMR JCAMP-DX V2.0
##DATA TYPE= NMR FID
##DATA CLASS= NTUPLES
##ORIGIN= UXNMR, Bruker Analytische Messtechnik GmbH
##OWNER= root
$$ XWIN-NMR		Version 3.5
$$ Wed Sep 27 16:30:48 2023 Russian Standard Time (UT+4h)  she@DPX200
##.OBSERVE FREQUENCY= 200.13135
##.OBSERVE NUCLEUS= ^1H
##.DELAY= (6, 6)
##.ACQUISITION MODE= SIMULTANEOUS
##.ACQUISITION SCHEME= undefined
##.AVERAGES= 8
##.DIGITISER RES= 18
##SPECTROMETER/DATA SYSTEM= spect
##.PULSE SEQUENCE= zg30
##.SOLVENT NAME= CDCl3
##.SHIFT REFERENCE= (INTERNAL, CDCl3, 0, 15.7039)
##AUDIT TRAIL= $$ (NUMBER, WHEN, WHO, WHERE, WHAT)
$$ ##TITLE= Audit trail, XWIN-NMR		Version 3.5
$$ ##JCAMPDX= 5.01
$$ ##ORIGIN= Bruker BioSpin GmbH
$$ ##OWNER= she
$$ F:/spectra/data/she/nmr/H-F/1/audita.txt
$$ ##AUDIT TRAIL=  $$ (NUMBER, WHEN, WHO, WHERE, WHAT)
(   1,<2023-09-27 16:29:51.62 +0400>,<she>,<DPX200>,
      <created by zg, POWCHK disabled, PULCHK disabled
       configuration hash MD5:
       00 E9 B6 7A A2 85 ED C7 34 08 36 98 17 FE 4E 26
       data hash MD5: 16K
       73 70 76 9D 37 F3 B8 84 54 66 0E EA 25 D4 8B 57>)
$$ ##END=
$$ 
$$ hash MD5
$$ 1B 83 82 2B 91 09 AE 31 65 8F 0D E1 C2 46 F1 B3
##$RELAX= 
##$RELAX= 
##$RELAX= 
##$RELAX= 
##$RELAX= 
##$RELAX= 
$$ Bruker specific parameters
$$ --------------------------
##$DU= <F:/spectra>
##$EXPNO= 1
##$NAME= <H-F>
##$PROCNO= 1
##$TYPE= <nmr>
##$USER= <she>
##$AMP= (0..31)
100 100 100 100 100 100 100 100 100 100 100 100 100 100 100 100 100 100 
100 100 100 100 100 100 100 100 100 100 100 100 100 100 
##$AQSEQ= 0
##$AQ_mod= 1
##$AUNM= <au_zg>
##$AUTOPOS= <>
##$BF1= 200.13
##$BF2= 200.13
##$BF3= 200.13
##$BF4= 200.13
##$BF5= 200.13
##$BF6= 200.13
##$BF7= 200.13
##$BF8= 200.13
##$BYTORDA= 1
##$CFDGTYP= 0
##$CFRGTYP= 5
##$CHEMSTR= <none>
##$CNST= (0..31)
1 1 145 1 1 1 1 1 1 1 1 1 1 1 1 1 1 1 1 1 1 1 1 1 1 1 1 1 1 1 1 1 
##$CPDPRG= <>
##$CPDPRG1= <>
##$CPDPRG2= <>
##$CPDPRG3= <>
##$CPDPRG4= <mlev>
##$CPDPRG5= <mlev>
##$CPDPRG6= <mlev>
##$CPDPRG7= <mlev>
##$CPDPRG8= <mlev>
##$CPDPRGB= <>
##$CPDPRGT= <>
##$D= (0..31)
0 1.2 0 0 0 0 0 0 0 0.06 0 0.03 0 0 0 0 0.0002 0 0 0 0 0 0 0 0 0 0 0 0 
0 0 0 
##$DATE= 1695817791
##$DBL= (0..7)
120 120 120 120 120 120 120 120 
##$DBP= (0..7)
150 150 150 150 150 150 150 150 
##$DBP07= 0
##$DBPNAM0= <>
##$DBPNAM1= <>
##$DBPNAM2= <>
##$DBPNAM3= <>
##$DBPNAM4= <>
##$DBPNAM5= <>
##$DBPNAM6= <>
##$DBPNAM7= <>
##$DBPOAL= (0..7)
0.5 0.5 0.5 0.5 0.5 0.5 0.5 0.5 
##$DBPOFFS= (0..7)
0 0 0 0 0 0 0 0 
##$DE= 6
##$DECBNUC= <off>
##$DECIM= 32
##$DECNUC= <off>
##$DECSTAT= 4
##$DIGMOD= 1
##$DIGTYP= 9
##$DL= (0..7)
0 120 120 120 120 120 120 120 
##$DP= (0..7)
150 150 150 150 150 150 150 150 
##$DP07= 0
##$DPNAME0= <>
##$DPNAME1= <>
##$DPNAME2= <>
##$DPNAME3= <>
##$DPNAME4= <>
##$DPNAME5= <>
##$DPNAME6= <>
##$DPNAME7= <>
##$DPOAL= (0..7)
0.5 0.5 0.5 0.5 0.5 0.5 0.5 0.5 
##$DPOFFS= (0..7)
0 0 0 0 0 0 0 0 
##$DQDMODE= 0
##$DR= 18
##$DS= 0
##$DSLIST= <SSSSSSSSSSSSSSS>
$$ [...]
##$SUBNAM2= <"">
##$SUBNAM3= <"">
##$SUBNAM4= <"">
##$SUBNAM5= <"">
##$SUBNAM6= <"">
##$SUBNAM7= <"">
##$SUBNAM8= <"">
##$SUBNAM9= <"">
##$SW= 18.05172834244
##$SWIBOX= (0..15)
0 0 2 0 0 0 0 0 0 0 0 0 0 0 0 0 
##$SW_h= 3612.71676300578
##$TD= 16384
##$TD0= 1
##$TE= 0
##$TE2= 300
##$TE3= 300
##$TEG= 300
##$TL= (0..7)
0 120 120 120 120 120 120 120 
##$TP= (0..7)
150 150 150 150 150 150 150 150 
##$TP07= 0
##$TPNAME0= <>
##$TPNAME1= <>
##$TPNAME2= <>
##$TPNAME3= <>
##$TPNAME4= <>
##$TPNAME5= <>
##$TPNAME6= <>
##$TPNAME7= <>
##$TPOAL= (0..7)
0.5 0.5 0.5 0.5 0.5 0.5 0.5 0.5 
##$TPOFFS= (0..7)
0 0 0 0 0 0 0 0 
##$TUNHIN= 0
##$TUNHOUT= 0
##$TUNXOUT= 0
##$USERA1= <user>
##$USERA2= <user>
##$USERA3= <user>
##$USERA4= <user>
##$USERA5= <user>
##$V9= 5
##$VALIST= <valist>
##$VCLIST= <CCCCCCCCCCCCCCC>
##$VD= 0
##$VDLIST= <DDDDDDDDDDDDDDD>
##$VPLIST= <PPPPPPPPPPPPPPP>
##$VTLIST= <TTTTTTTTTTTTTTT>
##$WBST= 1024
##$WBSW= 4
##$XGAIN= (0..3)
0 0 0 0 
##$XL= 0
##$YL= 0
##$YMAX_a= 119588
##$YMIN_a= -118883
##$ZGOPTNS= <>
##$ZL1= 120
##$ZL2= 120
##$ZL3= 120
##$ZL4= 120
##$ABSF1= 10
##$ABSF2= 0
##$ABSG= 5
##$ABSL= 3
##$ALPHA= 0
##$AQORDER= 0
##$ASSFAC= 0
##$ASSFACI= 0
##$ASSFACX= 0
##$ASSWID= 0
##$AUNMP= <proc_1d>
##$AZFE= 0.1
##$AZFW= 0.1
##$BCFW= 1
##$BC_mod= 2
##$BYTORDP= 1
##$COROFFS= 0
##$CY= 11.3945322036743
##$DATMOD= 1
##$DC= 2
##$DFILT= <>
##$DTYPP= 0
##$F1P= 15.7292609196834
##$F2P= 12.9074282941183
##$FCOR= 0.5
##$FTSIZE= 0
##$FT_mod= 4
##$GAMMA= 1
##$GB= 0.15
##$INTBC= 1
##$INTSCL= 1
##$ISEN= 128
##$LB= 0.24
##$LEV0= 0
##$LPBIN= 0
##$MAXI= 10000
##$MC2= 0
##$MEAN= 0
##$ME_mod= 0
##$MI= 1.114404
##$NCOEF= 0
##$NC_proc= 0
##$NLEV= 6
##$NOISF1= 3.799351
##$NOISF2= 2.8
##$NSP= 1
##$NTH_PI= 0
##$NZP= 0
##$OFFSET= 15.70392
##$PC= 1
##$PHC0= -21710.45
##$PHC1= 12.25271
##$PH_mod= 1
##$PKNL= yes
##$PPARMOD= 0
##$PSCAL= 0
##$PSIGN= 0
##$REVERSE= no
##$SF= 200.130013532006
##$SI= 16384
##$SIGF1= 3
##$SIGF2= 2
##$SINO= 400
##$SIOLD= 16384
##$SREGLST= <1H.CDCl3>
##$SSB= 0
##$STSI= 0
##$STSR= 0
##$SW_p= 3612.71676300578
##$SYMM= 0
##$S_DEV= 0
##$TDeff= 0
##$TDoff= 0
##$TI= <>
##$TILT= no
##$TM1= 0
##$TM2= 0
##$TOPLEV= 0
##$USERP1= <user>
##$USERP2= <user>
##$USERP3= <user>
##$USERP4= <user>
##$USERP5= <user>
##$WDW= 1
##$XDIM= 8192
##$YMAX_p= 0
##$YMIN_p= 0
$$ End of Bruker specific parameters
$$ ---------------------------------
##NTUPLES= NMR FID
##VAR_NAME=  TIME,          FID/REAL,        FID/IMAG
##SYMBOL=    X,             R,               I
##VAR_TYPE=  INDEPENDENT,   DEPENDENT,       DEPENDENT
##VAR_FORM=  AFFN,          ASDF,            ASDF
##VAR_DIM=   8192,          8192,            8192
##UNITS=     SECONDS,       ARBITRARY UNITS, ARBITRARY UNITS
##FACTOR=    0.0002768,     1,               1
##FIRST=     0,             0,               0
##LAST=      2.2672688,     0,               0
##MIN=       0,             -118883,         0
##MAX=       2.2672688,     119588,          0
$$ Real data points
##PAGE= N=1
##DATA TABLE= (X++(R..R)), XYDATA
$$ plain form
0 0 0 0 0 0 0 0 0 0 0 0 0 0 0 0 0 0 0 -2 8 -8 8 -8 8 -9 15 -16 16 -20 24 -25 31 -33 38 -44 49 -54 60 -68 76
39 76 -85 95 -104 116 -130 141 -156 173 -189 211 -231 255 -280 309 -341 377 -418 466 -520 584 -660
60 -660 752 -868 1016 -1216 1494 -1912 2603 -3953 7487 -34091 -59899 62067 -9528 -72411
74 -72411 83533 106983 -36045 22560 119588 41573 -3335 31087 21718 25628 -9937 -90612
86 -90612 -24237 69455 -40183 -110844 8135 40786 -64471 -92724 -33137 20436 6050 -67120
98 -67120 -41679 80203 60829 -40779 15627 105444 46767 -20859 1911 33762 29523 -11473
110 -11473 -35759 22661 46818 -37353 -52667 29733 13675 -66510 -47469 3630 -12917 -43085
122 -43085 -37553 -1307 31862 4967 -31499 13408 58114 5594 -37516 15061 54294 11541
$$ packed form
0@%%%%%%%%%%%%%%%%%kJ0j6J6j6J6j7K4l1L2l6M4m9N6o4P1q2R3j03J14j28J44
39G6j61J80j99K20k46K71k97L29l62M00m42M86n35N89o50P18p95Q84r86J104j244
60f60J412j620J884k232K710l406M515o556J1440m1578k5808J21966p1595o2883
74g2411J55944K3450j43028N8605R7028p8015m4908L4422r369L910l5565q0675
86i0612O6375R3692j09638p0661J18979L2651j05257k8253N9587N3573j4386p3170
98f7120K5441J21882j9374j01608N6406Q9817n8677o7626K2770L1851m239m0996
110a1473k4286N8420K4157q4171j5314Q2400j6058q0185J9041N1099j6547l0168
122d3085N532L6246L3169k6895l6466M4907M4706n2520m3110N2577L9233m2753
$$ plain form
134 11541 -22073 11372 46739 22404 -20189 -13070 21603 7731 -42695 -44434 -449 1632 -39975
147 -39975 -36823 11937 16530 -19363 -19991 14304 22654 -3364 -16162 13400 36822 9457 -13744
160 -13744 19411 41860 4780 -19337 5118 16661 -8935 -29848 -18586 5805 541 -29812
172 -29812 -21938 15459 5964 -29114 -15439 14699 5599 -14254 -8591 13388 23103 5375 -6591
185 -6591 19589 33789 1189 -14198 13590 18848 -8587 -16127 -597 7589 -4315 -22426 -15666
198 -15666 6796 -4772 -31238 -16511 9568 -3431 -19386 -2967 15600 12423 505 591 17533
211 17533 23278 918 -6034 18547 20987 -5481 -6998 12063 9958 -7704 -13971 -5751 1602 -10104
225 -10104 -25574 -12778 6081 -7461 -22004 -3655 12414 -949 -10099 921 12254 9829
$$ packed form
134A1541l3614L3445L5367k4335m2593P119L4673j3872n0426j739M3985K081m1607
147c9975L152M8760M593l5893o28L4295Q350k6018j2798K9562K3422k7365k3201
160a3744L3155K2449l7080k4117K4455J1543k5596k0913J1262K4391n264l0353
172b9812P874L7397r495l5078J3675L0138r100j9853N663K1979R715j7728j1966
185f591K6180J4200l2600j5387K7788N258k7435p540J5530Q186j1904j8111O760
198a5666K2462j1568k6466J4727K6079j2999j5955J6419J8567l177j1918Q6J6942
211A7533N745k2360o952K4581K440k6468j517J9061k105j7662o267Q220P353j1706
225a0104j5470J2796J8859j3542j4543J8349J6069j3363r150J1020J1333k425
$$ plain form
237 9829 -924 966 18112 19729 893 736 18286 13418 -5958 -6662 4167 1638 -10497 -14376
251 -14376 -4303 2260 -8930 -17389 -3969 3833 -9089 -15342 -2037 5967 -926 -5745 3878 15437
265 15437 11445 315 4974 16800 9453 -4428 -367 9994 5212 -5411 -4316 4493 4473 -7298
279 -7298 -11652 -1839 306 -12526 -15428 -3125 1310 -6336 -6534 3818 9227 3523 -1898 3867 10895
294 10895 4599 -4178 2366 11238 4915 -2748 2370 9413 3641 -5576 -5121 396 -1836 -10280 -9954
309 -9954 96 1663 -5831 -5267 3890 5270 -2974 -4744 2637 4635 -2088 -4294 3435 8546 4051
324 4051 -51 4849 8616 2153 -5146 -2151 2865 -1905 -8217 -4598 2121 -333 -5113 -2437 3256
339 3256 1356 -5048 -4971 1399 2256 -3000 -1600 6161 7791 1944 857 5524 6208 -603 -4428 -986
$$ packed form
237I829j0753J890J7146J617j8836j57J7550m868j9376p04J0829k529j2135l879
251a4376J0073O563j1190q459J3420P802j2922o253J3305Q004o893m819R623J1559
265A5437l992j1130M659J1826p347j3881M061J0361m782j0623J095Q809k0j1771
279g298m354R813K145j2832k902J2303M435p646j98J0352N409n704n421N765P028
294A0895o296q777O544Q872o323p663N118P043n772r217M55N517k232q444L26
309i954J0050J567p494N64R157J380q244j770P381J998o723k206P729N111m495
324D051m102M900L767o463p299K995N016m770o312L619O719k454m780K676N693
339C256j900o404P7O370Q57n256J400P761J630n847j087M667O84o811l825L442
$$ plain form
355 -986 1567 -3379 -6414 -1360 2836 -699 -4252 -1278 1547 -1388 -5802 -3587 1786 1000 -2895 484
371 484 5837 5063 1128 2076 4878 3155 -1106 -2198 1033 2537 -1316 -2702 2080 3367 -1911 -4104
387 -4104 -910 -674 -4631 -6379 -3724 -563 -762 -3033 -12 4896 3451 -584 1458 4919 2678 -679
403 -679 828 3843 3556 1251 654 2694 2992 -1357 -3919 -880 -794 -4983 -5931 -1829 -632 -2339 -2883
420 -2883 -486 2069 -34 -2583 -408 2574 626 -1328 1485 4492 3052 908 2288 4147 3080
435 3080 -173 -723 1149 771 -3221 -3179 689 311 -3160 -2856 -665 -912 -2781 -3545 -1856 491 -1085
452 -1085 -2377 1620 3592 1097 769 2903 3655 1558 -17 524 1766 1372 -1098 -437 1873 448
468 448 -2279 -1417 646 -1209 -3170 -1989 -799 -994 -1351 -1473 557 1583 -277 -1323 1304 1992 -762
$$ packed form
355i86K553m946l035N054M196l535l553K974K825k935m414K215N373p86l895L379
371D84N353p74l935R48K802j723m261j092L231J504l853j386M782J287n278k193
387d104L194K36l957j748K655L161j99k271L021M908j445m035K042L461k241l357
403f79J507L015k87k305n97K040K98m349k562L039Q6m189r48M102J197j707n44
420b883K397K555k103k549K175K982j948j954K813L007j440k144J380J859j067
435C080l253n50J872l78l992M2L868l78l471L04K191k47j869p64J689K347j576
452a085j292L997J972k495l28K134P52k097j575N41J242l94k470O61K310j425
468D48k727Q62K063j855j961J181J190j95l57j22K030J026j860j046K627O88k754
$$ plain form
485 -762 -1036 1733 2193 427 -47 1414 1850 985 -662 -1083 503 104 -2571 -1755 767 -577 -1444 -155
503 -155 169 -496 -230 -893 -467 751 -109 -903 1552 2097 -302 583 1745 402 -598 -366 -718 262
521 262 12 -2208 -557 2243 -470 -2471 648 1084 -1169 -329 -751 -439 1364 157 -1481 1416 2704
538 2704 -1215 -735 2133 -74 -1263 365 -527 -775 998 -300 -1006 861 -201 -1883 149 233 -2394
555 -2394 -844 770 -673 -303 643 190 1120 1347 -1048 73 2173 46 -1243 1015 1071 -132 333
572 333 -87 -461 1042 -488 -2421 -249 275 -1863 -1467 373 -412 -188 379 -569 26 978 -400 -586
590 -586 972 521 -44 960 1503 704 756 918 376 51 -167 -774 -310 -198 -1220 -386 46 34 -520 -706
610 -706 -357 108 -529 -1323 -172 470 148 58 1097 1648 1025 185 399 745 674 -176 -200 505 490 85 -163
$$ packed form
485g62k74K769M60j766m74J461M36q65j647m21J586l99k675Q16K522j344q67J289
503a55L24o65K66o63M26J218q60p94K455N45k399Q85J162j343j000K32l52R80
521B62k50k220J651K800k713k001L119M36k253Q40m22L12J803j207j638K897J288
538B704l919M80K868k207j189J628q92k48J773j298p06J867j062j682K032Q4k627
555b394J550J614j443L70R46m53R30K27k395J121K100k127j289K258N6j203M65
572C33m20l74J503j530j933K172N24k138L96J840p85K24N67r48N95R52j378j86
590e86J558m51n65J004N43p99N2J62n42l25k18o07M64J12j022Q34M32j2n54j86
610g06L49M65o37p94J151O42l22r0J039N51o23q40K14L46p1q50k4P05j5m05k48
$$ plain form
631 -163 538 579 -423 -1027 -287 -572 -1418 -1151 -288 -266 -254 -24 261 650 288 29 101 584 -93 -573 358
652 358 852 64 118 794 723 203 -121 -598 -110 -447 -726 -560 66 -104 -364 134 412 -232 -560 -552 -179 -238
674 -238 -246 -295 425 450 -17 421 678 418 -86 31 -49 21 35 -266 202 467 50 -60 43 74 -510 -561 -183
697 -183 -460 -260 -230 -109 289 616 101 5 386 -1 -467 -222 -135 116 -100 228 92 462 88 -161 -65 188
719 188 -254 -462 -60 53 81 -18 295 304 -94 -277 -76 73 62 -208 -229 -39 69 -44 -274 197 187 -229 -518
742 -518 -230 -162 -457 -378 111 174 20 43 193 388 164 141 112 327 108 -40 88 203 -36 -111 55 117 -234
765 -234 -161 -315 -361 -88 -372 -428 6 46 -237 -134 -59 123 1 -217 76 263 177 170 329 715 239 479 402
788 402 179 81 -159 86 -237 -117 141 45 -246 -142 -323 -218 -74 -153 -519 -165 -302 108 45 2 15 188
$$ packed form
631a63P01M1j002o04P40k85q46K67Q63K2J2K30K85L89l62k59P2M83o77m80R31
652C58M94p88N4O76p1n20l24m77M88l37k79J66O26j70k60M98K78o44l28QL73n9
674b38qm9P20K5m67M38K57k60n04J17q0P0J4l01M68K65m17j10J03L1n84n1L78
697a83k77K00L0J21L98L27n15r6L81l87m66K45Q7K51k16L28j36L70l74k49R6K53
719A88m42k08M02J13K8r9L13Rl98j83K01J49j1k70k1J90J08j13k30M71j0m16k89
742e18K88O8k95P9M89O3j54K3J50J95k24k3k9K15k19j48J28J15k39p5J66O2l51
765b34P3j54m6K73k84n6M34M0k83J03P5J82j22k18K93J87q6pJ59L86m76K40p7
788D02k23r8k40K45l23J20K58r6k91J04j81J05J44p9l66L54j37M10o3m3J3J73
$$ plain form
810 188 59 -82 281 148 114 126 171 177 118 219 194 235 -130 -288 -170 -130 -58 -121 -104 -71 -155 -294 -31 51 88 -100
836 -100 -246 -197 -124 7 268 41 127 212 120 128 167 17 -42 -40 182 208 -47 90 188 -161 -25 -244 -222 -155 -132 0
862 0 -224 -21 -69 28 -51 58 124 -14 5 54 134 -160 258 16 -3 -101 38 147 -149 -26 -99 39 -319 -33
886 -33 -207 60 227 -239 -87 249 11 -69 -124 30 -68 -90 -155 -119 -32 -187 39 54 63 -61 -108 -95 9 -104 -79
911 -79 -26 67 1 136 2 -93 -130 -71 -103 -142 -123 143 8 -233 181 55 176 85 181 -183 -185 -108 -73 -52 -65 -29 242
938 242 22 -152 -167 -255 -124 -340 -9 -213 39 81 288 88 -79 33 -138 -45 -140 -68 -108 -312 -88 -126 141
961 141 -5 143 -227 -2 -45 3 -184 100 267 98 -18 29 70 44 -22 25 29 37 -86 -52 13 -21 99 -9 199
986 199 159 156 -203 -142 -180 -139 -322 -160 -391 -298 19 -45 16 -55 -90 35 129 233 -77 269 -19 -50 255 142 57
$$ packed form
810A88j29j41L63j33l4J2M5On9J01k5M1l65j58J18M0P2o3J7L3q4j39K63Q2L7j88
836a00j46M9P3J31K61k27Q6Q5r2QL9j50n9KK22K6k55J37R8l49J36k19K2O7K3J32
862@k24K03m8R7p9J09O6j38J9M9Q0k94M18k42j9r8J39J09k96J23p3J38l58K86
886c3j74K67J67m66J52L36k38q0n5J54r8k2o5L6Q7j55K26J5Rj24m7J3J04j13K5
911g9N3R3o6J35j34r5l7N9l2l9J9K66j35k41M14j26J21r1R6l64kP7L5K1j3L6K71
938B42k20j74j5q8J31k16L31k04K52M2K07k00j67J12j71R3r5P2m0k04K24l8K67
961A41j46J48l70K25m3M8j87K84J67j69j16M7M1k6o6M7MQj23L4O5l4J20j08K08
986A99m0ll59O1l8M1j83J62k31R3L17o4O1p1l5J25R4J04l10L46k88l1L05j13q5
$$ plain form
1011 57 -41 184 -68 35 44 26 -275 114 165 163 91 -253 -5 -154 -7 -27 -216 -143 -87 185 -209 -13 208 244
1035 244 -105 -194 47 211 170 -36 175 26 -13 41 -328 -13 26 -34 -162 -113 -368 81 41 -8 -54 195 -231
1058 -231 -83 231 -255 65 142 -80 -240 -94 55 187 75 157 20 -132 165 -17 162 -274 -27 60 -65
1079 -65 -6 -25 119 -60 -238 118 27 -70 45 -16 401 -198 -150 64 187 -52 80 166 -90 -79 -128 208 -4
1102 -4 154 277 58 -150 189 68 168 257 163 -143 142 59 -70 -27 -107 -174 -65 -300 100 -23 -14 81 -3 -14
1126 -14 12 -175 9 -172 337 115 54 53 42 11 -125 61 119 296 173 -82 -145 -2 -49 -291 -190 -12 -109 -334
1150 -334 106 -93 -39 -4 -168 -194 -174 -79 -62 -104 -20 187 134 -59 42 45 -43 -122 -141 -38 -170 94 46 -252 85
1175 85 -178 123 174 -170 -144 -142 0 80 95 77 56 -118 -65 -15 -74 -314 -63 124 -27 76 10 71 17 55 -25 151
$$ packed form
1011E7r8K25k52J03Rj8l01L89N1kp2l44K48j49J47k0j89P3N6K72l94J96K21L6
1035B44l49q9K41J64m1k06K11j49l9N4l69L15L9o0j28M9k55M49m0m9m6K49m26
1058b31J48L14m86L20P7k22j60J46J49J32j12Q2j37j52K97j82J79m36K47Q7j25
1079f5N9j9J44j79j78L56r1r7J15o1M17n99M8K14J23k39J32Q6k56J1m9L36k12
1102dJ58J23k19k08L39j21J00Q9r4l06K85q3j29M3q0o7J09k35M00j23RR5q4j1
1126a4K6j87J84j81N09k22o1jj1l1j36J86N8J77j23k55o3J43m7k42J01J78r7k25
1150c34M40j99N4L5j64k6K0R5J7m2Q4K07n3j93J01Lq8p9j9J03j32K64m8k98L37
1175H5k63L01N1l44K6KJ42Q0J5j8k1j74N3N0n9k40K51J87j51J03o6O1n4L8q0J76
$$ plain form
1201 151 -34 -181 -243 -58 -86 -4 79 -2 61 -13 54 -49 84 -196 59 -13 -162 -89 -315 32 -225 -26 46 -323
1225 -323 -79 -114 -209 149 10 157 7 -65 130 99 -143 -145 -47 21 25 -64 -134 -115 -17 -61 91 40 -123 -250 -110
1250 -110 -49 125 110 183 34 -129 -37 -56 -262 4 -68 -66 -45 93 -43 73 112 75 -66 73 172 -15 98 -54
1274 -54 -118 66 -223 223 -105 33 -35 -109 -168 -17 187 -26 96 165 -199 170 45 -51 -277 -33 8 99 8
1297 8 -84 224 -109 -43 51 291 45 -270 14 251 80 23 170 151 69 19 103 133 79 97 -315 82 29 83 -36
1322 -36 23 -132 -97 139 99 207 115 -97 19 -273 -82 105 108 -49 -33 116 188 -197 -213 29 231 62 -178
1345 -178 144 90 -99 -216 151 17 39 97 -82 66 22 266 -146 -87 -92 156 88 135 150 78 262 -34 159 -65
1369 -65 73 -28 207 -89 195 -9 -96 -69 166 94 20 69 -66 -146 -98 324 45 116 3 177 -149 -44 53
$$ packed form
1201A51j85j47o2J85k8Q2Q3q1O3p4O7j03J33k80K55p2j49P3k26L47k57J99P2l69
1225c23K44l5r5L58j39J47j50p2J95l1k42kR8O8Mq9p0J9R8m4J52n1j63j27J40
1250a10O1J74j5P3j49j63R2j9k06K66p2KK1J38j36J16L9l7j41J39R9j87J13j52
1274e4o4J84k89M46l28J38o8p4n9J51K04k13J22O9l64L69j25r6k26K44M1R1r1
1297Hr2L08l33O6R4K40k46l15K84K37j71n7J47j9q2n0Q4L0n4J8m12L97n3N4j19
1322c6N9j55L5K36m0J08r2k12J16k92J91J87Lj57J6J49P2l85j6K42K02j69k40
1345a78L22n4j89j17L67j34K2N8j79J48m4K44m12N9nK48o8M7J5p2J84k96J93k24
1369f5J38j01K35k96K84k04q7K7K35p2p4M9j35q0M8M22k79P1j13J74l26J05R7
$$ plain form
1392 53 -8 411 189 -192 145 215 128 166 -106 17 40 -150 67 183 131 -197 -55 -188 -110 -115 58 253 -100
1415 -100 -24 -89 185 -106 262 46 51 -85 -73 107 216 12 -142 86 -78 128 -112 -76 39 -76 199 -46
1437 -46 37 58 17 324 -163 178 -116 -71 94 179 47 160 83 84 28 -66 -67 8 -180 37 22 -28 -61 -129 192 25
1463 25 -181 157 17 -168 156 -84 -16 -86 -377 -178 -14 168 199 -112 -156 300 184 3 10 -120 -99 -37 -43 -67
1487 -67 134 -131 88 96 -206 180 46 -158 -141 -93 -32 -98 224 7 -146 145 90 -133 -120 64 29 89 -12 -148
1511 -148 -33 -92 -263 -22 146 -29 96 -47 207 -191 55 45 -29 -223 -62 -43 137 -28 -108 -324 121 215
1533 215 -43 -146 -121 -198 190 84 194 -77 -24 159 -52 299 -147 218 29 -149 -6 -120 66 -138 -12
1554 -12 85 29 178 379 40 -19 -71 113 197 -149 -92 28 126 -30 -30 98 50 7 -69 -263 132 -27 -111 116 -113
$$ packed form
1392E3o1M19k22l81L37P0q7L8k72J23K3j90K17J16n2l28J42j33P8nJ73J95l53
1415a00P6o5K74k91L68k16Nj36J2J80J09k04j54K28j64K06k40L6J15j15K75k45
1437d6Q3K1m1L07m87L41k94M5J65Q5j32J13p7Jn6r4jP5j88K17j5n0l3o8L21j67
1463B5k06L38j40j85L24k40O8p0k91J99J64J82L1l11m4M56j16j81Pj30K1O2ok4
1487f7K01k65K19Ql02L86j34k04J7M8O1o6L22k17j53K91n5k23J3J84l5O0j01j36
1511a48J15n9j71K41J68j75J25j43K54l98K46j0p4j94J61J9J80j65q0k16M45R4
1533B15k58j03K5p7L88j06J10k71N3J83k11L51m46L65j89j78J43j14J86k04J26
1554a2R7n6J49K01l39n9n2J84Q4l46N7J20R8j56%J28m8m3p6j94L95j59q4K27k29
$$ plain form
1579 -113 -224 59 59 -70 -292 -74 -59 -135 -83 137 -36 -83 163 -118 -258 212 -102 -101 201 -54 403 -11 102
1602 102 189 73 -51 10 -68 28 -172 180 64 203 59 -60 -57 -90 171 153 -100 198 82 -71 -311 -48 149
1625 149 20 -9 -47 55 -20 -44 -258 102 133 -34 141 142 -337 -182 71 -219 88 -115 136 153 -27 -56 -255
1648 -255 -3 -158 -99 36 95 46 -110 -107 22 -212 -87 -103 -213 97 13 124 119 -160 -56 129 61 -13 -49 30
1672 30 -33 154 7 -289 -88 -260 57 156 291 -147 105 154 10 -50 180 249 56 -111 44 99 -134 -1
1694 -1 -49 70 -61 -15 68 32 195 158 129 415 -99 -102 88 31 263 83 56 175 71 219 -152 -110 31 -77
1718 -77 86 169 165 258 -200 -253 162 37 -44 177 -44 -2 -146 177 2 62 -33 110 -84 -68 -101 -20 189 -73
1742 -73 -47 -84 166 118 -132 30 188 180 -54 -87 71 -38 -73 -101 -24 148 -165 -11 -225 34 69 -91 94 -224
$$ packed form
1579a13j11K83%j29k22K18J5p6N2K20j73m7K46k81j40M70l14JL02k55M57m14J13
1602A02Q7j16j24O1p8R6k00L52j16J39j44j19Ll3K61j8k53K98j16j53k40K63J97
1625A49j29k9l8J02p5k4k14L60L1j67J75Jm79J55K53k90L07k03K51J7j80k9j99
1648b55K52j55N9J35N9m9j56LJ29k34J25j6j10L10q4J11nk79J04J85o8p4l6P9
1672C0o3J87j47k96K01j72L17R9J35m38K52M9j44o0K30O9j93j67J55N5k33J33
1694am8J19j31M6Q3l6J63l7k9K86n14lJ90n7K32j80k7J19j04J48l71M2J41j08
1718g7J63Q3mR3m58n3M15j25q1K21k21M2j44L23j75O0r5J43j94J6l3Q1K09k62
1742g3K6l7K50m8k50J62J58qk34l3J58j09l5k8P7J72l13J54k14K59L5j60J85l18
$$ plain form
1766 -224 -100 210 -1 -149 109 5 18 166 68 -47 -289 106 53 131 -39 151 26 -144 84 39 48 15 -58
1789 -58 -17 40 -57 -29 -201 22 13 -26 94 60 -217 78 -241 -212 256 -111 152 56 98 -110 185 165 76 202 139
1814 139 -215 -48 60 66 -170 -44 80 150 -21 89 65 -183 -18 149 42 -223 -10 -111 -92 47 -143 152
1836 152 134 -27 -61 189 -133 -68 -106 -137 -3 -186 -157 173 60 -194 21 -54 13 217 -55 -18 50 -140 -150 143
1860 143 170 39 -8 102 -65 -15 92 159 36 -131 -322 47 -49 -88 -201 -29 -103 -45 -206 -51 -39 -28 -12 4
1884 4 -37 -158 -185 10 364 -87 29 -322 -192 -245 -142 0 -10 -107 -134 -34 -28 -28 20 -107 -12 -60 -195 -199 106 70
1910 70 -112 -117 83 59 -36 184 102 -53 60 -174 67 186 115 103 -184 254 -37 -281 25 133 -29 186 -14
1933 -14 -11 141 63 270 -107 -15 -29 -43 -119 -132 162 -36 -14 0 102 107 99 -83 2 -281 -359 -139 249 85 246 -152
$$ packed form
1766b24J24L10k11j48K58j04J3J48r8j15k42L95n3P8j70J90j25j70K28m5Rl3p3
1789e8M1N7r7K8j72K23rl9J20l4k77K95l19K9M68l67K63r6M2k08K95k0q9J26o3
1814A39l54J67J08Ok36J26J24P0j71J10k4k48J65J67j07k65K13j01J9J39j90K95
1836A52j8j61l4K50l22O5l8l1J34j83K9L30j13k54K15p5O7K04k72L7O8j90j0K93
1860A43K7j31m7J10j67N0J07O7j23j67j91L69r6l9j13J72p4N8j61J55J2J1J6J6
1884Dm1j21k7J95L54m51J16l51J30n3J03J42j0r7k7J00O%M8j27R5m8j35mL05l6
1910G0j82nK00k4r5K20q2j55J13k34K41J19p1j2k87M38k91k44L06J08j62K15k00
1933a4LJ52p8K07l77R2j4j4p6j3K94j98K2J4J02Nqj82Q5k83p8K20L88j64J61l98
$$ plain form
1959 -152 -39 -284 69 -64 136 -62 -85 33 -83 45 -9 -9 119 -27 -69 -151 115 170 -206 143 225 20 7
1982 7 275 89 71 -170 -8 -103 -134 347 60 -115 -62 -39 -190 -16 4 -54 16 94 -118 -37 97 -172 22 -21
2006 -21 132 -24 -29 -98 -70 22 12 49 6 9 -228 19 -7 218 165 273 -120 -273 113 -8 -203 -103 -121 40 115
2031 115 -182 -281 25 -109 125 -46 27 -88 61 25 -71 183 57 -109 -11 -121 110 -229 -35 -147 -46 -44
2053 -44 -27 54 -54 -104 -199 -60 -55 -118 -31 -15 169 1 24 150 -51 -132 -3 -192 160 144 120 77 137 108 -211 150
2079 150 -115 -364 -62 155 -139 96 -96 94 57 161 143 22 -183 8 220 -165 -97 -171 -316 -113 122
2100 122 -113 -61 39 113 105 82 55 155 170 -30 -73 103 -47 258 -101 -58 -14 62 90 101 -68 -25 113 3 -6
2125 -6 -134 179 -76 -26 -68 36 -118 59 -32 -136 11 -45 124 152 93 -34 58 41 33 -43 -163 -167 206 -188 -180 -6
$$ packed form
1959a52J13k45L53j33K00j98k3J18j16J28n4%J28j46m2q2K66N5l76L49Q2k05j3
1982GK68j86j8k41J62r5l1M81k87j75N3K3j51J74K0n8P0P8k12Q1J34k69J94m3
2006b1J53j56no9K8R2j0L7m3Lk37K47k6K25n3J08l93j53L86j21j95J00j8J61P5
2031A15k97r9L06j34K34j71P3j15J49l6r6K54j26j66R8j10K31l39J94j12J01K
2053d4J7Q1j08n0r5J39No3Q7J6J84j68K3J26k01q1J29j89L52j6k4m3O0k9l19L61
2079A50k65k49L02K17k94K35j92J90l7J04j8j21k05J91K12l85O8p4j45K03K35
2100A22k35N2J00P4qk3k7J00J5k00m3J76j50L05l59M3M4P6K8J1j69M3J38j10r
2125fj28L13k55N0m2J04j54J77r1j04J47n6J69K8n9j27R2j7qp6j20mL73l94QJ74
$$ plain form
2151 -6 118 -61 -96 -189 26 -91 269 65 -63 180 106 277 -64 55 -76 177 52 -84 -149 218 125 -51
2173 -51 -6 119 114 22 -139 40 -12 97 78 54 -306 254 92 114 84 -69 118 103 7 20 93 198 -138 -108 -160
2198 -160 -5 -153 2 -67 1 -131 57 183 142 -140 172 -101 124 233 -42 -196 -87 74 141 109 103 15 189
2221 189 -35 101 -238 -90 63 -183 25 0 154 -12 -44 -196 97 -68 62 96 23 -36 -203 240 236 130
2243 130 14 153 -21 -32 7 -7 90 28 -246 130 -168 -77 -151 107 -42 -62 -200 42 -20 91 69 -71 -44 -96
2267 -96 -153 -52 26 -106 -32 -14 -128 -114 -166 -56 -63 53 118 -15 94 132 263 174 -83 47 -25 -119 -23 53 35 120
2293 120 89 187 -424 -380 -38 -46 -240 -26 -33 -106 -192 -126 283 -119 -278 41 62 -13 37 49 71 222 -242 -65 160
2318 160 58 -65 -69 47 192 -51 -73 -65 6 -80 -103 -100 -52 -21 204 81 9 -88 26 -122 -138 -43 -338 15 48 109
$$ packed form
2151fJ24j79l5r3K15j17L60k04j28K43p4J71l41J19j31K53j25j36o5L67r3j76
2173e1M5J25nr2j61J79n2J09j9k4l60N60j62K2l0j53J87j5r6J3P3J05l36L0n2
2198a60J55j48J55o9O8j32J88J26m1k82L12k73K25J09k75j54J09J61O7l2oq8J74
2221A89k24J36l39J48J53k46K08k5J54j66l2j52K93j65J30L4p3n9j67M43mj06
2243A30j16J39j74j1L9j4R7o2k74L76k98R1p4K58j49k0j38K42o2J11k2j40K7n2
2267i6n7J01P8j32P4J8j14J4n2J10pJ16O5j33J09L8J31q9k57J30p2r4R6P6j8Q5
2293A20l1R8o11M4L42qj94K14pp3q6O6M09m02j59L19K1p5N0J2K2J51m64J77K25
2318A60j02j23mJ16J45k43k2QP1q6k3LM8L1K25j23p2r7J14j48j6R5k95L53L3O1
$$ plain form
2344 109 -74 24 37 -92 -126 48 -4 -31 65 -14 -247 95 -77 21 -183 -20 -18 144 -12 -79 -115 130 -16 18
2368 18 75 -78 70 -83 -77 -58 -36 -213 3 -52 93 -108 -5 -288 10 -26 15 -11 -199 -228 -127 -62 -37 116
2392 116 -110 151 -243 65 57 -13 -163 -69 76 19 -187 67 -37 -80 -6 -46 51 181 -183 -356 -29 86 54
2415 54 -203 -317 104 273 128 106 269 -1 -95 -142 233 10 11 -99 -110 97 95 -137 -266 -35 8 -137 -90 161
2439 161 -109 42 244 104 -251 35 259 -190 136 45 296 83 -171 -25 -66 193 181 95 98 240 -10 -132
2461 -132 100 117 -103 65 33 174 -78 -378 -232 75 56 -113 205 75 75 138 153 -246 197 51 125 137 -134
2484 -134 -53 -142 -119 153 38 136 -44 -96 -115 -9 48 165 -161 192 40 291 142 56 6 113 330 155 -114
2507 -114 -144 0 -124 -68 74 35 214 75 12 -25 16 299 -212 -124 -88 123 -102 88 -331 7 -177 -71 103
$$ packed form
2344A09j83R8J3j29l4J74n2k7R6p9k33L42j72R8k04J63KJ62j56o7l6K45j46L4
2368A8N7j53J48j53OJ9K2j77K16n5J45k01J03k83K98l6M1k6j88k9J01O5K5J53
2392A16k26K61l94L08qp0j50R4J45n7k06K54j04m3P4m0R7J30l64j73L27J15l2
2415E4k57j14M21J69j45k2J63k70r4m7L75k23Jj10j1K07kk32j29K31M3j45M7K51
2439A61k70J51K02j40l55K86K24m49L26r1K51k13k54J46m1K59j2q6LJ42k50j22
2461a32K32J7k20J68l2J41k52l00J46L07j9j69L18j30%O3J5l99M43j46P4J2k71
2484a34Q1q9K3K72j15R8j80n2j9J06N7J17l26L53j52K51j49q6n0J07K17j75k69
2507a14l0J44j24N6J42l9J79j39o3l7M1K83n11Q8L6K11k25J90m19L38j84J06J74
$$ plain form
2530 103 -213 -164 115 21 -112 -111 60 -23 -70 189 -90 -47 -74 165 -174 -124 224 103 37 -40 -178 248 -36 -5
2554 -5 -41 89 24 -108 -145 -164 195 -53 -26 21 -109 -278 106 -136 106 63 -249 -104 46 171 -266 295 142
2577 142 -96 -74 181 -56 -198 213 -85 -171 -51 -116 29 -61 -53 184 -24 -59 -89 -179 -228 -96 -106 -24 229 0
2601 0 -237 -31 -76 -31 -51 -27 152 55 39 -38 -121 208 207 -76 -116 -45 -80 30 181 59 -95 5 -7 140 17
2626 17 -38 83 -119 -64 -329 97 253 153 -291 34 93 -336 -180 360 -33 193 63 -68 -35 162 -200 -365
2648 -365 129 54 -99 -143 -64 -163 133 342 93 4 -86 23 136 -94 -242 -47 166 -52 -94 -182 137 -22 -54
2671 -54 -197 -250 128 -204 -19 211 -151 167 -157 -22 -276 -74 58 -172 -134 178 97 -155 -115 52 -101 -143
2693 -143 -106 -146 -218 61 -67 -138 266 39 -103 -346 -89 -100 83 -5 284 -86 -154 65 29 158 -7 168 -165
$$ packed form
2530A03l16M9K79r4j33JJ71q3m7K59k79M3k7K39l39N0L48j21o6p7j38M26k84L1
2554el6J30o5j32l7j9L59k48K7M7j30j69L84k42K42m3l12J45J50J25m37N61j53
2577A42k38K2K55k37j42M11k98q6J20o5J45r0QK37k08l5l0r0m9J32j0Q2K53k29
2601@k37K06m5M5k0K4J79r7j6p7q3L29jk83m0P1l5J10J51j22j54J00j2J47j23
2626A7n5J21k02N5k65M26J56j00m44L25N9m29J56N40l93K26j30j31L3J97l62j65
2648c65M94p5j53m4P9r9K96K09k49q9r0J09J13k30j48J95K13k18m2q8L19j59l2
2671e4j43n3L78l32J85K30l62L18l24J35k54K02J32k30L8L12q1k52M0J67j53m2
2693a43L7m0p2K79j28p1M04k27j42k43K57j1J83q8K89l70o8K19l6J29j65J75l33
$$ plain form
2716 -165 215 60 -46 37 -55 -36 77 -126 -16 64 -87 -60 -82 -214 -178 -88 159 105 23 163 117 -35 -309 187
2740 187 -118 -56 -98 218 -15 -51 96 -215 -21 18 -11 44 -115 98 -281 -102 -252 -33 127 69 -69 185
2762 185 -34 128 89 -127 -13 -88 71 72 -106 33 154 160 -158 86 333 -68 -47 -61 -304 29 149 123 131 121
2786 121 248 64 188 -81 59 72 -31 19 111 147 52 -45 137 49 -183 233 110 71 -59 117 -252 -97 58
2809 58 -199 248 120 -26 245 -19 -22 -142 72 265 -9 -178 -126 158 -18 167 10 38 -80 -75 153 221 -92
2832 -92 -108 -49 196 192 -77 183 222 -175 5 -124 76 42 -100 34 -203 121 208 -11 -54 -244 153 -150 -6
2855 -6 109 -151 8 -168 123 68 110 -128 58 -233 -214 -53 45 253 -113 -98 213 83 2 -266 3 171 45
2878 45 -91 -92 -102 23 -96 -38 -170 -121 132 -64 -123 -64 -9 -196 15 -64 230 -120 127 -129 -88 -236 -11 -93
$$ packed form
2716a65L80j55j06Q3r2J9J13k03J10Q0j51K7k2j32L6R0K47n4q2J40m6j52k74M96
2740A87l05O2m2L16k33l6J47l11J94L9k9N5j59K13l79J79j50K19J60n8j38K54
2762A85k19J62l9k16J14p5J59Jj78J39J21Ol18K44K47m01K1j4k43L33J20k6Qj0
2786A21J27j84J24k69J40J3j03N0R2L6r5r7J82q8k32M16j23l9j30J76l69J55J55
2809E8k57M47j28j46K71k64lj20K14J93k74j69N2K84j76J85j57K8j18NK28O8l13
2832i2j6N9K45mk69K60L9l97J80j29K00l4j42J34k37L24Q7k19m3j90L97l03J44
2855fJ15k60J59j76K91n5M2k38J86k91J9J61R8K08l66J5L11j30q1k68K69J68j26
2878D5j36jj0J25j19N8j32M9K53j96n9N9N5j87K11p9K94l50K47k56M1j48K25q2
$$ plain form
2902 -93 234 -54 16 -149 -82 77 -324 -13 -149 -79 -88 255 91 -155 117 130 -80 -19 52 69 166 41 207 -96
2926 -96 -59 -253 -71 -1 -141 74 -130 -235 5 -66 353 -8 -107 -45 58 -43 -278 2 -159 -117 -78 26 197
2949 197 90 26 -30 -144 2 -157 -33 -20 179 36 -105 21 -31 -138 -17 36 60 36 -58 181 31 39 -12 11
2973 11 -244 -45 7 -81 -99 230 72 1 -169 -28 89 101 77 -143 -33 -55 169 97 268 -115 -246 152 -57
2996 -57 96 39 -123 102 -391 -6 -63 213 81 99 -172 252 85 -144 74 198 40 -198 -29 74 236
3017 236 -11 156 -60 -162 -29 -10 100 -140 153 31 -203 -3 55 -214 -155 -102 112 186 -61 43 51 99 -30
3040 -30 -62 -200 -43 -61 11 -164 -131 -9 -95 69 235 45 22 262 -119 62 -147 -50 87 91 79 -55 21 -70
3064 -70 305 -228 -267 -76 202 -186 -127 36 -27 95 -57 -60 18 61 -56 130 -21 -46 -6 0 283 92 146 6
$$ packed form
2902i3L27k88P0j65O7J59m01L11j36P0rL43j64k46K72J3k10O1P1J7R7j25J66l03
2926i6L7j94J82P0j40K15k04j05K40p1M19l61r9O2J03j01k35K80j61M2L9J04J71
2949A97j07o4n6j14J46j59J24J3J99j43j41J26n2j07J21N3K4k4r4K39j50Qn1K3
2973A1k55J99N2q8j8L29j58p1j70J41J17J2k4k20J10k2K24p2J71l83j31L98k09
2996e7J53n7j62K25m93L85n7K76j32J8k71M24j67k29K18J24j58k38J69J03J62
3017B36k47J67k16j02J33J9J10k40K93j22k34K00N8k69N9N3K14P4k47J04QM8j29
3040c0l2j38J57j8P2j75L3J22q6J64J66j90k3K40l81J81k09R7J37Mj2j34P6r1
3064g0L75n33l9J91K78l88N9J63o3J22j52lP8M3j17J86j51k5M0OK83j91N4j40
$$ plain form
3088 6 87 -20 258 159 172 -38 -36 166 15 -77 -267 -43 135 141 -78 133 109 -172 284 97 -153 -117 189 58
3112 58 -162 -7 -83 -129 39 -83 -29 28 -209 65 78 76 -135 279 147 34 -189 -180 134 -19 -56 62 24 143
3136 143 98 102 82 -136 -97 201 -164 68 182 -205 -51 -100 -112 -96 59 -64 -103 7 64 -50 -94 -14 -60 114
3160 114 -157 23 310 -148 200 -290 16 22 196 -32 -148 113 -124 0 63 185 -146 -165 -129 -126 -7 -215
3182 -215 -31 -144 72 -14 -11 -104 -85 34 27 68 98 -135 -142 25 8 101 -143 72 -8 169 -81 -21 198 -72 -52
3207 -52 48 -294 36 46 56 154 -203 -36 10 -29 180 176 -14 48 -39 -149 -96 -131 -48 22 -30 61 -85 57 -219
3232 -219 46 -209 131 86 205 -73 43 21 -31 105 -179 80 125 80 127 -34 -105 218 68 79 -118 -24 -65
3255 -65 -91 -114 -48 102 170 -15 161 -77 -25 -107 196 -73 118 267 -118 -82 -21 277 -14 -187 -199 101 -78
$$ packed form
3088FQ1j07K78r9J3k10KK02j51r2j90K24J78Ok19K11k4k81M56j87k50L6L06j31
3112E8k20J55p6m6J68j22N4N7k37K74J3kk11M14j32j13k23RL14j53l7J18l8J19
3136A43m5Mk0k18L9K98l65K32J14l87J54m9j2J6J55j23l9J10N7j14m4Q0m6J74
3160A14k71J80K87m58L48m90L06OJ74k28j16K61k37J24O3J22l31j9L6LJ19k08
3182b15J84j13K16q6Lr3J9J19pM1L0k33pJ67j7R3k44K15q0J77k50O0K19k70K0
3207e2J00l42L30J0J0R8l57J67M6l9K09mj90O2q7j10N3l5Q3P0n2R1j46J42k76
3232b19K65k55L40m5J19k78J16k2n2J36k84K59M5m5M7j61p1L23j50J1j97R4m1
3255f5k6k3O6J50O8j85J76k38N2q2L03k69J91J49l85L6O1K98k91j73j2L00j79
$$ plain form
3278 -78 -11 119 -130 74 -80 208 -105 132 -118 -54 -95 218 -138 99 -19 131 -68 -20 -249 113 -172 -5
3300 -5 41 269 170 -75 -77 64 -6 114 118 23 -138 24 -40 76 -122 -155 156 108 107 104 -124 101 -188 82 72 161
3326 161 186 276 -128 -272 -25 0 79 88 -33 -43 84 209 -173 -156 -44 -86 -50 284 4 -1 11 -108 -88 202 -111
3351 -111 -129 -123 87 83 -303 -110 -160 146 177 -18 138 191 -86 -175 -313 -83 8 178 100 189 38 26 66 12 -85
3376 -85 -24 103 21 77 -236 -116 93 -46 -3 14 -52 160 53 137 -125 147 54 44 115 41 -153 169 2 -135
3400 -135 123 37 106 251 -47 160 -38 127 89 -99 128 151 83 38 -132 70 0 -212 -6 -302 79 -20 -173
3423 -173 62 157 33 120 398 91 -5 -125 -182 59 -106 -82 -102 -2 -55 151 40 51 44 -16 174 -78 25 311
3447 311 -97 268 -7 32 -220 112 -11 -149 -155 -105 103 157 -9 -6 29 287 -263 -335 -31 -198 74 -36 149
$$ packed form
3278g8O7J30k49K04j54K88l13K37k50O4m1L13l56K37j18J50j99M8k29L62k85J67
3300eM6K28r9k45kJ41p0J20Mr5j61J62o4J16j98l3L11m8jlk28K25k89K70j0Q9
3326A61K5R0m04j44K47K5P9Rj21j0J27J25l82J7J12m2L6L34k80nJ2j19K0K90l13
3351a11j8OK10ml86J93n0L06L1j95J56N3k77q9j38K30R1J70p8Q9j51j2M0n4r7
3376h5O1J27q2N6l13J20K09j39M3J7o6K12j07Q4k62K72r3j0P1p4j94L22j67j37
3400a35K58q6O9J45k98K07j98J65l8j88K27K3o8m5j70K02p0k12K06k96L81r9j53
3423a73K35R5j24Q7K78l07r6j20n7K41j65K4k0J00n3K06j11J1po0J90k52J03K86
3447C11m08L65k75L9k52L32j23j38oN0K08N4j66LL5K58n50p2L04j67K72j10J85
$$ plain form
3470 149 175 231 -143 39 114 -76 -269 213 -94 -95 -47 -141 44 -173 -19 -118 -185 -5 -7 12 -47 -61 40 57 213
3495 213 17 55 -28 -13 -110 -27 -72 -84 22 -159 166 87 201 29 55 -11 -243 -30 -119 -102 -37 132 -51 97
3519 97 -173 -28 -108 -87 142 -61 -221 19 209 58 -72 6 -52 -11 -36 154 323 -107 -13 -5 -90 115 -237 151
3543 151 -107 199 -89 -84 207 50 35 -206 70 -166 -113 -129 -16 -68 49 281 -71 -192 43 -20 -104 128 -40
3566 -40 -12 -7 -162 94 -95 14 51 202 -238 36 -123 -210 132 -30 252 -178 69 220 119 -54 29 4 24
3589 24 87 51 0 -33 80 65 -243 61 101 -32 -192 114 88 -47 -157 129 -70 -35 -44 -64 117 -5 -55 37 -111
3614 -111 -208 96 -54 -48 -46 -128 -12 -185 -51 38 71 -20 50 -7 -80 -106 49 139 -304 -46 -115 16 123 52 247
3639 247 109 258 -144 90 -45 44 -116 161 100 -26 98 180 -133 180 -29 -48 64 -73 -10 -220 -37 133
$$ packed form
3470A49K6N6l74J82P5j90j93M82l07jM8r4J85k17J54r9o7J80kJ9n9j4J01J7J56
3495B13j96L8q3J5r7Q3m5j2J06j81L25p9J14j72K6o6k32K13q9J7O5J69j83J48
3519I7k70J45q0K1K29k03j60K40J90j51j30P8n8M1k5J90J69m30R4Qq5K05l52L88
3543A51k58L06k88NK91j57j5k41K76k36N3j6J13n2J17K32l52j21K35o3q4K32j68
3566d0K8Nj55K56j89J09L7J51m40K74j59q7L42j62K82m30K47J51j01j73Q3k5K0
3589B4O3l6n1l3J13j5l08L04M0j33j60L06k6j35j10K86j99L5rk0J81j22n0R2j48
3614a11r7L04j50OKq2J16j73J34Q9L3r1P0n7p3k6J55R0m43K58o9J31J07p1J95
3639B47j38J49m02K34j35Q9j60K77o1j26J24Q2l13L13k09j9J12j37O3k10J83J70
$$ plain form
3661 133 52 -9 47 -150 87 47 126 -191 108 39 -85 146 -80 194 -73 -70 26 -79 -88 -308 38 20 -29 -83 -84
3686 -84 8 228 -32 134 -32 -254 12 32 -242 -138 -10 -64 164 -104 69 76 -39 -202 41 -116 -47 123
3708 123 186 22 64 13 6 -83 -10 182 237 259 -59 74 -177 -100 22 -62 -228 125 -73 28 68 -55 -45 -81 0
3733 0 51 -37 31 117 -138 195 297 -82 7 72 345 201 -236 -215 5 -22 98 -89 -206 -62 29 196 -53 1
3757 1 -13 -6 21 97 74 -35 212 -10 20 94 -51 20 -181 76 154 22 -65 -93 65 184 156 -20 80 9 132
3782 132 -121 80 50 51 49 20 -97 2 -118 71 43 115 216 -21 -124 233 -84 139 -65 60 50 -25 173 14
3806 14 141 -132 -36 252 -132 -98 145 109 116 143 114 -64 -138 68 -18 117 71 -217 -252 -275 -131 5 -30 -93 233
3831 233 -190 74 -116 291 -59 -261 46 -126 4 -102 279 -103 -197 46 -110 293 -35 44 182 144 -67
$$ packed form
3661A33q1o1N6j97K37m0P9l17K99o9j24K31k26K74k67LR6j05rk20L46j8m9n4j
3686h4R2K20k60J66j66k22K66K0k74J04J28n4K28k68J73Pj15j63K43j57O9J70
3708A23O3j64M2n1pq9P3J92N5K2l18J33k51P7J22q4j66L53j98J01M0j23J0l6Q1
3733@N1q8O8Q6k55L33J02l79Q9O5K73j44m37K1K20k7J20j87j17J44R1J67k49N4
3757Aj4PK7P6k3j09K47k22L0P4j45P1k01K57P8j32q7k8J58J19k8j76J00p1J23
3782A32k53K01l0Jkk9j17R9j20J89k8P2J01k37j03L57l17K23k04J25j0p5J98j59
3806A4J27k73R6K88l84L4K43l6PK7k9j78p4K06q6J35m6k88l5k3J44J36l5o3L26
3831B33m23K64j90M07l50k02L07j72J30j06L81l82r4K43j56M03l28P9J38l8k11
$$ plain form
3852 -67 -108 -67 162 -131 -78 17 57 -122 -39 60 -110 102 -227 40 -36 -84 14 146 48 63 -51 25 -1 45 18 36
3878 36 18 -20 8 33 -59 449 33 127 288 -237 -80 104 -46 14 7 2 -151 -61 295 128 -186 -34 50 54 -46
3903 -46 -98 134 268 108 223 -45 -149 -8 94 25 -18 -36 315 59 -91 -80 -113 -90 -299 -36 -285 -81 157
3926 157 193 -20 -9 58 123 -181 62 -101 155 29 -33 114 71 76 -129 -75 -216 159 10 -82 113 20 -22 75
3950 75 -26 -56 -13 166 10 63 -190 -186 112 138 50 59 309 -209 108 69 197 109 41 34 1 -89 105 -36 -38 -53 -257
3977 -257 199 -52 25 49 127 -312 6 -96 14 90 47 99 86 79 -292 -77 -101 -69 249 254 140 -3 140 -74
4001 -74 -34 275 170 1 126 -101 18 38 219 -68 -29 -97 -16 96 153 -86 1 -196 92 45 -66 80 -195
4024 -195 -86 -78 83 -60 -7 -103 -33 -155 -183 12 -45 -190 -112 -11 16 115 -10 -155 -172 183 308 -149 -123 -294
$$ packed form
3852f7m1M1K29k93N3R5M0j79Q3R9j70K12l29K67p6m8R8J32r8J5j14P6k6M6k7J8
3878C6j8l8K8K5r2N08m16R4J61n25J57J84j50O0pnj53R0L56j67l14J52Q4Mj00
3903d6n2K32J34j60J15k68j04J41J02o9m3j8L51k56j50J1l3K3k09K63k49K04K38
3926A57L6k13J1O7O5l04K43j63K56j26o2J47m3Nk05N4j41L75j49r2J95r3m2R7
3950G5j01l0M3J79j56N3k53MK98K6q8RK50n18L17l9J28q8o8pl3r0J94j41kj5k04
3977b57M56k51P7K4P8m39L18j02J10P6m3N2j3pl71K15k4L2L18Nj14j43J43k14
4001g4M0L09j05j69J25k27J19K0J81k87L9o8Q1J12N7k39Q7j97K88m7j11J46k75
4024a95J09QJ61j43N3r6P0j22k8J95n7j45P8J01K7R9j25j45j7L55J25m57K6j71
$$ plain form
4048 -294 77 248 -79 49 71 92 64 53 47 103 -170 1 71 -91 11 274 -86 -410 249 -56 175 -282 -51
4071 -51 40 -10 -145 84 230 -349 163 207 248 -1 -161 15 -34 141 51 -228 -186 -100 -156 -61 71 -91 113 96
4095 96 -7 -206 56 142 -13 -125 -21 248 7 -165 -70 -68 -248 149 57 -64 -28 -13 -36 -206 79 -124 57
4118 57 -105 -56 -15 -17 72 -108 163 -66 150 72 105 -14 168 -207 -257 -44 133 106 -292 -141 -16 53 -138 135
4142 135 118 181 198 57 -61 -8 109 179 68 113 223 -66 65 -219 -29 -1 -127 28 27 -131 394 53 204
4165 204 172 238 -48 -97 -11 -6 137 -234 155 22 177 78 64 47 -106 -240 57 199 -103 79 -73 -102 -206
4188 -206 171 248 -50 66 127 -60 77 233 -213 216 -128 259 -73 -174 9 -137 -36 130 74 76 30 -23
4210 -23 72 3 26 65 -14 87 122 89 -32 164 133 -43 -145 -14 184 -116 -134 126 26 107 31 -34 146 176 -75
$$ packed form
4048b94L71J71l27J28K2K1k8j1oN6k73J71P0j62J02K63l60l24O59l05K31m57K31
4071e1R1n0j35K29J46n79N12M4M1k49j60J76m9J75r0k79M2Q6n6R5J32j62K04j7
4095I6j03j99K62Q6j55j12J04K69k41j72R5Kj80L97r2j21L6J5k3j70K85k03J81
4118E7j62M9M1kQ9j80K71k29K16p8L3j19J82l75n0K13J77k7l98J51J25O9j91K73
4142A35j7O3J7j41j18N3J17P0j11M5J10k89J31k84J90K8j26J55jj58N25l41J51
4165B04l2O6k86m9Q6NJ43l71L89j33J55r9j4j7j53j34K97J42l02J82j52k9j04
4188b06L77P7k98J16O1j87J37J56m46M29l44L87l32j01J83j46J01J66n6Km6n3
4210b3R5o9K3L9p9J01L5l3j21J96l1j76j02J31J98l00j8K60j00Q1p6o5J80L0k51
$$ plain form
4235 -75 105 -163 -96 144 -31 -91 -109 205 -53 -46 73 92 112 118 197 -16 -19 -1 -119 133 90 -132 -174 181 -11
4260 -11 9 63 66 195 53 352 -66 183 191 -68 -65 65 -41 -36 65 42 -7 -183 103 131 72 132 -30 -135 -119 -234
4286 -234 -83 -53 241 -68 28 162 122 117 9 -83 -303 55 289 39 -10 -94 148 55 1 -56 -55 -24 39 38 -120 306
4312 306 146 7 -150 198 -208 90 -257 -42 -224 -61 199 101 -39 207 0 -39 -84 -14 -95 112 193 80
4334 80 101 179 4 -206 93 -24 -57 -24 -38 -47 -244 112 25 -64 -30 -158 -54 24 10 -212 97 85 41 13 148
4359 148 134 -244 48 -57 30 -12 -61 -150 -8 60 -170 93 -162 -6 -126 114 -142 -62 53 83 21 -185 -56
4382 -56 -49 16 -64 -146 -42 160 34 -77 -171 118 71 -6 237 -4 137 116 36 -65 -49 -36 54 -142 47 35 -93
4407 -93 -230 88 211 13 -21 -90 9 115 282 194 15 126 -136 20 100 -219 75 -15 37 62 -129 145 -118
$$ packed form
4235g5J80k68O7K40j75o0j8L14k58PJ19J9K0OP9k13lJ8j18K52m3k22m2L55j92
4260a1K0N4LJ29j42K99m18K49Qk59LJ30j06NJ01k3m9j76K86K8n9O0j62j05J6j15
4286b34J51L0K94l09R6J34m0nj08r2k20L58K34k50m9q4K42r3n4n7JL1O3jj58M26
4312C06j60j39j57L48m06K98l47K15j82J63K60r8j40K46k07l9m5P0q1K07Q1j13
4334H0K1P8j75k10K99j17l3L3j4rj97L56q7q9L4j28J04P8j4k22L09j2m4k8J35
4359A48j4l78K92j05Q7m2m9q9J42O8k30K63k55J56j20K40k56Q0J15L0o2k06J29
4382e6PO5q0q2J04K02j26j11r4K89m7p7K43k41J41k1q0j01J6J3R0j96J89j2j28
4407i3j37L18J23j98l4o9R9J06J67q8j79J11k62J56Q0l19K94r0N2K5j91K74k63
$$ plain form
4430 -118 -152 14 -51 -96 139 128 164 -81 217 -196 -36 -42 -194 158 -91 -37 -50 142 55 47 100 212 -116 77
4454 77 1 -90 231 31 232 -196 146 115 -183 24 -77 -130 -172 -169 -12 45 146 159 -318 24 95 -153 -206 18
4478 18 65 121 -34 -48 135 -164 -8 -146 117 -34 69 -63 -97 -181 104 -368 -9 113 -56 24 -5 217 -6
4501 -6 85 -71 152 -302 -168 -181 68 127 162 -166 -217 -158 -45 81 107 -332 85 -138 -56 203 -107 173 96 -41
4525 -41 109 -119 -31 148 -18 116 129 1 34 -95 -98 180 150 -130 -93 72 -265 211 80 -253 -136 282 -4
4548 -4 -134 -93 -84 -64 26 31 -264 -35 -125 -40 22 57 -153 158 185 154 229 68 83 -9 160 138 -242 60 10 -87 -7
4575 -7 -103 -122 33 62 90 -72 -291 4 -178 59 58 128 115 -138 -47 -137 -148 53 18 -99 106 -18 81 45 109 185
4601 185 36 -152 110 25 42 94 -210 111 -72 -129 -123 -18 32 78 25 -169 -157 -97 35 180 44 -87 158 -24
$$ packed form
4430a18l4J66o5m5K35j1L6k45K98m13J60oj52L52k49N4j3J92q7qN3J12l28J93
4454G7p6r1L21k00K01m28L42l1k98K07j01n3m2LJ57N7J01J3m77L42P1k48n3K24
4478A8M7N6j55j4J83k99J56j38K63j51J03j32l4q4K85m72L59J22j69Q0k9K22k23
4501fR1j56K23m54J34j3K49N9L5l28n1N9J13J26K6m39M17k23Q2K59l10K80p7j37
4525d1J50k28Q8J79j66J34J3j28L3j29lK78l0k80L7J65l37M76j31l33J17M18k86
4548dj30M1RK0R0Nk95K29r0Q5O2L5k10L11K7l1P5j61J5r2J69k2l80L02n0r7Q0
4575gr6j9J55K9K8j62k19K95j82K37jP0j3k53R1r0j1K01l5j17K05j24R9l6O4P6
4601A85j49j88K62q5J7N2l04L21j83n7OJ05N0M6n3j94J2O0J32J45j36j31K45j82
$$ plain form
4625 -24 83 -107 -5 -148 -77 -40 -43 -85 -123 43 79 -24 -209 140 -25 -211 -100 165 79 171 -107 -62 -133 55
4649 55 77 44 69 -79 -92 134 0 -154 214 -137 181 194 50 -108 -11 99 47 -11 44 86 -159 -186 -72 -159
4673 -159 184 -222 -173 -233 -14 7 124 98 274 87 372 -102 89 -4 153 -38 -11 -114 -173 358 145 -231
4695 -231 -53 -107 -52 43 95 92 10 221 -131 35 -98 104 126 -64 -97 -93 -105 68 198 165 -51 6 67 25 102 -42
4721 -42 110 -68 -168 -84 -20 -44 84 140 -167 48 146 192 -73 -53 -180 69 160 -135 7 24 -201 63 277
4744 277 386 -36 -112 90 -88 -120 -191 -17 -65 278 96 -203 -73 63 -76 -167 -20 -123 79 -12 274 56
4766 56 253 247 295 -153 -165 278 -47 -206 120 233 -265 8 -159 19 91 103 88 18 -280 -122 59 -12 76 -11
4790 -11 66 60 69 49 -1 54 -35 276 79 -173 -29 238 94 176 156 101 -143 142 17 -27 -90 50 -159 -191 -51
$$ packed form
4625b4J07j90J02j43P1L7lm2l8J66L6j03j85L49j65j86J11K65q6R2k78M5p1J88
4649E5K2l3K5j48j3K26j34j54L68l51L18J3j44j58R7J10n2n8N5M2k45k7J14q7
4673a59L43m06M9o0K19K1J17k6J76j87K85m74J91r3J57j91K7j03n9N31k13l76
4695b31J78n4N5R5N2lq2K11l52J66j33K02K2j90l3Mj2J73J30l3k16N7O1m2P7j44
4721d2J52j78j00Q4O4k4J28N6l07K15R8M6k65K0j27K49R1k95J42J7k25K64K14
4744B77J09m22p6K02j78l2p1J74m8L43j82k99J30J36j39r1J47j03K02r1K86k18
4766E6J97oM8m48j2M43l25j59L26J13m98K73j67J78P2J2j5p0k98J58J81p1Q8q7
4790a1P7oRk0n0N5q9L11j97k52J44K67j44Q2k0n5k44K85j25m4o3J40k09l2J40
$$ plain form
4815 -51 -167 -123 106 -85 -321 97 70 177 -23 72 77 26 12 232 -111 -292 -273 -41 53 12 225 108 151 -340
4839 -340 -112 -45 37 -60 -10 -88 32 -2 -102 407 240 76 99 354 -51 -65 104 -78 182 -68 194 125 -17
4862 -17 -142 -77 239 82 -134 44 -6 58 -159 -114 31 102 96 139 -57 23 -1 -79 -232 4 -21 61 -5 -167 -244
4887 -244 -9 57 28 -365 279 29 -74 80 123 -214 67 171 -57 -107 127 8 240 158 10 29 65 60 -115
4910 -115 -13 36 -44 153 -110 0 -26 41 34 31 42 -6 114 82 113 -53 168 -62 145 -28 200 73 39 -28 -152
4935 -152 29 -34 6 -138 -161 -224 -12 70 25 68 200 -234 3 65 -38 20 -40 71 96 -75 -36 34 152 -15
4959 -15 -63 82 -42 -41 -70 270 13 -46 139 157 -112 -34 77 175 -141 121 84 -118 19 179 -39 168 137 39
4983 39 77 -25 249 -104 61 -58 -91 -46 267 -129 -229 31 -132 -82 -305 -99 -43 150 42 -223 -1 -118
$$ packed form
4815e1j16M4K29j91k36M18k7J07k00R5Nn1j4K20l43j81J9K32R4m1K13j17M3m91
4839c40K28O7Q2r7N0p8J20l4j00N09j67j64K3K55m05j4J69j82K60k50K62o9j42
4862a7j25O5L16j57k16J78n0O4k17M5J45P1oM3j96Q0k4p8j53K36k5Q2o6j62p7
4887b44K35O6k9l93O44k50j03J54M3l37K81J04k28n0K34j19K32q2j48J9L6nj75
4910a15J02M9q0J97k63J10k6O7plJ1m8J20l2L1j66K21k30K07j73K28j27l4o7j24
4935a52J81o3M0j44k3o3K12Q2m5M3J32m34K37O2j03N8o0J11K5j71L9P0J18j67
4959a5m8J45j24Jk9L40k57n9J85J8k69P8J11R8l16K62l7k02J37J60k18K07l1r8
4983C9L8j02K74l53J65j19l3M5L13l96j00K60j63N0k23K06N6J93j08k65K22j17
$$ plain form
5005 -118 12 -296 30 184 62 -122 -3 111 -282 -41 -146 60 -130 -3 -145 -3 81 -47 169 293
5025 293 -92 -139 0 141 69 -239 -68 18 -118 0 84 94 -71 54 -139 -17 80 27 -135 -181 -43 -101 -42
5048 -42 270 -66 125 64 25 238 -208 68 -163 -76 -38 -51 74 21 176 -60 -44 -9 106 -56 -163 204 -28
5071 -28 -66 89 275 -43 -128 -125 98 -133 -110 23 -125 9 57 138 103 -78 -22 116 190 -35 206 181 -80 -239
5095 -239 -70 176 -76 -17 -322 -117 69 195 -109 -42 -54 -322 -137 123 42 -121 -136 244 -1 -44 -178 -244
5117 -244 29 -134 -161 -71 118 -86 -73 -129 6 -63 -18 -180 197 50 -195 -93 43 92 52 23 210 -34 -127
5140 -127 176 -36 299 -80 -14 -104 -74 95 -177 -120 76 174 -138 122 104 225 -32 -11 66 -199 12 -175 -2
5163 -2 -34 6 -227 248 -295 226 -163 301 80 145 -5 -43 -39 48 61 -69 -188 37 -286 139 4 -142 62
$$ packed form
5005a18J30l08L26J54j22j84J19J14l93K41j05K06j90J27j42J42Q4j28K16J24
5025B93l85m7J39J41p2l08J71Q6j36J18Q4J0j65J25j93J22R7n3j62m6J38n8N9
5048d2L12l36J91o1l9K13m46K76k31Q7L8j3J25n3J55k36J6L5J15j62j07L67k32
5071b8l8J55J86l18q5LK23k31K3J33j48J34M8Q1l5j81N6J38P4k25K41k5k61j59
5095b39J69K46k52N9l05K05J86J26l04O7j2k68J85K60q1j63j5L80k45m3j34o6
5117b44K73j63k7R0J89k04J3n6J35o9M5j62L77j47k45J02J36M9m0k9J87k44r3
5140a27L03k12L35l79O6r0L0J69k72N7J96R8l12K60j8J21k57K1P7k65K11j87J73
5163bl2M0k33M75n43N21l89M64k21O5j50l8MQ7J3j30j19K25l23M25j35j46K04
$$ plain form
5186 62 -46 100 -4 -55 51 -47 -227 -156 -41 -70 -43 -87 -93 0 182 32 91 53 40 370 -120 143 253 75
5210 75 -139 60 70 -60 -229 -285 303 16 4 -128 -214 -59 -129 106 -191 -53 -224 -29 -90 -28 -62 82 -17
5233 -17 -185 12 134 8 92 189 90 -101 -146 -26 210 -107 -1 206 251 6 191 60 -157 -190 -140 -124 60
5256 60 123 63 21 -292 -133 -40 43 239 68 -51 100 -235 -89 64 -100 19 319 -55 20 -14 232 31 96
5279 96 30 -32 -28 -146 0 -57 -97 -294 -92 76 5 -125 -53 201 179 180 -182 -224 -261 144 -181 -169 22 -126 -37
5304 -37 0 -109 -72 -286 -261 -186 132 -196 123 -160 14 -153 92 -45 -22 101 -38 -109 12 -101 -56 -111 -335
5327 -335 -191 -26 -97 106 -34 42 62 -95 -126 -95 19 -162 -22 39 108 77 46 -60 110 -196 -49 288 138
5350 138 -40 -43 -22 151 -45 147 -231 -84 -143 77 -43 -87 173 -102 -376 192 -11 -127 104 -198 -152 -184
$$ packed form
5186F2j08J46j04n1J06r8j80P1J15k9K7m4oR3J82j50N9l8j3L30m90K63J10j78
5210G5k14J99J0j30j69n6N88k87j2j32q6J55p0K35k97J38j71J95o1O2l4J44r9
5233a7j68J97J22j26Q4R7r9j91m5J20K36l17J06K07M5k45J85j31k17l3N0J6J84
5256F0O3o0m2l13J59R3Q3J96j71j19J51l35J46J53j64J19L00l74P5l4K46k01O5
5279I6o6o2Mj18J46n7m0j97K02J68p1j30P2K54k2Jl62m2l7M05l25J2J91j48Q9
5304c7L7j09L7k14K5P5L18l28L19k83J74j67K45j37K3J23j39p1J21j13M5n5k24
5327c35J44J65p1K03j40P6K0j57l1L1J14j81J40O1O9l1l1j06J70l06J47L37j50
5350A38j78lK1J73j96J92l78J47n9K20j20m4K60k75k74N68k03j16K31l02M6l2
$$ plain form
5372 -184 115 93 93 103 9 -66 -91 9 -34 41 -280 45 196 66 5 36 -110 -75 54 83 -92 -94 -138 111 41 -17
5398 -17 171 -29 -70 -182 112 -261 -122 -132 -105 -123 -43 -164 63 55 16 -137 -46 -231 -88 96 79 401 -305 -37
5422 -37 83 76 -61 347 -135 -64 -90 248 62 -142 -37 47 134 224 -140 127 -201 -6 114 -147 310 -85 235
5445 235 -10 -2 -188 -214 109 62 26 122 87 104 141 -33 -290 66 -128 107 -43 21 -61 -74 -94 -122 142 -53 31
5470 31 -114 -33 -240 -233 10 54 236 -10 -125 -165 16 -140 21 -84 46 45 -4 114 -145 -310 155 -82 -28
5493 -28 55 -204 39 293 244 4 -119 42 -121 62 -51 128 192 410 -42 -69 125 -113 78 -80 -374 -138
5515 -138 119 7 -5 31 -10 -103 73 63 111 177 -237 -70 -78 -287 -98 -214 21 140 -39 28 231 -295 -223 46
5539 46 87 -233 33 -47 -102 161 47 -25 -46 -326 171 49 -128 -110 134 -234 -84 64 -125 -68 -19 75 223
$$ packed form
5372a84K99k2%J0r4p5k5J00m3P5l21L25J51j30o1L1j46L5J29K9j75km4K49p0n8
5398a7J88k00m1j12K94l73J39j0K7j8Q0j21K27ql9j53R1j85J43J84j7L22p06K68
5422c7J20pj37M08m82P1k6L38j86k04J05Q4Q7R0l64K67l28J95J20k61M57l95L20
5445B35k45Qj86k6L23m7l6R6l5J7L7j74k57L56j94K35j50O4q2j3k0k8K64j95Q4
5470C1j45Q1k07PK43M4J82k46j15m0J81j56J61j05J30jm9J18k59j65M65k37N4
5493b8Q3k59K43K54m9k40j23J61j63J83j13J79O4K18m52k7J94k38J91j58k94K36
5515a38K57j12j2L6m1r3J76j0M8O6m14J67qk09J89j16K35J19j79O7K03n26P2K69
5539D6M1l20K66q0n5K63j14p2k1k80M97j22j77J8K44l68J50J48j89N7M9R4J48
$$ plain form
5562 223 59 -257 69 174 7 137 -263 65 -132 -25 -54 169 56 34 -225 -194 -338 -68 62 2 89 -96
5584 -96 -101 256 11 -276 9 -140 -83 173 122 31 -118 -13 116 61 118 -233 68 -1 54 118 218 -109 -20 -118
5608 -118 64 138 -58 -45 -78 -210 83 70 -19 144 -107 -156 57 -69 -268 281 36 9 -127 29 -89 35
5630 35 -118 63 -22 58 68 71 -24 -194 -74 -49 88 50 -37 -61 103 -9 129 -55 35 -187 86 -364 -91 -44
5654 -44 -71 -88 209 96 -121 138 66 79 46 89 -62 -142 -198 -242 -16 219 -194 -85 -14 -68 -229 207 -90 124
5678 124 57 -51 -60 47 -7 41 -38 -109 0 127 72 -103 -146 159 81 -66 157 1 -143 90 -131 -276 61
5701 61 -11 2 17 35 -68 136 -73 -85 -45 5 -111 71 83 -41 111 3 -49 52 95 -66 66 164 -208 36
5725 36 -128 -94 142 98 -42 282 31 -104 4 -98 -161 49 -68 89 -6 -46 127 -35 -18 26 118 -40 126
$$ packed form
5562B23j64l16L26J05j67J30m00L28j97J07k9K23j13k2k59L1j44K70J30o0Q7j85
5584i6nL57k45k87K85j49N7K56n1r1j49J05J29n5N7l51L01o9N5O4J00l27Q9r8
5608a18J82P4j96J3l3j32K93j3q9J63k51m9K13j26j99N49k45k7j36J56j18J24
5630C5j53J81q5Q0J0Lr5j70J20K5J37l8q7k4J64j12J38j84R0k22K73m50K73M7
5654d4k7j7K97j13k17K59p2J3l3M3j51q0n6m4K26K35m13J09P1n4j61M36k97K14
5678A24o7j08rJ07n4M8p9p1J09J27n5j75m3L05p8j47K23j56j44K33k21j45L37
5701F1p2J3J5J8j03K04k09j2M0N0j16J82J2j24J52j08n2J01M3j61J32R8l72K44
5725C6j64L4K36m4j40L24k51j35J08j02o3K10j17J57r5m0J73j62J7M4R2j58J66
$$ plain form
5748 126 -28 150 -79 -54 -21 81 -204 190 14 -62 -223 -149 81 24 -198 -65 7 1 -34 28 113 -347 104 43
5772 43 -107 84 129 111 -72 54 73 195 43 28 -164 2 -133 203 -132 64 110 180 -87 81 -131 -155 251
5795 251 -28 135 -89 -245 195 -92 -18 -17 -58 204 327 94 -8 -157 -33 -160 -81 -15 -121 -136 20 37 9
5818 9 188 178 -54 -326 149 187 124 -65 -40 -45 -69 1 -2 -50 10 20 -79 -128 26 -59 114 116 70 -243 -51 -76 -106 -41
5846 -41 -115 59 24 67 5 38 -60 -260 -237 -200 -156 4 62 14 55 -65 91 -174 92 55 -64 -13 -214 -118 99
5871 99 170 169 213 -9 -24 -127 -101 -35 150 28 95 -44 -144 -86 -140 73 -115 -1 -90 137 -103 -111 32 312 130
5896 130 183 157 6 -69 164 229 13 -118 -107 120 61 139 132 4 148 -142 14 -4 -17 -154 155 64 156 74 269
5921 269 -131 -39 -60 -234 44 -54 286 235 -54 -76 -174 -95 38 -8 -9 -62 231 -10 146 -83 242 -125 94 -25
$$ packed form
5748A26j54J78k29K5L3J02k85L94j76p6j61P4K30n7k22J33P2ol5O2Q5m60M51o1
5772D3j50J91M5j8j83J26J9J22j52j5j92J66j35L36l35J96M6P0k67J68k12k4M06
5795B51k79J63k24j56M40k87P4Jm1K62J23k33j02j49J24j27P9O6j06j5J56J7k8
5818IJ79j0k32k72M75L8o3j89K5nk4P0lm8O0J0r9m9J54q5J73Km6l13J92k5l0O5
5846d1p4J74l5M3o2L3r8k00K3L7M4J60N8m8M1j20J56k65K66l7j19N1k01R6K17
5871I9P1jM4k22j5j03K6O6J85j22O7j39j00N8n4K13j88J14q9K27k40qJ43K80j82
5896A30N3k6j51p5K33O5k16j31J1K27n9P8pj28J44k90J56j8j3j37L09r1R2q2J95
5921B69m00R2k1j74K78r8L40n1k89k2r8P9J33m6jn3K93k41J56k29L25l67K19j19
$$ plain form
5945 -25 77 -197 22 -116 -175 -101 24 70 5 115 -95 -25 109 25 199 -60 66 35 -16 39 -28 118 234 -79
5969 -79 -121 340 49 120 61 -109 -116 -183 60 250 25 16 207 299 200 -6 138 -202 -7 100 -274 -108 156 -9
5993 -9 187 -77 77 -40 -218 -28 176 185 -76 27 -61 35 -104 -140 134 237 94 -74 90 -183 -5 -28 151
6016 151 121 -27 -47 -137 100 186 49 93 -61 -81 76 141 138 -36 -115 84 52 -89 132 -57 -67 -275 -355 108
6040 108 73 -187 151 78 84 -78 258 136 270 -31 47 -7 120 -106 -10 90 -224 136 -198 390 -55 72
6062 72 -53 141 98 57 -61 -57 65 -126 134 -65 -63 -164 141 81 -252 175 -17 -66 29 39 -90 -54 -92 -125 -29
6087 -29 -116 -185 79 33 -168 55 -145 47 -132 -140 205 -4 78 -159 -69 -55 6 -24 -216 -145 -251 -39 78 -41
6111 -41 196 -35 101 49 -2 -124 -49 79 -87 -55 -151 -92 75 -74 75 19 -164 113 84 -127 46 86 135 148
$$ packed form
5945b5J02k74K19j38n9P4J25M6o5J10k10P0J34q4J74k59J26l1n1N5o7J46J16l13
5969g9m2M61k91P1n9j70po7K43J90k25rJ91R2r9k06J44l40J95J07l74J66K64j65
5993iJ96k64J54j17j78J90K04Rk61J03q8R6j39l6K74J03j43j68J64k73J78k3J79
6016A51l0j48k0r0K37Q6j37M4j54k0J57O5lj74p9J99l2j41K21j89j0k08q0M63
6040A08l5k60L38p3Oj62L36j22J34l01P8n4J27k26R6J00l14L60l34N88m45J27
6062G2j25J94m3m1j18MJ22j91K60j99Kj01L05o0l33M27j92m9R5J0j29L6l8l3R6
6087b9q7o9K64m6k01K23k00J92j79qL45k09Q2k37R0J4O1l0j92P1j06K12J17j19
6111d1K37k31J36n2n1j22P5J28j66L2r6N9J67j49J49n6j83K77k9k11J73M0M9J3
$$ plain form
6135 148 -84 -1 -59 -214 -158 44 -67 -161 112 -93 -275 -155 301 -42 -76 173 -65 41 -327 75 111 89
6157 89 -73 -20 157 211 -258 -43 84 -127 45 51 283 -171 -40 321 -97 146 134 -240 125 125 47 -18 -19 -78
6181 -78 185 9 85 -18 19 81 -96 -139 120 -3 140 84 -61 -224 21 71 42 -55 27 -69 -316 137 -48 238
6205 238 -56 -121 8 51 34 -69 200 69 294 48 -70 94 -21 -197 -85 -149 -340 54 116 35 60 -65
6227 -65 29 -44 31 8 45 82 38 -378 -48 33 -85 140 -1 269 191 -52 -115 118 -181 -67 -22 93 -13 174
6251 174 12 60 -70 227 -118 -185 94 -28 -173 202 13 47 41 -132 59 -311 120 -83 -24 43 -69 121
6273 121 101 114 65 32 -160 -142 31 -98 -69 -81 25 170 -71 156 -164 -253 -58 19 -171 -147 -77 -97 -108 -97 -11
6298 -11 311 160 -136 -89 66 58 -200 -18 -127 -39 -119 272 73 92 -166 94 495 -3 -133 12 54 -34 191
$$ packed form
6135A48k32Q3n8j55N6K02j11r4K73k05j82J20M56l43l4K49k38J06l68M02L6k2
6157H9j62N3J77N4m69K15J27k11J72OK32m54J31L61m18K43j2l74L65%p8o5jn9
6181g8K63j76P6j03L7O2j77m3K59j23J43n6j45j63K45N0k9r7Q2r6k47M53j85K86
6205B38k94o5J29M3j7j03K69j31K25k46j18J64j15j76J12o4j91L94O2q1K5j25
6227f5R4p3P5k3L7L7m4m16L30Q1j18K25j41K70p8k43o3K33k99J14M5J15j06J87
6251A74j62M8j30K97l45o7K79j22j45L75j89L4oj73J91l70M31k03N9O7j12J90
6273A21k0J3m9l3j92J8J73j29K9j2J06J45k41K27l20q9J95P7j90K4P0k0j1J1Q6
6298a1L22j51k96M7J55qk58J82j09Q8q0L91j99J9k58K60M01m98j30J45M2q8K25
$$ plain form
6321 191 7 -38 33 94 269 -65 -30 -102 -152 40 80 132 -5 65 228 -66 -40 165 -69 -36 -56 -92 51 195
6345 195 168 -5 -8 74 97 -27 51 175 -2 27 184 -54 200 102 -78 -64 -208 88 -338 -77 -134 -20 -63 35
6369 35 25 -74 29 -66 -144 135 -261 151 365 85 -96 -99 57 57 27 37 -79 -207 109 -49 -102 -198 4 -166
6393 -166 -184 434 -82 -2 -25 -241 -47 -35 -104 121 -122 -159 -62 -84 -110 -90 -147 -72 92 134 89 114 -107 54 115
6418 115 55 -87 -193 22 5 -28 398 47 -169 77 57 306 -14 7 6 -27 -17 -45 18 59 -30 -89 -113 -7 -68
6443 -68 14 -44 -35 3 80 -39 60 156 -528 50 -107 -108 -70 -143 -83 -319 288 66 224 -132 70 -10 134 -66 -49
6468 -49 -78 8 -12 -17 53 88 8 134 -224 13 -163 -140 87 -11 -8 -212 -49 252 -42 224 -158 217 123 -12 168
6493 168 -131 -96 -190 -17 -160 1 154 88 2 -46 -36 -76 -2 82 18 -223 349 -238 -100 -166 14 24 63 52 98
$$ packed form
6321A91j84m5P1O1J75l34L5p2n0J92M0N2j37P0J63k94K6K05k34L3k0l6J43J44
6345A95k7j73lQ2K3j24P8J24j77K9J57k38K54r8j80J4j44K96m26K61n7J14m3R8
6369C5j0r9J03r5p8K79l96M12K14k80j81lJ56%l0J0j16j28L16j58n3r6K02j70
6393a66j8O18n16Q0k3k16J94J2o9K25k43l7R7k2k6K0n7P5J64M2m5K5k21J61O1
6418A15o0j42j06K15j7l3M26l51k16K46k0K49l20K1jl3J0k8O3M1q9n9k4J06o1
6443f8Q2n8RL8P7j19R9R6o84N78j57jL8p3O0k36O07k22J58l56K02q0J44k00J7
6468d9k9Q6k0nP0L5q0J26l58K37j76K3K27r8Lk04J63L01k94K66l82L75r4j35J80
6493A68k99L5r4J73j43J61J53o6q6m8J0m0P4Q4o4k41N72n87J38o6J80J0L9j1M6
$$ plain form
6518 98 100 167 -57 16 -23 -86 -145 72 125 116 -26 -182 -27 196 -81 83 180 51 137 28 -223 130 -295 -369 281
6543 281 -97 2 537 -40 213 108 128 121 -49 161 -300 260 160 49 102 242 -78 109 88 -35 200 137
6565 137 182 212 241 -117 154 -223 171 128 22 95 -95 64 -121 -91 11 276 -27 104 -14 61 37 -96 76
6588 76 -114 112 153 -121 -31 69 -229 99 -23 -118 158 96 25 74 -73 -21 -161 217 45 75 90 173 20 180
6612 180 -110 57 115 -305 -103 -188 86 199 -222 -187 -120 18 339 -101 98 -286 -62 157 -22 -30 -38 85 40
6635 40 -91 -224 -3 -31 -35 -86 -130 -94 162 -20 -69 -159 46 124 146 157 117 -9 -48 -27 123 17 234 -96 -162
6660 -162 91 -5 82 -159 9 201 -13 94 23 153 -52 -124 -49 28 -293 -130 -55 42 -64 -24 140 81 -201
6683 -201 180 -172 343 -38 214 154 77 20 75 215 91 -67 -214 20 -98 25 -84 245 -227 88 -59
$$ packed form
6518I8KO7k24P3l9o3n9K17N3rj42j56J55K23k77J64R7j29Q6j09k51L53m25p4O50
6543B81l78R9N35n77K53j05K0pj70K10m61N60j00j11N3J40l20J87k1j23K35o3
6565A37M5L0K9l58K71l77L94m3j06P3j90J59j85L0J02K65l03J31j18P5k4j33J72
6588G6j90K26M1k74R0J00k98L28j22r5K76o2p1M9j47N2j40L78j72L0J5Q3j53J60
6612A80k90J67N8m20K02q5K74J13m21L5O7J38L21m40J99l84K24K19j79qqJ23m5
6635D0j31j33K21k8mn1m4L6K56j82m9r0K05P8K2J1m0j26l9K1J50j06K17l30o6
6660a62K53r6Q7k41J68J92k14J07p1J30k05p2P5P7l21J63P5R7j06M0J64n9k82
6683b01L81l52N15l81K52o0p7n7N5J40j24j58j47K34j18J23j09L29m72L15j47
$$ plain form
6704 -59 -154 132 187 -98 -213 24 -56 54 -181 -55 187 -121 -345 -115 -60 151 145 -88 9 -38 -193 -195 -41 -78
6728 -78 48 140 -214 12 116 -82 5 104 -37 62 355 -77 95 -100 -314 158 146 -37 -163 -304 72 27
6750 27 -279 17 -16 -119 -203 91 36 -143 227 109 83 87 6 101 103 -40 -119 275 96 -46 40 -128 -46 -81 10
6775 10 -240 -244 -79 -122 -210 45 -126 194 -57 -133 117 -165 -11 59 -75 -17 0 -101 135 169 -52 -73 65 -33
6799 -33 122 238 1 -67 -31 -206 -169 201 242 66 -253 -158 140 -247 162 44 91 66 33 -6 -127 74 -107
6822 -107 96 -71 21 21 134 141 97 110 40 154 185 132 3 89 -16 16 56 182 -216 -153 -15 -207 -217 -47 -51 -13
6848 -13 -53 41 52 -142 -116 -22 -158 140 -11 59 26 0 181 216 -93 -156 42 -33 -118 -33 -107 -138 79 -295 -204 -111
6874 -111 84 160 74 -5 -147 -54 242 -180 298 -162 18 -27 71 -151 -138 242 -45 -189 44 -145 -39 -14 -120
$$ packed form
6704e9r5K86N5k85j15K37q0J10k35J26K42l08k24K30N5K11ok33R7m7j55kJ54l7
6728g8J26R2l54K26J04j98Q7R9j41R9K93m32J72j95k14M72j2j83j26j41L76m5
6750B7l06K96l3j03q4K94n5j79L70j18k6Mq1R5Kj43p9L94j79j42Q6j68Q2l5R1
6775A0k50mJ65m3q8K55j71L20k51p6K50k82J54P0j34N8J7j01K36L4k21k1J38r8
6799c3J55J16k37o8L6j75L7L70M1j76l19R5K98l87M09j18M7k5l3l9j21K01j81
6822a07K03j67R2%J13Pm4J3p0J14L1n3j29Q6j05L2M0J26l98O3J38j92j0J70mL8
6848a3m0R4J1j94K6R4j36K98j51P0l3k6J81L5l09o3J98p5q5Q5p4l1K17l74R1R3
6874a11J95P6q6p9j42R3K96m22M78m60J80m5R8k22J3L80k87j44K33j89J06K5j06
$$ plain form
6897 -120 -94 198 102 154 86 -221 -24 -13 185 61 254 2 -172 68 -297 40 142 -132 -5 32 206 77
6919 77 -72 116 -33 -154 -147 168 -71 -34 -62 64 101 -97 -210 -70 159 -163 -19 33 287 -113 63 -55
6941 -55 -19 -97 -128 -35 -32 117 -3 98 49 -67 -104 351 308 82 55 -156 -53 138 98 73 28 -275 -90 75 30
6966 30 203 -67 -154 -237 178 -6 57 -236 48 -3 38 173 -47 -99 -135 310 -173 157 -128 -109 113 84 454
6989 454 98 -105 -215 -65 -221 -105 276 -190 -36 -132 144 -55 20 78 76 76 10 -44 275 -72 18 137 -52
7012 -52 -200 105 47 234 91 -86 -95 68 109 -87 -87 -186 -246 136 231 35 -167 210 130 24 82 -217 -43 -20
7036 -20 180 -40 23 86 -26 88 93 90 -181 30 -71 -31 -222 54 -52 39 -50 -94 165 60 -116 143 -163 249
7060 249 42 -9 -235 -122 14 -100 -107 57 200 108 144 -63 24 145 -239 -43 13 27 206 -268 90 -81 79
$$ packed form
6897a20K6K92r6N2o8l07J97J1J98j24J93k52j74K40l65L37J02k74J27L7J74j29
6919G7j49J88j49j21PL15k39L7k8J26L7j98j13J40K29l22J44N2K54m00J76j18
6941e5L6p8l1R3LJ49j20J01m9j16l7M55m3k26k7k11J03J91m0k5m5l03J85J65m5
6966C0J73k70q7q3M15j84O3k93K84n1M1J35k20n2l6M45m83L30k85J9K22k9L70
6989D54l56k03j10J50j56J16L81m66J54r6K76j99P5N8k%o6n4L19l47R0J19j89
7012e2j48L05n8J87j43j77rJ63M1j96%r9o0L82R5j96k02L77q0j06N8k99J74K3
7036b0K00k20O3O3j12J14Nlk71K11j01M0j91K76j06R1q9m4K59j05j76K59l06M12
7060B49k07n1k26J13J36j14pJ64J43r2L6k07Q7J21l84J96N6J4J79m74L58j71J60
$$ plain form
7083 79 -269 185 -139 -199 16 97 101 189 77 -143 227 149 -110 90 -50 98 -36 52 -226 139 -76 -74 -33 253
7107 253 53 -6 196 -147 -117 -152 -91 211 304 -133 121 -31 72 5 166 276 151 -15 41 -60 159 49
7129 49 -106 294 121 -37 -92 -286 134 177 -44 38 71 13 -90 -323 -2 16 47 74 259 68 17 -2 -205 -43
7153 -43 106 -80 -114 -1 18 18 -102 -18 113 28 135 35 87 -84 -65 180 266 150 -361 60 -323 -107 78
7176 78 -225 -111 -42 181 27 -15 -43 32 211 -53 -32 -207 216 -13 44 -34 100 -45 40 52 -119 93 -132
7199 -132 75 -163 -94 -153 210 30 -68 4 37 -331 -114 -56 -209 83 -310 -125 -5 127 19 270 67 -126
7221 -126 182 -324 -145 100 -166 91 -142 -106 -247 -73 -238 -100 33 308 -96 -103 -253 -39 62 5 -58 -82
7243 -82 -31 -12 169 129 36 2 -195 -211 215 -42 130 -4 120 -86 18 93 25 164 -56 31 -197 132 -61
$$ packed form
7083G9l48M54l24o0K15Q1MQ8j12k20L70p8k59K00j40J48j34Q8k78L65k15KM1K86
7107B53k00n9K02l43L0l5O1L02R3m37K54j52J03o7J61J10j25j66N6j01K19j10
7129D9j55M00j73j58n5j94M20M3k21Q2L3n8j03k33L21J8L1K7J85j91n1j9k03J62
7153d3J49j86l4J13J9%j20Q4J31q5J07j00N2j71J9K45Q6j16n11M21l83K16J85
7176G8l03J14O9K23j54m2k8P5J79k64K1j75M23k29N7p8J34j45Q5J2j71K12k25
7199a32K07k38O9n9L63j80r8P2L3l68K17N8j53K92l93J85J20J32j08K51k03j93
7221a26L08n06J79K45k66K57k33L6j41J74j65J38J33K75m04pj50K14J01n7o3k4
7243h2N1J9J81m0r3l4j97j6M26k57J72j34J24k06J04P5o8J39k20Q7k28L29j93
$$ plain form
7266 -61 -245 -76 158 -138 -26 77 -49 -293 58 88 49 -254 155 75 -86 94 6 77 -183 69 -222 -61
7288 -61 116 70 -200 -61 70 101 -264 22 -112 35 410 -70 -79 156 149 75 119 72 107 -87 -49 -27 -189 -58
7312 -58 332 185 -121 61 260 -212 72 210 14 40 -64 23 128 83 -123 -25 15 171 3 316 -13 103
7334 103 -165 -259 -99 -7 -79 -55 45 -193 -28 195 -2 -112 -71 -78 156 -30 63 -218 -82 -102 -228 177 43
7357 43 -150 301 192 -24 105 98 -101 -152 98 -49 32 -135 -35 -1 47 42 38 -124 -102 -6 84 138 95 -71 -327
7382 -327 287 95 -12 -42 -2 -199 184 112 10 6 -7 -54 83 108 -139 117 45 62 46 -85 -123 -26 0 -104 -233
7407 -233 262 -170 -44 86 -156 -191 215 -58 -21 5 197 61 -176 116 22 127 68 50 -130 86 -99 -391
7429 -391 -24 -63 -2 -73 139 104 -99 22 149 81 72 -45 89 34 28 -301 -70 133 -69 64 -184 85 -88
$$ packed form
7266f1j84J69K34k96J12J03j26k44L51L0l9l03M09q0j61J80q8P1k60K52k91J61
7288f1J77m6k70J39J31L1l65K86j34J47L75m80rK35pp4M4m7L5j94L8K2j62J31
7312e8L90j47l06J82J99m72K84J38j96K6j04Q7J05m5k06R8M0J56j68L13l29J16
7334A03k68r4J60R2p2K4J00k38J65K23j97j10M1pK34j86R3k81J36k0j26M05j34
7357D3j93M51j09k16J29pj99n1K50j47Q1j67J00L4M8nmj62K2R6R0N4m3j66k56
7382c27O14j92j07l0M0j97L83p2j02mj3m7J37K5k47K56p2J7j6j31l8R7K6j04j29
7407b33M95m32J26J30k42l5M06k73L7K6J92j36k37K92r4J05n9j8j80K16j85k92
7429c91L67l9O1p1K12l5k03J21J27o8rj17J34n5ol29K31K03k02J33k48K69j73
$$ plain form
7452 -88 19 -112 39 -126 276 196 -26 74 -58 105 -60 7 92 -155 -87 21 122 -8 30 53 -111 -445
7474 -445 -128 -87 -69 230 -111 -238 -89 30 -97 299 44 70 146 113 -85 -93 -59 -99 -60 59 -167 -28 -241
7497 -241 125 8 -89 -155 -52 117 -80 -88 -177 105 -36 -106 -52 -108 76 244 184 119 -99 -115 -34 11 -243 90
7521 90 183 -226 -62 -131 68 127 70 113 13 -148 -93 76 245 34 25 102 52 127 203 76 54 -5 86 129 -169 177
7547 177 43 38 -201 95 -41 350 148 -27 -114 85 187 82 -98 -306 123 78 -100 -79 114 -66 152 -127
7569 -127 -134 -109 -43 376 181 21 -177 -154 52 244 15 -46 -134 27 89 -84 -251 -146 170 74 108 -197 -125 30
7593 30 180 284 188 100 -214 -67 13 -123 -81 -8 -255 119 -129 -89 273 160 -242 -228 -97 -80 -122 88 -27
7616 -27 43 -82 321 68 10 16 17 56 -26 -14 -145 -224 184 -238 13 77 -44 27 126 -97 31 281 -39 109 -74
$$ packed form
7452h8J07j31J51j65M02q0k22J00j32J63j65O7Q5k47O8J08J01j30L8K3j64l34
7474d45L17M1J8K99l41j27J49J19j27L96k55K6P6l3j98qL4m0L9J19k26J39k13
7497b41L66j17r7o6J03J69j97qq9K82j41p0N4n6J84J68o0o5k18j6Q1M5k54L33
7521I0R3m09J64o9J99N9n7M3j00j61N5J69J69k11rP7n0P5P6j27k2n9R1M3k98L46
7547A77j34nk39K96j36L91k02j75q7J99J02j05j80k08M29m5j78K1J93j80K18k79
7569a27pK5O6M19j95j60j98K3K06J92k29o1q8J61O2j73j67J05L16r6L4l05P2J55
7593C0J50J04r6q8l14J47Q0j36M2P3k47L74k48M0L62j13m02J4J31J7m2K10j15
7616b7P0j25M03k53n8OJL9q2J2j31p9M08m22K51O4j21P1R9k23J28K50l20J48j83
$$ plain form
7641 -74 386 -60 -154 -6 -182 129 3 -25 161 15 57 -71 0 -178 76 102 -99 2 77 29 260 162 20
7664 20 -119 19 -232 -229 54 -262 -40 -1 -283 -7 -51 -228 4 -274 -107 92 -126 -267 -174 75 112 165 -263
7687 -263 -150 -16 -183 -137 -50 -65 -257 84 -134 112 14 32 81 217 -25 -163 191 -136 -190 29 -139 94
7709 94 140 -140 48 -124 -164 196 -134 65 -217 80 168 243 209 -171 -83 -73 -68 136 36 91 -44 28 -92 -67
7733 -67 26 15 -66 57 69 -22 295 23 -249 -58 69 28 -270 95 17 6 287 35 -203 29 -213 38 -190
7756 -190 -34 -152 149 126 6 164 -23 -294 -12 10 -38 135 -224 134 18 105 19 105 81 126 85 -212 -168
7779 -168 107 -3 77 -126 -28 -41 5 16 42 -22 -86 94 3 -88 -94 116 103 43 12 65 -109 -59 -119 -13 -44 -272
7805 -272 -68 97 -162 220 235 62 203 69 276 84 -27 -185 63 -44 -67 -106 57 -26 -253 -133 110
$$ packed form
7641g4M60m46r4J48j76L11j26k8J86j46M2j28P1j78K54K6k01J01P5m8K31r8j42
7664B0j39J38k51LK83l16K22L9k82K76m4j77K32k78J67J99k18j41R3K49L7N3m28
7687b63J13J34j67M6Q7j5j92L41k18K46r8J8M9J36k42j38L54l27n4K19j68K33
7709I4M6k80J88j72m0L60l30J99k82K97Q8P5l4l80Q8J0NK04j00N5j35P2j20K5
7733f7R3j1q1J23J2r1L17k72k72J91J27m1k98L65p8j1K81k52k38K32k42K51k28
7756a90J56j18L01k3j20J58j87k71K82K2m8J73l59L58j16Q7q6Q6k4M5m1k97M4
7779a68K75j10Q0k03R8j3M6J1K6o4o4J80r1r1oK10j3o0l1N3j74N0o0J06l1k28
7805b72K04J65k59L82J5j73J41j34K07j92j11j58K48j07k3l9J63q3k27J20K43
$$ plain form
7826 110 130 -236 9 76 -156 99 -27 -81 -48 -15 -75 271 68 52 144 77 144 104 -33 -96 129 -104 -192 26
7850 26 237 -64 20 -25 -81 35 136 109 137 -233 -61 -172 -237 -40 -21 -37 -178 192 -61 -177 -32 52 -6 -29
7874 -29 -243 175 -87 341 -302 7 -209 144 19 161 154 -208 -8 102 -19 113 83 8 -128 6 -59 260
7896 260 -41 60 187 186 87 -71 3 148 -59 -207 38 -43 -23 -377 -205 162 -88 -52 -46 -180 160 -61 74
7919 74 22 91 8 122 -29 183 -58 -169 23 -158 -70 -225 128 -23 117 82 156 8 -70 204 198 47 169
7942 169 0 22 12 -137 -117 155 208 101 112 12 -137 139 -92 66 178 78 107 -156 -222 -10 -258 137
7964 137 -157 28 -152 -46 -28 -191 -8 77 -147 186 130 -326 26 -106 8 -61 -304 -94 65 -61 -136 55
7986 55 176 48 -84 -121 -14 -42 -23 200 33 -148 -1 -97 -87 -111 28 -2 -38 159 174 258 8 -67 122 9
$$ packed form
7826A10K0l66K45O7k32K55j26n4L3L3o0L46k03j6R2o7O7m0j37o3K25k33q8K18
7850B6K11l01Q4m5n6J16J01k7K8l70J72j11o5J97J9j6j41L70k53j16J45Q4n8k3
7874b9k14M18k62M28o43L09k16L53j25J42pl62K00J10j21J32l0p5j36J34o5L19
7896B60l01J01J27jr9j58P4J45k07j48K45q1K0l54J72L67k50L6Oj34L40k21J35
7919G4n2O9q3J14j51K12k41j11J92j81Q8j55L53j51J40l5P4j48p8K74oj51J22
7942A69j69K2j0j49K0K72N3j07J1j00j49K76k31J58J12j00K9k63o6K12k48L95
7964A37k94J85j80J06J8j63J83Q5k24L33n6m56L52j32J14o9k43K10J59j26p5J91
7986E5J21j28j32l7J07k8J9K23j67j81J47r6J0k4J39l0l6J97J5Q4k50p5J89j13
$$ plain form
8010 9 -5 -42 -161 -49 -169 -82 -304 161 114 90 6 -30 -200 13 3 240 -152 153 -102 13 -152 65 168
8033 168 12 114 136 -124 -32 172 101 -88 -135 -127 50 80 -33 -22 110 29 -101 -156 -123 155 29 208 126 115
8057 115 -163 67 -77 9 56 -40 5 -235 -316 241 112 -111 -90 58 248 70 -40 -289 20 -209 190 129
8079 129 5 -34 -142 -23 -65 14 -270 -67 -92 423 -198 37 -140 -112 142 81 116 -93 -98 5 290 -64 120
8102 120 -67 -149 90 51 204 247 130 92 183 -54 -188 -150 -100 -144 208 174 150 234 -61 -159 6 20 99 3 -47
8127 -47 -63 -52 -10 191 -84 156 -126 96 32 -183 17 30 -138 257 51 62 -49 -45 -103 -327 72 102 -69 33
8151 33 1 -132 -77 34 175 84 262 -83 -74 -99 291 81 6 -221 -339 -81 -42 -168 -112 -185 -183 -256 44 153 174
8176 174 34 -171 -103 -15 139 -245 299 -173 158 -150 -141 67 15 164 53
$$ packed form
8010Ij4l7j19J12j20Q7k22M65m7k4q4l6j70K13j0K37l92L05k55J15j65K17J03
8033A68j56J02K2k60R2K04p1j89m7QJ77L0j13J1J32q1j30n5L3K78j26J79q2j1
8057A15k78K30j44Q6M7r6M5k40q1N57j29k23K1J48J90j78j10k49L09k29L99o1
8079A29j24l9j08J19m2P9k84K03k5N15o21K35j77K8K54o1L5k09nJ03K85l54J84
8102A20j87q2K39l9J53M3j17l8R1k37j34L8N0m4L52l4k4Q4k95r8J65J4P9r6n0
8127d7j6J1M2K01k75K40k82K22o4k15K00J3j68L95k06J1j11Mn8k24L99L0j71J02
8151C3l2j33N5J11J41r1J78l45Rk5L90k10p5k27j18K58L9j26N6p3Kp3L00J09K1
8176A74j40k05O8Q8J54l84N44m72L31l08RK08n2J49j11
8191E3
$$ Imaginary data points
##PAGE= N=2
##DATA TABLE= (X++(I..I)), XYDATA
$$ plain form
0 0 0 0 0 0 0 0 0 0 0 0 0 -7 8 -8 8 -8 16 -16 22 -24 32 -32 40 -48 56 -64 79 -88 104 -119 136 -152 175 -198
34 -198 223 -250 281 -316 352 -392 438 -486 540 -597 660 -731 806 -888 978 -1079 1188 -1309
52 -1309 1443 -1591 1758 -1948 2162 -2409 2694 -3030 3434 -3931 4555 -5368 6479 -8087 10645
67 10645 -15342 26843 -118883 -79780 109636 -77106 -98228 -559 36169 18970 -10614 -63254
79 -63254 51230 108887 -36408 -63921 99298 78314 -24988 22895 78534 33316 1690
90 1690 -26690 -20846 17114 -26607 -80682 -6235 22800 -58255 -58987 10332 4201 -28013 -38972
103 -38972 -32081 9875 10936 -49692 -15060 78243 47914 -17415 24357 66952 38758 4280
115 4280 -11210 8674 39430 -7559 -61394 -3423 42380 -25277 -59347 -2936 11715 -35360
$$ packed form
0@%%%%%%%%%%%pJ5j6J6j6K4l2L8m6N6o4P2q8J04j20J43j67J92k23K55k88L27l73
34a98M21m73N31n97O68p44Q30r24J026j137J257j391J537j694J866k057K267k497
52a309K752l034L349l706M110m571N103n724O464p365Q486r923J1847j4566J8732
67A0645k5987M2185j45726L9103J89416j86742k1122R7669L6728j7199k9584n2640
79f3254J14484N7657j45295k7513J63219k0984j03302M7883N5639m5218l1626
90A690k8380N844L7960m3721n4075P4447K9035q1055p32O9319o131l2214j0959
103c8972O891M1956J061o0628L4632R3303l0329o5329M1772M2595k8194l4478
115D280j5490J9884L0756m6989n3835N7971M5803o7657l4070N6411J4651m7075
$$ plain form
127 -35360 -51209 -22682 3368 -3543 -25230 -6594 38379 30102 -9584 6393 47270 26436
139 26436 -17717 -4675 31918 17236 -19990 -10424 24492 19665 -18451 -27510 3236 10873 -30186
152 -30186 -45907 -3908 14057 -21829 -31567 7313 25157 1305 -14441 5017 29221 14302
164 14302 -16656 124 37431 19559 -14122 5633 31508 9662 -17361 -12667 4166 1136
176 1136 -25826 -32590 -63 8799 -25195 -25444 12536 14079 -14253 -12374 10452 16870 3365 -7335
190 -7335 10308 32503 13679 -9891 11661 29485 2189 -16541 145 9988 -4301 -19367
202 -19367 -14684 3673 2280 -22606 -20423 7236 1857 -23887 -14614 9801 6677 -6611 -2595
215 -2595 13127 21262 8085 -3369 13765 25733 3018 -9765 10303 16737 -3090 -10221 731
$$ packed form
127c5360j5849K8527K6050o911k1687J8636M4973q277l9686J5977M0877k0834
139B6436m4153J3042L6593j4682l7226R566L4916m827l8116r059L0746P637m1059
152c0186j5721M1999J7965l5886r738L8880J7844k3852j5746J9458K4204j4919
164A4302l0958J6780L7307j7872l3681J9755K5875k1846k7023M694J6833l030
176A136k6962o764L2527Q862l3994k49L7980J543k8332J879K2826O418j3505j0700
190g335J7643K2195j8824k3570K1552J7824k7296j8730J6686R843j4289j5066
202a9367M683J8357j393k4886K183K7659n379k5744R273K4415l124j3288M016
215b595J5722Q135j3177j1454J7134J1968k2715j2783K0068O434j9827p131J0952
$$ plain form
228 731 4967 -4421 -17558 -14676 -59 -5463 -23920 -14431 6589 -188 -14064 -2908 12117 8057
242 8057 -2158 -931 11862 16130 2251 -2220 15020 19664 1681 -3446 9946 10345 -5003 -12554
256 -12554 -5290 1146 -7981 -18529 -8770 3698 -4921 -15206 -5301 5423 -1979 -10248 -3331 7540
270 7540 6854 -1432 1854 15402 14825 1057 1327 12514 8481 -4644 -5583 3054 3416 -5374 -8759
285 -8759 -420 4537 -5338 -12669 -3821 1858 -8212 -13084 -2885 3872 -410 -4404 2399 10828 7705
300 7705 -967 1491 9525 5620 -4220 -1610 7648 5832 -2451 -1730 4938 3381 -5713 -8291 -2122
315 -2122 -1212 -8531 -10557 -2173 3228 -1776 -4090 3853 8267 1371 -3971 1533 6195 1197 -3254
330 -3254 1097 7132 4088 -2010 280 5596 2285 -5839 -5579 -309 -1408 -7593 -5567 1700 2867
$$ packed form
228G31M236r388j3137K882J4617n404j8457R489K1020o777j3876J1156J5025m060
242H057j0215J227J2793M268j3879m471J7240M644j7983n127J3392L99j5348p551
256a2554P264O436r127j0548R759J2468q619j0285R905J0724p402q269O917J0871
270G540o86q286L286J3548n77j3768K70J1187m033j3125r39Q637L62q790l385
285h759Q339M957r875p331Q848N679j0070m872J0199O757m282l994O803Q429l123
300G705q672K458Q034l905r840K610R258j816q283P21O668j557r094k578O169
315b122R10p319k026Q384N401n004k314P943M414o896n342N504M662m998m451
330c254M351O035l044o098K290N316l311q124K60N270j099o185K026P267J167
$$ plain form
345 2867 -2202 -2684 2737 3908 -1988 -4502 909 4025 -881 -2368 3643 7089 3367 163 2807
360 2807 4972 -86 -6295 -3339 802 -2297 -6432 -3169 1518 -103 -3829 -3128 1572 1136 -4135 -3991
376 -3991 2115 3576 -663 633 6447 6538 2613 909 2961 3172 -426 -4354 -1244 1441 -1923 -4975
392 -4975 -584 2178 -2167 -4256 -2293 -250 -2878 -4861 -3390 848 1403 -1716 392 5193 4598 -2
408 -2 894 4030 2872 -684 -243 2522 3296 399 -1028 1634 2518 -1938 -4674 -1989 -1708 -4837 -5538
425 -5538 -2593 -456 -1155 -2061 -548 2442 1289 -1222 303 3287 1927 -350 1343 3583 3038 1406
441 1406 894 2256 2252 -1220 -2886 -499 -194 -3110 -2870 -891 -458 -1734 -1999 -1115 -145 -924 -2822 -1636
459 -1636 1307 80 -1306 1357 3650 1850 977 1724 2313 1865 282 -957 932 1746 -1051 -1810 843
$$ packed form
345B867n069m82N421J171n896k514N411L116m906j487O011L446l722l204K644
360B807K165n058o209K956M141l099m135L263M687j621l726P01M700m36n271J44
376c991O106J461m239J296N814R1l925j704K052K11l598l928L110K685l364l052
392d975M391K762m345k089J963K043k628j983J471M238N55l119K108M801n95m600
408bQ96L136j158l556M41K765P74k897j427K662Q84m456k736K685K81l129p01
425e538K945K137o99r06J513K990j153k511J525K984j360k277J693K240n45j632
441A406n12J362ml472j666K387L05k916K40J979M33j276k65Q84R70p79j898J186
459a636K943j227j386K663K293j800q73P47N89m48j583j239J889Q14k797p59K653
$$ plain form
476 843 1125 -1895 -2466 -876 -1046 -2021 -2085 -1195 127 126 -950 65 2150 1079 -576 807 2307 -94
494 -94 -843 740 1160 689 65 325 1191 1097 -1666 -2343 916 461 -2404 -1401 886 108 -760 -615 38
513 38 1069 156 -2011 -347 1929 -265 -1285 1592 1452 -24 855 231 -710 791 -446 -1688 218
530 218 254 -2326 -216 1649 -1312 -915 1266 -149 -649 562 -559 -135 2118 8 -1190 2392 1910
547 1910 -970 -297 1191 -134 -384 -971 -1388 237 701 -2397 -1277 1426 -114 -1854 -330 -322 -546
564 -546 -125 -378 -242 1844 754 -530 1799 2078 -872 239 1316 -801 -186 490 -154 451 471 -1001
582 -1001 46 1200 -1496 -2510 -380 -95 -1927 -1105 238 302 167 -162 -100 1080 841 -841 -107 1165
600 1165 793 -150 559 1216 1006 752 -318 511 164 -916 -992 -555 -647 -985 -546 -166 -316 -484 -560 -90
$$ packed form
476H43K82l020n71J590j70r75o4Q90J322jj076J015K085j071j655J383J500k401
494i4p49J583M20m71o24K60Q66r4k763o77L259m55k865J003K287p78q68J45O53
513C8J031r13k167J664K276k194j020K877j40j476Q79o24r41J501j237j242J906
530B18L6k580K110J865k961L97K181j415n00J211j121M24K253k110j198L582m82
547A910k880O73J488j325k50n87m17J625M64l098J120K703j540j740J524Qk24
564e46M21k53J36K086j090j284K329K79k950J111J077k117O15O76o44O05K0j472
582a001J047J154k696j014K130K85j832Q22J343O4j35l29O2J180k39j682P34J272
600A165l72r43P09O57k10k54j070Q29l47j080p6M37r2l38M39L80j50j68p6M70
$$ plain form
620 -90 -217 -1066 -722 -99 553 250 378 1027 1505 977 271 429 794 5 -309 -349 -115 76 26 -318 1
641 1 395 -316 -676 -206 -588 -913 -932 -235 -597 184 115 203 697 614 33 -42 491 -114 -20 327 613 311 400
664 400 405 255 212 -146 -656 -173 -291 -820 -670 192 56 95 -180 26 474 202 -369 -300 236 -372 -419 427
686 427 643 175 81 171 306 -28 -253 -446 212 121 -441 -29 452 485 -196 85 96 -20 -212 -439 -204 25
708 25 -341 -287 240 444 -161 -288 221 106 -310 -565 -80 -160 26 -246 108 496 126 -124 18 98 -160 -643
730 -643 -7 183 312 67 148 350 492 18 69 18 -51 -644 -196 79 193 -154 -175 73 130 -217 -125 156 -385
753 -385 -344 -168 29 35 98 449 583 351 302 -50 -86 168 204 -125 321 135 184 137 57 135 156 -294 -477 -317
777 -317 -49 -491 -519 -94 0 97 -132 -60 44 -6 52 -120 364 301 32 212 563 470 184 106 92 39 -360 -154
$$ packed form
620i0j27q49L44O23O52l03J28O49M78n28p06J58L65p89l14m0K34J91n0l44L19
641AL94p11l60M70l82l25j9O97l62P81o9Q8M94q3n81p5N33o05R4L47K86l02Q9
664D00Nj50m3l58n10M83j18n29J50Q62j36L9k75K06M48k72n71O9N36o08m7Q46
686D27K16m68r4R0J35l34k25j93O58r1n62M12M81L3o81K81J1j16j92k27K35K29
708B5l66N4N27K04o05j27N09j15m16k55M85q0J86k72L54L88l70k50J42Q0k58m83
730f43O36J90J29k45Q1K02J42m74N1n1o9n93M48K75J14l47k1K48N7l47R2K81n41
753c85M1J76J97OO3L51J34k32m9l52l6K54L6l29M46j86M9m7q0P8K1m50j83J60
777c17K68m42k8M25R4R7k29P2J04n0N8j72M84o3k69J80L51r3k86p8j4n3l99K06
$$ plain form
801 -154 -102 133 -70 -13 139 173 -455 -140 -21 -180 18 -71 58 -24 -80 -182 500 350 80 0 263 89 27
824 27 181 151 430 -92 -142 75 169 -60 -62 28 20 -448 -284 -94 -128 -88 -97 -137 180 -88 -74 -2 -12 226 -126 39
850 39 44 107 358 181 190 26 30 -70 2 -31 233 -46 172 -61 196 -277 -244 96 135 -163 -50 28 -105 -178 -87
875 -87 -103 -9 66 -187 -39 119 -67 -23 348 174 299 248 358 175 175 111 99 191 -89 -223 149 -32 -20 -187
899 -187 -40 124 73 93 -126 -269 166 -24 48 223 93 14 -82 92 84 -43 -115 -176 14 13 -121 38 163 -166
923 -166 -100 94 336 1 -57 -230 -50 -159 -113 -80 -71 78 207 -42 -116 -82 -174 -168 82 -121 106 -32 -50 -48 14
948 14 39 84 215 15 14 -94 -94 -47 -16 139 35 164 145 -57 -30 70 -133 -157 205 74 -114 -126 154 -270 126
973 126 -46 146 -76 -154 -70 235 128 192 64 -229 327 -75 -199 -76 -33 168 -161 4 -134 -73 -107 19
$$ packed form
801a54N2K35k03N7J52L4o28L15J19j59J98q9J29q2n6j02O82j50k70q0K63j74o2
824B7J54l0K79n22n0K17R4k29kR0qm68J64J90l4M0rm0L17k68J4P2j0K38l52J65
850C9NO3K51j77Rj64Mj00P2l3K64k79K18k33K57m73L3L40L9k98J13P8j33p3R1
875h7j6R4P5k53J48J58j86M4L71j74J25n1J10j83%o4j2R2k80j34L72j81J2j67
899a87J47J64n1K0k19j43M35j90P2J75j30p9r6J74qj27p2o1J90jj34J59J25l29
923a66O6J94K42l35n8j73J80j09M6L3RJ49J29k49p4L4r2OK50k03K27j38j8KO2
948A4K5M5J31k00jj08%M7L1J55j04J29j9k02K7J00k03k4L62j31j88j2K80m24L96
973A26j72J92k22p8Q4L05j07O4j28k93N56m02j24J23M3K01l29J65j38O1l4J26
$$ plain form
995 19 -43 178 147 -105 99 -91 86 -166 -100 121 20 239 235 -122 -14 -66 -45 2 56 -6 64 -45 284 -73
1019 -73 -60 39 -166 -177 -146 -64 -246 -32 246 10 -73 -16 -163 -37 3 -307 48 -101 -43 -271 39 253 39
1042 39 146 142 -138 283 19 251 130 162 20 79 112 202 81 58 -257 133 1 -516 -203 165 -29 152 23
1065 23 -20 7 90 -24 -180 -154 -42 -221 1 23 233 90 -130 -109 -42 220 35 -139 -107 234 37 23 220
1088 220 -153 158 28 -5 -155 -111 172 -235 124 -89 115 -52 -90 140 -158 -51 -20 24 -93 -321 -89 76
1110 76 -39 -160 -11 -74 38 34 -90 -140 -87 58 -207 66 133 115 -136 136 -48 174 -79 -1 -165 -80 -114 176
1134 176 -4 -46 -64 202 -186 36 -78 -159 145 -219 191 19 97 126 50 55 148 62 -81 72 45 -13 331 -297
1158 -297 -50 12 95 -71 -88 -412 99 -32 19 9 -61 -196 -47 189 27 -106 178 102 -181 23 -45 190 63
$$ packed form
995A9o2K21l1k52K04j90J77k52O6K21j01K19ml57J08n2K1M7N4o2P0j09L29l57
1019g3J3R9k05j1L1Q2j82K14K78k36q3N7j47J26M0l10L55j49N8k28L10K14k14
1042C9J07mk80M21k64K32j21L2j42N9L3R0j21k3l15L90j32n17L13L68j94J81j29
1065B3m3K7Q3j14j56K6J12j79K22K2K10j43k20K1O7K62j85j74L2L41j97j4J97
1088B20l73L11j30l3j50M4K83m07L59k13K04j67l8K30k98J07L1M4j17k28K32J65
1110G6j15j21J49o3J12mj24n0N3J45k65K73O7j8k51K72j84K22k53P8j64Q5l4K90
1134A76j80m2j8K66l88K22j14q1L04l64M10j72P8K9p6NR3q6j43J53k7n8L44o28
1158b97K47O2Q3j66j7l24N11j31N1j0p0j35J49K36j62j33K84p6k83K04o8K35j27
$$ plain form
1181 63 -335 119 11 62 248 131 94 -275 -208 -29 159 -42 35 -60 22 45 -127 -51 -246 112 99 -7 -78 -18
1205 -18 -347 -49 86 202 -11 -13 -98 42 -135 -49 257 -73 7 -16 -18 -178 -15 -61 -54 87 10 -106 -47 80 -36
1230 -36 40 -216 -102 -2 -1 103 -5 25 -123 -209 52 164 -32 149 -163 -78 -24 431 -299 -275 132 -48 187
1253 187 -1 108 262 -173 48 -114 32 -105 38 19 56 6 -220 40 -133 112 204 76 241 0 125
1274 125 19 333 -180 -218 -71 26 34 77 17 -41 41 142 8 138 29 -23 -83 47 76 14 152 324 8 -152
1298 -152 186 45 -25 -120 -112 -151 116 38 44 -128 222 53 284 -34 134 78 82 160 -89 260 -74 11 4 152 -242
1323 -242 -213 -169 -43 55 -69 242 7 -7 127 55 130 78 268 122 -135 -243 34 139 86 10 -153 138 -76
1346 -76 -163 165 111 224 124 161 109 -153 7 123 117 -242 -238 -255 87 -210 5 269 74 -80 43 -17 86 3
$$ packed form
1181F3l98M54j08N1J86j17l7l69O7J79J88k01P7r5Q2K3j72P6j95L58j3j06p1O0
1205a8l29K98J35J16k13kq5J40j77Q6L06l30Q0k3kj60J63m6PJ41p7j16N9J27j16
1230c6P6k56J14J00JJ04j08L0j48q6K61J12j96J81l12Q5N4M55p30K4M07j80K35
1253A87j88J09J54m35K21j62J46j37J43j9L7n0k26K60j73K45R2j28J65k41J25
1274A25j06L14n13l8J47R7QM3o0n8Q2J01j34J30j09n2o0J30K9o2J38J72l16j60
1298a52L38j41p0r5Ql9K67p8Oj72L50j69K31l18J68n6MP8k49L49l34Q5pJ48l94
1323b42K9M4J26R8j24L11k35j4J34p2P5n2J90j46k57j08K77J05n3p6j63K91k14
1346g6q7L28n4J13j00L7n2k62J60J16ol59Mj7L42k97K15K64j95j54J23o0J03q3
$$ plain form
1370 3 46 -98 125 128 -2 -191 -71 -165 -10 122 66 -37 117 54 -9 -66 86 -2 8 -216 -127 74 196 56
1394 56 -10 -175 -1 124 64 98 31 93 12 152 207 -9 -3 -197 -38 -134 -277 49 -1 -120 -185 -27 67 82 -169
1419 -169 -218 62 306 61 -165 -25 189 106 -70 331 86 -70 -302 201 48 -97 -44 -140 62 30 16 -250
1441 -250 32 52 142 -260 -100 117 145 214 104 -214 206 -5 -100 -102 -245 199 -139 -102 -221 -16 -73 131 -97
1464 -97 -90 -127 0 -48 109 -82 -48 -9 -69 59 -178 -192 144 -248 79 297 -21 177 106 -87 71 -206 -147 -70
1488 -70 -136 235 -31 -13 131 163 105 70 -50 -109 32 -14 -2 -20 56 -242 -217 -143 176 -32 -37 101 -26 390 -11
1513 -11 40 -35 -129 -47 3 -221 163 -38 332 -200 -173 129 -26 14 -47 -2 -310 170 172 162 -49 -252 -18 92
1537 92 25 167 -5 -32 93 21 -5 -85 196 -32 19 12 -40 20 167 -231 101 -269 163 150 55 277 105 164 134
$$ packed form
1370CM3j44K23Lj30j89J20r4J55J32n6j03J54o3o3n7J52q8J0k24Q9K01J22j40
1394E6o6j65J74J25o0L4o7O2q1J40N5k16Oj94J59r6j43L26n0j19o5J58R4J5k51
1419a69m9K80K44k45k26J40K14q3j76M01k45j56k32N03j53j45N3r6K02l2j4k66
1441b50K82K0R0m02J60K17K8O9j10l18M20k11r5kj43M44l38L7j19K05n7K04k28
1464i7Pl7J27m8J57j91L4L9o0J28k37j4L36l92L27K18l18J98p1j93J58k77N9P7
1488g0o6L71k66J8J44L2n8l5j20n9J41m6J2j8P6k98K5P4L19k08nJ38j27M16m01
1513a1N1p5r4Q2N0k24L84k01L70n32K7L02j55M0o1M5l08M80Kj0k11k03K34J10
1537I2o7J42j72k7J25p2k6q0K81k28N1pn2O0J47l98L32l70M32j3r5K22j72N9l0
$$ plain form
1562 134 40 -245 -163 -43 46 56 215 -236 154 73 190 -125 -212 3 -142 -148 85 -288 -187 -95 108 -10 12
1585 12 39 -193 52 -268 -168 -144 215 62 24 -162 -122 -32 76 266 77 57 111 234 -293 -98 42 -33 49
1608 49 -10 165 -115 -15 -162 28 -9 -122 303 -62 -26 -198 56 -20 -175 -65 -50 324 190 -24 32 74 -3
1631 -3 35 47 -158 4 41 9 86 -190 133 35 201 69 -152 153 12 125 206 95 232 -110 112 -5 63
1654 63 177 -50 -4 85 -73 -299 53 -113 -102 42 -4 25 8 135 78 141 -184 19 124 -223 -27 -259 -19
1677 -19 -122 -26 19 -86 80 119 -92 117 -99 202 -79 101 32 -123 71 -141 237 -21 105 -129 -120 182
1699 182 7 -7 -2 189 -44 -20 138 74 -20 189 131 -92 70 -73 53 90 111 95 -130 -127 -115 110 154 28 183
1724 183 47 13 107 166 -13 67 -172 -52 34 11 -21 -222 -186 -188 -112 -144 -31 -271 -109 105 -4 -290 -192 119
$$ packed form
1562A34r4k85Q2J20Q9J0J59m51L90q1J17l15q7K15j45oK33l73J01R2K03j18K2
1585A2K7k32K45l20J00K4L59j53l8j86M0R0J08J90j89k0N4J23n27J95J40p5Q2
1608D9n9J75k80J00j47J90l7j13M25l65L6j72K54p6j55J10J5L74j34k14N6M2p7
1631cL8J2k05J62L7l2P7k76L23r8J66j32k21L05j41J13Q1j11J37l42K22j17O8
1654F3J14k27M6Q9j58k26L52j66J1J44m6K9j7J27n7O3l25K03J05l47J96k32K40
1677a9j03R6M5j05J66L9k11K09k16L01k81J80o9j55J94k12L78k58J26k34RL02
1699A82j75j4NJ91k33K4J58o4r4K09n8k23J62j43J26L7K1j6k25LJ2K25M4j26J55
1724A83j36l4R4N9j79Q0k39J20Q6k3l2k01L6kP6l2J13k40J62K14j09k86R8L11
$$ plain form
1748 119 72 262 116 88 212 124 346 144 -214 211 186 -7 -167 -77 2 167 56 -39 121 68 182 -73 17
1771 17 -151 84 -117 -203 -129 43 95 32 -198 -51 -14 -175 -27 -7 -31 67 -178 80 54 95 47 2 -77 136 -191
1796 -191 -194 215 8 -141 46 94 -37 178 -104 -61 16 -33 25 -28 -71 -120 65 -158 -114 123 33 55 -183 69
1820 69 68 -41 -171 61 -40 176 -37 -18 -44 -314 40 -150 -183 173 28 87 -52 -104 122 150 -6 16 102 71
1844 71 24 -43 -46 -108 -233 -17 20 156 -9 166 169 -65 -74 -94 -50 220 121 -112 -241 45 -4 172 247 -133 -113 -18
1870 -18 48 -196 -147 35 90 105 -190 15 1 -185 23 -160 76 10 37 -80 -78 89 26 -76 69 -273 93 175
1894 175 5 -247 21 221 15 81 221 94 88 17 -25 113 -81 64 1 110 -115 -123 157 -121 141 -238 -38
1917 -38 -31 -217 117 -132 -30 -75 45 57 137 -154 -81 34 174 -164 -80 53 3 15 -23 -19 -15 -269 -103 -169 -131 -23
$$ packed form
1748A19m7J90j46k8J24q8K22k02l58M25k5j93j60R0P9J65j11r5J60n3J14k55R0
1771A7j68K35k01q6P4J72N2o3k30J47L7j61J48K0k4R8k45K58k6M1m8m5p9K13l27
1796a91lM09k07j49J87M8j31K15k82M3P7m9N8n3m3m9J85k23M4K37r0K2k38K52
1820F9jj09j30K32j01K16k13J9k6k70L54j90l3L56j45N9j39n2K26K8j56K2Q6l1
1844G1m7o7lo2j25K16L7J36j65J75Lk34rk0M4K70r9k33j29K86m9J76P5l80K0R5
1870a8O6k44M9J82N5J5k95K05j4j86K08j83K36o6K7j17KJ67o3j02J45l42L66Q2
1894A75j70k52K68K00k06O6J40j27op1m2J38j94J45o3J09k25qK80k78K62l79K00
1917c8Pj86L34k49J02m5J20J2Q0k91P3J15J40l38Q4J33n0J2l8MMk54J66o6L8J08
$$ plain form
1943 -23 -195 272 114 64 -86 28 -101 -261 -84 -35 -117 15 -59 185 151 -53 112 17 37 -78 -79 24 201
1966 201 40 386 63 215 192 8 57 0 282 126 59 -59 17 10 54 70 96 -25 132 -219 122 -90 28
1989 28 -143 -35 106 161 51 96 -44 299 -48 -7 -42 -34 10 -73 -117 -222 -60 -54 -81 85 11 -321 140 77 68 -69
2015 -69 -1 -58 -177 0 -51 273 23 23 -158 -185 19 25 185 98 79 215 159 102 66 31 245 -82 -92 -11 -81 -35
2041 -35 255 99 -16 39 91 77 -193 95 61 9 -14 -19 -62 -113 -17 55 17 42 140 228 80 113 65 64 82 44 -89 -135
2069 -135 -64 -197 19 6 60 -104 -94 -145 -19 -43 38 -4 -5 162 -165 -168 -39 27 27 -1 -127 4 -370 100 -182
2094 -182 15 -211 106 -150 213 -61 -42 149 134 29 -217 90 59 45 6 201 3 -110 396 -96 -6 -99
2116 -99 56 186 56 60 -76 203 -78 -63 -64 -81 -45 -235 -36 3 77 -18 -17 -37 -30 -64 -59 -34 -103 -47 92 58 20 131
$$ packed form
1943b3j72M67j58n0j50J14j29j60J77M9q2J32p4K44l4k04J65r5K0j15jJ03J77
1966B01j61L46l23J52k3j84M9n7K82j56o7j18P6pM4J6K6j21J57l51L41k12J18
1989B8j71J08J41N5j10M5j40L43l47M1l5QM4q3m4j05J62Ok7J66p4l32M61o3rj37
2015f9O8n7j19J77n1L24k50%j81k7K04OJ60q7j9J36n6n7l6l5K14l27j0Q1p0M6
2041c5K90j56j15N5N2j4k70K88l4n2k3nm3n1R6P2l8K5R8Q8j48L3m8jJ8l8j33m6
2069a35P1j33K16j3N4j64J0n1J26k4Q1m2jJ67l27lJ29O6%k8j26J31l74M70k82
2094a82J97k26L17k56L63k74J9J91j5j05k46L07l1j4l9J95j98j13N06m92R0r3
2116i9J55J30j30Mj36K79k81J5jj7L6j90J99L9P4r5Jk0Pl4NK5o9N6J39l4l8J11
$$ plain form
2144 131 -312 14 -82 139 -65 -148 -56 -246 -211 109 -78 75 38 -85 135 -372 -167 -127 -145 158 66 203 5
2167 5 -29 -96 88 -33 2 138 29 -31 -172 -107 -61 84 -319 -86 102 93 20 -179 310 -145 -151 -151 -121 20 51 -1
2193 -1 44 -194 -149 -97 -54 -51 -92 212 86 40 71 14 46 193 -59 108 165 59 255 -8 -103 -48 -76 -126 50 101
2219 101 -34 -33 7 -282 -313 -4 -124 121 -101 20 38 5 194 203 69 4 15 -178 92 -77 93 -67 -77 29
2243 29 -168 -164 7 39 -369 113 381 196 74 166 -204 138 -60 -72 54 -130 220 18 32 -28 -116 72 11
2266 11 112 122 28 -287 126 115 -62 130 188 -70 64 188 -25 97 -261 182 93 -187 -64 -47 -139 -164 -18
2289 -18 -45 452 -110 -210 12 29 211 -159 105 -206 141 36 1 203 18 81 -35 57 -246 109 -134 76
2311 76 -123 162 50 111 -104 5 90 64 13 91 60 -161 -175 209 43 175 340 317 211 -188 80 67 -102
$$ packed form
2144A31m43L26r6K21k04q3R2j90L5L20j87J53l7j23K20n07K05M0j8L03r2J37j98
2167El4o7J84j21L5J36j09o0j41O5M6J45m03K33J88rp3j99M89m55o%L0J41L1n2
2193aM5k38M5N2M3Lm1L04j26m6L1n7L2J47k52J67N7j06J96k63r5N5k8n0J76N1
2219A01j35JM0k89l1L09j20K45k22J21J8l3J89Rj34o5J1j93K70j69J70j60j0J06
2243B9j97MJ71L2m08M82K68j85j22R2l70L42j98j2J26j84L50k02J4o0q8J88o1
2266A1J01J0r4l15M13j1j77J92N8k58J34J24k13J22l58M43q9k80J23J7r2k5J46
2289a8k7M97n62j00K22J7J82l70K64l11L47j05l5K02j85O3j16R2l03L55k43K10
2311G6j99K85j12O1k15J09Q5k6n1P8l1k21j4L84j66J32J65k3j06l99K68j3j69
$$ plain form
2334 -102 108 67 14 54 150 -175 -114 -5 -33 200 205 49 2 120 49 -1 3 -73 -9 -93 64 -139 -99 13 -217 -5
2360 -5 274 -112 102 66 -79 10 35 -303 -14 -99 144 -29 -13 85 -189 -48 -121 -110 -24 138 -263 -307 -121 -4
2384 -4 26 218 80 -161 86 13 92 -31 119 -162 154 59 80 -5 -1 119 -114 37 -77 69 -68 15 -219 -24
2408 -24 -55 -67 -246 -3 219 -19 -60 66 7 109 125 -131 -50 -20 -36 -56 169 -105 -60 -89 276 33 87 103 162
2433 162 -39 8 70 -8 4 196 79 -116 163 232 40 -121 -141 -7 73 65 -129 163 -166 62 182 187 27 -49
2457 -49 -10 156 -99 -188 187 -56 8 -198 165 244 -206 44 56 11 -14 61 206 175 -4 24 157 41 -205 173
2481 173 -16 -3 90 -104 -1 -37 142 93 119 95 122 19 -301 -59 49 178 -164 143 6 182 -66 -139 -106
2504 -106 31 104 -193 141 149 90 -113 139 -116 -209 3 48 100 -102 -111 9 -208 -53 5 -63 -132 5 122 -65
$$ packed form
2334a02K10m1n3M0R6l25O1J09k8K33Nj56m7J18p1n0Mp6O4q4J57k03M0J12k30K12
2360eK79l86K14l6j45Q9K5l38K89q5K43j73J6R8k74J41p3J1Q6J62m01m4J86J17
2384dL0J92j38k41K47p3P9j23J50k81L16r5K1q5MJ20k33J51j14J46j37Q3k34J95
2408b4l1j2j79K43K22k38m1J26n9J02J6k56Q1L0j6k0K25k74M5k9L65k43N4J6N9
2433A62k01M7O2p8J2J92j17j95K79O9j92j61k0J34Q0qj94K92l29K28J20Nj60p6
2457d9L9J66k55q9L75k43O4k06L63P9m50K50J2m5k5P5J45l1j79K8J33j16k46L78
2481A73j89J3R3j94J03l6J79m9K6k4K7j03l20K42J08J29l42L07j37J76k48p3L3
2504a06J37P3k97L34Qn9k03K52k55r3K12M5N2k02rJ20k17J55N8o8o9J37J17j87
$$ plain form
2528 -65 -12 191 218 89 18 208 -36 -62 -224 -119 -76 290 -63 44 152 6 -163 -31 14 143 -124 -103 -25
2551 -25 89 9 140 -198 -120 -24 25 -33 -62 11 146 332 128 151 -279 85 252 124 -119 147 174 85 245 16
2575 16 -99 150 -189 -60 163 63 -112 -51 77 -146 238 59 47 26 -132 -183 38 -196 -121 -42 -231 0
2597 0 -90 27 35 9 119 -215 23 -117 -4 -52 -19 -228 -14 -191 -80 1 -90 2 -143 37 23 165 -129 160
2621 160 -149 10 49 75 -88 3 135 66 28 -184 -71 10 -29 72 -38 -29 -103 -137 211 109 123 162 -67 181
2645 181 259 201 87 -116 27 -96 207 21 -272 160 -111 67 81 -103 -29 14 -171 -2 132 10 -112 233
2667 233 -92 110 -2 42 222 11 136 -61 52 -59 167 -177 39 224 -123 -114 177 62 -190 -94 -119 205
2689 205 -28 -345 162 376 -53 -79 114 -49 136 293 -163 -21 -150 -137 79 -37 25 -25 -76 301 -101 12
$$ packed form
2528f5N3K03K7j29p1J90k44k6j62J05M3L66l53J07J08j46j69J32M5J29k67K1P8
2551b5J14q0J31l38P8R6M9n8k9P3J35J86k04K3m30L64J67j28k43K66K7q9J60k29
2575A6j15K49l39J29K23j00j75O1J28k23L84j79j2k1j58n1K21k34P5P9j89K31
2597@r0J17Qk6J10l34K38j40J13m8L3k09K14j77J11Q1r1R2j45J80j4J42k94K89
2621A60l09J59L9K6j63R1J32o9l8k12J13Q1l9J01j10Rp4l4L48j02J4L9k29K48
2645A81P8n8j14k03J43j23L03j86k93M32k71J78J4j84P4M3j85J69J34j22j22L45
2667B33l25K02j12M4J80k11J25j97J13j11K26l44K16J85l47RK91j15k52R6k5L24
2689B05k33l17N07K14m29k6J93j63J85J57m56J42j29J3K16j16O2n0n1L77m02J13
$$ plain form
2711 12 11 103 -106 60 -131 -64 -11 -118 147 -33 24 107 127 85 102 22 -100 -246 -72 -9 23 113 228 267 208 60
2737 60 -220 46 48 -109 97 8 -151 282 89 -43 -33 -24 125 -52 219 78 82 -67 41 -55 182 146 -75 18
2761 18 102 64 -140 91 177 206 -16 33 122 50 -73 -146 95 210 35 -114 132 87 10 -149 -141 69 -7 38 -117
2786 -117 -180 -155 -104 128 -118 -41 128 -214 -179 -221 7 -22 38 -188 -37 22 -47 118 -59 -18 -26 1 -192 38 42
2811 42 1 -116 139 -336 -46 -137 47 -5 154 -288 30 -12 118 332 -206 54 -78 18 161 -24 15 155
2833 155 120 -39 -15 -23 120 -33 -274 -66 -34 160 -21 142 91 179 -67 -3 186 -58 -79 52 -54 -32 -101 7
2857 7 95 34 -89 -19 83 167 -27 213 117 -122 -70 -162 -149 -186 22 -136 -283 1 6 255 -169 -27 184 201 -10
2882 -10 -166 61 92 60 -445 249 50 -68 -22 -196 -113 -323 114 34 -246 -80 5 215 84 93 17 76 -190 54
$$ packed form
2711A2jR2k09J66j91O7N3j07K65j80N7Q3K0m2J7q0j22j46J74O3L2R0J15L9n9j48
2737F0k80K66Kj57K06q9j59M33j93j32J0RJ49j77K71j41Mj49J08r6K37l6k21R3
2761A8Q4l8k04K31Q6K9k22M9Q9p2j23p3K41J15j75j49K46m5p7j59QK10p6M5j55
2786a17o3K5N1K32k46P7J69l42L5m2K28k9O0k26J51N9o9J65j77M1qK7j93K30M
2811D2m1j17K55m75K90r1J84n2J59m42L18m2J30K14n38K60j32R6J43j85L9J40
2833A55l5j59K4qJ43j53k41K08L2J94j81J63n1Q8k46O4J89k44k1J31j06K2o9J08
2857GQ8o1j23P0J02Q4j94K40r6k39N2r2J3l7K08j58j47K84NK49m24J42K11J7k11
2882a0j56K27L1l2n05O94j99j18M6j74Q3k10M37q0k80J66Q5K10j31Rp6N9k66K44
$$ plain form
2906 54 -64 -153 114 120 -8 276 143 -19 -45 170 -97 -7 -52 201 36 4 43 -96 137 -91 -166 -166 -143 -12
2930 -12 -118 11 -28 -164 -38 -85 37 12 -170 -16 -32 -83 -2 -4 -53 27 32 -118 -38 46 88 -44 -76 127 198 49
2956 49 -50 201 262 -53 -179 103 -235 11 14 177 -10 143 -22 233 -116 -87 -34 34 108 250 30 -112 -83
2979 -83 133 0 -32 307 175 97 -172 -159 -95 205 -54 98 115 87 -49 74 38 202 120 135 -128 -16 -36 33
3003 33 255 -114 -276 85 272 57 180 92 -33 -235 -197 100 42 166 -55 109 186 -291 -43 -87 -313 88
3025 88 0 -288 110 -185 171 97 64 -148 -152 265 49 216 -4 -232 -83 -42 165 -85 -55 -193 -98 -5 189
3048 189 84 -75 -106 -207 -40 61 -159 51 -26 -116 -36 -256 204 -339 44 73 -59 98 -117 -126 106 113 -123
3071 -123 -240 180 3 71 185 206 60 -104 -274 -20 82 22 -106 45 42 -305 -244 -35 -34 -241 -85 -203 -6
$$ packed form
2906E4j18q9K67Oj28K84j33j62k6K15k67R0m5K53j65l2L9j39K33k28p5%K3J31
2930a2j06J29l9j36J26m7J22k5j82J54j6n1Q1km9Q0Nj50Q0Q4M2j32l2K03P1j49
2956D9r9K51O1l15j26K82l38K46LJ63j87J53j65K55l49K9N3O8P4J42k20j42K9
2979h3K16j33l2L39j32p8k69J3O4L00k59J52J7k8j36J23l6J64q2J5k63J12k0O9
3003C3K22l69j62L61J87k15J23q8j25k02L8K97n8J24k21J64P7m77K48m4k26M01
3025H8q8k88L98k95L56p4l3k12mM17k16J67k20k28J49M1K07k50L0j38R5R3J94
3048A89j05j59l1j01J67J01k20K10p7r0Q0k20M60n43L83K9j32J57k15rK32Pk36
3071a23j17M20j77O8J14K1j46j64j70K54J02o0j28J51ll47O1K09Jk07J56j18J97
$$ plain form
3094 -6 -18 -115 -11 -38 193 -88 -93 48 127 103 229 29 109 59 -96 5 86 -83 191 23 57 -110 133 -34
3118 -34 142 94 55 30 78 -98 28 107 -152 -199 228 96 285 338 -217 -88 -222 -128 154 124 -103 -95 -73 84
3142 84 90 -113 3 163 28 -24 8 149 -140 230 -263 121 -44 -45 -187 -13 71 -150 250 117 248 -50 -33
3165 -33 -263 65 -155 6 -254 -146 22 -57 -87 9 -110 44 -8 160 -304 -213 -20 14 -83 69 137 -14 238
3188 238 -72 -96 30 -32 -195 -175 114 -66 122 -24 -42 160 53 19 6 85 -167 56 205 -67 102 -187
3210 -187 -303 3 93 34 -185 59 -26 16 104 -225 6 -77 77 -184 -28 -104 -14 -52 159 123 -97 22 -121
3233 -121 -41 -64 48 -36 -12 -172 -104 269 80 27 232 -95 -262 55 -72 -264 93 -61 -35 49 304 -57 -22
3256 -22 -236 25 -87 -44 137 25 -47 -7 -33 168 -173 -60 -99 21 108 -29 -6 234 146 50 -95 110 -25
$$ packed form
3094fj2r7J04k7K31k81nJ41P9k4J26k00Q0n0j55J01Q1j69K74j68L4j67K43j67
3118c4J76m8l9k5M8j76J26P9k59m7M27j32J89N3n55J29j34R4K82l0k27QK2J57
3142H4Ok03J16J60j35n2L2J41k89L70m93L84j65jj42J74Q4k21M00j33J31k98J7
3165c3k30L28k20J61k60J08J68p9l0R6j19J54n2J68m64R1J93L4r7J52O8j51K52
3188B38l10k4J26o2j63K0K89j80J88j46j8K02j07l4j3P9k52K23J49k72J69k89
3210a87j16L06R0n9k19K44q5M2Q8l29K31q3J54k61J56p6R0l8K11l6k20J19j43
3233a21Q0k3J12q4K4j60O8L73j89n3K05l27j67L17j27j92L57j54K6Q4K55l61L5
3256b2k14K61j12M3J81j12p2M0k6K01l41J13l9J20Q7j37K3K40q8r6j45K05j35
$$ plain form
3279 -25 -86 22 -92 -79 46 -215 -277 73 -62 29 139 96 113 -90 -73 -181 -15 101 -155 180 -30 83 137
3302 137 -59 -40 108 125 261 222 44 -37 123 -59 -30 211 5 150 146 -46 -68 18 116 -308 -150 -214 123 83
3326 83 -190 84 139 140 163 140 -47 -186 -88 12 258 110 -129 136 55 -36 251 70 -205 -107 214 -106 -133 -142
3350 -142 74 -69 -108 241 -134 -107 -84 112 -70 -77 -124 -73 54 159 140 36 -72 182 232 -33 81 193 -134
3373 -134 -238 -173 30 -25 15 -152 25 -34 86 -82 -227 236 183 -133 36 -75 18 45 76 137 48 -74 -58 -19
3397 -19 84 163 -54 151 343 39 204 89 -118 195 -106 -149 -47 -195 -100 268 -80 -241 221 -398 168
3418 168 -52 100 8 69 48 -82 -185 76 -93 33 136 -49 6 -142 54 -74 82 -76 35 -194 27
3439 27 -102 -30 99 -122 -151 45 -248 -95 -44 -28 106 63 -77 -114 48 24 -286 92 160 -251 -69 -81 -91 220
$$ packed form
3279b5o1J08j14J3J25k61o2L50j35R1J10m3J7k03J7j08J66J16k56L35k10J13N4
3302A37j96J9J48J7J36l9j78q1J60j82K9K41k06J45mj92k2Q6R8m24J58o4L37m0
3326H3k73K74N5JK3k3j87j39R8J00K46j48k39K65q1r1K87j81k75R8L21l20k7r
3350a42K16j43l9L49l75K7K3J96j82pm7N1J27J05j9j04j08K54N0k65J14J12l27
3373a34j04O5K03n5M0j67J77n9J20j68j45M63n3l16J69j11R3K7L1O1q9j22J6L9
3397a9J03P9k17K05J92l04J65j15k07L13l01m3J02j48R5L68l48j61M62o19N66
3418A68k20J52r2O1k1j30j03K61j69J26J03j85N5j48J96j28J56j58J11k29K21
3439B7j29P2J29k21k9J96k93J53N1J6J34m3j40l7J62k4l10L78O8m11J82j2j0L11
$$ plain form
3463 220 165 -173 12 -70 186 65 43 -234 -21 126 22 -7 -18 -169 -91 23 102 50 -234 -274 98 -117 -45
3486 -45 5 8 -112 -10 -120 -5 107 108 -109 -157 231 209 29 67 133 -317 -143 -60 19 105 -5 -139 -2 -38 137
3511 137 37 35 -77 5 -45 76 111 18 -89 66 55 153 131 33 -161 -109 -229 260 -12 102 29 -120 130 0
3535 0 141 -47 -59 47 164 100 83 -134 -67 62 -86 -107 -133 8 66 -25 16 90 -141 211 -170 -67 86 -118
3559 -118 -97 -34 28 -30 -82 193 124 -31 11 80 -91 -59 -19 3 61 43 56 -50 -205 197 -131 -33 72 -22 53 -179
3585 -179 -266 9 82 -43 -224 61 143 117 250 -47 -58 -93 -39 52 93 97 -85 -3 137 147 -42 -271 65 -20 -32
3610 -32 106 160 225 -50 -25 -212 84 -9 -133 -99 -12 54 323 42 -161 83 155 -103 -74 1 117 61 241 -177
3634 -177 -268 50 -24 -110 44 -131 92 -26 -89 -26 109 -44 -187 97 61 -62 -97 222 -23 308 -68 270
$$ packed form
3463B20n5l38J85q2K56j21k2k77K13J47j04k9j1j51P8J14P9n2k84m0L72k15P2
3486d5N0Lj20J02j10J15J12Jk17m8L88k2j80L8O6m50J74Q3P9Q6j10j34J37l6J75
3511A37j00kj12Q2n0J21L5r3j07J55j1R8k2r8j94N2j20M89k72J14p3j49K50j30
3535@J41j88j2J06J17o4j7k17O7J29j48k1k6J41N8r1M1P4k31L52l81J03J53k04
3559a18K1O3O2n8n2K75o9j55M2O9j71L2M0K2N8j8J3j06j55M02l28R8J05r4P5k32
3585a79q7K75P3j25j81K85Q2k6J33k97j1l5N4R1M1Mj82Q2J40J0j89k29L36q5j2
3610c2J38N4O5k75K5j87K96r3j24L4Q7O6K69k81k03K44P2k58K9P5J16n6J80m18
3634a77r1L18p4q6J54j75K23j18o3O3J35j53j43K84l6j23l5L19k45L31l76L38
$$ plain form
3656 270 -94 -33 -92 -227 5 -25 -447 78 -84 -74 81 -20 -106 73 -55 -136 268 226 -108 5 13 -227 187
3679 187 -14 126 -165 170 96 -61 105 124 -118 7 -10 -153 -192 122 205 -39 27 -29 -42 -156 -250 87 213
3702 213 90 -156 -48 -21 2 -117 -76 250 -204 -140 -167 30 -139 -125 -58 -51 -49 45 -48 -77 49 -381 162 -361 11
3727 11 -41 -74 217 -74 23 234 -4 41 48 -7 36 -169 -262 -91 -216 110 -146 -285 -12 -13 18 40 50 -169 -270
3752 -270 -11 -45 97 227 -63 53 146 165 47 -95 -60 72 124 -227 129 -23 -299 -17 -127 214 102 -211
3774 -211 -84 210 134 -194 9 138 -99 100 128 -210 -52 54 34 63 -227 -13 36 28 103 86 -133 -10 -65
3797 -65 25 260 -164 -7 -226 52 -89 -175 -77 78 156 -81 -71 -197 1 83 82 -40 -224 64 230 78 -33
3820 -33 -27 -139 -238 -28 -165 -221 -59 53 -114 -8 239 -56 -88 -49 -179 334 -46 238 78 33 218 121 -172
$$ packed form
3656B70l64O1n9j35K32l0m22N25j62J0J55j01q6J79j28q1M04m2l34J13Qk40M14
3679A87k01J40k91L35p4j57J66J9k42J25j7j43l9L14Q3k44O6n6j3j14r4L37J26
3702B13j23k46J08K7K3j19M1L26m54O4k7J97j69J4O7PKR4r3k9J26m30N43n23L72
3727A1n2l3K91k91R7K11k38M5Pn5M3k05r3J71j25L26k56j39K73jL1K2J0k19j01
3752b70K59l4J42J30k90J16R3J9j18j42L5J32N2l51L56j52k76K82j10L41j12l13
3774b11J27K94p6l28K03J29k37J99K8l38J58J06k0K9k90K14M9qP5j7k19J23n5
3797f5R0K35m24J57k19K78j41q6R8J55P8k37J0j26J98Q2jj22j84K88J66j52j11
3820c3Oj12r9K10j37n6J62J12j67J06K47k95l2L9j30N13l80K84j60m5J85r7k93
$$ plain form
3843 -172 199 -59 -115 24 7 147 -3 -172 110 -101 -68 37 -68 49 47 -120 -27 14 101 20 -51 -162 106
3866 106 -152 44 11 -29 -22 -1 162 1 -115 69 -109 -51 -16 244 -27 -67 70 -109 66 90 216 124 199 63
3890 63 -21 -120 -80 40 -218 -159 -10 -96 -190 35 -7 74 -80 -228 -175 -28 -224 141 -98 -287 20 -47 -155 68
3914 68 7 -237 227 -101 44 16 -20 408 6 103 -90 87 197 26 -66 -135 132 -1 -51 88 88 -180 326
3937 326 -60 -128 187 27 36 63 219 53 -76 -347 -92 73 -126 54 0 -149 161 178 -78 -196 87 -198
3959 -198 -109 -155 -17 -32 83 63 -8 -4 81 -87 -191 -347 -18 47 25 -246 -48 112 -66 -7 -89 123 -42 -52
3983 -52 70 -28 -75 36 120 39 -27 151 116 -32 -163 56 141 -76 -158 87 109 -181 344 -8 6 121 -32 158
4007 158 101 -81 -102 3 -22 9 246 23 58 -47 -18 18 -21 88 227 0 -17 70 332 -20 -137 73 -73
$$ packed form
3843a72L71k58n6J39j7J40j50j69K82k11L3J05j05J17kj67R3M1Q7q1p1j11K68
3866A06k58J96l3m0PK1J63j61j16J84j78N8L5K60k71m0J37j79J75K4J26r2P5j36
3890F3q4r9M0J20k58N9J49q6r4K25m2Q1j54j48N3J47j96L65k39j89L07o7j08K23
3914F8o1k44M64l28J45k8l6M28m02R7j93J77J10j71r2o9K67j33n0J39%k68N06
3937C26l86o8L15j60RK7J56j66j29k71K55J65j99J80n4j49L10J7k56j18K83k85
3959a98Q9m6J38j5J15k0p1MQ5j68j04j56L29O5k2k71J98J60j78N9q2K12j65j0
3983e2J22r8m7J11Q4q1o6J78l5j48j31K19Q5k17q2K45K2k90N25l52J4J15j53J90
4007A58n7j82k1J05k5L1K37k23L5j05K9L6l9J09J39k27j7Q7K62l52j17K10j46
$$ plain form
4030 -73 -89 104 -203 -35 131 -74 -101 201 74 -270 -105 36 85 -238 231 169 -176 59 50 -15 214 -175 -199
4053 -199 9 126 -79 -107 -5 -40 106 -102 121 4 101 181 -88 10 81 -125 157 -31 17 -145 74 -52
4075 -52 56 -6 72 -123 -230 140 -55 1 -86 -2 -91 -14 48 155 -32 -254 84 131 230 -88 -277 27 -46 -101
4099 -101 -153 -19 74 -214 -233 56 -154 -133 140 230 -178 -152 42 175 -56 136 -47 58 -40 -161 69 -18 -175
4122 -175 28 127 182 -41 189 -160 180 214 -27 -46 353 -46 -178 105 -331 249 -104 -208 -131 44 -122 -271
4144 -271 -47 106 -18 -97 -127 -9 -13 -181 204 -56 -105 -13 -21 -108 -41 -116 -67 164 167 17 -71 168 328 192 58
4169 58 -188 -89 136 2 102 159 -213 53 81 -263 -40 -15 0 -8 -187 -3 326 -203 -206 94 -153 -173 22 87
4193 87 80 146 125 82 38 -140 -168 -113 193 182 -2 122 -318 -25 330 -118 -47 -284 -71 209 -177 -28 193 6
$$ packed form
4030g3j6J93l07J68J66k05k7L02j27l44J65J41M9l23M69o2l45K35ro5K29l89k4
4053a99K08J17k05k8J02l5J46k08K23j17R7Q0k69R8P1k06K82j88M8j62K19j26
4075e2J08o2P8j95j07L70j95N6q7Q4q9P7O2J07j87k22L38M7R9l18j89L04p3n5
4099a01n2J34R3k88j9K89k10K1K73R0m08K6J94J33k31J92j83J05r8j21K30q7j57
4122a75K03R9N5k23K30l49L40L4k41j9L99l99j32K83m36N80l53j04P7J75j66j49
4144b71K24J53j24p9l0J18mj68L85k60m9R2qq7O7p5M9K31Lj50q8K39J60j36j34
4169E8k46R9K25j34J00N7l72K66K8l44K23K5J5qj79J84L29n29lL00k47k0J95O5
4193H7pO6k1m3m4j78k8N5L06j1j84J24m40K93L55m48P1k37K13K80l86J49K21j87
$$ plain form
4217 6 -232 141 -3 127 106 19 -21 152 -66 -47 240 56 214 -33 3 33 47 -34 -190 -139 -27 -26 -105 114 2
4242 2 21 263 -181 -71 26 -64 -313 -124 -100 -91 -37 209 80 -229 55 6 21 43 -67 17 -6 -60 119 80 -90
4267 -90 83 110 389 -255 -53 71 83 -202 144 107 155 35 154 335 -38 143 -190 17 -72 2 -83 195 -5
4290 -5 -53 88 14 21 40 -249 273 -115 -32 -230 -36 4 81 88 -132 -33 52 -39 160 -41 -189 -8 83 236 17
4315 17 -4 237 115 -247 126 11 189 -202 36 -56 99 26 -85 -171 136 -97 -175 -240 -5 -173 -194 27 -22
4338 -22 -66 40 -52 -156 -7 -104 46 40 -6 24 -20 38 -23 -245 -13 64 -147 -115 -58 -211 128 105 -65 -150 -31
4363 -31 -168 48 -114 -50 -47 -195 57 -78 60 -44 -311 292 -71 -96 173 38 40 -3 -89 19 -38 -105 -252 -7
4387 -7 166 -65 12 3 -50 -34 -8 55 31 165 52 -77 60 -291 -219 117 -194 51 -33 97 60 140 -19 -59 -115
$$ packed form
4217Fk38L73j44J30k1q7m0J73k18J9K87j84J58k47L6L0J4q1j56N1J12Jp9K19j12
4242BJ9K42m44J10R7r0k49J89K4RN4K46j29l09K84m9J5K2j10Q4k3n4J79l9j70
4267i0J73K7K79o44K02J24J2k85L46l7M8j20J19J81l73J81l33K07q9P4q5K78k00
4290em8J41p4PJ9k89N22l88Q3j98J94M0P7Pk20R9Q5r1J99k01j48J81R1J53k19
4315A7k1K41j22l62L73j15J78l91K38r2J55p3j11q6L07k33p8o5K35j68k1K21m9
4338b2m4J06r2j04J49r7J50om6L0m4N8o1k22K32P7k11L2N7j53L39k3j70q5J19
4363c1j37K16j62O4Lj48K52j35J38j04k67O03l63k5K69j35Km3q6J08n7o7j47K45
4387gJ73k31P7rn3J6K6O3k4J34j13j29J37l51P2L36l11K45q4J30l7Q0j59m0n6
$$ [...]
8191a8
##END NTUPLES=NMR FID
##END=
