##TITLE=1H_DE18kwTFA
 CDCl3
 8 sc, 
 27.9.2023
##JCAMPDX= 6.0         $$ Bruker NMR JCAMP-DX V2.0
##DATA TYPE= NMR FID
##DATA CLASS= NTUPLES
##ORIGIN= UXNMR, Bruker Analytische Messtechnik GmbH
##OWNER= root
$$ XWIN-NMR		Version 3.5
$$ Wed Sep 27 16:23:45 2023 Russian Standard Time (UT+4h)  she@DPX200
##.OBSERVE FREQUENCY= 200.13135
##.OBSERVE NUCLEUS= ^1H
##.DELAY= (6, 6)
##.ACQUISITION MODE= SIMULTANEOUS
##.ACQUISITION SCHEME= undefined
##.AVERAGES= 8
##.DIGITISER RES= 18
##SPECTROMETER/DATA SYSTEM= spect
##.PULSE SEQUENCE= zg30
##.SOLVENT NAME= CDCl3
##.SHIFT REFERENCE= (INTERNAL, CDCl3, 0, 15.7039)
##AUDIT TRAIL= $$ (NUMBER, WHEN, WHO, WHERE, WHAT)
$$ ##TITLE= Audit trail, XWIN-NMR		Version 3.5
$$ ##JCAMPDX= 5.01
$$ ##ORIGIN= Bruker BioSpin GmbH
$$ ##OWNER= she
$$ F:/spectra/data/she/nmr/H-F/1/audita.txt
$$ ##AUDIT TRAIL=  $$ (NUMBER, WHEN, WHO, WHERE, WHAT)
(   1,<2023-09-27 16:22:32.79 +0400>,<she>,<DPX200>,
      <created by zg, POWCHK disabled, PULCHK disabled
       configuration hash MD5:
       00 E9 B6 7A A2 85 ED C7 34 08 36 98 17 FE 4E 26
       data hash MD5: 16K
       D6 07 29 CF D4 55 59 7D A7 E2 EB B1 64 5D E9 E1>)
$$ ##END=
$$ 
$$ hash MD5
$$ 58 26 0D 64 DE 50 57 1E A0 2D 36 A2 21 42 9B BB
##$RELAX= 
##$RELAX= 
##$RELAX= 
##$RELAX= 
##$RELAX= 
##$RELAX= 
$$ Bruker specific parameters
$$ --------------------------
##$DU= <F:/spectra>
##$EXPNO= 1
##$NAME= <H-F>
##$PROCNO= 1
##$TYPE= <nmr>
##$USER= <she>
##$AMP= (0..31)
100 100 100 100 100 100 100 100 100 100 100 100 100 100 100 100 100 100 
100 100 100 100 100 100 100 100 100 100 100 100 100 100 
##$AQSEQ= 0
##$AQ_mod= 1
##$AUNM= <au_zg>
##$AUTOPOS= <>
##$BF1= 200.13
##$BF2= 200.13
##$BF3= 200.13
##$BF4= 200.13
##$BF5= 200.13
##$BF6= 200.13
##$BF7= 200.13
##$BF8= 200.13
##$BYTORDA= 1
##$CFDGTYP= 0
##$CFRGTYP= 5
##$CHEMSTR= <none>
##$CNST= (0..31)
1 1 145 1 1 1 1 1 1 1 1 1 1 1 1 1 1 1 1 1 1 1 1 1 1 1 1 1 1 1 1 1 
##$CPDPRG= <>
##$CPDPRG1= <>
##$CPDPRG2= <>
##$CPDPRG3= <>
##$CPDPRG4= <mlev>
##$CPDPRG5= <mlev>
##$CPDPRG6= <mlev>
##$CPDPRG7= <mlev>
##$CPDPRG8= <mlev>
##$CPDPRGB= <>
##$CPDPRGT= <>
##$D= (0..31)
0 1.2 0 0 0 0 0 0 0 0.06 0 0.03 0 0 0 0 0.0002 0 0 0 0 0 0 0 0 0 0 0 0 
0 0 0 
##$DATE= 1695817352
##$DBL= (0..7)
120 120 120 120 120 120 120 120 
##$DBP= (0..7)
150 150 150 150 150 150 150 150 
##$DBP07= 0
##$DBPNAM0= <>
##$DBPNAM1= <>
##$DBPNAM2= <>
##$DBPNAM3= <>
##$DBPNAM4= <>
##$DBPNAM5= <>
##$DBPNAM6= <>
##$DBPNAM7= <>
##$DBPOAL= (0..7)
0.5 0.5 0.5 0.5 0.5 0.5 0.5 0.5 
##$DBPOFFS= (0..7)
0 0 0 0 0 0 0 0 
##$DE= 6
##$DECBNUC= <off>
##$DECIM= 32
##$DECNUC= <off>
##$DECSTAT= 4
##$DIGMOD= 1
##$DIGTYP= 9
##$DL= (0..7)
0 120 120 120 120 120 120 120 
##$DP= (0..7)
150 150 150 150 150 150 150 150 
##$DP07= 0
##$DPNAME0= <>
##$DPNAME1= <>
##$DPNAME2= <>
##$DPNAME3= <>
##$DPNAME4= <>
##$DPNAME5= <>
##$DPNAME6= <>
##$DPNAME7= <>
##$DPOAL= (0..7)
0.5 0.5 0.5 0.5 0.5 0.5 0.5 0.5 
##$DPOFFS= (0..7)
0 0 0 0 0 0 0 0 
##$DQDMODE= 0
##$DR= 18
##$DS= 0
##$DSLIST= <SSSSSSSSSSSSSSS>
$$ [...]
##$SUBNAM2= <"">
##$SUBNAM3= <"">
##$SUBNAM4= <"">
##$SUBNAM5= <"">
##$SUBNAM6= <"">
##$SUBNAM7= <"">
##$SUBNAM8= <"">
##$SUBNAM9= <"">
##$SW= 18.05172834244
##$SWIBOX= (0..15)
0 0 2 0 0 0 0 0 0 0 0 0 0 0 0 0 
##$SW_h= 3612.71676300578
##$TD= 16384
##$TD0= 1
##$TE= 0
##$TE2= 300
##$TE3= 300
##$TEG= 300
##$TL= (0..7)
0 120 120 120 120 120 120 120 
##$TP= (0..7)
150 150 150 150 150 150 150 150 
##$TP07= 0
##$TPNAME0= <>
##$TPNAME1= <>
##$TPNAME2= <>
##$TPNAME3= <>
##$TPNAME4= <>
##$TPNAME5= <>
##$TPNAME6= <>
##$TPNAME7= <>
##$TPOAL= (0..7)
0.5 0.5 0.5 0.5 0.5 0.5 0.5 0.5 
##$TPOFFS= (0..7)
0 0 0 0 0 0 0 0 
##$TUNHIN= 0
##$TUNHOUT= 0
##$TUNXOUT= 0
##$USERA1= <user>
##$USERA2= <user>
##$USERA3= <user>
##$USERA4= <user>
##$USERA5= <user>
##$V9= 5
##$VALIST= <valist>
##$VCLIST= <CCCCCCCCCCCCCCC>
##$VD= 0
##$VDLIST= <DDDDDDDDDDDDDDD>
##$VPLIST= <PPPPPPPPPPPPPPP>
##$VTLIST= <TTTTTTTTTTTTTTT>
##$WBST= 1024
##$WBSW= 4
##$XGAIN= (0..3)
0 0 0 0 
##$XL= 0
##$YL= 0
##$YMAX_a= 130709
##$YMIN_a= -124280
##$ZGOPTNS= <>
##$ZL1= 120
##$ZL2= 120
##$ZL3= 120
##$ZL4= 120
##$ABSF1= 10
##$ABSF2= 0
##$ABSG= 5
##$ABSL= 3
##$ALPHA= 0
##$AQORDER= 0
##$ASSFAC= 0
##$ASSFACI= 0
##$ASSFACX= 0
##$ASSWID= 0
##$AUNMP= <proc_1d>
##$AZFE= 0.1
##$AZFW= 0.1
##$BCFW= 1
##$BC_mod= 2
##$BYTORDP= 1
##$COROFFS= 0
##$CY= 11.3945322036743
##$DATMOD= 1
##$DC= 2
##$DFILT= <>
##$DTYPP= 0
##$F1P= 15.7292609196834
##$F2P= 12.9074282941183
##$FCOR= 0.5
##$FTSIZE= 0
##$FT_mod= 4
##$GAMMA= 1
##$GB= 0.15
##$INTBC= 1
##$INTSCL= 1
##$ISEN= 128
##$LB= 0.24
##$LEV0= 0
##$LPBIN= 0
##$MAXI= 10000
##$MC2= 0
##$MEAN= 0
##$ME_mod= 0
##$MI= 1.114404
##$NCOEF= 0
##$NC_proc= 0
##$NLEV= 6
##$NOISF1= 3.799351
##$NOISF2= 2.8
##$NSP= 1
##$NTH_PI= 0
##$NZP= 0
##$OFFSET= 15.70392
##$PC= 1
##$PHC0= -21710.31
##$PHC1= 12.25271
##$PH_mod= 1
##$PKNL= yes
##$PPARMOD= 0
##$PSCAL= 0
##$PSIGN= 0
##$REVERSE= no
##$SF= 200.130013532006
##$SI= 16384
##$SIGF1= 3
##$SIGF2= 2
##$SINO= 400
##$SIOLD= 16384
##$SREGLST= <1H.CDCl3>
##$SSB= 0
##$STSI= 0
##$STSR= 0
##$SW_p= 3612.71676300578
##$SYMM= 0
##$S_DEV= 0
##$TDeff= 0
##$TDoff= 0
##$TI= <>
##$TILT= no
##$TM1= 0
##$TM2= 0
##$TOPLEV= 0
##$USERP1= <user>
##$USERP2= <user>
##$USERP3= <user>
##$USERP4= <user>
##$USERP5= <user>
##$WDW= 1
##$XDIM= 8192
##$YMAX_p= 0
##$YMIN_p= 0
$$ End of Bruker specific parameters
$$ ---------------------------------
##NTUPLES= NMR FID
##VAR_NAME=  TIME,          FID/REAL,        FID/IMAG
##SYMBOL=    X,             R,               I
##VAR_TYPE=  INDEPENDENT,   DEPENDENT,       DEPENDENT
##VAR_FORM=  AFFN,          ASDF,            ASDF
##VAR_DIM=   8192,          8192,            8192
##UNITS=     SECONDS,       ARBITRARY UNITS, ARBITRARY UNITS
##FACTOR=    0.0002768,     1,               1
##FIRST=     0,             0,               0
##LAST=      2.2672688,     0,               0
##MIN=       0,             -124280,         0
##MAX=       2.2672688,     130709,          0
$$ Real data points
##PAGE= N=1
##DATA TABLE= (X++(R..R)), XYDATA
0 0 0 0 0 0 0 0 0 0 0 0 0 0 0 0 0 0 0 0 0 -6 8 -8 8 -8 8 -9 16 -16 16 -22 24 -25 32 -35 40 -45 49 -55 61 -69 77
41 77 -85 93 -105 116 -127 141 -156 173 -189 207 -230 252 -279 308 -341 380 -423 473 -534 606
61 606 -697 812 -960 1167 -1470 1960 -2872 5110 -21132 11552 123270 36868 -124280 -85150
75 -85150 72130 119646 49000 -74890 -113536 14559 130709 58747 -60205 -82284 -36462
86 -36462 49607 105149 13184 -112996 -84561 40769 97838 35051 -83744 -104484 12506
97 12506 93511 40119 -38528 -61332 -33250 37845 84017 26858 -62871 -65891 9841 78119
109 78119 61097 -38536 -88028 -13168 70589 61876 -8030 -66346 -51930 28310 73342 23277
121 23277 -56961 -73304 -4014 71268 52972 -37977 -77136 -18783 51787 55602 -2394 -57534
133 -57534 -42859 23213 58211 28332 -31865 -60124 -11017 59781 52035 -18528 -57136 -27728
145 -27728 31942 56833 14464 -46771 -48613 7702 51070 36262 -23928 -62582 -20437 50295
157 50295 47592 -13757 -49069 -30882 18884 49947 17966 -38757 -45850 -1584 40539 37057 -12510
170 -12510 -51826 -22001 39054 46342 -1128 -37092 -28992 11940 43056 24265 -22856 -40033
182 -40033 -9839 35184 42150 -5558 -47576 -26687 25718 40212 4477 -34302 -34641 2227 34036
195 34036 22472 -16401 -38595 -18295 25705 39471 7 -40507 -26056 20685 39197 13434
207 13434 -23630 -27909 2855 31402 26925 -5582 -31316 -19443 20593 37367 5244 -33451
219 -33451 -28547 9319 31354 12913 -21608 -31546 -7899 19863 22956 -1744 -30140 -24777 13490
232 13490 35137 10716 -25527 -26178 6573 31272 20330 -10585 -23984 -6507 19374 26329 6268
245 6268 -22979 -24151 8324 30837 11999 -21933 -27519 -1282 21598 15552 -10089 -25375 -14940
258 -14940 9250 21233 7036 -20219 -24775 3315 28514 16720 -13885 -22987 -1673 21121
270 21121 19617 -1293 -17443 -12243 8623 23207 12186 -13784 -22884 -829 23278 15540 -12403
283 -12403 -24387 -8193 13446 15339 -1313 -17059 -16106 1936 18308 12291 -11426 -22587 -4312
296 -4312 19918 17709 -5960 -18385 -6144 12704 17463 4715 -10761 -13535 813 17277 15022
309 15022 -7018 -20347 -6250 15841 16470 -4148 -18094 -10424 6203 12847 4155 -10044 -15384
322 -15384 -4453 12799 14401 -4521 -19510 -8837 12340 15946 -632 -14006 -9030 5997 14042
335 14042 8870 -4464 -12217 -4581 12058 16015 -610 -16352 -9671 9862 15453 1714 -11703
348 -11703 -9904 1165 9469 7102 -4195 -14378 -9508 7028 13344 -163 -15422 -11224 6669
361 6669 13743 2983 -8960 -8971 326 9140 10082 1071 -9536 -7368 7969 15954 4419 -11225
375 -11225 -10196 4793 12795 3907 -7747 -9405 -2802 4704 7490 599 -11404 -11967 2446 11943
389 11943 3084 -11416 -12082 2049 11499 5335 -4955 -6638 -1542 5213 9675 5030 -6336 -8943
403 -8943 3446 14118 7252 -7021 -9488 1270 9431 5195 -4161 -8047 -4834 802 5996 3169
417 3169 -7644 -12426 -1814 10059 5597 -7595 -10465 -1125 7235 6107 -1118 -5127 -3050 2588
431 2588 8356 7362 -2778 -8873 -443 11205 8467 -4234 -8607 -1071 6002 5251 -234 -5585 -6281
446 -6281 -1623 4846 4692 -4136 -11153 -4483 7652 6709 -4519 -8559 -2339 4448 4787 1382 -2588
461 -2588 -4358 -714 6359 8642 392 -8045 -3205 8593 8688 -1915 -6913 -2037 3481 4181 1394
476 1394 -2484 -5737 -3308 3193 5843 -1014 -9848 -6487 5168 6769 -2839 -7229 -2241 2713 2747
491 2747 1727 170 -3266 -3162 3571 8115 2756 -5805 -4247 5521 8685 1271 -5591 -3488 2121
506 2121 3324 1894 25 -3690 -5728 581 6978 774 -8771 -6837 2345 5369 -410 -6210 -4082
521 -4082 1729 3098 1121 931 -1209 -3598 831 7034 4028 -3803 -3843 2715 6577 3231 -2732 -2540
537 -2540 1377 1891 1438 1724 -2673 -6470 -772 5685 1577 -6088 -6295 -638 4106 1928 -4684 -4565
553 -4565 549 1302 939 2453 -708 -4442 1085 6986 3611 -2228 -3229 1252 5137 3862 -1307 -1949
569 -1949 926 712 866 3447 -942 -6250 -2268 4237 2030 -3879 -5552 -1584 3254 1879 -3033 -3248
585 -3248 -498 -108 1040 2951 -455 -3888 -275 5029 4728 -181 -2959 642 4629 2682 -920 -348
601 -348 -113 -1276 1720 3582 -812 -4893 -2580 2293 3049 -1815 -6072 -3181 2312 964 -1673 -1391
617 -1391 -1242 -1728 1674 3185 13 -3413 -1270 3893 4758 -412 -2899 1067 3904 1615 603 763
633 763 -949 -1539 1185 2444 263 -3226 -3634 1218 3888 -2034 -5168 -859 1171 -1047 -451 297
649 297 -2597 -2367 1012 2948 1682 -1972 -3068 2396 5483 450 -2840 908 2697 1068 1193 1524
665 1524 -766 -1177 496 2806 1418 -3427 -4337 1177 3391 -1870 -4018 -1023 181 -783 -776 -296 -958
682 -958 -2071 -1457 2160 3651 -1839 -3440 2279 4911 361 -1380 682 1145 1149 1289 1049 510 -927
699 -927 -1140 2378 3104 -2471 -5010 719 2950 -1400 -3493 -1277 -452 -695 -696 -659 -328 -1496 -1968 1520
717 1520 3047 -976 -2793 1410 3798 1025 -419 575 1138 955 884 1799 1115 -1387 -1281 1836 3106
734 3106 -1669 -3482 -134 2008 -311 -2573 -1477 -711 -1108 -900 109 -172 -1889 -1542 1297 2316
750 2316 -483 -2219 668 2786 1094 -102 1125 1527 187 782 2450 1237 -1323 -1441 1599 2151
766 2151 -814 -2891 -536 1452 -140 -2057 -1227 -300 -1664 -1585 916 516 -2457 -1979 1462 2299 -218
783 -218 -1979 211 2256 1120 -320 866 1771 -194 -174 2276 2033 -1232 -1778 1299 2272 -663 -2261
800 -2261 -746 1091 -10 -1617 -982 -79 -1653 -2070 510 980 -2258 -2465 965 2179 -301 -1667
816 -1667 345 2088 1091 -34 877 1622 -36 -157 1889 2500 -622 -1674 1050 2250 -146 -1862
832 -1862 -799 746 -303 -1342 -414 42 -1686 -2024 605 1141 -1888 -2828 362 2008 -295 -1481
848 -1481 308 1848 835 188 1564 2140 235 -502 1744 2483 -339 -1564 707 2198 291 -1766
864 -1766 -404 405 -818 -1623 1 159 -2025 -2247 264 1122 -1140 -2438 -326 1644 516 -1293
880 -1293 21 1607 455 -359 1825 1959 -28 -406 1944 2486 69 -1374 273 2002 263 -1772
896 -1772 -444 690 -579 -1720 -318 302 -1683 -2272 59 956 -1107 -2249 -106 1490 270 -938
912 -938 247 1615 129 -337 1050 1712 89 -762 1300 2618 365 -1227 349 1663 8 -1500
928 -1500 -168 161 -626 -1184 -140 326 -1299 -2155 -300 1285 -979 -2558 -224 1144 -498 -931 544
945 544 985 -72 -242 856 2022 186 -1211 1191 2835 309 -1338 692 1875 -235 -716 -25
961 -25 62 -1061 -1213 -48 359 -948 -2647 -249 1472 -997 -2213 -98 1238 -573 -1012 126 1274
978 1274 -6 -489 1237 2136 290 -1009 986 2667 338 -1189 503 1580 158 -849 108 915
994 915 -353 -2100 -59 1134 -1471 -2719 -500 1362 -1108 -2018 -493 662 -36 -908 -106 1273
1010 1273 192 -1153 972 2560 264 -1290 1548 2547 454 -773 748 1162 320 -747 -369 1012
1026 1012 -449 -1916 -156 1293 -871 -2625 -805 926 -488 -2076 -789 779 -122 -1143 -174
1041 -174 1402 301 -988 848 2149 512 -987 850 2006 989 -667 -42 1583 223 -1141
1056 -1141 -146 1298 -691 -1982 -324 1145 -702 -2061 -932 588 -16 -1695 -1229 515 -117 -1279
1072 -1279 221 1028 -48 -844 949 1644 570 -524 531 1755 1154 -937 -316 1968 359 -1494
1088 -1494 223 1223 -484 -1727 -292 294 -499 -1723 -1123 -2 276 -1677 -1142 891 50 -1845
1104 -1845 98 1642 -161 -993 683 1924 227 -680 539 1473 804 -445 -192 1622 720 -1071
1120 -1071 -208 1596 -63 -1777 -281 1006 -415 -2203 -577 861 -547 -1540 -776 640 -219 -1111
1136 -1111 -248 1249 553 -1600 100 1944 917 -968 287 1901 831 -416 357 1245 763 -883
1152 -883 -107 1006 160 -1560 -922 1042 -106 -2093 -699 554 -606 -1514 -630 274 -234 -811 -713 489
1170 489 605 -1118 -357 2260 894 -936 648 1896 423 -350 868 1158 419 -299 -17 892 554
1187 554 -1093 -934 1088 98 -1912 -871 501 -704 -1746 -310 126 -482 -848 -277 669 402 -916
1204 -916 -415 1767 1237 -566 291 1733 856 -216 444 1525 239 -586 -76 911 337 -1276 -974 409
1222 409 76 -1732 -1126 313 -277 -1432 -568 833 -178 -1502 -477 709 449 -820 -424 1238 850
1239 850 -388 -29 1614 1074 -518 61 1551 618 -671 53 1250 190 -1249 -443 220 364 -1230
1256 -1230 -1171 281 -243 -1424 -1014 653 -176 -1209 -376 712 -24 -909 -28 1071 705 -466 -122 1362
1274 1362 961 -250 -34 1361 779 -594 32 1173 368 -1060 -442 592 -111 -1345 -826 535 -306
1291 -306 -1295 -911 506 -71 -1472 -689 666 -28 -982 -342 1158 565 -409 238 1174 800 -212 81
1309 81 1387 677 -583 59 1254 501 -940 -489 701 46 -976 -910 402 -179 -1331 -1068 228 -196
1327 -196 -1435 -709 748 333 -1055 -160 1055 596 -587 15 1439 1062 -678 291 1317 805 -540
1344 -540 -95 810 747 -778 -589 613 95 -1168 -545 639 -99 -1175 -1095 282 -316 -1222 -758 685
1362 685 478 -886 -505 1229 790 -677 -185 1209 1128 -222 152 1247 929 -633 97 932 583 -723
1380 -723 -533 660 177 -1476 -770 -31 -27 -1122 -1043 278 178 -1487 -814 656 213 -901 -589 681
1398 681 504 -293 -111 1165 1083 -313 15 1123 1015 -395 -83 1030 864 -796 -638 772 412 -1053
1416 -1053 -759 281 42 -1297 -1238 253 -88 -1131 -674 536 420 -858 -567 964 595 -469 -97
1433 -97 1167 1064 -418 -36 1193 949 -526 -313 875 711 -666 -229 624 289 -950 -1029 409 35
1451 35 -1391 -1103 324 -107 -1282 -844 172 511 -913 -424 654 481 -535 -223 970 1048 -259 82
1469 82 1237 736 -265 -126 1172 693 -668 -629 591 450 -1096 -1058 146 312 -1288 -1426 43 172
1487 172 -1109 -957 268 176 -480 -323 743 733 -213 -358 954 1064 -146 -176 1328 1038 -206 -214 955
1506 955 794 -446 -621 757 515 -517 -807 -127 208 -692 -1242 123 251 -863 -670 -40 279 -477
1524 -477 -397 547 680 -189 -140 767 754 -147 -34 835 1000 15 -271 779 962 -380 -333 441 604 -859
1544 -859 -698 437 107 -692 -999 392 -123 -832 -726 191 170 -974 -608 429 696 -349 -431 718 817
1563 817 -122 -317 645 967 -48 -292 758 856 -223 -467 715 562 -652 -792 207 163 -973 -801 -41
1582 -41 -19 -888 -921 31 438 -797 -634 374 641 -529 -405 564 616 -185 116 988 1097 96 -279 710
1602 710 793 -3 -520 578 602 -750 -813 182 199 -921 -816 -27 66 -669 -757 116 161 -473 -802 42 701
1623 701 -155 -478 711 941 -310 -158 846 909 -29 51 614 756 -48 -307 423 768 -317 -508 137
1642 137 481 -865 -1051 -102 262 -770 -913 -62 362 -640 -752 420 557 -127 -634 617 858 -53
1660 -53 -124 912 933 -53 -122 734 439 -246 -199 278 911 -378 -1014 24 508 -751 -952 86 -27 -759
1680 -759 -819 138 16 -570 -869 243 132 -60 -557 568 938 90 -403 721 900 168 -114 785 783 -10
1700 -10 -111 520 443 -95 -574 -133 522 -603 -918 -278 149 -736 -870 -27 146 -537 -947 81 651 -223
1720 -223 -484 160 889 -86 -117 677 863 119 -58 490 956 196 -386 385 828 -306 -631 72 505 -663
1740 -663 -862 -40 6 -734 -888 14 440 -595 -721 10 359 -184 -418 354 878 146 -391 612 937 392
1760 392 -348 1132 621 151 -316 357 558 -194 -663 232 460 -629 -806 70 321 -372 -1169 -316 404
1779 404 -632 -668 -66 521 -211 -611 125 763 110 -380 468 1088 -51 -345 381 930 239 -24 412 507
1799 507 -35 -640 -33 280 -546 -756 -282 359 -578 -967 -51 263 -488 -614 142 309 -265 -314 274 567
1819 567 193 -207 152 720 -12 -36 355 728 255 -99 564 605 -86 -451 -144 213 -266 -806 -202 -16 -416
1840 -416 -826 -169 147 -463 -875 56 509 109 -761 147 500 43 -126 409 812 -51 10 342 772 235
1860 235 -145 299 797 48 -727 -47 685 -69 -963 -169 203 -392 -781 -212 290 -368 -869 -100 607 -299
1880 -299 -489 105 660 -140 -464 418 866 217 -51 286 997 130 -381 132 595 130 -506 -58 371 -39
1900 -39 -716 -35 348 -499 -991 -483 234 -482 -802 -294 162 -129 -761 -188 603 372 -279 280 812 400
1920 400 -349 208 864 321 -451 289 670 117 -342 117 399 59 -816 -114 210 -667 -696 -366 205 -295
1940 -295 -676 -61 202 -234 -443 -192 492 12 -314 369 829 253 -105 530 719 410 -258 354 963 29
1960 29 -264 63 416 -310 -496 -26 240 -377 -653 -402 209 -208 -509 -109 146 -65 -466 -102 394 136
1980 136 -278 78 439 66 -124 331 873 181 -256 75 656 95 -337 37 551 -135 -600 -91 -12 47 -718
2001 -718 -335 91 -250 -760 -278 439 -176 -610 -167 575 -49 -286 -18 618 263 -198 601 463 269 -230
2021 -230 191 755 220 -129 -120 449 247 -480 293 256 -169 -499 -187 261 -475 -526 -353 28 -90 -846 -285
2042 -285 451 -166 -349 74 617 266 -385 201 528 474 -109 170 758 320 -391 173 615 -24 -516 21
2062 21 234 -208 -425 -589 235 -204 -928 -176 329 -246 -644 -378 270 -210 -434 -127 468 139 -280 223
2082 223 737 352 -211 56 569 157 -441 22 532 253 -458 -179 163 -172 -607 -132 304 -96 -594 -161
2102 -161 297 -178 -650 -143 372 99 -262 -73 769 200 -231 366 827 485 -118 107 694 77 -202 153
2122 153 473 221 -446 -149 522 -139 -508 -405 211 -179 -662 -308 -167 -204 -358 -127 414 305 -625 153
2142 153 610 172 -88 65 745 432 -47 85 471 238 -259 -72 524 196 -500 -35 260 -86 -511 -276
2162 -276 341 -164 -574 -203 135 -35 -479 -102 224 -3 -229 55 456 315 -321 -13 630 445 -259 169
2182 169 655 335 -132 102 341 196 -531 -58 231 -160 -528 -227 437 -121 -819 -46 71 -222 -639 -9
2202 -9 222 7 -244 -143 615 145 -302 93 703 223 -26 -52 611 220 -50 42 430 266 -95 -107 408 1
2224 1 -442 20 242 37 -601 -345 187 -49 -656 -48 364 233 -555 1 219 251 -169 -62 563 220 100
2245 100 207 793 130 27 153 187 102 -115 22 483 157 -346 -361 387 12 -709 -213 317 -224 -625 -275
2266 -275 39 212 -561 -222 253 268 -329 -107 627 182 -172 -40 571 369 -72 -54 312 255 -354 -253 175
2287 175 265 -396 -303 160 -22 -431 -260 234 35 -579 -305 349 148 -239 -405 47 24 -152 -24 484 394
2308 394 -89 125 552 406 -227 223 578 304 -162 21 388 304 -328 -25 -39 -9 -602 -682 258 23 -548
2329 -548 -163 -30 160 -483 7 385 141 -143 -238 572 399 -3 202 605 319 71 202 426 296 -195
2349 -195 -77 160 167 -305 -196 334 152 -383 -345 78 -43 -391 -429 40 44 -705 -2 244 224 -372 -110 243
2371 243 332 37 -44 510 136 -63 -17 961 425 -110 -209 317 435 -227 -213 161 -95 -225 -349 -154 97 -303
2393 -303 -542 171 41 -246 -291 255 90 -274 -193 395 156 -300 113 572 285 -85 -22 419 324 -408 -123
2414 -123 297 205 -310 -257 27 71 -592 -580 88 110 -212 -572 82 -82 -156 -529 186 135 -314 -51 665 281
2436 281 -168 -67 264 330 91 100 605 591 -323 -74 183 163 -170 -190 199 -140 -25 -309 179 -328 -457 -192
2458 -192 38 -96 -346 -125 158 231 -278 -78 385 137 -41 119 543 572 -92 -10 377 461 -239 -340 313
2479 313 315 -191 -89 -164 247 -341 -381 272 -236 -505 -187 19 39 -623 -429 524 283 -279 -78 340 157 -199
2501 -199 -57 419 423 101 -3 286 532 23 -90 388 137 -143 49 -206 145 -137 -411 -42 -143 -316 -134
2522 -134 324 -72 -384 -590 181 36 -260 55 383 348 -177 -168 434 528 245 129 112 363 -116 -173 246 150
2544 150 -356 -309 158 86 -203 -383 164 74 -59 -481 -46 -145 -462 -463 -110 235 -70 -233 149 281 237 -30
2566 -30 123 204 -61 54 249 472 88 105 408 494 -142 -316 362 148 -206 -350 -86 27 -209 -322 49
2587 49 18 -218 -262 -27 185 -85 -252 542 52 87 -16 247 231 -16 -13 395 257 -130 -33 362 313 -206 32
2610 32 186 244 -250 -485 30 198 -384 -365 -369 104 -344 -504 -321 206 -204 -413 329 222 -2 -206 239 108
2632 108 -326 45 308 307 46 95 -29 181 -131 -293 103 281 8 -482 -20 136 -337 -417 -67 -56 -216 -356
2654 -356 89 33 -137 -9 91 196 -11 -149 362 230 48 -71 645 356 -73 128 385 412 -137 -299 -57
2675 -57 206 -447 -143 -154 150 -559 -418 174 -58 -87 -307 -114 -23 -281 -464 62 75 -204 -139 246 365 -64
2697 -64 -234 383 359 59 8 260 112 42 -135 2 133 -99 -389 98 128 -331 -259 -98 -85 -286 -273 259 42
2720 42 -223 -29 113 235 -2 -300 317 398 -28 -65 336 414 37 -324 346 588 -88 -486 63 220 -37
2741 -37 -88 -46 104 -108 -367 -63 323 -5 -506 6 287 -148 -326 191 239 -119 82 108 175 83 -126 422
2763 422 416 19 -106 198 543 122 -206 63 373 -251 -190 -132 48 -333 -415 62 -31 -329 -333 72 52 -236 -278
2786 -278 86 307 -22 -65 291 408 142 -124 187 422 286 -261 302 220 231 -149 161 62 -219 -176 170 123
2808 123 -264 -210 -275 -10 56 -376 32 202 -318 -297 225 15 182 -123 283 234 -27 -73 219 385 -1 -117
2830 -117 150 81 94 -99 66 284 -166 -292 -83 7 -186 -365 108 -183 -18 -509 -170 163 -240 -331 -15
2851 -15 129 22 -347 96 278 -33 172 130 9 117 -82 278 165 -115 -241 -2 281 -367 -166 110 86
2872 86 -62 -193 -144 47 -173 -415 -102 210 -261 -272 -7 96 35 -41 217 230 -21 39 284 482 170 -89
2894 -89 -39 305 -128 -11 81 338 -103 -227 102 285 -133 -394 -199 94 -107 -434 -134 -2 57 -134 -210 262
2916 262 -181 -134 192 264 201 102 93 165 5 -22 66 202 6 -94 96 157 209 -2 43 151 -478 -294 52 -61
2940 -61 -126 -492 65 78 -229 -261 51 86 62 -162 -111 150 10 -308 49 305 178 194 -34 -11 173 -110 261
2963 261 171 -50 -434 39 -4 -184 -193 -75 4 -120 -168 -177 21 -56 -381 -300 -62 -68 -143 98 200 5 -367 69
2987 69 381 395 -27 10 378 82 -229 214 464 -158 -176 79 -62 -421 -188 -166 246 -243 -286 -78 128 -141
3009 -141 -328 -4 268 50 -78 34 150 10 -78 74 362 138 -213 323 180 293 30 26 54 129 -220 -187
3031 -187 -37 -113 -252 -40 129 -86 -617 -55 -227 -245 -186 -275 138 -270 2 -141 263 37 35 -46 390 31
3053 31 23 59 310 102 -138 317 218 121 -461 -171 -59 -370 -157 13 -63 -95 -345 -227 196 -9 -107 -75 -80 124
3077 124 -232 -18 47 -102 -49 125 106 -19 67 207 215 69 -175 153 351 164 -144 -118 -70 59 -178 159 159
3100 159 -71 -315 21 190 -345 -321 119 55 -66 -217 -96 193 76 -18 -58 178 73 -7 98 341 27 -128
3122 -128 -57 154 -71 -71 139 -95 -48 -105 147 -107 -187 -321 54 5 -69 -129 -114 2 -96 -222 -13 28 53 -190
3146 -190 239 151 24 78 -151 359 313 -107 -28 141 -259 -136 121 291 203 -369 -175 185 176 -322 -198 219
3168 219 29 -286 9 229 -189 -159 -56 238 71 -192 38 -3 96 -37 -66 275 -18 22 82 343 89 27
3190 27 168 93 -144 -90 -92 172 -93 -232 59 42 -46 -223 55 63 -158 -212 -65 192 25 -359 -119 -42 -223 -58
3214 -58 -224 180 -44 -56 250 338 -16 -134 40 31 10 -140 186 191 106 -145 -11 217 -162 -276 27 44 76 -94
3238 -94 54 64 132 -194 -81 271 78 96 107 266 116 -58 116 281 103 -128 347 -16 -39 -127 158 163 -88
3261 -88 -443 -198 108 -79 -185 -55 0 -123 -6 -47 26 328 -165 96 253 30 63 -17 39 222 303 33 231
3284 231 -44 -177 40 -338 141 -96 -38 43 28 -242 -59 19 -77 -427 -68 -77 -86 -243 -29 -15 -89 -56 -84 299
3308 299 50 31 -50 173 53 39 197 309 -116 -97 -114 357 41 -63 -110 177 -99 -8 -197 -6 74 -255 -6
3331 -6 235 120 -139 -145 278 -63 -251 -34 248 -93 23 -168 126 216 -92 397 398 30 104 212 238 171 -99
3354 -99 -114 -10 -241 -86 -76 235 134 -151 15 134 -299 -265 40 34 -33 -117 -110 64 -26 -120 -316 148 69 -126
3378 -126 7 204 205 -49 134 321 -46 -360 147 101 119 -55 -180 14 39 -69 -319 -293 -37 -98 -110 4 -137
3401 -137 -151 6 59 -50 123 -49 172 146 -27 117 542 247 -21 -40 217 56 -200 1 387 78 -346
3422 -346 -212 -33 -85 -136 -162 21 -20 -159 -22 234 10 -319 59 141 104 -346 70 158 145 57 -146 142 46
3445 46 90 312 154 121 -244 -149 171 35 -188 -49 178 -16 -44 96 26 44 -61 -50 24 -124 -257 49 0
3468 0 41 97 22 10 -327 1 218 148 315 75 -85 301 249 -54 -51 -124 -134 119 10 105 108 -173 -256 96 -91
3493 -91 -128 -222 -55 115 -273 -20 121 288 -243 -126 280 351 135 168 451 101 59 -117 -72 211 -19 97
3515 97 52 181 -47 127 104 21 -89 151 99 -203 -276 -70 -201 -74 59 -254 7 172 67 107 -51 52
3537 52 -36 -73 93 38 -20 126 364 131 3 -67 172 -3 -163 56 192 -161 -126 -156 -26 155 -157 -186 -126
3560 -126 72 -197 -302 167 142 -66 -29 29 77 168 205 351 209 -101 17 181 23 -155 67 12 54 -196 -261
3583 -261 109 -43 -169 -317 30 -245 -124 65 -13 132 12 -257 225 -185 -71 -276 172 180 -220 362 44
3604 44 39 57 -5 247 49 -104 -43 34 395 -109 -36 193 581 -48 -292 24 17 -312 -44 -114 -112 141 5 -3 71
3629 71 102 -108 30 -182 14 -70 175 29 66 296 -173 389 -78 8 8 274 -98 -235 15 63 -113 -165 -97
3652 -97 -110 -150 -244 -254 -63 -206 -272 -32 -24 -153 -78 -56 46 -174 115 6 -28 -264 206 -21 169 42 -232 -14
3676 -14 -44 -29 -358 67 187 -88 -79 74 -104 123 -292 -35 -57 8 -17 -32 24 -106 -198 -9 166 -128 -39 194
3700 194 149 -52 187 219 357 121 30 -126 49 -41 -104 -29 116 132 119 -153 136 -91 -33 -107 43 -69 25 -181
3724 -181 198 -153 -223 18 68 -49 -153 10 161 113 48 135 133 -138 -94 -44 41 137 33 87 103 84 -59 -56 -6 -68
3750 -68 -121 31 -311 -140 -331 -286 -48 99 -28 213 -103 -141 -65 343 -195 35 56 -67 308 -168 -50 79
3772 79 103 62 -9 102 -4 -118 -286 186 233 -79 -157 -9 -71 -126 117 -53 -69 -268 19 138 61 -70 -10 -25
3796 -25 76 16 -201 67 391 -99 -63 8 1 69 -165 190 188 -58 -136 108 39 -84 -289 -61 -110 -120 -71 7 10 -54
3822 -54 -214 96 -80 -14 -67 -29 123 -18 167 100 73 165 95 99 60 -60 31 159 170 -238 9 105 152 227 -199
3847 -199 42 -161 -31 -264 -24 115 -416 -154 -71 234 157 150 134 68 -40 86 -29 -153 -54 -152 145 -123 70
3870 70 -200 92 255 -243 -249 -223 -184 -31 -96 141 217 -2 16 199 190 -106 -53 -55 -95 -84 132 171 -33 47 114 235
3896 235 -210 -232 274 334 -123 187 -84 109 133 52 -200 77 142 -227 24 -73 -42 0 -229 -203 -4 -141 -6
3919 -6 -150 37 -338 -170 40 149 -33 -14 -2 -54 25 244 166 -1 77 134 139 392 -35 -17 -25 -65 -212 -217 94 -139
3945 -139 21 -285 32 238 97 -99 6 -29 80 -79 -271 -178 152 145 91 275 128 -74 253 55 -2 -51
3967 -51 60 -75 -197 25 35 -110 -174 -156 6 -191 45 -221 136 32 31 -107 148 2 -236 62 74 -110
3989 -110 20 17 -42 272 65 122 51 240 53 10 199 217 -30 180 148 152 2 25 59 -159 -217 -158 12 100 -278
4014 -278 -66 139 309 -94 149 -96 175 232 29 -106 14 36 -140 97 131 -72 91 401 237 -25 16
4035 16 2 -80 6 -102 101 129 -210 -56 160 -133 88 -258 -165 37 59 110 88 118 270 -212 328 124 14
4058 14 158 29 198 126 -186 -39 10 -179 -48 28 167 86 43 -196 33 -156 -168 117 147 92 -90 40 -106
4081 -106 -218 -202 -91 172 -63 -48 31 149 -187 -124 94 164 -86 -133 436 -117 -53 51 7 258 284 -71 -58
4104 -58 -218 22 -240 -272 77 86 -278 87 397 -165 54 -44 -178 99 -92 -102 -2 77 224 275 69 159 21
4127 21 -48 -7 -168 -315 -149 -49 -182 21 116 -153 -196 -87 123 70 -187 -276 -22 80 21 -84 -226 -28 -81
4150 -81 -233 410 73 117 -21 232 87 -117 -178 -120 23 -203 95 -68 -26 -110 -143 104 137 -425 -46 -134 -15
4173 -15 -352 -46 -329 -29 -57 -197 -3 321 -49 39 224 19 187 -137 -23 163 -129 -102 56 49 3 -165
4195 -165 438 59 -169 -247 56 184 -180 123 -232 297 23 -10 -194 39 39 -213 -302 94 183 16 145 186
4217 186 233 -16 19 35 -76 -86 317 16 -82 84 1 262 -141 -166 11 100 -157 -110 157 101 65 -85 -230 50
4241 50 94 29 136 79 136 51 -104 170 117 -381 -44 -4 165 -219 182 231 144 68 258 -59 -196 -6 20 28 -111
4266 -111 -234 100 -184 201 218 -71 95 -244 -86 84 -66 17 -14 -148 184 54 -138 11 49 303 -94
4287 -94 -72 168 71 6 56 -41 -169 20 -108 -104 -11 -53 -168 -75 120 319 -213 100 45 102 1 82 122 178 -190
4312 -190 62 82 -49 -37 66 17 9 -97 49 -52 119 -231 202 74 -137 151 -6 36 106 24 73 247 -198
4335 -198 37 139 -73 -350 -7 163 82 -181 19 28 -193 48 98 27 -120 -168 41 40 346 144 33 -58 22
4358 22 -336 -192 66 -92 -101 -109 37 -118 154 -3 102 -28 -74 -1 -70 126 0 132 276 119 -8 -125 269
4381 269 67 -38 -83 28 186 264 -182 -34 37 -29 -99 -114 110 -211 158 165 97 65 66 89 149 -159 16 -66 -158
4406 -158 83 112 137 102 -34 19 92 -137 0 67 123 49 4 -162 192 -30 -166 82 15 4 -271 -194 -109 226
4430 226 -151 -65 -14 -47 -112 -91 98 -86 41 78 -17 36 159 -158 -49 166 -73 -104 3 -163 109 -37 40
4453 40 -133 -57 190 -67 54 -218 20 -40 31 -197 90 -121 48 -321 -50 158 -144 2 93 181 -142 76
4475 76 -17 -18 -72 -126 158 247 164 -43 -118 116 248 -65 -145 292 5 14 -9 -237 164 -22 -36 -100 -85 122 -140
4500 -140 -332 272 203 15 62 99 -87 -21 11 23 9 257 -100 -157 58 215 119 140 3 15 44 1 -220 206
4524 206 88 -178 38 -217 -43 -35 -59 53 -42 -193 -1 -11 39 61 17 213 204 115 -73 -150 89 4 -151 -31
4548 -31 0 -142 -136 -115 -180 -81 -295 -339 7 155 8 -186 -124 -180 -52 48 -111 -68 -6 41 -210 -123 -213 -223 -107
4573 -107 74 -172 191 130 -17 128 86 45 -62 77 4 92 -97 -149 36 -117 193 -180 -202 -120 67 12 -4
4596 -4 116 -24 93 104 -56 52 57 64 -200 -40 170 2 -17 130 153 -64 -12 22 -77 -103 -181 -38 112 108 91 -30
4622 -30 -49 137 108 -121 178 75 -93 -12 -118 -44 -107 144 -119 89 -98 172 -32 93 106 -59 -151 94 120
4645 120 189 230 116 153 32 -53 -20 29 12 -252 134 -108 -72 69 40 192 61 2 -220 -1 141 -197 -134 127
4669 127 47 149 12 132 42 70 -13 16 -11 257 64 109 -57 -69 -191 -58 -36 -278 -38 -256 -44 51 -265
4692 -265 54 75 -199 64 29 -75 -196 -179 -210 93 138 125 40 62 -116 -147 50 -145 -103 74 224 -22 -48 142
4716 142 307 24 71 -44 226 -79 -320 -34 -44 147 27 -37 50 3 36 256 236 -6 -21 106 196 124 299
4739 299 107 -5 -74 107 -92 82 61 -142 -58 -65 158 -190 -111 25 94 -16 -141 -152 -85 -76 -188 105 -181 -138
4763 -138 198 102 142 -146 -38 128 54 -234 19 45 -107 117 272 50 -84 20 -132 -191 -20 -130 4 -140
4785 -140 74 -194 94 -60 77 297 -135 -43 -145 -95 -173 -53 23 76 59 -107 -41 -121 95 98 123 -128 213 -94
4809 -94 62 149 214 -152 -126 12 -255 113 111 -142 -279 137 -3 -38 -98 114 11 -37 -89 -71 -71 161 18 -39 -54
4834 -54 -272 -30 -50 10 -170 154 -28 2 -113 -113 21 -148 86 90 -73 -46 -3 -291 33 -67 -420 29 -8 95
4858 95 -64 -213 18 -85 -93 227 -27 177 -6 182 203 46 -59 108 -76 241 4 -145 59 -16 -344 142
4880 142 38 3 -235 -125 216 -233 -125 -4 -37 59 146 -84 362 -94 76 -116 68 9 -125 109 131 138 -104
4903 -104 19 32 -25 43 -277 42 222 98 72 -88 -68 -43 57 24 -192 35 -26 36 -81 121 -369 11 -71
4926 -71 37 134 -5 97 43 143 82 -30 -106 -36 366 18 -53 -45 201 58 -113 87 80 -278 -19 -327 99 114
4950 114 110 -88 267 -34 -89 -67 185 -175 -61 302 228 -215 201 -163 118 185 -43 2 -47 237 -74 72 -146
4973 -146 129 -157 -225 -98 -105 83 37 -142 -133 69 -130 -97 -276 -2 -4 71 -5 -142 3 173 0 -26 48 156
4997 156 176 -155 -131 -103 102 126 82 127 75 -147 -62 7 39 58 41 4 267 91 44 -16 -107 28 -59 -236 -60 -26
5023 -26 -19 -161 132 23 -49 -186 -144 -57 134 196 6 55 -37 32 282 -51 -141 -41 85 -237 -2 226 90 -85
5047 -85 23 -93 -58 -134 -190 64 184 -53 239 -63 19 -38 -298 268 188 -179 -245 192 -152 175 -98 40 187
5070 187 158 -34 244 -109 -162 23 136 149 -131 103 329 10 146 -209 -30 166 -164 -102 -82 -231 88 38
5092 38 167 14 -47 95 93 -154 43 104 -28 115 223 -8 -179 -54 -113 68 -143 55 75 46 -116 140 67
5115 67 94 76 -79 44 58 -198 156 54 66 168 121 92 54 -214 278 24 -62 -92 -172 -115 -192 185 -23 -7 -123
5140 -123 -141 -35 -137 -285 -52 272 -47 -160 -36 -10 -83 33 -217 294 -43 -148 -25 33 52 102 238 76
5162 76 45 278 36 20 28 -32 -21 102 -296 -31 96 26 -106 199 -30 -118 400 -62 199 199 180 -350 251 175
5186 175 -127 -111 -24 208 -89 151 57 29 158 -162 49 173 95 -87 120 95 340 77 12 78 32 80 182
5209 182 42 -3 -187 181 39 -274 -229 -175 -62 -97 -210 39 -332 168 -54 138 -81 65 140 176 4 -82
5231 -82 -26 108 153 -117 -33 -157 0 -202 -55 -39 166 -91 29 -53 104 36 -86 136 -97 -183 -128 247 -106
5254 -106 118 -28 -25 189 112 5 -280 83 126 103 -224 -326 242 234 -122 -25 32 24 -83 -51 288 -15 179 195
5278 195 -53 53 -277 -190 188 228 -211 3 107 66 78 -32 50 173 49 31 63 -97 -45 37 106 -76 -22 -66
5302 -66 -284 3 16 190 59 42 -206 -209 28 -3 241 92 132 178 -102 140 -90 -160 -30 102 282 -61 -189
5325 -189 -230 -53 -89 -16 1 188 -301 92 -26 -115 -3 130 -11 -33 -142 128 81 41 -48 -2 -271 -69 -96 88
5349 88 159 17 -116 -203 189 -125 188 196 3 -9 245 -222 26 -24 -140 -4 46 -144 23 -33 201 -115 -112 37
5373 37 200 -40 268 168 25 -236 -144 353 -284 -79 -53 167 -122 53 -287 134 10 -88 215 -50 318
5394 318 -143 56 98 175 -231 52 104 -85 57 -129 -227 99 101 -140 -101 -62 130 -196 -26 -3 0 131 176 -82
5418 -82 -9 -25 -172 36 0 98 -222 -142 -23 194 125 119 2 80 129 -7 269 243 -104 56 122 94 -113 -42 19
5443 19 -9 49 117 -53 -122 -53 -86 -3 86 -84 -59 54 -164 -84 9 -11 206 202 -111 -33 -11 -73 -214 -98 77 -31
5469 -31 140 24 -138 163 85 -28 -99 -158 347 224 -151 106 -152 47 -182 35 -1 97 -61 -36 119 32 -56
5492 -56 -68 -52 150 -184 -85 -201 162 -126 60 49 -49 -78 -1 12 124 15 219 68 39 -98 342 -120 51
5515 51 37 102 138 -94 -283 134 -22 -71 5 72 -8 -175 -252 44 40 271 -123 153 2 -151 -15 80 117 -75
5539 -75 80 150 146 -85 -18 242 65 93 58 -7 205 -52 -118 -36 210 -174 -214 44 -151 -150 -46 -346 -25 -84 154
5564 154 66 302 -167 -218 -250 -80 -56 -347 35 196 -158 139 95 -147 74 42 152 -110 -80 18 -56 3 -135
5587 -135 -251 -58 38 -67 2 -94 -102 -208 -136 -101 -49 -175 3 -33 -12 135 60 -24 53 85 294 -115 66 59 -187
5612 -187 59 242 -7 -35 -262 -103 468 -282 -196 -24 -158 -74 -12 44 36 -27 208 -67 -201 -201 -63 78 109 77
5636 77 134 -102 -103 -362 -77 -126 151 217 -75 -44 31 84 196 131 16 5 267 -172 83 -120 22 69 161 -218
5660 -218 68 181 -23 44 -119 -18 -224 63 -146 307 -251 42 -73 107 -81 -122 264 78 -249 -87 -122
5681 -122 -171 -69 -59 -45 200 -98 -81 62 98 -227 59 132 -85 227 -102 -251 -87 -40 92 65 44 159 -115
5704 -115 14 260 -281 17 -127 -53 48 -40 127 -99 70 72 -105 63 -122 -119 242 -21 -230 -107 -159 218
5726 218 138 -51 -172 -73 111 18 94 24 -62 -81 138 144 -80 -43 148 35 3 1 199 118 21 -96 10 123 -24
5751 -24 -105 155 49 -207 20 -188 -18 345 -22 52 -45 -128 -5 129 125 -39 -61 113 -129 -73 -33 -223 136
5774 136 220 103 -74 111 134 125 -219 -138 94 -55 138 -58 39 47 33 113 2 58 -208 209 11 -161 -116 188
5798 188 -11 8 121 -77 -109 37 381 299 -2 -202 -123 208 188 -92 126 202 -101 -86 144 12 -2 -76 -151
5821 -151 162 270 -272 -50 -66 240 -144 74 -355 -157 62 16 -69 -22 142 53 12 46 -44 349 1 72 -10
5844 -10 78 61 -29 -2 117 -179 78 -24 9 189 -213 -339 -7 78 59 35 41 -121 18 77 179 41 -42 202
5868 202 -4 -54 -12 -128 36 -52 91 -113 208 80 -262 -84 -104 135 -111 48 95 14 -235 55 -146 -122
5890 -122 -75 140 -366 -57 -59 -256 166 -78 9 0 -68 -4 -102 -198 -47 -27 72 -170 102 56 129 22 -89 -220 28
5915 28 -35 -136 -110 -74 195 -76 192 229 37 159 -136 156 134 103 -231 -108 142 -213 148 75 -47 48 -53
5938 -53 15 -80 -25 -266 -144 65 101 57 175 -136 137 182 99 -102 -151 40 -8 -80 -172 75 -57 91 108 -16
5962 -16 165 172 118 247 -114 -252 -170 31 -54 6 65 -205 211 -45 -19 -26 156 8 -161 -89 -1 177 2 -64 -262
5987 -262 -135 -195 46 4 2 -231 -220 -59 8 -88 138 -28 236 103 39 108 -107 96 -198 165 95 -32 -103 -9
6011 -9 64 -116 -18 26 -57 48 30 -64 -114 103 -89 80 -18 -36 74 -164 14 193 -125 4 49 20 80 39 -167
6036 -167 18 -7 21 71 15 49 17 13 -9 -43 76 13 -64 126 -74 -17 89 28 -110 -35 -72 -75 13 15 284 7 -238
6063 -238 100 -19 -48 219 9 101 272 220 -40 10 219 12 26 38 2 266 64 56 17 192 -146 148 15
6086 15 57 -41 -155 147 -31 40 -5 85 117 -16 -341 -131 187 274 -165 144 -58 65 151 24 -38 372 82
6109 82 134 -240 22 38 235 54 6 -235 131 21 -116 13 -229 -15 -257 3 103 118 160 456 -81 -32
6131 -32 -120 -15 164 -177 90 -53 -232 39 -116 111 -33 -193 -91 -54 -75 97 44 171 133 14 1 -194
6153 -194 150 -179 -92 25 33 54 203 33 -37 -81 9 148 76 -24 -4 132 226 58 -93 -166 -54 124 83 -61
6177 -61 200 146 -85 210 -122 -158 -91 -33 122 76 107 -200 57 -11 -265 -10 -29 19 13 28 -41 183 -36 -187 -28
6202 -28 30 43 279 147 68 217 37 31 -190 210 9 -166 100 -88 -37 -268 21 -87 -89 -31 -4 -71 10 38 36
6227 36 -42 15 -183 -36 90 402 -105 -57 48 -75 -1 29 -70 349 -96 87 -6 -276 -253 -103 -118 22 117 60
6251 60 -108 -205 -224 -4 0 -337 -116 -185 117 54 144 49 43 -254 39 -15 -168 50 -137 -115 1 43 -33 -10 -9 -204
6277 -204 -51 -39 272 74 -177 31 30 -2 133 12 -88 -240 -142 17 -203 -85 -40 39 -98 212 -133 -14
6299 -14 -60 148 218 -62 -303 -376 -121 11 343 68 -111 19 -108 72 26 28 144 -207 48 -24 -150 41 -32
6322 -32 57 45 -44 53 266 219 -130 78 32 -46 -176 -132 -77 49 122 -35 93 -74 -133 -20 98 163 71 -4 -108
6347 -108 -307 -289 129 134 139 -74 -217 -50 106 106 -132 -106 19 76 -19 -76 47 134 -47 -99 -257 -70 -53 -57 36 53
6373 53 -281 129 153 -108 -118 180 -11 1 148 -72 231 -174 -132 164 -58 281 8 -238 -133 12 -6 0 101
6396 101 -7 114 47 238 -133 29 236 271 -33 12 -181 83 -103 289 392 -63 -119 -14 1 1 -293 64
6418 64 216 -131 54 4 281 135 26 -25 -64 25 -113 59 -87 -118 -163 -278 17 -76 -2 -5 -42 -70 53 -41 -141
6443 -141 -231 -125 188 -266 18 -192 -20 -18 -2 18 -19 218 -125 -35 208 28 -167 -48 -24 8 -86 22 103 69
6467 69 -31 78 96 -117 -134 -77 156 172 -125 -42 108 0 -36 106 127 172 -35 -211 141 35 -152 -34 39
6490 39 70 -202 12 76 116 -102 -142 183 328 197 89 149 96 134 -45 -40 -106 83 -66 -25 -49 -132 -107 -28 -69 -28
6516 -28 -290 -41 -123 -78 71 -25 30 51 -134 -45 -104 109 177 -16 155 340 -9 -224 -26 -306 -317 9 81 275
6540 275 -87 -31 253 198 -207 139 -34 141 16 68 50 -202 126 -37 118 65 -204 64 106 -131 -105 85
6562 85 -94 -175 -1 12 -45 -178 -137 8 193 44 38 85 -78 -133 71 75 115 -122 215 -36 -96 -76 -76 38 -428
6587 -428 74 -100 355 20 -66 -161 -103 93 -138 131 177 121 88 -130 57 -61 -88 -168 -17 -43 -57 -62 95 133
6611 133 195 142 -86 -83 177 32 32 -42 -72 -136 88 164 186 -155 25 41 151 83 -34 210 103 -110 -41 -44 -168
6636 -168 9 144 198 -229 133 55 175 96 192 17 -35 -156 316 -122 47 -42 7 152 87 56 -294 -14 -212
6659 -212 -55 -217 152 188 -277 478 -71 -139 -95 85 -144 31 31 -61 70 269 75 18 -4 51 -70 -45 232
6682 232 -28 -56 46 -151 138 72 -82 -139 104 -21 -124 164 140 35 13 -75 -22 124 81 131 -66 -57 -116 299
6706 299 -36 -262 -149 102 -44 -229 -160 171 8 4 27 71 -86 -47 4 -199 18 -131 -31 20 338 -305 -147
6729 -147 163 -154 -77 115 -283 -187 107 -298 -161 96 92 -10 -174 58 54 300 228 -75 86 67 111 -114 -124
6752 -124 87 -93 -96 58 -118 11 261 159 -4 -208 242 -16 46 7 -180 -1 161 -176 215 366 64
6773 64 -54 65 -161 309 -79 70 119 71 -58 110 -80 -27 -13 171 54 0 60 98 -66 -148 -20 47 -112
6796 -112 25 265 -80 359 71 -63 -15 58 66 157 34 -96 -168 176 126 82 97 -15 64 -40 -98 17 270 -71
6820 -71 -177 -127 112 42 -31 -152 -102 -374 -192 84 162 -144 126 95 -66 -4 -180 66 -251 39 -63 -2 183
6843 183 66 -55 38 -176 72 94 -12 -206 -30 151 -28 -126 -11 22 -57 -232 -52 248 -145 -88 -127 -146 -142
6866 -142 81 172 -213 -100 136 75 -222 68 187 -11 -163 -170 -140 -173 72 129 -192 247 13 -99 -1 -167 153
6889 153 305 78 105 -159 -128 -214 -54 66 -210 -50 -30 -74 114 48 -30 -30 -109 -12 -7 97 -100 -84 -5 1 -114 43
6915 43 -37 -176 27 209 -64 61 102 -171 132 -193 51 262 227 -161 131 270 222 161 159 -245 -119 -73 118
6938 118 96 214 89 -62 -236 -4 48 -13 112 122 73 39 -58 -143 93 248 121 142 85 51 -93 -130 -129 -35 80
6963 80 195 64 -100 -68 -30 -33 -109 -57 107 203 -76 4 163 68 196 -20 272 200 145 25 -243 -144 -7 -279
6987 -279 -34 25 257 -47 117 -87 205 -117 39 -21 -218 -83 -125 -66 12 -179 -38 -61 59 -53 -12 117
7009 117 -113 11 -74 30 -18 81 -176 111 119 13 76 86 -111 200 191 -230 28 46 164 60 -9 30 113 -362
7033 -362 -29 -174 -10 99 111 114 -153 117 18 91 141 -73 -114 -31 -202 92 44 -88 151 97 -114 -70 248 8
7057 8 52 -240 37 -121 -151 -79 125 -212 -110 -2 51 -36 75 -192 -126 -314 111 -150 -275 89 44 40 -96 28
7081 28 20 -153 -206 -198 -66 -63 18 2 -140 -28 92 -12 -126 38 -192 -43 -67 -60 -97 -118 -59 -27 144 25 -36 -73
7107 -73 -112 -85 -262 -106 45 -19 13 168 -212 -27 -216 6 -71 -74 -20 -10 -73 71 83 1 165 34 -113 -21 124
7132 124 169 22 299 88 -340 -39 117 241 -290 25 -219 -45 -149 55 96 97 -47 -92 21 -269 32 -233
7154 -233 -1 -71 88 -167 119 207 -9 65 -126 77 172 364 164 38 -20 88 -37 35 115 -60 40 -95
7176 -95 106 -173 -159 -112 -1 98 -221 -192 -158 -180 184 -94 -57 128 75 57 -112 79 -165 81 3 -93 -71 -36 -52
7201 -52 -95 -181 33 -152 -44 -8 -27 53 -29 37 -165 -16 144 -5 -158 133 26 191 -150 -173 -194 -170 68 32
7225 32 -224 -64 6 -106 -236 90 170 53 -87 209 -291 -170 -72 33 29 -11 -72 -193 62 86 181 -44 36 84
7249 84 146 36 109 -165 73 -241 76 -102 -205 13 22 112 -28 41 -66 49 -229 124 172 7 160 -12 161
7272 161 52 139 -161 34 -47 -69 -25 152 18 -6 64 8 -62 -35 -204 -34 137 -136 -130 -76 140 59 -67 -85 -78
7297 -78 -85 -10 37 37 205 -126 -5 -4 -161 -244 -56 -149 -22 -2 29 -16 -111 195 -25 18 95 -212 -351 -339 96 81
7323 81 -7 82 294 132 -59 0 -91 -217 114 76 -61 -139 262 276 -108 -145 21 -149 -48 64 -299 74 -127
7346 -127 166 -122 297 -30 41 182 99 -26 -73 66 238 33 -176 -45 -69 -216 -117 -15 167 247 -100 100
7368 100 192 111 103 -81 93 -307 81 -268 59 -102 23 -43 -243 189 -141 -188 129 167 83 159 58 -37 -105 42
7392 42 71 -137 85 -140 275 -32 107 166 -144 299 -82 -24 -123 -210 -165 326 -184 -57 -76 -96 -199 -39 37
7415 37 164 -153 50 110 49 -151 -23 273 -79 44 -27 -116 -107 145 98 157 -97 46 99 176 -233 258 -70 118
7439 118 15 -26 191 54 30 103 -113 -83 -148 -1 -25 -48 385 270 88 -11 15 -10 -126 -253 -1 78 100 -35
7463 -35 320 71 82 33 -45 -158 -120 47 -163 -278 -20 403 -271 -99 -67 239 5 -184 87 33 -84 32
7485 32 -367 -178 162 -192 26 24 91 109 -77 -176 -199 189 -65 8 -96 195 94 211 124 300 -94 134 83
7508 83 -26 124 9 149 -65 80 6 229 46 -150 221 157 -205 -112 -49 84 165 37 -107 140 -156 123
7530 123 50 -2 91 1 -27 -90 204 -53 -151 136 21 -33 -148 -93 139 18 37 33 33 -78 44 44 1 135 74 -48
7556 -48 -57 314 -300 -158 -260 26 117 -85 -86 -72 -242 181 138 -136 82 47 85 24 -33 -50 67 -224 -209 -93 89
7581 89 -1 -60 173 92 22 18 171 82 -127 -100 3 -62 -92 4 110 368 1 12 34 70 -52 -148 -123 -353 -95 -221
7607 -221 -7 -174 -208 -10 66 139 113 -46 -56 -98 -95 -121 -17 196 -216 197 -136 9 -14 -258 127 -132 -172 116
7631 116 207 -184 -249 65 25 -184 25 -34 48 17 -93 -140 -32 194 -14 -106 -206 146 13 102 105 -176 34 231
7655 231 93 -82 -209 80 4 49 122 -239 -6 191 132 -18 61 171 99 -82 188 -90 208 56 284 149
7677 149 -237 -11 -68 131 -54 36 -332 209 -165 2 -11 83 -19 -156 -66 251 110 0 158 172 -84 -215
7699 -215 -21 -141 117 57 180 419 -64 -26 -80 -13 -2 -34 223 -17 -85 -11 -39 49 -1 82 40 145 152 148 -48 140
7725 140 -137 116 -14 -1 307 44 116 1 85 -117 -3 27 40 96 -32 -272 156 117 -110 113 142 -86 131
7748 131 -66 -55 -124 -6 225 8 245 103 -58 2 163 233 154 71 104 16 32 -112 160 281 -125 23 68
7771 68 -12 69 -204 -19 128 -81 79 -139 -120 127 -51 70 41 54 58 -183 -71 -39 -96 61 -87 44 -118
7794 -118 32 77 -80 34 -354 167 -33 65 -186 22 -41 69 97 -312 82 66 30 30 76 -103 292 -45 129
7817 129 -114 156 301 61 189 45 38 -167 -69 156 112 -197 147 -203 28 -49 -55 -173 -229 158 -28 -61 -51
7840 -51 -75 -68 236 -86 -81 -239 -80 -48 53 119 43 65 -43 137 -195 130 118 98 33 212 8 -24 67 -98 136
7865 136 106 57 78 -48 -33 201 130 66 341 -291 37 -142 -73 130 107 -139 -85 242 32 -25 231 -193 -58
7888 -58 -13 77 38 -109 -95 -128 -170 -44 -7 190 64 -174 222 -43 -12 172 169 -23 -202 -91 -42 -89 -100 269 -54
7913 -54 -12 -149 -64 159 -274 -241 -67 47 18 105 36 -46 8 105 -88 100 -50 -26 -30 176 183 96 76 -45 -214 -1
7939 -1 170 -70 -45 98 126 -124 -63 -197 166 127 -144 158 55 -95 -267 34 -23 151 -208 -23 98 -133
7961 -133 14 10 157 -116 214 -18 33 295 26 -84 -71 -51 6 -90 -52 424 50 20 -152 -131 118 -90 152
7984 152 -111 -31 128 304 313 194 33 -135 -17 120 38 -174 -28 240 -2 38 40 58 91 -134 55 274 170
8007 170 -81 19 199 99 -112 423 -38 -67 190 -255 92 -29 -27 21 84 128 118 192 129 205 -30 123 82 -34
8031 -34 -73 49 146 -13 77 27 -236 -169 17 -23 -157 277 -96 225 -100 127 83 -10 90 156 -107 3 -144
8054 -144 -65 20 190 -387 176 285 -9 122 65 108 -63 149 -88 242 -26 -236 46 -52 132 -114 -91 -113
8076 -113 -2 -108 -61 -31 -5 -162 -129 90 71 -240 98 -270 95 -92 55 -159 166 22 -223 -84 168 10
8098 10 188 69 -1 61 47 -259 -128 -123 -95 279 -5 -8 137 -34 -154 54 -142 221 -86 137 -212 67 -1
8121 -1 -138 -146 -74 -47 -49 -266 121 -165 -131 -102 342 -126 -223 19 -54 30 -57 57 195 94 -14 -92 -163 -30 181
8146 181 -106 -7 91 141 -57 129 121 -97 31 33 -173 138 -159 -159 28 -204 -167 -126 92 26 47 11 -16 90 17
8171 17 -12 -59 133 114 167 -41 -281 -14 -208 86 61 66 21 16 30 -171 -221 39 148 -333
8191c33
$$ Imaginary data points
##PAGE= N=2
##DATA TABLE= (X++(I..I)), XYDATA
0 0 0 0 0 0 0 0 0 0 0 0 0 0 8 -8 8 -8 8 -16 16 -23 24 -29 32 -40 48 -56 64 -72 85 -96 112 -128 144 -161
34 -161 184 -207 233 -261 293 -325 360 -402 446 -494 547 -605 665 -734 808 -890 983 -1081
52 -1081 1194 -1316 1455 -1609 1788 -1992 2229 -2508 2842 -3254 3773 -4450 5378 -6726 8879
67 8879 -12878 22828 -105524 -91813 127744 77558 -2616 -82553 -88244 5588 112275 53695
79 53695 -44725 -81082 -38545 57105 119603 10206 -111479 -58803 64744 85329 31464 -48859
91 -48859 -80360 -10501 73578 60450 -12566 -82399 -73631 36349 108258 15959 -101909 -77728
103 -77728 32436 85220 38143 -56502 -83690 -3122 73497 57334 -10873 -65367 -49006 40221
115 40221 86720 20499 -62429 -60298 13664 71399 45224 -33866 -65606 -19215 41857 54262
127 54262 4944 -60032 -58927 17839 70038 31180 -45222 -68210 -7638 63319 48065 -25763
139 -25763 -59854 -27617 32141 58286 13867 -51854 -48928 16609 59388 32476 -30393 -56281
151 -56281 -10160 49996 43362 -11078 -43257 -30624 16158 54230 24085 -41583 -49733 3294
163 3294 46393 34712 -20266 -54270 -20041 37056 41514 -2772 -39199 -35736 6833 47060 27451
176 27451 -31576 -48311 -4766 42537 38682 -11507 -44045 -17453 28596 38183 8800 -27593
188 -27593 -33010 3335 41186 29319 -19356 -42711 -12335 32543 35916 -7591 -41417 -23698
200 -23698 15548 30324 11105 -23730 -36228 -6125 31785 29542 -11292 -39009 -17377 27411
212 27411 37521 1926 -29820 -20510 12759 32277 19297 -14182 -30471 -7453 27763 30487
224 30487 -4214 -34962 -21173 19582 31157 1257 -28052 -25368 1041 21938 15969 -12172
236 -12172 -30587 -13762 19949 29210 1633 -28358 -21181 15399 31699 9617 -17600 -19619 1243
249 1243 23520 22923 -2203 -24231 -15080 15787 28108 4794 -25690 -24002 6708 24472 8366
262 8366 -17058 -22768 -6868 14236 18091 -1465 -23183 -18596 9994 26472 8931 -19312 -20281
275 -20281 5657 24120 14149 -8420 -16968 -5636 13471 20974 5246 -17131 -17434 6121 23365
288 23365 9953 -17292 -22539 -1061 17243 11368 -7804 -17920 -10385 7178 17071 5832 -15838
301 -15838 -19773 1209 20623 12154 -11567 -18521 -1026 16613 14830 -629 -12414 -9175 5778
314 5778 17150 9251 -10906 -18031 -834 18530 13546 -8696 -17898 -4600 11048 11457 -855
327 -855 -12914 -12616 157 13351 9731 -8688 -18463 -4271 14976 13319 -5552 -15497 -5263 9201
341 9201 12258 3492 -7401 -10049 422 13995 13235 -4263 -15896 -5032 13543 13682 -2646 -13017
355 -13017 -7294 5211 10063 3405 -7562 -12840 -5343 8738 10938 -4007 -16815 -8193 10246
368 10246 12539 -1034 -10953 -7114 3869 10092 6388 -3059 -8942 -3582 10014 14709 1523 -12453
382 -12453 -6943 9260 12543 282 -9433 -7800 471 6449 5204 -3034 -10649 -8027 4037 10761
396 10761 479 -13825 -10675 5357 11068 1280 -6868 -6036 1160 7219 8286 1373 -7029 -5374
410 -5374 5581 12988 4967 -8803 -8896 5050 10976 3054 -6277 -6882 -2137 3236 5422 55 -8953
425 -8953 -9591 1225 9229 3411 -9054 -10574 1157 8891 3959 -3999 -4978 -1467 3933 7879 4963
440 4963 -4266 -7078 2604 11002 5936 -5615 -7973 1276 8231 4362 -3089 -5088 -3429 153 4906
455 4906 3286 -5790 -10072 -1584 7920 4576 -6291 -8910 -710 6609 3815 -1674 -3499 -2402 479
470 479 6326 6332 -2056 -7312 -200 9223 6998 -2686 -6889 -609 5761 3854 -1157 -2628 -3391 -1995
486 -1995 3634 5373 -2884 -10396 -4623 6445 6005 -4324 -8614 -2137 4279 3486 -302 -2201 -2457
501 -2457 -601 3855 5592 813 -5760 -2575 6895 8328 -1048 -5770 19 3938 2564 1149 -708
516 -708 -3622 -3188 1705 4553 364 -7181 -6638 2668 6509 -2040 -7643 -3314 2359 2750 1142 -1108
532 -1108 -3147 -1419 2914 5702 2419 -4619 -4691 5182 7747 146 -3702 -249 2252 2047 2266 -348
548 -348 -3125 -2600 -339 3093 2278 -5443 -7371 1124 5570 -782 -5006 -2674 -1023 979 2647 350
564 350 -2538 -1753 1368 5073 4521 -2974 -4580 3969 7420 633 -2638 -541 605 1637 2828 746
580 746 -2152 -3338 -1343 2792 2440 -4296 -6666 -320 3398 235 -3159 -2824 -1105 814 1979 946
596 946 -1236 -3410 -509 5558 4569 -2265 -3184 2825 4795 1830 -624 -925 277 1410 989 821 -338
613 -338 -3219 -2167 3119 2651 -3915 -5283 -645 1374 144 -1835 -2229 -1450 -637 1015 2458 528
629 528 -4066 -1158 4704 3636 -1495 -2386 1029 3762 2933 -286 -938 748 -19 242 3049 367 -4776
646 -4776 -2383 3611 1805 -2778 -3290 -1188 884 370 -2194 -1872 -224 -1751 -865 3064 1372 -3552
662 -3552 -1734 3784 3831 -253 -1874 470 3193 2284 0 882 1257 -1375 107 3829 1271 -3683
678 -3683 -2916 1835 2395 -1190 -4397 -2392 1668 177 -2418 -909 -234 -2899 -980 3150 1167 -2864
694 -2864 -1430 2240 3610 1234 -2086 -298 3452 1850 -523 1455 1821 -1275 -225 3412 1877
709 1877 -2511 -2948 373 2025 -10 -3608 -2485 627 131 -1480 -397 -127 -2407 -1497 2171 1466
725 1466 -1967 -2241 1354 3308 1118 -1094 229 2564 1687 109 1333 1375 -1189 -1095 2164 2067 -1678
742 -1678 -2657 126 1761 32 -2637 -2063 -272 -715 -1209 -366 -277 -2210 -1396 1992 2084 -1354 -2338 1195
760 1195 2876 719 -626 349 1627 1079 1013 1624 1539 -833 -1015 2011 2560 -1314 -3042 114 1658
777 1658 -410 -1975 -772 -387 -1400 -1001 215 42 -2319 -2301 1200 2300 -729 -2609 535 2806
793 2806 676 -887 896 1649 278 237 1964 1828 -595 -1312 1457 2605 -536 -2819 -527 1611
809 1611 -373 -2227 -650 -67 -1384 -1451 398 278 -1923 -2565 563 1984 -487 -2318 205 2206
825 2206 1029 -287 853 1473 297 50 1927 2005 -580 -1123 1337 2682 -77 -2130 -234 1469
841 1469 -568 -2012 -504 -22 -1888 -1922 410 911 -1906 -2929 34 1955 -403 -2185 -166 1749
857 1749 618 -413 980 1637 260 -56 2149 2285 -415 -1633 1112 2529 336 -1588 -324 857
873 857 -641 -1714 -813 -115 -1626 -2002 21 733 -1442 -2850 314 1859 -147 -1822 14 1638
889 1638 405 -227 1053 1838 117 -385 1847 2503 236 -1428 1079 2332 114 -1699 -439 848
905 848 -627 -1279 -240 210 -1490 -1958 -10 659 -1290 -2700 -383 1391 169 -1410 40 1224
921 1224 433 -660 1273 2046 -73 -557 1280 2403 355 -749 694 1617 334 -1139 -574 821
937 821 -427 -1600 161 632 -1449 -2154 167 649 -1053 -2251 -694 1250 235 -1620 -367 1581
953 1581 258 -890 1454 1753 -526 -660 1518 2096 274 -472 444 1814 767 -1051 -75 1224 -438
970 -438 -1949 163 834 -1977 -2167 -9 884 -746 -1929 -944 1150 -201 -1688 -233 1060 -413
986 -413 -969 1380 1915 30 -628 1316 2198 712 -1284 226 2147 641 -1615 366 1302 -808 -1788
1003 -1788 289 685 -1112 -2106 -741 659 -515 -2174 -956 1489 8 -1691 185 1707 -561
1018 -561 -1054 1099 2073 423 -401 711 2321 806 -1005 204 2105 530 -1313 -34 1039 -380
1034 -380 -1597 -102 715 -781 -2131 -872 637 -463 -2285 -766 749 -299 -1152 345 1111 28
1050 28 -845 577 1836 570 -1219 427 2131 918 -1039 586 1694 581 -655 -44 909 -87
1066 -87 -1386 -771 990 -111 -1953 -599 613 -863 -2173 -218 327 -485 -1145 -336 755 127 -977
1083 -977 144 2393 644 -1513 478 2434 741 -882 773 1474 393 -84 -125 758 499 -1321 -612
1100 -612 1108 -40 -2245 -941 1220 -607 -1977 -105 377 -671 -1234 -137 644 264 -958 139
1116 139 1754 1264 -1106 8 2058 1183 -1044 257 1535 304 -971 203 1460 -47 -1430 -307
1132 -307 898 -267 -1890 -837 311 -278 -1847 -1080 537 -269 -1605 -150 982 33 -1382 208
1148 208 1627 507 -370 61 1572 1158 -441 -143 1800 1010 -1040 -158 1633 42 -1140 -334 547
1165 547 -34 -1115 -1120 297 -108 -1455 -1401 780 -118 -1780 -181 1128 -168 -1357 321 1174 622 -114
1183 -114 179 1037 1330 -164 -94 1697 1286 -980 -239 1955 -69 -1559 -309 854 -284 -1405 -887
1200 -887 -97 -233 -1291 -1290 149 12 -1497 -935 1087 336 -1326 165 1637 572 -403 563 1336 907
1218 907 -150 -170 1457 959 -801 -190 1304 500 -1280 -618 1041 -206 -1550 -576 186 -426 -1213 -910
1236 -910 268 -189 -1100 -918 711 38 -1397 -111 1282 644 -594 127 1377 936 -253 208 1128
1253 1128 789 -299 -109 951 724 -851 -657 872 17 -1440 -459 475 -392 -1480 -726 447 -188
1270 -188 -1300 -671 709 425 -823 -593 1291 968 -644 165 1649 904 -556 383 1258 613 -488
1287 -488 240 778 319 -814 -522 849 287 -1120 -919 503 -224 -1374 -794 295 -542 -1411 -613 230
1305 230 51 -837 -482 1014 677 -519 -98 1355 967 -391 433 1428 779 -491 234 1072 773 -774
1323 -774 -541 756 279 -1004 -1109 381 -52 -1575 -1187 352 -188 -1361 -879 602 75 -1325 -496
1340 -496 939 859 -510 -124 1206 976 30 -30 1577 774 -317 143 1274 854 -922 -340 613 126
1358 126 -1070 -632 374 -122 -1453 -1004 330 -120 -1247 -830 515 401 -910 -804 786 776 -577
1375 -577 87 1098 1008 -510 63 1145 873 -199 112 943 691 -742 -642 535 99 -1047 -841 389
1393 389 38 -1217 -963 450 285 -1301 -800 689 277 -955 -619 809 503 -438 -232 1155 914 -115
1411 -115 -124 1292 874 -133 -343 871 515 -424 -399 741 516 -938 -757 571 217 -1296 -924 98
1429 98 85 -1355 -857 285 466 -989 -889 721 641 -471 -137 1195 763 -167 118 1072 958 -271 -52
1448 -52 1076 551 -368 -436 563 713 -771 -792 360 328 -1388 -1138 239 -17 -718 -973 306 -13 -820
1467 -820 -714 638 426 -713 -69 1114 836 -331 36 1316 940 -337 -218 986 1116 -392 -484 573
1485 573 790 -440 -786 385 331 -979 -798 95 -65 -905 -962 241 245 -983 -813 641 472 -603 -224
1504 -224 756 702 -524 -277 1217 1131 178 142 748 1001 -163 -597 788 801 -625 -967 339 334 -828 -939
1524 -939 241 16 -1214 -835 293 39 -607 -600 467 487 -311 -517 853 976 -183 -262 920 1097 -87
1543 -87 -136 808 1047 -359 -344 443 555 -453 -501 300 319 -891 -989 187 113 -1084 -839 51 290 -797
1563 -797 -755 227 651 -558 -444 862 846 -233 -542 813 1019 -152 -18 788 812 -261 -138 586 621
1582 621 -292 -668 191 284 -661 -1186 53 332 -958 -891 71 -157 -647 -551 584 288 29 -436 547 634
1602 634 169 -331 775 1261 229 -399 968 1106 -108 -315 558 311 -469 -415 184 297 -575 -838 -131
1621 -131 307 -615 -1142 88 489 -935 -1090 324 658 -593 -481 414 995 -246 -319 751 968 105
1639 105 -110 730 1179 -52 -155 674 719 -395 -433 133 356 -697 -624 -240 199 -709 -894 -119 219 -734
1659 -734 -915 399 514 -482 -419 698 751 -42 -456 376 954 -44 -329 544 1106 153 -427 503 697 -544
1679 -544 -618 589 91 -594 -509 -12 208 -713 -883 -285 114 -609 -982 93 558 -874 -628 545 719
1698 719 -182 -193 514 704 23 -98 576 1055 -2 -568 522 645 -55 -435 382 478 -516 -780 -131 -200
1718 -200 -504 -927 96 318 -587 -872 -74 572 -444 -387 409 328 -253 -422 625 861 -32 -219 802
1737 802 978 36 -211 654 870 -126 -741 492 648 -478 -715 255 348 -667 -973 -80 296 -790 -842
1756 -842 -15 451 -619 -574 190 614 -321 -319 669 919 37 -111 697 818 -68 -31 628 613 103 -502 123
1777 123 266 -195 -928 -53 159 -581 -734 -170 358 -612 -788 8 555 -572 -625 385 451 -251 -155 759
1797 759 695 230 -24 786 809 172 -348 541 758 -269 -653 364 456 -597 -764 -185 373 -642 -1004 -298
1817 -298 100 -427 -890 -105 327 -435 -857 190 758 -252 -757 522 610 29 -387 158 749 196 -477
1836 -477 530 898 -75 -722 288 501 -388 -552 51 344 -313 -825 -131 111 -143 -832 -221 273 -180
1855 -180 -816 10 619 -160 -473 182 769 359 -289 473 851 189 -346 162 950 -125 -434 307 528 -208
1875 -208 -467 -185 283 -424 -855 -382 124 -293 -948 -281 634 -338 -601 46 493 -121 -334 418 419 172 -262
1896 -262 451 993 64 -214 427 559 154 -378 125 620 -327 -700 -156 305 -453 -889 -182 345 -219 -718
1916 -718 -193 195 -180 -554 -149 456 -202 -416 168 1141 76 -538 433 766 254 -210 659 851 124 -207
1936 -207 174 604 63 -593 -256 320 -307 -829 -231 74 -390 -791 4 244 -272 -466 104 595 -36 -293
1956 -293 284 1079 138 -342 393 592 90 -203 431 842 211 -429 -144 516 67 -557 -33 303 -251 -774
1976 -774 -301 294 -287 -628 -231 60 43 -642 -394 423 150 -360 91 746 22 -323 143 792 154 -348
1996 -348 348 752 162 -252 157 564 -89 -416 -40 417 -203 -800 -278 247 -282 -1017 -152 274 -447 -735
2016 -735 -93 490 86 -419 -109 389 321 -357 299 628 257 -85 441 512 48 -491 188 467 181 -367 -78
2037 -78 396 -383 -642 -437 231 -276 -576 -396 347 -247 -892 -123 132 -96 -228 112 585 202 -337 243
2057 243 808 -21 -211 132 798 -33 -491 153 530 171 -518 21 343 -283 -627 -117 258 -131 -759 -102
2077 -102 338 -48 -285 -107 64 -155 -488 -57 348 243 -108 253 644 296 -249 327 726 40 -302 244
2097 244 553 40 -206 -76 30 126 -563 99 73 -239 -488 -249 297 -129 -916 -245 190 -64 -481 58 606
2118 606 223 -13 55 901 391 -39 309 573 24 -99 -99 509 125 -528 -33 352 242 -658 -258 -187 -313
2139 -313 -634 -155 118 -136 -651 -404 357 -325 -363 -156 449 199 -217 44 594 410 -53 -109 621 494 -303
2160 -303 92 742 207 -374 -28 486 42 -580 -325 184 153 -874 -510 36 -326 -469 -257 342 -86 -685
2180 -685 -232 608 332 -440 45 233 129 -280 123 666 373 -318 -13 457 -8 -99 -13 515 20 -482 -175
2201 -175 222 -331 -602 -446 114 -258 -529 -441 135 161 -561 -160 662 323 -135 -84 333 197 -51 162 375
2222 375 224 -159 -72 584 259 -385 -139 240 233 -476 -410 -190 116 -532 -395 -24 -191 -546 -597 279 107 -492
2244 -492 -21 676 250 -298 -46 406 308 -25 291 309 162 -224 138 520 138 -362 -257 424 42 -556 -124
2265 -124 77 -28 -328 -140 130 -107 -557 -405 -1 54 -263 -478 352 187 -260 -280 466 310 -181 47 662
2286 662 348 16 41 435 332 -70 -112 399 109 -701 -318 332 -152 -672 -309 266 -174 -391 -439 -15 20
2307 20 -703 -234 432 124 -261 -157 359 244 -241 -125 596 530 -171 356 300 221 -86 -2 187 -76 -383 -283
2329 -283 139 -237 -286 -405 -38 -283 -632 -674 -29 20 -209 -412 208 332 -27 -163 281 385 -157 83 365
2350 365 379 -93 -87 401 407 -72 7 278 199 -520 -90 29 -24 -428 -655 71 44 -542 -188 19 -16 -142 -350
2373 -350 162 155 -168 -285 168 190 -93 -138 414 540 -139 68 373 317 -136 -356 403 114 -173 -187 31 150
2395 150 -437 -256 -22 -201 -350 -353 -112 114 -105 126 166 134 -77 -7 152 213 121 190 426 355 -275 -83 207
2418 207 271 -283 24 364 325 -174 -241 239 -60 -536 -363 101 -118 -404 -221 -335 -27 -308 -406 111 172 -571
2440 -571 -223 432 148 -36 391 130 445 -193 -121 413 401 56 -323 513 494 -264 -391 110 51 -203 -532
2461 -532 -11 29 -434 -362 116 -139 -291 -221 60 -220 -214 -111 220 88 -92 178 307 582 -225 108 480 252
2483 252 -38 -246 148 207 -90 -224 404 -6 -174 -488 194 226 -354 -430 259 -163 -327 -252 293 252 -68 -276
2505 -276 238 -6 -91 -94 287 503 -71 9 339 363 11 -182 406 411 -197 -247 309 165 -561 -258 73 51 -335
2528 -335 -358 63 -87 -336 -360 48 393 -184 -165 309 368 -293 -154 383 303 10 37 316 163 28 137 85
2550 85 480 -127 -289 -43 138 -252 -359 75 126 -131 -255 27 104 -489 -385 24 122 -51 -42 170 117 -61
2572 -61 -84 480 643 -53 -87 514 467 36 -112 560 448 -133 92 213 236 -440 -372 142 49 -342 -182 -21
2594 -21 123 -124 -195 120 258 -248 -239 164 284 -88 34 282 443 -24 53 266 444 36 -281 331 397 -9
2616 -9 -171 202 180 -178 -138 89 35 -213 -475 125 -16 -311 -376 -36 144 -154 -244 348 254 -177 -47 276 475
2639 475 -7 -135 -36 275 -41 -15 228 354 -9 -193 400 164 -207 -106 -19 45 -231 -365 -85 -115 -298 -352
2661 -352 140 -7 -84 -279 281 241 -373 -40 273 220 96 -210 301 429 49 27 401 281 -58 -72 110 181
2683 181 -391 -4 2 43 -147 -239 -80 -103 -403 -509 -6 41 -55 -453 -23 104 -37 -256 442 364 134 -30 138
2706 138 504 64 -132 144 212 -14 -20 89 234 -17 -267 131 364 -192 -310 -346 30 -250 -402 -32 117
2727 117 -223 -92 48 170 -201 -60 208 468 -62 -137 143 416 -69 -197 279 227 -42 -386 295 208 20
2748 20 -16 143 17 -148 -234 -496 45 -283 -219 -224 13 -264 -430 -113 88 -53 50 318 201 -216 23 338
2770 338 299 144 133 78 334 130 -282 331 159 -124 -553 -28 229 -119 -467 -203 85 -85 -476 -142 12
2791 12 -286 -146 -157 120 -232 -292 48 122 99 -7 306 354 -152 -66 153 378 83 -278 274 124 -300 -355 35
2814 35 -156 -232 -273 -434 61 -292 -431 -277 215 -226 -73 219 320 90 -270 140 336 3 -310 274 336
2835 336 38 78 263 231 -68 -142 135 235 -294 -111 -74 269 -176 -241 -129 4 -29 -458 -109 135 -393 -323
2857 -323 140 33 -15 -140 11 250 -74 -122 67 257 115 -139 269 191 195 -157 -25 254 37 -214 258 355
2879 355 -230 -401 -63 266 -124 -368 -172 53 24 -299 30 154 -73 -387 262 136 24 -158 123 359
2899 359 12 -37 270 388 279 -207 306 433 -36 -97 17 22 -175 -400 -343 202 -95 -669 -282 -95 -90 -400
2921 -400 -260 160 122 -245 -26 364 -1 -101 -204 265 143 -117 -193 85 163 -144 143 413 -106 -70 -87 51
2943 51 -59 -79 -42 179 -226 -294 -16 -65 -119 -220 -139 188 -332 -213 124 245 84 -265 39 185 206 9 144
2966 144 526 -102 114 -38 138 -9 -247 -56 42 89 -328 -302 141 -260 -358 -279 -206 -88 -329 -258 273 -82
2988 -82 -183 1 14 72 -46 -110 78 80 -166 328 513 414 137 21 182 112 111 13 247 -16 -262 -106 -187 -342
3012 -342 -357 -27 111 -79 -380 103 310 -199 72 26 92 -183 -204 77 343 -167 -44 88 181 329 76 76
3034 76 280 -107 -268 144 157 -82 -419 19 160 -145 -391 -122 -70 -119 -409 -75 -50 -243 -52 142 363 109
3056 109 -334 156 183 -109 -99 192 239 150 37 146 132 102 -114 -94 400 -39 -158 115 149 29 -191 -130 79
3079 79 -279 -211 182 -52 28 -255 40 108 -43 -295 -11 212 111 75 315 121 190 -179 59 -38 117 -53
3101 -53 53 111 -23 24 -151 -111 -43 -315 -127 201 -96 -248 -158 35 21 -311 -114 236 -126 -417 91 215
3123 215 478 10 -123 238 334 7 422 334 337 10 170 150 163 -258 50 191 56 -371 -192 300 -77 14
3145 14 -171 82 -115 -253 10 240 36 -184 -254 141 334 48 186 144 12 -81 -20 158 300 -233 -207 183
3167 183 215 -88 86 274 -77 -54 71 296 181 -203 83 -78 -67 -83 111 108 202 -59 231 194 365 -18 140
3190 140 224 176 -41 -182 87 214 -154 139 207 -127 -115 -10 -157 -16 -412 -97 -28 -34 -175 -336 -17 -138
3212 -138 -349 -116 18 -137 -193 188 339 -9 -75 -1 262 160 -58 -16 410 64 -250 296 168 85 -204 -57
3234 -57 94 -162 -230 -394 280 -67 -219 -172 27 -171 -177 -85 -45 280 -141 -115 297 17 -242 -174 271 95 -203
3257 -203 129 375 54 -62 328 -97 133 -172 96 229 -115 -442 -145 4 -99 -199 -265 32 -215 -245 139
3278 139 -125 77 -117 6 165 257 15 259 131 232 -18 97 186 99 100 -88 510 97 10 -167 -176 -53 -123
3301 -123 -193 22 -75 -308 -44 31 393 -357 165 73 76 -228 -48 83 27 -100 -191 69 33 -67 -32 182 322
3324 322 -218 139 163 41 -286 -57 163 165 -97 -124 -15 -132 -57 -37 -244 -123 -127 -157 -187 64 -165 -5 120
3347 120 -53 -1 -45 306 -108 189 261 197 63 -155 74 183 -94 -103 -160 260 29 -281 -385 87 -74 -195
3369 -195 -67 84 217 -259 -133 114 -53 -252 -62 4 -11 -98 -81 177 40 23 -61 97 6 18 8 -31 79
3392 79 36 158 -172 146 -202 -73 151 82 -218 -168 145 6 -292 -143 198 -142 -114 -109 63 -121 -17 -312
3414 -312 -5 213 113 10 460 -101 98 335 183 126 -102 -77 74 143 -215 -106 125 -166 -233 132 -140
3435 -140 -110 -212 -384 266 -3 -166 -113 47 141 -200 -45 213 -14 -168 54 297 -91 226 -140 201 0
3456 0 11 -48 123 125 -205 -89 62 60 -326 65 52 -318 -158 -110 111 178 -88 46 -196 169 -208 55 130 158
3480 158 111 -53 233 158 39 -2 143 -86 4 -57 175 52 -137 -4 135 49 145 -66 6 41 38 -214 103 0
3504 0 -95 -21 296 57 -262 67 182 -84 -240 -229 145 216 -105 -129 178 8 -126 -75 -21 232 -193 19 235
3527 235 97 -163 169 -84 3 -227 -198 245 45 -431 32 -73 171 -28 -177 -43 -13 -11 -32 5 156 200 77
3550 77 58 209 -48 -85 -87 8 68 -310 22 45 -292 -27 -3 142 -43 -3 134 57 -377 53 -32 -56 -19 -125 156
3575 156 -290 162 -143 64 162 59 -281 134 61 101 10 141 17 168 -121 29 149 -78 -140 164 -188 -96
3597 -96 -119 -136 -282 -208 -172 250 -102 1 186 261 -120 76 -19 226 30 -39 -58 201 206 24 86 125 224 -163 69
3622 69 361 174 -225 -203 83 -50 -215 -22 166 122 -189 43 -8 -32 -245 -55 169 54 -62 -205 -83 -190
3644 -190 -25 58 114 160 -39 171 153 352 -80 -350 72 -58 -161 -145 84 -149 -305 -235 -68 -258 -343 -155
3666 -155 155 -120 -246 71 -22 -117 -66 -96 96 74 -221 -60 82 -24 146 -47 -2 341 -72 -215 185 220
3688 220 224 -295 -40 77 -227 -103 -128 222 -7 -23 -12 95 -20 -87 143 278 -106 143 125 248 -220 155
3710 155 205 -21 79 -142 25 -149 32 -90 83 49 -225 69 -38 129 -252 -174 99 -11 -383 -76 -58
3731 -58 -195 -166 -427 62 171 -168 27 232 256 69 -45 125 232 -28 46 62 24 132 -10 80 170 35 -29
3754 -29 -58 156 44 -238 53 170 -332 -162 109 32 -276 -73 -127 114 -11 -111 34 134 -30 -206 71
3775 71 98 -278 45 309 160 -30 -44 196 154 -16 60 65 -62 -77 24 -174 83 -192 -391 -10 -23 146 -71
3798 -71 -91 210 -10 -74 -72 -221 -73 63 228 383 -66 -85 477 111 152 -47 -20 13 -116 -192 -137 198 -174 -128
3822 -128 -58 -10 -12 -130 25 2 12 -242 -47 101 17 -213 110 115 -11 -6 110 149 235 143 118 244 329 -176 194
3847 194 204 -176 -210 47 54 -175 -130 11 304 -137 76 -208 11 -147 -187 -184 78 -142 -31 -58 -65 -164 -13 264
3871 264 -63 -258 -99 -173 166 105 43 -57 17 157 -272 98 293 -34 -268 -111 244 -114 32 3 -122 63
3893 63 169 201 7 -103 -165 87 -72 30 -331 311 281 -122 -40 93 255 -62 -116 -202 -49 -145 -135 -105 67
3916 67 -28 -188 -69 -236 306 52 -258 50 -218 -119 -48 -44 205 -303 -155 99 -36 229 230 18 -26 -60 46
3939 46 166 62 146 35 97 -170 -115 161 475 6 -127 70 -86 -101 -112 38 -65 -96 -54 58 166 75 -190
3962 -190 135 24 -116 2 129 184 237 131 226 267 139 53 114 117 -135 99 18 80 -27 -72 62 26 -106 -6
3986 -6 48 -37 -262 -143 55 -32 -204 28 -174 64 32 -183 -70 28 -13 32 555 -100 -4 -164 119 217 140 117
4010 117 -15 97 -372 -176 -153 -7 -90 159 -17 -145 -162 -71 -122 182 -149 -306 266 201 167 -105 92 461
4032 461 -37 -88 -77 306 319 213 -3 182 -33 106 -82 -120 -216 -191 258 -18 -60 -248 149 229 -192 -57 53
4055 53 56 69 -352 -169 129 -77 -10 -175 313 108 92 -158 145 -119 177 299 -16 188 57 -91 239 91
4077 91 -82 44 222 -357 -19 -188 -51 -42 -120 3 93 -152 -101 243 205 -126 -95 168 215 70 128 -5 74 46
4101 46 98 -161 52 -34 -295 201 -159 36 -210 -175 -71 -73 -140 -193 -158 -16 -73 -280 -5 -185 -97 -115 54 36
4125 36 -5 -79 170 74 -191 -91 35 19 98 64 72 152 -22 -35 71 -309 -228 106 141 33 -12 83 -127 -167 -350
4150 -350 -107 114 19 -348 -103 192 -9 -139 -15 279 168 -178 -8 29 -68 41 -38 -257 87 -58 -9 203
4172 203 21 28 81 -283 -113 -56 -176 94 -140 255 -23 162 -46 -210 -29 -51 -276 -238 180 -55 -37 28 107
4195 107 -58 10 -184 181 72 -260 -137 73 -104 123 -200 -116 -186 24 -190 101 -92 -15 -11 -99 48 -57
4217 -57 -43 -186 230 43 -83 -129 -27 72 -136 -20 204 106 -172 -13 183 -121 -3 52 -104 -150 50 -66
4239 -66 27 -109 -117 -158 69 -114 -16 101 97 -320 -168 -295 160 10 -146 -4 -131 46 134 -70 141 26 148
4262 148 -144 75 42 -283 160 291 74 -132 -168 -44 -29 -59 89 113 -193 17 39 -215 28 -7 -107 -90 -42
4285 -42 122 65 74 -118 -108 208 71 160 -153 232 10 31 29 25 -10 -191 -88 62 99 -58 -29 -39 78 -220 -389
4310 -389 -190 108 -361 -29 12 -289 213 -179 -80 -11 17 -44 -131 281 -3 -44 113 -164 -51 190 -107 -167 189
4333 189 -84 41 306 38 91 -28 -9 -88 -210 -184 150 174 -286 69 21 -13 -216 -211 52 59 139 77 173 52 -24
4358 -24 -113 38 -198 -91 -249 -74 145 24 -118 86 -23 -104 67 142 -26 -241 81 60 -147 -216 50 124
4380 124 -35 -181 -67 152 233 -41 170 -8 -22 -242 9 275 -189 71 -8 -251 59 -186 77 -154 -33
4401 -33 -98 -194 29 24 -215 -232 -141 -266 -71 -320 -275 -47 -48 -85 -66 -101 110 194 62 93 -218 -129 -90 -230 15 121
4427 121 38 193 28 -76 116 -264 129 20 116 100 -46 113 -199 -76 -7 -14 -136 -138 30 324 1 78 -205
4450 -205 132 -55 29 -259 226 226 137 -112 -78 207 19 43 113 214 84 73 -22 -122 43 -2 -219 -171 -28 83
4474 83 -287 112 62 53 -207 -138 3 22 -16 84 232 157 96 23 178 181 -44 267 -64 -173 -13 -71 -134 -253 347
4499 347 -197 59 -149 129 -71 -32 151 -57 85 27 12 -189 196 1 -178 -49 109 -85 20 -91 -92 273
4521 273 47 -212 100 -64 -59 -61 -209 197 -210 -120 -31 104 -137 67 -103 -83 -27 -2 -525 119 157 107 33 147
4545 147 -7 -159 53 111 141 2 133 -247 86 -128 295 -50 -38 -39 43 -11 -7 175 300 -166 -231 16 -67 -70
4569 -70 -136 68 44 129 -139 -122 171 151 -104 -82 16 -27 45 68 296 350 -51 -163 -161 -17 56 -5 293 204 84 -113
4595 -113 55 32 85 -160 3 -205 -269 -31 -97 45 -224 -112 -100 114 -168 -17 18 -142 -162 37 70 -21 0
4618 0 127 257 250 -292 153 6 21 85 -100 260 -26 40 36 67 -356 -74 -50 -199 79 -114 -211 14 -62 -135 -129
4643 -129 133 235 -134 -70 164 -6 60 -118 -126 2 -105 -151 204 11 6 -202 95 9 -170 71 -191 43 -209
4666 -209 -113 -9 -218 -208 -51 55 221 -77 -125 161 -17 -170 140 42 196 -29 -128 146 154 7 -93 61
4688 61 10 156 -51 169 -70 -154 135 -16 82 -118 29 -65 -7 -28 -134 30 -171 76 75 103 -80 -220 64
4711 64 31 -168 53 -98 88 128 61 56 53 197 19 124 97 -6 -31 -91 -188 -60 81 -59 230 -98 -110 -14 -38
4736 -38 158 -95 16 -62 -39 -231 135 -49 -84 -311 -34 -8 22 -173 -26 162 61 -162 160 171 -174 -25
4758 -25 -98 47 -150 -244 86 66 90 -7 -100 -101 -123 123 -8 258 6 -125 -14 -13 83 25 -91 -151 205 -55 -58 14
4784 14 44 51 78 -2 -33 -216 -233 -56 -142 -140 17 -269 -140 54 -433 -14 2 -47 262 -17 -12 267 91 -24 259
4809 259 70 121 111 -256 -180 139 140 107 73 14 20 -32 7 -6 170 78 5 -122 -31 -45 -155 22 31 -207 -177 -210 142
4836 142 30 -67 50 240 175 93 70 -133 30 131 116 32 87 -159 -52 -57 -155 -152 15 67 -147 13 97 -166 -234
4861 -234 44 -15 88 343 233 80 -81 236 17 -177 -215 -133 -40 -143 114 -83 -127 -63 -27 -266 -162 24
4883 24 200 -14 93 165 322 -21 -110 -258 -96 41 13 -133 -122 69 -4 31 -72 -66 -192 -177 1 17 -46 -157
4907 -157 132 -54 -282 57 115 -145 -26 -140 -55 311 17 -331 46 -158 -113 2 87 -75 86 28 69 157
4929 157 -93 -208 -28 101 -168 126 76 121 71 1 -230 109 94 -85 47 149 -107 -45 -249 85 -187 -45
4951 -45 -58 33 105 97 -61 199 255 -256 -6 -14 -93 -171 -24 -170 -393 -165 173 -1 -267 -100 136 181 115 88 -98
4976 -98 230 200 95 177 127 2 -213 107 -222 -121 -116 -78 177 -56 105 34 -79 -129 2 -17 161 -49 122
4999 122 82 -54 44 -98 5 62 -118 154 196 151 115 -12 -167 -83 -116 65 -93 -24 25 -60 -77 -56 169 149 204
5024 204 230 -132 -210 -16 -229 142 217 16 -43 109 -59 -74 32 98 -28 -63 101 94 -31 25 134 -56 -12 -15
5048 -15 66 77 -93 -175 -141 -115 -6 -65 -77 -282 158 -82 148 11 86 269 52 267 -24 272 123 25 -100
5071 -100 58 -124 176 113 185 230 86 -106 -101 52 -149 -45 -143 -238 -201 -350 -92 -102 -17 -94 -87 -52 107 63 134
5096 134 46 12 -103 301 -1 67 131 -156 66 -155 -55 182 66 -228 -89 -139 23 40 -64 132 170 -137
5118 -137 230 36 45 57 -95 -85 39 76 -82 -68 295 88 189 176 205 -121 -79 71 160 62 -199 36 101 4
5142 4 185 57 -27 84 -104 -3 40 132 15 -124 -132 -26 -55 -229 132 -104 -313 57 38 159 -173 -222 21
5165 21 -195 85 -33 32 -75 93 -192 376 29 -15 -43 -40 -25 39 83 47 -2 -150 64 -8 83 65 129 -1 20
5190 20 -276 -82 -99 73 321 30 -79 -109 -322 81 297 -133 -89 132 186 89 -22 104 115 86 -196 -41 -18
5213 -18 144 -429 -41 -147 -128 -192 -75 51 84 -313 -207 -178 184 -84 14 39 -176 -93 52 -143 133 9 63
5236 63 108 187 1 134 -55 172 -97 -341 -78 -112 -45 14 -163 -6 -125 284 -198 -254 -240 89 123 32 -53 177
5260 177 -19 37 -120 -118 66 -40 75 35 -33 234 84 -37 397 -1 204 32 -2 46 -117 10 85 -184 -347
5283 -347 99 19 17 29 -149 -179 62 -73 56 -67 -242 -106 114 32 -2 -82 217 271 -23 -272 -21 67 10 -8
5307 -8 -151 -60 -10 22 71 -77 19 -222 -20 -95 -220 -235 36 -103 12 -6 23 276 37 -252 -117 -11 122 71
5331 71 -104 -56 -152 40 248 22 37 6 241 -203 -29 9 109 -123 23 -418 -19 -48 -112 88 45 -79 -131
5354 -131 186 181 -93 -160 22 196 320 -104 -122 -25 36 -162 -67 -231 -61 94 88 122 208 -34 -156 293 124 -21
5378 -21 -77 83 -68 73 73 -190 -14 26 -310 35 -11 167 -160 -212 -331 85 32 37 333 -234 119 88 68 -38
5402 -38 -196 -54 -54 129 100 -70 -7 -209 -80 144 67 137 -103 -167 -228 -40 71 -121 -39 80 85 46 -162 60
5426 60 -63 41 80 -258 -4 39 -59 -124 192 135 80 -218 66 -92 166 230 49 96 92 -107 -31 133 472 -131
5450 -131 -130 172 151 66 -14 93 226 -37 214 132 -73 52 24 96 320 -165 -225 -35 -108 67 -215 2 96 112
5474 112 -8 180 84 -101 -99 -133 -16 -49 -2 -136 160 -84 -383 -119 46 -123 160 82 -155 52 -8 38 -52
5497 -52 -30 64 -287 82 -69 68 6 2 -8 24 -145 -213 151 -80 240 -233 -19 9 24 23 8 -24 -182 270 -7
5522 -7 153 37 176 -105 166 -241 136 65 -117 -140 -51 56 30 -112 -185 -382 -87 86 -70 -141 -76 92 -100
5545 -100 159 174 78 -185 33 89 165 -86 19 -43 -152 85 -2 -196 -78 -71 100 235 68 -239 30 -107 61
5568 61 124 58 126 -85 -30 -254 -31 -102 -67 -101 46 5 -59 -15 -133 68 -112 -222 31 86 -106 84 -28 6
5592 6 -87 -182 -261 -13 15 -21 -95 -169 90 16 200 34 -213 138 -122 1 -105 -97 54 59 80 105 43 -3 -47 -119 100
5619 100 73 157 31 -378 -31 32 83 -95 19 -82 -18 111 -334 -302 18 196 115 -57 -104 -173 -233 82 237
5642 237 -109 -53 -145 331 -162 103 -38 -100 12 -107 64 -152 -131 39 -111 62 71 0 -259 132 102 -48 -246
5665 -246 178 169 -123 107 44 85 -200 171 -218 -180 -99 73 -192 53 -11 211 -153 108 -52 -130 187 75 95
5688 95 45 -104 36 -46 117 -242 272 96 -15 50 -116 41 -263 -46 39 25 83 -148 -52 89 -9 -94 -68 5
5712 5 -55 -214 -160 -56 28 -49 36 27 25 -19 -63 323 -41 -162 46 -64 103 127 -5 109 -43 188 321 66 -15
5737 -15 499 58 65 208 158 -32 -30 171 245 239 -60 88 -6 -8 109 76 -122 -94 67 -178 -27 -37 -87 120 21 -46
5763 -46 199 -114 15 305 102 123 -261 88 93 -95 36 22 77 -275 -176 235 -82 -351 87 13 -38 51 9 -140
5787 -140 -92 -117 -249 -158 64 -7 -64 24 -136 246 106 -284 -139 12 168 -12 -41 -65 62 -13 -61 -235 -7
5810 -7 -366 107 -76 -45 -20 14 -120 -182 84 330 92 -172 -5 23 -89 -287 153 224 99 161 -195 163 21
5833 21 -140 -76 -150 99 -49 107 100 -45 -89 112 110 -209 -203 -50 -365 76 168 56 251 142 -79 -79 67 -17 151
5858 151 110 -220 -122 -126 -86 -205 90 279 -158 -159 -191 -259 -41 136 82 -52 178 152 24 -62 -40 208 126 -122 -46
5883 -46 -74 257 191 146 5 266 41 -281 -72 47 236 -30 104 -259 -229 -65 251 -137 -40 -137 -150 125 -332
5906 -332 -124 50 37 -10 193 -68 179 153 189 125 -84 48 29 38 243 -49 -221 -115 -70 184 113 -98 -12 -44
5930 -44 -141 150 27 -82 -57 -79 -65 78 -182 -125 30 175 259 -123 166 221 205 -5 27 109 87 -6 274 -150
5954 -150 101 56 -51 -90 -19 -93 -104 193 -56 57 -190 140 -135 -151 -94 -52 -54 -147 -270 98 -47 81 58 192
5978 192 -75 97 48 -96 -290 -33 33 231 66 -341 -261 39 58 -190 38 -8 -45 132 -198 11 -277 3
6000 3 105 -74 9 -138 65 -83 -136 93 52 94 -120 -51 -90 71 -5 -91 -33 161 -299 24 151 18 29 155
6024 155 146 57 136 8 117 -150 -214 140 -135 184 -40 -134 44 35 16 -60 -161 -125 -139 84 -8 -175 86 -100
6048 -100 29 -66 -107 -71 33 -41 -15 -95 -210 -6 -215 93 -29 -72 -19 -206 14 180 67 -193 -1 -119 41
6071 41 -153 -58 69 35 186 3 -171 -13 234 131 51 -55 129 187 177 -26 221 -190 -26 88 14 -207
6093 -207 128 28 -115 176 71 -22 11 -117 -29 -94 155 -232 64 -20 -117 186 344 220 137 216 15 -32 -193
6116 -193 -64 -128 14 96 -13 -60 106 -38 155 15 -307 70 41 -26 -161 77 155 -136 89 36 -165 95
6138 95 -34 -101 240 -7 -39 -228 38 65 -139 206 89 -254 52 -93 -72 140 212 -186 -80 -21 -15 293 -343
6161 -343 -234 -132 -7 -74 40 136 -112 133 -2 -182 -157 -345 -53 225 -39 321 -170 122 208 133 -15 201
6183 201 -189 -189 -147 -132 -78 -202 15 -41 66 -73 -14 -29 16 294 214 38 -102 90 -139 -74 -80 -135 -73 -239 14
6208 14 -62 132 -150 -51 242 -207 -9 85 -156 64 -216 -7 -101 97 -112 -51 2 45 -70 3 -22 55 215 -36
6232 -36 -154 -23 237 34 -264 84 6 -164 -63 -25 -161 34 -59 -77 177 -134 163 -33 140 -9 96 -59
6254 -59 248 190 272 190 28 -110 -122 -207 -63 -63 -191 60 5 32 37 -1 180 -116 -42 256 -39 -53 -6 72 -200 74
6280 74 136 -80 49 67 150 68 144 -98 -20 0 -338 -122 -39 172 -145 74 -94 -33 -59 35 -25 256 128 55 262
6305 262 -125 113 -136 -131 -125 39 51 -7 151 35 -89 -81 126 -52 95 44 -151 -26 230 101 -9 247 -206
6328 -206 -98 59 -51 -167 -113 -153 -221 38 -259 165 -76 -107 -95 104 -106 254 -43 -48 -25 -68 209 141 42 105
6352 105 14 -111 -127 119 -46 -35 126 -117 -112 106 28 -35 14 107 102 30 177 55 156 98 205 108 36 -253 -119
6377 -119 -292 89 119 -40 184 -94 -192 52 4 -142 -28 205 110 -115 -41 311 130 76 121 -160 -22 188
6399 188 -207 -82 -43 -33 211 -75 -42 67 266 70 61 35 6 -22 -109 -59 67 106 -184 65 42 -25 126 -124
6423 -124 -66 24 -21 99 -102 -37 -81 -284 -56 -41 20 113 -189 302 -128 224 -58 37 -176 -84 -280 -178 53
6446 53 -107 -139 53 -179 31 -173 -18 32 -310 -75 186 101 -84 -184 -179 -248 -22 -211 -79 52 131 -142 134
6469 134 137 -239 -200 116 -277 1 129 -41 117 -124 -165 3 38 73 -137 -125 7 -18 93 -19 9 -70 141
6492 141 23 -90 94 -32 68 0 1 -249 -120 162 45 27 17 -68 20 -62 -233 -25 -100 -1 33 29 39 73 -235
6517 -235 -19 29 -137 80 3 207 45 -120 -138 96 -16 -214 126 46 -88 167 123 78 -158 -52 23 -54 -93
6540 -93 364 -56 -127 -206 -41 -97 84 -112 115 184 -210 11 -9 51 64 2 -63 2 -216 30 -17 -149 -93 214
6564 214 -59 121 63 -156 166 23 -35 -259 -294 -201 -162 -68 286 87 -10 -69 126 -185 -119 8 -210 -61 92
6587 92 5 73 -169 128 -45 -178 105 -46 -48 -75 69 -284 2 26 354 -202 342 -241 -33 -47 260 120 280
6610 280 -88 -190 116 -65 -157 -322 -7 87 -81 -67 42 -129 -37 -21 137 74 25 50 -165 55 -3 121 -182
6633 -182 88 48 -148 24 195 54 -13 142 -172 -33 -72 76 144 -103 28 -341 -73 256 -184 -149 -4 4
6655 4 -122 191 159 -63 -54 -134 -41 90 75 18 -247 41 63 -65 -193 -41 25 -278 -70 -145 253 92 130 -396
6679 -396 -118 29 -55 -65 -167 -168 200 106 179 157 213 49 -118 -79 3 54 -93 -177 247 180 48 -226 -141 106 13
6704 13 -124 13 101 -184 78 80 -186 -66 -5 2 52 143 -36 145 87 91 166 -148 -190 71 -212 -185 72 -63 -79
6729 -79 -44 85 299 191 -23 57 40 -51 -164 76 212 74 97 -170 62 39 123 -116 50 -152 -208 -11 -45
6752 -45 138 82 -40 71 -13 75 74 -25 111 -226 -51 -14 14 -223 -272 -265 6 -5 118 89 -149 60 -37 216 -45
6777 -45 -34 -259 -49 -95 73 38 159 -18 -40 -120 -137 240 -20 84 -103 -64 143 114 -99 -129 -89 151 -102 -28
6801 -28 -29 -115 -18 105 137 -26 44 225 -184 12 -9 -23 -5 -47 -116 -141 128 -77 238 -72 17 258 -137 -154 -35
6826 -35 -38 -221 47 -56 -128 -136 -165 42 -10 140 156 122 -174 -127 88 -107 8 243 -107 -63 -31 -60 94 248 -9
6851 -9 -13 187 12 -270 -43 -208 -65 -296 -37 -11 141 -107 -7 -79 15 34 -104 5 -178 1 92 -255 -123
6874 -123 -80 -20 -9 23 103 -136 65 171 348 -7 149 -52 11 -102 -113 80 -78 13 168 -28 -94 -38 99
6897 99 68 55 -26 -161 -69 74 -165 -21 -100 8 -106 -32 52 -242 85 -43 124 215 42 -32 66 -141 9 295
6921 295 -277 153 -20 -7 138 181 -177 79 73 -107 -74 34 134 -96 81 -161 110 -156 83 142 -31 -83
6943 -83 -186 -5 -7 196 -88 38 -11 -66 -181 -64 136 -131 61 157 -138 46 -88 -54 -32 -335 -31 -62 -125
6966 -125 -65 -79 105 95 3 189 59 311 -33 53 -7 -27 110 116 -178 31 -77 167 -31 -30 -215 73 -89 90
6990 90 101 -55 192 -1 15 51 -37 309 -69 -53 -162 -249 74 -113 -125 -114 -167 335 119 16 126 -159 28
7013 28 19 80 128 -51 -17 278 -8 48 -41 -61 22 -439 -56 231 -220 84 187 -44 -62 -90 -141 18 -42 44 81
7038 81 265 183 -165 82 -203 -201 -148 -29 203 -73 -78 185 -71 -31 56 -18 233 133 -74 149 59 219 90 -40
7062 -40 38 129 98 146 24 -34 -71 67 -158 -162 178 -273 15 -185 -39 -39 116 59 37 22 27 102 -30 122 -211 99
7088 99 158 -55 77 139 -223 -130 65 136 -310 -183 -155 57 54 -335 85 -76 215 19 61 41 -22 142 -43 -253
7112 -253 -207 27 136 -174 -44 -199 112 107 -56 -139 -30 -8 -307 102 8 -29 45 31 -77 142 -133 -80 102
7135 102 -95 192 -159 -52 7 -94 330 -84 107 -228 186 -159 -159 73 169 -120 21 -33 -230 -149 -336 -78
7157 -78 -54 140 -58 -115 172 -58 -241 -167 -48 -148 -199 89 -84 -30 260 -22 -188 42 -15 219 19 -155
7179 -155 -15 46 -244 133 -159 59 94 -93 61 193 16 -135 331 -203 107 123 -86 -27 -101 202 -55 -348
7201 -348 18 150 182 4 -202 -56 -31 2 137 -107 -92 135 -178 51 12 213 63 -350 -110 -152 -104 46
7223 46 162 -96 -164 -292 -156 -61 -25 -142 90 281 77 -165 -22 -270 -71 102 -191 172 270 79 142 9
7245 9 36 251 -161 -14 79 -235 146 -1 -123 -93 51 3 44 -51 -138 238 49 16 -76 42 63 -152 -51 -158
7269 -158 -144 -210 139 -69 -179 -31 157 108 103 -226 -67 49 388 23 -103 67 76 -76 -33 110 97 141 -160
7292 -160 158 -99 -225 -52 62 -125 181 10 16 101 -53 3 -124 73 -88 124 -127 29 6 -56 19 -135
7314 -135 219 -10 -44 278 215 -216 -306 62 -4 14 -39 -158 25 -95 -194 -264 214 -24 -154 -37 -122 -73 -180
7337 -180 -47 88 -287 -71 71 -99 9 182 127 -24 137 19 41 132 -19 163 -133 74 146 -367 -91
7358 -91 303 -136 184 92 -12 33 -134 -47 -47 -86 -209 -28 -113 287 67 -7 -71 34 -66 -91 -6 -47 32 -87 -8
7383 -8 21 39 -186 15 -5 24 -252 -66 -138 -39 -46 71 238 49 124 -37 54 -45 -92 22 -52 -287 90 -43 107
7408 107 -45 14 134 -174 -157 -22 134 61 23 6 64 6 38 -133 147 -80 -193 -142 38 39 41 -44 37 -21 -17 -83
7434 -83 -239 -101 -141 195 -262 -57 -360 -213 -246 26 -244 113 -19 -68 -97 68 -57 10 -145 79 50 -172
7456 -172 14 64 -123 -33 -8 -248 -13 -117 -59 74 49 16 -37 -95 169 -126 5 96 218 -147 204 85 -76
7479 -76 -101 183 10 -208 12 -244 52 -143 -111 -46 -15 -148 30 -243 13 -172 -88 -79 83 -97 68 -110 -41
7502 -41 131 82 31 -115 201 -51 122 -55 -153 -114 99 -58 -54 154 -70 3 -177 48 -5 -247 -64 -128 187
7525 187 6 93 66 -210 100 79 -41 18 -77 113 125 -145 -21 -90 452 292 -29 -125 6 81 -185 12 64
7548 64 -183 -16 137 156 -77 -133 22 77 120 23 44 79 -41 -158 -66 -128 21 11 -66 -74 137 -17 50 148 -8
7573 -8 -124 31 225 264 -16 156 131 -21 -114 117 -7 -62 48 -7 121 -116 -91 -79 -91 -67 -64 -163 66 -114 109
7598 109 91 -76 -43 -128 -42 246 208 -117 -93 237 -67 24 57 -71 -61 -163 -278 -22 -302 -141 54 225 -264
7621 -264 -119 -180 -2 -87 42 8 -39 172 -149 100 -110 -22 -104 216 62 -36 -47 35 109 -134 -64 179 -5 -145
7645 -145 -45 208 259 222 -92 30 -50 -8 89 -9 185 50 183 64 119 127 -89 -67 145 -192 100 -222 192
7668 192 -30 -105 156 -66 24 140 178 -101 108 -248 75 246 186 -14 99 210 -203 -156 -197 86 64 99 -79
7691 -79 -70 -161 -64 9 -42 -84 -24 -147 28 -76 -276 88 142 89 48 36 55 34 -119 -10 -41 55 235 -99 40 169
7717 169 70 95 87 -47 -3 -101 3 -155 -59 76 -4 206 75 80 53 -67 81 -201 -130 202 -21 1 -2 -35 -253
7742 -253 100 157 37 -139 -121 9 88 107 -107 297 149 123 33 2 -32 -134 40 165 11 -10 51 115 134 133 -148
7767 -148 0 -129 82 218 -91 36 278 -81 -252 11 -76 146 -88 63 0 -13 -195 -110 -112 231 58 176
7789 176 -11 -100 24 -146 194 35 -17 235 -92 -113 -387 -273 265 129 -27 8 -121 -132 57 -9 -86 189
7811 189 360 50 30 104 -71 205 43 84 203 -20 129 -195 13 -114 132 179 -36 -37 -24 47 27 78 66 56
7835 56 -145 189 -11 15 24 162 17 -84 143 -43 12 8 -36 195 148 -139 125 -175 -130 50 -212 -295 -32 48
7859 48 112 -58 -47 148 -283 -77 -130 -43 171 97 151 -227 141 91 -23 141 -173 -45 21 48 44 -36 106 -15
7883 -15 -109 -4 62 -134 170 118 -84 87 27 21 12 23 360 -101 142 -313 -1 145 -178 -82 -144 -6 -127 -9
7907 -9 187 60 -10 207 -77 -25 4 37 -52 -249 -122 -71 74 229 46 -102 225 64 -106 139 -169 168 -58
7930 -58 -179 48 -9 130 156 53 129 146 117 -246 -172 154 -20 220 44 163 -88 -57 -154 65 -167 199 90
7953 90 11 -146 -112 239 115 18 136 110 3 -160 -36 98 36 128 -74 77 111 32 -64 -134 -207 84 -127 159
7977 159 1 16 -27 -205 -20 -120 135 -99 -1 162 -20 193 -20 213 -93 228 81 27 55 -125 99 -45
7999 -45 -109 41 11 212 -6 79 -16 -96 95 -222 275 40 -54 -99 58 -97 -303 207 -167 130 29 234 104
8022 104 30 -99 -3 -204 80 69 -224 -76 -167 39 206 118 -159 40 -385 63 -113 78 37 -23 -4 11 96
8045 96 123 77 155 33 123 116 -62 -90 34 -89 -112 10 39 -165 260 -71 -283 30 139 33 -129 -132 155 -71
8069 -71 -93 83 3 10 -120 191 226 -89 -121 -24 -55 125 165 -14 158 -1 -78 -75 -267 78 78 88 105 -256 -157 -15
8095 -15 101 12 -9 86 42 -25 6 -84 -124 56 87 -59 167 37 -63 -63 -31 53 237 158 40 35 -203 -5 58 180
8121 180 133 38 -92 116 -168 93 212 -55 -13 -36 -45 -46 -88 -199 -91 -161 358 25 -218 127 106 121 -53 58
8145 58 -169 -38 -162 111 23 -48 29 -110 5 -43 95 85 194 -105 172 39 -110 78 -30 144 -58 107
8167 107 -52 -152 -48 -3 2 -174 -24 74 153 26 -2 -234 -29 75 -97 -9 123 183 150 -211 7 -44 2 -66
8191f6
##END NTUPLES=NMR FID
##END=
