##TITLE=1H_DE10+11F2T
 DMSO-d6
 8 sc, 
 7.9.2023
##JCAMPDX= 6.0         $$ Bruker NMR JCAMP-DX V2.0
##DATA TYPE= NMR FID
##DATA CLASS= NTUPLES
##ORIGIN= UXNMR, Bruker Analytische Messtechnik GmbH
##OWNER= root
$$ XWIN-NMR		Version 3.5
$$ Thu Sep  7 15:31:08 2023 Russian Standard Time (UT+4h)  she@DPX200
##.OBSERVE FREQUENCY= 200.13135
##.OBSERVE NUCLEUS= ^1H
##.DELAY= (6, 6)
##.ACQUISITION MODE= SIMULTANEOUS
##.ACQUISITION SCHEME= undefined
##.AVERAGES= 8
##.DIGITISER RES= 18
##SPECTROMETER/DATA SYSTEM= spect
##.PULSE SEQUENCE= zg30
##.SOLVENT NAME= DMSO
##.SHIFT REFERENCE= (INTERNAL, DMSO, 0, 15.7039)
##AUDIT TRAIL= $$ (NUMBER, WHEN, WHO, WHERE, WHAT)
$$ ##TITLE= Audit trail, XWIN-NMR		Version 3.5
$$ ##JCAMPDX= 5.01
$$ ##ORIGIN= Bruker BioSpin GmbH
$$ ##OWNER= she
$$ F:/spectra/data/she/nmr/H-F/1/audita.txt
$$ ##AUDIT TRAIL=  $$ (NUMBER, WHEN, WHO, WHERE, WHAT)
(   1,<2023-09-07 15:29:59.31 +0400>,<she>,<DPX200>,
      <created by zg, POWCHK disabled, PULCHK disabled
       configuration hash MD5:
       00 E9 B6 7A A2 85 ED C7 34 08 36 98 17 FE 4E 26
       data hash MD5: 16K
       AF D3 FF 31 9D 82 A1 1F 7A 61 B4 A8 06 56 06 08>)
$$ ##END=
$$ 
$$ hash MD5
$$ 05 CF 3D 66 BB 0D 61 14 8F 38 62 2B 45 E9 5D 6E
##$RELAX= 
##$RELAX= 
##$RELAX= 
##$RELAX= 
##$RELAX= 
##$RELAX= 
$$ Bruker specific parameters
$$ --------------------------
##$DU= <F:/spectra>
##$EXPNO= 1
##$NAME= <H-F>
##$PROCNO= 1
##$TYPE= <nmr>
##$USER= <she>
##$AMP= (0..31)
100 100 100 100 100 100 100 100 100 100 100 100 100 100 100 100 100 100 
100 100 100 100 100 100 100 100 100 100 100 100 100 100 
##$AQSEQ= 0
##$AQ_mod= 1
##$AUNM= <au_zg>
##$AUTOPOS= <>
##$BF1= 200.13
##$BF2= 200.13
##$BF3= 200.13
##$BF4= 200.13
##$BF5= 200.13
##$BF6= 200.13
##$BF7= 200.13
##$BF8= 200.13
##$BYTORDA= 1
##$CFDGTYP= 0
##$CFRGTYP= 5
##$CHEMSTR= <none>
##$CNST= (0..31)
1 1 145 1 1 1 1 1 1 1 1 1 1 1 1 1 1 1 1 1 1 1 1 1 1 1 1 1 1 1 1 1 
##$CPDPRG= <>
##$CPDPRG1= <>
##$CPDPRG2= <>
##$CPDPRG3= <>
##$CPDPRG4= <mlev>
##$CPDPRG5= <mlev>
##$CPDPRG6= <mlev>
##$CPDPRG7= <mlev>
##$CPDPRG8= <mlev>
##$CPDPRGB= <>
##$CPDPRGT= <>
##$D= (0..31)
0 1.2 0 0 0 0 0 0 0 0.06 0 0.03 0 0 0 0 0.0002 0 0 0 0 0 0 0 0 0 0 0 0 
0 0 0 
##$DATE= 1694086198
##$DBL= (0..7)
120 120 120 120 120 120 120 120 
##$DBP= (0..7)
150 150 150 150 150 150 150 150 
##$DBP07= 0
##$DBPNAM0= <>
##$DBPNAM1= <>
##$DBPNAM2= <>
##$DBPNAM3= <>
##$DBPNAM4= <>
##$DBPNAM5= <>
##$DBPNAM6= <>
##$DBPNAM7= <>
##$DBPOAL= (0..7)
0.5 0.5 0.5 0.5 0.5 0.5 0.5 0.5 
##$DBPOFFS= (0..7)
0 0 0 0 0 0 0 0 
##$DE= 6
##$DECBNUC= <off>
##$DECIM= 32
##$DECNUC= <off>
##$DECSTAT= 4
##$DIGMOD= 1
##$DIGTYP= 9
##$DL= (0..7)
0 120 120 120 120 120 120 120 
##$DP= (0..7)
150 150 150 150 150 150 150 150 
##$DP07= 0
##$DPNAME0= <>
##$DPNAME1= <>
##$DPNAME2= <>
##$DPNAME3= <>
##$DPNAME4= <>
##$DPNAME5= <>
##$DPNAME6= <>
##$DPNAME7= <>
##$DPOAL= (0..7)
0.5 0.5 0.5 0.5 0.5 0.5 0.5 0.5 
##$DPOFFS= (0..7)
0 0 0 0 0 0 0 0 
##$DQDMODE= 0
##$DR= 18
##$DS= 0
##$DSLIST= <SSSSSSSSSSSSSSS>
$$ [...]
##$SUBNAM2= <"">
##$SUBNAM3= <"">
##$SUBNAM4= <"">
##$SUBNAM5= <"">
##$SUBNAM6= <"">
##$SUBNAM7= <"">
##$SUBNAM8= <"">
##$SUBNAM9= <"">
##$SW= 18.05172834244
##$SWIBOX= (0..15)
0 0 2 0 0 0 0 0 0 0 0 0 0 0 0 0 
##$SW_h= 3612.71676300578
##$TD= 16384
##$TD0= 1
##$TE= 0
##$TE2= 300
##$TE3= 300
##$TEG= 300
##$TL= (0..7)
0 120 120 120 120 120 120 120 
##$TP= (0..7)
150 150 150 150 150 150 150 150 
##$TP07= 0
##$TPNAME0= <>
##$TPNAME1= <>
##$TPNAME2= <>
##$TPNAME3= <>
##$TPNAME4= <>
##$TPNAME5= <>
##$TPNAME6= <>
##$TPNAME7= <>
##$TPOAL= (0..7)
0.5 0.5 0.5 0.5 0.5 0.5 0.5 0.5 
##$TPOFFS= (0..7)
0 0 0 0 0 0 0 0 
##$TUNHIN= 0
##$TUNHOUT= 0
##$TUNXOUT= 0
##$USERA1= <user>
##$USERA2= <user>
##$USERA3= <user>
##$USERA4= <user>
##$USERA5= <user>
##$V9= 5
##$VALIST= <valist>
##$VCLIST= <CCCCCCCCCCCCCCC>
##$VD= 0
##$VDLIST= <DDDDDDDDDDDDDDD>
##$VPLIST= <PPPPPPPPPPPPPPP>
##$VTLIST= <TTTTTTTTTTTTTTT>
##$WBST= 1024
##$WBSW= 4
##$XGAIN= (0..3)
0 0 0 0 
##$XL= 0
##$YL= 0
##$YMAX_a= 100659
##$YMIN_a= -189604
##$ZGOPTNS= <>
##$ZL1= 120
##$ZL2= 120
##$ZL3= 120
##$ZL4= 120
##$ABSF1= 10
##$ABSF2= 0
##$ABSG= 5
##$ABSL= 3
##$ALPHA= 0
##$AQORDER= 0
##$ASSFAC= 0
##$ASSFACI= 0
##$ASSFACX= 0
##$ASSWID= 0
##$AUNMP= <proc_1d>
##$AZFE= 0.1
##$AZFW= 0.1
##$BCFW= 1
##$BC_mod= 2
##$BYTORDP= 1
##$COROFFS= 0
##$CY= 11.3945322036743
##$DATMOD= 1
##$DC= 2
##$DFILT= <>
##$DTYPP= 0
##$F1P= 15.7292609196834
##$F2P= 12.9074282941183
##$FCOR= 0.5
##$FTSIZE= 0
##$FT_mod= 4
##$GAMMA= 1
##$GB= 0.15
##$INTBC= 1
##$INTSCL= 1
##$ISEN= 128
##$LB= 0.24
##$LEV0= 0
##$LPBIN= 0
##$MAXI= 10000
##$MC2= 0
##$MEAN= 0
##$ME_mod= 0
##$MI= 1.114404
##$NCOEF= 0
##$NC_proc= 0
##$NLEV= 6
##$NOISF1= 3.799351
##$NOISF2= 2.8
##$NSP= 1
##$NTH_PI= 0
##$NZP= 0
##$OFFSET= 15.70392
##$PC= 1
##$PHC0= -21411.32
##$PHC1= 18.45271
##$PH_mod= 1
##$PKNL= yes
##$PPARMOD= 0
##$PSCAL= 0
##$PSIGN= 0
##$REVERSE= no
##$SF= 200.130013532006
##$SI= 16384
##$SIGF1= 3
##$SIGF2= 2
##$SINO= 400
##$SIOLD= 16384
##$SREGLST= <1H.CDCl3>
##$SSB= 0
##$STSI= 0
##$STSR= 0
##$SW_p= 3612.71676300578
##$SYMM= 0
##$S_DEV= 0
##$TDeff= 0
##$TDoff= 0
##$TI= <>
##$TILT= no
##$TM1= 0
##$TM2= 0
##$TOPLEV= 0
##$USERP1= <user>
##$USERP2= <user>
##$USERP3= <user>
##$USERP4= <user>
##$USERP5= <user>
##$WDW= 1
##$XDIM= 8192
##$YMAX_p= 0
##$YMIN_p= 0
$$ End of Bruker specific parameters
$$ ---------------------------------
##NTUPLES= NMR FID
##VAR_NAME=  TIME,          FID/REAL,        FID/IMAG
##SYMBOL=    X,             R,               I
##VAR_TYPE=  INDEPENDENT,   DEPENDENT,       DEPENDENT
##VAR_FORM=  AFFN,          ASDF,            ASDF
##VAR_DIM=   8192,          8192,            8192
##UNITS=     SECONDS,       ARBITRARY UNITS, ARBITRARY UNITS
##FACTOR=    0.0002768,     1,               1
##FIRST=     0,             0,               0
##LAST=      2.2672688,     0,               0
##MIN=       0,             -189604,         0
##MAX=       2.2672688,     100659,          0
$$ Real data points
##PAGE= N=1
##DATA TABLE= (X++(R..R)), XYDATA
0@%%%%%%%%%%%%%qJ6j6J6j6K4l2L5m3N3o1P2q8J04j20J36j52J76k01K26k58K91
35A54l27L68m13M62n18N78o42P10p85Q72r65J064j172J293j428J572j732J909
53A000k104K326k574K852l172L543l978M501n134N921o939Q311j0270J3314j8758
68a1161L1526j20219q9750J13175J5966L5324L3271M1845l129k3281m3178J0521
80i090K7554l64n586N0070L8075j0847l6657k6282k5553k8265m7694k7714K1857
93h0496L0489r694n595J9786P960k5097k6173j555K6361K4043Q895K6105N3364
106D8393K6782j5702j2096P938j270j8419j3936J3269K6060L85k6303j2236O55
119B3520k7604m7848k0493J0344Q320m647P44K1211K1596j0014k5047N148K4007
$$ y = [0, 0, 0, 0, 0, 0, 0, 0, 0, 0, 0, 0, 0, 0, -8, 8, -8, 8, -8, 16, -16, 19, -24, 29, -32, 40, -48, 56, -64, 72, -80, 96, -105, 121, -137, 154, -173, 195, -218, 244, -274, 304, -338, 372, -413, 459, -506, 558, -614, 679, -749, 823, -909, 1000, -1104, 1222, -1352, 1500, -1672, 1871, -2107, 2394, -2740, 3181, -3758, 4553, -5717, 7597, -11161, 20365, -99854, -189604, -76429, -60463, -25139, 8132, 49977, 46848, 23567, -19611, -9090, 18464, 18100, 12514, 62584, 100659, 89812, 53155, 26873, 1320, -26945, -74639, -102353, -80496, -50007, -59701, -65296, -45510, -37550, -62647, -88820, -90375, -64014, -39971, -31076, -4971, 48393, 75175, 59473, 47377, 55315, 54045, 35626, 21690, 34959, 61019, 61404, 35101, 22865, 23520, -4084, -51932, -72425, -62081, -53761, -58408, -57664, -36453, -14857, -24871, -49918, -44770, -20763]
132b0763L350j538K5964L9389K1195m187j0227L741J822k5113k6008R584J9993
145C7202o624j5130j055r6j7388l4063k6739L688J0863q352K03L1057K3569n960
159h825j0570L065Q607K121n432R906L6261K4464o635k734J1624p547k8766k1870
173C669k674P681j061j1278K388J4355j0491l2676j5936J258l832q013M719K2834
187b9057K7725O280p952O642J1620r303j4151Q135K1914J4992L106J606J0258
200E1815J974k3990k7945n672J492j0484p886Q616J2977n42j6610j4428n69k990
214c4242j4780j983K2876K2918O532M742J1485Q170o040j5560k638J4248Q285
227B4013k843O868J5905J133j8022j8392r166n973j2261j1450N363J6418K653
$$ y = [-20763, -17413, -18951, 7013, 46402, 67597, 63410, 53183, 56924, 58746, 33633, 7625, 17209, 37202, 30578, 15448, 14393, 14297, -3091, -37154, -63893, -60205, -49342, -57694, -57491, -26434, -2865, -8825, -19395, -16330, -7723, -5602, -11034, -1128, 35133, 59597, 52962, 50228, 61852, 54305, 25539, 3669, 995, 8676, 7615, -3663, -1275, 13080, 2589, -30087, -46023, -44765, -48597, -56610, -51891, -29057, -1332, 4948, -3004, 3638, 15258, 5955, -8196, -61, 21853, 36845, 39951, 41557, 51815, 53789, 29799, 1854, -3818, -2326, -12810, -20696, -12080, 897, 355, -16255, -30683, -31252, -34242, -49022, -51005, -28129, -5211, 1321, 6063, 17548, 25718, 19678, 4118, 1480, 15728, 24013, 21170, 28038, 43943, 45076, 27054, 8662, -504, -6477, -18738, -30188, -24825, -8407, -5754]
240e754j0383k812L302o800j3991l899J3503J7832Q814N176J4594J4262n733j5368
254A2743k815N620J2l752M695J3206O504j0975j5913o921o629j7377j3450N102
268b9950J2106M582j576K076N307l057j4139o619R587J1708M759R162J7637J2896
282C4479j531j0661n166k03n548q924K967J2839O092n873p576m345q397j6758
296a8605j5905o69R340M540R57R676J1160o20j0652o407K867N143J222O126J7587
311A5760J6622J899o103k913k427j1196j2511k582P430N800k010j596J801m678
325C296j5896j5218l226K408K33L110J1512J3815M755m236l685J659n36m303K686
340c626J3513J3526M322o29J777j769j1340j4824o663K509J029j942J704O372
$$ y = [-5754, -16137, -18949, -15647, -22447, -36438, -40337, -26834, -9002, -188, 4988, 19582, 33844, 28111, 12743, 9928, 15548, 15560, 11808, 16503, 29709, 36213, 25238, 9325, 2404, -4225, -21602, -35052, -29950, -17844, -13262, -14838, -12762, -7455, -10512, -24651, -31270, -21683, -9975, -5216, 3946, 21583, 34479, 32948, 22287, 17121, 16918, 11370, 2446, 5413, 18252, 24344, 18471, 10895, 6550, -1847, -18605, -34510, -35179, -25839, -21299, -20342, -10666, 494, -126, -10778, -17185, -14318, -9175, -7953, -1827, 15760, 32382, 34281, 28178, 25265, 22838, 11642, -869, -3451, 3979, 9779, 7769, 6173, 7974, 3296, -12600, -27818, -31044, -28636, -28403, -25293, -13781, 34, 4789, 553, -3132, -1473, -2009, -6312, -3626, 9887, 23413, 27735, 27106, 28883, 27114, 15774, 950, -5713, -3204, -2175, -4117, -2413, 3959]
354C959l66j1777j1698l987j487l115Q51J1007J5028P481k63O05L007k859p632
369a246r61R066R099L661L037M151K9r243j4409q734j424l389l361L894P876K114
385A60n268p221l989k698n702j750Q494J4124P801M055N458L554l466p910m992
400F50L338N788J981K980P726L390q192j1459q471o026o514n406J922R691O161
415b441k184k040M30m490p983l526M442R412R266N943P617P954p34r657n654p03
431E652j448r26L392O184N740j429q700p052n433r694r673O08O752N188L986K854
447c999K577n9o431p224J274O321L290N772J1214Q858J419l655n868m413l377
462E699n912k495P008O175j472j900j935n832r347q871m542L197N555K797M682
$$ y = [3959, 3593, -8184, -19882, -23869, -25356, -28471, -27620, -16613, -1585, 5896, 5633, 6238, 9245, 6386, -1246, -2207, 6859, 15958, 19619, 22656, 26807, 26836, 17593, 3184, -5550, -6974, -10363, -13724, -9830, -1954, 160, -5108, -12329, -16318, -19016, -24718, -26468, -17974, -3850, 3951, 8006, 13464, 17018, 13552, 5642, 650, 3988, 9776, 11757, 14737, 22463, 25853, 17661, 6202, -2269, -8295, -14809, -20215, -18293, -8602, -2441, -4625, -6665, -6235, -10725, -18708, -22234, -17792, -8380, 886, 6829, 14446, 22400, 21666, 12009, 6355, 5652, 4204, 3278, 6670, 12854, 18594, 17165, 8465, 1413, -4020, -13714, -23387, -22779, -16027, -10839, -6853, -3999, -1422, -1481, -7912, -15136, -13862, -7541, -4251, 1521, 12735, 21593, 23012, 19357, 13489, 9076, 5699, -213, -2708, 4300, 10475, 9003, 7103, 5168, -664, -10011, -18882, -23424, -20227, -14672, -11875, -7193]
477g193Q319K579m850l625j064K46K043L575O563J0275N737l093l145k155o925
492G287q135l053J200L467L311j358m57N1p538j1038l372P01K38L677P262P641
508a16N724P40m909j147M21l575k19P656P715M225L229j137l678m284r573q434
524g362N0K382m38K637M569j24l636o069p300k659J273l22M497J0842P770J700
540G810J542n90l632l000k716j87O650O266J614K460J579n281q688o730o054k544
556a1501J068J241L804N530P45m722l219k901m501j200L802N435P925P097K509
571A1112J648R0n149n997n62R71J348M078L473J189J75n257q680m787l485m981
587a4814P2N447L955K917K015k546k232j297l723j697N584O466M370O170L991
$$ y = [-7193, 1126, 3705, -1145, -4770, -5834, -5588, -3545, 30, 6593, 16868, 22605, 19512, 16367, 14212, 7287, -848, -3901, -2701, 766, 4077, 2719, 2262, 2313, -5225, -16263, -19635, -18934, -18696, -15019, -7757, -116, 5608, 6348, 1439, 292, 713, -2862, -3081, 4575, 12290, 16515, 19744, 18607, 14929, 10645, 1072, -7362, -7312, -4930, -5368, -2731, 1838, 1714, -1922, -7991, -15291, -17950, -16677, -16999, -12502, -1660, 6110, 7810, 9352, 8762, 5130, 2130, -586, -773, 5877, 12143, 13757, 16217, 17796, 12515, 3827, -2903, -8957, -11501, -10433, -9192, -5388, 142, 887, -3835, -7054, -9955, -14456, -15656, -11854, -6419, 1506, 8603, 11112, 12760, 12850, 7701, 1704, 1142, 2113, 3461, 7539, 11012, 12201, 12376, 7119, -1561, -6348, -9833, -14814, -14742, -9295, -5340, -2423, -408, -2954, -5186, -6483, -10206, -11903, -6319, 147, 4517, 10687, 14678]
602A4678j43j978m816n558j298R01o72K468N134Q2l092l605o403n782l082k171
618a5337N94O035N205J888K139N80l094k754r39n02L974O316M014M229M434j718
634A5064m913m282l996l864m9J073J489M223N55l795l521l887o442l464R83K179
650a2647M767O591L213J750J130k819m055n16N36K094N368N306K834J917r72o072
666H425n385l805m755j573K758K420K009J932j912m197l052m540m012J908L949
681i830M196N871N364J738L1j572l947j997J245P47K957N332L306n92j590m344
697F915o380m726l368k393K365L668J051J297O46l020l858k309k245R69N007M555
713a826M438N899K198j708k072j997k811k80R15J948L720K845j711k987l269n716
$$ y = [14678, 14535, 12557, 7741, 2183, 885, 1786, 1114, 3582, 8716, 8798, 5706, 2101, -4302, -10084, -13166, -15337, -14743, -8708, -3503, -1615, 524, 1104, -1990, -4744, -5683, -6185, -2211, 4105, 8119, 12348, 16782, 15064, 10151, 5869, 1873, -1991, -2040, -967, 522, 4745, 5300, 1505, -2016, -5903, -12345, -15809, -14826, -12647, -7880, -1289, 1924, 3674, 4804, 1985, -2070, -2586, -2050, 44, 5412, 10718, 13552, 15469, 14497, 8425, 3040, -765, -5520, -7093, -4335, -1915, 94, 2026, 114, -4083, -7135, -11675, -15687, -13779, -9830, -5634, 237, 5601, 7339, 7370, 5798, 1851, -146, 1099, 1846, 4803, 10135, 13441, 12849, 11259, 6915, 535, -4191, -7559, -9952, -7587, -3919, -2868, -1571, -925, -3945, -7803, -10112, -12357, -11388, -6381, -1826, 2612, 8511, 10709, 9001, 6929, 4932, 2121, 1841, 2756, 4704, 8424, 11269, 9558, 6571, 3302, -2414]
729b414n753j985q17J827L244K429R54J053j665l914j790K74J440L706N511M690
745F790L957K093k231l223k139k765j975J642J979K380J359r93l834l502n253
760e715n409k121J124K174L133M092K094N27j260k850j984R82J383L086N957M874
776A0087K667M01j544l760l969k837k386P71K266J199P96J45k869m734m352l967
792a2086j580J139K988L730M395L831m1j188j751j245o35J188L151M472M819J704
808A2891o50j507l773n169l595j952J03J503J752R38K18k015m111l666k293j023
824a2349J321L482M507M189L141N92q48j382j475j224J237K675L328K758J076
839A1028o12k303m193m761l704j507J28J201J729J615L61j754l274k796q18l25
$$ y = [-2414, -8167, -10152, -10969, -9142, -5898, -3469, -2515, -1462, -3127, -7041, -8831, -8557, -7117, -3411, 2100, 6790, 10747, 12840, 10609, 7386, 5247, 2482, 507, 2149, 4128, 6508, 7867, 6874, 3040, -462, -5715, -11124, -13245, -12121, -9947, -6814, -2722, -628, -101, -1361, -4211, -6195, -5213, -3830, -744, 5213, 10087, 12754, 13155, 11611, 7851, 3882, 1045, -1341, -570, 1696, 2895, 3691, 3836, 967, -3767, -8119, -12086, -13666, -12527, -9539, -5809, -1414, 2417, 2376, 1188, -563, -1808, -2443, -1255, 1896, 6368, 11187, 12891, 12241, 10734, 6961, 1792, -1803, -3755, -3652, -2149, -397, 541, 759, -1256, -5367, -9033, -11326, -12349, -11028, -7546, -3039, 1150, 4291, 4883, 4035, 2653, 1178, -46, 1191, 3866, 7194, 9952, 11028, 10416, 8113, 3920, -841, -4545, -6052, -5924, -4723, -2994, -1379, -1018, -2772, -6046, -8842, -9660, -9985]
855i985J925L710N142L694K244O56j111j654k255j147P80J970K896J272M56o36
871G957k995m919m391k764j176J44J852K775J915N40j501k096j839q31M5K513
887d771M113M434L465J540N61j610k738l108j181Q40J047J515J752O63j661l489
903A372m401l868k177j088N81L147L621K068O30k85j578j688r40L0K360M538L534
920E856K706J780L94k869l585k827j872m37O71J011J950R54j895l408k869l232
936g672k309o16J870K932L977K420P52N03l26k236j734J420K090K597L036K252
952H956J253m42l324l988k262k160j405P48J509J223L01q75k905k192k097k354
968a0014M35L079L024L079K848J641k19n07k304j162J617J367J476K307K670l83
$$ y = [-9985, -8060, -4350, 792, 4486, 6730, 7386, 6275, 4621, 2366, 1219, 1999, 3969, 6865, 8137, 8593, 7957, 4962, 43, -4348, -7112, -8288, -8144, -6292, -3517, -1602, -1062, -2563, -4659, -6498, -7329, -7284, -4771, -658, 3776, 7241, 8781, 9342, 7732, 4994, 1886, 705, 1545, 2592, 4107, 5859, 6522, 4861, 1372, -3029, -6897, -9074, -10162, -9581, -6434, -2813, -745, -115, -400, -1978, -3666, -4606, -4576, -2216, 2322, 5856, 8562, 10342, 10736, 7867, 4282, 1455, -417, -854, -183, 828, 2778, 3732, 1837, -1571, -4440, -7672, -9981, -10597, -8727, -5795, -1818, 602, 1354, 1857, 1531, -705, -2439, -1019, 1071, 3668, 6704, 8956, 10209, 9767, 6443, 2455, 193, -1967, -3372, -2624, -1115, 108, 409, -466, -3371, -5563, -7660, -10014, -9579, -6500, -3476, -397, 2451, 4092, 3873, 3366, 1062, -100, 1517, 2884, 4360, 6667, 9337, 8954]
984H954k002k513l875l001j896j322R51K540P83l43k50j206k973j523q59O44L714
1001d177L224K748L219K349j482j609j466j032l75J416J407J822K119q35l195
1016D133j920l365l903k221L1R08K035J858K44N74n30l026j720Q70J404J938L857
1033A167L422K468J551j406k096j302j379j906R12K142J174N99n62k542k575l142
1049c475l849j742J243J279J384K568J779l51m97j492j232N72J685J401L063M574
1065F910J443J48n77k050k231k127j434l98K399P22q66L66j122l661l194j887
1081g559j520O33K439J302K733K772l85q95q6r49n67K033K131K330L200J167p77
1098H002r72j759l499k403l33k3L68J357k29m84j118k942k794p24o57K16K722
$$ y = [8954, 6952, 4439, 564, -2437, -4333, -5655, -4704, -2164, -1381, -1724, -1974, -3180, -6153, -7676, -8535, -7891, -4177, -953, 1795, 5014, 7363, 5881, 4272, 2806, 1774, 1399, 2815, 4222, 6044, 8163, 7328, 4133, 2213, -1152, -5055, -7276, -7245, -6337, -4302, -2444, -2200, -1626, -2156, -5182, -6902, -6032, -4628, -2690, 1167, 4589, 7057, 8608, 7202, 5106, 3804, 2425, 519, 1431, 3573, 4747, 5346, 4784, 2242, -333, -3475, -7324, -9066, -7823, -6544, -5160, -2592, -813, -1164, -1661, -3153, -4385, -3813, -2128, -727, 2336, 6910, 8353, 8501, 7924, 5874, 3643, 1516, 82, -316, 2083, 2805, 1939, 2305, 1183, -2478, -5672, -7559, -9079, -8446, -6007, -4705, -1972, 800, 415, -480, -566, -1515, -2082, -49, 2082, 4412, 7612, 8779, 8002, 7030, 5271, 1772, -631, -964, -987, -619, 738, 509, 25, -1093, -4035, -6829, -7553, -8210, -7994, -5272]
1115e272L021K223K160O21j359p3o06r91J021K977J981J322J192o74j940k268
1131C335l307k651m23J46k9J484J491j250j231j580k540q95L41O37K436M130K331
1148B425J069R49n76j370q91o23J80K613J725M65P14J54k636l521k256k654j093
1165e326O74L45J326K120j48j560r27j259j766R26J431K359L245K883O68L12J25
1182E428k054j646j91o3O89K011L59J95o1k491l617j923j703j528Q70J677J063
1199b985J310P97p97j153m38q78q1K448K455K044K596P26Mp69j650j972p74L79
1217A262Q6Q64J326m08j353j422l001k375q59p23K62K488K085P64R04j08j164
1234a372p14n48J68K063K791J630J756J268q24j758j613j759j388l91R34M09J318
$$ y = [-5272, -2251, -28, 2132, 2753, 1394, 1321, 715, -276, 745, 3722, 5703, 7025, 8217, 7543, 5603, 3335, 28, -2623, -3046, -2900, -2929, -1445, 46, -1204, -2435, -4015, -6555, -7450, -7109, -6472, -4036, 94, 2425, 3494, 4443, 3867, 2497, 1606, 983, 1163, 3776, 5501, 5966, 6680, 6834, 4198, 677, -1579, -4233, -5326, -4652, -4307, -2981, -861, -1009, -2569, -3496, -4755, -6521, -5595, -4164, -1805, 1440, 4323, 4991, 5303, 5428, 3374, 1728, 1537, 1474, 2163, 4174, 4533, 4728, 4667, 2176, -1441, -3364, -5067, -6595, -5725, -4048, -2985, -1675, -878, -1675, -2828, -3266, -4144, -4225, -1777, 678, 2722, 5318, 6044, 6048, 5279, 3629, 1657, 883, 1262, 1348, 2212, 3538, 3130, 1777, 355, -2646, -5021, -5880, -6603, -6341, -3853, -1768, -1004, -100, -208, -1372, -2086, -2634, -2466, -403, 2388, 4018, 5774, 7042, 6218, 4460, 2847, 1088, -300, -691, 243, 652, 1970]
1251A970J23j641j997j520k240j452K83J237K140K488Q44Q09L66r58j448k60Q33
1268d23R38K025K060J206P92p43k260k112j541j651o00Q26J054P64K61j050j527
1285a981j316j889j392J060J831J516J991K007R41k63j023j214l32P26Q6J254
1301B002K300J183j83r84j689k171j979j415l03O90J112Q58L01m42r98j384j238
1318d340o68P52J750J949J507J916P96l45j211p55r19Q5O65R30J535Q31q01r36
1336B741j375j936k154p42m54J205R86P19M71J31j067j475q97L13N56J374K157
1353E53K166J411L05j002j046p56j088l23L46J235J089K03k26j306j491k071j602
1370c603p64L05J045J069J028Q54N9q94j119o66O3P52J154K204J875J419m47r00
$$ y = [1970, 2093, 452, -1545, -3065, -5305, -6757, -6474, -5237, -3097, -609, 235, 1044, 1410, 452, -996, -1256, -423, 515, 2540, 4600, 5806, 6598, 5855, 3595, 1483, -58, -1709, -2309, -1483, -429, 335, 596, -454, -1981, -3297, -5186, -6578, -5518, -3687, -2171, -180, 1827, 2768, 2505, 1482, 268, -64, 662, 748, 2002, 4302, 5485, 5302, 4318, 2629, 458, -1521, -2936, -3239, -2549, -1437, -579, -278, -720, -1718, -3102, -4340, -5008, -4256, -2506, -557, 950, 2866, 3662, 3317, 2106, 1351, 432, 517, 1182, 2112, 3647, 4478, 3677, 2741, 1366, -570, -2724, -3466, -3920, -2715, -1729, -1010, -539, -408, -1475, -2950, -3847, -3534, -2978, -1604, 553, 2719, 4130, 4435, 3433, 2387, 1631, 543, 220, 566, 1801, 2890, 3093, 2867, 1561, 70, -2001, -3603, -4367, -4062, -3017, -1948, -920, -66, -7, -901, -2020, -2686, -2623, -1871, -717, 1487, 3362, 4781, 4334, 3434]
1388C434n13j886j319l85O61Q93R76K07n26q57j278k159j740q2O03O50J468J564
1406b89J337l00o95p54l15k50J21J555J971J645N89L7q75j202j993j425l54O89
1424e08J15P23O46j70q98j500j360j539J14J54J185J967J850O21k03k22p03q15
1442e43qJ87J336J803R37L92J6q61j939j278j559j49L66L49M96Q17l8j102j158
1461a936j305m32m20O10J648J828J415N15O6k05o04j294j08O73Q18J004J155J93
1479C621j90j357j776j593o57p39J42Q47J001O45J5r55j005o58q07k24J328J791
1497e71J418J254Q14N03j156j053j078m01J012M20M84J289L21o35j388j860j397
1514b024q05j93l36J570J496J59j78n1q76r07l53j8J102J683J169J306Q25L94
$$ y = [3434, 2921, 1035, -284, -669, -8, 885, 1861, 2068, 1542, 685, -593, -2752, -4492, -4574, -3971, -3321, -1853, -289, 1048, 748, 53, -701, -1016, -1266, -1145, 410, 2381, 4026, 4615, 4652, 3777, 2575, 582, -843, -1197, -508, -393, 330, 976, 806, -92, -1592, -2952, -4491, -4377, -4223, -3038, -1071, 779, 1400, 1197, 975, 272, -543, -551, -364, 972, 2775, 3712, 4104, 4120, 3259, 1320, 42, -1517, -1666, -1300, -951, -455, 362, 324, -778, -1936, -3241, -3673, -4093, -3483, -1835, -7, 1408, 1923, 1989, 1784, 1180, -114, -222, 451, 1269, 2273, 3428, 3621, 3431, 2074, 298, -1295, -1952, -2691, -2549, -1702, -701, -56, -41, -996, -2001, -2659, -3466, -3690, -2362, -571, 847, 2101, 2915, 3418, 2262, 1209, 131, -270, 742, 1162, 1646, 2935, 3256, 2621, 1233, -627, -2024, -2829, -3022, -3358, -1788, -292, -133, -311, -362, -1238, -2145, -2498, -2516, -1414, 269, 1438, 2744, 3569, 3963]
1532C963j701j104o99p32L18K80O26Q74Q13j404j091j131r63j423j82O88R84J530
1550c54K73K70K72n95j524oO46N52Q13J508J234M38l36j277q02p13q20n20Q80
1569f1P69M70P3n84j146o47j488j032L25J129Q52J019J132M38m88q25n62j38M88
1588b76J87Q41J455J254l18m89j102j137j203m64k38P50R92M0K85K0j142j830
1606b375j64o33M80J150R37J201J261L63j038o03k01r82q7J016Q54P18P76L2p83
1625A922p10j717j247j64J19L72R09Q60j57J23o79j515m00J78k12P33J875J001
1643A291M02R45o98o08o39q29m11P81P71M79M66N05r92j081j218j208l72J23O01
1662a692O76J165J51l55j68n80r87k51M97P97J621Q61M86J83J63j295j286j11
$$ y = [3963, 2262, 1158, 459, -273, 45, 325, 951, 1825, 2638, 1234, 143, -988, -1951, -3374, -3556, -2868, -1884, -354, -81, 189, 461, -134, -1658, -1664, -1018, -466, 347, 1855, 3089, 3527, 3191, 1914, 1112, 399, -421, -941, -61, 708, 1178, 1251, 667, -479, -1126, -2614, -3646, -3321, -2192, -1340, -321, 811, 1249, 761, -64, -626, -764, -276, -89, 752, 2207, 3461, 3143, 2654, 1552, 415, -788, -1252, -1490, -740, 252, 292, 577, 597, -545, -2375, -2539, -3172, -2692, -1542, -605, 596, 1857, 2220, 1182, 579, 378, -604, -691, 325, 1179, 1897, 2673, 2705, 1922, 1212, -505, -1752, -1916, -1797, -1425, -516, 344, 187, 310, -369, -1884, -2284, -2106, -2318, -1585, 290, 1291, 1693, 2638, 1940, 1332, 693, -136, -547, 234, 1005, 1484, 1950, 2455, 1463, 382, -836, -2044, -2416, -2293, -1692, -1016, 149, 300, -55, -223, -803, -1790, -2041, -1544, -747, 874, 1735, 2221, 2404, 2567, 1272, -14, -125]
1680a25k33J11O28P22M85M33j399j283p47n00o80K18J007O63M08Q08m31O9o08
1699d54r92j28J043P05N97R69R21m39j48r58j139J60o66q9M33J399k94l92l8q86
1719c96j072q85l66K76J389M29N22R50L39j117l69n99K22K21O96O90J209O67p09
1738B097p11k43r56j008k78K46R67L98O0m30K25q44j863l92M19K68M70J311R39
1757F75P55K3j045o21M98m67m90P25J761N43On3p67m33j469j230J54O92J25J96
1777d22O34O11q07o95j297k27L33j2L44J480J515r6l64N9l52p16l66K71P79J068
1797A740n2k1N88m75j707j286l47K17J04l29P48R95J85j106o46K91k08q98M69
1816a738J426J344L53k4K61J61p40j430K4R07K14J02M68N66k12r72j771k72l3
$$ y = [-125, -358, -247, 381, 1103, 1588, 2021, 622, -661, -1408, -1908, -2588, -2370, -1363, -700, -292, 516, 85, 154, -454, -1446, -1574, -531, 174, 771, 1740, 2661, 2222, 2074, 1116, -23, 137, -529, -618, -185, 1214, 920, 528, 490, -396, -1468, -2353, -2719, -2443, -1054, -625, -103, 847, 1186, 69, -300, -899, -677, -456, 240, 930, 2139, 2806, 2097, 1386, 1143, 187, -821, -1099, -853, 114, 512, 572, 142, 367, -477, -2340, -2732, -2313, -2045, -1575, -264, 675, 1430, 1453, 408, -213, 285, -182, -672, 53, 1814, 2357, 2363, 2310, 1543, 1110, -359, -1589, -1435, -743, -618, -422, 212, 823, 16, -679, -1976, -2203, -1870, -1882, -1538, -58, 1457, 1361, 997, 1056, 704, -12, -378, -107, 672, 1740, 1688, 1667, 2255, 1780, 73, -1213, -1560, -1343, -1239, -1568, -820, 175, 360, -746, -1392, -1101, -1309, -2207, -1738, -312, 1032, 1385, 1361, 1622, 1783, 1043, -387, -363, 544, 758, 860, 1328, 1894, 1682, 710, -1061, -1333, -1366]
1835a366l90m27P07J466J07k28n52J06l45r27QR17J679L62K54P11N74p94j546
1854C16n44N53K11m84J33J188M84j155j162m02k58q75p06O10J522Q41o82K96N83
1873D69m66j049m99O03R29O02r2J122J019l97j209o10Q0l56q20j28J136R71n59
1892G46r15r8J09j163j323K61J243N45l20Q85J009j10r69r02M72R15n38K86J205
1911A338J095R5j121m97K7p00j043m41R43P54l47m14L54Q3j157j133j83R51K57
1930a139O0N09J324Q30r80o85K31N20q78J74R32J001L25o47m61K37r18j300n71
1949a436L77R01m46j19P38K78j000r63l40P30L46m16M99J553R14n73l10J60Lo56
1969B40n93N99J278j7k41NL09p46j547q95J55M63l36k40J155R22n10j078l56P09
$$ y = [-1366, -1756, -2183, -1476, -10, 97, -131, -683, -577, -922, -1849, -1841, -924, 755, 1117, 1371, 2082, 2656, 1862, 316, -228, 325, 536, 52, 185, 1373, 1857, 702, -460, -862, -1120, -1995, -2701, -2091, -569, 272, -410, -114, 469, 3, -1046, -1545, -942, -13, 589, 497, 1619, 2638, 2241, 1032, 422, 502, 146, -674, -802, 334, 1305, 746, -169, -267, -158, -1321, -2644, -2383, -1140, -595, -915, -30, 979, 869, -100, -1002, -530, 385, -153, 133, 1338, 2433, 2528, 1407, 910, 937, 237, -806, -1247, -304, 450, 103, -311, 43, 126, -1031, -2164, -2347, -1396, -1139, -1079, -570, 754, 1584, 604, -81, 150, 670, -208, -34, 898, 1899, 2224, 1577, 1116, 1353, 435, -865, -1436, -1059, -158, -604, -723, 15, 293, -707, -1670, -2010, -1280, -934, -1350, -851, 702, 1616, 1043, 733, 893, 896, 240, -353, 246, 1524, 1507, 1266, 1271, 1580, 834, -713, -1608, -1453, -990, -1326, -1566, -411, 511, 1, -1077, -1433, -724]
1989g24o03j84P34J336R55J31k99M72j4j148j064N12P24k48o4L56M09m27j140
2008b86j375L19J35p17k25J332R74P3m56q3J21k58p04J35J555O85J4L07O67M2
2028B255p75j377k62L79J01n02J20Q84l42r22n96k46k58o48j68J098J166J7k83
2047c59Q11K65l31q46L2P26O73J27K62Q92L78j039j090l22o3q39r8L20P92k6p49
2068d84p31K19k90n96m24P05P88L44N09M98M93J42r19j68P01J94l80L73R62P4
2088B010l50j115m02j17n92r34j9R09j57J22P2p7l76o57m19O76N43L68J32J159
2108G76N48J09l64k42j1j16l9k22Q80O46p10p69J90m93j142m96j9n5L17j9M89
2129g42L50K62q87o53P13K98k64Q57P93R23K92m22k92L10o54r35L82Q06j12l38
$$ y = [-724, -1327, -1511, -777, 559, 1514, 1645, 1346, 1818, 1804, 656, -408, 104, 828, 580, 516, 872, 1281, 854, -286, -1661, -1342, -1207, -1924, -2149, -817, 157, 230, -226, -309, -188, -446, -1150, -1015, 540, 1225, 1239, 1546, 2213, 2255, 1480, 103, -159, 220, 321, -181, -61, 823, 481, -441, -1037, -1283, -1541, -2189, -2357, -1259, -93, -76, -359, 452, 717, 386, -460, -428, 298, 971, 1098, 1360, 2252, 2630, 1591, 501, 179, 116, -723, -821, -501, 291, 265, -484, -1215, -996, -1286, -1882, -2306, -1601, -813, -469, 40, 538, 1031, 1173, 254, 86, 787, 981, 601, 974, 1936, 2010, 1660, 545, 143, 26, -566, -1500, -1519, -610, -767, -645, -573, -650, -1026, -1683, -2102, -1426, -883, -515, -383, 776, 1324, 1433, 1069, 827, 816, 700, 661, 439, 1319, 1965, 1255, 486, 676, 183, -959, -1455, -1474, -1529, -1212, -1231, -742, -392, -130, -1017, -1670, -957, -659, -923, -66, 727, 1650, 1942, 1520, 1228, 1538, 884, -51, 331, 1137, 1025, 687]
2149F87O1j65n86p87o99m59M46m93J69J000N21j67L93l97M4Q8K0R7P22R05R1Q9
2171A580K59k11o37o79m53J60K33k18r4L74r4q97n29k07k58L8J30J09J017L21
2191e6j19J0N32l72j57K58L39N60N35j3OL87n64q00l83j6r07j73M82L30L4k93
2213c80m06k36%n50l54N86Q89M08N52j46J84K11l66n77O00M74k64L83N96N7m54
2234A207o98n57j02m96l59N9O85K19m31j96K79m33m60q9R0N91O23L63K55P60m93
2255H17l04MJ28n3J7o5M66N58m81n80j26l22p35n75L3M64l7K96j19M03o6k97n16
2278a090P6N01J2L81Q96J31J57j70l56J07j32p32J69M28O21o60q1K96m08l96p89
2299a039l25M58L70m30O68M35km01q7l07L41K25k28N19P44K29l8k68K4M0j075
$$ y = [687, 748, 583, -3, -790, -1489, -1948, -1502, -1995, -1826, -826, -305, -472, -79, -476, -432, -344, -324, -227, 495, 1400, 1491, 1580, 1839, 1628, 991, 312, -141, 19, 252, 34, -60, 314, 220, -677, -1206, -1413, -1671, -1633, -1503, -1394, -377, -56, -175, -165, 367, -5, -162, 96, 435, 995, 1530, 1517, 1523, 1910, 1346, 546, 163, 147, -760, -933, -451, -121, -87, -380, -786, -1022, -1022, -1572, -1926, -1340, -451, -43, 509, 363, 547, 758, 392, -185, 415, 889, 625, 1008, 1604, 1661, 1207, 509, -48, -150, -646, -1005, -946, -261, -42, -473, -669, -390, -823, -1283, -1372, -1282, -691, -68, 295, 550, 1310, 817, 513, 517, 645, 592, 609, 544, 1010, 1568, 1087, 507, 381, 59, -676, -1251, -1218, -754, -791, -495, -614, -211, -277, -574, -1090, -1014, -513, -501, -120, 776, 907, 1064, 894, 538, 645, 513, -219, -50, 378, 999, 339, 258, 554, 146, -250, -1039, -1364, -906, -536, -966, -298, 137, 135, -266, -353, -660, -319, -94, -322, 197, 941, 1170, 1132, 864, 888, 928, -147]
2320a47J73l0M14q7j98N9q4n32l63l25M38m13J93L36M48L43K1n11J63P4l24P2
2342b80K85O60M56L7m2O7n07l20o05O6K66q7k76N03ml5r34J91k83j64k00R5J149
2365C8J95r3R1k15J48l15l5j9P50M3K5J31K27k62k72n01L9j7m74J74K5L13J0r6
2389i0l55M1k43m01M0Q56L32L01O1l21M31k88k25l42L60R9J4K19M93L8p58j98
2411F4j77M6m84k17K65J20N48j48m83Q6k08n73L47K42L93M15J08J95K91k36l70
2432B24j68J2J64k00K43K66L00m48j33l94j51l25k1K81R0J42R3j85K46j7o14o1
2454f56k9L78L32N8K41N70n1k92j68l02J21j68p5L20J19qJ3r0m15m36n01K09K13
2477f17M36l69M88L18k64L1l23l11J44J99K78L28J90J20K9l90K33m03l55K86P2
$$ y = [-147, 26, -4, 410, 323, 125, 184, 100, -432, -795, -1120, -682, -1095, -902, -566, -118, 225, 246, -265, -102, -28, -352, -280, 5, 665, 1121, 1158, 1116, 1183, 676, 356, -249, -183, 83, -4, -280, 223, 219, 184, -750, -559, -842, -1006, -1206, -1111, 38, 233, 140, 231, 16, 164, -151, -186, -205, 545, 588, 613, 744, 971, 709, 437, -64, -25, -42, -516, -342, -317, -4, 6, -90, -445, -404, -647, -1048, -1008, -152, 180, 481, 542, 221, 652, 364, 139, -203, 157, 256, 270, 489, 982, 1020, 262, 64, -113, -67, -551, -768, -503, -383, 165, 17, -466, -380, -588, -1161, -814, -572, -179, 236, 344, 539, 830, 594, 224, 56, 68, 232, 32, 275, 541, 841, 393, 260, -134, -285, -610, -631, -350, -260, -118, -25, -210, 36, 19, -595, -656, -685, -307, 25, 83, 324, 894, 843, 551, 383, 81, 202, 34, -41, 279, 398, 390, 403, 313, -102, -538, -1039, -830, -617, -181, -550, -62, 256, -8, 23, -300, -611, -467, -268, 10, 338, 528, 648, 677, 287, 520, 117, -238, 48, 120]
2498A20L38j07o8k4J66n70l60k96J7M82R4J5K39R7k63k56O0M1j26K53J04P8Q25
2521H59k60o2j92mn12L01m08L38J51k08K03K4j91l06l22J65m7r7K66P2L45O7j43
2544C9j79K7K02l63K39P2L59M25j40k43L5k40l19l93L75K09p2L2J70j96J38l09
2566a32o88P4L04j95K93M07J47L25k02k48k49K62k54J54M69J07R6j51J19l13o44
2587c19J75m46M06Qk20N29k72M32k77n16Lq7q0K28K86K69K21RJ66j49l07l65J71
2610a35K41P7J14M42j63nj05p37K29k54J5r0J26K39MJ09j38l77L30j38k42K24
2632b34J93M55q4J16o7k04M9m34n8M51l31M28Qj40l1N7k74l78J72k16K39L4L99
2655A50j22m5J61j09j82p1j89M28J99L8J25J20K22m33L9l72J26j31J19J71K70
$$ y = [120, 458, 351, 283, 259, 425, -145, -505, -801, -784, -302, -208, -193, 46, 143, -120, -376, -316, -275, -401, -148, -44, 34, 859, 599, 537, 345, 341, -171, 130, -278, 60, 211, 3, 206, 230, 39, -267, -589, -424, -471, -568, -302, -230, 115, 182, 39, -140, -113, 89, -274, -35, 37, 396, 821, 681, 438, 473, 233, -86, -479, -104, 105, 33, 65, 235, 39, 177, -132, -820, -746, -442, -637, -344, 63, 210, 535, 333, 85, -164, 98, -156, -2, 467, 574, 670, 519, 638, 325, -319, -144, -590, -184, -176, -396, 133, -139, 293, 16, -500, -497, -584, -664, -436, -150, 119, 340, 349, 515, 366, 59, -306, -135, 106, 183, 297, 739, 576, 571, 466, -271, -42, -296, -281, -371, -245, -6, -2, 107, -31, -408, -78, -216, -458, -234, -41, 414, 330, 446, 379, 175, 224, -210, -268, 183, -148, 280, 288, 148, 117, 174, -100, -478, -306, -522, -283, -249, 150, 28, -17, 144, 35, -147, -218, -407, 21, 220, 258, 383, 503, 725, 292, 331, -41, 85, -46, 73, 244, 514]
2676E14K2p50L3n0k18J36j67R2L35J36R1j42K39j47n03K11q4K71K54m1M51m05
2698B78L17n75L8k12k17K3L44k02l2M68k92r5k04O1k97K46L15m3K42O5j89L89
2720D28m74j11p2M06j30J68J85L41k36j61k80j49k72Q1L7M0K73l03K86o7L1r4
2742g3p2m03J04O60m88M82J04K36m12k3j47j41J30j21qK35J94j87J07k64k77K05
2764a59k73q1J6L26J66M9J15l50L7J9l49M51p4L58P2J43j03j86o4P2r6J15l07
2787a03K1N2K32j80m9m6j88k97K09K0K37N4j6j67K77M54p04k2j02N5Q5M21jK51
2811D93r0j36k16J02l1l37P6n7R8M4L8P5l49j48k22J54J44K74m1K23j08p5K01
2834A12qj21Q0j02K88j2K13K50l41J68l43l05j01k60J95K74m32N76j94J49j96
$$ y = [514, 536, -214, -181, -231, -449, -313, -480, -388, -53, 83, 174, 32, 271, 124, -379, -168, -252, 19, 273, 232, 683, 278, 595, 20, 58, -154, -371, -348, -4, -206, -238, 230, -62, -157, -361, -300, -597, -351, -36, -79, 163, 228, 39, 428, -46, -157, -229, 177, 47, 215, 400, 741, 505, 344, 64, -85, -357, -276, -239, -199, 74, -229, 57, -10, 21, -73, -145, -548, -444, 216, -272, 210, 314, 550, 138, 115, -32, -173, -43, -164, -172, 63, 257, 70, 177, -87, -364, -159, -432, -513, -497, -171, -5, 44, 159, -191, -154, -135, -484, -33, -107, 251, 323, 466, 363, 177, 113, 185, 89, 204, -103, -82, -30, 202, 22, -27, -73, -261, -558, -349, -329, -92, -38, -54, -221, 56, 510, -194, -216, -318, -263, -178, 243, 242, 493, 403, 267, 51, 153, 122, -215, -139, -196, -98, -54, -16, 59, -290, -438, -660, -506, -362, -88, -129, 94, -14, -89, 112, 104, -17, 63, -39, 249, 237, 450, 700, 359, 527, 184, -121, -222, -482, -287, -13, -445, 131, -63, 86, -110]
2855a10j90m2R6j70P8L38K54K53j59l8j29j63j12j6J64M3L4N48n11Qr3l17j23
2878c57R4K12k53K61j48M6K08k41j81K01j82Q1L93P9RK58p5j30J20j39l07R1K20
2901B60j01J72K04k89R9p15o1j53N27l12QJ35L10O5l30M5J67j85J70lJ30M07p7
2924D73J03k45k39L99n24J30J44j77J45r7J27k29j64j30k96L41j67J65k13M50
2944dM06k05k86L7K21l00J14M34k69L06qQ8n7p7l35m27N51k28r7M1J29k0m5l01
2968c32j75K27l63J62NL12J02o4J47J68N0k05j89J02L48l07M83K4k19J7k08l14
2990b29J34k93K48j21p0J98J64N6n85K23o9j34J69K38J23J1L93J29k77K44l36
3011B16k75J72P1j81%M84l04J40l79l18J44k12Pj00M25O7j94J70J26m88R0Q0m8
$$ y = [-110, -300, -342, -246, -416, -338, 0, 254, 507, 348, 310, 181, 18, -94, -110, 54, 97, 131, 679, 168, 176, 83, -234, -357, -263, -51, -304, -43, -191, -145, 63, -178, -359, -158, -340, -259, 134, 213, 222, 480, 405, 275, 395, 256, -51, 40, 260, 159, 331, 535, 246, 345, -370, -431, -584, -57, -369, -361, -226, 84, 149, -181, -136, 31, -154, 16, 13, 143, 550, 473, 576, 331, 92, 491, -33, 97, 241, 64, 209, 112, 239, 10, -154, -284, -580, -239, -406, -241, -454, -4, 402, 197, -89, -52, 169, -131, -17, 417, 148, 454, 446, 534, 477, 400, 65, -362, 189, -39, -136, -95, 34, 14, -31, -332, -507, -280, -643, -481, -476, -164, -62, -126, 21, 189, 239, 34, -155, -53, 295, -12, 471, 495, 276, 293, 85, -229, -95, -388, -140, -261, -331, -133, 31, 87, -498, -275, -344, -478, -309, -71, 52, 63, 456, 585, 308, 552, 216, -59, 113, 184, 3, 3, 487, 183, 323, -56, -374, -230, -442, -435, -535, -110, -43, -237, -67, 59, -429, -339, -259, -307]
3034c07M74J59J05OJ00rm89L31k77J23j08o6J86q4j29J32k32k23k26J34nQ0L0
3057b95J40k03M37q8mk49K46J76p9L52o6K26Q2k71l29M0k04J16m06L95m4K95l67
3080a00j46R8j09k09J03O7J44m5K2L53k42o1K15r6j78L22N1j22L40j00N6O0k81
3103A42j94J8j30j89Q1J80l6Rp9k12Ko1j10K93J69j11J67L20l0J4M2j15l5L4k6
3128A43J21J90k5j26k05L23k54m12r3K55j05J05j28J40j00n9j41J19o2J07J57
3149e0j06L71Q8J61k99K14p8Mk3j43L81j43J15m82k34K73n67L0l4K14k6J25j2
3172b21l6L55m77p1K10o3K93J87R2j04QK29r9j39J25j70o5K04J3NJk75k34Q4L6
3197a12K1k07J50j39J24J29J29l79K36r8J78n7k79M91R8L20j53J12J8k95l62J04
$$ y = [-307, 167, 326, 431, 437, 537, 528, 39, 370, 93, 216, 108, 42, 228, 144, 15, 147, -85, -308, -534, -400, -405, -325, -295, -155, -358, 79, -9, -13, -262, -16, 160, 81, 433, 367, 593, 675, 404, 75, 115, -89, 27, -379, 16, -28, 267, -100, -246, -148, -257, -466, -363, -296, -152, -197, -175, 178, -64, -125, 90, -6, -184, 138, 189, 67, 407, 307, 363, 423, 142, -52, -34, -164, -353, -272, -92, -128, -119, -198, -410, -408, -469, -579, -286, -117, -228, -61, 259, 229, 243, 285, 170, 135, 169, 143, 264, 454, 429, 303, 98, 421, 167, -245, -338, -83, -188, -83, -211, -71, -171, -230, -371, -252, -314, -207, -50, -156, 215, 303, 464, 165, 379, 301, 305, 282, 139, 520, 377, 492, 10, -224, 49, -518, -488, -522, -308, -334, -209, -221, -257, 98, -379, -450, -240, -303, -10, 177, 269, 165, 173, 402, 303, 164, 289, 119, 54, 258, 271, 276, 277, 2, -232, -148, -112, -91, -298, -148, -287, -163, -34, 95, -284, -48, -146, 32, -25, -304, 187, 285, 605, 452, 564, 582, 287, -75, 29]
3219B9J91j35Q1k3j30j36O0l32L8j11N3j1J81j24N85j99k3mO1K48l40K62Q9k16
3243I4M49o0l54K32j01l34J69l3k93k03N49k82J31j3l05j18J40q2j0K76J39pR6
3266H0m1k17M06r2j24j2J22J52J38n9J65m54J46j79J66l57m1j13J98j42j10K17
3288a51k68k0K38k34J88J63N43j94r1J75j40j91J04K9j3J53J26q2J52m56n1N2
3310C2K1kk40j96K31K42j92pP9L6j98j26J76J7J15L90k41J67k02J87k20J52m97
3333b76K96J42J14j13J6k88o0j6R9p1k50K48j05K87j88K85k84J93l33J42K33j23
3355e2m4M03o9K01j47Oj3l13r5j03L11Q6j24L8k65O9j27J0N6%j16K17J77q7R1
3380A10m9m2l1K01l37K85R5O9n3M9L8j7l81P3r0K83m72K77j11L09l43j37j40L09
$$ y = [29, 220, 85, 166, 143, 13, -123, -63, -395, -357, -468, -415, -426, -245, -369, 216, 17, -6, -10, 51, 299, -41, 221, 310, 94, 543, 483, 129, 361, 260, -74, 95, 62, -231, -434, 115, -167, -36, -49, -354, -472, -332, -414, -424, -148, -9, -16, 80, 39, -178, 228, 136, 12, 0, 122, 274, 412, 353, 518, 64, 210, 31, 197, -160, -201, -314, -116, -258, -368, -151, -419, -439, -201, -435, -247, -84, 459, 265, 174, 349, 209, 18, 122, 151, 138, 291, 417, 335, 487, 31, -20, 32, 53, 51, -189, -385, -154, 88, -104, -111, -32, 4, -194, -320, -144, -127, -12, 378, 137, 304, 102, 289, 69, 221, -276, 20, 162, 276, 163, 179, -109, -169, -185, -86, -157, -407, -159, -264, 23, -165, 120, -164, 29, -304, -162, 71, -52, -96, 307, 238, 439, 292, 298, 285, -28, -123, -226, 85, 171, 47, 85, -180, -111, -238, -228, -172, -172, -288, -71, 106, 19, 110, 61, 19, -12, 189, -148, 137, 232, 301, 248, 297, 335, 318, -63, 10, -80, 203, -269, 8, -103, 206, -137, -274, -414, -105]
3404a05j39r3k8R6J86K57J17l61K9J9K31j21J97j8J08p6o5J09k25J47m13j65M53
3427A40O5j83q3J20j57q6p2J08j57K97m8K07j80L72l45k9M38l04K55j70j15L96
3449D69m16N8P9J61k39l14K33l38K85M8Q6k43J39O7j88j21j4K32k26J18Q9J17
3471H2Qk68K46J14l9j52o2N9J36j5N2m8n9q9j27R5j43j42K64j87K84J20k95L07
3495A41kl08p6L09n2O5j17J52j74L49j00M4k52j26L97k58M5k4k66L29k50R0j50
3518b34j42L44j72L49k95J76j09n6J21k11L90k42K28R1q9M9M9q3J0j02q8Kk9N1
3542HJ39k20o0L67j77j75n6m8K43k31L53N7R7l39J39k19r0L98j2q6n9M2J37J83
3566C91l42J93j01l65L44j64r7J68j80J84j78j0l22L83Qk13J18J48K28k98L66
$$ y = [-105, -244, -337, -365, -269, -83, 174, 291, -70, -41, -22, 209, 88, 285, 267, 375, 299, 234, 343, 118, 265, -148, -313, 140, 205, 22, -61, 59, -98, -184, -256, -148, -305, -8, -56, 151, -29, 343, -2, -31, 407, 103, 358, 188, 73, 469, 53, 111, 190, 351, 112, -202, 31, -307, -22, 26, 112, -131, 8, 75, -113, -234, -248, -16, -242, -124, -35, 82, 90, -178, 68, 182, 143, -9, -71, -12, 124, 109, 161, 113, 54, -35, -162, -67, -210, -352, -88, -275, 9, 129, -166, 141, 139, -169, -245, 64, 12, 77, -40, 112, -62, 287, 187, 231, -21, -147, 250, -8, 37, 13, -253, 76, -174, -84, -234, -376, -32, -204, 145, -150, 26, -83, -139, -18, -229, 161, -81, 147, 238, 149, 198, 247, 164, 174, 72, -16, -14, -43, 8, 147, -73, -133, 234, 57, -118, -174, -222, 21, -210, 143, 200, 297, -42, 97, -122, -212, 186, 174, 88, 29, 71, 208, 391, 49, 242, 141, -224, 120, -44, -141, 27, -153, 31, -147, -157, -479, -96, -88, -301, -183, -35, 193, -105, 261]
3587B61j36j32q9J52L09l34k5J34j2R4r7j27k3k08J27k9j61K74K37k5p6l00j10
3610b96l7J14L19k00P7K00n8pJ84l49J0m3Q3P2J3l0OL34m24k69K82j25j61j04
3634d09K99mJ69j41R7j35j29K75l52O39m14m3J84J81m9j8k71n4J68n1L61l53R
3657d1L3J58o4K7j75j2l53L72j43J99J2j27J46k62J10k8K40q6J7k05J80j07J91
3680H2k22J64l6K6J3j31K53l6P1m63K60j83n8J50k3M6l1M8J77j61K22k65J00K8
3704C1j5J50J1l14J69K44j35q5J2N9j38j38J64r5OK03k84M41m19j4N5k06L17j42
3728a23K54N3j19J40j70J3L4j55j43L81j55K28j93J0K71k99Kk44J49K67j46k02
3750a47j0K65j94j11l7Q3m1J49L00n77M92jp0J79J78p54L14pJ07p0k3K26k48j30
$$ y = [261, 125, -7, -96, 56, 365, 31, 6, 140, 128, 222, 125, -2, -25, -233, -106, -135, -296, -22, 215, 190, 114, -186, -296, -333, -219, 100, -100, -23, 177, 119, 112, 296, -53, -43, -86, -3, 69, 82, 52, 58, 392, -32, -301, -19, -144, -305, -409, -110, -114, 55, -86, 11, -124, -253, 22, -330, 309, -105, -148, 36, 217, 168, 150, -121, -175, -7, -58, 303, -50, -41, -8, 150, 86, 113, -62, -74, -427, -55, -198, 1, 13, -114, 32, -230, -120, -148, 92, 6, 23, -182, -2, -109, 82, -140, 24, -12, 14, 27, -104, 149, 113, 184, -279, -19, -202, -260, -110, -133, -87, -118, -70, 107, -54, 168, -97, 3, 31, 16, 166, 177, -137, 32, 276, 141, 56, 68, 127, -11, -149, 15, -80, -74, 129, -155, 286, -133, -147, -92, -298, 19, -123, 131, 184, 65, 205, 35, 48, 82, -73, -216, 165, 10, 238, 45, 55, 326, 27, 29, -215, -66, 201, 55, -147, -157, 108, -86, -197, -234, -151, -192, -43, 257, -320, 172, 171, 101, 280, 458, -296, 18, 11, 118, 48, 25, 251, 3, -127]
3774a27Q3j64K29lOq5M3k6n3P4J00j06j13J50k7J94J3J20l83K71j09pnJJ02P0
3800B48k41J32n0k87L01k08j0J29j68J14J81K84n93K75k19K37l9n3nJ54M8N5r3
3823A92o4P1n2j71j68Q5jJ06J05Q8m74K2k7K79j01N5j07J03J10k79J53K57m2k45
3847a05K08k65L5P1J86m7j37P7m1r1j59K91J14k31j37M00r5R4k72K10k77qrJ25
3871f3J21o9r1K09J22j23J1o2Jk28L52j61p4Q1O1N3j58r6J42j54M1k3L15j13n0
3896D4K38n01J47K8J63p8p3L13l62L06l53L33j58j86K02n9j91N79m35K08jK34
3918C98m27J5N5n8K14j54J59j58J83m3l32P7Q2O4j02o3j88O09k69J61k56J82l1
3941A18j2l78J33K38K3j75L15j72l55N6J15L04k56P9J88l41J28Q0k64K21j15J06
$$ y = [-127, -44, -208, 21, 18, 24, -61, -18, -44, -97, -23, 77, -29, -142, 8, -19, 175, 188, 308, -75, 196, 87, 80, 75, 76, 178, 248, 7, 139, 89, -198, 103, -105, -115, 14, -154, -40, 141, 425, -168, 107, -112, 125, 86, 33, 28, 182, 230, 285, 192, 128, 199, 147, -24, -192, -107, -108, -2, 103, 191, -283, -261, -288, -9, -110, -55, -162, -59, 51, -228, -75, 182, 140, -105, 103, -162, -127, -56, 130, 83, -54, 23, -18, -109, -268, 23, 137, -94, -231, 169, 74, 168, -104, 106, -171, -179, -188, -63, 58, -11, -102, 107, 229, 106, 117, 55, 56, -172, 180, 19, -55, 26, 87, 140, -18, -114, 28, -126, -85, -108, 207, 94, 44, 282, -219, -72, -44, 119, 41, -32, 281, -81, 225, -128, 205, 47, -139, 63, 4, -187, 392, -43, 165, 164, 398, -29, -14, 41, -17, 197, 43, 202, 44, 227, 184, -148, -71, 11, 75, -27, -90, -278, 331, 62, 223, -33, 149, 118, 106, -272, -139, 99, 122, -53, 262, 90, -265, -209, -94, 210, -46, 33, 221, -120, 8, 88, -176, 45, -70, 36]
3963C6M3n9N7P7l60M70m19P5K02j45J3o2q0J14J91L5l44Q0k17K95k37P0J12q7
3987a40M7M9jo2N2L07l35o4l0K02N1j34n6M6K0K00j6j82J73l8j62J67r0o0J18
4012F2J94l60K7J50R7n6k63K37J33O7k94k23K17O2q0K23j43J88j39j89q4l2O5
4035a41r4K05o1m3J85j80J10k00K40l7j11K5J59j06j63K39J81j25q5j14O1j84
4057b39M36j41j10k75L26L2j88N5R4l13J88J51n6j06L41q0k23M2r6j23K54l2J40
4080G7K54n20J64J29k56J71j55J27mN9N7p6k68K47K5Q8j24k35L19j72o2j3M0L53
4104B25l87j17L43q3N9K71j17o5K38l78J69n8k35K93k55J29j37K3K9J03j20J67
4126I7j55K01j60j65M38j98Ok5j20K11j90O01n95J23M9N9K07m50L9K58o42L95
$$ y = [36, 79, 20, 77, 154, -206, 264, -155, -80, 122, -23, -10, -72, -152, -38, 153, 188, -156, -76, -293, 2, -235, -165, -53, -140, -93, -44, -45, -107, -55, 252, -83, -147, -177, 25, 76, -58, -114, -68, -48, 152, 136, -46, 127, 89, -73, 94, 4, -56, 62, 256, -104, -77, 73, 170, 114, -149, 88, 221, 288, -6, -229, -12, 50, -30, 193, 50, 238, 99, -90, -174, -206, -141, -235, -30, -91, -134, 51, -129, -19, -219, 21, -16, -127, -102, 57, -49, -212, 27, 208, 83, -2, -116, -55, -239, 197, 56, -54, -329, -3, 29, -159, -104, -10, -323, -135, 16, -40, -146, 195, 115, -108, -66, -162, -285, -31, -63, 77, 331, -189, -25, 104, -152, 19, -136, -9, -13, 46, 103, 27, -241, 6, 31, 119, -5, -240, 79, -93, -155, -168, -128, 225, -162, -279, 64, -19, 40, 311, 194, 129, 367, -11, 158, 100, -135, 158, -97, 32, -105, -82, -53, 50, -70, 97, -58, 143, -17, -182, 256, 58, 64, 39, -81, 130, -60, 541, -54, 69, 118, 177, 384, -66, -27, 231, -411, -16]
4148a6j4p9K79k59J67J07m77K75j89L0R3k43L82j09Q7m63L02J87j87K4K07q8m1
4171b5J19J4j3M9M1l4k59j4J17k31J46Q0r9J15k53n5L56k3o0j11O6J7j41J39K45
4196A86j03m0J23j31k59L05j21R0j32J34k3j97K88m01L75m22K49O4k43J97K1K45
4218B05l41O8L7m0j4J41J53j89K04k1j10L5l0J10p8k04r6J62J69j89l61K52L9
4241i8m7J07k9n1j12K54K3j43j18L18n5j50k3L18j35l2k55K57O9J78n04K16K16
4264B04L8J2l94L48l98J8L0N9P0q1L1O3NQ5j64j31L68O6k78l9K43oJ17k67K53
4289B52p4j08k20J83k1j6N8m8k1P6j38n6LK4J21j79J14n5O1Q9m06M06O1J67m29
4314a56K94K69l97q9J46P8oj84M4J55J8k75n0J24k10L29k15j46L3J69p1O8q2J64
$$ y = [-16, -30, -109, 170, -89, 78, 185, -292, -17, -206, -176, -83, -326, 56, -53, 34, -429, -127, 60, -127, -103, 104, 16, -25, 94, 108, 95, 144, 185, 151, -108, -122, -5, -236, -90, -10, -109, 6, -247, -302, 54, 31, -29, -140, -74, -57, -198, -59, 186, 83, 43, 166, 35, -224, 81, -40, 50, -82, 52, 29, -168, 120, -281, 94, -328, -79, -15, -258, -61, -40, 205, -136, -68, -31, -71, -85, 56, 209, 20, 224, 203, 93, 128, 98, 208, 130, -74, -170, -8, 161, -28, -389, -137, -98, -145, -38, -67, -118, -230, 24, 47, -96, -214, 104, 49, -101, -124, 194, 59, 27, -228, 29, 98, 276, -228, -12, 204, 242, 254, -140, 208, -190, -172, -142, -83, -13, -94, -63, 0, 5, 90, -74, -205, 163, 229, -49, -88, 155, 149, 266, -1, 252, 178, 70, -150, 33, 12, -4, 54, 6, -15, 61, -77, -133, -130, -106, 15, -164, -50, -105, -44, 45, -361, 45, 106, 273, -156, 138, 407, 10, -79, 67, 145, 139, -45, -1, 154, 172, -103, -153, -29, -239, 90, -125, -271, -238, -69, -140, -72, -154, 10]
4338A0K04m98K65J9j1j19L19j95J52n8j74J79j42J87k35M00n0k80m3pO3n2J08
4361D2k83J48J7p0j9NL03j21J37j59j33J56J17q9j21J25j31M3J5K48j59n2j08
4384h9R9r7JrJ58j12J24R0q1k1o3Q0o6r7L6J78m4j1n0K75l64J5J39p9j03J5Q2
4411Fq7L8J58j53j2K93m00N8L79j76L7r0pP7k89R7j8J62j55M8J89j82R4J79l21
4436g5J35J05l4k4k91M35k69q6J31l6K64k82L3K20l24MOl9J93j13J62q8N2r2j03
4461a16K34o1Lj48P0p6Q8q5L22j54k70K22j81j0J81l72K48Q9Nl8L8j04J91k19
4485a43J95L4o3J5r2M5L5K05k87J03n7K14l19K47j08qK2Q2j19j40K58j63Q4r7
4509e7m2Qoj68K23J56k52K56n5K12j14J14j69M6k79K76k03N6k1k19N62k60n1k20
$$ y = [10, 214, -284, -19, 0, -11, -130, 189, -6, 146, 88, -86, 93, -49, 138, -97, 303, 253, -27, -70, -77, -14, -66, 42, -241, -93, -76, -146, -165, -160, 143, 22, 159, 0, -133, 23, 140, 51, -70, 55, -76, -33, -18, 230, 71, 19, -89, 10, -87, -86, -95, 63, -49, 75, 165, 84, 63, 0, 80, 14, -83, -47, 131, 87, 76, 26, 301, -63, -48, 91, 12, -91, -76, 6, -81, -43, 115, -38, -50, 243, -157, -99, 280, 104, 141, 51, 44, 121, -168, -71, -89, 73, -82, -34, 155, -27, 67, 246, -75, 60, 165, 131, 107, -184, 251, -18, -104, 27, -9, 255, -27, 6, 226, -98, -94, -88, -127, 66, -47, 115, 27, 79, -13, -116, 118, 57, 60, -88, -18, -94, -6, -91, 231, 77, -193, 29, -152, -162, 19, -353, -105, -16, -11, -49, -11, -115, 76, -143, 52, 86, 23, 38, -54, -9, 26, 231, -56, 47, -10, 204, -115, 132, 24, 16, 38, 120, 1, -139, 119, -44, 40, -57, -99, -91, -97, -265, -42, 114, -138, 118, 63, 275, 161, 275, 106, 152, -127, 149, -54, 2, -19, -238, 324, 64, 13, -207]
4533b07J51p2J62n4n2k6K3j70m0L62j51J11k5j87K79j13K33l21l9J57ln4l1M3
4557b4K6j14R9j65L52j23K06k95K75j46p3q5J27j09J76l0l06L53r8L7L2K8m40
4580b97K18k8J33o4J00J85m68J81q6k41M93p1J1j34J64m00M71j29nm1L4j29J50
4603D7k19L13j97J2J42l01N25j69l21Q8L14p9k27l9J05k68J55N1l5J60P4Q8Jj21
4627I9j13k2K7j19K7j61K31J8MM8j50J06nM5p5j02J40j64K06P6k0j73Q7m8m3J82
4653A01j03L17k30j94J25j5J15j95J97k90O2K04q8J71k21J38j35j65J54j30J66
4674a6O3P0j85P2q0J76j21M5O9o2N4R1K39n10K87q5j02O1k17R0J7K46j40j10O0
4699A2j74K34j69J13j20o6J22Q2L5j87K56k24K79k14o9m3K04l0p3J3K12J2q8k25
$$ y = [-207, -56, -128, 34, -20, -72, -98, -75, -245, -285, 77, -74, 37, 12, -175, 104, -9, 224, -97, -136, 21, 18, -36, -67, -24, 2, -112, -13, -178, 174, 51, 257, -38, 237, 91, 18, -67, 60, -49, 127, 97, -209, 144, 46, 83, 115, 143, -297, -79, -107, 26, -38, 62, 247, -221, -40, -126, -367, 126, 55, 66, -68, 96, -304, 167, 38, 33, -8, 26, -103, 47, -172, 141, -56, -44, 98, -203, 322, 153, -168, -80, 234, 155, -72, -111, -6, -274, -119, -68, -103, 57, 131, 219, 220, 99, -14, -36, -9, -128, -101, -262, -31, -13, -9, 39, -111, -5, -10, 35, -40, -142, -2, -166, 40, 116, 96, -77, 10, -38, -81, 101, -2, 315, 85, -109, 16, 1, 116, -79, 118, -172, -110, 94, 6, 177, -44, 94, -41, -206, -52, -182, -16, 47, 117, -68, 4, -76, 100, -21, 24, 93, 31, 85, 176, 415, -95, 192, 107, 5, 66, -151, -61, -44, 202, 62, -48, 12, -162, 72, -97, 16, -104, -170, -48, 34, 69, -118, 138, -86, 193, -21, -90, -133, 71, 41, -32, -19, 193, 205, 117, -108]
4723a08O9k2P3P1j17K28j55J72l74K72k32K18P3Kk06J22m1l15K33r8qL09k56J39
4747D9j20J13j63K14J0k70r7J25k7J74j35N9P1m9j06j7J86o5J22K0k68J50j19
4770a43K49N7k74K46k43l3J00q0R2J31j27Q3k57K34MJ30k95J12O9l18L23k03L19
4793A76k87J45k22J01P8ql4J35j01J4P6j08J38j74Q2j41p4L08j8j87P2N4j63l7
4817a75L84k80R9J38n4K59k38n7j36k93K18K20Nj84j04J31O0l19M15j94J16pm5
4840d1j6J92l70L10O3J18l19J3J61kj57k9j11L07j07j35L22l79K23l71J57M12
4862B41m64J55N0L08l58r3J3J45J76k43K61n44N00k24J41j0j87K76k69J72J85
4883B31l31J98q7k8L7Q3k84K62l8n4J0j49J38O6j99J69J99k37K57l41K6M31l14
$$ y = [-108, -39, -61, 12, 83, -34, 194, 39, 211, -163, 109, -123, 95, 168, 170, -36, 86, 45, -270, -37, -135, -143, 166, -90, 49, -71, 42, -121, 93, 103, -167, -264, -139, -166, 8, -127, -68, 3, -46, -152, -169, 17, -48, 74, 94, -174, -24, -143, 106, 163, -111, 135, -108, -141, -41, -121, -29, 102, -25, 58, -199, 35, 39, 169, -126, -14, 55, -263, 60, -143, 176, -111, 34, -188, -87, -9, -17, -51, 84, -17, -3, 73, -35, 103, -71, 11, -130, -204, 104, 86, -101, -29, 25, -138, -175, 209, -71, 28, 166, 112, 371, 133, 76, -60, -353, -135, 85, 90, -94, -198, -67, -7, -326, 89, -105, 11, 4, -41, -57, 135, -235, 75, 138, 256, -63, -50, 111, 109, -48, -77, -188, 119, 12, -123, 199, -180, 43, -328, -171, 241, -223, -68, -18, 290, -68, -161, -148, -3, 173, -70, 191, -353, 147, -77, 64, 54, -133, 143, -126, 46, 231, -100, 98, 11, -17, 20, 103, -181, 81, 43, -11, -1, -150, -12, 54, -145, 24, 223, -14, 243, -98, -72, 359, 45]
4906D5l48J11N62n03L39j17m10L20j56J89j72J82k23Q6K6l0J07R7q7J79l46M5
4928a04M07m30K11L2j7L0j28j03L76l21L08k83J96p8k33K20K16n88J68J56M6O
4950H7j88j34M1J00K15j7k38K41j33o1K83m55j1M63l31K10j15J57p1n2j93R0K36
4973A24j05n8Q8k52L85l18L5N7P0K3r7n1K38q4L4l2K16k63M01j12k37j35Q4q1
4997g0L20l43jJ92k96J10P4j9L4j36K44m7J28k84r5K9K58n7j18k13J07K89k32
5020a26K60k3j06j48K72l03N0J66r2L29k79l9k4Q7k06L12j5j97O1K45l02K3j14
5043a69mJ04J17J07p9j4k11J99r7M7L6j76MQ2K13k09o4R7J6p1J25R5j67k8K33
5068A86j94m1j5O5j06J23r4J55p3n0R1m2r4l0M13m61M86l75M3j40l2K81r5l8p0
$$ y = [45, -303, -192, 370, -133, 206, 89, -321, -1, -157, 32, -140, 42, -181, -95, -69, -99, 8, 105, 18, 197, -149, -104, 303, -127, 84, 116, 99, 129, 1, -102, 274, -47, 261, -22, 174, 96, -137, 83, 299, -289, -121, 35, 81, 87, -101, -235, -194, -94, 121, 104, -134, 107, -26, -87, 196, -259, -270, 193, -138, 72, -43, 114, 43, -9, -202, -112, 124, 19, -39, 49, -203, 182, -136, -101, -44, 26, 49, -48, -99, 139, 55, 89, 57, 273, 10, 411, 299, 62, -73, 11, -70, 250, -93, -94, 98, -198, -88, -14, -33, 1, -135, 109, 62, 190, -94, -189, -160, 98, 41, -77, -290, -183, 106, -126, 134, 111, 5, -143, 129, -174, -124, 42, -50, 279, 0, -39, -63, 24, -182, 130, 115, -82, -21, 224, -78, -55, -169, -173, -69, 48, 155, 76, 62, -149, 50, -47, 0, 36, -140, -136, -54, 159, -50, -114, -17, -1, -72, 53, 148, -19, -47, 186, -8, -49, -64, 1, -105, 18, -76, 79, 6, -44, 47, 5, -89, -119, 294, -167, 319, -56, -13, -153, -185, 96, 1, -37, -107]
5093a07O1K96r5l00Q6K56J2j67l9k13M01j25q1J58l03K30j14K22r1k20J09K00
5115A76m34K18N6k19K86j46K26M1l98R5j41O9mK33j71J84k12K52j24L9J4n1J48
5138A37j39m7J25J30J4j95o3j50L7K20k45L56k0r2o2J18n4J30k32j25Q9P1j67
5161a64L16k06r8K58j37J6j32mO1M6J93j83LJ00p5K9n5j21K39j87O2J38l40jM
5186b38p1L52K04k99J22r7J44R7k40K16l50P9n7J82K9n5J38m02K65P3j40K54j84
5209B2m9J27k32n0L23k04l09K13J07j29L21j45r6K98j84q6J79l09M34j43j94K13
5231A07j33k8J03l3l8j48K81m40L56n9Q7j97N0K81r2k5p4q5J7L66l99N7J19m8
5255B5J99j50k01k8k4K25j41K29m5k11m6J40j05J4L59l26O7QJ0k16J53O8J30Q5
$$ y = [-107, -46, 250, 155, -145, -59, 197, 209, 42, 3, -210, 191, 66, -15, 143, -160, 70, -44, 178, 87, -133, -24, 176, -258, -40, 16, -203, 83, -63, 163, 204, -194, -99, -240, -171, -175, 58, -113, 71, -141, 111, -13, 26, 40, -11, 137, -2, -49, 76, 206, 220, 25, -38, -188, -151, 69, -176, 180, 160, 68, 6, 124, 70, 200, -32, -157, -68, 3, -164, 152, -54, -152, 106, -31, -15, -147, -151, -90, -44, 149, -34, -31, 69, -6, 23, -32, -153, 86, -101, -39, 99, -241, -242, -238, -309, 43, 247, -52, 70, -27, 117, 214, -26, 190, -160, -81, -138, 44, 73, 18, 156, -246, 19, 92, -48, 206, 22, -27, 100, -132, -182, 141, -63, -372, -159, -52, -181, 140, -5, -101, 197, 13, -73, 106, -203, 231, 88, -106, 107, -26, -54, 49, 16, -22, -170, 111, -329, 27, -32, 55, -142, -92, 189, 97, 72, -2, -87, -70, 296, -103, -46, 73, 25, 224, 74, -127, -155, -179, 46, -95, 134, 89, -122, -168, -28, -133, -119, 240, -86, -19, -11, -1, -217, -64, 4, 134, 219]
5279B19l92N8J56j63j73J69J54J93k1j90R7l14K10j04j38L00j49j6M6n6MK24j93
5302g9J88j31MrO7Lj74Q5j16l7J80J18L3k56R9J15m71M60Q5J06k33j13r6J88m9
5327c3K23k4l08K74p3J2MM8j16q2KM7K47j12l59K06J53o4k05N9j00n3K38j82J45
5352e3l0n5R6P4j2J42oj88J23k19J37N6m6j07L91k62o5j49M1K57o4l22K86pp3
5377e5j38J24J48m05M17j26J8J3J21q0O9j74j01J58K23m2j77L1k10L16l8j40L32
5400B84k19j21K59j86j52J10R0J62k61n7j27K58R1J83m31J01N0Q2j40R2O2K5K9
5423A84k62L3J47j01q7J00R9k16p5J51J23k8K2k10M45m89J4L78m24J89N4K10j22
5446A35k23q9P5m5J68j09j52L99j80j02K53j29J25lk24L14j41Q6j99Qj04J98k12
$$ y = [219, -173, -115, 41, -122, -295, -126, 28, 221, 200, 10, 107, -207, 3, -101, -239, 61, -88, -104, -58, -114, -110, 114, -79, 109, -22, -18, -27, 40, 43, -131, -46, -162, -199, -19, 99, 132, -124, -25, 90, -381, 79, 164, 270, 37, -76, -172, 16, -33, 190, 166, -142, 132, 59, 71, 75, 123, 7, -75, -73, -26, 221, 109, -250, -44, 109, 45, -160, -101, -201, -254, -16, -198, -53, -83, -138, -42, 32, 20, 162, 156, -32, 91, -128, 9, 65, 19, -88, 303, 41, -24, -173, -132, 125, 61, -261, 25, 18, -55, -193, -69, 79, -326, 91, -35, -17, -4, 117, 37, 106, -68, -169, -11, 212, 170, -7, 24, -186, 130, 92, -48, 284, 65, -56, 203, 17, -135, -25, 65, 227, -34, -91, -218, 40, 131, 314, -117, -16, 34, 116, -24, 68, 130, 155, 184, -78, -45, 102, 1, -86, 14, 113, -103, -178, -27, 96, 68, 90, -120, 325, -164, -150, 228, -196, -7, 47, 257, 135, -88, -177, -102, -147, 21, -88, -240, 159, -21, -123, 130, 1, 126, 123, -101, 213, 72, 158, -41, -33, -137, 61, -151]
5469a51Q3j37N1J40M3M4m3p2J5J8L3n8m3Q5P4rP6k31L02j47k32J0L96m20K65k09
5495a17J55K11j76j70MK18r0k99M57l4r9n6j2J49J3Lq5k22L78N9l15K16j2j59
5519A7J52P6k88K7J52j4j04q8J52k29J18J08Lj43J09j41K17j27J08j34J43l14
5541b00J59J04j64J07k3K37l63K81k00K0J24qm5P3j76q0J74k22L47k10M9j15J93
5564F2j56K20j96l0R3mj4m8K37l7k92L56k44J83j81K93m92J47K98j09J16k75J04
5587C1J56l40j7J26j99L40J0m9J18l47J36R0O5k79J41J5LJ96m9q3j3k87N9J84
5611GL16k43k39j70K37J2L48m95m2L11j21N3p6O1P4P4k63L46r9n3j00M5J25k18
5635a10j6K02J74k68K4qk02L43n8j51M71n01K08k74N1J67m2L1n7J72n53M18O0
$$ y = [-151, -68, -205, -154, -14, 29, 73, 30, -42, -27, -9, 24, -34, -77, 8, 82, 73, 149, -82, 220, 73, -159, -149, 247, -173, 92, -117, 38, 249, 73, -97, -93, 125, 35, -264, 193, 159, 60, 4, -8, 141, 154, 157, 72, -150, 228, 287, -28, 188, 176, 17, 169, 245, -43, -16, 136, 122, 18, -70, 82, -147, -29, 79, 82, -61, 48, -93, 124, -3, 105, -29, 114, -200, -41, 63, -101, 6, -17, 220, -143, 138, -62, -42, 82, 74, 29, 102, -74, -154, 20, -202, 145, -65, -16, -131, 62, -94, 126, -70, -100, -7, -11, -25, -73, 164, 127, -165, 191, -53, 130, -51, 242, -250, -103, 195, 86, 202, -73, 31, 187, -153, -170, -44, -243, 97, 107, 58, 176, -171, -35, 55, 120, -159, -18, -3, 0, 196, 147, 64, 51, -236, -177, 7, 323, 80, -159, -329, -92, -80, 268, -227, -269, 42, -79, -26, -102, -41, 33, 107, -156, 190, 91, 38, -62, -17, 108, -110, -126, 76, 250, -18, 6, -2, -204, 139, 81, -70, 401, -100, 108, -166, -115, 52, 10, 41, -16, 156, -397, 21, 81]
5658H1N0l3k16j56K03J09j87L49l31j9J78m5o2J93r5L06j47k35l1%K01q7j53K74
5682A47k65N4j1J4Q3J81m19J8L14l00N1J32L4L1k39K13j26J97k60L80k97K01l26
5705a93K29O7N1r1k5K45r1j51qP2p0k11J38k21J56K95L5j21j83J02q9J75M0k35
5729h4l2L14m41K21Q8j30r1J45j07J66k23J26J41j07O6nK0M80o73k1J67o6Q7j29
5753h8n2M76k47j19OJ42j73L7k8K6j6nM7k26J61J80j06l4k56M03j11J20k86q3
5777b32M1J86O2n8K72q4j32j8J2J45J47j82j7k44J75K5o8J5k7M4j6j13J86j49
5801c0k66L34k2K0Jj78J10q0o2L73j57M8J2j32m7L01k49J76k73K12l70K62J9j39
5825a37J35N8K14j88j59J25R4J72q9j79o0K76n34J03M66k88J17k0j06J23q6k37
$$ y = [81, 131, 98, -118, -274, -71, 38, -149, 200, -131, -150, 28, -17, -79, 114, 19, 325, 178, -57, -88, -88, 113, 26, -127, 147, -118, -64, -75, -61, 22, 203, -216, -198, 116, -184, -133, -1, 33, 64, -175, 38, -88, 109, -151, 229, -68, 133, -193, 36, 103, 154, 63, 38, 283, 192, 41, 33, 105, 35, -176, -38, -259, -103, 192, 227, 106, -77, 25, -64, 111, 151, -84, -116, 198, -243, -22, 66, -64, -155, -10, -117, 49, -174, -48, 93, -14, 52, 47, 67, 547, -126, -147, 20, -46, 41, -88, -140, 336, 89, -30, -24, 118, -55, -18, -46, -20, -36, -41, 6, -220, -59, 121, 15, -19, -275, 128, 17, 137, -149, -232, -191, -5, 57, -1, 271, 187, 55, 37, 49, 194, 341, 159, 142, -102, 73, 98, 30, 45, 18, 62, 46, -67, 119, -30, -296, 38, 16, 36, 37, -141, -31, -111, -173, 200, 43, 91, 103, -29, -76, 225, -24, 152, -121, 91, -279, -17, 2, -137, -2, 56, 270, 82, -77, 48, 142, 314, 225, 46, -14, 262, -272, -169, 297, 9, 126, 106, 0, 123, 37, -200]
5847b00K87o7m6J8l4M3Q9P8m7O9j79K5l07K66J88j38j53M7Rk1N0n6J49R7n86L78
5873d1Kp8m9K02j4j05p2K54m3Q5k31J8L9R9J6N5k76L53l69j07N05k67L5J03q8
5898B6n2L9l64K48K26j24L6j34PJ25m25K15J85k9R5j74M2m00M75J53k25j00K46
5921I1l3l07J28J92k59K49j52J14L8J24j59j28R0l2J81nk31Q3P6l67M47j72P7
5944D5K17k33k87L94n3k75jJ18J40P3lk1r4k69K46O7J9j17pmk2J48oM7j88L7L3
5971DJ76pj65J17k95J56jK33k34O0p9J61n1J16l98L2K41k3N7K46n37J80MJ49j1
5996A31j36R8j61R8k6K9j36K13m9j54L20l04l04N43k38J59N9j47M5r2O8J04p3
6019D7k95L43o9q2M7L2N6LP4j29J28m40L66j74K96j40r8m7J80q8j17K10j35q4
$$ y = [-200, 87, 20, -26, -8, -42, 1, 90, 168, 121, 190, 11, 36, -271, -5, 183, 45, -108, -61, -52, -73, -23, -79, 70, 167, -419, -41, -39, -117, -166, 36, 22, -83, -155, 99, 56, 141, -90, -72, -33, 66, 82, 137, -139, 214, -155, -262, 243, -24, 11, 114, 26, -26, 13, -351, -103, 123, -1, 35, -99, -92, 33, -392, -177, 8, -21, 74, -100, -58, -458, 17, 170, -55, -155, 91, 58, -249, -121, 71, -188, 61, -91, 23, 61, 185, 26, -102, -12, -44, 137, 132, -99, -16, 60, -307, 140, -32, 45, 262, 29, -258, 136, 83, -192, -193, -75, 65, 138, 135, 114, 20, -249, -3, 64, 83, -34, -41, -45, -67, 81, 75, 122, -66, -29, 4, 180, 173, 8, 125, -170, -14, -15, 218, -16, 44, -35, 126, 75, 191, -207, -175, 66, 43, 100, 346, -191, -11, -7, 142, 131, -5, 93, -68, 30, 4, 33, -103, 110, 61, -93, 227, -77, -381, 162, -76, 83, 142, -5, 40, -52, 16, 120, 47, -248, 95, 26, -56, -9, 23, 79, 82, 156, 27, 155, -285, 81, -93, 203, 63, -35, -82, 98, 10, -107, 103, -32, -116]
6043a16L15j95J49j18j07j17M5M2J39L9p3l4j7j4J55l78L17K8j36J56j25j93K07
6066c1r5j64K75J38j02L3J49M7j10l34K47j51K57k47J43j00k91M32p3m5R8K0r4
6089BO8j19k41M10l11L60j01m2q3J13k2O2k78K28j35K21j61J7K13Q8k66p7k7j63
6113b44K76RK47k72l14L62k82N18l28l7K46n2k47j36J53J5J02K6O0m7q4j40L04
6136A35k76L58j65K33m0k11qJ05k83KL26n0l22J35K30n0p8n0J51j70Qj42K48q5
6160AK5j09N6J98j01J8j35N5P2k24L22l3j78P7o4q7J10j61L29k44J62m7J83L7
6184B62m85J81J25j81J2Q7J28j02j15J41K07l39q3K98N0j8j51q1L03k21j32K03
6206H9k45J12j4QJ09r7j75J29J68k64P3J18j1P9M6j91l0J71j23j44Q2N7J38j61
$$ y = [-116, 199, 4, 153, 35, -72, -189, -144, -102, 37, 76, 3, -31, -48, -62, 93, -285, 32, 60, -76, 80, -45, -238, -31, -126, -290, -15, 123, 21, 54, 203, 250, 140, -194, 53, -98, 159, -88, 55, -45, -336, 96, 23, -22, 76, 96, 2, 70, -49, -290, 120, -191, 169, 68, 26, -57, 56, 34, 96, -182, 46, -89, 132, -29, -12, 201, 289, 23, -54, -81, -244, 32, 41, 288, 16, -298, 64, -218, 300, -28, -65, 181, 129, -118, -254, -101, -86, 16, 42, 102, 55, -29, -169, 135, -141, 217, 52, 285, 245, 34, 26, 131, -152, -150, 176, 126, -196, -61, 169, 119, 41, -9, 142, -28, -20, -162, 86, 1, 26, -83, -27, 171, 70, 88, -47, 8, 80, -144, 178, 145, -33, 44, -20, -107, 3, -158, 171, -73, 89, 42, 225, 262, -223, -42, 83, -98, -86, 1, 129, 27, -88, 53, 260, -79, -162, 136, 186, 168, 17, -64, 239, 18, -114, 89, -156, -44, -58, -50, 59, -38, -213, -84, 84, -180, -107, 11, 0, 79, 125, -66, -96, 75, -48, -192, -110, -53, 85, -76]
6230g6J4J00M4R8kk69k8J67M3o7J84l47K33r4j38N1R0KR9k73K37p4J70l35J69
6255bmJ6j56L41k81J62N3j14J48k63qR3J44j87J39Rl55j6N99l64LN3j43m7K87
6280A07l55K89k22K64l5J65l75QJ92O8R4p0N3m44K52JL9j71P7K01r2o1J17j23
6304b1q7j01J23J2J24j32J95k43J87O4j66j8k0K57j20M6j08k1J38l63L57J31p5
6327A59k94J98j7r9l23K74PJ4r2M9Q8Q8o3p8R7L8p7NM4q1R6k65K77k9o8n1K6L83
6355C06l85N8o3J79l0k13N1JQ5j82L68j69l6n8N2o5r8J01r1Q3J02P4n2k98K43
6380c7L23l73J61O7j76J79l01L57l25J59k7R8j36L95k46k49J8K80j71J07j52J92
6402A43J56l00j87J50m4J85k31K59k40R6O1j87L65m22K66l51M32j29j89J01J73
$$ y = [-76, -62, 38, 82, 180, 178, -91, -119, 48, 91, 24, 208, -139, 94, 0, -138, -87, 3, 5, 104, -169, 68, -6, 164, -171, -2, -6, 10, -146, 195, -86, 76, 129, 15, 163, -100, -108, -15, 129, -58, 81, 90, -265, -281, 318, -46, -43, 10, -133, -180, 107, -248, 41, -181, 83, 48, 213, -162, -154, 38, 106, 200, 130, 183, -261, -9, -8, 31, -140, -63, 138, 46, -15, 102, -21, -108, -209, -86, -74, 50, -82, 113, -130, 57, 121, -45, -63, -83, 174, 54, 100, -8, -29, 109, -254, 103, 234, 159, -135, 63, 46, -53, -376, -102, -95, -81, -173, -124, -36, 52, -11, -89, 8, 46, -31, -26, 18, -63, 33, -232, 45, 16, -52, -103, -77, 306, -79, -21, -84, 95, 65, -148, -97, -96, -11, -193, 175, 6, -30, -88, -36, -101, -199, -98, -189, -106, -4, 70, 18, -280, -37, 286, -87, 74, 141, -35, 144, -157, 200, -125, 34, 7, 105, -31, 364, 118, -131, -113, 167, -4, 103, -49, 143, 299, -1, -188, -38, -82, 103, -128, 131, -109, -13, 48, -139, 226, -196, 70, -281, 151, 22, -167, -66, 107]
6423A07j03k8n3k0l8K02J53l07j33q3M03n1j86m5N13k95K4r8j35L04k78K43Rj85
6447h0j09R6J16J0J05j28j49N3M9q7oK63L7j88N1J00q1n9j23M2O2j1L66m45J16
6472@J64k86K77l99J55N5r0M9J92m01L47M5p4N8l31lJ75n9J73j98Oj74J19R1P8
6497c1oJ7j06K58j09j30L38l50K77o5J2j7l2q8k0J86j64on4R1J53k70j3K20l21
6522b30K73N2j15k4O7k12K38n2M6j2K28j11k35K49l31L33k22p1M1k26L49j26J25
6545C4R3k46P1k3Omj62L14j72J48J09k76J01M6K39l06j22K54j31k13N49l25j39
6568a55J94K4K3R0k46J30j8j88K6j9L06n6K30m09j35J22J72P1r4k50J60j4q0K93
6592A77k51J01L9k39Q5L44j06j80M9m7N4l55K98j54L84l19L17n8N3l64JK99l3
$$ y = [107, 4, -24, -77, -97, -135, 67, 220, -87, -220, -303, 100, 49, -137, -182, 331, 36, 60, -38, -173, 131, -147, 96, 105, -80, -189, -93, 23, 33, 138, 10, -139, -86, -37, -124, -130, 133, 170, -18, 33, 133, 52, -7, -130, -88, -26, -37, 329, -116, 0, 164, -122, 155, -244, -89, -34, -124, -75, 117, -284, 63, 108, 34, 92, -239, -242, -67, -126, 47, -151, -145, -319, -200, -109, -31, -37, -20, -126, 132, 23, -107, 231, -119, 158, 93, 105, 88, 56, -32, -52, 134, -30, -36, -90, 1, 154, -116, -129, 91, -230, 43, 95, -20, -44, 23, -189, 49, -3, 43, 31, 259, 148, -87, 162, -169, 164, -58, -129, -88, -314, 35, -91, 34, 127, -119, -48, -71, -65, -69, -231, 83, -89, 59, 168, -108, -7, 39, 278, -28, -150, 104, -27, -240, 309, -16, -155, 39, 63, 86, 176, -70, 60, 42, -146, -120, -139, 167, 111, 341, -68, -203, -81, 91, 162, 68, -182, -22, -36, -116, 177, -74, 27, 66, -173, -88, 256, 150, -30, 19, -28, 26, -329, -31, -185, 199, -120, 197, 139, 192, -172, -171, 128, 95]
6615I5j89J28j76L56j02q6l6n3J34k44J76r2nP7K60j16n8J63k77o9L8m4K08r6
6639ho5J9k66L58j90J02M6J01j66J70k07P9N9K46j26J13k4j15k6j97K41N9k13
6662a0o5R7l36M06k57K06j18K43k72J00M4j40Q0K01j13q1Lo5K00k54N4J52j37
6685f2l8j3L01l13J17O3o1J83r4m4nJ20o1k05K00q8k51K33Q2M7k41K36l86J60
6709a20J68o8J21r6J47j73m5m1J17K71j82K03l42M8mJ87o5k22K44n1n5K25k78
6732a1J2j45K31n2N3j8P4l05J03K33qRj49n5O1J3J17j42j00R7l6K0J4k76R1K46
6758G7j94L07k23L2J30J3M1o9J10l29J03J15j95J18j25j6L83r4k80J73J69l02
6780e6K14k14N7ro1J61j66N23k80j76p6J28q2k54J45J58j15J74j25N8M3k67K74
$$ y = [95, -94, 34, -142, 214, 112, 26, -10, -63, 71, -173, 3, -89, -94, -17, 243, 127, 69, 232, -45, -114, -76, -120, 88, -8, -73, -54, -320, 38, -152, -50, -4, 97, -69, 101, -106, -27, 32, 278, 152, 265, 241, 126, 100, -97, 144, 203, -10, -75, 22, -314, 92, -165, 41, -77, 166, -106, -6, 38, -102, -22, 179, 66, -15, -12, -77, 123, -131, -77, 75, -62, -100, -113, 188, -125, -8, 55, -6, 177, 83, 39, 34, 154, 93, -112, 88, 0, -251, -18, 64, 111, -130, 106, -280, -120, 48, -20, 101, 5, 152, -21, -66, -107, 10, 281, 99, 302, -40, 8, 4, 191, 126, -96, 148, 97, 42, 267, -11, 1, -144, 87, 35, 88, 70, 144, -161, -58, 175, 167, 176, 27, -28, 33, 46, 163, 21, -79, 18, -18, 2, 16, -260, -169, 77, -117, 190, -33, -1, 129, 142, 183, 114, 224, -105, -2, 113, -82, 36, -89, -105, 278, 184, -96, 77, 246, -56, 158, -56, 1, -8, -69, 92, -74, 449, 169, -7, -83, 45, -37, -291, -146, 12, -103, 71, -54, 4, 47, -220, 54]
6803E4p9J96j81j76K55j84J59J3J08k29J11m28N67k92R0j35p0L36l17m5M51j17
6825H7q5n5j56K52o3J85j92j39j1J02j55K16p6k55O9K04J24ML3l14L9j4L65J69
6849C34j26k68Q5j40k0J21J87P1l45J70j16J73k17K74j98j80J61L4n5m1L65l40
6871g1o1K97l5om4q8Kk22j05L44j66N3j8J23P3k89J95k35K79K54l28O6L9J10k17
6896e0L9L16j33j62k3P8J37k13L7m6J60j72L9O3j13n9O2K36P1l72Q6K53k52K02
6920A84j44j14k4K96k84J45j98L18k66J72m77N71j11l26K9M44Q5k24j63Mq1K54
6942I0k39K18k1r0L4QJ26j30o6k0N1j03j24L61j91J60K1J38k75K25k08K36k66
6965f5J15j54J63k02K22l28K00L3j17J00j1r1%J61J5K43k14j47N3N7r1P6J43k26
$$ y = [54, -25, 171, -10, -186, 69, -115, 44, 57, 165, -64, 47, -381, 186, -106, -16, -151, -221, 115, -202, -247, 204, 87, 2, -53, -209, 43, -20, 165, -27, -166, -177, -75, -230, -14, -90, -345, -276, -72, 52, 56, 89, -225, -186, -200, 165, 334, 208, -60, 25, -115, -135, -14, 173, 244, -101, 69, -47, 126, -91, 183, -15, -195, -34, 0, -55, -96, 269, -71, -132, 165, 130, 124, 80, -8, -6, -228, -333, 11, -155, -102, -120, 3, 76, -213, -18, -253, 26, 280, -48, 18, 57, 167, -50, -11, 305, 172, 10, -13, 65, 202, -11, 26, -20, 140, -32, 7, 70, -43, -102, -40, 196, 267, -105, -19, 234, -18, 184, 40, -74, -98, 198, -86, 59, -139, 179, -87, 85, -392, 179, 68, -258, -229, 215, 300, 76, -87, -83, -164, 90, -149, 69, 48, -42, -8, 0, 126, -4, -70, -90, -39, -142, -266, 95, -96, 64, 85, 223, -52, 173, -35, 201, -65, 50, -104, 59, -143, 79, -249, -49, -16, -133, -33, -44, -135, -135, 26, 41, 284, 70, -77, -24, 33, -58, 18, 161, -65]
6989f5j69K94k77N9K95J74l10J2j35L14k67o4P5J84m30O41j48l06j77M12n2O0
7011A20k09j03J18J0K57j69j66M2L03l15K99k05J73j56P0j75o9J05L71k27R9l39
7033a66O4L23k34J34l6j15j23J29J81m27J98K7k4J35j05K07p1Q2J9j03k26K29
7055I8J03j3j2r4r1k17L2M6K3N9K24j48L5pL9R5k46K80l61p9l4L96O4p0K3r3l7
7082A5R8l45J27K9L38m8J9k87P3p0N7j72J49j48L21j17J22m1k89J58n4R1j30L11
7106B07l21R7j16n6L82j46l7l12M55q0k06M6Lj38K67J33r1p7O7N9r3j78K08j87
7130a14j28P9J36q5R5O6n3l99M95Ok23J1K3J64j46R4NJ7J90k27L4j16r7L46L3
7155B06K3p1j82k4j65N4l4K15m2R7k63j4N0J55j06j1n8N2J83P1q4N0l69K00J72
$$ y = [-65, -234, 60, -217, -158, 137, 311, 1, 13, -122, 192, -75, -139, -64, 120, -310, 331, 183, -123, -300, 112, 60, 120, -89, -192, -74, -64, 193, 24, -142, -100, 203, -112, 187, -18, 155, -1, 69, -106, -175, -70, 301, 74, 173, -166, -102, 221, -13, 121, 85, -30, -153, -24, 157, -270, -72, -45, -69, 66, -39, 168, 97, 179, 198, 95, -131, 98, 201, 188, 176, 82, -9, -226, -194, -148, -125, -66, 158, 10, 45, 38, 77, 172, -74, 206, -155, -234, -268, 128, 192, 122, 145, 52, 15, 113, -232, -105, -76, 262, 214, 233, -54, 19, -51, 6, -166, -17, -165, 156, 39, 161, 120, -169, -11, -65, 26, -104, 207, -114, -17, -133, -189, 193, 47, 10, -302, 153, 73, -133, -87, -84, -222, 45, 178, 87, 10, 77, 136, 43, -135, 73, -114, -242, -163, -27, -112, -17, 49, -4, -403, 92, 98, -125, -114, -91, 73, -73, 21, 26, 43, 233, 6, 40, -76, -173, 173, 206, 229, 158, -24, -48, -213, -159, -193, 22, -20, 77, -186, -200, -150, 5, -101, -112, -170, -118, 65, 136, 52, 102, -267, -67, 105]
7180A05k76Q4J59k24L4K90j57K09l32J48pK35l92Q8J49o3l12K94pj08K44j54m2
7203c5J0J02J32k62K30l55J0k0K85j87K0J30K00k08j97J89k03J72O3m57K20L17
7225A56n3pj52n8R4K32j89j40R9l2J13O5j94p0j26J40J97j1k39K87j02k00K81
7248I1q2k14J77q4j04J44p7J3j52K37Q6OK05j17l36J87kn6L5K91m87J98M1j49
7272a49R0K40l73J61q9Q3J07j5j67L5Q7K3r2M8K8j10K13J42q5m27O5O4R9L47m00
7297g5K4L2J49j93n4r5K03m1k00j9J54J96j87P9J77j94p5JJ84O3l03j2P0K02J97
7322B83k32k29K36R7m3k25Nj5n1M0m0J92n1n0pJ70p7R1r5m8j04J61L3j31k09M77
7348A78j8l36K6L35j49m4rK3J72j28OJ11l37R8p6J82j33o7K00J41j99k32L81k4
$$ y = [105, -171, -87, 72, -152, -118, 172, 15, 224, -108, 40, 33, 268, -124, -36, 113, 50, -262, 32, 25, -83, 161, 7, -35, -25, 77, 209, -53, 177, -178, -168, -188, 97, -90, -70, 60, 260, 52, -145, 44, -159, 13, 76, -381, -161, 156, 103, 96, -56, -114, -20, 212, 23, -117, -18, -50, 63, 128, -66, -136, -262, -122, 75, 64, -175, 112, 10, -190, 91, 9, -205, -28, -112, -216, -72, -149, -136, -288, -51, 35, 41, 246, 129, -207, -20, -22, -78, -43, 248, -239, -41, 0, -149, -59, 181, -192, -31, -120, -37, 70, 55, -112, -77, 10, 33, -59, -11, 17, -93, 120, 262, 177, -250, -185, -121, -22, 325, -75, -51, -19, 130, -63, -117, -212, -9, -50, -250, -269, -115, 81, -106, -27, 150, -44, -119, -118, 66, 129, -174, -186, -116, 86, 283, 51, -178, 58, 155, 112, -113, -108, -123, -174, -134, -174, 18, -33, -83, -90, 80, 3, 94, -1, -49, -153, 8, 41, -90, -299, 178, 160, -176, -150, 185, 36, -8, -17, 6, 178, 50, 56, 167, -170, -72, -148, 34, -99, -166, 34, 175, -24, -256, 125, 101]
7372A01Jp8R6j61o8Q4K00j61j65N0J51r1J19j31O4J32j95Q0k35L04m9p4n5j68
7396b49K26L2l2o7K65k36J2Mo8K53M3j07J86l88K26k09M41m42J75j01Q4j34O9
7419a7j13Q8N1o0m5r0R2K07j45j53P8L84j79j97P3j5k00K19K54j61Q9o3o9j98
7443a70M8J01K22m24K31L52n76M67m13J89j56J07K60l57J87k20L49k78%K78m21
7464b24J46R0j84J48j41K04q3J7J76l23RL09j35j94L7J13K32l52N2K2j07J41j76
7487b23M27l06L94j77N5j70m4o4j28J93J35J9k45J28LJ50l05L40l9ml16L42%j9
7511A46j10k07K07m2k0j9J30m62N03j29N9n8m0K94j69q2m3J8J42P6k83K5J20p2
7535a6j54O0J47J2k5M2q2N6K02l25J24J10k88K34k86J87L5j9M6l16K08j3m8j4
$$ y = [101, 102, 24, 120, -41, -109, -25, 175, 14, -151, -101, 50, -41, 78, -53, 11, 143, -52, 28, -207, 97, 48, -26, -81, -249, -23, 9, -23, -90, 175, -61, -49, -45, -113, 140, 183, 76, 262, -126, 100, -109, 332, -110, 65, -36, 48, -86, -17, -130, -42, 9, -51, -96, -186, -94, 113, -32, -185, -107, 277, 98, -99, -26, -41, -241, -22, 232, 71, 160, 97, 28, -170, -122, -21, 201, -223, 8, 360, -216, 251, -162, 27, -129, -22, 238, -119, 68, -152, 197, -81, -81, 197, -224, -78, 12, -172, -24, -165, 39, -44, -27, 149, -174, -165, 144, 9, -185, -148, -35, 197, -155, -103, -81, -188, -47, -223, 204, -102, 292, 115, 170, 0, -44, -108, -236, -43, 92, 111, -134, -6, -3, 147, -158, 182, 143, 139, -177, 165, 165, 146, 36, -171, 36, -6, -26, -45, 85, -377, 126, -3, 56, -2, -42, 252, 83, 1, -42, -24, 118, 194, -89, -64, 56, -16, -170, -110, 37, 49, 24, 66, -16, 40, 242, -83, 41, 151, -137, 97, -189, -2, 33, 14, 60, -256, -48, -61, -109, -123]
7559a23K86j25k39J5j1j5K68k13K06k0J46l55L22k23J67l1j75J95k47K64k23J6
7581a15J78j2j09j4j21J80J36q9JOk00J56%NJ2q3K21j44K28m54O0O3K20q8J40
7606A77j60P0k04J23j33j2J12Nr2lR2m3Q5n5K7L4J8r2R9k11J37o8Q5L7J7K9J07
7633A81j12j36J03j10qM2K50j11oj55l4j20L54J8k51LJ13j60J8J37q0PL3j14K82
7658A44o7k41j35K40k40J08J22R4m6j0q8L50j80n6q4r2jl3M41m22L01k60J07R0
7682D2j12j71K53J80m70L42r9L5J47j74J43K21l52mn3J17k49O4R3n3PJ62k8O6
7706A07l18j24M50j10j07J68K9o8j18P8j28P7N2k9J34o0q3R8k05J50m0J12j14
7729d9p7K3O1JJ40j18P0K8mL4J1l2j85Q0K7NM1j2p7j40K0J28L7k93L43N6J0k60
$$ y = [-123, 163, 38, -201, -186, -197, -212, 56, -157, 49, 29, 175, -180, 142, -81, 86, 55, -120, 75, -172, 92, -131, -115, 63, 51, -58, -72, -193, -13, 123, 34, 35, 41, -159, -3, -3, 2, 14, -69, 152, 8, 236, -218, -158, -95, 125, 37, 177, 17, 87, -117, 6, -127, -139, -27, -22, -114, -117, -25, -68, 17, -38, -11, 23, 41, -51, 48, -163, -26, -94, -9, 28, 45, 74, 181, 69, -67, 36, -74, -82, -40, 210, 99, 93, -62, -96, -216, 138, 156, -95, -92, 21, -139, -121, 16, -64, -57, -24, -138, 144, 77, -164, -299, -59, -299, -191, -69, 25, -21, -31, -119, 231, 51, -5, -89, -181, -182, -215, 226, -196, 105, -155, -48, 42, -70, -241, 12, 192, -278, 64, -35, 0, 147, -27, 116, 337, -15, -19, -72, 45, -204, -140, -47, -100, -93, 69, 41, 107, -211, -335, 115, 5, -102, 66, 95, 27, -91, -13, -141, -64, -12, -41, 93, 33, -50, 48, -157, -7, -47, 65, -49, -126, -103, -42, -41, 99, -19, 51, 79, 75, 109, 120, 88, -97, -17, 10, 15, 56, 44, -33, -173, -153, -25, 12, -281, 62, 118, 128, -132]
7757a32r4J84J28q5M8j6L5l5j68NL9O2QK94k20j27k22K87o3J67j16q2J53m4l8
7782c2J64p9k79K17J15j62M0K63j06j42N6j9J71j15k14J67k37K67n5P0k25K46
7804A11j10L6J3P7j51k69J81Q9r5J79r5J59l11L61r9l21O6K00p8r5j9J57r2L0
7828g6J32k57pK24O7l45J83k0N7j33M04j72P5l44K95j55J10J05m02J24K44QK2
7851A39N3k10K5R7k77J04O2j46K24n2j03Q3Nk25J47J45r8Q0J53j41j72K0k48N21
7875A86q4j47P5J67k6k87P8j0J47Qj93J42J6l6j68J83k03j77K04R2pO1l1o2J58
7900H6j09k35L49l0o1n0q2J21Q8p9J67R5j82j74J63j4O5l17K47Q2k2j11k53K81
7924B5j55R1Q3K40l24O7R9k92R3M2K4j24J18k3q3J10J19r9j30J78J92p4j80j46
$$ y = [-132, -226, -42, 86, 1, 49, 33, 68, 33, -135, -130, -91, -29, -21, 273, 53, -74, -296, -9, -72, 95, -21, -103, 50, 6, -32, 132, 53, -226, -9, 106, -56, -16, 247, 141, -1, 55, 36, 207, 92, -122, 45, -192, 75, 20, 90, -135, 111, 1, 37, 50, 127, -24, -293, -112, -23, -118, 61, -34, 125, -186, 175, 76, -245, -179, 21, -57, -152, -171, -14, -106, -76, 56, -201, -208, 16, 83, -262, -79, -99, -42, -175, 229, 57, 132, -212, 83, -72, 38, 143, -259, -135, 109, 117, 139, 192, -18, 7, 104, -173, -69, -7, -153, 71, 19, -84, -1, 4, -221, -74, 71, -27, 53, 206, 65, -107, -87, -335, 186, 102, -45, 30, 197, 171, -116, -38, -48, 99, 107, -86, 56, 72, 36, -132, 51, -152, -329, -125, -33, -40, 21, -10, -72, 86, -23, -258, 91, 61, 0, -50, -132, -11, 77, -2, 165, 260, 78, -96, 67, 53, 118, -199, 48, 130, 108, -3, -256, 25, -130, -39, 44, 284, -40, 27, 126, -166, -73, -31, -7, -131, -13, -36, -119, -9, 110, 11, -119, 59, 251, 177, -3, -149]
7948a49j7K22lr0j50R9N5J32l6j82j60K91O5K3J2q6J09j94J41j38K77j72j45K51
7972A55m0r0J7j77J9j83K77q7K25l5k39L80j91l3K32m06K43k99M36j60J1N2N9
7995A66j81J18j23J13o0K62k76P5J94j73n4l9O8j61K21j68P8P4k00J12k51O7J38
8018@p8jj37L29RJ1l72K33K52k38k31J73o0K7K75j41%%j13k82N94m32L49p7Nk05
8044a10M8J69k87K93j16O0J10j74J73J88l49O8M4K9l27K86l33L56k79J71P7j1
8066H6j17j26J78K0j65m6K21mK2l21K20lk40M08R9m01K40m0q0K00Rm3M9j42o4
8091d0mr3K7L7O5Q2O9J12l88j31L74j00n4j36M3K52k20J50l84L27j07K19j37J36
8115I9J10J42l81j53Q0j65L74r5R3j6r6j24J25j04r7K76j95L34p9j5r4J76k17
$$ y = [-149, -166, 56, 53, -37, -187, -88, -33, 99, 63, -119, -279, 12, 77, 100, 112, 26, 135, -59, 82, -56, 221, 49, -96, 155, 115, 25, 42, -135, -116, -299, -22, -109, 116, 81, -158, 222, 31, -2, 230, -176, 67, -232, 204, 44, 55, 107, 166, -15, 103, -20, 93, 33, 295, 19, 94, 288, 115, 61, 22, 90, -71, 150, -18, 60, 134, -66, 46, -205, -138, 0, -78, -79, -216, 113, 122, 133, -239, -6, 246, 8, -223, -50, -110, -83, 192, 51, 51, 51, -62, -344, 250, -182, 167, 90, 95, -110, -62, 107, -180, 113, -3, 57, 167, -7, 166, 354, 5, 73, 117, 146, -181, 105, -228, 128, -151, 20, 97, 86, -31, -157, 21, 41, -124, -170, 51, 47, 69, -252, -32, -35, -275, 133, 232, -169, 71, 31, -49, 151, 160, 117, 166, 24, -40, -44, -137, -110, -73, -8, 74, 143, 255, -133, -264, 110, 10, -44, -180, -137, 115, -105, 45, -339, -12, -119, 100, -37, 99, 209, 351, -30, -183, -103, -268, 106, 11, 104, 88, -8, -132, -7, -111, -208, 68, -127, 207, 128, 113, 19, 195, -22]
8138b2P0J63m25L23J16q0m5j90L73k97J39k10K41lk56K44j92P7J03q5r4K71k49
8161b8N9p2n4O2J48j77j05J41J94N2l94J55j45J55J07j50K30q6o0rq5J76J88l37
8185c5Mj85M25l70N9K0
$$ y = [-22, 48, 211, -214, 109, 225, 145, 100, -90, 283, -14, 125, -85, 156, 153, -103, 141, -51, 26, 129, 44, -50, 221, -28, 31, -41, -95, -33, 115, -62, -167, -26, 168, 220, -174, -19, -164, -9, 98, -52, 178, 92, 32, 23, -62, 114, 302, -35, -31, -216, 209, -161, -102, -82]
8191h2
$$ Imaginary data points
##PAGE= N=2
##DATA TABLE= (X++(I..I)), XYDATA
0@%%%%%%%%%%%%%%%%%nJ3j6J6j6J6k2L0l2L4m2M8n5O4p2Q5r5J05j19J35j52J70
39I0j91K13k38K65k91L22l56L93m36M80n29N82o41P08p80Q62r53J056j175J312
59F93j471J659j888K173k539L027l715M773o632J0909m1646k3859o012l4995K1752
74g7771J7141j077j9730j1743J7001M1014L178m39M5490M5830p710j2398J0684
87D9470J6963L394r710l668K7483J6685l2220l5103j793j3040m1955l2883N34
100e5843J6917M897j5314k420K1464J279l2949j2512K6553K4155P423J4953L6484
113C5087L7914N773k1607n811J3090q931k7021j49K5907R702j6231j8693o483
126B2547j0563l4783m0693n161J7789k87p346J7108K5358K089j6214j0166J0158
$$ y = [0, 0, 0, 0, 0, 0, 0, 0, 0, 0, 0, 0, 0, 0, 0, 0, 0, 0, -5, 8, -8, 8, -8, 8, -14, 16, -16, 18, -24, 24, -31, 33, -39, 46, -49, 56, -63, 72, -80, 90, -101, 112, -126, 139, -152, 170, -186, 207, -229, 251, -278, 304, -337, 371, -409, 453, -500, 556, -619, 693, -778, 881, -1007, 1166, -1373, 1654, -2061, 2712, -3920, 6989, -34657, -58516, -64528, -99523, -77771, -60630, -61707, -81437, -93180, -76179, -35165, -31987, -32426, 13064, 58894, 51184, 38786, 49470, 66433, 69827, 60117, 56449, 83932, 100617, 68397, 33294, 31501, 18461, -23494, -56377, -55843, -38926, -34029, -49343, -51763, -30299, -29020, -61969, -74481, -47928, -23773, -16350, -1397, 35087, 73001, 78774, 57167, 51356, 64446, 55515, 28494, 28345, 54252, 63954, 47723, 29030, 22547, 11984, -22799, -63492, -68653, -50864, -51151, -58497, -41389, -16031, -13942, -30156, -40322, -30164]
139c0164J5938J30L636L5240L7840K384j0253L795J026j6673k5366j1558J2704
152A8679J2602j2764j3543J0013k007l4638l1375n651L801r29k429J2233L2477
165a3531J7240j4361p997J5472L757j2508K364K4398K7538J1881m516Q30Q764
178E9331j4610l4428j4110P633o23r028m75R273M120j5847k7237r401M430q684
192d9656q631J6712K8217J4629J104J823Q548L224j2940r980J5662K1225L800
205C3737P88J1931P214j2201k5391j8259j892k900j4360l202J7992R688j2658
218i513j3833k368k474j0369j0301P705K4719J6898J700P733J6394J397j5237
231A2451r006N886R568K002Q2R898J2982o035k1555j3761l662j1178j4846k785
$$ y = [-30164, -14226, -14096, -10460, 24780, 62620, 65004, 54751, 58546, 59572, 42899, 17533, 5975, 18679, 31281, 18517, 4974, 14987, 12980, -21658, -53033, -58684, -54883, -55812, -58241, -46008, -13531, 3709, -10652, -18649, -3177, 580, -11928, -9564, 14834, 42372, 54253, 49737, 50567, 59331, 44721, 10293, -3817, 3816, 3193, -5835, -6310, 2963, 7083, -8764, -36001, -45402, -40972, -49656, -58287, -41575, -13358, 1271, 2375, 4198, 12746, 15970, 3030, -6950, 8712, 29937, 33737, 34525, 46456, 53670, 41469, 16078, -2181, -4073, -6973, -21333, -24535, -6543, 3145, -9513, -23346, -25714, -28188, -38557, -48858, -41153, -16434, 464, 2164, 9897, 26291, 27688, 12451, 3445, 9331, 18899, 20901, 20983, 30881, 43863, 37828, 16273, 2512, -1150, -12328, -27174, -29959]
245b9959J1340J0280j951p013N59K303j1423j3136N551J7380J0906N753J2530
258A3120J5765M593j0754j1520J465L823n565k018J2514J1988l947j3399r477
271F588o035j2456j8002o629J1075J0008n36Q67P750K866r673j1910K71J0834
285a4982P624M399J3025J9335P100p485q057k110l711r406n355O899J1842J035
299B0153p758l541l505j3566j8449q713L838O264K492N266J2592Q703n612j0386
313a2222l3L942q12K083J2677J7420R616j585l586j115o249j4991r604L045O667
328E253L56j765K177O40r512j6267r847J11J001k72O240J4733J1450l31l982R1
344G6J174l433l213O999J4027R332J172Q87J680n513j4819j2216j745J427j714
$$ y = [-29959, -18619, -8339, -10290, -17303, -16744, -14441, -25864, -39000, -33449, -16069, -5163, 590, 13120, 28885, 33478, 22724, 11204, 12669, 16492, 10927, 8909, 21423, 33411, 29464, 16065, 6588, 553, -11903, -29905, -36534, -25459, -15451, -15987, -15120, -7370, -4504, -14177, -26087, -25816, -14982, -7358, -2959, 10066, 29401, 36501, 29016, 20959, 18849, 15138, 5732, 377, 7276, 19118, 20153, 12395, 8854, 5349, -8217, -26666, -35379, -31541, -25277, -22785, -17519, -4927, 3776, -1836, -12222, -12255, -8313, -9125, -7042, 5635, 23055, 32671, 31086, 27500, 26385, 20136, 5145, -4459, -1414, 5253, 5609, 3844, 6021, 6661, -2851, -19118, -28965, -28854, -27853, -28125, -21885, -7152, 4298, 3967, -15, 76, 1250, -2183, -5396, 1603, 15630, 24962, 26134, 27021, 28701, 23188, 8369, -3847, -5592, -4165, -5879]
359e879j62N433M449n000j2013p775j734l133l493N953J4476J1427L578J487K610
374A0224M3o065o113K987R759O106J593M738M512m479j2976j1478n775k495m149
389a3568j364O619P933j007p178l912k416n626n143K339J0945J2489O252L933
403A0296O916J950p858p988p65L320K397K800N225O841j1j0533j0777n520p375
418a1082q686j540O056P423L894r31n67k85n468q669n20Q283P436O459Q634Q736
434A9173L851l355q674m772J65k771k462N672Q383R27m078n821o336p803r152
449a7053p589K879Q185L503K209O012K902m375n954l229J442N466M207O139J1233
464A5977P854k472m959k747n483o635l066J101M832M386j425k741j529o501j1390
$$ y = [-5879, -6041, -608, 3841, -1159, -13172, -20947, -22681, -25814, -29307, -23354, -8878, 2549, 6127, 7614, 10224, 10267, 4202, -1911, 1076, 10835, 16941, 18534, 23272, 27784, 23305, 10329, -1149, -6924, -9419, -13568, -14932, -8313, -380, -1387, -8565, -12477, -14893, -20519, -25662, -23323, -12378, 111, 6363, 10296, 17212, 19162, 11304, 3316, 2551, 5871, 8268, 11068, 16293, 23134, 23123, 12590, 1813, -3707, -11082, -19768, -21308, -15252, -7829, -3935, -4866, -5433, -5718, -11186, -19855, -20375, -12092, -4656, 1803, 10437, 19173, 23024, 19669, 10995, 6223, 6388, 3617, 1155, 6827, 15210, 16137, 12059, 6238, -98, -7901, -17053, -24642, -21763, -13578, -10075, -7866, -1854, 1048, -3327, -9281, -12510, -11068, -5602, -1395, 4744, 15977, 23831, 21359, 16400, 13653, 8170, 1535, -1531, -430, 4402, 8788, 7363, 4622, 3093, -3408, -14798]
479a4798o075J90J998L782N601N651O411J566n905l526J611k91r7O417R337O727
495A8599K879k558l647l126p634r272q05M683J038P67K139n26l701p159q861l352
511b0536K614J171K682J0290Q020J773k61j861k828j374j279j7P763Q610K192
526A6959N25J184m745q326p259o277j294L217R93J364N139N80p061n191l543l750
542a7485r9L033N634R456P756J076j59Q92m226n587p64K713L847N296L053Q28
558A5264L53n369j0276o205k722l662l3M492M325K792P35l665l973j968l292j480
574a4684N274P469N695N911L507k09j706l855o108o77K992P25K302M721J200l724
590H833m956o792o329k906k325j03N928N435R39Q58M60l540l530j148J57M567
$$ y = [-14798, -20873, -20683, -18685, -14903, -9302, -3651, 2760, 4326, -1579, -5105, -3494, -3785, -3882, 2535, 11872, 18599, 21478, 18920, 15273, 12147, 4513, -4759, -5564, -881, 157, 924, 3063, 2537, -1164, -8323, -17184, -20536, -17922, -16751, -14069, -3779, 4241, 6014, 5753, 3892, 1064, -310, -1589, -1606, 6157, 14767, 16959, 17484, 18668, 13923, 5597, -1662, -7939, -9233, -6016, -5023, -3659, 1480, 2060, -5001, -10192, -13735, -17485, -17584, -14551, -8917, 539, 8295, 9371, 9212, 10104, 5878, 291, -473, 2240, 6087, 11383, 14436, 15264, 15617, 10248, -28, -6233, -8955, -12617, -12650, -8158, -3833, -1041, -306, -3971, -7944, -9912, -13204, -14684, -9410, -1941, 3754, 9665, 13172, 12963, 11257, 7402, 1294, 617, 3609, 4334, 6636, 11357, 12557, 8833, 3877, -2915, -9244, -12150, -14475, -14578, -8650, -3215, -2276, -1418, -958, -4498, -8028, -9176, -9019, -4452]
606d452P713M013L905N044o80o135l594l461l024J057J777J451L683J352n383
621C266m759l994n845m088K64K253M786O517J976q3J342k267m691m98K524K641
637f56N622N856K893K267j069o123n424k581l593j333K844K830J511J241l098
652A187n402l764m713l894J861M537M109N770M492N80m24j519m166j515K558K516
668B213L609O009L224p39j995m739o642l932k769j972K722L713P94L03l61m248
684d810m441k584k598J320N429M635M672N173K270j803k357k124k590P53K813
699C758K232M167L180j027l808l608n987n702k165m08J315L758K532m47O6j962
715d106m762k070J94J607M179O012M270L822K355k259l138j528k173j160K169
$$ y = [-4452, 3261, 7274, 11179, 16223, 15543, 9408, 5814, 2353, -671, 386, 2163, 3614, 7297, 8649, 3266, -1493, -5487, -11332, -15420, -15156, -12903, -8117, -1600, 376, 293, 1635, -632, -5323, -5821, -3297, -656, 4966, 10822, 13715, 15982, 14913, 8790, 3366, 785, -2808, -4141, -1297, 1533, 3044, 4285, 1187, -4215, -7979, -12692, -16586, -14725, -10188, -6079, -309, 4183, 4763, 4339, 2820, -1346, -2861, -303, 2213, 5822, 11831, 15055, 14316, 12321, 7582, 940, -2992, -5761, -7733, -5011, -1298, -504, -201, -562, -4810, -9251, -11835, -14433, -13113, -7684, -3049, 1623, 6796, 9066, 7263, 4906, 2782, 192, 945, 3758, 5990, 10157, 13337, 12310, 8502, 4894, -1093, -6795, -8960, -9368, -8053, -4295, -1763, -2210, -2144, -4106, -8868, -10938, -10744, -9137, -4958, 1054, 5324, 9146, 11501, 9242, 6104, 4576, 2403, 1243, 3412]
730C412L140K240Q89j001l858m109n018n589j916J333J680K947L357R59o52j258
746c444l170k312J662K182L548N545N411K484N00j577l946l039k039j531J251
761A525L092J810l33o65l209n120m876m262j609J877K940K999L874K984p30k314
777b017j336j751K25K620L704N073M704K140p20j650l892m638k856j574O81K186
793H99J899J65n14k517n155m971k429n65J527L529M344M198K525jj644j259q48
810h17q19J470M105M205L082J516p40k380m423n187l232r61O08R35J739J273q27
827d53k188l598l765j576J06J853L908M638M352K186m7q97j686j626q20J622K961
844D970K943J934O38r12l220m564m613k859j058N53J442J832J874n29j939k905
$$ y = [3412, 6552, 8792, 9681, 8680, 4822, 713, -4305, -9894, -11810, -10477, -8797, -5850, -2493, -1534, -2186, -3444, -6614, -8926, -7264, -5082, -1534, 4011, 9422, 11906, 12406, 10829, 6883, 3844, 1805, 274, 1525, 4617, 6427, 6094, 5429, 2220, -2900, -7776, -12038, -13647, -11770, -8830, -5831, -1957, 1027, 297, -2017, -3353, -5104, -4879, -2259, 1445, 6518, 11222, 13362, 12642, 10992, 7100, 2462, -394, -1968, -1287, 899, 2798, 2963, 2449, -68, -5223, -10194, -12623, -13188, -11661, -8132, -3788, 410, 2935, 2934, 1290, 31, -817, -1636, -166, 3939, 8144, 11226, 12742, 12002, 9622, 5199, 12, -3220, -4181, -3573, -2638, -899, 374, -453, -2641, -6239, -10004, -11580, -11474, -9621, -5713, -1075, 3277, 5463, 5416, 4519, 2833, 1207, 387, 2009, 4970, 7913, 9847, 10485, 9573, 6353, 1789, -2824, -5683, -6741, -6188, -4746, -2914, -1040, -1569, -3508, -6413]
860f413j944j121J17K620M758M646L542J591j60j402j961k287q51J227K165J984
876F511J633o7j563l516n162m076k043p64J014K223K988J786pj564j872j435j012
893f926L78L032M809M398K522J436j74k107l221k692j155R01J157J359J252P47
909E716k070m265l741l408k089o13J438L013L927K057L75p30p66k243j074J553
925b920K721L556L524K332J101l95k628m277k296j616m44K38K053J232L15j931
941E65l316k966k054k520l68L243L216K868K671R63Jo86k196r64J574K503K063
958D597K790K740m04j607k902l907k706j164j405O48K480P69l68j249k490k601
974f779j449j073K72L673L926K053K628K127j028j869p50p87Q43J428J925J854
$$ y = [-6413, -8357, -9478, -9361, -6741, -1983, 2663, 6205, 7796, 7636, 6234, 4273, 1986, 1135, 2362, 4527, 6511, 8144, 8077, 6514, 2998, -2164, -6240, -8283, -9047, -8033, -5810, -2822, -1036, -1043, -2607, -4479, -5914, -6926, -6548, -3516, 1293, 5691, 8213, 9649, 9475, 7368, 4147, 1455, 300, 1201, 2358, 3717, 4969, 5716, 3646, -619, -4360, -7768, -9857, -10470, -9032, -6019, -2092, -35, 340, -390, -1156, -3399, -4473, -2920, -199, 3357, 6881, 9213, 10314, 9919, 7291, 3014, 718, -898, -1342, -1104, 949, 2181, 2496, 565, -2751, -5717, -7771, -10291, -10659, -7416, -4200, -1332, 1339, 2302, 2303, 1617, -579, -1543, 31, 2534, 4597, 7387, 10127, 9723, 8116, 5214, 1307, -1399, -2563, -3968, -3320, -840, -71, -439, -1688, -4178, -6779, -8228, -9301, -9029, -5356, -1430, 623, 3251, 5378, 4350, 2481, 1731, 944, 1787, 3215, 5140, 6994]
990F994K587j019l252k614l184l341j878j60P26K694J022m91l53j067k907k104
1006h347N47J743K626L753L449K236J486r08k756r50o08q59J135K015K021N43
1022G126q76k892l000k837l894k101J094J714J387J706J441n79j290j625j817
1037f443O79K686J537L506M402J950l63o81j910k375j016r12K08K230J356o09
1053D245o47j606l891l695j929j365J001K224J200J894K557l49j902n79j46k96
1069c284J775K842K516L620J617j217j029j005l498k187o0K45P90J322o03j389
1085D55p64l222l786p06l30K56K536K563J869K204L30j691n39Q8j16J038L434
1102C619K066J922J312q53k153j799l201k652j81O19P4J204N91j187j818k143
$$ y = [6994, 9581, 8562, 5310, 2696, -488, -3829, -5707, -5867, -5141, -2447, -1425, -1916, -2269, -3336, -6243, -8347, -7800, -6057, -3431, 322, 3771, 6007, 7493, 6585, 3829, 2879, 2271, 1412, 2547, 4562, 6583, 7126, 6250, 3358, 358, -2479, -6373, -8474, -7380, -5666, -4279, -2573, -1132, -1711, -3001, -4626, -6443, -5764, -3078, -1541, 1965, 6367, 8317, 7954, 7273, 5363, 2988, 1972, 1060, 1268, 3498, 4854, 4245, 3598, 1992, -1899, -5594, -7523, -8888, -7887, -5663, -4463, -2569, -12, -361, -2263, -2842, -2988, -3284, -1509, 1333, 3849, 7469, 9086, 7869, 6840, 5835, 2337, 150, 90, 335, 1125, 2447, 1844, 455, -309, -3531, -7317, -8023, -8353, -8097, -5561, -2998, -1129, 1075, 1405, -286, -825, -737, -853, 185, 3619, 5685, 7607, 8919, 8066, 5913, 4114, 913, -1739, -1920, -1301, -1227, -23, 568, -619, -2437, -4580]
1118d580k764j189J092M22K354M311K018M72P61m61j503j99p3M88K687K665O55
1135G156P65l97k679l424k494k142j205J083O46J132J456r21k458j439j277j281
1151g479O74J902K035L597L037L41L08J49j846j869N64Q80J027K009Q31j29o05
1168E426k304m191j704j384j564O79J694Q15J188M09j555j493p03p05pK584K627
1185a88K455K449J054l21n15j415j927m24R77N10R99J168l58j692j798l009k705
1202d740p49r32L63K320J672M55M58j53j356o65j74J05K161L098J895J653J376
1219F787o43j767j169j957j060R21Q44j39J338j32k128k133k159k294r10L10O17
1236e674K272K044R81RL02q14j280K42R72J221K553K258P51R90o13k578k110j278
$$ y = [-4580, -7344, -8533, -7441, -7019, -4665, -354, 1664, 2136, 2897, 2436, 933, 734, 661, 1149, 3836, 6501, 7156, 7921, 7524, 4845, 1421, -1073, -3215, -4420, -3337, -2691, -1559, -103, -1024, -3482, -4921, -6198, -7479, -6805, -4903, -2868, 729, 3766, 4107, 4415, 4564, 2718, 849, 1413, 2293, 3320, 5329, 6160, 6031, 5426, 3122, -1069, -2773, -4157, -5721, -5042, -3348, -2533, -1345, -936, -2491, -3984, -4687, -5392, -5399, -2815, -188, 2267, 4716, 5770, 5449, 4934, 3519, 1592, 1168, 2145, 2655, 3654, 4822, 4464, 2772, 974, -2035, -4740, -5489, -6421, -6058, -3738, -2066, -1611, -1153, -1306, -2662, -3327, -3501, -3396, -1235, 1863, 3758, 5411, 6787, 6144, 4377, 3208, 1251, 191, 1112, 1956, 1817, 3155, 3023, 895, -1238, -3397, -5691, -6601, -6291, -5674, -3402, -1358, -377, -368, -66, -880, -2160, -1918, -946, 275, 2828, 5086, 5837, 6827, 6214, 3636, 1526, 248]
1254B48j003j24J022N44N21J87j590j999j840j673j277J040J679J582K210J911
1270A438J08j01n20j648l77J094J441J361J995J403o0j075k099k197j543j218
1286a998n83J044J502K71l07Kk391j445j273q54P28K309J845J587K024P56r09
1303B308j030o84n28K83J130J292J693J143q98j389j494k224j964r92J24P21J486
1320a023N71k92m0r06j906j244N89O54J554K048J933J689M03j097j038o66p98
1337D31K9Q62J403R84L14p55j330j738j855j879n84N0J584P84R27L76J38j342
1355a601j436n63L59J194J479J962J932Q20K99j104j064j311q01k84P43J364P62
1372B750L90o99j328j925k174j448o8L21J104J548J071R22m92q73r56n12J70R61
$$ y = [248, -755, -879, 143, 687, 1208, 1395, -195, -2194, -4034, -5707, -6984, -5944, -4265, -2683, -473, 1438, 1546, 1445, 925, -723, -1100, -6, 1435, 2796, 4791, 6194, 6134, 5059, 2960, 763, -780, -1998, -2581, -1537, -35, 236, -71, -69, -2460, -3905, -5178, -6032, -5304, -2995, -1150, 437, 2461, 3217, 2308, 1278, 594, 66, 349, 1479, 2771, 4464, 5607, 4709, 3320, 1826, -398, -2362, -3354, -3230, -2509, -1023, -452, -744, -784, -1690, -3596, -4840, -4251, -3597, -2043, 5, 1938, 3627, 4030, 2933, 1895, 1229, 431, 460, 1322, 2725, 3709, 4023, 3268, 1938, 200, -1655, -3534, -4118, -4068, -2484, -1700, -773, -397, -259, -1601, -3037, -3600, -3241, -2047, -568, 1394, 3326, 4146, 4445, 3341, 2277, 966, 165, -119, 624, 1988, 2750, 3140, 2441, 1113, -812, -2986, -4434, -4502, -4181, -3077, -1529, -458, 464, -28, -901, -1857, -2369, -2199, -1238]
1390a238J502K093J716P35l71p20j414j839j165n7P45R93P17K38m33j294j972
1407a764j654q32j98O89P81J476J837P48n54o29p54j67l10R08J355K032J170l1
1425D103J65r37j785j390j071l80N21P67M27K75R0j430j630j528m95J9O51J671
1443a957J732J162L00M1l57q97k71Q2M21J575J327M84L44j45j256j911j560p75
1461a661j00J17M65P68N54j05j241j312p07n77l98J181J960J834J130N61k29n01
1479A739q37j064q9J065Q43P63J124L49j104j162j698j896k22n26J28J026J270
1496b91J38k80p09n95j166j10k33J257J912J556Q01Q57J07j184j326n26m7L67
1514E28N88Q29Q04K49r48j809j235j016j286o9O25J060J401O27o35r2n83j149
$$ y = [-1238, 264, 2357, 4073, 4808, 4437, 3717, 2303, 464, -701, -758, -13, 980, 1697, 1935, 1502, 208, -1764, -3418, -4250, -4448, -3759, -2978, -1502, 335, 1083, 529, -100, -854, -1021, -1331, -423, 932, 2964, 4134, 4103, 4268, 3331, 1546, 156, -915, -1295, -774, -7, 420, 695, 785, -645, -2275, -3803, -4298, -4279, -3628, -1957, -225, 937, 1237, 1278, 921, 24, -247, -165, 256, 1831, 3158, 3642, 3986, 3841, 2585, 674, -886, -1661, -1761, -1644, -1179, -411, 143, 38, -1203, -2515, -3222, -3799, -4197, -3016, -1056, 778, 1908, 2469, 2240, 1739, 902, -162, -251, 814, 1657, 2420, 3544, 3893, 2789, 1627, -71, -1967, -2189, -2715, -2587, -1561, -291, -153, -433, -1142, -1737, -2903, -3013, -3246, -1989, -77, 1479, 2280, 3137, 3244, 2060, 734, 208, 161, 528, 1116, 1945, 2749, 2998, 2050, 241, -994, -2010, -3296, -3365, -2740, -1680, -279, 348, -287, -379, -962, -2111]
1532b111l14P14O20J694J497O01P31j06j229j517k86n00k48Q14J021L74L46j577
1550E24r55r83r22j416K92J315M89J181J072K03n61o52q78l60J238M24Q20J537
1568B368J313k70m60r67j488p49l94l24N13J431j77l84O1j005j624q82q5o1J520
1587a664J229M49J281N47j196n05k96l92j08J184Q56J013R54n94j074m53j167
1604F4j802j55P15N64N29O18k04k41n77j848p31O29J16N07J754J326L09O17o27
1623A563q35o81j72l60Q55J187L60P03j26o21j575r64j335m80Q72J66M68J292
1641C17L57r02n28o30q58j3N29Q60J256J545J16M45j50j233j139l28L35J70J012
1660A161N29K39K23p48j946n10q79l61L6R67N14R25M37q52m51O1j183l12J184
$$ y = [-2111, -2425, -1711, -1091, 603, 2100, 2701, 3432, 3326, 2097, 580, 294, -206, -454, 360, 1381, 1755, 2101, 524, -431, -1414, -2336, -3752, -3460, -2145, -1656, -475, 597, 800, 239, -413, -1291, -1651, -413, 11, 831, 2368, 3681, 3411, 2951, 1984, 496, -253, -647, -971, -458, 973, 796, 412, 473, -532, -2156, -3038, -3123, -3184, -1664, -435, 14, 1295, 1842, 646, 141, -155, -547, -655, 529, 1385, 2398, 3352, 2758, 1684, 1231, 64, -1738, -1893, -1178, -614, -85, 533, 329, 88, -489, -2337, -3068, -2439, -2323, -1816, -62, 1264, 1573, 2190, 1563, 728, 47, -125, -485, 370, 1557, 1917, 2620, 2494, 1873, 298, -666, -2001, -2481, -1609, -1443, -975, 317, 674, -228, -756, -1386, -2244, -2257, -1728, -868, 388, 1933, 2049, 2494, 2344, 1111, -28, -356, -21, 149, 1161, 1690, 1929, 2152, 1404, -542, -1052, -1931, -2292, -2256, -1289, -775, 150, 587, -265, -716, -655, -1838, -2150, -966]
1679i66R80M86J381P63l12j04j275j095j83L71j73M38R98J31k64o62j315j055
1697a856l93l74l65J757J099k26P68N20r75o87o93L85N20Q84N93J264P11l51j035
1716A546o86n22q40k10L30N66Q37J83n95m95q09j355q89P25M7R30R35O56N63J16
1736A033q12j003J89J62q0J018J319N39M49o28r35l99p74j443J20R59J69L53J32
1755C68N2n08j151q33n75Q38K8L85J470J395J3n76m88l1m33l41q0J267J005L72
1775B177j83n7k69j511j142q28M85O75r3LR26L41q51j342j95K05j87J37R76J275
1795E42R09Ro36M57k97j270l72R79R91K34p0J23M83r46j874o87K88j71m41M90
1815a259J161M35m33n56l42k1l23o22O75K167L52pJ90P39n11j108j267O17Q56
$$ y = [-966, 14, 500, 1881, 2644, 2332, 2228, 953, -142, -325, 46, -127, 311, 1309, 1440, 1176, 514, -801, -1856, -2249, -2623, -2988, -1231, -132, -358, 410, 930, -45, -732, -1425, -1040, -520, 364, 957, 2221, 2932, 2581, 1546, 860, 338, -502, -712, -382, 184, 1021, 1204, 609, 114, -695, -2050, -2939, -2214, -2167, -1237, -302, 354, 917, 1033, 221, -782, -593, -431, -511, 507, 1826, 2365, 2814, 2186, 1251, 852, 78, -1365, -1245, -286, -117, 236, 368, 420, -88, -1239, -2072, -2647, -1809, -1781, -1396, 74, 1469, 1482, 906, 418, 387, -46, -387, -467, 800, 1805, 2177, 1994, 1937, 1668, 157, -985, -1813, -1328, -653, -746, -743, 183, 524, -327, -1669, -1864, -1659, -1846, -1709, -733, 542, 1451, 1460, 824, 1281, 984, -286, -658, 321, 1312, 1546, 1476, 1599, 2082, 1136, -738, -1425, -1137, -1308, -1749, -1259, -98, 337, -96, -652, -994, -1015, -1338, -1960, -1285, 882, 1234, 1227, 1417, 2156, 1645, 537, -730, -113, 743]
1834G43J56m78J044M32o34j557o86j83j46q71l42J760J003k35n55P4N6o47j055
1853b121N90J510Q68N6M90J008J72j062j457J07K63l91k14N69J132m1j293p91
1871f05J42q21j490P9J184R74L76j86O63K16n92j387L96R00N10M5O22J381K80
1890B687p29j334k9k13n67p72N57J234J44r39j68J93j072j264n31J077Q77q4K00
1909g33J189P43r94o90K8M29K48k95N16J441Q69q18j077L21j87j424j217J137
1927e14N61L16m16q9K26l01j395r86P50Q38l60N67J035J385m37j010k21N41l16
1946A74o86N89J282P07n09m20L14m61j337r08j31O26L87m00K39P94j41j256n45
1965a682L59J44K52k18J153J239L15p07L73k05j84j026j32Q52R56n23j36N28Q1
$$ y = [743, 899, 421, 1465, 1897, 1263, -294, -980, -1163, -1309, -2180, -2522, -762, 241, 6, -549, -475, -419, -1066, -2121, -1531, -21, 847, 903, 1393, 2401, 2573, 1511, 54, 161, 424, 33, -181, 388, 1520, 1479, 186, -605, -463, -1284, -2774, -2695, -1511, -537, -161, -347, 316, 532, -60, -1447, -1051, -151, 359, 404, 1026, 2407, 2687, 1958, 624, 595, 382, -185, -957, -400, 834, 978, 39, -129, 64, -1008, -2272, -2803, -1726, -849, -933, -733, 456, 1199, 205, -485, -457, -28, 220, -75, 441, 1882, 2751, 1933, 856, 1177, 990, -434, -1651, -514, 47, 363, -53, -142, 84, -217, -1612, -2598, -1848, -1010, -1370, -803, 232, 1617, 1180, 170, -51, 490, 174, -512, 77, 1359, 2066, 1557, 1137, 1451, 990, -347, -1255, -1386, -760, -373, -773, -534, 260, 119, -1137, -1682, -1323, -1179, -927, -1145, 8, 1247, 1562, 855, 1228, 1023, 839, -187, -319, 533, 1489, 966, 830, 1358, 1439]
1984A439j518j470J74K56n4m00L76J204K59p89o98M80R1o65o9J108J530K50j26
2003A378J86L77n03j073o03N28M22m54M37L78R9r71j153l03j18k81n55J63J724
2022c22N90l08k37L84k05r81M94K10J195L23N5N04P45o05j177n05L01k11n71J14
2042b07N13J83k49j279n9j64m12r40Q45Q80L59K73m7Q93K56p57m11M98P78M2L56
2063A351M48N43m64r08n07l53m29q22J46P82O42q92l09o3j41n67p07K53J150L90
2083d57L8O51J079P8n88l68k26N14%j88P49J020j30j142n37q4q22q00j63Q2N78
2104g16P6l56L43L98j107k30q7M54O01M86L06Q87J081r52l58L51P4j071J10N71
2124H61N29J01m06n60k61k89j482k79L44J0J56K49O04K36l37o84P1L23J16K27
$$ y = [1439, -79, -1549, -1375, -1119, -1173, -1573, -1197, 7, 266, -523, -1221, -741, -650, -1315, -1384, -276, 1254, 1504, 1378, 1564, 1941, 1438, 365, -238, 290, 712, 258, 695, 1073, 1172, 201, -952, -1255, -1373, -1654, -2209, -2046, -322, 268, -40, -277, 107, -98, -1079, -585, -375, 820, 1143, 1198, 1702, 2447, 1842, 665, 160, 461, 250, -321, -207, 306, 489, 240, -1039, -1098, -1262, -1674, -2614, -1769, -889, -530, -257, -304, 589, 845, 88, -323, 175, 953, 995, 1351, 1799, 2342, 1878, 970, 463, 110, -319, -1141, -995, -213, 429, -463, -772, -835, -976, -1543, -2250, -1997, -847, -457, -419, 232, 1311, 1389, 801, 433, 207, 721, 721, 533, 1282, 2302, 2172, 1030, 493, 409, -413, -1213, -1376, -1294, -716, -640, -996, -653, -255, -1362, -1592, -1679, -1225, -624, -138, 168, 1055, 2136, 1184, 826, 1177, 1251, 180, 290, 861, 1390, 1491, 1085, 525, 264, -25, -1507, -1786, -1442, -1432, -1276, -1027, -423, -187, -524, -1208, -1137, -814, -698, -471]
2144d71O69J023P01l38J20r1n25l51q45M09N97m3m64L16j7q59j136j24m34j99
2164b062M43p2R49O42j40k78L06o6m2P5M68R48L75j63J59J90q2j086l42k7k48
2185e3m8K31J70k67m06n58m46lj32m78O32P10N02L00j92P4O02k64p70N47R11m7
2207A015J67N00J89n76m27o16j54k48j80l40M35K54m53k78k8n44n7k66j43Q68
2227h82O46J39N1J076K81r34j64K8J69K65L94J96N05j68r49l82l47k79p27M7L56
2248f79J87J85l29r8M7l52n69K44R34R3L81J50M02O30q5o32j34M68o62l67R64
2269G78L68q2n57j87m9l09q54n99N52O7J64rM09o8q5n08j63L41L37j6N84Q54K58
2292A226K4l41o5j27m07J2p1M20J86l86m8j75j78r38j77j40K07K08J60K33N18
$$ y = [-471, 198, 1221, 1922, 1584, 1704, 1613, 1088, 737, -108, 301, 898, 855, 391, 707, 690, -169, -1305, -1429, -1863, -2062, -1619, -1691, -742, -100, -240, -518, -212, -278, -320, -245, 223, 1171, 1546, 1383, 1542, 1732, 1650, 564, 222, 195, -53, -101, 130, 300, 33, -373, -931, -1377, -1380, -1512, -1990, -1358, -648, -146, 154, -38, 36, 638, 374, -396, 151, 1062, 1015, 1182, 1682, 1871, 1295, 868, 252, 98, -150, -330, -670, -235, 19, -434, -712, -740, -1284, -1341, -1607, -1750, -882, -236, -97, -46, 1030, 1311, 377, 213, 241, 410, 675, 1069, 1265, 1770, 1602, 653, 271, -76, -355, -1082, -1035, -679, -492, -307, -636, -734, -687, -1039, -1608, -1364, -430, -337, 44, 194, 596, 1226, 1141, 509, 375, 843, 181, -186, 778, 1146, 1064, 507, 320, 271, -38, -892, -1491, -939, -872, -708, -717, -308, -376, -461, -969, -1132, -791, -454, -470, 114, 968, 1226, 1250, 909, 844, 717, 310, 322, 251, 671, 857, 471, 423, 248, 70, -868, -1045, -1185, -978, -770, -610, -377, 141]
2313A41M6n04k26M38j07j52L40P61K70K03j91j97J13m50m94j13M13n8J2j20O4
2334A89N6q95k59J4k23K18j21O11M27K20m21j25K58O5l81J14O17L50R1L17k07
2355I15K83o95l14p09K84J13l56L97L68L5p16k67l4j20l42OL49R35K37m25K09
2376A53J69j49j40j48J95K81K85L7L75q7k93r07mj75p9j02P8O79o3J67p20j32
2398e80K20p48J87J05M46M92n4M12L14k07m24n9q9K99K9M6K67L20k19m04n08J02
2420e3m45j03p4K72K85P9k10j63J74l42j25j04K77L06N62OL67m8l63j5n8j88M8
2443H5J5L74N39j72m65q1l10l29m21j28L58MN60m5l14K48L9m01k52M68nL08K09
2466B84L50K91m49k06J38n3j19n5p3O81n37J97j55j43j7o48k12j03M03K21J41
$$ y = [141, 187, -317, -543, -105, -212, -364, -24, 737, 1007, 1210, 1019, 822, 935, 485, -9, -122, 291, 233, 245, 125, 189, 245, -650, -909, -895, -1118, -900, -1021, -410, 17, 237, -184, -309, -51, 14, -367, -253, 364, 714, 805, 1122, 915, 1198, 503, 189, -520, -236, -123, -479, -82, 286, 321, -395, -662, -696, -816, -1158, -1152, -803, 132, 369, -56, 153, 322, 173, 33, -115, 80, 361, 646, 683, 1058, 971, 678, -229, -233, -408, -487, -589, -511, 168, 105, 272, -448, -580, -360, -1108, -921, -816, -370, 122, 68, 480, 794, 587, 163, 104, 15, 314, 343, 389, 656, 976, 757, 353, -155, -53, -498, -601, -675, -403, -118, -39, -249, -412, -238, -580, -705, -809, -532, -226, 336, 342, 709, 661, 298, 283, 225, 37, 85, 100, 474, 1013, 841, 376, 295, -15, -344, -765, -893, -535, -531, 29, -16, -330, -82, -43, -444, -696, -228, -233, 75, 284, 634, 925, 476, 270, 408, 355, 236, 181, 108, 789, 252, 449, 294, 151, 134, -514, -726, -829, -426, -205, -64]
2487f4j36L89o4k94l6k92K67l5L66J66N35r3k9j36m12K0m11P3M41l7q6J99j03
2510B28r3l67l17k10K19O8OM61K35j12k02K24l23m3%J56K64K04K16r4K58k86k56
2533B36k60l96L07J60P6J31M6m2o62Q5k91k28K72RJ41M99J73P9m9l91J95k21m5
2556a76l8M16L45rk09K98q4m89k44k70J83J04J90mJ99j78k72j94k03j85K54J09
2578d57L60J26N0J13J26j66m26K79K1J67K79Q7O7k29k5l7k30l54j58K54l8N62
2600C71m91L78j48m01KJ49m72n7L60L19N9K84J1O0l90ln8k92K60K54K9J62j0j99
2624A77J34l95k99N1k12o6K96L60j45L8Nk62M6j33R2l1L85K34q6M01p3k30j51
2647A36m35J52J31K13K5j60K23j45k42k92J72k69M4P0M07l8l2J94K4j48n29M94
$$ y = [-64, -200, 189, 125, -169, -205, -497, -230, -265, 101, 267, 802, 709, 680, 544, 132, 152, -259, -186, 255, 218, 132, 331, 228, 135, -232, -549, -759, -540, -472, -466, -5, 230, 118, -84, 140, -183, -226, -226, -70, 194, 398, 614, 520, 778, 492, 236, -24, -420, -113, 47, 123, 254, 300, 258, -404, -319, -610, -838, -566, -557, -416, 83, 256, 335, 286, -105, 90, -131, -176, -214, 202, 547, 538, 329, 627, 543, 54, -190, -460, -277, -173, 17, 13, 212, 34, -238, -432, -635, -820, -566, -457, -97, 29, 79, 192, 318, 152, -274, 5, 26, 193, 472, 559, 626, 397, 372, 335, 105, -249, -407, -153, -191, 371, -120, 258, 110, -291, -289, -140, -612, -669, -309, 10, 69, 353, 364, 424, 34, 31, -27, -319, -59, 195, 224, 386, 376, 177, 311, -84, -383, -332, -544, -610, -314, 46, -99, -61, -56, -318, -272, -405, -313, -344, 41, 275, 189, 590, 517, 287, 136, -299, -147, -16, 197, 222, 62, 285, 140, -102, -394, -222, -491, -447, -377, 30, -8, -40, 154, 178, 30, -499, -5]
2669en1j26N65J08j98q1M85n54n6K2o19K70P4L36j16K66n63J8j86l6n9O7N2L99
2693A2N0K06k39Q1j23k60L40q8q5J72K56K27j83k1k68k14Qk4j73O5M48l7l2j44
2717b6k22k89P3K49j79M92L9J6L02J15l10n13K27k65K62J45K01j70M14j79r2k16
2739G4r3l83R7J6K95M4rN8j72N37j055mJ69J76L36K2j6L53O3n3k49p4j85O7k30
2764b16J39M27j38Qk98j46M3k60JK94k22K98J84M0l3j91n2r1o0K70rJ14L98J02
2788F02m27M0j38k20O6m1l9L09j68J09j77O0l04K10m49J85J84K23j57L55o1Kl01
2811a37p4K64j46J59j0M11K6R7k74J71k94l07k82J28J3L63J11j11n5l41j12K7
2833c73j46P6K31K05j36L81J13k27j43J81l68R0K82M8K48k09K56j23l55J13l67
$$ y = [-5, -56, -182, 383, 491, 293, 212, 697, 143, 87, 109, -510, -240, -166, 170, 54, 320, -243, -225, -411, -447, -506, -439, -387, 12, 62, 268, 29, 110, -13, -273, 67, -21, -106, 66, 322, 549, 366, 345, 77, -137, -129, -153, -326, -261, 187, 150, 118, -26, -248, -537, -464, -215, -394, 98, 137, 153, 455, 570, 260, -253, -26, -291, -29, 116, 317, 147, 561, 382, 290, 74, -19, -402, -305, -289, 6, 50, 41, 99, -73, 464, -591, -595, -426, -250, 86, 108, 92, 445, 508, 455, 206, 132, -53, 14, -216, -77, 350, 212, 220, -78, -224, -181, -441, -440, -146, -368, -70, 114, 154, 121, -70, -122, -213, -273, -3, -12, 102, 500, 602, 175, 215, 77, -143, -77, -118, -157, 152, -16, 93, -84, -24, -328, -118, -567, -382, -198, 25, -132, 223, 162, 164, -137, -211, 53, -93, 66, 56, 467, 493, 590, 316, 487, 193, -114, -396, -268, -255, 108, 219, 108, 53, -288, -400, -373, -519, -443, -212, -7, -143, 238, 351, 124, -19, 162, -206, -116, 166, 214, 462, 253, 509, 386, 31, 144, -223]
2854b23k93L91J3K25r4l07L57l30j89J61J41j85J77o4N97lk85M09l27j0j7m14
2876b70K22L34k7J14J12k45J01m50M2k91J09M3j09J8K57Q3r4k05OK6j6o4M47K69
2900D12l68J30K0K16l60K80j91r2J29n1J05Q3n58M82p54R1K01o4k97M76q8K44
2922D6k1j06j76N2o6j0J67M23L6o9J91Lk26J16m10n0JK09r1nJ54j85j03j74K5
2947b69j19j02Q8L03K07J71k11n3L01m25j09K28R5K44P9o4J23R4p0m59O0l86Q2
2970a92oo6L76k13j08j38k2k49O6K72j66M62j26K05J43j5o8J07O3l5k11K72J39
2993D90j32j50R5m4l78p9k43J09M5K79Lq6K30n24J18J4k89L11K81j07J38L84K0
3016D85m2mo8l86L24r7k8MJ57j03l41O7j68k85J38J98l11M34p5j86K60J22j51
$$ y = [-223, -516, -125, -112, 113, 19, -288, 69, -261, -450, -289, -148, -333, -156, -220, 377, 374, 89, 498, 171, 161, 144, -270, -48, 286, 259, 373, 485, 240, 341, -109, -67, -358, -249, -206, -315, -297, -40, 43, -51, -256, -250, -224, -240, -304, 143, 412, 44, 174, 194, 410, 50, 330, 139, 47, 176, 125, 230, 313, -245, 237, -517, -426, -225, -289, -586, -110, -198, 46, 25, -81, -257, -205, -271, -281, -114, 309, 345, 276, 467, 470, 244, 360, -50, -100, -99, 110, 19, 14, 168, -17, -120, -294, -269, -388, -490, -402, -99, 108, 279, 68, 15, 316, -109, -218, 10, 105, 349, 428, 364, 487, 581, 511, 52, 112, -274, -192, -198, -264, 112, -101, -209, -347, -369, -618, -552, -280, -446, 16, -110, 95, 238, 223, 155, 262, 325, 290, 79, 351, 490, 358, 208, 303, 259, -119, -198, -441, -332, -287, -8, -5, -91, 139, -385, -267, -253, -542, -231, 50, -57, 81, 465, 485, 443, 439, 371, -15, 309, 212, 184, 188, 345, 242, -99, -32, -200, -485, -347, -149, -460, -26, -101, -287, -27, 95, -56]
$$ [...]
8191a44
##END NTUPLES=NMR FID
##END=
