##TITLE=1H_DE10+11k2TFA
 DMSO-d6
 8 sc, 
 8.9.2023
##JCAMPDX= 6.0         $$ Bruker NMR JCAMP-DX V2.0
##DATA TYPE= NMR FID
##DATA CLASS= NTUPLES
##ORIGIN= UXNMR, Bruker Analytische Messtechnik GmbH
##OWNER= root
$$ XWIN-NMR		Version 3.5
$$ Fri Sep  8 14:11:50 2023 Russian Standard Time (UT+4h)  she@DPX200
##.OBSERVE FREQUENCY= 200.13135
##.OBSERVE NUCLEUS= ^1H
##.DELAY= (6, 6)
##.ACQUISITION MODE= SIMULTANEOUS
##.ACQUISITION SCHEME= undefined
##.AVERAGES= 8
##.DIGITISER RES= 18
##SPECTROMETER/DATA SYSTEM= spect
##.PULSE SEQUENCE= zg30
##.SOLVENT NAME= DMSO
##.SHIFT REFERENCE= (INTERNAL, DMSO, 0, 15.7039)
##AUDIT TRAIL= $$ (NUMBER, WHEN, WHO, WHERE, WHAT)
$$ ##TITLE= Audit trail, XWIN-NMR		Version 3.5
$$ ##JCAMPDX= 5.01
$$ ##ORIGIN= Bruker BioSpin GmbH
$$ ##OWNER= she
$$ F:/spectra/data/she/nmr/H-F/1/audita.txt
$$ ##AUDIT TRAIL=  $$ (NUMBER, WHEN, WHO, WHERE, WHAT)
(   1,<2023-09-08 14:10:52.03 +0400>,<she>,<DPX200>,
      <created by zg, POWCHK disabled, PULCHK disabled
       configuration hash MD5:
       00 E9 B6 7A A2 85 ED C7 34 08 36 98 17 FE 4E 26
       data hash MD5: 16K
       EC 39 6B 9E 86 3B DD 9B 00 A6 4C AA F0 88 4C 1C>)
$$ ##END=
$$ 
$$ hash MD5
$$ B0 B2 24 C0 57 51 FD 0B 76 31 4D EA 76 80 16 E8
##$RELAX= 
##$RELAX= 
##$RELAX= 
##$RELAX= 
##$RELAX= 
##$RELAX= 
$$ Bruker specific parameters
$$ --------------------------
##$DU= <F:/spectra>
##$EXPNO= 1
##$NAME= <H-F>
##$PROCNO= 1
##$TYPE= <nmr>
##$USER= <she>
##$AMP= (0..31)
100 100 100 100 100 100 100 100 100 100 100 100 100 100 100 100 100 100 
100 100 100 100 100 100 100 100 100 100 100 100 100 100 
##$AQSEQ= 0
##$AQ_mod= 1
##$AUNM= <au_zg>
##$AUTOPOS= <>
##$BF1= 200.13
##$BF2= 200.13
##$BF3= 200.13
##$BF4= 200.13
##$BF5= 200.13
##$BF6= 200.13
##$BF7= 200.13
##$BF8= 200.13
##$BYTORDA= 1
##$CFDGTYP= 0
##$CFRGTYP= 5
##$CHEMSTR= <none>
##$CNST= (0..31)
1 1 145 1 1 1 1 1 1 1 1 1 1 1 1 1 1 1 1 1 1 1 1 1 1 1 1 1 1 1 1 1 
##$CPDPRG= <>
##$CPDPRG1= <>
##$CPDPRG2= <>
##$CPDPRG3= <>
##$CPDPRG4= <mlev>
##$CPDPRG5= <mlev>
##$CPDPRG6= <mlev>
##$CPDPRG7= <mlev>
##$CPDPRG8= <mlev>
##$CPDPRGB= <>
##$CPDPRGT= <>
##$D= (0..31)
0 1.2 0 0 0 0 0 0 0 0.06 0 0.03 0 0 0 0 0.0002 0 0 0 0 0 0 0 0 0 0 0 0 
0 0 0 
##$DATE= 1694167851
##$DBL= (0..7)
120 120 120 120 120 120 120 120 
##$DBP= (0..7)
150 150 150 150 150 150 150 150 
##$DBP07= 0
##$DBPNAM0= <>
##$DBPNAM1= <>
##$DBPNAM2= <>
##$DBPNAM3= <>
##$DBPNAM4= <>
##$DBPNAM5= <>
##$DBPNAM6= <>
##$DBPNAM7= <>
##$DBPOAL= (0..7)
0.5 0.5 0.5 0.5 0.5 0.5 0.5 0.5 
##$DBPOFFS= (0..7)
0 0 0 0 0 0 0 0 
##$DE= 6
##$DECBNUC= <off>
##$DECIM= 32
##$DECNUC= <off>
##$DECSTAT= 4
##$DIGMOD= 1
##$DIGTYP= 9
##$DL= (0..7)
0 120 120 120 120 120 120 120 
##$DP= (0..7)
150 150 150 150 150 150 150 150 
##$DP07= 0
##$DPNAME0= <>
##$DPNAME1= <>
##$DPNAME2= <>
##$DPNAME3= <>
##$DPNAME4= <>
##$DPNAME5= <>
##$DPNAME6= <>
##$DPNAME7= <>
##$DPOAL= (0..7)
0.5 0.5 0.5 0.5 0.5 0.5 0.5 0.5 
##$DPOFFS= (0..7)
0 0 0 0 0 0 0 0 
##$DQDMODE= 0
##$DR= 18
##$DS= 0
##$DSLIST= <SSSSSSSSSSSSSSS>
$$ [...]
##$SUBNAM2= <"">
##$SUBNAM3= <"">
##$SUBNAM4= <"">
##$SUBNAM5= <"">
##$SUBNAM6= <"">
##$SUBNAM7= <"">
##$SUBNAM8= <"">
##$SUBNAM9= <"">
##$SW= 18.05172834244
##$SWIBOX= (0..15)
0 0 2 0 0 0 0 0 0 0 0 0 0 0 0 0 
##$SW_h= 3612.71676300578
##$TD= 16384
##$TD0= 1
##$TE= 0
##$TE2= 300
##$TE3= 300
##$TEG= 300
##$TL= (0..7)
0 120 120 120 120 120 120 120 
##$TP= (0..7)
150 150 150 150 150 150 150 150 
##$TP07= 0
##$TPNAME0= <>
##$TPNAME1= <>
##$TPNAME2= <>
##$TPNAME3= <>
##$TPNAME4= <>
##$TPNAME5= <>
##$TPNAME6= <>
##$TPNAME7= <>
##$TPOAL= (0..7)
0.5 0.5 0.5 0.5 0.5 0.5 0.5 0.5 
##$TPOFFS= (0..7)
0 0 0 0 0 0 0 0 
##$TUNHIN= 0
##$TUNHOUT= 0
##$TUNXOUT= 0
##$USERA1= <user>
##$USERA2= <user>
##$USERA3= <user>
##$USERA4= <user>
##$USERA5= <user>
##$V9= 5
##$VALIST= <valist>
##$VCLIST= <CCCCCCCCCCCCCCC>
##$VD= 0
##$VDLIST= <DDDDDDDDDDDDDDD>
##$VPLIST= <PPPPPPPPPPPPPPP>
##$VTLIST= <TTTTTTTTTTTTTTT>
##$WBST= 1024
##$WBSW= 4
##$XGAIN= (0..3)
0 0 0 0 
##$XL= 0
##$YL= 0
##$YMAX_a= 105085
##$YMIN_a= -125449
##$ZGOPTNS= <>
##$ZL1= 120
##$ZL2= 120
##$ZL3= 120
##$ZL4= 120
##$ABSF1= 10
##$ABSF2= 0
##$ABSG= 5
##$ABSL= 3
##$ALPHA= 0
##$AQORDER= 0
##$ASSFAC= 0
##$ASSFACI= 0
##$ASSFACX= 0
##$ASSWID= 0
##$AUNMP= <proc_1d>
##$AZFE= 0.1
##$AZFW= 0.1
##$BCFW= 1
##$BC_mod= 2
##$BYTORDP= 1
##$COROFFS= 0
##$CY= 11.3945322036743
##$DATMOD= 1
##$DC= 2
##$DFILT= <>
##$DTYPP= 0
##$F1P= 15.7292609196834
##$F2P= 12.9074282941183
##$FCOR= 0.5
##$FTSIZE= 0
##$FT_mod= 4
##$GAMMA= 1
##$GB= 0.15
##$INTBC= 1
##$INTSCL= 1
##$ISEN= 128
##$LB= 0.24
##$LEV0= 0
##$LPBIN= 0
##$MAXI= 10000
##$MC2= 0
##$MEAN= 0
##$ME_mod= 0
##$MI= 1.114404
##$NCOEF= 0
##$NC_proc= 0
##$NLEV= 6
##$NOISF1= 3.799351
##$NOISF2= 2.8
##$NSP= 1
##$NTH_PI= 0
##$NZP= 0
##$OFFSET= 15.70392
##$PC= 1
##$PHC0= -21401.24
##$PHC1= 10.45271
##$PH_mod= 1
##$PKNL= yes
##$PPARMOD= 0
##$PSCAL= 0
##$PSIGN= 0
##$REVERSE= no
##$SF= 200.130013532006
##$SI= 16384
##$SIGF1= 3
##$SIGF2= 2
##$SINO= 400
##$SIOLD= 16384
##$SREGLST= <1H.CDCl3>
##$SSB= 0
##$STSI= 0
##$STSR= 0
##$SW_p= 3612.71676300578
##$SYMM= 0
##$S_DEV= 0
##$TDeff= 0
##$TDoff= 0
##$TI= <>
##$TILT= no
##$TM1= 0
##$TM2= 0
##$TOPLEV= 0
##$USERP1= <user>
##$USERP2= <user>
##$USERP3= <user>
##$USERP4= <user>
##$USERP5= <user>
##$WDW= 1
##$XDIM= 8192
##$YMAX_p= 0
##$YMIN_p= 0
$$ End of Bruker specific parameters
$$ ---------------------------------
##NTUPLES= NMR FID
##VAR_NAME=  TIME,          FID/REAL,        FID/IMAG
##SYMBOL=    X,             R,               I
##VAR_TYPE=  INDEPENDENT,   DEPENDENT,       DEPENDENT
##VAR_FORM=  AFFN,          ASDF,            ASDF
##VAR_DIM=   8192,          8192,            8192
##UNITS=     SECONDS,       ARBITRARY UNITS, ARBITRARY UNITS
##FACTOR=    0.0002768,     1,               1
##FIRST=     0,             0,               0
##LAST=      2.2672688,     0,               0
##MIN=       0,             -125449,         0
##MAX=       2.2672688,     105085,          0
$$ Real data points
##PAGE= N=1
##DATA TABLE= (X++(R..R)), XYDATA
0@%%%%%%%%%%%%%qJ6j6J6j6K4l2L2m0N1n9P2q8J00j11J31j52J71j95K22k51K85
35A52l22L60m01M47n03N63o24O91p65Q47r36J033j139J256j385J524j677J850
53I71k044K258k495K765l079L443l867M374m991N761o758Q101j0015J2986j8257
68a0847L0367j08490l6479J42348q8381L7719R9475l1311N9P0625p4398j0434
80B0253P3400m9071l9732P3969k2220l5592K9582m5001m1680M2488m7671n1659
92i2934O1833P581m0186M0781P314j7667L6190k1650l3924O4442M098m9903N4695
105B0670L1934m2542L1288J1608n3438L0867J7368p2162J9170M9482n1238l775
117a0768M0659l6702l808K6658n3734p094N2959l9520k6077O0048k068k6144L2539
$$ y = [0, 0, 0, 0, 0, 0, 0, 0, 0, 0, 0, 0, 0, 0, -8, 8, -8, 8, -8, 16, -16, 16, -24, 27, -32, 40, -48, 52, -59, 72, -80, 91, -104, 118, -133, 152, -170, 190, -211, 236, -267, 296, -328, 363, -402, 445, -491, 542, -597, 659, -726, 798, -879, 971, -1073, 1185, -1310, 1455, -1624, 1819, -2048, 2326, -2665, 3096, -3662, 4439, -5576, 7410, -10847, 19520, -88970, -125449, 16899, -71482, -33763, 65712, 34401, 34460, 105085, 30687, 20253, 93653, 44582, 4850, 78819, 56599, 21007, 50589, 5588, -36092, 6396, -41275, -92934, -31101, -23520, -63706, -22925, -15611, -33278, 2912, -18738, -52662, 11780, 15878, -34025, 20670, 52604, 10062, 41350, 52958, -480, 30387, 47755, -24407, -5237, 44245, -6993, -10768, 29891, -6811, -10619, 16039, -37695, -44789, 8170, -31350, -57427, 2621, 553, -25591, 6948]
130F948o981j7387L0924j6663k4482M4250P729k4607K8270Q202j8943J7241j5289
143A9212l2870K9538L07m1703K3585K1603k9855O194N357l1236J2268P581l9705
156d9724J7668L7983k5674K362L6098j5272m295K0487k3655j917L5073j7494j3758
169b118L7363j653k3361J1746q959j7945J1108j4248j9503K5149L395k3495J2493
182a0028P949j5587M410k926j1503K0562O130j5684J9899J8383j4493M784P017
195A8913j4074P805M754k1781J0682K0392k1007n109J6970j4264j1145O320j5688
208a7232l160J7715j2170q331K4372j0j5151J0052J152p834R232j273n474J9002
222A0890O163j2545Q395P331j1375k188j474o920P255P80j1539P829P878j2941
$$ y = [6948, -33, -17420, 13504, -3159, -27641, 16609, 24338, -269, 28001, 36203, 17260, 34501, 19212, -13658, 15880, 16187, -25516, -1931, 19672, -10183, -3989, 1368, -29868, -17600, -10019, -49724, -32056, 5927, -19747, -17385, 18713, 3441, -854, 19633, -4022, -5939, 29134, 11640, -2118, 35245, 33592, 10231, 21977, 13018, -4927, 6181, -8067, -27570, -2421, 974, -22521, -10028, -2079, -17666, -13256, -16182, -27685, -7123, -993, -16677, 3222, 21605, 7112, 11896, 18913, 4839, 12644, 17398, -4383, 6299, 26691, 5684, 575, 17545, 3281, -7864, -1544, -17232, -20392, -2677, -14847, -23178, 1194, 1184, -13967, -3915, -2763, -10597, -1365, -2638, -8112, 10890, 17053, 4508, 12903, 20234, 8859, 6671, 5197, -1723, 5532, 6312, -5227, 2602, 10480, -2461]
236b461m108K556q301O71J629q199Q735J3061r111l48J2631n081n652N639l786
251b125J454J1654m634k757J4387j879j2863L321n22q627J182j252m357Q175J728
266B885r903K397M341q265m115K590J16L989L784j527N916O867m758l100L281
281D498o57r19J73m61N442M196o174k025L528n414o516l67j899Q7L587k741p04
298f366P335j999p295K473K506l421J486L244J881N659K573l926J411L520m993
313D088m367K275J680n53L38P6P03J16m280m888j14J41k475j221K698L929N96
330a258j554O04J909j240k149N52K941K773J552J55K242K589k452m100m53O46
346B757k196j956J409J708L79j699k319p59m31k803k509J818L134K04O48K943
$$ y = [-2461, -6569, -4013, -12314, -11643, -10014, -18213, -9478, 3583, -5528, -5876, 6755, 1674, -3978, 1661, -2125, -671, 10983, 6349, 3592, 17979, 16100, 3237, 6558, 6036, -2591, -1409, -2661, -7018, 1157, 2885, -7018, -4621, -280, -8545, -12660, -10070, -9954, -5965, -2181, -3708, 2208, 9075, 4317, 1217, 4498, 3841, 2922, 3095, 2634, 8076, 12272, 6098, 4073, 7601, 2187, -4329, -4696, -6595, -6508, -2921, -5662, -6366, 969, -1030, -8325, -5852, -3346, -6767, -5281, -2037, -156, 5503, 8076, 4150, 5561, 9081, 4088, -279, 1996, 3676, 3123, 3461, 3537, 4240, 4356, 76, -4812, -4926, -4785, -7260, -8481, -5783, -1854, -1258, -2812, -2208, -299, -1539, -3688, -3136, -195, 2578, 4130, 4285, 6527, 9116, 6664, 2564, 2111, 2757, 561, -1395, 14, 1722, 2101, 402, -1917, -2676, -3107, -5910, -8419, -6601, -3467, -3263, -2615, 328]
362C28J850o26r40j135P20K075m17o87L880K360k015j359J40j952k230j886j674
379c568J429J872j702m92K404j040l009p34j05O24J068J60K116L812O64j272N21
396B748N7p46j016r68J447K720o37j411K089o72l531j176j550j196J669n88j528
413d289L814J693l706l6J707k204l58J596p55K497L503j829L51L469j973k788
429F92Q06j56q96J244o65r1K669j316l410N38o19k134j1q62P10K744m66j161K946
448E62L84l237R34P38j062K300J306j180L451J605l768K3J713l571j172J684j764
465a054J018K524k753j096K713l029l096J779l87o22K601M06k42L390l05k921
481a074J913L85k170J443J162k07K385N4k491J726j54m161j55J170j843P18J199
$$ y = [328, 2178, 1552, 612, -523, 197, 2272, 1855, 1168, 5048, 7408, 5393, 4034, 4174, 2222, -8, -1894, -3568, -2139, -267, -1969, -2461, -57, -1097, -4106, -4840, -4945, -4321, -3253, -3093, -977, 2835, 3499, 2227, 2748, 2805, 2059, 1043, 75, 1522, 4242, 3605, 2194, 4283, 3611, 80, -1096, -2646, -3842, -2173, -2761, -4289, -475, 1218, -2488, -2524, -817, -3021, -3379, -1783, -2538, -41, 3462, 1633, 1984, 5453, 3480, 692, 1498, 1342, 446, 1690, 1025, 934, 3603, 2287, -1123, -585, -1204, -3338, -3349, -4211, -3501, -757, -1223, -2384, 562, 946, -2291, -1357, -619, -1681, 619, 1925, 745, 4196, 5801, 2033, 2056, 3769, 198, -974, 710, -1054, -36, 2488, -265, -1361, 1352, -1677, -4773, -2994, -3381, -4003, -1402, -996, -1238, 2152, 1847, -1074, 839, 1224, -946, 497, 1659, 1452, 3837, 3891, 1400, 3126, 2972, -1189, -1344, -174, -2017, -1299, -100]
498a00j618J261J317l520m62K219j995m45K783m32P43K978j589p27K833j756k611
515a121K655J63j496J943l1j422J809q91l333J265J23k388N71J449j227J444M50
532c7j623J064P60k557M11K036j049J221J825r54J173R49k533j02J643k169n93
549e35K215j051j81J833j941j471J610j782k316J889L04j178K256L06j042J678
565E94k98k201J562O93j297J337J754q23R31N13j597J62K54k439K98J211j154
582e00N27R04j387J47L73k322m44J392r96K20K089l81K62J651j069q99J708r45
600C30j191K283n4p57J770k07j438O66l37k192N04K72j349N75R95p96N27K93j659
619a765L42Q03j478L63J917n45O98J582r87l1Q91j339o86J439o89l11J431m69
$$ y = [-100, -1718, -457, 860, -2660, -3122, -903, -2898, -3343, -560, -992, -249, 2729, 1140, 413, 3246, 1490, -1121, 1534, 1697, 201, 2144, 2113, 691, 2500, 1609, -1724, -459, -336, -2724, -2153, -704, -1931, -487, -37, -1660, -596, 164, -2393, -1982, 54, -995, 226, 2051, 1097, 2270, 3219, 686, 584, 2227, 58, -535, 1680, 629, 448, 2281, 340, -1131, 479, -1303, -3619, -1730, -1426, -2604, -348, -42, -1084, 594, 296, -1905, -343, 350, -947, 390, 2144, 1321, 2252, 2765, 1168, 1330, 1584, -855, -557, 654, -500, 27, 931, -456, -309, 64, -2258, -2702, -1310, -2306, -2086, 3, -378, -116, 1535, 466, -433, 1275, 330, -861, 1422, 1368, 611, 2381, 2174, 736, 1402, 1065, -1127, -623, -351, -1700, -1125, -130, -926, -399, -106, -1765, -1423, -620, -2098, -1735, 182, -363, 335, 1917, 930, 899, 1790, 451, -235, 1204, 515, 204, 1635, 1166]
637A166n04P67j407j298J366j105j419J514J51q28J571J01j353J001J2j334Q62
654g37J054p87J035J314r66N47O91j619l11R92j296j76J002m51j96P34j129l34
672f33R0q74p41J069j6l99J626l14p0R77n78j010J250j25o63J388M68o85P21K75
692A756j423M49q6j424J70O86o68m3P60q32J8K85r25k20N51k51J79J188J26q2
712B14P18m30k96M12k08l60P89K74n53P40q9p90M59p12r00J58j8n27P27J77n63
733g78K13J83n99O9K24l09L22Q81m0N42L32l33K0L90p92k06O09k77J8L17r3m77
755B16Q4m05p94J07j82m73K76P61o5J09K92j20k11J33j63J75L87K86M00J86mJ22
777A117k21o09R7O3p21K98M02k29k82J16m87l39J49n16n3N22J28J82K47M51j45
$$ y = [1166, 662, 1429, 22, -1276, 90, -1015, -2434, -920, -769, -1597, -26, 75, -1278, -277, -265, -1599, -737, 317, -470, 565, 1879, 913, 1460, 2151, 532, 221, 1213, -83, -259, 743, 292, 96, 830, -299, -633, -543, -1417, -2158, -1089, -1105, -1504, 122, -192, -262, 715, 137, -873, 377, 252, -411, 977, 1445, 760, 1481, 1756, 333, 782, 696, -728, -558, 128, -540, -583, 177, -655, -637, -352, -1277, -1497, -946, -1197, -1018, 170, 296, 214, 932, 502, 206, 618, 410, 50, 839, 1113, 560, 1300, 1211, 421, 880, 168, -732, -574, -592, -1119, -392, -215, -778, -565, -382, -981, -912, -688, -997, -675, 206, 166, 708, 1040, 707, 727, 1117, 325, 119, 728, 451, 469, 786, 693, 216, 300, -105, -899, -792, -974, -1447, -1171, -410, -475, -366, -74, -194, -405, -272, -435, -260, 127, 413, 813, 999, 995, 1117, 896, 287, 384, 447, -274, 24, 426, 197, -85, 31, -456, -795, -646, -1162, -1215, -693, -565, -383, -136, 315, 170]
798A70L90m85k04L35J10J00R4M07L6o7o2l79l36j18l53P1r4j7J34K00j94k93J57
821c98n32O1M92k31M41J96P0M16Nn6l21K71j00k39K43K33K6R2j20j95k55k84m01
844e86L4Nl0P0J25P9Q0Pk07P6N4L4J82J11M85r1L72j75q8j30k07m2n7J53J17j60
870B11K6p9l13k73k00j2lo6R0L84Q1J17k08J51j34L8J42q8L44J35J77L39j50l0
894F79k20l60J1r6lj28M38r8m97j95K65j82k16j43J05J75K00L98k21J92R1pj52
917C6K98l03K63L5K3K23K77l53k76M4l51m1J07l15J04J20k42O7O2m37Q4K69k95
940f01K33M93m4K7L71O6k17J91j57l37J3K91l15M70m9l13M0K8l70j18K9n20M26
963c63Q7j69K28J97j85k59M48l02o0M47L4J40K65j00J23K31m22k28j57L14k31
$$ y = [170, 560, 75, -129, 206, 316, 416, 510, 917, 953, 886, 824, 445, 109, -9, -362, -291, -385, -402, -268, -68, -262, -555, -398, -930, -869, -377, -608, -167, 29, 99, 515, 520, 464, 143, 414, 314, 75, 318, 551, 577, 669, 549, 354, 99, -185, -586, -552, -547, -577, -507, -382, -303, -223, -216, -423, -347, -293, -259, -77, 34, 519, 428, 800, 625, 537, 407, 200, 158, 101, 254, 371, 211, 237, 158, -155, -428, -628, -640, -643, -709, -619, -235, -154, -37, -245, -94, -228, -190, -48, -136, 208, 343, 520, 859, 709, 679, 459, 99, 110, 14, 11, -117, 321, 223, -274, -469, -204, -386, -602, -745, -640, -465, -265, 133, -88, 104, 195, 188, 36, 334, 31, 294, 329, 352, 575, 852, 499, 223, 267, -84, -125, -18, -333, -229, -109, -351, -284, -222, -659, -575, -306, -601, -368, 125, 81, 108, 479, 545, 328, 519, 362, 25, 38, 329, 14, 484, 435, 122, 162, 190, -180, -298, -269, -789, -363, -276, -445, -217, -20, -205, -464, -16, -318, -378, 69, 103, 243, 508, 408, 531, 762, 340, 112, -45, 269, 38]
984C8K52l67J79p6L1m76K6j54M7R6pJ27J11K34m11L55J99m59J21J30J53O8K56
1007D73l81L89K41m53k47K68j41m62L45j01j52L66j11o2j67Pl25K11L8J00L09
1028A45j00J4M31j97l96J91P0l9K79J63l66M25l1n24r7J92m24L0K13k82J33K17
1050D7l08Q9J66l56j67K42K02p6K96M5qJ94r3j45J3P4j57J06R1j10K20k98L5P9
1074A81l88j2j25M67l84j14J54OP3J22j4k62J46j61oN26j82J54L42l05L4P4j58
1097A68l04L62j65k38L34rk29J23j11j90N3J76m12o6M09j10J30%j14L06mk37J06
1120b2L88j25o8J06J1n4K35k50k43O1p2k37L09m7j08K60l04j24Q3k0l96L96n0
1143b71J26j4K89r8J37j61j03J45K33p7L8K03k68J75n7j54k73J57l07pK23q7r0
$$ y = [38, 290, -77, 102, 26, 57, -419, -393, -547, -500, -404, -411, -284, -173, 61, -350, 5, 204, -255, -134, -4, 149, 217, 473, 92, 481, 722, 269, 22, 290, 149, -313, 32, -69, -221, 145, 34, -28, -195, -188, -513, -302, -264, -164, 145, 45, 59, 490, 293, -103, 88, 158, 119, 398, 561, 195, 620, 589, 65, -32, 160, -264, -234, -21, -303, -170, 47, -261, -172, -6, -362, -529, -287, -85, -161, 135, 180, 172, 366, 273, 128, 141, 215, 58, 164, 255, 145, 365, 67, 102, 181, -207, -219, -344, 123, -261, -375, -221, -215, -142, -20, -34, -296, -150, -311, -317, 209, 27, 181, 523, 218, 252, 326, 168, -136, 226, 61, -177, 157, 148, -81, 42, -69, -259, -206, -30, -442, -508, -99, -209, -79, -79, -193, 113, 109, -128, -22, 366, 241, 173, 279, 290, 236, 471, 221, -22, 39, -33, -270, 39, -8, -116, 144, -160, -284, -201, -221, -617, -221, -271, -145, -159, 130, 32, 169, 8, -95, 50, 283, 206, 244, 447, 179, 354, 297, 143, -130, 27, -280, -287, -64, -151, -241]
1166b41J87Q2k63P8q1o3K59j53L0L04Q9j95L13K5m03M1L19k54J08J27l5k8R2m11
1190g3N3J48j47l34L32k39J05K03j43j13J81J34l28L14j36j92L96N5j13L79k02
1211B80j36o9J42k46J49j93J7L43k42n9Q7p5m06K94j38m3J48Q7k06J29K75k17
1233g9K33j21j26K72J34j35k88L87r3q2J78k13j39K7N2j48k1J48j25K69k50k33
1255c53K01K3l09K26J7J78K08J32j54O3j0l04J65J19j45n1L89m03J31J57k44j08
1277g2L8l82J68M43l09j10J3K15k17J36J28m09M92k65KL84n7l08N08j06r2n7m8
1300I5N0m1J67k21J22jm14K63k4l20kL26j37k04L90k77N2K87k36p1J92n8M6K78
1324B62p3j05J89m7j82p1j36K45M0jk92J90J91k72m8j56R0Q2j92J11O0Q2L5pM2
$$ y = [-241, -54, 28, -235, -157, -238, -301, -42, -195, -165, 139, 228, 33, 346, 371, -32, 9, 328, 74, 182, 309, 274, 246, 338, -73, -20, 128, -19, -353, -21, -260, -155, 48, -95, -208, -27, 107, -221, 93, -43, -235, 161, 216, 103, 482, 280, 144, 75, 217, -29, 120, -73, -56, 287, 45, -14, 73, -2, -408, -114, -252, -295, -147, -60, -266, -137, 138, -79, 154, 33, -93, 179, 313, 178, -110, 277, 184, 102, 280, 67, -72, -45, 7, -141, -162, -14, -139, 130, -120, -353, -152, -129, -438, -212, -195, -17, 191, 323, 169, 232, 222, -82, 83, 202, 57, 6, 395, -8, 123, 280, 36, -72, -34, -416, -248, 195, -114, -224, -211, 4, -213, -77, 51, -358, 134, -131, -129, 255, 198, -110, 398, 292, 200, 143, 95, 145, 104, 271, 50, 172, 171, -243, 20, -4, -324, -326, 0, -137, -341, 49, -228, -176, 111, -125, -196, -4, -62, -16, 262, 189, 84, 273, 226, 44, -27, -163, 82, 122, 121, -171, 19, 210, -62, -110, -266, -176, -94, -286, -175, -115, -33, 2, -5, 37]
1349C7J10l13R3J22n5L15j36k34L53j80LO7q4j0p1K3j44J01j36J18Kq5n8m0P9
1374a23j10M7L24j03r7K65k13m7J02J9J69j53j8r0K14r3k07J93k9j60r6K08l4
1397c2j52R4j52J77k0j54J76O9k81K58R1k09K25j11m5J51K78l26L1O2Q2j04nK4
1421A27k12K58j91j83r8J62N5m5M3j64K64J16j91j22J21m5J99p4J44k60L02J49
1443C55j98L3j53o3J7J81j91j03J44m9J3o8K8k20J06L6L8N7l2M2j6M3K5Jk05j02
1469b81L32k46L01j3j5M0J93j56k01J62j64j02J69j76lL79k21o0k4J79k39P3Q3
1492A0l41L28j9k3O9J04l80J75K03k16RL54j35j13N5l8j57K34k19Q7j56m9J91
1515b7l3J47k13P5k29J36J29k2J0n9R1P9K19p2j66N4L2k21K47L9p1m2j47k9K89
$$ y = [37, 147, -166, -73, 49, -6, 309, 173, -61, 292, 112, 115, 182, 98, 88, 17, 40, -104, -3, -139, -21, -19, -104, -162, -202, -123, -233, -186, 138, 35, -62, 203, -10, -57, 45, 64, 233, 80, 62, -28, 186, 93, -114, 79, 50, -110, -206, 2, -32, -184, -90, -242, -65, -85, -239, -63, 6, -275, -17, 74, -135, 90, -21, -66, 85, 363, 37, 68, 130, 212, 108, 103, 127, -85, 173, -18, -201, -299, -137, -82, -127, -84, -248, 16, 132, -59, -181, -60, -105, 94, 20, 164, -96, 206, 355, 157, 190, 37, -26, -9, 172, -19, -122, 22, -27, -14, -82, -54, -274, -168, -132, -94, -37, -69, -27, -43, 0, 25, 26, -179, -281, 51, -195, 106, 93, 78, 118, 311, 155, -46, 116, -48, -150, 19, -157, -160, 219, -2, -62, -86, 93, -146, -73, 10, -331, -3, -22, -45, 24, 128, -252, -77, 126, -90, -81, 273, 138, 25, 80, 42, -115, 119, -100, -13, -169, -218, -27, -60, 87, -126, -51, -280, -144, -15, -37, -27, -86, 5, 84, 303, 231, 65, 119, 151, -70, 177, 216, 145, 103, -44, -73, 216]
1540B16j14m01J44Q8q9r0K38j42m6J44j26J90K2k44O2M35k13oO7o3o8J24P4k26
1564b4J27J24k09k0K4k22J15j12o7K00j7k44K10K31l96L83K3k87J68Q2k46J46
1586a1Jo6KK7J39J37k14J74k64L88j89m00K71l5n0K1J33k25J84o9j45K58j92P0
1610e5R5j1q4Q5K03l19K00k66M3J08M82m00J81j59j75K24j36k30L0K58q3j45j4
1633a68j7J32J63k69M1R0J37k34K09K1j9R1k22J34K04j29l07L05j99P3No9j36
1656a64L63j58j75J10Q2k80J97j04%J98j1j31p8J39j42LL60k54J76J68j04q6n
1679A04l0k09K18l06J82K15l02N6J4j25j32L35j12QK71j95p3J71P4k73P9K26k84
1702h8J19m8%N0J81l87K00N1j00J22J81m73J87N0k34K49N1j31p2P4j51j5L61l34
$$ y = [216, 102, -299, -155, -67, -156, -246, -8, -150, -196, -52, -178, 12, 34, -210, -148, 287, 74, 68, 135, 72, 4, 128, 202, -24, 103, 227, 18, -2, 22, -200, -85, -197, -264, -64, -81, -325, -115, 116, -280, 103, 126, -161, 7, 89, -157, -11, -10, -76, -74, -47, 92, 229, 15, 189, -75, 313, 124, -276, -5, -40, -90, -69, 64, -161, 23, -46, -191, 67, -125, -55, 40, 29, -55, 30, 233, -86, 114, -152, -109, -1, 481, 81, 262, 103, -72, 152, 16, -214, -184, 74, -9, -154, -168, -185, -53, 110, -159, -118, -28, 109, -125, 84, 105, 86, 177, -45, 89, 293, 164, -143, 162, -37, 36, 41, -28, -164, 199, 41, -134, -24, 58, -222, -25, -129, -129, 69, 58, -73, -151, -12, -154, -151, 209, -45, 131, 299, 195, 109, 104, 74, -135, 83, -223, -41, 174, -128, -72, -58, -183, -315, 20, -92, -84, 187, -8, -81, 90, 164, -109, -30, 196, -88, 31, -17, -17, 33, 214, -173, 27, 78, -22, 100, 281, -192, -5, 45, -189, 60, 111, -20, -92, -18, -169, -184, 177, -157]
1726a57K4N11k70j36K20k3j03P9q7n0J68J4j00Q6p1k29J18k8q5L39p2l23R4p1
1750a52l0J10M7j07M8l3j00K28j8l8J39P2k61J43J79N5j94o9l9J25rk93J70K63
1774B36k19J9n5j07O7Q1m3k64M83k48m5O6oJ18j30j02K66l1K19m32J26Q0j87J93
1798H5p6o8J72j91q8K77N1l97J65j3R3k17K68r6j21K51j43J7l4j29m9L74j83L0
1822b2M6m9M5J09j45m2OJ89l71K54P1j40P3j69K1K03k80M1J20n5J6K97k11j36
1846a29J9J53k47J06K57k10j0K08j88K22nl24N4K11l9l47K85j19J74j3k03J73
1868B8m0Q4k21N6R5j19Rj3JJ48M2kM7j5j26RJ07j95K94j30j54Q4K53k52j74O1
1894a23PJ83j97R2o6J65k9O8Oj25q0J49J45j74j66K70k00J67j5J6j56K02j74r1
$$ y = [-157, -133, 378, 108, -28, 192, 169, 66, 145, 58, 8, 176, 190, 90, 176, 105, -124, -6, -34, -119, 220, 148, -175, -81, -152, -182, -72, -25, -132, -84, -117, -217, 11, -7, -45, 94, 166, -95, 48, 227, 282, 88, 19, -20, 105, 96, -197, -27, 236, 17, 36, -19, -126, -59, 22, -21, -285, 198, -50, -95, -29, -35, 83, -47, -149, 117, 86, 305, -127, -1, 79, -108, 85, 9, -59, 113, -78, -166, 111, 162, -235, -70, -83, 10, -207, 61, -35, -156, 95, -48, -31, -65, -194, -243, 131, -52, -22, 24, -25, 20, 129, -16, -58, -52, 137, -234, 20, 91, -49, 24, -145, -124, 79, -201, -160, -40, -95, -79, 218, 7, -129, -110, 43, -204, -98, 159, -51, -61, 147, -41, 181, 176, -148, -94, 117, 78, -269, 16, -103, 71, 58, -145, 28, -12, 72, -149, -93, 2, -117, -108, -121, -120, 28, 70, 68, 115, 100, -26, -17, 90, -105, 189, 59, -95, -11, 242, -10, -184, -123, -116, 67, -130, -38, -104, 61, 32, 100, 106, -19, -99, 50, 195, 21, -145, 125, -75, 92, 77, 93, -63, 139, -35, -126]
1918a26R0K98j54j70k48N7L05j20O0n2J74k38J79k71K30P8l06J45J05R4o6j69
1940a05K69k36J77j04q3K17p9o0k44L98k39J27j32j8J57j16j16N4J35J5O0q3L3
1963B7k7l5n7K65M7j49k17K49O0j07l7J05Q9j65j49j4K73j42j45N4pO2j09n5K68
1988H4j21m8p3L88j48P2k97J79M8J2j86r2K00J78k25J87j49O5l74K86n3J7J1j25
2012a64J78k40J4Q1j30J84oK8J7k11K69J21j68R7M3j8k6k3n5K26j15jj01RR7j63
2038e7J73j83J85j62j16J94j64J91mkj04L43l93O9J41q4o8J09J60n0j14k12L95
2061B47lm95K70O5o8k15K45K3k56J31j10J20Q1L7k64R8k7J70j87l3m7J48O2j07
2085a15J65N4n4J32j41j54L04j29L5j24M9P6j55J07j62K1J45j4j05L2O2k76L58
$$ y = [-126, -36, 262, 108, -62, -310, -253, 52, -68, -8, -60, 114, -124, 55, -216, 14, 92, -214, -69, 36, 130, 64, -105, 164, -72, 105, 1, -82, 135, 56, -4, -248, 150, -89, 38, -94, -112, 45, -71, -187, -133, 2, 17, 77, -6, 27, 0, -35, -92, 173, 220, 71, -146, 103, 163, 56, 19, 124, 213, 48, -101, -115, 158, 16, -129, -75, -82, -20, -129, -184, 84, -37, -85, -158, 230, 82, 154, -143, 36, 84, 96, -90, -182, 18, 196, -29, 158, 9, 74, -300, -14, -67, -50, -39, -164, 14, -226, -212, -131, -261, -77, -83, -55, -38, -249, 20, 141, -27, 70, 113, 95, 69, 46, -9, 217, 102, 101, 0, 9, 106, -57, 116, -67, 118, -44, -160, 34, -130, 61, 57, 55, -49, 294, -99, -30, 111, 27, -41, 68, 228, 178, 64, -148, 247, 244, -251, 19, 84, 16, -199, 46, 69, -187, -56, -166, -46, 35, 72, -192, -94, -121, 49, -138, -171, -218, -70, -8, -115, 50, 104, 50, 182, 41, -113, 191, 62, 97, -27, 22, 98, -57, 50, -112, -91, 54, 40, -65, -33, 29, -247, 111]
2108A11j77K9K7J37j15J18o3m3Q5p5n7m7J27p4j20K77r2K0j39j02J26L4j26J23
2132a6P5j48Q3o2R6k19L82k50K8K56j07k09K50k10j00J03J61k73J9Q7k3J79j10
2155hQ6o8P9j81K03k07M7PK20oj35p4J52j37m7K31O4n4j56J76j68p1J52r1k32
2180b18L09m7M0j8j10M2j41M6O9p0O9J42k05n6J78j0J36j09j69K55k26N2J36j08
2204a3J38o8M9q5lj14J56Q4n7l4j84J21l08K02M2L6K46k48K2j60K10m7n1K2N7
2229A3m4K3K03l20K11p0j4P1k27K78j15j42R8j17K10m8J4lp2J61qk9k15J29r3
2254a06p7K07Q3k34K14k3j33K25l2j33J29j4o5p1r4K47j17r3lJ70k4Q3p0O9nj85
2280e2Rm0K68n0r3R9j18J7l3L8j80R0N6j62RJ21Jm4m0L58j10k72R0l2R1Qq7j75
$$ y = [111, -66, -37, -10, 127, 12, 130, 67, 24, 109, 34, -23, -70, 57, -17, -137, 140, 48, 68, -71, -173, -47, -13, -139, -16, 59, -89, -6, -68, 28, -191, 191, -59, -31, 225, 118, -91, 159, -51, -151, -48, 113, -160, -141, -54, -77, 102, -8, 78, 10, 89, -92, 111, -96, -49, -42, 178, 172, 37, -37, 115, -22, -69, 162, 226, 172, 16, 192, 24, -47, 105, 14, -218, 91, 44, 84, 66, -44, -2, -143, -97, -28, -98, -29, 113, -92, -148, 30, 20, 156, 47, -122, 133, -93, -41, 95, -13, 125, 57, 106, 21, 18, -96, 60, 144, 87, 53, -131, -10, -318, -116, -74, -38, 208, -40, -18, -178, 32, -15, -66, -44, 13, -31, -8, 195, -125, 86, 16, 2, 73, -154, 124, 9, -133, -35, -152, 58, 10, 24, 21, -51, 110, 102, 73, -142, -13, -106, -183, 24, 107, -127, 87, 64, -69, 156, 124, -9, 120, 106, 41, -30, -124, 123, 6, -87, -90, 80, 56, 139, 69, 138, 133, -52, -43, -83, 185, 135, 42, 141, 23, 40, 7, 45, -135, -45, 11, -151, -142, -21, -20, -64, -104, 254, 144, -128, -38, -70, 21, 29, -58, -233]
2308b33J23K36j19l2J38M7r6l6K7J04j32L1O3j17j40J52m9L1J81k41Rj33K79o0
2332C3o8O2j3J15j92N6P3K9l21J91L8P1J3n5n6J95j64N8o2J00J77n54J67M03j41
2357A55j78Jj32K17k54J63K27k6m29L68j47K26q0J06j74lL7J46j85K8j96N6Q8
2380A4L4K3J04j54j35M7J19O9j50K73k87j68J77j15R4j6N7J04l59J68m5J73n8
2403c1J06J43k49J90N6j73R5j72J03pO8j44j60n8J79J01j42R2j23J95j54l7J53
2426C1Pq3Q4J29l60J80J31j25J8N0J0O2m0k83K53kl2q9M5j50J89qL1Q7k30J77
2452H2j93OJ51r9q4J42j87J51K2j33K23k41J17K19j34M5nj98R4Mj45L01j79J66
2476A25q5l0m8M7p3mL6k8oP1j97P6O9L4J16k44L0J7J61j40J59k05J34oM1J4j89
$$ y = [-233, -110, 126, 7, -25, 113, 160, 64, 28, 55, 159, 27, 58, 121, 4, -136, 16, -33, -2, 179, -62, -53, -186, 93, 33, -35, 27, 14, 129, -63, -7, 66, 95, -226, -35, 3, 74, 87, 32, -24, 171, 7, 65, 3, 103, 280, -274, -107, 296, 155, -23, -22, -154, 63, -191, -28, 199, 173, -256, 112, -35, 191, 111, 217, 43, 40, 77, 223, 38, 66, -130, -74, 14, 48, 71, 175, 21, -114, -67, 52, 121, -29, 244, -43, -211, -34, -149, -55, -71, -14, 90, -269, -101, -146, 27, -31, 75, 218, -31, 159, 215, 42, 137, -35, 68, 61, 129, -15, -175, -233, -54, 47, -95, -3, -126, 69, -85, -122, 31, 38, -45, 39, 168, -192, -12, 119, -6, 12, 62, 72, 134, 94, -189, 64, 62, 30, -59, -14, -164, 25, 17, 48, 135, -95, 82, -111, -105, 46, -53, -137, 5, -182, -31, -9, -142, 81, -160, -43, 176, 42, 87, 82, -116, -22, -18, -163, 138, -41, 125, 40, 10, -38, 9, -64, -68, -32, -60, -66, 5, -192, -116, -47, -13, 103, -141, -111, -94, 67, -73, 86, -119, 15, 9, 50, 64, -125]
2503a25J77L8j42L7Q0k33K26o6J2K37k04O4Op5k4j60J23l8J91j28j19J44oJ23
2527A38p6o0O3J4K9n2J53l54p8K14%M4m0P4r0j5J35j9k9Q3j21p2P9L86k74j33
2553aJ4j87L05J0nn6rQ3q2pOk25P5J32J0j33R1K0o5j08j1K69j53Q2MQ2o8m2j62
2582a31J71r3p5p8K74J3l5n5R9q9J38m8k8j6Nj03J32n2R4o8j64R2j2J04N1k25
2608i9N3L1j17K41k70J88o7Q5j84K69p8R0k02J04l3O3j54m5K63j88J23p4M4r2
2632d9P7r7J67K8k78K8P5L5lj2n6l2M4L9Q8K7j59O7r6L5lO5j04J12K4j91K64k97
2660b02J21J45m9k11K91j20j2k2J69n5pKrK1k6j16Q5Oj69J34K3Kj12Q9K29j84
2686B3j51J32j08R2l8p8R7j61J51n5K27K9qj03k32J67J41j54l1o2q6J44P0j6J35
$$ y = [-125, 52, 90, -52, -15, 65, -168, 58, -8, 4, 241, 37, 101, 107, 32, 8, -152, -29, -67, 124, -4, -123, 21, 15, 138, 62, 2, 65, 79, 108, 56, 209, -145, -223, -9, -9, 35, -5, 69, -21, -36, 99, 80, 51, 134, 13, -59, 20, 406, 132, -1, 13, -174, 131, 141, 136, 80, 71, 154, 72, 65, 71, -154, -79, 53, 63, -70, 21, 41, -24, -132, -143, 126, -27, 55, 59, 141, 73, 31, -131, 40, -53, -128, -206, 68, 81, 46, -9, 90, 1, 139, 91, 63, 47, 52, -51, 81, 29, 123, 55, -109, -17, -29, 75, 126, -99, -46, -15, -132, 109, -161, 27, -40, 45, -139, 130, 52, 142, -60, 44, 11, 74, -80, -125, 138, -50, 73, -1, 43, -49, 28, -69, 98, 126, -152, -124, -49, -14, -17, -29, -85, -117, -73, -34, 54, 81, -78, -11, -107, -72, -75, -10, -114, -2, 22, -169, 95, -202, -81, 64, 15, -196, 95, -25, -37, -59, 110, 55, 48, 50, 41, 62, 36, -80, 5, 11, -158, -24, -1, 1, -111, -22, 207, 23, -128, 4, -104, -12, -50, -128, -31, -192, -41, -96, 131, 160, 152, 49, -183, -16, 125, -29, -60, -122, -208, -64, 6, -10, 125]
2711A25j29K28j55j50K08N6j35l09K26J9o2K47j69nJ49k82K62r1o3o6L0k8J04
2734A0j40K23k32L10l05L5J90j13j01J23L14l04P2N0j03P3k00N7j94J08o7K13
2756A9K24j37qL1j89O9pn4J67L6j63j30R9K75j55l3K4j61Q5N4p5m7P4K5m0R4K0
2783I7j20j77L00L6k39J88k19Q7K79k42m5Q6j45K19q0l6N8k0l8L6J15l59Q3M44
2807C08l35J67Qk12j83K78P1o2r9m7Q5Q4O5n0Q3j81%n2J77l33K35J3r2P6J32k03
2833f7J29j12M0Q6j16o6J10N5l49K43q8J08m2n4K99j60J74j97r2J68r7p5J75r2
2857b0J65l8p8q2M6O1j54J09J22j8r5K2K0m9L5r1O3J25k66p1K36p6j27J13%M3
2883eo8N2M9K1p1J62k73R8J1j78K30rj0m0K41k53j8R4Q9j18J70l57L16L4k99L07
$$ y = [125, -4, 224, 69, -81, 127, 183, 48, -261, -35, -16, -78, 169, 0, -5, 144, -138, 124, 33, -30, -96, -66, -94, 10, -130, 93, -139, 171, -134, -99, 91, -22, -123, 0, 314, 10, 82, 132, 29, 102, -98, -41, -235, -127, -194, 19, 243, 106, 98, 129, -60, 9, 2, -52, 115, 151, -12, -142, -43, 232, 77, 44, 68, -93, -8, 46, -29, -76, -2, 23, -17, 77, 97, -23, -200, 100, 136, -103, 85, -134, -47, 232, -10, -55, 31, -114, 105, 25, -11, 47, 27, -11, 25, 140, -219, -136, 308, -27, 140, 148, -64, -247, 31, 102, 40, -59, -106, -21, 63, 128, 78, 161, -20, -20, -72, 105, -228, 7, 20, -72, 4, 136, -67, 62, -50, -10, 76, -40, -106, 4, 59, -290, -47, -135, -27, -69, -123, 176, 16, 190, -7, -99, 69, -28, -103, 72, -20, 145, 107, 29, -53, -7, 54, -100, 9, 131, 113, 18, 40, 60, 11, 46, -45, 18, 143, -123, -194, 42, -34, -161, -48, -48, -5, -73, -21, 28, 49, -22, 140, -133, -35, -24, -202, 28, 19, 9, -31, 210, -43, -61, 33, 122, 4, 174, -183, 133, 167, -132, 175]
2909A75j87K51k42R9q3R3j75m4N2J31k7O2Q2l24J02L43l76K44j14l5K2N7j61J03
2933D8p0k1j3Q5p8J6J03l28L03k1J4q3N0K10k74J0J55L0j84K79l16K75r0j35O4
2958B9K46l52o8R7N9J58M5j4j60K3J17k72N6P0k17L0J47R9l1j29rQ9m0k0m5J17
2984B5j04M36k83j17j57K19o4J58l3J40k08j69K21Oj91l4J32R0N3p2j30K9OO7
3008B0K6J6J9j84M2j15J85l0m6J56o2k01J74K13l25k9Q0P7kj93K46L5j82J29j
3033D8r9K8j4o4m2L7J2l8oJ03J37j00k3mj04k2J59J61j89M2j92J62j9K02l5k44
3059a04J08Q9j23j5q6J39n8J51M9k49M4P0j2j4J26j18J53j00o2O0k6K5j58R8l7
3084e0O1J03o7j74L21k42J55k17R1J0N3p3P0j04L0M3l3R5j50J02j87J35O1L4n3
$$ y = [175, -12, 239, -3, 96, 13, 106, -69, -113, -61, 70, 43, 105, 187, -137, -35, 308, -68, 176, 62, 27, 49, 106, -55, 48, -22, -43, -56, 29, -49, -33, 70, -258, 45, 24, 38, -45, 5, 215, -59, -49, 106, 136, -48, 231, -85, 190, 100, -35, 29, 275, -77, -145, -48, 11, 169, 214, 200, 40, 63, 180, -92, -36, 34, -183, -153, -6, 93, 62, -67, -76, 13, -27, -47, -92, 25, -79, 357, 74, -43, -200, 19, -45, 113, 80, 220, 12, -157, 64, 70, -121, -155, -23, 67, 120, 48, -82, -53, -47, 20, 46, 62, 81, -103, -61, -176, 9, -21, -67, 89, 27, -174, 0, 213, -112, -141, -61, 16, 14, -179, 67, 102, -80, 49, 48, -51, -23, -37, -101, -143, -106, -94, -132, -138, -35, 102, 2, -21, -25, -129, -151, 8, 169, -20, 22, -170, -8, -27, 175, 140, -104, 4, 93, -30, -45, -131, 8, -50, 101, 150, -99, -55, 15, 3, -11, 115, -3, 150, 50, -12, 48, 22, 47, -111, -13, -50, 11, 114, 47, -127, 194, -48, 107, -110, -19, -9, 44, -29, 41, -63, -33, 10, -23, 72, -78, 24, -163, -28, 33, 67, 14]
3109A4J89j25k06P3j0k2J50k6j46L7M4J34j14n7L1R4j91J39N8j3j5L6k81J18K36
3134A47k23N3m9k7J58Kj94K2P7K53k74R1kr9K03k77J20q2Q5j87L10l24J16J67
3158F6pj53J15k5O5j65J73J02j08J75j72n2J5Kq9n3J12K4K7K27l06l9J8MQ0K6
3184F2p3Q7O0m6j5k72L10j76N6j18o0J17p4K38j39rJ1J32mk41K04L2r6l5k4K57
3210A84j62n6J0j15J41l3n1M9j8JJ90p4j17n7R5K2o2q4K22p1Q4o5k4o1n5J65j04
3237d6J27J2J11k37M9O4k1l6P0j46J16j94J39m7r2J41p3R5j26K73k17k0K05j92
3261d5R9k13J60p0J17j68L1O9Jl1j00K60k41m6K11j6M2l2J4j06J27Pj34m6qK56
3287A38j95M4J61k44n0J13j1J1j4j19J85M7j89J36j25J15%j3Q5R9l00M2J03j00
$$ y = [14, 203, 78, -128, -55, -65, -87, 63, 37, -109, -72, -28, 106, -8, -65, -34, 60, -131, 8, 66, 53, 38, 74, -207, -89, 147, -76, -23, -72, -99, 59, 61, -133, -111, -34, 219, -55, 36, 34, -65, 138, -139, -19, -101, -16, -203, 107, -217, -101, 66, 59, -94, 21, -4, 61, -104, 69, 171, 63, 238, 66, 14, 29, 31, -58, -111, 1, 25, 52, 279, -27, -66, -48, -44, 36, 62, -11, 76, 136, 90, 75, -197, 113, -63, -7, -125, -185, -68, -142, 96, -43, -52, -41, 91, 87, -154, 50, 82, -14, -49, -73, 184, 22, -34, -24, -139, 2, -31, -82, -33, -51, -50, 140, 66, -51, -108, -13, 9, -53, -137, 85, 14, 98, 33, 9, -52, -107, 58, -46, 81, 93, 204, -33, 16, 80, 59, 23, 93, -53, 63, -131, 8, -39, -131, 10, -63, 32, -94, 179, -38, -58, 147, -45, 54, -159, 1, -69, 48, -120, -89, -20, -19, -50, -150, 110, -131, -177, 34, 18, 60, 28, 42, -64, 63, 70, -64, -110, -118, 138, -57, -13, 148, -96, -146, -33, -44, -33, -47, -166, 19, 66, -123, 13, -112, 3, 3, -10, 75, 174, -126, -84, 19, -81]
3311h1J09R9j57K00j69n5M5m7P5O0J9p6j6K5km6O2q0L4j42K50L2k25K63r2j08
3337b3J13o4mj11J39J17l9j57K7j79J73O0L9j7o1q2K4R2m4J47j92J30m1j01M7
3362gJ01k5j08p0j05J46K09j90K3J40k21J81%j3P3l8P3k41L2Q6J45k07K0L3j24
3387h7J76k04M1n7L08j94J27j64KR5k5L2L8k4N4k10R0Rk5J63k28O2k46K27R2O9
3413A21m5l3j18R5P8k53J68m0o3J01o6J36j38m6J02n1M7J39R3l00K5o1J2O9n0
3438g8m7J77L4l8MN9l4N5k27N1J9k6O5j09J43M3j63Q3K30k47j43J21o5J23M8k94
3464b16K36j38J58j34J49k32J72K5j10L9L3N4K1l7J65j99J02p4o3R0l3p8L1l0
3488f9k34J80J68Q1k58N0J30k28K39O7q3j56L88l56J01J26p7j74N6K22k56KM8
$$ y = [-81, 28, 127, -30, 170, 1, -54, -9, -56, 19, 79, 98, 22, 6, 31, 29, -17, 45, -35, -1, -143, 107, 139, -86, 177, 85, -23, 90, 26, 22, -89, 50, 167, 128, -29, -2, -181, -8, 52, 91, 74, 13, -69, -45, 47, 3, 150, -42, 88, 47, -54, -7, 94, 69, -39, -109, -214, -68, 141, -49, -26, 114, -107, 74, 74, 61, 134, 96, 169, -72, -40, 46, 191, -16, 4, 37, -87, 89, -115, -74, -131, 177, -17, 110, -54, -52, 43, 18, 50, 88, 64, 118, -92, -2, 7, -18, 145, -83, -21, -267, -40, 52, 121, 76, 43, -75, 20, 98, -155, 13, -27, -90, 11, -55, 81, -57, -103, -1, -52, -5, 134, 227, -73, -48, -109, -97, -28, -78, -125, 52, 86, 48, 52, 111, 77, 132, -95, -44, -25, -51, 14, -95, 48, 91, -72, 11, 241, -6, -149, -28, -93, 30, 78, -216, 20, -118, 40, -94, 55, -177, -5, 20, -90, -51, -18, 36, 57, 20, 185, -14, 88, 14, -49, 41, 8, -70, -39, -69, -303, -123, 45, 126, -132, -82, 48, -180, 59, 126, 43, -113, 275, -81, 20, 146, 69, -105, -49, 173, -83, -81, -33]
3511c3J10j62J55k8j0q3J70j92L58k56j43L7k8n8Q0J52p9r1K2J56j77K36j97N0
3535a1L0j3k58K73K01p7k57R7J95k75P0P4q0p6m5J3l7K56k06k5L12k56J38J85
3559B28l12K1l0J70j04K18j47r3J25o4Kp0L1Rm2q2k04M07L6j87L6K21j64K8O8
3584A01J38l36J37j07R5m2J41j23o5J46k70J42o4J47n5n4J73k83NM59k26O8k4
3607A03N5l70K48K9j65l4J53R7m0p6K8j76O0j27L03j21M6J07l53J04j2Q7J35m7
3631C4J01Op9J9l18K73J72j20j03L3q7J05J65k4j30p9Q6J43n9r7o7r5J63p6j51
3656a85K63j4n5q4J12M3r3M2j66J47k23K49r9R4l6J6L4Q0Q2j90k05K92O8j69L2
3681C5q1P7k6j05J19j60L9P2q5o6K85l4j0K1k80K37l0K9l5P5J1k28L60j82k1J62
$$ y = [-33, 77, -85, 70, 42, 32, -51, 119, -73, 285, 29, -114, -77, -105, -163, -83, 69, -10, -101, -79, 77, -100, 136, -61, -11, 19, 6, -252, 21, 222, 145, -112, -15, 180, -95, -25, 49, -31, -107, -152, -139, -176, 80, -126, -151, 161, -95, 43, 228, -84, -63, -93, 77, -27, 191, 44, -49, 76, 12, 14, -56, -25, -16, -58, -140, -344, 63, 99, -88, -52, 169, 5, 33, 101, 239, -97, 40, -67, 28, -14, 127, 4, -61, 85, -185, -43, -107, 40, -15, -69, 104, -179, -174, 285, 59, 127, 103, 158, -212, 36, 65, -100, -134, 19, 116, 76, 0, 28, -148, -88, -215, 88, -33, 13, 120, -233, -129, -141, -54, 81, 34, 135, 141, 62, 81, -237, 36, 208, 88, -15, 18, -69, 36, 201, 177, 47, -32, 54, 197, 138, 41, -26, -121, 42, -34, -185, 78, 64, 9, -75, 37, 80, -13, 29, -137, 10, -213, 36, -63, 31, -5, 11, 45, 125, 207, 17, -188, 104, 172, 3, 35, -46, 31, 5, -100, 19, -141, -102, -30, -115, -181, 104, 70, 60, 81, -199, 38, 8, 37, 2, 77, 88, -140, 220, 38, 17, 179]
3707A79J7j1k29Q0P5K0j7l3qr5j40P7N1K79k05J46j76l8lN0m7m1r5J78N9k56J71
3734a2j21qK37K1m3r9o7K11p7l23L18M0j74M1J16o3R8j75q3J78m0P0p3n4K53j61
3760A0L6j02J72j63K5L7%N7k22j2L53j21J95k42k22K26jo7j92M42k61j87P3L52
3784A86k17J01O4j2O0k50R5J15j2k32K40k00P6l4KJ18j26J23j01J56j24j09K42
3807A61l43R9KP4l0j03J8j1K91k00M0O8n9J13k05M2K5m3P4j83L08j28r9J01N5
3832F7l8r2Q6j51J13j7j48K67j78kK94k73J64n0j23J0j0J49j87K58k2m2J14j29
3856F0k43K91k65m6J70j9O3m7q7K05n6k27K23J82j85k12K78j74J61k4j55J47R7
3879A37j86R8l1M8q3J4j52K00j8p5j24J84l3r0J95j01K7N5kj44L0J02n0m5k2K9
$$ y = [179, 196, 185, -44, 36, 111, 131, 114, 81, 73, -22, -162, -85, -34, 245, 40, 186, 10, -28, -31, 19, -28, -69, -164, 14, 73, -183, -12, -133, -141, 96, 117, 74, -25, -92, 119, 42, -281, 37, 77, -97, -56, 60, -3, 95, -80, -163, 15, -25, 45, -28, -82, 171, 10, 46, -56, 116, -47, -22, 15, 15, 72, -150, -162, 191, 70, 265, 23, -199, 27, 26, -41, -233, 209, -52, -239, -166, 186, -31, 70, 134, 122, 182, -68, 27, 142, 130, -102, 138, -62, 14, -20, -18, 100, -26, 97, -4, 152, 28, -81, 161, -182, -83, -81, -7, -37, -140, -122, -133, 158, -42, -2, 66, 7, 120, -85, -43, -18, -61, 13, -170, 138, 10, -89, 12, 67, 29, -63, 23, -128, -15, -32, -180, 87, -91, -93, 201, -72, 92, 42, -81, -71, -81, 68, -119, 139, 117, 75, 189, 60, -183, 108, -157, -203, -33, -52, 11, -36, -123, 82, 26, -201, 22, 204, 19, -193, 85, -89, 72, 48, -107, 40, 137, -49, 49, 18, 66, -17, -3, -155, 45, 27, -48, -172, 12, -21, -111, 84, -17, 10, 65, 63, -81, -51, 51, 1, -44, -66, -37]
3905c7O7o5K06r1l67K03J00K3l8m7n9J78rj79J71j99J84O6k76O1K6J39O1jk18
3930a01J62l7J6j46K4K19k27J77j34J1K40j63j31j6j23J31P5j29J64Qp3j20K12
3953C9j91R2KR2l0j13Q1Nmn6m6K15j15K50k50n1N5l5k9J21N8j42q6m4K08O9j61
3980f6J42J48k93K9O9j46q2K42j87K22j11N2J34k09J00j91O4q1J29J46k20J04
4002eqq2J04j51J28N0P0q0k6J94l53K75Lk39R8K04k50J00k13M2R3P5o4j07K22
4027H0j17j3N6J6j12J76j52K03r0j12n2J78m0n8N0P9k36P1J57j93o9J01j2K35
4051A46J6j40K8M8j06q9q3J22O3N1ln1q0O4j32mJ54J9q7J89k22L4J25m8o1L2M6
4078C1J45k15J54j9r8Q4j3k96L30j72J45n7J39j84J26k9j25M7j68K62l41L09j07
$$ y = [-37, 30, -35, 171, 80, -287, -84, 16, 39, 1, -46, -105, 73, 64, -115, 56, -143, 41, 107, -169, -108, -82, 57, 118, 117, -101, 61, 24, 40, -106, -82, 137, -90, 87, -47, -36, 204, 41, -90, -106, -229, -98, -23, -152, 12, 20, -53, -173, 39, -152, -60, -58, 34, 4, -109, -28, -23, -27, -83, -129, 86, -29, 221, -29, -80, -25, -60, -89, 32, 90, -52, -138, -182, 26, 95, -66, 76, 224, -69, -40, 29, -117, -199, 43, -144, 78, -33, 19, 153, -56, 44, -147, -83, -164, -35, 111, -109, -5, -13, -95, 9, -142, -14, 36, 106, 26, 0, 194, -159, 116, 119, -120, -22, 182, -68, 32, -181, -139, -46, 29, -35, -142, 80, -37, -50, 6, 22, -90, 86, -66, 137, 47, -65, -117, 61, 21, -37, 13, 92, -144, -73, 84, -109, -178, -77, -89, 146, 162, 22, 50, 98, -8, -97, -180, -58, 5, 56, 53, 2, -78, -14, -146, -150, 4, 23, -64, 125, -97, -63, 62, 14, -47, -15, 31, 176, -39, 115, 96, -2, 82, 69, -227, 103, -69, 76, 19, 158, -26, 100, 71, -54, -7, -175, 87, -254, 55, -52]
4101e2J55j39R4j69K7K10j17J9M2m9Mk8k24K29R6L1p7q0J16n0R8q5P3k50l9K46
4127H1n9k8J61k17J27j54j9N1o9p5L17j07J8K1Mj11J04Om2j15M8j18m0K46J6J05
4153A51k95J03p1K25q3j10Q4k08J03k8j3K68p3Lj16p5rK05j3mj39J12qQ9l13J33
4179h2N2o0Q3j53J78j37K80j83R8q5Q5o1r5K0Q4J18k09k19P3K69j72J01j6N5j58
4204a34K14k76K52J01j87R0qq0J13j43L6j14M5K68k65M5qM9J28r1k4o1Q2M9j28
4229d7J12j36R9j46Q2J04p9j31P5k1P3N1k53j2J02L68k50l0N8j77L16j17j3L6
4253F4o3n3q4K15j38O7m9j01J44J2L2j86M4K5nJ19j96J51J6Nj89J86J09n8j38
4278g1K19o3j09Q4k39K61q2k7kK20j84o4P0n8M7R4j44j6J74o9J02j73J08n7o9
$$ y = [-52, 103, -36, 58, -111, -84, 126, 9, 28, 70, 21, 25, -3, -227, 2, 98, 129, 52, -28, 88, 38, 136, 51, 124, -126, -165, 81, 22, -6, 155, -62, 65, -89, -108, -57, -126, -201, 116, 9, 27, 48, 52, -59, 45, 51, 9, -106, -58, -176, -216, 30, 46, 151, -144, -41, -112, 113, 30, -80, 4, -204, -101, -129, -142, 126, 53, 56, -60, -135, -144, 61, 48, 44, -95, 17, 9, 98, -215, -82, -30, -90, -7, -160, 18, -119, 161, -22, 76, -9, 76, 15, -80, -60, 24, 142, -67, -286, -213, 56, -116, -15, -31, 24, -134, 80, -196, 56, 157, -30, 60, 52, -28, 85, -58, -22, -136, -91, 177, -88, -43, -51, -2, 126, 35, 11, -50, 32, 81, -47, 65, -71, 28, -118, -36, 68, -11, -142, -67, -88, -15, 36, -217, -229, -127, 241, -9, -39, 19, -158, 158, 41, 28, 64, 1, -52, -136, 79, -59, 8, -41, -142, 2, 14, 46, -140, -96, -71, -76, 43, -153, -2, 14, 19, -170, 16, 125, 67, -71, 148, 85, -24, 60, -179, 82, 0, -27, -29, 191, 7, -57, 13, -45, 2, 96, -48, -64, 110, 41, 143, -30, 78, 21, -48]
4303d8Q2j22K46k01K15r0j62M1R6j49j05K32k9j98K35k54L27j87r1L10j8j30M8
4326D8m8K26l60m8J06K36j82l9J13%q6J05j97J35O7o9j08N7p6K67j29J2j33Q9
4350a4k6m5J23j10K66j72J0j53K81k17J43k15J66k10K38j0r4K43k47%N2K34l05
4373f2NK94j82O4j34m9R2K8k81K46j48r3K10oq0J50k7j1J43o8M1l25J91q3OP7
4399bj96K29J75k07k2J73j60O3j9n2J75k01l5J19n2l2Q9j21o2J75n9O8k03Q8k3
4424i2J10j12J34p0j41K00M0q6m5oJ55k57J92l3oJ46k8q2jJ3j63K14j96l3K07
4449F0k61J81P5K6j03N8l02L62j30Q4m9j77J37L4l6q2J81l1P9J65k50j08j5R0
4473a2j02J53k4K69k05j1p5R9r7K35m74L49k52M8K00k01P3J49J5j34J17j1j70
$$ y = [-48, 34, -88, 158, -43, 172, 82, -80, -39, 57, -92, -197, 35, 6, -192, 43, -211, 116, -71, -162, 148, 130, 0, 48, 0, 226, -134, -182, -76, 160, -22, -61, 52, 52, -34, 71, -126, 9, 76, 7, -101, -44, -120, 147, 18, 30, -103, -14, -40, -85, 38, -72, 194, 22, 32, -121, 160, -57, 86, -129, 37, -173, 65, 55, -39, 204, -43, -43, 9, 243, -62, -57, 237, 55, 119, -15, -64, 28, 56, -225, 21, -127, -220, -10, -16, -96, 54, 27, 16, 159, 91, 132, -193, -2, -85, -79, -2, -198, 31, 206, -1, -23, 150, -10, 53, 34, -18, 157, -44, -79, 40, -12, -44, 45, -76, -138, 37, -22, 46, -157, -69, -92, 18, -94, 40, -30, -171, 29, 69, -17, -62, -68, 87, -170, 22, -11, -17, 129, 101, 19, 18, 31, -132, 82, -114, -147, 60, -201, -20, 55, 81, -22, 36, -266, 96, -34, 50, 1, -176, -39, -5, -41, -123, 58, 27, 106, 271, 21, -87, -102, -12, -114, 39, 15, 284, 79, 68, -7, 92, -5, 230, -244, 105, -147, -99, 101, -100, -27, 122, 137, 3, 120, 109, -61]
4496f1j77K39J85j50j59J81j68K00k2j01N1r5j00J21R9J0n1j08K4j50J25L3J25
4519E1K07j83j38O4J7j34OJ70q4Q0j52N9N7r5P1J7J19j41n5Q7n4J19j43N0J59
4544A54j89K5L8L3k23J66l5j5%J49j01N7n2L1Q2k2j73J24j44N3J34k89K47k29
4568a79P8J23r1J18j02k8JM7J79j14k2j48l4J89j72K10q6nj4j29P0K20p9k21K19
4593C0r0J74k15J30k06R2J47o9q5K93k79K42j32O0r2j71J7L0j9K93k25j96K46
4616b5N0J86l99K66J38l78K72j25M3o0j23L58k96J41j28J65j83j27K00k66K33
4637e8k0J54o1J45j72L4J7qk3j59M0M6J3j58L55k48o0J34o8M4Qm8L94l20m7j22
4663a88K83k12K00j88J92k17Ok5O5R7j47L26k15k6l0P8K9J71k43N2L8m1J13j7
$$ y = [-61, -238, 1, 186, 36, -123, 58, -110, 90, 68, -33, 18, -77, -177, -56, 43, 53, 2, -106, -82, -232, -107, -74, 51, 258, 75, -63, 1, 18, -116, -110, 60, -24, 56, -96, -37, 20, -75, -4, 13, 132, -9, -64, 23, -31, 88, -55, -5, 154, -35, -10, 28, 61, -162, 4, -31, -46, -46, 103, 2, 59, 7, 38, 120, 98, -75, 49, -95, -42, 92, -197, 50, -179, -101, 22, -69, 49, -53, -81, -80, -33, 146, 32, 10, -138, -172, 17, -155, 55, -31, -36, -50, -179, -109, 111, 32, -189, 30, -60, 114, -101, 29, -177, -85, 62, -7, -92, 201, -78, 164, 32, 92, 0, -171, -154, -124, -143, 150, -75, -271, -25, 25, 211, -188, 78, 216, -162, 110, -15, 28, -32, -155, 203, -93, 48, -80, 85, -98, -225, -25, -291, -58, -78, 76, 15, 160, -12, 22, 39, 31, 8, -151, -111, -65, -52, -210, 145, -103, -163, -29, -97, -53, -45, -93, 301, -19, -66, -188, 95, -117, 83, -105, 87, -130, -124, -149, -84, 13, -134, 192, -23, -49, -79, -1, 28, 199, -44, 8, 46, 5, 118, 101]
4687A01j06L1P5rn6l7j9J93j51j11J30q8J32L4n9q2J88j80J64K0l10R1K1R6L4
4712A02q7o4J17o2p8O2Q1j40J85j44l7O5M6k26L18K4r1J75k23Kk23K47l7rj34
4737a31O5j1j44J16OR4J04n3K16k07N1o8j45J60j09j38K99p4MK1j20NJ09l0J21
4762A41j24j28J78PJ2r7o8L14j49k32Q3N3J15jr5O0kQ1k03j91J87p5L30L2k62
4787c4J21Q8n6k24K28j36j19J07J53j99J08j53J15k08P1J04K4j15J11J3j30J92
4809F1j39K20l7j62l0K03l1j8r8J05m1j23N1R0j05l5M7K23j89j17K00j1O9j45
4833a2p2R2j09R1J48j2n9J28l28K06n8l4J2K85l12N8jJ87j07J6j18j06J01j09
4857a13j66M11n2r2J10j56Q4J42k59J29Q0k48O6n6lK41j50n0J4J02M1j53K45m5
$$ y = [101, -5, 26, 101, 92, 36, -1, -20, 173, 22, -89, 41, -47, 85, 119, 60, -22, 166, -14, 150, 170, -140, -49, -28, 68, 102, 15, -49, 68, 6, -72, -10, 71, -69, 116, -28, -65, 0, 46, -180, 138, 162, 71, 246, 23, 25, -198, 49, 12, 3, -131, -66, -77, -221, -105, -99, -5, 99, 46, 262, 55, 106, 38, -107, 53, -56, -194, 105, 31, 35, 56, -64, -59, 50, 20, 141, 17, -111, 67, 74, 86, -11, -79, 235, 86, -146, -63, -10, 105, 104, 9, 69, 67, 148, -55, -246, -59, -134, 196, 228, -34, 87, 175, 119, -105, 123, -13, -132, -25, 128, -71, 37, -116, -1, -209, -138, -34, -10, -125, -14, -1, -131, 61, -78, 142, 105, -57, -87, 116, 85, 67, -31, 74, 33, -90, -39, 51, -54, -89, -42, 181, -8, -125, 75, 64, 133, -12, -84, 8, -101, -10, 138, 126, 67, 195, -133, 73, 15, -19, -7, 278, -34, 24, 23, 210, 103, 119, 1, -105, -4, -113, -279, 132, 80, -12, 98, -58, 26, 168, -91, 38, 118, -130, -64, -120, -123, 118, -32, -82, -68, 34, 75, -78, 167, 122]
4881A22j32J7l2o1P4J46j92M1j17l3J70P5j09p9J07m9J14r2%j68J42J15l01K27
4905a5J31j99J7MK61l03k6K83j81L4J03j14k2J45j74J4q4N0M3J16j2l0n4K2j6
4930gL0J48m3k48m5J55L5Oj31j3R3o8J08l7m4q0J16l4J67m5j40J97q1l5J80j85
4956aj10J90O1n7j55M1J18l54L34r3J75p6p6j63J87J15j61J07QL0j45PkJ95n1
4981A24j47Q0L4p2J09k25P0LR8P7j21j29P6l0Q7o5j99K50R0k63J57j93L6l6L71
5006A82j98m6K21k13k17N76k69O3j51n8O6k3J35n8j4O5J0m8o7K9L8j70OO6N6m
5032b3k5j22L12k25N1M1p4O5P7j38r4J83q6j61K04N9N7L3k27J08N4k27O7o2K61
5057A08m2r6M8J19q1J12k27M7l8k8J81r9k0j7k9P8j9k15L36j33M2K5r4N3O7o4
$$ y = [122, -10, 7, -25, -86, -12, 134, -58, -17, -134, -167, 3, 78, -31, -110, -3, -52, 62, -30, -30, -198, -56, 59, -242, -15, 116, -83, -66, -62, 199, -104, -130, 153, -28, 6, 109, -5, -27, 118, -56, -42, -126, -76, -33, 83, 71, 41, -13, 9, -7, 23, 171, 128, -120, -165, -10, 25, 31, -100, -113, -20, -88, 20, -17, -61, -141, -25, -59, 108, 63, -77, 120, 39, 4, 184, -1, -111, 79, 140, 83, -72, -31, 87, -267, 67, -26, 149, 73, -3, -166, 21, 136, -25, 82, 90, 120, -25, -18, -20, 175, 124, -23, 57, 91, 19, 128, -97, -27, -24, 74, 151, 30, -99, -23, -53, 34, -31, -230, 20, 110, -153, 4, -189, -153, -189, 182, -16, -62, 159, -54, -271, 305, 36, 99, -52, -110, -44, -67, 68, 10, -4, 61, 71, 23, -44, -15, 23, -147, -141, -75, -19, -23, -48, -170, 142, -83, -32, 9, -65, 0, 77, -61, -155, 28, -58, -219, -15, 44, 101, 134, -93, 15, 69, -158, -91, -153, 108, 66, -30, 18, 137, 56, 168, -59, -12, -50, -78, 103, 4, -16, -33, -62, 16, -3, -218, 118, -15, 27, 52, -42, 11, 78, 14]
5083A4M3q1n3o6K77l31R7P6m5l0j02L97j08j14j43J99K2j05p3L4K67o9q3j37K31
5108A17L3k10jJ15L0j20L9m0o1O8O5k46L23j39k6n7l2K82l1n3o1N0n1l0j16J34
5134a8K50k75RJ49K2p8q7R5m9j41L12k12L2m9R1j43J88R2j67ml10K61J14J99k71
5159A0Qr6Q5j88J52m0P6J58k47K44j64L3M5P2j65k35K30r7J59l6k51K17r1J26
5183Ej43K2N5K3N9k80M22l27j6O2O5ML9k88K92q1J18k0jR0l09J68J98k81p9Q4
5209a19L12k01J4J0L7k04J88m9J30j87q6K82n3J15m5J00k5j07j3p3Q0p7q4J74
5233A19j78J16P9p4j2j52N3O2P6j02j05N2JJ39kk0K8k76M1J72K6m7K77l34L7K21
5259A97M9j61j56N4Q8PJ74k59n5M3K5j52M0J95K6k85J09l5K18j80o5J26L9j61
$$ y = [14, 57, -24, -77, -143, 134, -197, -100, -24, -69, -99, -201, 196, 88, -26, -169, 30, 52, -53, -126, -92, 175, 106, 23, -114, 117, 150, -60, -61, 54, 84, -36, 3, -37, -98, -30, 35, -211, 112, -27, -53, -110, -142, 140, 109, 56, -5, 45, -6, -36, -152, -18, 232, -43, -34, 115, 137, 59, -28, 67, 18, -123, 189, -23, 9, -40, 51, -92, 96, 188, 21, 17, -293, -32, 82, 281, 10, 18, -78, 7, -181, -29, -69, 7, 165, -82, 162, -2, 31, 76, 148, -17, -252, -22, -119, 40, 4, -247, -30, -121, 5, -138, -116, -61, -38, 21, -259, 163, -164, -180, -118, -53, -49, -10, -298, -6, -87, 31, 11, 10, 100, -209, -41, 157, -124, -203, -119, 193, -8, 6, 16, 53, -151, 37, -12, 118, -69, -155, 127, 74, 189, 144, 244, 219, 112, 99, 26, 106, 29, -55, 119, -59, 57, 136, 62, 50, -102, -49, 13, 89, -13, -118, -66, -65, 74, 72, 52, 80, -196, -155, 17, 43, -4, 273, -61, -24, 197, 246, 85, -71, -17, 71, 78, 252, -7, -62, -19, 6, -146, -106, 89, 115, -170, -61, -96, 122, -58, -123, 3, 42, -119]
5283a19M4K15K8l25J68j5JJ22k27J23J34j77M6j85L26n9k21J72l5J21j56J28l17
5306b08K98k52L11j41O9l2l32L46k1k59K41Q0p2K2M5Kj91K30l30J52Q0K0q4q8
5330a14J44j07J63k07L84k72q4P1q8K4K56k70n0J08K98k84O4O7m12K90m1J17J18
5353A75m5j94R3r7PJ45j00J38n6j27O5kJ6M7k79M32k33o5M6P3n4j0J3mnJ49p0
5380E8J6j13J16j63jr2L61k8r1J16l14K10J61j57j76Q0J07lp2J50j56p6o6k5J15
5405d3J19q6j35J40m6KJ18j77m0K18o8M9J84k03o8j9K03m8o4j64J01r5J85j7j34
5430h8j9J68q6m5Q7N2j21JJ76k77K25k8q2P4r8J31p2R1J01j18J1mo4n2O1j9J68
5457A73m4m2j29M8o9J20m3j48J16M0m2q5O9Om1J0p3J22j11J18j7j2J73j18qN6
$$ y = [-119, -75, 140, 168, -157, 11, -4, -3, 119, -108, 15, 149, -28, 18, -167, 159, 100, -121, 51, 16, 137, -19, 109, -208, 90, -162, 149, 8, 77, 45, -287, 59, 38, -221, 20, 100, 28, 50, 95, 97, -94, 136, -194, -42, 38, 58, -26, -114, 30, -77, 86, -121, 263, -9, -93, -22, -110, -86, 170, -100, -150, -42, 256, -28, 36, 103, -309, -19, -60, 57, 175, 130, -64, 29, -68, -61, 84, -16, 122, 66, -61, 4, 2, 18, 65, -214, 218, -15, -80, -34, 39, -15, -25, -12, -16, -21, 128, 58, 74, -39, 77, -86, -87, -179, 182, 154, 63, 179, -135, 75, 236, 79, -97, -17, 90, 87, 15, 165, 9, -67, -133, -158, -43, 76, -10, -145, -5, -51, -49, 69, -108, -148, 70, 2, 51, 235, 32, -36, -55, 148, 100, 36, -128, -27, -122, 63, 46, -88, -107, 61, -25, -70, 17, 69, -52, -51, 125, -152, 73, 45, -37, 37, -61, 70, -2, 89, 190, 72, 83, 79, 15, -37, 24, 5, 173, 129, 87, -42, 6, -63, 57, 14, -134, -18, 22, -20, -105, -36, -30, -71, -61, -134, -12, -123, -5, -22, -34, 139, 21, 13, 69]
5483F9J09j82J5K35l35J65r6JL0j87K58O7j85L0qJ79n7r5J00j08r2OJ21p8J6l2
5509e4j2K97j83J2rj67J55J6m5k3j5J22O8J20j05j67m2J36p4olJ1j31J04j92K39
5535E2r9J38L4o1r4l8J50N8k70Kn5J7K89j52j40K65J34k79LL8pq9J21j81J45J45
5561A26j06P0r0r6L7O3P8j04L2P7Q4J5k78P8J2J04r4l05K60n2j42K38q1m3pQ4
5587d0K4J46n4k64K94k07R3j42J03K3M6M0K2j56R8M8j20K52k35L7%R2j70K2K2
5612b6j4J52j58R9j49ko9L6J60k40J77J85Rj55j05J36r1N1j59Q0J82k20M4J47
5636G0j59Q9j13R6m1N8p5J98o6r1L2m2o3K60j26P8r3o7J86j8k51J36J02l52J98
5661e4P6KK7L1j78Q4r9J73k20K17J83j53R6j97K43j24k24K82j06l4j3j43J07j
$$ y = [69, 178, -4, 11, 246, -89, 76, -20, -19, 11, -176, 82, 149, -36, -6, -14, 165, 108, 13, 113, 5, -87, -81, 40, -38, -22, -54, -66, 231, 48, 60, 51, -116, 39, 55, 10, -13, -28, 94, 162, 282, 177, 10, -32, 104, 30, 24, 21, 32, -99, 5, -187, 52, -47, 91, 125, 64, -30, -68, 82, 140, -130, -128, -183, -166, 123, -29, -169, 96, 230, -49, -46, -8, -15, -104, 17, -164, -19, 126, 20, 90, 0, -96, -59, 4, 82, -22, 10, 87, 171, 186, -92, -14, -2, 102, 8, -297, -37, -89, -231, 7, -74, -117, -124, -40, -16, 130, 76, -188, 106, -101, -8, -150, -47, -24, 22, 62, 84, -72, 26, 74, -46, 206, -29, 8, 8, 100, -70, -48, -26, -40, 112, -46, 53, -96, -98, -167, -131, 29, -211, -34, 151, 160, 5, -100, 36, -55, -4, -163, -83, 99, -121, -77, 70, -89, 0, -113, -17, -58, 0, -75, 123, 57, -34, -2, -44, -107, 153, 27, 105, 12, -55, 131, 113, -138, -2, 100, -252, -54, 22, 24, 51, 82, -96, -12, -111, 62, -158, 59, 242, 89, 185, -12, 231, 107, -117, 165, 59, 25, 12, -131, -24, -25]
5685b5j6Om6J93j37J3J03r5K2j9p1P7M5K1j78J85k40K47r6k50J25K16k32Q2J15
5710D5l3J1Nq2J53j9j63K12J1q9J32k52K20l84L41L1j73Q5k75L02R3k42K9J57
5734A15j39k3Q5N6m5J6R2k30k7J67kp6M0N9oPr2J65k74R2Nr9P8J4P5m9j17J73
5762F0j89J29O0K9n2j20O4m6J43j81L20j03j55j08L3J78j39j28J98J51r8j46M4
5785e6J31o3P3q3m2L0J37p1Lo8M1q1R1o8J45j61R2j05j29J05J77l4p9m5l2l0l2
5812a54K31J8p5o5Ok0K10k00J13N1k5j6j11L1j45K51P1p6j31R1M6k3j11m3J7M6
5838a3o0j2L0J22K5J5o7P4o9J8r4J40k2j16Q5O2r0p9J71k09L49k77j2j06J64j7
5864A2j19mN6K62j66o7J2p9j6K44m45J89L8P8L7J9Q1k20J59j48R6n9J67l3q4P2
$$ y = [-25, -41, -35, -81, 112, -25, -12, 91, -4, 18, -1, -72, 5, 50, 71, -107, 78, -162, 85, -11, -261, -136, 80, -152, -70, 45, 12, 23, 28, -54, 99, 80, -83, 129, 140, 51, 183, -69, 151, -233, 108, 139, -34, 51, -224, 78, 171, -71, -42, 115, -24, -47, 38, 94, 49, 65, 157, -73, -100, 67, 65, -11, 29, 88, 82, 89, -3, 162, -112, -20, -15, -114, -36, -22, 53, 4, -113, 60, -129, 0, 60, 89, 37, -83, -19, -65, 78, -103, 217, 114, -41, -149, -116, 62, -77, -205, -7, 144, 46, -100, -56, 75, 12, 85, 2, -40, -10, 127, 56, 59, -9, 32, -49, 42, -26, 119, -42, 50, -55, -184, -79, 98, 64, -15, -60, -92, -122, -154, 77, 95, 20, -45, -39, -59, 151, -49, 64, 115, 90, 74, -37, -6, -151, 100, 171, 95, -36, 55, 101, 78, -33, -76, -59, -13, -73, -85, -55, 67, 92, 107, 40, 114, 45, 63, -31, 109, 87, -29, 56, 118, 28, -51, 120, -89, 260, -17, -29, -135, 29, 12, -107, -111, -55, 207, 41, -26, -14, -93, -109, 135, -310, -121, -83, -5, 32, 51, 132, -88, 71, -77, 19, -40, 127, 94, 10, 82]
5890H2r1qQ5j20J34j75J33j2j22O7j05K59p0p4M5J14k07K5J6j07M5K3J43q5l3
5915c8j74K43p1J22p1p2K16j43J11j7p2o8j1O5o5nRj34K42k8Po8L0R7j64n9K6
5942i2O2R9j30l2m8R7J03j71N9r6K32L5j20M5o4N5j14J24k3k21m2K65R6j63m2
5967h6j00L51j76l8l9LJ32j62o9O0m9J47k0M7J63o6j08l9P8M5J14j36n5M1j42
5992a04K8l0Q8J44j67Q2j85m5J58PQ3rJ33k64K36K5m44J56K79k20J7K5Q5k0p7
6017a9R7j08n7L23k74K89m1j86J65j80p0K8M9kM5K1q7j54K41j55J41P4ol03J08
6042f1J93k49oO4J02j4k0K1j56M8J05MO7n0j58J56j01j6K19l03K93m1l04J38J84
6067A15k85K44j5J5j8m9n1Q2pm1oj36K08Kl11K96N0n4Lko4M1J29k16J56q0m1O4
$$ y = [82, -9, -17, 68, -52, 82, -93, 40, 28, -94, -27, -132, 127, 57, -17, 28, 142, -65, -40, -24, -131, -86, -63, 80, -5, -38, -212, 31, -40, 82, 11, -61, 155, 12, 123, 106, 34, -34, -45, 20, -45, -50, -41, -175, 67, 39, 46, -22, 8, 105, -59, -118, -92, -30, 69, -61, -93, -141, -44, 59, -112, -53, -149, 83, 118, -2, 43, -21, 34, -80, 44, 21, -200, -242, 23, 119, -44, -86, -186, 165, -11, -49, -88, -85, 47, -115, -184, -124, -173, -26, -46, 1, 164, 98, -10, -49, 29, 74, 188, 52, -3, 38, -104, -76, -106, -18, 126, -41, 41, -144, -189, -31, -24, 59, 50, 183, -81, 155, 180, -264, -108, 171, -49, -32, -7, 78, 58, -19, 78, -30, -87, 236, -38, 251, 210, 24, 189, 9, -61, -33, 16, 14, 59, 80, -7, -161, 80, -75, 66, 140, 134, -169, -61, 132, -117, -123, -59, 43, 29, 9, 30, -126, -78, 27, 31, 98, 48, -110, 46, -55, -71, 148, -155, 138, 97, -207, -69, 115, -170, 74, 59, 74, 56, 7, -44, 38, 31, -10, -16, -152, 56, 58, -253, 43, 93, 39, 42, 40, -24, 17, 146, -70, 86, 6, -35, 29]
6095B9k7L8J20n6o3L2m6M8j58J60rj15n7Rq0K21K22l55K22r1M6j47OK13j85j41
6121a64M5R8k06J97L2P5k3J9l1jk05O3M2K6j2J02k44L39j06j27L8J43k39K06O1
6146A28k83L06o5j43L2jQL2R8r2O0l9q4J15p3mQ2no0m4K3r8Q4M3J58l85J31MR1
6175A9L9n2j89K23j31r4J55J4M2K4j65J37Pj8J58j93P4m4O3j00R0Km4j31K71p2
6201H5kM7k06J68j11k3O1r1J78q9j40O7R7M4l65J90K2J4J63p4j66K1J94j81K7
6226g0J14J20j26Qk3%J29k30J49o2J9J8Q8j22n4j4J21j39N4N3j11N5Q8j12j36
6251a83J58P4nj37J26N0m27L55Oj13J14n5O8J04j52r0R7K8q0J69j29k9o9Q2k9
6276f7J95kq5j90R7J19j53J95j81J94J23l65J96j4m9N0j40LJ45m9J2o0j0l8j3
$$ y = [29, 2, 40, 160, 104, 41, 73, 27, 75, -83, 77, 68, -47, -104, -95, -175, 46, 268, -87, 135, 44, 90, -57, -51, 162, -23, -164, -119, -21, -227, -30, 2, 77, 54, 73, 42, 41, -164, -101, -59, -33, -45, 57, -187, 152, 46, -81, -43, 100, -139, 67, 128, -155, 151, 86, -57, -25, -26, -18, 14, 112, 20, 80, 41, -43, 72, -1, -5, 77, 72, 12, -32, -9, -107, -23, 20, 178, -207, -76, -72, 19, 58, 6, -183, 40, -91, -185, -30, -16, 26, 50, -115, 22, 29, 11, 169, -24, 50, 6, 69, -31, 59, 61, 17, -114, 157, 85, 83, 130, -76, 92, -19, -42, 19, -72, 106, 17, -123, -56, 41, 85, -280, -90, -68, -54, 109, 35, -131, -110, 84, -97, -70, 44, 164, 38, 46, 23, 23, 152, -78, 71, 9, 28, 46, 134, 12, -42, -56, 65, -74, -20, 33, -78, -23, 65, -47, -183, -25, 49, 44, -93, 33, 83, -344, 11, 17, -96, 18, -37, 31, 135, -17, -107, -10, 18, -62, 107, -22, -51, -120, -38, -67, 128, 126, 41, -149, -52, 67, -86, 109, -72, 122, 245, -120, 76, 62, 13, 63, -77, -74, 71, 22, 34, -26, -36, -74, -87]
6301h7J30n3K29k67P8Q7o9j41M9O8J42l59R4J37p4J44j03j22J20l2J01M9l09J58
6325c0M9J6ol3j70j15M88k64L3O1o3r2K59l61J93N2l9L0qK74l09J20j63NQ7no3
6352e4Op4L7P3p4jl8K12N7J16k97J72oj92O8K5p2MN6O6k27K50J62j21k14Q4l7
6379a9J2L6K2O1j69K26j73N2k96L32k79K84o6J51r3j54J57o0lmN5j73J40j40J17
6404A6kJ1jq7j35L45j54O0k94J91PO0j98K21j8R1j13n2N4j59J55J09lJ14l2j88
6430bn5J65k46R3J97j46j2P5n6o8K1o3L2J17O2j55o0J34Q5m1j19K0K1j17O3K9
6456b6L1j73J69Q6k43P2R0j57R0o8O0M8J4o2L5R5q8m7N0L15k34np1q2J13j6M2
6483C8R8l28J17K5p0J68j72K48j45M4k4J09j53j17J30M9Nj50J47Q9o3J9j65N2
$$ y = [-87, 43, -10, 219, -48, 30, 117, 48, -93, -44, 24, 166, -193, -99, 38, -36, 108, 5, -117, 3, -29, 72, 121, -188, -30, 19, 35, 29, -4, -174, -289, 199, -65, -32, 29, -34, -126, 133, -228, -35, 17, -22, 8, 0, 274, -35, 85, -78, -73, 14, 9, -54, -48, -122, -85, -12, -86, -87, -125, 87, 144, 260, -37, 135, 129, -63, 5, 30, -42, -38, 18, 84, -143, 107, 269, 148, -66, 18, -19, -7, 29, 51, 112, -57, 169, -4, 48, -248, 84, -195, 89, 23, 174, 81, -73, 84, 24, 21, 17, 72, -101, 39, -101, 16, 14, 25, 24, -63, -198, 147, -7, 53, -241, -50, -43, 17, -181, 40, 22, 113, 0, -52, 2, -157, -2, 107, 104, 218, 186, -2, -57, 108, -138, -45, 152, 6, -6, 69, 13, -55, -34, -97, -65, 52, 114, -41, -101, 33, 118, 77, -42, -22, -1, -118, -55, -26, 5, -168, 1, 87, -156, -84, 6, -151, -61, -129, -69, -21, -7, -69, -34, 61, -27, -74, -24, 291, 57, 52, -19, -101, 12, -4, 38, 136, -192, -75, -50, -120, 48, -124, 124, -21, 23, -1, 108, -45, -162, -32, 17, 22, -128, 19, 108, 45, 64, -101, -49]
6507d9p8J15J17j1m6R4n6j64O8R6L8k90J06LN5O6r5L5k9R5j61J3J18k6J42l36
6533a80J73L1n1r7O9K2oj38P6J01J62k70j24K52j06J04j52K59j3n9oK3r5N5j6
6558A4q2k6K13j45O8O0j38KM9j38l4K16m3k7q5K62k28K31O4l02r9J51P0L0nr7
6584a9j1pqQ9m0K9j44M4J73q1j5j85M8J17j29K82r3j69n1J08j5Q1J30j13j20Q8
6610a1l8K1J84p8j3j8n7j3o0K07lm0j79J31J06mk49J2O6Jj47L61k22J59R3k76
6636f7K61k18J81r2k3L1j76L3J03p8K9L5k1O4o6K05l5j54L9m0rJ50j5n5Qj0k00
6663a20J02MJ2j79L59q9q0L9j68K22j99J24qj6N2j12J54k65J98K8M8l10K01J84
6687A81k1q8j34K22k64J70Q1N5l59K20O1q5j56J13r9J06J6R0M4j88N0rK18l16
$$ y = [-49, -127, -12, 105, 94, 48, 142, 86, -78, -10, 86, 124, -166, -60, -57, -2, 64, -31, 4, -25, 70, -91, -78, 40, 14, 156, -180, -7, 24, -27, -124, -55, -33, -39, -177, -101, 0, 162, -108, -232, 20, -86, 18, -134, 125, 112, 53, 47, 70, -25, 30, 14, -68, -94, 119, -26, 42, 102, -36, -34, 15, -123, -157, 59, 16, -11, -96, 166, -62, 169, 233, -69, -168, -17, 53, 83, 78, -19, -30, -37, -45, 44, 4, 33, -111, -67, 106, 25, 10, -175, -127, -10, -139, 143, 50, -119, -170, -62, -77, 4, 134, 21, -99, -11, -49, -28, 156, 78, 65, 47, -10, -23, -83, 124, 121, 81, -98, 33, 139, 135, -114, -102, -36, -35, -182, 179, -43, 116, 209, -67, 194, -24, 157, 65, 42, 73, -103, -70, 33, -45, -16, 19, -2, 62, -4, 201, 166, 12, 51, 11, 2, 152, 137, 82, 90, 80, -120, -18, -14, -2, -181, 178, 89, 9, 48, -120, 102, -97, 27, 19, 3, 55, -57, 97, -168, 30, 58, 106, -204, -3, 181, 160, 72, -62, 160, -104, 66, 147, 202, -157, 63, 124, 39, -117, -4, -103, 3, 19, 109, 153, -35, 15, 6, 224, -92]
6711i2K15j60L04k58r4J14j79K46K52m02P8j08J19n1J20j28M0j33O4Jj4K82l68
6734a52j7K34j21J04J32l15J00J41P5k03l4J12L3l51J48J94o7O8k0r8K4R5j0R0
6758A62j66j09K54k6k08J16n7N1k33L49j40O3o0J67o3m1m5j48QL4O0K25k78qL9
6783e4J04j2J00j01J52k82P3N0j15J38J23j41j02J71p6J02k69K09L3J19j45Qj74
6806h9L1J67p2k19P7K78k58J36k22K73qj7j82J25j65J44Q3k4k0j27Q9M0J7m24
6830c67K38K24j04q6J52j06r7K65r2k24L08K5l2k00J23J30L0r9j12J14L6j65R4
6853E5l5j60L50j83o0j79K00Nm4Q3ql7j8J01N6k9o9j85J60K9P3j23P2j44J99l5
6879G4j57jP4K0K7q8Q9j2J45j24j19M1L6j7J19n8J37j94n8M3K1k9k6l3NJ9J42
$$ y = [-92, 123, -37, 267, 9, -85, 29, -150, 96, 348, -54, 24, -84, 35, -16, 104, -24, 16, -117, -53, -52, -66, 216, -152, -169, 65, -56, 48, 180, -135, -35, 106, 181, -22, -56, 56, 89, -262, -114, 80, 13, 81, 61, -37, -13, 82, 72, 162, -4, -113, 141, 115, -93, 23, -34, 17, -216, 133, -7, 56, -4, 163, 100, 59, 14, -134, -126, -92, -32, 193, -85, -93, -54, 50, 38, 138, 37, 189, -93, -20, 30, -85, 53, 176, 35, -67, 104, 28, 130, -139, 70, 103, 222, 77, 85, -89, -58, 109, 37, -182, -105, 173, -85, 51, -171, 102, 94, 77, -105, 20, -145, -1, 82, 58, 38, -89, 0, 40, 57, -367, -129, 95, -9, -95, 57, -49, -146, 119, 27, -197, 111, 136, 104, -96, 27, 157, 187, 88, -24, 90, 126, -39, 55, 20, -140, 210, 27, -33, -212, -12, -7, -51, 32, 24, -13, -31, 70, 126, 97, 28, -157, 3, 32, 105, -18, 54, -90, 109, 74, -83, -84, -10, 10, 37, -51, 38, 26, 171, 47, -72, -31, 5, -12, 107, 49, 186, -8, -66, -23, -2, -31, -57, -90, -85, -66, 76]
6906G6kJ07j33m9o0M7o7K94j06k8pk7jqj23N7K8J17k22q0L46m8j40l7J64q7q7
6933g6q7N9j07K34R0k06J52R8L6j10J4pj52j43L56k32O9n3RN5N7j03Q0J9J9p2
6959aj8K53m44J12J16o3M4p0n1J79k39J72M6j01K77l9J61j91k09nj37J90q4J27
6983B5j18R8p1R9K4j26J93j9j08Q3q9J19j72J36j03o8R7K6K05k89J59q4M3j11
7007e1o4R4j64L24l19K56q7o1N9k02j13M83l1j53K9j05J29L5o8M9l2J67j67k7
7031a9q9K08m6k89K94N1r4Lr7J23j76J54J17j68l9J09o3P2j4o8J78n6o3O5k25
7056a32O4O5j4J74k07k30J08J77o9j09Q5J64k05K20k18K51k00k4j7J47N7k84Q3
7079a14J05j2j53J57j68N9j6M5N4m5nRJ9K45k34J4q1Kl0K03j94J06J4J02k14J68
$$ y = [76, 74, 181, 48, -1, -61, -14, -81, 213, 107, 79, 72, 45, 44, 36, -87, -30, -2, 115, -107, -187, 159, 111, -29, -66, 98, 11, -76, -163, -104, -211, 23, 113, -93, 59, 157, 193, 83, 97, 90, -62, -205, 151, -81, -12, -65, -56, -1, 56, -47, 33, 52, 71, -1, -19, 234, -210, -98, 18, -45, -1, -71, -122, 57, -182, -10, 36, -65, 212, 173, 334, 143, -66, -71, -208, -18, -102, 25, -93, 5, -66, 33, 57, -69, 124, 105, -3, 80, -9, 110, -62, 74, -29, -97, 0, 26, 231, -58, 101, 17, 60, -51, -115, -21, -185, 139, -180, 76, -11, -72, -13, -215, -328, 155, 124, -29, 0, -105, 24, 59, -9, 40, 8, 175, 8, -19, -108, 100, 54, -235, 59, 110, 16, 19, -78, 45, -131, 23, 140, -28, -67, 42, -21, 51, 37, -31, 147, 91, 28, 93, -132, -68, -3, -17, 157, -50, -280, -172, 5, -64, -173, -88, 76, -129, 91, -127, 124, -76, -100, -117, 30, 87, -197, -114, -9, -21, -174, -17, -185, -126, -142, -97, -43, -88, -93, -84, -65, 180, -54, -40, -121, -119, -149, 54, -140, -34, -20, 82, -132, 36]
7105C6j4l0K62l50Q4O4l1j10K03j55L0J05n6R5k06J40j83N8J0nJ10%r1r4J24j23
7131a27R0P2LR2q8k86L52j30J86j48jq0n3R6K52j68M0o2j17m1J55J13l56J40J88
7156A22j29m1r6K01j43J35O3k02K97k84Q8j79J87R9j53L0J71k56j14K78k72J19
7178g9j1K13l50J97J01k25J74j33O2l0R3k01J43J5l6K6K24j2m9j96O8O7Mj7j83
7203a35J32O0L7r7o3R9J44k1j11O4j84LJ68j23J27r5J41k86n4L6K31j5q0o1K51
7228A68m7l34J66k6J30j70O9j06K86pnP3r3j5k37K33o5m4j5J6J27Jl8j07J02j40
7254g8R9k37K11K08j94r8OP3J19k08JK72k20O9m7k3K7K1P0j39O3n2P6jn1J6m9
7281f6J78j12j07J85J6p6j48Q4j16J89Q3j67J72j44l8J55j11j36P4m4J4K17O7
$$ y = [36, 22, -8, 254, -96, -12, 52, 21, -89, 114, -41, -11, 94, 38, 133, -73, 67, -116, -58, -48, -53, 57, 57, -34, -128, -4, -127, -37, 35, 38, 130, 42, -244, 108, -22, 164, 16, 15, -65, -118, -22, 230, 62, 102, 40, -77, -118, 37, 150, -206, -66, 122, -7, -48, -144, 57, -86, 49, 112, -90, 207, -77, 11, -168, 19, 118, -35, -5, 166, -90, -204, 74, -198, -79, -90, 123, -227, -30, 71, -154, 20, -113, -51, -81, 12, -189, -46, -31, -67, -41, 183, 171, 122, -74, -6, 61, 65, 48, -135, -3, 57, 94, -3, -66, 33, 177, 156, 45, 109, -75, -72, 96, -27, 100, 5, 146, -140, -194, -158, 73, 58, -22, -83, 168, 121, -213, -47, -73, 57, -113, -44, -150, 136, 129, 124, 197, 104, 89, -148, 85, 20, -24, -39, -23, 104, 105, 67, -40, 62, -78, 21, -216, -5, 203, 9, -89, -83, -10, 109, -99, -98, 174, -46, 23, -24, -47, -20, 1, 71, -68, -5, -57, 19, 18, -33, -17, -66, 112, 0, -107, 78, 94, 18, -130, -46, -162, 27, 110, -57, 115, -29, -67, 88, -23, -159, -85, -129, -115, 102, 169]
7304A69k43J91q2nR4j72J55j43J52k44k8K25l8k6j48K16j63o2K53k5k55J07P1
7327aK0P3j00j68J59N0j0j1O2Q0j53R8J41j69k54L77k23m1J35p8K7qJ27k05j04
7352a76J32R0J59j78O6K5l2M5n0n2l68L69j5P4j24j12J92J8k92J69J17l5j48j49
7376b75K78o4j8P3K9q6r8jM7j31K37J31j57N9m7P4j67K9n3J29Q4j32Pl2J05r5
7402g4L19l12J01o1J49p0k72R5K71k13J61j1P9j96j18P2J6J25k16J55PL2r3M9
7426eR4j20J41m13J93o4L65q5j74N1j9P1O4M4j77L2n0k58L21qr9O6J83j05O3N5
7452A66l68J65K57k90K21l20Q6P1J0Q6j31l2k2o5J7L77l08K28j36j0j88N8JK17
7476I0Q4k68J40m21M40n3q2j4j07Q9O6J61j5j24r9j2K52j26o3P6L6J12K5k47J68
$$ y = [169, -74, 117, 35, 30, 124, -48, 107, -36, 116, -128, -156, 69, 31, 5, -143, 73, -90, -152, 101, 76, -179, -72, -1, 19, 92, -8, -176, -17, 33, 23, 12, 74, 154, 1, 99, 240, 71, -183, 194, -29, -70, 65, -13, 14, 6, 133, -72, -176, -44, 46, 205, 27, 93, 118, 86, 131, 81, 29, -339, 30, 15, 89, -35, -147, 45, 63, -229, -60, 57, 22, -126, -275, 3, -61, -79, -6, 23, -63, -161, -162, -115, -246, -9, 122, -35, 24, -23, 51, -116, -87, -140, -11, 73, -59, -52, -84, 21, -74, 245, -67, 34, -27, 122, 52, -220, -125, 146, -67, 94, 83, 162, -34, -152, -80, -64, 61, -155, 0, 7, 39, -54, -5, 89, -31, 110, -303, -110, -174, 191, 106, -68, -17, -36, 35, 99, 143, -34, -2, -52, -310, 11, 3, -96, -30, 153, 48, 111, 166, -202, -37, 220, -70, 151, -169, -83, -12, -2, 84, -47, -79, -101, -166, -149, 228, -80, 148, 12, 2, -186, -128, -127, 90, 174, -94, 46, -375, 65, 12, -70, -84, -191, -102, -36, 125, 110, -14, -113, -125, 127, 1, -62, 14, 50, 162, 187, -60, 108]
7501A08j39j5K0P3M2p2J06k77J31j60K24j0j20J45j08k7J30k47N7J63J7j33L9
7524e3J11M0j06l6j22L22m9j82oM2o4J60M3j45o0m4l6J75NMKj17K19l3l2Q1j11
7551Ho5L5L8m7J60j63n9p4J66m1r1Q5k1J49m6n0k3l1l3L1k04N23l05J44o9qK0
7578B9J08l1q9m6p8J89n2K6j80L6Q4m3n4O4J52J50l02%J49k40K3J29p4rJ48l9
7604E0l34L80n6Q1j74J05l6K1p6J25j8j54O0K5j34J35Q1j27J21j47o7K72k01L6
7628c2Q9n8l9J2J22j02mJ0P3k1n7n4Q1j65K93kO7m52K65j52K16j00j35K3J47j70
7654a45P6J22l5J2l7J4q5j18J57m9L8K2M3j4L6J38j33k5Q1j09l5j1L1J38j98p4
7680a60L49j05j63K21j7j82P6M2j52J8J55J0k19L1J60j75Q3R3r2k9O1j2j7K5m4
$$ y = [108, -31, -46, -26, 47, 89, 17, 123, -154, -23, -183, 41, 31, -89, 56, -52, -79, 51, -196, -139, 24, 41, -92, -53, 58, 98, -8, -44, -166, 156, 107, -75, -81, -39, -103, 57, 100, -45, -105, -149, -185, -10, -5, -1, 1, -116, 103, 70, 38, 119, 8, -57, -22, 16, -31, 129, -34, -93, -167, -1, -42, -133, -48, -69, 80, 34, -16, -39, -70, -103, -72, -276, 247, -58, 86, 17, 9, 29, 137, 106, 17, -29, -107, 82, 30, 56, -124, -88, -4, -47, -101, -37, 115, 265, -37, -37, 112, -128, -105, 24, -50, -59, 89, 50, -284, 96, 40, 121, -53, 52, 16, 37, -39, 86, 68, -86, -26, -1, -135, 0, 81, -46, 75, -72, -139, 133, -68, -32, 57, -1, -40, -28, 94, -8, -12, -2, 71, 50, -7, -61, 20, -145, 148, 146, 213, -239, 26, -126, 90, -10, -145, -122, 25, -145, -69, 53, 18, 30, -7, 7, -78, -196, -39, -88, -50, -28, 15, 1, 37, 175, 42, 17, 98, -11, -46, -57, -26, 112, -86, -160, 189, 84, -79, 142, 125, -57, 19, 61, -91, -73, 82, 92, -127, -96, 64, -111, -28, 65, -27, -56, 5, -7, -24, 1, -43]
7705d3PQ2r8PP8k59K83k24K39l9P1k37O7j7K27m8j27P7j60R5r4J99j98J06j7m9
7731g2q3K33k98M8J02R5J78j29j62J6Q5r6J8J00qm7J16k0j11L1q9J81n1o5J94
7756A66n6p7K1j25N7j0j6Q1k4r1J03M0NMp3j2M4j8KJ29k89J03kl9J91j06O8j78
7784a02Q0o4O6P4j42P7K3M2m7r1k6K6J81k40J76N1pm7J3J1q2R4l0Mj36K76j67
7811A3j6K0j35K40p5k08l5J61J38k71K44j09Mm6L5J9J07j2J97l91K20q0l5p2J47
7836F0j5L1q5p1R4j12R1K71k96l44K90R0p7o6J77k29K37J18o5n1k54L13r9M6k68
7861b14K72q7R3o5o0K15k15J08j57J40P2m0JR4k33J62j49K38k20K6L73m84L35
7884B05l81K12m5J40l99J72j5J72o9OK82l06K4L8Q6k40J40j61K30J25k82J30J75
$$ y = [-43, -36, 46, -52, -45, 33, -226, 57, -167, 72, 33, 104, -133, -66, -83, 144, 96, -31, 46, -114, -19, -113, 86, -112, -6, -23, -72, -155, 78, -220, -172, -70, 25, 203, 74, -88, -72, 13, -83, -65, 35, 27, -20, 96, 76, -35, -4, -93, 88, 37, -28, 166, 110, 33, 54, -71, -14, -24, -40, 41, 17, -74, 29, 69, 74, 78, 5, -7, 37, 19, 21, 150, -139, -36, -38, -77, 114, 8, 76, -102, -22, -86, -20, 54, -88, -11, 12, 54, 7, -84, -110, -84, 97, -143, 33, 84, 77, 30, 43, 54, -28, 66, 36, 40, -96, 180, 13, -3, 17, -118, 122, 47, -161, -196, -35, 103, -168, 76, -33, -29, -75, -40, -21, 86, 74, 271, -120, 100, 20, -15, -87, 60, 45, 76, -9, -80, 14, -98, -7, 264, -32, -376, -86, 4, -73, -139, 38, -191, 46, 164, 99, 48, -206, 107, 8, 54, -214, 58, -29, 64, -1, -61, 154, -61, 47, -110, 30, 102, 62, 63, 157, -76, 86, -63, 175, -45, -19, 354, -130, 205, -176, 36, -9, 131, -268, -96, -111, 61, -8, -2, 280, -26, -2, 36, 122, -118, 22, -139, 91, 216, -66, 64, 239]
7907B39j84n6O2m0R4M6Q7j65j58j9J4Q3P6j71M5J57oj6k0p9m6p3m0L7J39P5r2
7934a1j7O2P7j19j42J58j5j08K10k03J87j31J82p3l9J17j30r3J24j84P2l5K50
7957A39n1k25K33J35j45j28J32m3j65lN6J5K1Q8j45O8j55L13r8m2Q5k3p8J32K5
7982A41j45o7j4K2K4Po5O6R5j56K01q2n5K64l13J31l3j96K08j12J08J9j60K98
8006A86r3j26j26J88q4j16J06Q9j21k6K05j46Q3j92L97j73j10K40k41l8l2M0J86
8029I6j08oj78J76p7Q8J36j62K34l36J94J98m11K84j68N6k12O8J50k14J33k7M2
8052d4m3J50q6J7J54k61K43j96J01r1J9n1O4j5m0R7J57j7p1j04mm2K04kk40J76
8078G5j24l2J21q2lJ19p5K8r0jM4l4l8L6J29O8N2j58L6J07m26P1J06j86J10Q8
$$ y = [239, 55, -1, 61, 21, 115, 161, 248, 83, -75, -94, -80, 3, 79, -92, -47, 110, 104, 88, 68, -11, -57, -130, -170, -133, 6, 81, -11, -28, 34, 111, -8, -150, 8, -7, -115, 95, -108, 79, -52, 130, 57, 18, 135, 5, -88, 36, -148, -76, -111, 139, 88, -137, 96, 231, 86, -42, 90, 47, -118, -121, -65, -50, -29, 59, -86, -18, -173, 140, 42, 0, 85, 62, -16, 116, 141, -4, -71, -85, -63, -39, -32, -97, -31, 64, -92, 109, 27, -28, 236, -77, 54, 21, -175, 33, -79, 29, 48, -112, 186, 93, -33, -159, 29, -55, -171, -65, 24, -97, -123, 82, -64, 19, -173, 224, 51, -59, 181, -60, -98, -130, -90, 96, -12, -18, -196, -20, -97, -9, 127, -35, 199, -137, 57, 255, -156, 128, -40, 16, -196, -128, 22, -192, -59, -86, -44, -87, 63, -23, -6, 148, -113, 130, -66, 35, -56, -37, -88, -24, -39, -79, 18, 175, 158, 87, -17, -21, -63, 141, 139, -101, 75, -49, -81, 40, -42, -45, 74, -1, 27, -63, -64, -20, -54, -92, -56, 73, 141, 193, 35, 71, 178, -248, -177, -71, -257, -147, -59]
8104e9J02n1J63k48o0P3J44r8Qm7N0K3j11L33k20N1r1Q6j9k6m4P7L7j70J54j00
8130d3L1k17J83J95k3L3k11nl9K05j25j67K34o8J3j56J41J57j70mJ78l8l5j14
8154d5K44k11j06K47j19nL0j53l1J55l2K0R4j11J14q7K7L1J5M0j28O2J47k86M8
8179d0J30k20M7K71k79LmO5k9j20K92P0
$$ y = [-59, 43, -8, 155, -93, -153, -80, 64, -34, -26, -73, -23, 0, -111, 222, 2, 53, -38, 48, 29, 3, -41, 36, 73, -97, 57, -43, -12, -229, -46, 149, 126, 159, -52, -57, -96, 109, -16, -183, 51, -17, -4, -160, -19, 138, -32, -36, 142, 104, 69, -45, 199, -12, -118, 129, 10, 5, 35, -118, -149, 6, -26, -6, 88, -23, 91, 4, 31, 62, 77, 117, -11, 51, 198, -88, -40, 90, -130, -83, 188, -91, -88, -92, -27, -56, -176, 116, 186]
8191A86
$$ Imaginary data points
##PAGE= N=2
##DATA TABLE= (X++(I..I)), XYDATA
0@%%%%%%%%%%%%%%%%Oj4J6j6J6j6K4l2L2m0M8n4O2p2Q6r7J09j24J41j59J78k00
38a06K26k52K78l09L46l85M25m71N21n76O35o98P70q47R33j029J133j252J388
57G30j541J716j919K158k447K798l240L816m604N758p645J1481l5714M1275o6598
72e3976o3578J04070m4913m6924O3640k6638k9618J05904j43l7182Q7348K3412
84H1402n2802L6338p378m4599M3075p893n9494N3162K1681o6221Q199J2828m7524
97b9226P463q352m4808M5686K4855n8515L3778M9819m8706N518L5213m2963J5599
110a4639M6308m9818P246P2378l5290k5993N1272k2005k8432L2713l1655k3534
122b1449N5725k0193m5866N1534P397n2575J5772M024l3078J9907Q48k9522L7079
$$ y = [0, 0, 0, 0, 0, 0, 0, 0, 0, 0, 0, 0, 0, 0, 0, 0, 0, 6, -8, 8, -8, 8, -8, 16, -16, 16, -24, 24, -30, 32, -40, 46, -51, 58, -66, 75, -84, 94, -106, 120, -132, 146, -163, 183, -202, 223, -248, 273, -303, 332, -366, 404, -443, 490, -539, 594, -658, 730, -811, 905, -1014, 1144, -1303, 1495, -1745, 2071, -2533, 3225, -4420, 7061, -28653, 12622, -53976, -117554, -13484, -58397, -105321, -41681, -68319, -97937, 7967, 7824, -29358, 57990, 81402, 28600, 64938, 57560, 12961, 56036, 48143, -11351, 41811, 63492, -2729, 5470, 18298, -29226, -21763, -30115, -74923, -29237, -4382, -62897, -29119, 20700, -28006, -22488, 12725, -30238, -14639, 31669, -18149, -10903, 61475, 26185, 192, 51464, 29459, 1027, 33740, 2085, -21449, 34276, 14083, -31783, 19751, 27148, -25427, -9655, -5631, -38709, -18802, -17954, -47476, -10397]
135a0397K1569l4008J6442K0607k5150R367O761k4072K9153K4505l3888J6383
147A7272L5381l1334j0912J5636k7653j748J7920l2260J842L9527k7537k3428
159b7294L0253j4697k5366J9852r791r810L7950j808k0403L5380J0557k9574J0693
172E942R217j5177J4242M828j5999K2317J1005k9670R22J0682k2387o509L021
185g566j3144J0415R905k0592O954J8783j9350o624J3460r170L957J5825j1092
198h239P938K7267j3866j1584K1086o347j6177J0850l836p217J7421n947j6718
211e369J6643M24k5730K419N367j2223M444M662p198J3190Q627j5609K486J2231
225D364r623k752Q253l79P572P791q387M243J0632j3034q202O493n135k954M733
$$ y = [-10397, 11172, -22836, -6394, 14213, -10937, -1570, 5191, -18881, 10272, 34777, 889, 17272, 52653, 21319, 10407, 26043, -1610, -3358, 14562, -17698, -15856, 23671, -3866, -27294, 2959, -11738, -37104, -17252, -27043, -36853, 1097, -711, -21114, 14266, 24823, -4751, 5942, 15159, -18, 14224, 19052, 3053, 25370, 36375, 6705, 7627, 18309, -4078, -10587, -7566, -20710, -10295, -390, -20982, -14028, 4755, -14595, -21219, -7759, -16929, -12972, 2853, -8239, -301, 26966, 13100, 1516, 22602, 16255, 78, 10928, 7092, -125, 17296, 11349, -5369, 11274, 11698, -14032, -11613, -6246, -18469, -14025, -9363, -16561, -3371, 5256, -10353, -7867, 4364, -5259, -8011, 242, -137, 7435, 15226, 6839, 11082, 21714, 8680, 478, 6971, 1836, -1118, 3615]
240C615o262J977R976j1516r853J0026m723j1319O630J712j217J1263o81n943
254f315J2366J692j3411M172P837n168K923N620k305N278K684j1383j902N208
268G296q628o425M688M06q4J774m024K41L357o219n715N232J942j76L587K258
284d90M766M308m491k754N565j730n168L187K850J23K918k375m185L041k722r978
300g135L76L749l822l51L833J3J634N78n179k34M497k370k181N804M880M59J289
317E840P63R9J16l352l194J411J977r95r15J676J345k518m598k128K39j839k549
334h622J497K975K316N40q37R21J956k038k752K262L562Q05L87K620K418l80k302
351E328k636j010j05k163k095K162K660j547k179L98o96k874j758q43J294K618
$$ y = [3615, -2647, -670, 9306, -2210, -12063, -2037, -6760, -18079, -11449, -9737, -10954, 309, -372, -6315, 6051, 7743, -5668, -1496, 6341, 1173, 4096, 9716, 7411, 12689, 15373, 3990, 2088, 7296, -1332, -7757, -3069, -2663, -2747, -973, -4997, -4756, -1399, -7618, -13333, -8101, -6159, -6335, -2748, -490, 4276, 8584, 4093, 1339, 6904, 5174, 6, 3193, 6043, 6166, 9084, 6709, 2524, 5565, 2843, -7135, -6759, -3010, -6832, -7183, -3350, -3337, -1703, -1125, -6304, -6538, -2041, -4411, -6592, -788, 4092, 4551, 5840, 6603, 6702, 6818, 3466, 272, 1683, 3660, 2665, 1750, 3426, 4771, 2253, -2345, -4473, -4234, -6073, -8622, -7125, -4150, -1834, -1294, -2131, -1210, 746, -1292, -4044, -1782, 1780, 2585, 2972, 5592, 8010, 7630, 5328, 2692, 1682, 1577, -586, -2681, -519, 2141, 594, -1585, -1187, -1883, -4757, -6515, -7358, -6064, -3446]
367c446J152P6L645K429k475j460J415J59q85Q72J006K145K206j891j945R64j627
384B340m375j158N66L53J86j49M65J655q33l130k68Q26k63M21J106K215L529M4
402C530j801J782M05l220m8O88k67J891P23k061J472J024m803k161K033k342j398
419d553K153k51R07K349j988j821K852q99k882J832K145K29J903O26k30K218o72
436C918l175O63P28j979K03Q29l7J523r03l031P64j0l786l78K005p27J234K062
454i7j578J313K346l585r37L503j011r72L485M86o6K296k051k213J960j443l833
471b397K148J083k001J517J89k043J266j030l628J088J990k015J491K836m09J197
487A282P65k320Q05J516k853L37L311p58K01J750j933q29J155l513j572K769j384
$$ y = [-3446, -2294, -2218, 1427, 3856, 1381, -79, 1336, 1495, 610, 1482, 2488, 4633, 6839, 4948, 3003, 3967, 2340, -2035, -3193, -2627, -2274, -2088, -2237, -1772, -117, -950, -4080, -4348, -3522, -3785, -3364, -2258, -43, 3486, 3530, 1729, 3511, 3916, 696, 648, 1336, 1069, 2960, 3683, 1622, 3094, 4118, -685, -2846, -813, -3155, -4553, -2400, -2651, -1744, 605, -1383, -3204, -352, -1251, -4133, -2301, -156, 73, 1976, 2602, 2372, 4590, 3918, 743, 1406, 2134, 155, 358, 1187, 1150, 2673, 1770, -1261, -497, -507, -4293, -4671, -2666, -3393, -2159, -97, -1675, -362, 1984, -1601, -2538, 965, -46, -1018, 2467, 2953, 2887, 5183, 3132, 919, 2879, 1436, -2397, -249, 834, -1167, 350, 539, -1504, -238, -1268, -4896, -3808, -1818, -3833, -2342, 494, 85, 1282, 2047, -273, 532, 2048, -805, -468, 2843, 2085, 2286, 4036, 2103, 1274, 2429, -1084, -2656, 113, -1271]
504a271j643K823k44j273J714j353k174K343l97k435K903K294j714J867J171j873
520G38J051M79k890R62J922k185O08K113j497k18M62k521n07R90k235l15K249
537g94k87j71J385q16l53J328k089n44K799n58o54K842M09j239J762j259j930
554a69J466m21k101J892J127j753P53L24k122L05l89k188Q19J553j242P61K172
571G87q92n1R25j555L6J468j183M14K332k93j42R90j165j108R40j743j266K123
589F17o21j312J928l55j618R22q76j569J491K56j445K233J051j132J257O48j564
606h9P28N14j507P89J550j136L66J068j333m64M56j834n97J403j514q0J733n44
624d91p10J335r55q02J134p28n27J957K46o17J914j25r44Q88n88j378J389R2j198
$$ y = [-1271, -2914, -91, -335, -1608, 106, -1247, -3421, -1078, -1475, -3910, -1007, 1287, -427, 1440, 2611, 738, 1789, 2268, -622, 340, 2262, 77, 685, 2798, 1301, 1083, 1545, -976, -1483, -493, -2728, -3043, -794, -1081, -1252, 133, -683, -1036, 292, -1797, -2341, 458, -100, -754, 2088, 2497, 1258, 3020, 1761, -169, 1297, 876, -1225, 667, 1794, 41, 794, 1118, -1004, -699, -1088, -3276, -2457, -904, -2146, -1385, 787, -105, -156, 769, -786, -750, 718, -465, -51, 2281, 1988, 1846, 2836, 1671, 563, 1503, -240, -1506, 617, -4, -1316, 612, 257, -1361, -439, -1315, -2884, -1393, -1137, -2582, -349, 702, -430, 827, 1475, -89, 639, 1153, -354, 435, 1985, 849, 1215, 2283, 950, 486, 942, -892, -1489, -86, -1600, -1680, 53, -491, -1201, 134, -821, -1623, -489, -1217, -1744, 213, 459, -158, 1756, 1631, 687, 1575, 987, -391, 998, 1090, -108]
643a08J227O79j875N13N27k126k9N54j500L75J697r35J6J336q55k81Q00p52l08
662a045J598r7k37J480P2q02O61n18r91O42o10o39J071J26j224P33k0j362L78
681g84m25q84R00O87q45R99Q92o96J53N65r39J33J053o88J47J555n04l15P74p83
701I95j149N85o83o85R44l29n98P26J54r20Q7J11q08L94N13k59R09O80j19J58
721G06K18n87J56K7n54O10O34m33L73J50o66n69J8q32j03L05l34k35P55K4l39
742f76L55l46k21M16n6r3Q24P01n33R42j42n82K02k18o27K99L22m63K87K65o05
763E1j00j03n66j06n4l40M17M12p1k4M82k32J94j45l99O29K20NL44M40p7l21K31
786H87n16m99K15O8l89M96j45k59J66m34j83k04j98N6J46N32j32M46J83qN4N7
$$ y = [-108, 1119, 1798, -77, 436, 963, -1163, -1192, -638, -2138, -1763, -66, -1001, -985, 351, -504, -785, 15, -737, -1045, 553, 456, 219, 1699, 1771, 969, 1630, 1112, 121, 763, 153, -486, 585, 711, -513, 220, 200, -1162, -784, -1209, -2093, -1193, -506, -1351, -352, 540, -156, -3, 562, -377, -244, 809, 121, 268, 1823, 1319, 1004, 1778, 995, -154, 431, -252, -937, 7, -322, -920, -194, -40, -960, -873, -762, -1570, -1176, -663, -922, -13, 667, 548, 706, 924, 337, 493, 520, -34, 576, 1210, 777, 1150, 1300, 634, 65, 83, -749, -852, -547, -881, -1116, -361, -337, -676, -321, -667, -888, -472, -528, -621, 203, 904, 371, 1313, 1171, 589, 791, 573, -54, 245, 567, 104, 391, 656, 51, -49, -152, -718, -824, -878, -1218, -801, -389, -460, -484, -2, -234, -40, -185, -584, 45, 265, 270, 614, 1054, 977, 656, 887, 371, -128, 87, 155, -234, 262, 117, -142, 24, -410, -593, -797, -995, -939, -793, -261, -393, 53, 236, 228, 282, 339]
808C39k55J5L68j24K77L15q5%k66j82l75j49l68j1L07j47j18J28O8j31l2l62j98
831i86N20O6J81N52K31l1j62J58M3l00m6j8N3L25M9j89K0l06k52j96k21k49J84
854e74J89Q2l8K15j05k6j73J02k96L83K91K36J88J76K07l79J80k48j57q0l7j06
876C0N1K33j67N8l06m07k8j77k12K04K97K63N6J03k36N36m60n3L72j01K22M67
898G45j72N7K09j89m53j33J01m16R5J72j81R7J04k82j50J94m15j32L63J11L4J92
920d9K23J2K24k61q4J55k11M2K83m1M25q3k69m33M17l62l48%Q3j52K33J24k54
943c26K23K6n05J86J09j68K41M42j61L64K27k88j46J95l08Q1J47k28j9M82m97
964G7o4K34n05o3J7j23l48N11J24k81L55l33J39K41n6j20K98J48j30M17L9j63
$$ y = [339, 84, 99, 467, 343, 620, 935, 850, 850, 584, 402, 27, -122, -490, -501, -194, -341, -459, -331, -263, -394, -426, -788, -986, -466, -400, -219, 333, 564, 533, 371, 529, 572, 272, 226, 208, 261, 586, 635, 446, 466, 160, -92, -288, -509, -758, -574, -385, -303, -341, -126, -231, -257, -430, -328, -624, -241, 50, 286, 474, 650, 857, 478, 658, 410, 253, 173, 136, 30, 81, 314, 147, 205, -101, -508, -536, -713, -925, -721, -424, -161, -105, -2, -238, 298, -162, -215, 157, 56, 278, 745, 573, 630, 839, 650, 197, 64, 165, -251, -156, 16, -165, -68, 36, -246, -396, -202, -617, -749, -386, -275, -241, -49, 174, 186, 410, 149, 65, 220, 9, 51, 334, 293, 718, 635, 366, -67, 350, -12, -360, -360, -277, -429, -196, -72, -326, -103, -77, -582, -396, -287, -455, -214, 228, 67, 431, 658, 370, 224, 419, 111, 192, 339, 111, 92, 574, 77, 13, 247, -258, -321, -304, -427, -775, -264, -140, -421, -66, -399, -260, -19, -75, -195, 103, 251, 121, 538, 577, 414]
986D14N2k56k85n8K38j12Q3J58j98r9J18o61L11Q1k95L5M42l58N7J54P6m6J29
1009b0O9j66L59K03l09K92J84l79J11k25q3J4K6m29L67Jk14K12k01j36J59J4p22
1032h73O35O0k12L29L95j53P7K65m79oK61j12r5N14j78q0J75k13l68L20m26m15
1054e79N99j44l47K86P9k93K38M1l59L53l4P6l9L01K7j1L7p8J35O0k54m3K23n3
1078B21j32K40j46q7k16n0m14M41q2k77L22J39j56n5K07j79L9K20m82P68P3m46
1100e2M27K31l95J00J9m06J1K47k69m3L39l69j16J36k5r8J18k10K6J45N8o3J60
1123b9p3J45K31k92P5K48m5K0J52j07k99K34R0m75J36J31l96J55K42pl11K39m51
1146c87j02N21l79jK78O4j87K49R7J11o2J99m59L32j14k44N01O5l25m6L5j46j71
$$ y = [414, 466, 210, -75, -133, 105, -7, 76, 234, 36, -63, 55, -606, -295, -214, -509, -474, -32, -390, -333, -179, -103, -149, -20, 49, -117, 242, 445, 136, 428, 612, 233, 344, 119, 36, 50, 76, -353, 14, 15, -199, 13, -188, -324, -165, -151, -873, -238, -178, -390, -61, 334, 181, 258, 523, 44, 38, 299, 187, 92, 606, 428, 348, 523, 310, -58, 262, -164, -579, 20, -124, -471, -185, -106, -399, -161, -120, -479, -126, -160, -84, -123, 178, 205, 194, 231, 153, 288, 348, 94, 51, 274, 221, 89, 329, 183, 96, -120, -170, -584, -143, -225, -502, -180, -41, -197, -252, -45, -224, -185, 35, -447, 321, 394, -52, 375, 606, 211, 311, 330, -76, -65, 182, -87, -130, 209, -160, -276, -140, -165, -263, -145, -355, -329, -184, -126, -189, -29, -102, 43, 274, -18, 57, 305, 260, 280, 432, 325, 26, 260, 350, -125, 11, 142, -254, -99, 143, 136, -175, 64, -387, -489, 32, -347, -348, -70, -6, -193, 56, 153, 264, 202, 401, -58, 274, 160, -84, 417, 482, 157, 111, 146, 0, -171]
1169a71K43l04k1J22j78K68k14l9K29j08j34J65O3L6J18K61k02M9J79j93k22M07
1191C54l03oJ82J68l12j7l7k67J57m28J01K71J16l16J41J44k03K82M6j29jP4l9
1214b2K02l4J40j59K72l02M0K19m09O0K13k72r0K31n6k19kj51o8K58n2j47M31
1237H3l27J32K11o0l14L78j33l9K15K60m29L52L4k29L0q8q8Q2j01j70K88k46l3
1260a92J29P6k75P0J01k49J28L77m38K20L37j0j41K14j35k6Q3k98O0J52Kk63Q2
1283DL0l00L26j12k33K41j08j29J76l4p4R8K26l35J84R1k53J79K91j9k49K08o0
1306A48j01Q6j71J13K14l10j7N6J66m52P6J18j70J00J14k11k1L87m31J39L15k06
1328e8K5R2j08P8K67l85K99L7j22l2j13n7j07J72k1q0K13p0k98K89q2k45K42k0
$$ y = [-171, 72, -232, -253, -131, -309, -41, -255, -294, -65, -173, -307, -142, -79, -43, 75, 336, 134, 183, 362, 169, -53, 354, 51, 45, 227, 395, 83, 66, 29, -238, -81, -509, -408, -137, -21, -337, -196, -52, -255, 27, 73, -56, -57, 17, -22, 180, 146, 286, 127, 399, 97, 137, 356, -53, 7, 220, -52, -142, 89, 33, -186, -188, -339, -407, -149, -201, -348, 83, -244, -112, 99, 39, -275, 103, -30, -69, 146, 406, -23, 329, 363, 134, 164, 76, -12, 70, -31, -201, 87, -159, -192, -63, 13, -262, -192, -91, -340, -212, 165, -273, -53, 284, 274, 133, 347, 212, 186, 269, -29, 31, 183, 185, -78, 4, 34, -266, 60, -52, -285, -44, -152, -281, -105, -139, -213, -115, 111, -224, -40, 51, -202, -23, 268, 249, 0, 208, 148, 47, 133, -38, 75, 289, -21, -38, 18, 184, -268, -192, -74, -244, -144, -30, -241, -262, 125, -306, -167, 148, -58, -33, 59, -49, 29, 296, -89, 210, 247, 125, 93, -20, -77, -184, -12, -33, -113, 100, 30, -268, 21, -61, -306, -64, -84]
1352h4J83j83O6J0K0L82n76J98j16J91K14q0k44J56j6j28L2n0J11r6L8j10j3L6
1376e9M6j03J90j58j89J33J18j68J26Q7m5k7L00k52R4J03j44K8j5K17n2j05j21
1399Dk4o9J58k94j7L06l09L15k40o4K99n4k50J17Q1j42K48J5p9L53k35o0k5J5
1423D9r4J58N0k34K18n3k16J86k62q1J89L5j0m0J84j30k10L20j07Q7R5j06J6k
1447D2N9QNm2l9J44k7j11N1M7J08m04K58j88n8J57q5n7L6k6j41N4K41j57Q7J65
1473A27k05K81k10J18Jj29J27J45k7m07L57r9r9J56j38k14nK47J18j79j9j40J78
1496a6n2j15O2K37k36j76M35Rr7M2k1nJ3m5J22j13J5Q3rk11J18L2j16k9k9K2q6
1523a66K97lk68R4J30k97J64oj7j63L22k2L4O2q6k9O9j76j01K34o9N3P2o1j67
$$ y = [-84, 99, -84, -18, -8, 12, 394, -182, 16, -100, 91, 305, 225, -19, 137, 121, -7, 25, -25, 86, -10, 28, -82, -95, -59, -13, -116, 74, -84, -273, -140, -22, -190, -64, 23, -22, -49, 251, -1, 93, 196, 52, 80, 65, 282, 230, 125, 4, -20, -89, 69, -225, -242, 64, -245, 70, -170, -234, 65, 11, -239, -122, -41, -183, 65, 80, 1, 354, 119, 59, 34, 49, -45, 113, 163, -71, 147, 94, -122, 64, -198, -279, -90, -55, -65, -105, 79, -51, -261, 59, -48, 39, 134, 28, 44, 42, 101, 109, 114, 72, 33, 177, 150, 39, 90, 137, 245, -159, 99, -89, -147, 10, -75, -132, -96, -122, -263, -209, 32, -125, -38, 127, -78, 203, -7, 111, 112, -17, 110, 255, 228, -179, 178, 79, -20, 136, -2, -216, -221, 26, 144, -35, -54, -194, -16, -68, -183, -121, 116, -120, -296, 139, 148, 51, 93, 72, 67, 80, 35, 157, 44, 59, 142, 133, -78, 40, 72, -44, -73, -102, -80, -166, 131, 128, -140, -46, 84, -213, -49, -55, -72, -235, 87, 65, 99, 161, 75, 46, 115, -61, -162, 72, 3, 56, 128, 67, -100]
1548a00K23k98l0J38k34K54J54m7j34J0r6J44J26k31j5K82m7k02K30R6j64pj31
1571g9R5q8O2j24J51J32k17p9M09m08j20J79K2q2K17k95P9M25k66O4j30N1p1N6
1595a7J37k62L88j44j11J98o3j5q9k9j00J92m6l22K10pm1p9J01q7L08o8j61J55
1619D8J17n9k10K19k34L67O3l72J64J55k24J5J6m10J11J96j47j39M02p4k45K94
1641E3j7k64K15n2J22j27R8q9O3K18M1k8j37J7J5O4j57O5r5q9K56j1j71o5K76
1666B01m22L9K96j91o6K97l42J10K24k55P6J52N2k10J73m3l37N86k00l72L85r1
1688F2k06K46k10j15K77R3m21K1L09l19J05Pr6K05J79j43j34N40n43J35r9P6J02
1711G1P9j20p1M21l93l8J41j43j23K35j33j51M16j97j36K04j57j21J42r7m4J75
$$ y = [-100, 123, -175, -205, -67, -301, -47, 107, 60, -74, -64, -160, -16, 110, -121, -136, 146, 99, -103, 127, 223, 59, 52, -79, 16, -72, -10, -134, 17, 149, -68, -147, 262, -146, -266, -87, -65, -147, 70, -225, -146, 279, 13, 77, -53, -2, -73, -17, 120, -142, 246, 102, -9, 189, 126, 111, 22, -7, -107, 85, 39, -283, -73, -80, -121, -200, -99, -186, 122, 54, -107, 48, 165, 106, -104, 115, -119, 248, 311, -61, 103, 258, 34, 49, 65, -345, -234, -38, -185, -324, 78, 4, -241, 53, 36, -228, -13, -65, 57, -70, 28, -61, 2, 220, 261, 233, 96, 113, 128, 192, 35, 100, 5, -84, 172, 161, -10, -75, 201, -221, -182, 114, -77, -143, 154, -188, -78, 146, -109, -33, 119, 171, -39, 134, 91, -246, 340, 140, -232, 153, 62, -144, 102, -108, -223, 54, 147, -274, -253, 56, -263, -158, -151, -247, -42, 137, -6, -140, 400, -143, -8, -107, -31, 71, 150, 30, -41, 380, -13, -51, 90, -53, -176, 59, -74, -225, 191, -6, -142, 62, -95, -216, -74, -171, -215, -40]
1733d0K04l54K13K78l16J93j60o9Q7J06j19L5j33j37J82L14n65J83J03n7n9l8
1755a49J01q5RK5P5K55l19j87L01q0J11P6L8m5Q7j71K4L02k10j14Kj94J01r5R3
1780d9o1L30k36k25J93K30l30M5M4O9R3L3k95J89J08j71l9J96k26J74p7K06J0
1803B11L6j78j49R2j06r8J16J85l99K82j27J0Q0k16L2jK48j86K27j93J23J00N4
1826A43k50K77l8m1j42K13k99J84J58k30l7K27r9jJ99j38j31Pp3QJ06k87L12j8
1850E0K1j59J45j48K20k12p5J78QK06j46M8JO8l99K70r6q6K52j38j03R1Lj81J78
1875dl4M04m79m2J75J32p5j23K57n3j73O3k5Q6m0j21p9K58P4k25j16K25%j38r6
1900a49kQ4J52k52K9j42N33l52L3R9J73k28j87N9L59k43p7K46P7j00q7n1J7j4
$$ y = [-40, 164, -190, 23, 301, -15, 178, 18, -51, 36, 142, 23, 58, -75, -212, -30, 284, -281, -98, 5, -52, -111, -149, -48, -133, -124, -99, -24, 231, -88, -275, 26, -54, 57, 133, 171, 126, 213, 42, 66, 368, 158, 44, 46, -148, -47, -142, -49, -110, 220, -16, -241, -48, 182, -148, -103, -59, 10, 103, 136, -159, 30, 138, -33, -72, 124, -102, 72, -5, 201, 211, 247, 69, -80, 12, -94, -192, -76, 109, -290, -8, -135, -125, -45, -261, -229, -230, 18, -168, 59, -134, -11, 89, 143, -107, 170, 132, 91, -51, 162, -137, 47, 205, -25, -62, 165, 66, 65, 264, 126, -5, 2, -71, -63, 43, -244, 68, 50, 71, -88, 57, -91, 129, -83, -158, 20, 28, 234, 88, 136, 137, 205, -194, 76, -20, -106, 146, 8, -95, -4, -1, -182, -4, -38, 366, -113, -155, 20, 152, 77, -46, 211, 158, -15, 48, 23, 109, 69, -52, -131, 127, 201, -24, -140, 85, 85, -53, -149, -151, -67, 85, -167, -138, -280, 253, -99, -66, 33, 206, -22, -209, -150, 209, -34, -111, 135, 212, 112, 25, -26, -9, -23]
1924b3j48LQ8Q3J28j60K7p4q3J23N4O8N0j37m6J21J24j59P3k32K43m6r0J12j51
1949e2K99l97J77M3J72j86k08J00nn2J27j24P4MJ3j35J32J98l47J59K65J0l37
1972g0N9k8Q0M0k75J40J04j7j82K18O7k6j11k65J80J4J12n0l4J62k63J76M2r8
1996b5J1J29o0R3j09j53K2J2J44M4k31K04l9K24l38k8J75l0N8l7j89R0J75k28
2020h6N3J9K2k62K19j1Q1ok52L07Jo2l4R3n9j29J24K6j3L3N8j18L3R4l11O6J47
2047C3j7p0N0l38L54Lj35L5J44l8j6q5J65K44l92R0J18R5k33j22J04j86L07o2
2071D8k31J7K58k06q8o3Q0J20J6Q9j17J19j20J98R0k09m1K72j44j70K91j45j1
2094E3Kj06J20j76lP8J81m37L14j09kM3J5L4l54L64j28J30N4k5pRO6k92K97m1
$$ y = [-23, -171, -168, -80, 3, 131, -29, -2, -76, -159, -36, 18, 86, 136, -1, -47, 74, 198, 39, 112, -120, 123, 77, -13, 99, -52, 247, -150, 27, 70, 242, 56, -152, -52, -57, -109, 18, -106, -32, -28, -15, -150, -18, 180, -167, -8, 257, 267, -70, -11, -39, 41, 81, -194, -54, 50, 33, -149, 69, 136, 110, -1, -266, -86, -72, 40, -10, -44, 118, -145, 31, 73, -25, -14, 115, 55, 148, 39, -114, -92, -80, 64, 108, -123, 81, 42, 266, -72, -100, 75, 45, 103, 66, -123, -33, 142, -86, -33, -14, 8, -254, -35, -46, 35, 29, -223, 84, 85, 23, -11, 82, 23, -106, 18, 44, 31, 64, 122, 4, 37, 131, -180, -114, 33, 16, -54, -4, -342, 12, 15, -120, -85, 59, 21, 5, -80, 85, 329, -63, 27, 145, 240, 7, -115, -11, -197, 110, 48, -183, -166, 92, -114, -202, -265, -185, -65, -49, 40, -77, 42, -78, 120, 210, 1, -40, 232, 88, -82, 209, 64, 53, 55, -51, 69, -107, -110, -32, 149, -288, 26, -83, -85, -42, -27, 7, -347, 17, -111, 19, 73, 48, 41, 50, 116, -176, 121, 80]
2120H0pJ27r9L4j88J08J31j77P9p9N0k3j61Q2j50K21k9N1J2Q5q3J05M6k42J8o1
2146g0K0M8J31j73k3J14L0nj08J6J65j34j32R4k20K62j38R9n4l2K01O6l11o5N0
2171a69K66q3p8m8L06k02K5J17r4j6m3J65l78L17q6l0M5k9NK0K28k02J21k08j70
2196b21M74l61N5P7K5L5Q2j92K9K29n17J61lK23r5K5N0M1k21J58k05N5K48j03
2220D9m6j87K9R9m9n6O0L4K72j53j12K2R5q5M4j99J11M4L37k88q6L1K54j48j67
2245i5O3r3K15m3j75Q4n9M7n2J85L6j72P2OO4oP7k60K08ro5m4J41r4R0l18K57
2272F0o9N2J07l63L03l12J81k12K60k45L74j09J43l86O4M2M9O8L50n34M3M6R4
2295FK6rpJ03l08L54l57K27KJ48j83j52K42k60oK08m4k08K23j13J33r8M62m60
$$ y = [80, 73, 200, 101, 135, -53, 55, 186, 9, 88, 9, 59, 36, -125, -43, -193, 28, -1, 50, 62, 147, 64, 169, 215, -27, -9, -70, -50, -2, 129, -44, -67, 47, 77, 72, -36, -20, 145, 11, -121, -27, -247, 15, -123, -24, -78, -110, 91, 157, -154, -219, -169, 97, 14, -64, -112, 194, -8, 17, 134, 40, 24, -19, 146, -232, 85, -1, -31, 14, -15, -10, 10, 238, 36, 157, -51, -221, 253, -108, -53, 24, 49, 84, 166, -26, 3, 232, -285, -124, -127, 96, 1, 26, 76, 117, -104, 54, -151, -96, 152, 49, 3, -184, -155, -56, -105, -161, -101, -67, 205, 52, -60, -38, 57, -28, 16, -183, -72, -28, 309, 21, -65, -34, 220, 72, -95, -32, -125, 90, 47, -128, -44, -103, -56, -108, 77, 113, -59, 13, 19, 83, 77, 154, -106, 102, 93, 28, -16, 125, 31, 121, -197, 60, -9, 43, 150, -213, 90, -222, -41, -253, 7, -238, 136, 27, 170, -216, -152, -110, -61, 7, 357, -177, -134, -88, 6, 32, 23, 16, 119, -189, 165, -192, 35, 37, 185, 2, -150, 92, -168, -174, 34, -10, -218, 5, -108, 25, -73, 389, -71]
2319g1L20l19P0j62K28o1pk2J16j10M0l6j06J16N7j33l5J57j05j0l6Q2Q1jk78
2344b25K01J82j01P0k59P1J03Jn0L6J00j25Q9p7L8P9n1R0j57M1n4p7J49J08j88
2369fp7NJ95o9j01%r4J43o9J50o3j2o5J33j73K04M9j41o4K22l53Qj54L08MQ4p3
2396iPJ03o3p2M7Lo3J79j26K04j82J3K5k2O0j42J76j33O9j02j06L58j66M5QL9
2422A50k12q4n9R8j7J50p5Kj23J1K35k9j10J05p7J31k1K9k48N9J10q2N2Q8j80
2447i7l3J55j41J65Q4j88J1J20j70N3RR1l6l8J18P0k49P0n9J7kj91J68Q5N4m6
2473B0p4N5jm4J10k68K85j33K02j09J9j39J74P9k40k03L00j13J66PM8j26p8K18
2497A55j84m3M3O1J37q1j67L6j20K28j05oj5PL9n2O2r6N7J67K2j86K17j92PJ8
$$ y = [-71, 249, -70, 0, -162, 66, 5, -2, -24, 92, -18, 22, -14, -120, -4, 53, -80, -115, 42, -63, -73, -109, -27, 54, 53, -225, -24, 158, 57, 127, -132, -61, 42, 43, -7, 29, 129, 4, 93, 16, 54, 133, 82, 172, 15, 56, 2, -75, 74, 182, -6, -83, -78, 117, 48, -53, -53, -147, -4, -73, 77, 14, 2, -63, 70, -103, 101, 150, 9, -55, 167, -186, -178, -332, -24, -20, 64, -9, -2, 101, 38, -34, 13, 16, -47, 132, 6, 210, 28, 41, 66, 44, 104, -38, 138, 5, 74, -28, -134, 224, 58, 103, 111, 150, -62, -146, -205, -107, -124, 26, -49, -47, -170, -159, 76, 47, -63, 42, -35, 96, 75, 104, -144, -85, 25, -57, -5, 83, -97, -130, 25, -116, 49, 133, -55, -44, 76, -94, -41, -32, 59, 23, -15, 103, 173, -76, -6, -65, -48, -50, -241, -73, 12, 66, 20, -54, 1, 0, -44, 66, -202, 83, -50, 152, 43, 62, -77, 97, 176, -64, -267, 33, -80, 86, 93, 141, 15, -63, 155, -29, -72, -29, 32, 169, 88, -79, -43, -163, 65, -40, -46, -61, -54, -15, -67, -5, -101, -44, 123, 145, -41, 176, -16, -9, 9]
2523Ik6R3p3J27j55J15j22J15J8m08K12R7J46j10j2j04O8KJ19N9j24K7J50n7j08
2548E8k5J2q1K02j81L4J30k88K25l35K11J02o0P3j38Q4j15O5L1N5L6J86k46M8
2572H3j52L8j0rP8M8p4o5MP7j7l8p9K5J10J30j65J05j33L7op5J09r9l5L3M8O9
2600C7m4n8qJ47j32J70k00M5M6J33j9k24J18P8n9P9j71R9j18K14j75m2R3N6J63
2625B28l00J13j07o7K4j7J69o6J07p1k13K20O0l0j59J89r5P1K7r2LK9n6L2P1n4
2651A6j33p7J71Q5r7R0N9j46k6J42j48m1J18m7l2J5O2J64r7j81K61l67K6J04o
2676h5K8K26k21R5L4j7j8K3J09Mj87O4j0j28l0J58P5j88j85L66j30j6J7J48j51
2701a9J02k6o6J98k28m6J93M6j90J15k49K80k24R4Kn2J15j38qm2R9J14j78N6O7
$$ y = [9, -17, 76, 3, 130, -25, 90, -32, 83, 101, -307, -95, 2, 148, 38, 26, -78, -10, -8, 111, 170, 46, 73, 223, 166, 58, 33, 45, -36, 166, -15, 19, 149, -139, 86, -249, -38, 64, 4, 77, -61, 23, -92, -27, 4, 59, 95, 281, 35, 83, -69, -31, -41, -50, 28, 76, 2, -63, -59, 18, 1, -37, -116, -91, 19, 149, -16, 89, -44, -7, -13, -88, 21, -78, -113, -80, -32, 37, -7, -65, -73, 74, -58, 112, -88, -43, 3, 136, 117, -107, 11, 89, 30, 109, -62, 37, -81, 133, -42, -84, 9, 65, 228, -72, 41, -66, -133, -109, -126, 43, -23, 84, 13, -200, 20, 80, 50, -109, 80, -15, 56, 83, -9, -6, 23, -33, -1, 70, 16, -117, -194, -23, 62, -35, 55, 114, -32, -58, 84, -64, -105, 13, -34, -66, -51, 11, 175, 78, -103, 158, -209, -183, -79, -85, -57, 169, -52, 43, 77, 60, 42, 65, 174, 178, -9, 55, 45, -83, -113, 45, 120, -68, -253, 113, -17, -33, -16, 132, -19, 83, 57, -9, 189, -39, -85, 108, 154, -36, 79, -170, 110, -114, -20, -18, -70, 45, -93, -101, -143, -44, 70, -108, -52, 15]
2726A5L5j50K32O3j04j66O0J1J4j14K17j93N9k9j2J00j86K49j93J81l7p1rj14
2750a42J61L7q8J29j88J36J9j40M9p0O4j18K60j41K05j32q4J08j46k0J19l1Q4
2773G1J80k41q9j6m8L77j34j20J44j30L7j68K27j60ROj16M0K02j34K6J29Q2pl31
2798a64K9K05q5QJ69o8k11J67n3N3q2R3op1n6J92p2p5J28J22k65l1J77p6R2j09
2824A1n2J45j3j22P2j6J08j95l2R2j08k2J35Q4m1L1j90p2K97o8o0n0N6J08j36
2849c8j10J63j2O8j03k6K51j30p0k7J16m9N1j06q8J13n8J30J7j25Q4L8k07j07
2873b25K21O1n4n8J66j13Rr4krR5R2l2K14k76P2q5l7j24M31j59j98oK57j09J29
2899A66k55K18k16L52j34j54J68m7j38r6R0j44J89J5p2M2J47j53J34L9j67r4J86
$$ y = [15, 50, -100, 132, 195, 91, -75, -15, -4, 10, -104, 113, -80, -21, -50, -62, 38, -148, 101, -92, 89, 52, -19, -28, -142, 19, 56, -32, 97, -91, 45, 64, -76, -27, -97, -33, -151, 109, -32, 173, 41, -43, 65, -81, -101, 18, -13, 71, 251, 10, -79, -95, -143, 234, 100, -20, 124, -6, 31, -137, 90, -70, -61, -55, -171, -131, 71, -63, -37, 92, 174, 167, -164, -135, 70, -15, -7, 162, 94, -117, 50, -3, 50, -32, 61, 55, -16, -72, 120, 48, -27, 101, 223, -42, -73, 104, 28, 120, 11, -41, 104, 91, -31, 41, 25, 133, -62, -94, -2, -110, -132, 3, 87, 46, 77, -113, -185, 112, 44, -16, -66, -10, 98, -38, -148, 15, 3, 71, -32, -58, 193, 63, -7, -34, 82, 33, 84, -22, -110, 3, -55, 75, 92, -33, 51, 89, -118, -225, -4, 57, 3, -55, 111, -2, 7, -87, -89, -98, -3, 89, 57, 271, -5, 67, -18, -55, -179, 252, 93, -105, -111, 146, 37, 166, -89, 129, -87, 265, 131, -23, 145, 98, -40, -136, -46, -190, -1, 14, -58, -16, 131, -22, 112, 151, -16, -110, 76]
2922G6J06k62J95m3L1Q0m26K09J8J84k17J88r7ql0k5N3q2n5j6J78j30Q0l5L6J6
2948B4j37J5J22R3m8mj86J71j78J21K4J35J3p1k30P6J37r3n3N0P6k01L05j97J10
2973G4J0L2j60J11K3K4n9q1j60L0P2K19k09qJ95o5l8J04k04K3n6K26M1j16K7J05
2999A60K6k96J7j59K96r6K4L21l81m0J04l1L2P3L4p9P0j40J17j44m6K00j71J22
3023A3Q4j91R8p3R5j2R3j50lL2k4J8J2K1o3K31j97L5J55o2k05J26Jr2P8J2m8J45
3051A29p1j13N0n8p0J84MK6M7p8j01q1NpK55j17N3j01m1N5J47j12Ql2j6K9q7K66
3079A73j94Q7m7j6n6J3M4p9M8q2K11p2l4J19K88l03l5p2J0J7o6m6K4%J95j08P9
3106I8j84r3L54k03rJ23j22M5L4j51P4j09J99k82L07R6k08j60J86J88j48j45J09
$$ y = [76, 182, -80, 115, 72, 103, 183, -243, -34, -16, 168, -49, 139, 42, 34, 4, -21, 32, -50, -105, -121, 57, -73, 7, -28, 8, 24, -113, -98, 24, 117, 69, 65, -121, 50, -128, -7, 17, 152, 165, 94, -136, -60, 77, -16, -69, -19, 57, -144, 161, -36, 74, 84, 116, -44, 67, 90, 114, 55, -26, -186, -156, -84, 135, -74, -82, 113, 48, 10, 114, -90, -67, -123, 103, 144, 28, 55, 160, 186, -110, -93, -252, 44, -52, -28, 293, -88, -128, -24, -55, -23, 50, 84, 5, 75, -65, 52, -92, -138, 62, -109, 13, 97, -94, 4, -69, 26, 14, 107, -43, -46, -14, -38, -20, -8, 13, -50, 181, -16, 19, 174, 112, -93, 33, 34, -58, 20, 32, -16, 129, 58, -55, -5, -63, -133, 51, 55, 81, 128, 50, -51, -132, -127, -134, 121, 4, 57, -44, -85, -30, 117, 5, 13, -19, -35, -6, -93, 173, -21, 66, 19, 3, -53, -40, 4, -75, -27, -109, 102, 30, -4, 115, 403, 100, 65, -7, 3, 20, -46, -92, -68, -68, 127, 19, 98, -86, -179, 175, -28, -37, 86, -36, 9, 43, -108, -34, -143, 56, -226, 81, 177, -31, -191, -5, 183, 35, -110, -1]
3129aj00J41k1Pj32p6K32j28J66j02Q7j41J54R3r0j45L9q3Rk3J85j71J82j53r4
3154a65K24L7j49N5N7l5m1P1r4J33J34l36K72k81O2K8p2K46l07K37K27l84R3j0
3178Bj1J43j84K2R8k48K74j63n3j75K45R3j08J06Qo2j1J61k25J19M9j16J55m1
3202G8j52J67k81J91K18j25m9j17Q8l8n1k9N4Q3R1q4K9q8k9J20j40P2n1lQ9j63
3228a20L06pk20J4l7j43J37K4J44n9n3k8M4m8p7N1J43j09l3N3LOJ0J34k09m6J9
3255a01J71J20l09N8K21j81K61j00k38oO7K09p9k54K58l53J37K19K3%r7j41L6
3278g9J47J41k87J17K5j32K5P5j87M00j62j34j76K47n2J35j68o3N0J26M8j6n8
3301B2J64l05L26k18J27j61j06K33Q5j85r0L13k38m4O3O6r9J88j2k66J58O0q9
$$ y = [-1, -101, 40, 19, 26, -106, -182, 50, -78, 88, -14, 73, -68, 86, 179, 89, -56, -17, -100, -91, -114, 71, -100, 82, -71, -165, 59, 96, -53, 2, 59, 24, -17, 54, -40, 93, 227, -109, 163, -118, -56, -28, -100, 146, -161, 76, 303, -81, 12, 2, -9, 134, -50, -28, 70, -178, 96, -67, -120, -295, -50, 43, -65, 41, 49, -13, -24, 137, -88, 31, 80, -36, 119, 78, -74, 93, -188, 3, 221, 96, 47, -70, 18, -20, -71, -100, -46, 37, 128, 44, 73, -15, -44, 76, -64, 8, -43, -46, 43, -120, 186, 179, -41, -27, -64, -207, -70, -46, 98, 39, -14, -42, 2, -46, -123, -72, 71, -38, -71, -18, -15, -9, 1, 135, -74, -120, -101, 70, 190, -119, -61, 160, -21, 240, 140, -98, -104, -37, 172, 93, -161, 97, -256, -119, 100, 123, 123, 26, -115, -79, 68, 209, -78, 39, 64, -68, -43, 32, -155, 245, 83, -51, -227, 20, -32, 103, -65, -128, -78, 48, 96, 80, 22, 186, -119, 207, -11, 116, -45, -151, 82, 167, -18, -108, 205, -33, -77, -14, 52, -47, 141, 129, -137, 21, 81, -8]
3324hp4RJ77O4l02K75j42p5kK63j82K5N5j13N0Jj06rP2pJ20o5J0J7J04l54K08
3351A1p7J57k07N2K44m38K99Nj00J00k0r5Q4n6Q9rm1j06K02k3M6j7k47K28Nl4
3377E2p0K22k17J92r5r3k13K06p5Q8J82j64j56N7J69m3j09K50j47mM6j92K27q8
3401B5L5p6k23J52J29O3j75Q9k9j88L59j12L8j33K04j93R9j82J40j60J19N3j15
3424h1J32pO0K5k38M9J07j17K03j43n2j12L41r0l4o1M6N9N8o0j29P3q7P7k5R9
3450I3k48K76j22k6J8J51l34J79K49k04K8j38O9O1k02K05j33p3J33K9j02P9Q8
3473G6k78J39M23m80N4J16r6k0J01PK01j97j7p0m0J1k4J06j9j2l8pJ12j13J24
3498E9O0k76K19J8Kj57J15l0J0M5j31K47l67J65k4L0J33rP3m04L06j54J33m5J0
$$ y = [-8, -82, -73, 104, 168, -134, 141, -1, -76, -78, 185, 3, 28, 83, -30, 20, 21, -85, -94, -22, -29, 91, 26, 36, 53, 157, -197, 11, -66, 91, -116, -64, 180, -258, 41, 46, -54, 46, 26, -69, 15, -41, 48, 39, -2, -108, 94, 71, 117, 100, -147, 81, 86, 52, -18, 204, -13, 179, 84, -9, -222, -16, -91, -3, 179, 15, -141, -84, 85, 42, -67, 183, 36, 32, 78, -114, 113, 25, 60, -16, -239, -87, 42, 105, -70, 19, -10, -198, 161, 49, 87, -46, 158, -35, 64, -118, 22, -138, -19, 34, -81, 51, 44, 104, 129, -109, -60, 47, -70, 133, -10, -62, -174, 167, 77, 43, -18, 28, 87, 145, 85, -44, 29, -58, 19, -6, 93, -155, 121, -1, -27, -9, 142, -192, -13, 236, 32, 60, -78, -9, 52, -150, 55, -78, -151, -18, 11, -91, -12, 76, -202, -63, 360, -120, -66, 50, -46, -66, 35, 42, 243, 46, 29, -41, -81, -70, -94, 12, -7, -19, -57, -64, 48, -65, 59, 119, -157, 62, 80, 82, -75, 40, 10, 20, 65, -66, 181, -186, -21, -45, -15, 118, 109, 182, -222, 84, -70, 63, 18, 28]
3523B8j07JR3J98k40j59J25J33k46J51J83p8q2q4p1L29k20j02J91p0j19K72k57
3546a31R8M4k80K19J03M0J7q1J52j29k08J64j59L42l31K28m7j72J96j32Q7N0%
3569G0j2J6K0n6l4j66J46o0J99j66J43q6j46O3J59n6q9K40M6k77P2k8J46n2k8
3594F4j12p2J34O3L0pj93o7K60q0P2j53j82M88k68Q9j23L63l96R8j7J10Rj82K1
3619e1K32k02M3n2k3J66Kl69K69K4K33j22j51PKk8P9o3K8O1q1N9r7rJ19j18r7
3646a39J44k3m4K07j88M6P9j44M9k5N2o7J31k4N8j14kJ48J4o7o8j04oQ8j73L64
3672A92Lj84n2lm8K79j75P2j21O4j00o9K56k23L2K49q7P8j60j22P7N5J6K4L2q0
3698EJ6O9L9j21j79L17k20J61k29L23j61M6N6l19P9J35o6J42j45k0o8R8J20k3
$$ y = [28, -79, -78, 15, 213, -27, -186, -61, 72, -174, -23, 160, 82, 0, -84, -155, 174, -46, -148, 43, -27, -146, 126, -131, -33, 11, -269, -50, 53, 93, 110, 29, 181, 52, -156, 8, -151, 191, -140, 88, 41, -131, 65, -67, 20, 70, 70, 58, 74, 94, 38, 4, -162, -16, -76, 123, -43, 100, 14, -132, -69, 90, 34, -55, 185, 231, -46, 26, -2, 144, 92, 64, -48, -120, 14, 77, 107, 100, -93, -160, 100, 20, 92, -61, -243, 245, -23, 66, -57, 306, -90, 8, -9, 101, 110, -72, -51, 181, -21, 22, -30, -53, 113, 115, -254, 15, 39, 272, 150, -1, 6, 8, -20, 59, -4, 24, 85, 4, 63, -34, -43, 76, -42, -139, 5, -18, -62, 145, -43, 3, 82, -62, -13, -38, 14, -53, 78, 54, 112, -2, -4, 144, 158, 91, 23, -81, -87, 1, -172, 192, 195, 11, -41, -44, -92, 187, 12, 84, -37, 27, -73, -142, 114, -109, -77, 172, 85, 163, 3, -119, -42, 13, 29, 53, 85, 5, 21, 90, 129, 8, -171, 146, -74, 87, -142, 181, 20, 66, 122, -197, -118, 17, -49, 93, -52, -72, -140, -42, 78, 55]
3722E5q7j08O1N5k9k54J42J84o3J35J19j64m2J14k70J58J60m7j28J49k2j85j09
3745a76J59O3p6k0k7J01L9l4j78J9J72q9J18J78k52O0P1k21j07J11K62k31J74
3768A16o7K7k4o7J12k89J53l9J30k98L02j83J95m7j31J76l44J16K32Jj54j7J07
3791GJ81j94P1Pp7q3P6R1j39o1K70k2j67O1l6p1P3j90J92q8k3K71l71K77k3o4
3817c2P1l6N5J9L7j46L1J15j3j80J74j06j08J43L5k0l2m8k0O1r3K52k65J85r4
3842a5j5Q7J5rNk0n0m0J71q7p8K7K8J01k28K05o3J99l71O1M6j32K25mj16R1n6
3869b3N8j59K25p5j55L6l9K54k11j8J12n1N3k04J75P2k1j55J39k0J00N3K7k10
3893c7K13j50k1L1n4j29K02k27K95P0o2k17o3P7%J27k47J25M7j90J18L3J25l08
$$ y = [55, -32, -140, -79, -24, -53, -307, -165, 19, -44, 91, 210, 46, 4, 118, -152, 6, 166, 119, -9, 140, 118, -67, -176, -17, 46, -30, -50, -77, 24, 63, 29, -149, -130, 42, -47, 71, 249, -3, 57, 128, -93, -200, -89, 173, -58, 116, 49, 76, 52, -15, 97, -192, -39, -78, 52, -246, 56, -127, 68, 21, -110, 66, -278, -162, 70, 71, -83, -100, 7, 188, -6, 65, 72, -5, -88, -12, 79, -60, -121, 149, 127, -40, 21, -15, -86, -13, -203, -11, -99, -122, 149, -222, 55, 32, -32, 39, 3, 58, 77, 114, -32, -1, 114, 101, -79, 95, -11, -119, 24, 59, 39, 7, -41, -61, 0, -93, 159, -106, 79, -15, -30, 57, 72, 63, 68, 48, -2, -42, 129, 42, -36, -9, 19, 120, -108, 97, 34, 233, -138, -77, -31, -163, 62, 58, -58, 33, -23, 35, -124, 101, 26, -129, -93, -132, 122, -89, -107, 5, -46, 7, -197, -22, 50, 29, -126, 13, -7, 93, 146, 173, -37, 176, 26, 5, 36, -18, -147, 55, -172, 123, 193, 131, -86, -149, -72, -72, 55, -192, -67, -20, -210, -92, -59, 66, -242]
3917b42L36j23K64j94j2J30k32J4J21k47L40j00n8J08j63Q9j61J41j16Q3mM5j05
3940h6K59k23N8o3o2M1r5K54N6q7R6o0p6J02j04J28k48Q4J15j11K32m1j50M4K0
3965H3k47J20J11Nj8k23J23J10n7K5k5ro6J37p5m0R3J11q1j87K15j41J2j46J61
3990ik4K2j06J59p0J40k08K46k52P3q7J18o7%J11J8p5N5l7M5JM7p6j33K03k27
4016a33K75j81L09q5k05P1P1j54M6j1J64k19J04j90M8Q2m2J16k41K12j36J2J70
4039H3r1j4K02k58J80k11Q7K95l92K01k05M5rJ84j25j39j9P4J4R7J13j66k8k5
4063a07o2M28k39j5N8M5j42n2Q6l7O8q8k7P8p2l3J6L01k74L2J3J10j6L3k16o8
4089a80J74m1P9p7P5k26M98l88j06K6J00J93q3p5n3J52o0k0q8K52r3p4J6M1J41
$$ y = [-242, 94, -29, 235, 41, 29, 159, -73, -59, 62, -185, 155, 55, -3, 105, -58, 31, -130, 11, -105, -22, -26, 19, -86, 173, -50, 8, -55, -117, -76, -171, 83, 139, 52, 148, 88, 12, 114, 10, 138, -110, -26, 89, -22, 210, 169, 19, 63, 83, -164, -44, 67, 72, 54, -169, -46, 64, 7, 32, 7, -2, -68, 69, -6, -46, 47, 158, 77, -110, 105, -36, -24, -170, -9, -33, -11, -117, 42, -28, 112, -96, 150, -102, -29, -116, 2, -65, -65, 46, 64, -11, 44, 7, 52, 53, 100, 24, -109, 94, -133, 142, -39, 270, 185, -20, 51, 122, -32, 14, 3, 167, -52, 52, -138, -90, -8, -50, 66, -175, 37, -99, -87, 83, -8, -22, 180, -78, 102, -109, -22, 273, -119, 82, -123, -78, -87, 97, -28, -167, -186, -112, -98, -1, 112, -54, -82, -107, -169, 259, 20, 5, 63, 108, -34, -86, 0, -37, 31, -57, -84, -6, -78, -111, -95, 206, -68, -36, -23, 87, 71, 104, -112, -180, -6, -47, 32, -45, 30, -196, 302, -86, -192, -166, -66, 127, 44, -31, -84, 68, 8, -12, -100, 152, 59, -15, 1, 42, 183]
4114A83j19j30KO7q2J28o7k5J64j5j34q8J31L2j12L9J10o3K1k08K32k3j55n0J6
4139a46J19j3K87k32n1p2J22Q2r1m4J70p7R0k2k38P7j50M01j76j42J82j72K76
4162A80l05K94o5K9k78P3p2JJ19j59J99J02qk21J98Q9j85K0J75m55K61j01O4J58
4186A13l02K17j14K3p9K66j06l4R9k2L6j58O3J06o5r4P4rJ66k74j0j0J06j31K29
4211I0j49Q7j18J48k16n1L14j35k8J29q7n3Q0m4LM2l4O1j44R6k6j26K20nJ43k26
4237b9l0L0M4l7K8L47k19Jj58r5OO7J77j97K2q3q4L66j63j27L29l65J85j31R9
4262a7L5q7J15J00k72P5n0J56m0Q3l1J14l13o6K24j7l7Q6j15k7R5j7m5j57J79
4287b9j45J35J64k39J99k30K60J40l69O7L9k8O2Q4K4j77r3O5J2Q4P4j8Mk11L01
$$ y = [183, 64, -66, -64, 3, -79, 49, -18, -43, 121, 106, -28, -116, 15, 47, -65, -26, 84, 21, 42, -166, 66, 43, -112, -162, -146, -27, -40, 247, 15, -36, -108, 14, 96, 5, -39, 131, 54, 144, 122, -116, -39, -189, 212, 36, -106, 76, -96, 180, -125, 169, 104, 133, -145, -72, -144, -143, -24, -183, 16, 118, 110, -111, 87, 176, -9, 11, 186, -269, -8, -109, -45, 113, -189, 28, -86, -63, -142, 124, 18, -16, 83, 61, 97, -61, 2, 108, 43, -51, 23, 14, 180, -94, -104, -114, -8, -139, 90, -59, 28, -90, 58, -158, -209, 105, -30, -58, 71, -16, -69, 11, -33, -30, 12, -22, 39, -105, -9, -35, -161, 59, 54, 197, -29, -59, -29, 15, -22, 6, 353, 134, 135, -23, -118, -112, -45, 132, -65, -43, -126, -210, 156, -7, -134, 195, -170, 15, -116, -17, 18, -69, 46, 146, -126, -51, -101, 55, 15, 98, 67, 181, -132, -198, 26, 9, -28, 58, -57, -84, 11, -6, -51, -208, -29, -174, -39, 125, -114, 85, -145, 115, 255, -114, -47, -8, -36, 26, 110, 134, -43, -136, -71, -59, 25, 99, 81, 85, -126, 175]
4312A75j87j14J21r1N5O2k6j3j89J90J1l9J75j43kJ46k45J42q8K71k08P0k60K51
4336F4k01K08j28j00K09j44K56j41J60k46J25j45N3r6K97k29qQ5QK2k3n1L5o2
4360e2m3K08r6j1j65J09K12o5J4j25J8N0n4j92K02O7j51o9m2J70O5j3j06j96K45
4385b0K2K6p7R3o6r3J98q9m4J1l7J65j70p0j53J17J31J18j59K15q3L1k18K4J30
4410BM9K02j22k79K10j20M4j77L63l59M10l77J88j86O8K65k22l7n2J8J45k0M0
4433E3j42pj4J22J16j18j60R5J07p6q3J99Njj83M7J07j40Q1r6K08j62O9k1J53
4458A59r0M8j34j48J36p1J12q6J83m0j18J17j7M9k44P4J00J5K0m7j56L2K22j24
4482hR9r0R2o0q5J27j82J47J7J6j80l1m1K41j83N0O0j34P8R7k0Nl7J78k46Q5n6
$$ y = [175, -12, -126, -5, -96, -41, 21, -5, -18, -207, -17, -6, -45, 130, -13, -15, 131, -114, 28, -60, 211, 3, 73, -187, 64, -137, 71, -57, -157, 52, -92, 164, 23, 183, -63, 62, -83, -30, -126, 171, -58, -66, 19, 27, 49, 26, -25, 10, -52, -95, 113, 17, 6, -159, -50, 162, 97, 111, -14, 4, 54, 0, -192, 10, 77, -74, -143, -185, -15, 50, 37, -69, -265, -20, 2, 28, -49, 44, -22, -115, 83, -6, -50, -39, -76, 89, -81, -151, -304, -187, -56, 62, -97, 118, 35, 66, -152, -128, 2, 51, 253, 131, -148, 62, -58, -14, -191, 172, -187, 223, -154, 34, -152, -84, 181, -41, -78, -130, -112, 33, 13, 53, -89, -96, -110, 12, 128, 10, -150, -55, 52, -24, -107, 92, 97, 96, -87, -40, 67, -73, 8, -88, 120, -42, 27, 6, 159, 69, 117, -17, -165, -29, -100, 12, -74, 109, 69, -49, 68, 51, 100, -144, -70, 30, 45, 65, 18, -138, -106, 116, -8, 91, 1, 93, 33, -52, 75, -107, 40, 57, 73, -107, -138, -179, 62, -121, -71, -11, -145, -67, 30, 10, 15, -22, 156, -90, -5, -61]
4509f1K22k92J27n9J47r9r2J00K6k42L73j06oO1k25L01j1k77Q0J48k70L36j87
4532fKr5l5J73K38m0l14J34j38K23q4K9k84K36J6j29J27mo2N7J24k45K62l67J65
4557a7%o4Q2j93J09O6J0P6q4j05J15j58m6J27J43m5q9P8r3L1P4o1Q1j01L30k48
4583A8j78K35q6K02j03o0R6k06J9R3r1J47j49p3R2o1L28j39j50J86j16p3Q4r6
4607h1R9p8j0N2Q3L5o1j18Rl4K05j82L9n6J2J68j39r9J43R2J3k63k69N23j20N0
4633A3k20L07n6P2k15K01o9l06J67K08p6l3P2n2q9Q9K7k00K15r4P0R6oJ5o5J25
4659A96l20J27J18j70K98k54Q8O7k10k9J85p3j6J51Mj67M0j75L2J84j49J4J49
4682I0r1Pq4J76k71L29j19k5j47M3o4J60p7Q3p6o4K51jj68m8P1Q3Mj23J89r6j37
$$ y = [-61, 161, -131, -4, -63, 84, -15, -107, -7, 19, -223, 150, 44, 38, 99, -126, 175, 164, -113, -33, 115, -155, 181, -6, -4, -99, -134, 39, 277, 237, -77, 57, -81, 142, 58, 87, -197, 39, 55, -74, 53, 49, -13, 44, 168, -77, 185, -182, -17, -17, -81, 1, -192, -83, -17, -7, 69, -15, -120, -5, -163, -209, -82, 61, 16, -73, 5, -88, -57, 17, -44, 37, -64, 266, 18, -160, 75, -11, 191, 88, 28, 124, -82, -63, 30, -61, 86, -63, -136, -44, -105, 223, 84, -66, 120, 4, -69, 15, -81, 18, -60, -70, -18, 65, 100, 39, -79, -70, -104, 101, -81, -42, -98, -86, 82, -57, -156, -13, 79, 92, -171, -440, 83, -37, 13, -207, 100, 44, 116, -99, 102, 33, -273, -106, 102, 26, -7, 65, 13, -76, 13, 40, -160, 55, -39, 31, 127, 121, 136, 71, 196, -124, 3, 121, -49, 249, -5, 83, 150, -60, -89, 96, 23, 7, 158, 162, -5, 35, -140, -108, 76, -73, -59, 90, -1, 6, -78, 98, -173, 156, 37, 12, -135, -92, -156, 4, -73, 10, -66, -130, 121, 120, -48, -96, -25, 58, 62, -61, 128, 32, -105]
$$ [...]
8191I0
##END NTUPLES=NMR FID
##END=
