##TITLE=1H_DE10+11F1T
 DMSO-d6
 8 sc, 
 7.9.2023
##JCAMPDX= 6.0         $$ Bruker NMR JCAMP-DX V2.0
##DATA TYPE= NMR FID
##DATA CLASS= NTUPLES
##ORIGIN= UXNMR, Bruker Analytische Messtechnik GmbH
##OWNER= root
$$ XWIN-NMR		Version 3.5
$$ Thu Sep  7 15:38:20 2023 Russian Standard Time (UT+4h)  she@DPX200
##.OBSERVE FREQUENCY= 200.13135
##.OBSERVE NUCLEUS= ^1H
##.DELAY= (6, 6)
##.ACQUISITION MODE= SIMULTANEOUS
##.ACQUISITION SCHEME= undefined
##.AVERAGES= 8
##.DIGITISER RES= 18
##SPECTROMETER/DATA SYSTEM= spect
##.PULSE SEQUENCE= zg30
##.SOLVENT NAME= DMSO
##.SHIFT REFERENCE= (INTERNAL, DMSO, 0, 15.7039)
##AUDIT TRAIL= $$ (NUMBER, WHEN, WHO, WHERE, WHAT)
$$ ##TITLE= Audit trail, XWIN-NMR		Version 3.5
$$ ##JCAMPDX= 5.01
$$ ##ORIGIN= Bruker BioSpin GmbH
$$ ##OWNER= she
$$ F:/spectra/data/she/nmr/H-F/1/audita.txt
$$ ##AUDIT TRAIL=  $$ (NUMBER, WHEN, WHO, WHERE, WHAT)
(   1,<2023-09-07 15:37:05.59 +0400>,<she>,<DPX200>,
      <created by zg, POWCHK disabled, PULCHK disabled
       configuration hash MD5:
       00 E9 B6 7A A2 85 ED C7 34 08 36 98 17 FE 4E 26
       data hash MD5: 16K
       05 3B 00 BA 5B 36 12 D6 A0 E0 BA 05 E5 A3 37 84>)
$$ ##END=
$$ 
$$ hash MD5
$$ 9C 1F DC 02 FF AE 53 21 76 DF B7 7E E4 78 27 B7
##$RELAX= 
##$RELAX= 
##$RELAX= 
##$RELAX= 
##$RELAX= 
##$RELAX= 
$$ Bruker specific parameters
$$ --------------------------
##$DU= <F:/spectra>
##$EXPNO= 1
##$NAME= <H-F>
##$PROCNO= 1
##$TYPE= <nmr>
##$USER= <she>
##$AMP= (0..31)
100 100 100 100 100 100 100 100 100 100 100 100 100 100 100 100 100 100 
100 100 100 100 100 100 100 100 100 100 100 100 100 100 
##$AQSEQ= 0
##$AQ_mod= 1
##$AUNM= <au_zg>
##$AUTOPOS= <>
##$BF1= 200.13
##$BF2= 200.13
##$BF3= 200.13
##$BF4= 200.13
##$BF5= 200.13
##$BF6= 200.13
##$BF7= 200.13
##$BF8= 200.13
##$BYTORDA= 1
##$CFDGTYP= 0
##$CFRGTYP= 5
##$CHEMSTR= <none>
##$CNST= (0..31)
1 1 145 1 1 1 1 1 1 1 1 1 1 1 1 1 1 1 1 1 1 1 1 1 1 1 1 1 1 1 1 1 
##$CPDPRG= <>
##$CPDPRG1= <>
##$CPDPRG2= <>
##$CPDPRG3= <>
##$CPDPRG4= <mlev>
##$CPDPRG5= <mlev>
##$CPDPRG6= <mlev>
##$CPDPRG7= <mlev>
##$CPDPRG8= <mlev>
##$CPDPRGB= <>
##$CPDPRGT= <>
##$D= (0..31)
0 1.2 0 0 0 0 0 0 0 0.06 0 0.03 0 0 0 0 0.0002 0 0 0 0 0 0 0 0 0 0 0 0 
0 0 0 
##$DATE= 1694086625
##$DBL= (0..7)
120 120 120 120 120 120 120 120 
##$DBP= (0..7)
150 150 150 150 150 150 150 150 
##$DBP07= 0
##$DBPNAM0= <>
##$DBPNAM1= <>
##$DBPNAM2= <>
##$DBPNAM3= <>
##$DBPNAM4= <>
##$DBPNAM5= <>
##$DBPNAM6= <>
##$DBPNAM7= <>
##$DBPOAL= (0..7)
0.5 0.5 0.5 0.5 0.5 0.5 0.5 0.5 
##$DBPOFFS= (0..7)
0 0 0 0 0 0 0 0 
##$DE= 6
##$DECBNUC= <off>
##$DECIM= 32
##$DECNUC= <off>
##$DECSTAT= 4
##$DIGMOD= 1
##$DIGTYP= 9
##$DL= (0..7)
0 120 120 120 120 120 120 120 
##$DP= (0..7)
150 150 150 150 150 150 150 150 
##$DP07= 0
##$DPNAME0= <>
##$DPNAME1= <>
##$DPNAME2= <>
##$DPNAME3= <>
##$DPNAME4= <>
##$DPNAME5= <>
##$DPNAME6= <>
##$DPNAME7= <>
##$DPOAL= (0..7)
0.5 0.5 0.5 0.5 0.5 0.5 0.5 0.5 
##$DPOFFS= (0..7)
0 0 0 0 0 0 0 0 
##$DQDMODE= 0
##$DR= 18
##$DS= 0
##$DSLIST= <SSSSSSSSSSSSSSS>
$$ [...]
##$SUBNAM2= <"">
##$SUBNAM3= <"">
##$SUBNAM4= <"">
##$SUBNAM5= <"">
##$SUBNAM6= <"">
##$SUBNAM7= <"">
##$SUBNAM8= <"">
##$SUBNAM9= <"">
##$SW= 18.05172834244
##$SWIBOX= (0..15)
0 0 2 0 0 0 0 0 0 0 0 0 0 0 0 0 
##$SW_h= 3612.71676300578
##$TD= 16384
##$TD0= 1
##$TE= 0
##$TE2= 300
##$TE3= 300
##$TEG= 300
##$TL= (0..7)
0 120 120 120 120 120 120 120 
##$TP= (0..7)
150 150 150 150 150 150 150 150 
##$TP07= 0
##$TPNAME0= <>
##$TPNAME1= <>
##$TPNAME2= <>
##$TPNAME3= <>
##$TPNAME4= <>
##$TPNAME5= <>
##$TPNAME6= <>
##$TPNAME7= <>
##$TPOAL= (0..7)
0.5 0.5 0.5 0.5 0.5 0.5 0.5 0.5 
##$TPOFFS= (0..7)
0 0 0 0 0 0 0 0 
##$TUNHIN= 0
##$TUNHOUT= 0
##$TUNXOUT= 0
##$USERA1= <user>
##$USERA2= <user>
##$USERA3= <user>
##$USERA4= <user>
##$USERA5= <user>
##$V9= 5
##$VALIST= <valist>
##$VCLIST= <CCCCCCCCCCCCCCC>
##$VD= 0
##$VDLIST= <DDDDDDDDDDDDDDD>
##$VPLIST= <PPPPPPPPPPPPPPP>
##$VTLIST= <TTTTTTTTTTTTTTT>
##$WBST= 1024
##$WBSW= 4
##$XGAIN= (0..3)
0 0 0 0 
##$XL= 0
##$YL= 0
##$YMAX_a= 91389
##$YMIN_a= -194437
##$ZGOPTNS= <>
##$ZL1= 120
##$ZL2= 120
##$ZL3= 120
##$ZL4= 120
##$ABSF1= 10
##$ABSF2= 0
##$ABSG= 5
##$ABSL= 3
##$ALPHA= 0
##$AQORDER= 0
##$ASSFAC= 0
##$ASSFACI= 0
##$ASSFACX= 0
##$ASSWID= 0
##$AUNMP= <proc_1d>
##$AZFE= 0.1
##$AZFW= 0.1
##$BCFW= 1
##$BC_mod= 2
##$BYTORDP= 1
##$COROFFS= 0
##$CY= 11.3945322036743
##$DATMOD= 1
##$DC= 2
##$DFILT= <>
##$DTYPP= 0
##$F1P= 15.7292609196834
##$F2P= 12.9074282941183
##$FCOR= 0.5
##$FTSIZE= 0
##$FT_mod= 4
##$GAMMA= 1
##$GB= 0.15
##$INTBC= 1
##$INTSCL= 1
##$ISEN= 128
##$LB= 0.24
##$LEV0= 0
##$LPBIN= 0
##$MAXI= 10000
##$MC2= 0
##$MEAN= 0
##$ME_mod= 0
##$MI= 1.114404
##$NCOEF= 0
##$NC_proc= 0
##$NLEV= 6
##$NOISF1= 3.799351
##$NOISF2= 2.8
##$NSP= 1
##$NTH_PI= 0
##$NZP= 0
##$OFFSET= 15.70392
##$PC= 1
##$PHC0= -21413.2
##$PHC1= 19.65271
##$PH_mod= 1
##$PKNL= yes
##$PPARMOD= 0
##$PSCAL= 0
##$PSIGN= 0
##$REVERSE= no
##$SF= 200.130013532006
##$SI= 16384
##$SIGF1= 3
##$SIGF2= 2
##$SINO= 400
##$SIOLD= 16384
##$SREGLST= <1H.CDCl3>
##$SSB= 0
##$STSI= 0
##$STSR= 0
##$SW_p= 3612.71676300578
##$SYMM= 0
##$S_DEV= 0
##$TDeff= 0
##$TDoff= 0
##$TI= <>
##$TILT= no
##$TM1= 0
##$TM2= 0
##$TOPLEV= 0
##$USERP1= <user>
##$USERP2= <user>
##$USERP3= <user>
##$USERP4= <user>
##$USERP5= <user>
##$WDW= 1
##$XDIM= 8192
##$YMAX_p= 0
##$YMIN_p= 0
$$ End of Bruker specific parameters
$$ ---------------------------------
##NTUPLES= NMR FID
##VAR_NAME=  TIME,          FID/REAL,        FID/IMAG
##SYMBOL=    X,             R,               I
##VAR_TYPE=  INDEPENDENT,   DEPENDENT,       DEPENDENT
##VAR_FORM=  AFFN,          ASDF,            ASDF
##VAR_DIM=   8192,          8192,            8192
##UNITS=     SECONDS,       ARBITRARY UNITS, ARBITRARY UNITS
##FACTOR=    0.0002768,     1,               1
##FIRST=     0,             0,               0
##LAST=      2.2672688,     0,               0
##MIN=       0,             -194437,         0
##MAX=       2.2672688,     91389,           0
$$ Real data points
##PAGE= N=1
##DATA TABLE= (X++(R..R)), XYDATA
$$ [...]
1777a2j12p0J2K85k19K05k33r4M31k55J08j4r6j30J77J83J60m26Q2K61l26N5J59
1800A31k25M0k52K55J78q6j51p9J39P2Q6k45L09l58J92j5j05L6J91k65J61q8q6
1823a65r0NK52J49m4J8k44j18L81q4k5J29K9l84J96J75J49m42j43J69J03J1L5
1846F2k94K55k53K68r5j8J08l3J35q5k18J13q0J28p5j40J47%J24N6J18j39k78
1869a94K17kmj62K52j56K2r0K05r2q8K64K2l28p1M86J12o18J43L6P6O2k50Q8m4
1894a14MN5J33j32j00J61j24J97r0p8L10o0j12M8j37j81R9J92o4k8J49l60N1N
1918a76K60k50P3K63j38j84J43R2k01K6K33j51J78l00J4qJ40m0j33J44m5J89q5
1941D4j90o1K77NoP4k06P1k1K98n22K04L1J82k68P1Kj13J17O0k13N6NL19j22J41
$$ y = [-12, -124, -194, -182, 103, -116, 89, -144, -238, 193, -62, 46, 32, -64, -194, -17, 166, 326, -100, -18, 243, -83, -28, 131, -94, -54, -306, -51, 127, 41, -110, -189, -50, 22, 108, -137, 172, -186, 6, -9, -114, -78, 113, -152, 9, -79, -165, -255, -250, 2, 151, 107, 125, -119, -237, 144, 60, 35, 164, 193, -191, 5, 180, 329, -113, -256, -87, 16, 27, 62, -232, 23, -230, 38, -57, -75, 33, 0, 135, 50, -168, -55, -135, -7, -82, -222, -75, -75, 49, 105, 223, 84, -194, 23, 21, 17, -145, 107, -49, -27, -117, 88, -4, -92, 172, 194, -134, -205, 281, 393, -225, -82, -46, 30, 92, -158, -70, -114, -110, -55, 78, -54, -154, 7, -117, 80, -10, -88, 222, 162, 50, 98, -39, -220, -121, 71, 7, -21, 128, -232, -181, -176, 84, -166, -93, 170, 32, -152, -9, 83, -118, -92, 141, -10, 168, -132, -118, -126, 14, -26, -159, -15, -60, 129, 44, -146, -207, 70, 75, 69, 143, -63, 8, -13, 285, -237, -33, -2, 180, -88, -17, -15, -128, -11, 49, -164, -108, -103, 216, 94, 235]
1967B35j55m11O03l06q2J24N3J05n76N27j30j94J29l6K10k80J00Q5K40j87j90
1988a36M11j74n06M00p8J46k87J96j06K34q2o3j46N6J67n0J78j22J54k31KK17
2010A80j55j2k1J49j93R0l2J4L22l12j3j4M8k18R9K02k85J50nn8Q2r4K16K1k28
2035f7j7L50k43O0Q8j71j67P3Q2k56N13k90L2p2K92k27k18K19L07j47l3l38K40
2058A0J58k85L9J52P1p2K55m22j36P8L25j86R0L31m78J58k65P8K91j34j7k07J63
2081ck83N24j20k1k71J75P0k58J73L4P8l12L78Qk18j7j18L66j10j7K11l11J79
2104A37q6j73K34l3O%j63J34k65J8M30j34n29O87l43j77K01L0J55J3q1j58J32
2127C5M5k06J46q8N8J30k46n4L09N8l22Qq9M90l22J93K5j50P0k54J72Mo5j39L30
$$ y = [235, 80, -331, 272, -34, -116, 8, 61, 166, -410, 117, -13, -207, -78, -114, 96, -184, -84, 1, 241, 54, -136, 275, 101, -405, -5, -83, 63, -224, -28, -134, 100, 18, -45, -191, -135, 32, -18, 160, 38, 192, -39, -37, 180, 25, 13, -8, 141, -52, 38, 6, 20, 342, 30, 17, 3, 51, -167, -68, 134, -151, -1, -6, -64, 18, -76, 140, 161, -67, -84, 266, 23, 83, 171, 0, -167, -94, -12, -268, 245, -45, -13, -85, 207, -20, -238, -19, 288, 141, 108, -230, 10, 168, -117, -78, 74, 145, 73, 328, -94, -230, -152, 173, -13, 77, 408, -70, 88, -177, -99, 192, 58, 41, -166, -3, -286, 238, 118, 97, -174, 1, 71, -187, -14, 20, 98, -214, 164, 172, -46, -63, -181, 185, 75, 58, 269, -42, 137, 51, -122, 112, 79, 85, 85, -78, 56, -209, -191, 239, 105, -424, 263, -80, -257, -56, -26, 129, 142, 61, -97, 35, 80, -126, 20, -68, -10, 120, -126, -180, 129, 187, -135, -127, -216, 274, -48, 145, 170, 20, 90, -164, 8, 12, -53, -192, 138]
2152A38k87J25j10L06m39K99n2N5K04p8r0J23L3k68J71nJ22n50K54K00m6j69j14
2175a78K73r1j25J15j6l2J46K9l20J37j76L35j04K25O1l27Rj67J45k13M47q6k0
2198F7m11L75K2j96J27o8J78j1j42P2j49K86j06p6K9K7j87J17R3j8MJ3J7p9K09
2223A93j88j82J91n2J60l44J75pq3K72J3p6l44K38p9J38j25J83J91j68P8l77j4
2246b07L39j14J66Ql41L15j56K5J51j62J31M7k62N1K4R6k00L3Q4J57Pl73J14l4
2270a01K44k6k43J11k2p4P7J49j84J24J46O2k01j18o9mJ40o3L6rk13K88Lj86O0
2295g3J2R8j30j8J39r7pq8J72k9J0R5j78J35RO8k23R5L5R0p4K02m28K17m6j10
2321a24K85m00M4K75j23J62L7k82J5K13q0o4j03O3J33l34L05k45K52J13l16N2
$$ y = [138, -149, -24, -134, 172, -267, 32, -20, 35, 239, 161, 71, 194, 227, -41, 130, 125, 247, -303, -49, 151, 105, -64, -178, 95, 4, -121, -6, -22, -54, 92, 121, -199, -62, -238, 97, -7, 218, 279, -48, -39, -206, -61, -274, 173, 87, 67, -344, 31, 53, -143, -16, -84, 94, 83, -59, 13, -136, 150, 44, -32, -3, 24, -163, -46, 47, 29, 33, 46, 63, -16, 193, 5, -177, 14, -38, 122, -222, -47, -54, -137, 135, 148, 72, -272, -34, -113, 25, -100, 83, 274, 106, 184, -193, -207, 132, 18, 184, 192, -149, 166, 10, 35, 186, 24, 155, 202, -60, -9, 15, 111, -89, -56, 28, 185, 192, -181, -67, -101, 143, 117, -126, -15, -37, -111, -34, 115, -69, 55, 201, 263, 62, -56, -125, -129, 11, -52, -16, -25, -238, 50, 53, -133, -73, -61, 37, -93, -111, 28, -69, -76, -164, 8, -21, -11, 84, -94, 41, 50, 118, -105, -10, 25, 115, 41, 243, -185, 32, -14, -124, 161, -239, -195, 80, -43, 119, 156, -126, -111, 102, 22, -42, -145, -82, 51, -283, 22, -223, 29, 142, -174, -122]
2343a22K15q2O3r3j97J41J6NN3L65m40L23l23Q7N3k06K13j01O2j67p1J17OR2k5
2368a6j3q1L00k40o8K03k63J21J29J77l48LJ41n4J53j42j77l1L42K2j07l7J65
2391A79k5J9j35L1l2K6M7j46km6m9L2n0O7J94j28J95J59l71j09K28N4k70j5M5
2416a02K97k48M9j73K87k10L34l08k0J50pKk4K9o9j59K83j14R3p0k85L85k94J44
2440c0M4j31J53M2j56P6Jj5J95k56K26L3j39j83K42j90Q1j8j71P2MJ38J64m25
2464b43L5J37J38j5k9O5j20lr4K87J8Q1l98L07n2p8L2j25O0j69J06j6P2l7l1J70
2490I8j36%r3J11J75l2k06L54k45k18J3Q4j64L26j27J45j30J03j59K58o7L1oj04
2514A1K6n1k48L34j09J6k22M25O5m31K60j84K3j23M08k94K73k44K62J01m4k79
$$ y = [-122, 93, 11, 74, -19, -216, -75, -59, -54, -1, 364, -76, 247, -76, 11, 64, -142, 71, -30, 32, -135, -206, -89, -83, 9, -16, -29, -110, 190, -50, -118, 85, -178, -57, 72, 249, -99, -96, 45, -9, 144, 2, -175, -206, 136, 158, 51, 14, 179, 154, 173, 38, 69, 37, 63, 110, -36, -38, -84, -133, -101, -151, -84, 110, -18, 177, 336, -35, -144, 84, 138, -132, -147, -102, 195, -53, -4, -177, 110, -100, 234, -74, -94, 56, 49, 51, 27, 56, -13, -172, 111, -3, 90, 20, -265, 120, -174, -30, 14, -117, 36, 78, -78, -2, -1, -16, 179, -77, 149, 182, 43, -140, 102, -88, -7, -25, -196, -124, -120, 18, 182, -243, -208, -71, 67, 52, 23, 88, -32, -35, -129, 158, 176, 257, -141, 166, 114, 36, 68, -57, 3, -166, -60, -76, -4, -41, -72, 98, -38, -38, -131, -20, 155, 123, -83, 271, 26, -192, -179, -95, -259, 67, -60, 85, -45, 58, -101, 157, 90, 121, 115, 11, 37, -14, -262, 72, -37, -21, -243, 182, 247, -184, 76, -108, -85, -208, 200, -94, 179, -65, 197, 298, 254, -25]
2536b5pK08j29o1j47K44j18j10J35N3mJ39k20j6k4J50k93R0j32K78J36p8q0M3
2560C2q3R6O5j05j36K74j59k1J32l16K28q0J14m00L53j20K5j03L64k23n2o3j17
2583b95J93O5J70n0l6k27L57r5l6J31j19n8o5L34l50J32j47L2j05J08N5j10N1
2606f5J71j29k5P5K46m60KL14j67k14L52Jk51J09K91k37K66l75K71k88J31j53
2628a35J03RJ74j50j34l6R9k6K89k04j28J29M4rn8J80Oj83J29K07l12K4k96J38
2652a40q0K72j32K22k26J13j15J54j38J27K1k14m2P2n4j1L30l81K98J03k93J33
2674A9j52K22j32j79L69l62L25l04M4M25k49N5J65k51J26j10J57j8l80K26J12
2695A08k09l9k00K20RR9K17m36J78P4j05Pj64J06Q9K21J5m77K17K5j7j3J74K40
$$ y = [-25, -32, 176, 47, -14, -161, 83, -35, -145, -10, 43, 39, 178, -42, -58, -82, 68, -225, -135, -267, 11, 147, 69, -11, 32, -51, 45, 110, 5, -131, 143, -16, -37, 95, -221, 7, -73, 41, -359, -6, -126, -101, -204, 160, -63, -115, -178, -295, -102, -37, 133, 83, 47, -180, 177, 82, 46, 177, 58, 0, -65, 269, -81, 51, -96, -64, -169, -61, -6, -116, -65, 106, -23, -48, 27, 273, -187, -185, 129, -38, -252, 100, 101, -150, -41, 250, 13, 279, -96, 175, -113, 18, -135, -32, -23, 151, 1, -133, -169, -70, -96, 193, -11, -139, -10, 34, 25, -33, 147, 153, -30, 99, 306, -6, 18, -278, -140, -220, 52, -80, 142, -84, 29, -86, 68, -70, 57, 78, -136, -178, -106, -160, -171, 159, -222, 76, 179, -114, 19, -133, 89, -43, -222, 147, -215, 110, -194, -150, 275, 26, 81, 246, -5, 121, 11, 168, 150, -230, -4, 108, -101, -140, -340, -120, -111, -12, 205, -231, -53, 21, -84, -77, -241, -135, -46, 175, 190, -287, -70, -45, -62, -75, 99, 339]
2719C39m50p9M95k92j04P1K20k02J35j35L0j25m0P6K08j3l1K58l01q0k1O7n8R7
2743F5P3j31M46m95j15J66J51Mk05q4J32K10l0j24J54k16J96j13j04O6n7r9J30
2766B0Q3J78k74L17l81J51P6k54K33l17J67q6K1P1M1r9r9J6J79J63j34o9j12L0
2790g9J59j05p8l2NJ81J47K1k71J9o0r8K69m8m3J12l28M1L74P5K1r0k55L07j52
2815I2j48l23L48P5oq5j51L24l26J40j32K14j6M1m6J13J7Q9k26p6M74m71J33J17
2839A71k57m1Q3r8O6k79M28K46l48J73k71J55Q6k57K69K4j48q5m1J74J69k13q6
2862h0M7K78l18N4q9j14K01J69j72p7p0J96J60j7j32j8J6p7K2J52n6j57K58P4
2886B50l49K07k58J10K33p2j90J5K11o8j8L2j85Pn7M10k45J11o2J50n0l0j64l2
$$ y = [339, -111, -190, 305, 13, -91, -20, 200, -2, 133, -2, 28, -97, -137, -61, 147, 134, 103, 361, 60, -20, -41, 26, -32, 65, 138, 7, 453, -42, -157, 9, 160, 164, -41, -125, 7, 217, 187, 63, 217, 1, 197, 84, -20, 46, -11, -110, 20, 103, 281, 7, 324, -57, 94, 170, -84, 149, -168, -1, -87, -66, 5, 46, -53, -152, -136, 43, 206, 72, 3, -109, -79, 80, -25, -103, -135, -130, 51, 198, 219, -52, -33, -93, -191, 78, 30, -13, 99, -229, -188, 186, 261, 282, 192, -63, 244, 92, -56, -379, -31, 44, 38, -47, -198, 126, -200, -60, -192, 22, 6, 47, 1, 114, 131, 220, -6, -82, 392, -79, 54, 171, -86, -127, -44, -142, -76, -355, 73, 319, -29, 144, -127, 28, 114, -143, 126, 150, 2, -83, -124, 50, 219, 6, -80, -33, 245, -73, -19, -108, -222, -21, 148, -24, -101, -171, 25, 185, 168, 36, 18, 34, -43, -21, 131, 75, -82, 176, 250, -99, 108, -150, -40, 193, 121, -69, -54, 157, 89, 71, 103, -82, -75, -132, 278, 33, 144, 82, 232, 182, 152, -12, -44]
2910d4K8o0J01j92K70k5m2j52j63L80k83rN27m37J16kK02k28j33K53Kk40K21j22
2934c2K83j21k39p9K74k92L11j86K07k65R1J1O8p0m0J0j6r3L0J79j9j69pL57k80
2959h7pL0L10l19K07k05pK70k68j6K0K59k10O4l09K01P9J75k32m3K40j61l7J3
2983c3L45l69K61k61J10l9l1L58j40l82J66j03L59k19O4L9k10O7J70n9k54J85
3005B4Rp8J49q1J25r8n0j1J58J77l64K80k21k7j59K91j54J28k36q1N8J71jk10
3029b01K08j01J89J27j85j98P3K86j88j26J87J8p3k20L11l8q8R1Q4o9k60K96k79
3052a56L71R9l44j05K05j90J25J14j18p9O4j10L27j47O3n0j36o4K27j03K49m3
3074A99l77M40j89q0m9L6Q9N6k96K45R2qk17K65k39n9J19j70l2J23J32N2K0l6
$$ y = [-44, -16, -76, 25, -167, 103, 78, 36, -116, -279, 101, -182, -191, 336, -101, 15, 13, 215, -13, -146, 107, 109, -131, 90, -32, 251, 130, -109, -188, 86, -206, 105, -81, 126, -139, -48, -37, 31, -39, -79, -69, -85, -178, -148, 31, 12, -157, -164, 193, -87, -94, -64, 246, -73, 134, -71, -78, 192, -76, -92, -72, 187, -23, 41, -268, -67, 12, 187, -45, -88, 152, -9, -46, -33, 312, -57, 204, -57, 53, 14, -17, 341, 201, -181, -15, -118, 241, 22, 86, 125, -85, -18, 152, 93, -161, 24, 33, -45, 104, 23, 148, 50, 0, -11, 147, 324, -40, 240, 19, -8, -167, 124, -30, 98, -138, -219, -161, 10, 9, -201, 7, -94, 95, 222, 37, -161, -88, 198, 10, -116, 71, 89, 16, -204, 107, 69, -19, 72, 156, 87, -173, 123, -156, 215, 314, -30, -135, 70, -120, 5, 119, 1, -78, -14, -124, 203, 56, 119, 69, -67, -131, 96, -7, 242, 199, -178, 262, 73, -7, -56, -20, 69, 125, -171, 74, 166, 158, -59, 206, -33, -92, 27, -143, -175, -52, 80, 132, 152, 116]
3098A16q0Lj4J52j55%j43r8P1P3J20J8j21Q2R5j94K83k1j94R3j42j8m4l1K20q0
3124ij0q1Q8J86l8J38J15m95K36M0k64P6J7k23L71k67J24P2l9k15J81J84P0k05
3148E2k62R4J90r9J2J6PM9j08K0j9J67p4l3O0q3L44l15p0K3J37K18m91Q9O5M9
3174C8Rj03r8K14Lj01J73j62J66j21RJ95k86J95J83k64J2n0N1J23j44l8J28l85
3198b53M56m68K26j7j97L00n9J12m52L16J89m04O0L21J27j79J17l15K93k8p4N3
3220A24k95K13M3O5l9k42J10L6J34k10mJ25l1j0J30m03M42m1l00J52K5J66j79
3243A1J1L82j67j30j62l9K11l0k08J64j71J80q1J22j39Lj37J43J51p0J51p2J11
3266B34k21R6Q1j18J1r3K5O4k25M6J26j79L40k86J63r6J60k50J25J21k27L14k72
$$ y = [116, 36, 39, 25, 177, 22, 22, -121, -219, -148, -75, 45, 63, -58, 24, 119, -75, 208, 187, -7, 86, -56, -74, -118, -149, 71, -9, -19, -100, -12, 174, 136, 274, 389, -106, 130, 170, -94, -18, -1, -224, 147, -120, 4, 76, 37, -178, 3, 187, 257, 52, -210, -116, 74, -25, -13, 3, 10, 59, -49, -29, -48, 119, 45, 12, 72, -11, 333, 18, -52, -29, 108, 326, -165, -76, -11, 38, 47, -56, -154, 60, 63, -38, 135, -27, 139, 18, 27, 222, -64, 131, 314, 50, 62, 12, 63, 186, 42, 4, 132, -253, 203, -265, -39, -56, -253, 47, -12, 100, -352, -36, 153, -251, -191, 130, 257, 78, 195, -120, 173, 145, 71, 124, -171, 42, 85, 150, 111, -131, -21, 15, 149, -61, -65, 60, 29, 19, 149, -254, 188, 147, -153, -1, 24, 190, 11, 22, 404, 237, 107, -55, -94, 117, 87, -121, 43, -128, 52, -29, 93, -46, -43, -180, -37, 114, 44, 195, 123, 234, 13, 109, 190, 72, 83, -10, 15, 79, -146, -100, 26, -153, 187, -99, 64, -32, 128, -122, 3, 124, -103, 211, -61]
3289f1O1r2J53m4M5L3j50J62o9rk22J90o5J17K2m24M32q4j03L5R3J17k80j05K61
3314A3P3q1K05k28k23J12K95l1j28q6k6n1K33j99J54q5R3k13M37l01j30K48j55
3337g4P4l7J52k39L33j10J15l54L10j4l46J68j53J36K7O5J32j31l3l55K89j1j52
3360b08%K17QN3p1K5n7k68J96N0J25j65j19K34j10o6K31O9j31j60L10l7r6q1K42
3385A91j01K80m39KJ79Jp1q2k0j7j4J16J16j58R7j38M7K01j96J29j76M3L2M8m3
3410B7k11K80m9J11k95K80p0Q5m06M66k39J98j45j24J27j73R0j02L2N7J19J53
3432B11j68J0O5k49j82K71O8l64M20Q6k37J74k3j47L39j83r8q3k61M84j93K78
3454B18m64J71j06r1K08J67k56pN15l84o8J29K49j98Q4j38q8L4J93j98j76J5J57
$$ y = [-61, 0, -92, 61, 17, 62, 95, -55, 107, 38, 29, -193, -3, -68, 49, 71, -353, 79, -5, -108, -73, 20, 137, -143, -248, 13, 86, 5, 210, -18, -241, -129, 166, 135, 7, -79, -105, -156, 77, -122, 32, -53, 40, -173, 264, -37, -167, 81, -74, 0, -37, 115, -124, 209, 99, 214, -140, 170, 156, -190, -22, -175, -39, -12, 53, 185, 54, 21, -334, -45, -56, -208, -208, 9, 17, 70, -1, 24, -33, -301, -105, -55, 70, -95, -214, 20, -90, -156, 75, 144, 13, -147, 163, 126, 30, -51, 191, 90, 370, -69, -67, 112, 113, 42, -40, -60, -77, -91, 25, 141, -17, 80, -58, -11, 190, -6, 123, -53, -10, 22, 70, 27, -184, 96, 47, 158, -137, 143, 73, 158, -248, 218, -21, 177, 32, -92, 35, -138, -48, -150, -118, -61, 58, 211, 43, 53, 118, -131, -313, -42, 26, -338, 82, 168, -69, 105, 82, -65, 274, 91, -7, -90, -351, 133, -60, 218, -246, -75, -181, -272, -64, 103, -153, -160, 355, -29, -97, 32, 281, 83, 167, 29, -59, -25, 168, -30, -206, -191, -34]
3477c4j5J38r1q7L2jJ34j24r3j20J74N0j41R4O5l09L38k8K3n5o5K07k34Q2Q4q4
3503f0K00L9l13M82o76L88j47J84j51J59l25N24k56j27J21j19K2M2J31k02K43
3524A59j90K12l06L70m55L98pk29K7O8K3m1%J8j51R3j20J91k89K98lP3j06l35
3548c02J36J80M8j26j7O1K01j35j66J12M6j3J07k37k0Q8O1R8k7j54J91q2M3k87
3572a94J98m2J83pk74K28j31m2K38j28K7J8o6q4O4K27k72kL83k29n3j12L3J88
3596A51j09L4J33j98k20J57k11J97J65M2j89J4K29j32n5MJ72j19J43l94J41j14
3618a59M07l06J55m1j27M9p1J44k4mq5O1k80N5K30J63j22J24j72n5R3j18J59j34
3642e8q1J78J3n6lm7L03r8k53K73r8j88j08M24k89L06k76N9J1j46R7K2k8N2k4
$$ y = [-34, -49, 89, -2, -89, -57, -58, 76, -48, -141, -261, -87, -37, -178, -84, -19, -328, 10, -18, 5, -50, -115, 92, -142, -60, 24, -60, 140, 179, -134, 348, -328, 60, -87, 97, -54, 105, -220, 304, 48, -79, 42, -77, -55, -13, 118, -84, 159, -31, 181, -125, 245, -210, 188, 181, -48, -21, 47, 70, 29, 29, 47, -104, -11, -131, 60, -229, 69, 66, 139, 33, -302, -166, 14, 62, -64, -81, -20, 181, 46, -120, -8, 38, 25, 132, -105, -125, -37, 24, 122, 95, -59, 132, 50, 93, -194, 4, -38, 145, 138, -136, 92, -39, -81, 157, 29, 56, 74, 8, -76, -12, 215, -57, -59, 324, 95, 42, -70, -37, 151, 42, 76, 209, 11, -209, -52, -263, -66, 99, 141, -48, -34, 195, 63, 8, 12, 184, 65, 208, -186, -45, -159, 248, -58, 97, 56, -71, -22, -93, 51, 27, 23, -62, -1, -281, -226, 4, 167, 45, 169, -3, -58, 35, -83, 76, -58, -139, 39, 52, -4, -7, -54, 249, 151, -102, 171, 73, -115, -223, 201, -88, 218, -58, 1, 12, -134, -37, -15, -43, 9, -15]
3667a5O1k25L7K59Kj01r9J40k48O6k1l4l1L52k27M8K7k25K31l2j18J39j9Q5J98
3692B50r9j63J78j09k79K67j52L36J9k36k8J60j47j51K46k34J50Q0n8J89m55K78
3714D2kJ18j19O8k73J93K29l15L1J00j26J9J39j1j23J14P2m7J22l54L85m17J03
3737e2k6o3J95n2j49K68j54J44J04m1k43Q3O2O5J10p5o0l05J46k09M50k26O6Q8
3761A26k68r6J16N4Q2j21J13p3J63j99M5K31N7k23j27K29j77n0N7J56k11M9k41
3784c08L62J18l46P3J44o1J71j91O6J5o2J15r2p2LQ6j10J28k12K04m0J85j29j48
3808a01P9j4Q2m9j54J11J71j7j60PM3Q9j57j51K51j38J41o1j33J45o2m1K12q1
3832A2k08M74l01K24ll5j10J20k92K77k76K45k37j32M20k85K77l01J51k32K75
$$ y = [-15, 46, -179, -142, 117, 119, 18, -81, 59, -189, -123, -144, -178, -209, 143, -84, -36, -9, -234, -3, -35, -153, -14, -33, 52, 250, 151, -12, 166, 57, -222, 45, -107, 229, 248, 12, -16, 144, -3, -154, 92, -142, 8, 88, 30, 219, -236, 42, 40, 158, 39, 107, -166, 27, 256, -59, -28, 72, -54, -35, 104, 93, -30, 84, 156, 109, 231, -123, 262, -155, -52, -78, -141, 54, 2, -147, 121, -33, 111, 215, 174, -69, 14, 76, 141, 251, 176, 116, -189, -43, -252, 198, -28, 38, 126, -142, -238, -122, -68, 14, -107, 6, -67, 96, -103, -58, 173, 230, 7, -120, 109, -68, -118, -61, 95, -116, -67, -308, 54, 172, -174, -101, 43, -18, 153, -38, 28, 43, -19, 96, 4, -68, -65, 21, -89, 39, -173, 31, -9, 176, 47, -101, -22, -36, 46, -3, -157, -46, 125, 108, -52, -45, -2, 87, -70, -221, 30, -108, 33, -28, -161, -16, -78, -119, 93, 12, -196, 278, -23, 201, 198, 163, 53, 173, -119, 158, -118, 127, -110, -242, 178, -107, 170, -131, 20, -212, 63]
3853F3L9j92K03j86J47j30J55k03k7O9m2j95K98j15M5l1J64j25k0J75k07m2o8
3876b25K00P8j23K31j07j7o1J64j36j77J38Pj5j09JQ5j05J72O2r1j61K89k0j79
3900i9j04L36p9k31J32K56k90K7O2p6o6J49J39k72J21j59K74k49J00O1l4O7k12
3923a47M4L50k59N5K19j91k05J00j2J3J12k88L27j57M8K27q8j65r8p9J22J42j09
3946c9J42K70l36L0q3n1K92m27L30k64J28J00O9r8Q1k27J75r2j28K5Q5J36j48
3969c0J52k53K50k92N9N4r9N5j0L5J35J36r2k89J58r7K32q1K1o5p5j23K36j81
3993a64L49j96J04r0k56K69k27J34K06j90j7Q1j54j6J39j08O2j47j74J84M9K67
4015A05n3k00O9J73j74l1J31J52j90J70o1l9q2K68l68J18J91j41j73K82j67N2
$$ y = [63, 102, -90, 113, -73, 74, -56, 99, -104, -131, -62, -104, -299, -1, -116, -71, -102, 62, -63, -83, 92, -115, -157, -225, -25, 53, -70, 161, 54, 37, -24, 140, 4, -173, -35, -28, -43, -152, -151, -66, -171, 1, 63, -28, -189, 100, 80, -99, -203, 133, 54, -177, -45, 211, -79, -52, 10, -66, -132, 17, 156, -116, 5, -154, 120, -129, -29, 32, -2, 65, -147, -103, 247, -12, 43, 262, 71, -134, -34, -46, -33, 79, -209, 118, -39, 9, 236, 148, -17, -115, -194, -72, 70, -39, 103, 373, 37, 67, -16, -67, 225, -202, 128, -136, -8, 92, 161, 63, 144, -83, 92, 0, -128, -103, -18, 118, -30, 122, -131, 119, -173, -114, -60, -159, -104, -114, -79, 56, 192, 100, -189, -31, -128, 104, 23, 44, -21, -96, -219, 17, -164, 185, -11, 93, 3, -253, 16, -211, -77, 129, -61, -78, 3, -151, -167, -28, -136, -74, -221, -395, -211, -162, 105, 52, -148, -79, 94, -80, -111, 20, 172, -18, 152, 91, 52, -30, 238, -130, -12, 179, 38, -135, 147, -20, 32]
4037C2J59o5j50R5q5J53k09P1j88J67j7p0J86o1j41O7J52o4l4o1K28l8j96J17
4061D8M3m18M90k83J17K3j94L38Q9j4j90o1K05j94j9J18j13J96k58j15J50k35
4083b77L99l74K87M4K9j89l2K69k97O4J8J39j14P4j94J01j1j6J84J09n12L36j82
4106a45%K70p2J18k6j56n6J69o4k67K68j40J90o2j08J43K15m44M31j59k21J06
4128a0J27k24L10O5k70K24k27O7J02j11j25K51m42K77R4lj16R0l91K80j07J92
4150E3k2J17R8m18M62m07r5qL09j80J53J62j83N9j40J03q3k8K17j81jp2M8l2j21
4175a90L46o9n3J06j92J23j7J03l42J27j91K65K5k37K54Kk51N40m39J64L8j3j11
4198a2Q3j09qQ7j07o7j51M35l46K38M3j55l9L8p7M25l82K37O5K5k25q7l7P0j6
$$ y = [32, 191, 126, -24, 71, -14, 139, -70, 1, -187, -20, -37, -107, 79, 18, -123, -56, 96, 32, -2, -63, 165, 127, -69, 48, 91, -327, 163, -120, -3, 20, -174, 164, 253, 239, 49, -12, 193, -1, -20, 98, -15, 181, -77, -192, -42, -277, 122, -252, 35, 79, 108, -81, -113, 156, -141, -77, -59, 80, -34, 40, -154, -53, -64, -80, 104, 213, -299, 37, -145, -145, 125, 53, 171, 145, -11, -67, 102, 38, -229, 39, -101, 89, 27, -81, 62, 277, -167, 264, 105, -116, -10, 117, -107, 203, 268, -2, 222, -5, 62, 164, 53, -72, 179, -263, 14, 108, 105, -11, 79, -312, -32, -139, 53, 31, 148, 246, -172, 290, -117, -212, -220, 89, -91, 62, 224, 41, 100, -40, 63, -20, -48, 169, -12, -13, -85, -37, -69, -190, 156, 87, 34, 140, -52, 71, 54, 157, -185, -58, -249, 16, 41, -196, 58, 60, -191, 349, -90, 74, 112, 99, -12, 71, -38, -46, 41, -66, -133, -284, 151, -195, 43, 86, -69, -108, -70, -147, 278, -104, 133, 198, 223, -2, -89, -126, -56, -72]
4223g2k41L16n2K07k15j28J90p8J20K27p9j23p3O7J56k27j39J25r0n5L26j97l7
4246g2J95j07o9J54k28oK56j91K19J21l83K62k11J51p8l8Q8j9J13j8j75k74N11
4269B01k74K91p8k03P3L55k27o7J05l43J92j39j72K84j17Ok6J5J02k1R1Jk54J74
4293c1J18k44J00K51o2j3j88j62L7j30O6J89rJ26n5k0P0o5p1M00k23j85J07J64
4317A70p7j15K5j7l4J50J83k86R4J53n09J0L60j14j94J53j66J2K10j37R5l0m9
4340a13M0P3kM5K92l98K44k85L61m38J5J0J18J27j22K25k50o4J29L0l2o7R2n7
4364b7K49n51L44N0p6K35p0k09J58m7j41J15J26k27L9L60m49M09j62j29J09O4
4386A70j55k9l7j67k7R3K72n0j07K14l14O8j33J77j94L28r0K07nk12j97Q5k8R0
$$ y = [-72, -313, 3, -49, 158, -57, -185, 5, -73, 47, 274, 195, 72, -1, 66, 222, -5, -144, -19, -109, -164, 162, -35, -72, 123, 16, -53, 101, -127, -133, 123, -68, 151, 272, -111, 151, -60, 91, 13, -25, 63, 44, 157, 139, -36, -310, 201, -73, 218, 140, -63, 10, 365, 138, 71, 176, -167, 25, -114, -286, -2, -119, -113, -139, -124, -22, -43, 48, 49, -205, -31, 87, -157, -57, 194, 132, 119, -69, -231, -194, -324, -258, -69, -78, 48, -7, -27, 43, -22, -93, 307, 84, -101, 6, 170, 93, -22, 3, -14, -48, 102, 285, -1, 93, 246, -263, -253, 107, -7, -201, -48, -214, -202, 8, -129, -34, -64, -113, -73, 0, -2, 43, 335, -63, 181, -104, 257, -181, -166, -156, -38, 89, -33, 192, -58, -122, 7, 37, 5, -62, 30, -27, 222, -329, 15, 65, -11, 224, 154, -55, 103, 56, -85, 30, 156, -71, -32, 328, -121, 288, 126, -3, 106, 170, 15, -14, -51, -218, -245, -152, 120, 70, -37, 177, -137, -69, -202, -25, -219, 109, 19, 226, 221, 9, -188, -103, -131, -41]
4410d1L6j89L17L3j01Jj90J44j35P6M0k1L6J73k63P9j60J28J01q5K2j79J54n3
4434g7O2M4m1n4j6J73O9l88m3M02j29QL92m74Q5K6Q1j07q6M2m4j03k5K30q8P3
4460A2K07l81P1J55M9J9k83L2L78l90O4J12m8J48j18j05q6L50j12k53M17k08k7
4483Co5OL09m30K75j56K37j30n7P4J87k11k64L79j87nO2m5K4j49K57k63K90K26
4507C67n21L49k33J94l14L2J86M3o8k0Q2Kp2k8J29j16j96J74o5J95l89L85k11
4530i5l4J81l94L73J82j08L9j95O3Q6k66J41l87K73k1K50n0j04O0N8k4J07k33
4553i8K59l1j59J94q0L6j24j02J26j97J64j34K09m1L2P3k50J61o0K18k21m8K09
4576A36j20j9J18J05l81K1K22j09p4L08r8K6j26l56L48m4J05M3k11o7J97m0J49
$$ y = [-41, -5, -194, 123, 156, 55, 56, -134, 10, -125, -49, -9, -30, 6, 179, -84, -5, -165, -37, 64, -21, 1, -178, -24, -77, -15, 29, -12, -66, -82, 91, 160, -228, -271, 131, 2, 10, 402, -72, 13, 39, 120, 13, -73, -31, -75, -178, -203, 27, -61, 12, 219, -162, -91, 64, 113, 132, -151, -119, 259, -131, -67, 45, -3, 145, 27, -78, -164, 186, 74, -179, 238, 30, 3, -62, -56, 253, -177, 98, -58, 179, 49, -8, 66, 253, 42, -222, 157, -30, -35, 27, -18, 6, -143, 114, -149, 141, 367, -154, 195, -38, 156, -158, -126, 60, 103, 35, 15, 97, 99, 27, -1, 128, 12, -184, -10, -75, 120, -269, 116, -95, -129, 52, -342, 31, 213, 105, 144, -51, 12, 98, -168, -27, -414, -141, -162, 88, 38, -66, -6, 52, 28, 135, -98, 161, 130, -29, 165, 85, 121, -3, -105, 21, -176, -12, -146, 63, 22, 54, 127, -123, 38, -22, 196, -25, -73, 136, 16, -3, 115, 220, -161, -140, 82, -27, -101, 207, 109, 135, 9, -347, 1, -43, 62, 105, -106, -173, 24, -16, 133]
4599A33j26J03j12l37L26J37j41Oj97J66Q0j25M5J51M6n2o4o9K86k25j45L17k63
4622f0K5j23r9L14R1j39R4n8j03K15j77J39j97P1j17j4J40j07pJ59J36k25Q9o4
4646a7M9K41l58k00N82j39k84K66j55o8L02l47N8j37K33k07N06l10J70l70K41
4667E6m7o6K37q7N1j13k47M1o7L2J61j98K19j13L10j39J54n0L1k92J63l8m8L1
4691a9j84K3N2J04K15r9j67r5R7P9j38n1J36k6K7L54k49p1Q1k8J98j81j28O6j81
4716a85K88j31K18Mj82N9L11m06k6J07J4k24N6L8LO4m4Q9jj39K15O9j89P1J90
4741B69j04l70N3J41R1j48J99m4J3k34J13J2J18k66O8L67l76J65l2Pn4J69j77
4764b0J45jj77L48k35k47L39l17L57j29k16J34m4j33K18j72K99j97J62o7L0q8
$$ y = [133, 7, 110, -2, -339, -13, 124, -17, -11, -208, -42, 38, -87, -42, 109, 155, 103, 39, -30, 256, 31, -114, 203, -60, -35, -158, -257, 57, 148, 9, 103, 45, -58, 157, -20, 119, -78, -7, -124, -138, 2, -105, -112, 47, 183, -42, 47, -17, 32, 273, -85, -285, 297, 158, -126, 140, -15, -83, 219, -128, -70, -207, 26, -181, 325, 15, 185, -185, 56, 9, -57, 180, 93, 144, 31, -216, -175, -242, -210, -49, -247, -28, -141, 169, 30, 184, 134, 165, -127, 36, -2, -50, -19, -203, -180, -128, -24, 191, 92, -75, -170, -73, 6, -132, -183, -47, -73, -46, 308, 59, -12, 69, 41, 239, 58, -70, -4, -185, 103, -28, 190, 194, 12, 71, 382, -24, -50, 57, 71, -153, -97, -59, -56, 8, -36, 53, 52, -87, 128, 197, 8, 79, 269, 165, -205, -152, -11, 80, -68, 131, 87, 100, -134, -21, -9, 109, -157, -89, 278, -98, 67, 35, 42, -12, 157, -20, 125, 124, -53, 295, 60, -187, 152, -165, 192, 63, -153, -19, -63, -196, 22, -150, 149, -48, 114, 47, 77, -11]
4786a1o7J51n7J79Q5m09J01m8J6N7M2j69Q5j4m3k2J64p2K17j94n5j8L05k66K1
4811b2J4n5j8L8K13l76J81j32J96R7q9k19K70l71Q0J86J53pk85K72K1k86J79j04
4835f4r1K57j08J26k2k04M5q1K15j76m4K16n0p1J53m42L71l6R6j0k74M47k73j47
4859a67J7J03L5J61l65p2M47K5j11q0N8m0L8n6Q9m7k7qJ4j59L7J21K9k62L00O1
4885A41l9m48L77j85K23k3J46Ol92K89K6o3l6R9Q1j6k83j82K89J43k62Q9J2p5
4909h3J20J9l32N1K33j66j09M03P7k19n1P1K84k65K2j98J31k8j78L79m1n6O5k38
4933a09N6q7J10j7K15m49M16Q3ml13J82l12Q1M3J37j19L22k19M0J21n6q6K46l58
4957g7j25K67P5j1P4l19m9l7K91q8j00Kj7J81J0j8L9k22R1O9Oj58k55L01N1J49
$$ y = [-11, -78, 73, 16, 195, 280, -129, -28, -76, -60, -3, 39, -130, -45, -59, -102, -124, 40, -32, 185, -9, -64, -82, 223, -43, -22, -8, -63, -81, -43, 170, -206, -25, -157, 39, 136, 47, -172, 98, -273, -193, -7, 146, 139, -146, 126, 147, -139, 40, -64, -155, 102, -6, 120, 98, -106, -61, -142, 73, -103, -147, 69, 19, -52, 101, -341, 30, -6, 90, 80, -194, 253, -20, -167, -150, -47, -12, 149, -216, -288, 159, 184, 73, -7, 51, 11, 49, -7, 82, 35, 8, 0, 14, -145, -108, 13, 42, -220, 80, 141, 102, -346, 31, -154, 69, 46, 192, 198, -194, 95, 121, 58, 22, 121, 202, 186, -97, -279, 10, 153, -109, -20, -8, -83, 37, 56, -276, -225, 8, -158, -267, 136, 213, -6, -57, 14, 298, 33, 55, -143, -12, -40, -218, 161, 120, 64, 129, -109, -53, -140, -30, -47, 168, -281, 135, 218, 214, -99, 83, -229, -148, -105, 32, -87, 235, 16, 56, 177, 121, 35, 281, -77, -202, 65, 140, 129, 203, -116, -165, -202, 89, 1, -99, -97, -114, 67, 77, 59, 98, -124, -33, 36, 42, -116, -371, -70, -19, 130]
4983A30j76k45L81j36j14K24n7n8K29j80j55P1R2J51k65K4N1j03j5m6K05j37K76
5006A47k24j41J98J76k67J1L3q9R6K2l1K35k21K57l01L11k28j08l0K96j26j49
5028a33K29k05K54k78J5K27j3j10K30m61R8O7K39l03K94k99M16k72L4K86l19k09
5050b13J21J0O7j0P2K1r4K34k50L37k54KJ28j97RQ2J4Oj96J73k1Q9j96L7J34j69
5076f4M8jr8O2o3K46L1k33L2Jk10J34K96j86N7Q8k40J15L2j38J77J33k98K25j57
5101a1K22j17j56pR6o6N6J46l31Q4kL04k60J06R9l25LL02m0j57R8m3J91l41J58
5126IL53l00k20L44k66K27p7j80P6j24P1j30K29k23K40M6j15j6J40j7k24R1j41
5149b07J40K02j99j2R1j4J08n5L7n5p7J18pp4J39k34Q5K04j22p9J32k49J02L16
$$ y = [130, -46, -291, 90, -46, -160, 64, 7, -51, 178, -2, -157, -86, 6, 157, -108, -84, -33, -136, -151, -197, 8, -129, 147, -77, -218, -20, 156, -111, -100, -67, -156, -60, -38, -69, 166, -55, 202, -99, 212, -16, -124, -154, 142, 16, -133, 96, -109, 145, -133, -118, 109, 96, -14, 216, -245, -147, -80, 159, -144, 150, -149, 267, -5, 29, 315, -4, -213, -92, -82, -15, -25, 47, 68, -26, 208, -42, 295, 41, 43, 171, -26, -17, 65, 79, 85, -111, 62, 41, 130, -66, -29, 105, -64, -16, -17, -115, -53, -116, 130, 161, -72, -40, -39, -249, -115, 181, -5, 52, 140, -100, 15, 47, -91, 86, 219, -79, 146, -11, 211, 94, -62, -69, 27, -39, 17, 163, -168, -84, -86, 218, -42, 64, 163, -162, -159, 143, 103, -54, 44, 1, 192, -149, 9, 362, 62, -158, 186, -80, 147, 70, -110, -34, -158, -87, -217, 12, -211, 29, 75, -40, -56, 84, 67, -157, -66, -207, -67, 135, -64, -76, 15, 1, 109, 54, 91, 36, -41, 77, 70, -4, 135, -99, -14, 190, 68, -11, 121, -128, -26, 290]
5173B90l32K79l95J91K66k90r1N9j48K63r3M7n7J40M0j91M2L0r7N4m4j90J2L2
5197a83L5P4J2k5p1J39J05l17J71Q8j94M91l01p2r9M54k42k61K81k19K78j19k00
5220a75J00K47j21Qj25j86K94j59J03P6N8n9J2O1k40R3r9J43p4Q0O0j50J03j09
5244e9k39J96N5K28j0m3k67J26j57K46j34O1P5n6%Q3k70K67o3qr2m5K43j97L03
5269B43l21n4J14j34K7J52L6J0M0k05K46j22j31J01K8q6l5J13J08k7p8MO1j3j49
5294g2J63j83L70l83qK40k12Q9N2j42J06J00l45K16j00K9K04m21R6L59P5q4j93
5317d4L15m59K03o6J83r0j65N0r5K35k54N8R7P2O0j30P6Pm9J20j56k8J82j70r5
5342a43L82j80k5j49J83N6J08l61L7j48K74j09j8J24o5K05Mj11j37M6J21Q4K08
$$ y = [290, -42, 237, -158, 33, 299, 9, -82, -23, -171, 92, -1, 46, -11, 129, 169, -22, 20, 50, -47, 7, -37, -227, -215, -183, -148, -74, -62, -87, -158, -19, 86, -231, -60, 28, -166, 325, 24, -48, -147, 307, 65, -196, 85, -134, 144, 25, -175, -75, 172, 51, 59, -66, -252, 42, -117, -14, 62, 120, 61, 73, 134, -106, -13, -112, 31, -43, 37, 97, -53, 50, -59, -298, -102, -47, 181, 171, 128, -139, -13, -170, 76, -58, 3, 78, 22, 22, 105, -165, 102, 39, 31, -61, -106, 137, -60, 243, -78, -132, -18, -152, -125, 27, 63, 73, 113, -92, 154, 32, -99, 2, 30, -56, -91, 22, 130, 103, 25, 29, 90, 77, -72, 91, -92, 278, -105, -113, 127, -85, 4, 56, -86, 20, 120, -225, -9, -109, -80, 124, -297, -201, 158, 233, 149, -44, 271, -188, 15, -51, 132, 42, -123, -73, -168, 67, -187, -129, -32, 40, 100, -30, 46, 53, 4, 124, -32, -60, 122, -48, -143, 239, 59, 34, -115, 68, 124, 232, -129, -92, -240, 34, -75, -93, 31, -34, 171, 175, 64, -73, -27, 94, 178, 386]
5365C86n09q4J62J55j58P0n7P9oo3O7rj8nR8k79L66o88N99k05l5R0J70j89j12
5390a75L44n7r7J31l84P6L73l00Q8j87P9J25J27j99N2J58k81K65k57J88j83P6
5412c8k08K43j28R5J12oQ6l84L35k96J86q1J0n0loJ18p9K09J85j66j90j63J32
5436h7R9j16j40Q6k9K19R2J08J12o40L14R8j68O2L9J03k11J68l06J30N1q3J09
5459A0k5J34j04j73J71PK08j29j61O2K6J64p7j06o5R7KL09j70j49p7J70O3l4l97
5484b44M04L4k37j22kM5J76J76k07o5J12j91J59J2J08n0j65k42K29J29K9k00Q6
5507b6m6k5J09j19L57n8k34K4J55k1j62p3j91J66K7J47K6j99K36l33M12j48k96
5530b72K59j07k2J95n6R2j57j39l1J96j8P7k07K63j14J77j4l88N6L35l50M21l61
$$ y = [386, -123, -207, -45, 110, -48, 22, -35, 44, 38, -25, 42, 33, 15, 10, 108, -171, 195, -493, 106, -99, -134, -44, 126, -63, -175, 169, 112, 15, 146, -238, -162, 211, -89, -1, -188, -109, 16, 143, -56, -4, 154, -127, 138, -119, 69, -114, -38, -246, -3, -131, -36, 76, 70, 156, -228, 107, -189, -3, -84, -74, -124, -127, -133, -15, -94, 115, 300, 134, -56, -219, -87, 12, -104, -244, -158, -187, 32, 124, 232, 344, -296, 18, 116, -52, 10, 49, 152, -59, 109, -197, -67, -16, -99, 10, -15, 119, 15, -158, 13, 20, 228, 99, -62, 0, 26, 190, 113, 7, -58, 39, 41, 350, 180, 31, -46, 124, 187, 153, -244, 160, 194, -43, -165, -167, -122, 54, 230, 23, -42, 70, -121, 38, 50, 158, 108, -57, -299, -70, 59, 88, -112, -26, -72, -97, 12, -107, 250, 192, -42, -18, 137, 116, -46, -119, -310, -144, -117, 30, 56, -143, 93, -240, 172, 24, -272, -13, -120, -142, 53, -3, 89, -68, -207, -238, -42, -60, 17, -190, 73, -41, 136, 122, -266, -210, 125, -225, 196, -165]
5553a65J28P5j18K68Pq9r0j16l7K38j48M5J60k38j29O0J30K37j12p8p7K54n02
5576b97J6K95j57J15j01N9j5N4P0j19J73j65J54Q7N2k25R8J6p1K40j34j11lJ16
5600A47k85jR5Q0J5k14J79K47k03m4M4Q1j34P7q9j66K91j62K66k09k28K44j10
5623g9N0k74K72j84J37Q0J70j08J70k64r0j35K66J66l29R6k7K7J32O1j40n0r1
5646a44L88j89J70l15m7P5J71rL8m01K13J4L5K2L9j73J66j12J13k38L06j16m2
5669c6K03n6P3m62J90jJ5P1M7M5k40N8L3k6K51l41J83k0K85k72M0k77j05K62K67
5694A87k96lO3K03k49J98q7m6J44j13J28lo6k24j00o8K41J0L88j18J73l34j32
5717a04K65j82K53J0n56K19q6J18K73q2n8k66K64m4r3J14m3K10L8m47L15L9n5
$$ y = [-165, -37, 38, -80, 188, 195, 106, 16, -100, -137, 101, -47, -2, 158, -80, -209, -149, -19, 218, 106, 28, -49, 205, -297, -281, 14, -143, -28, -129, -70, -85, -31, 39, -80, 93, -72, 82, 169, 221, -4, 94, 110, 39, 279, 145, 34, 31, 147, -138, -139, -44, 36, 51, -163, 16, 263, 60, 16, 60, 141, 7, 84, -5, -171, 120, -42, 224, 15, -213, 31, -79, -29, -303, -31, -215, -78, 2, 172, 64, 234, -30, -120, -255, 11, 177, -152, -56, -83, -56, 76, 137, -3, -53, -144, 244, 55, 225, -90, -137, -62, 109, 100, 138, -263, -50, -36, -1, 21, 60, -113, 53, -59, 54, -184, 122, 6, -36, 167, 111, 184, -278, -88, -89, -74, -3, 44, 89, -151, -93, -60, -86, 165, -176, 7, -13, 272, 0, 40, -237, -342, -80, 187, -109, -112, -49, 154, -95, 103, 16, -30, 114, 1, 129, 126, 60, -164, -264, -332, -91, -81, 307, 189, 362, 28, -104, 161, -21, 232, 242, -314, -95, -181, -63, 210, 128, 70, -196, 68, 24, -69, 45, 2, 212, 250, -197, 118, 157, 102]
5740A02m3J52j62m7M0k31N5q2J63J8K77k88lNj26J67J51j87k2R7J49l38R6o1J31
5765A3r6L3N1k87J61P2J96o5J81k30Q5J20l99M7J37L5j03J49j49j56K93l3l09
5788b54K55M1l08K78l4J89j54r8J65k44L84K0j00j34r1J1jJ98o9k58L57j39J88
5811B02k26L8L3J49l92L05j89K91N8m37J50k77K54J10n6j9P1k51L91j77j89K2
5833a39M8j25J97Q8J1j2l5k68Q0N9P5K88k41r3m8K73K5k6p5k04J02J52P3l53J84
5858C6k30J78K5m4j37J04M9J8j03m6L96k76p3L4J0j03M07l46n0J54j56J80j19
5881i2J42l12j3L82M1j00L8Mk8k96J91O9J78j50r4K28j87j37J26j57K83Mj95N3
5905b2Kj9K81J7l57J43J83k3k70k08N9J82j03J01k19L18j72J0K47r5k42J66j4
$$ y = [102, 59, 211, 49, 2, 42, -189, -134, -216, -53, -35, 242, -46, -49, -44, -170, -3, 148, -39, -61, 36, 185, -153, -57, -118, 13, -83, -50, 1, -286, -125, -53, 143, 78, 259, 29, 114, 234, -165, -118, 19, 54, -49, 100, -49, -205, 88, 55, -254, 1, 42, -266, 12, -22, 167, 13, -85, 80, -164, 220, 240, 140, 6, -85, -74, -75, 123, 54, -204, 153, 14, 202, -24, 14, 47, 196, -196, 109, -80, 211, 269, -168, -18, -295, -41, 69, 13, -6, 65, -186, 205, 28, -161, -139, -91, -216, -19, 69, 80, 68, 33, -235, -155, -96, -21, 267, 26, -67, -115, 158, 183, 157, 82, -122, -20, 132, 205, -148, 36, -194, -16, 9, -35, -172, -68, -19, -1, -104, -150, 246, -30, -103, -69, -59, -162, 245, -101, -151, 3, -153, 27, -92, 50, -262, -275, 107, 148, 48, 86, 90, 62, -234, -43, 26, 204, 54, -40, 188, 1, -136, -10, -167, 116, 120, -75, -22, -20, -39, 242, 259, -98, 45, 228, 205, -65, -273, -214, -32, -135, -34, -253, 65, -107, -97, 150, 55, -187, -21, -35]
5928c5j05J65R4k08J94n22J51K34R4J36l0j46r8P0O1LQj18M3l9J03Nk54J02q3
5953a75J30K4J22j93L53k74K33k12q1j9O5o3N8qj74JO4K75j3j38J2J99l39J42
5977a1L6j09K76L9j95j42K57j09Q5m39K29N9K27k90o5J25N6pl28K93N1m4K17j86
6001B5j25r1J04p0J77o5pK03J24m45M90k96j23N7KJ31N1j18pJ65j45J74j89k32
6025b10J86M1p7J95M8k47J05k02J59l1j32L34l12JJ4o8O8N9k63J71K49Q1j40j58
6049a29J66J35k90J01M0l5l5L01l78R3R3j86R5J88j72k2l8K60j93J24k03M32m03
6072e6L24j90j00R1LL1r2j86J43M9J0J1K04j4k14j06MN6J0J4R6J5oj4o6L6RR5
6100A57l15L56j90r8P5J34l71L25O0q5p8K20j35k05M6J51N8Q6k63j3k42L21j88
$$ y = [-35, -140, 25, 119, -89, 105, -417, -266, -32, 62, 198, 168, 22, -76, -6, 55, 58, 66, -52, -9, -48, 55, 60, -194, -92, -175, -45, -21, 101, -92, 261, -13, 220, 8, -73, -92, -27, -90, -32, -40, -214, -213, -149, 126, 113, -25, -13, 186, -153, -11, 25, -84, 192, 231, 36, -106, 151, 42, 127, -312, -83, -24, 203, -87, -152, -27, 29, 22, -306, -13, 38, -6, 211, 25, -100, -191, -87, -157, 20, -45, -52, 151, 275, -170, 320, 24, -99, -42, -40, 91, 142, 24, 17, 182, 37, 211, 22, -210, -24, 17, -60, 135, 183, -64, 41, -161, -2, -33, -165, 169, -143, -142, -128, -196, -128, -69, -332, -161, 88, 169, 29, -129, 37, 172, -118, -17, 23, -12, -47, 254, -124, -31, 62, -124, -29, 159, -13, -35, -73, 187, -6, 118, -85, 347, -56, 268, 78, -22, 69, 72, 103, 11, -175, -32, 17, 27, 38, 242, 228, 14, -92, -88, -32, -22, -8, 88, 103, 97, 83, 17, 53, 62, 157, -158, 198, 8, -90, -15, 119, -252, 73, 133, 48, -30, 190, 55, -150, -104, 47, 105, 191, -72, -85, -327, -6, -194]
6123a94Q4j7M24k39j70J65O1k19J4k3J73O9p9K6k39J46j58K02lK78m5j20q7j35
6147h6QJ66j30J10K1p2K6om0Q4J8r4J56k83K9k70L99p0p0K42l34K27L3j08m8K05
6173A13K47n56J70k7l0K2j77K46r4J23j17K07j18p9N0n5L35j41kq4j01J06j40
6196a02K75j89K67l7k97K80l02L7j34J61q7K15o6k8P5l20L71j09k80M43j90j85
6218b02J78j73K60J64l40J56j26K3J30j3k74J3P25l90M5j34J10k44J00j15M5J56
6240I4N9J1r2o5M9n3o9J11p6O1k24K80m5o7J10k39jK33j53K75J5M8l09k1j80J85
6266f3q8K07k69n1M48n0k06J28q2J22J31j99O4j78j13K48j6j89L22j92J48j95
6288g3J07O9J54l32N3J7J99k52O3kj32j15P3J34J4P7j72N6R3j16O8J89l47J95
$$ y = [-194, -110, -127, 297, 58, -112, 53, 114, -105, -91, -114, 59, 128, 49, 75, -164, -18, -176, 26, 23, 301, 256, 136, 49, -86, -78, 88, -42, 68, 89, 17, 43, 37, -3, 81, 99, 5, 161, -122, -93, -363, 36, -34, -104, 138, -196, 31, 64, -44, -92, 113, 360, -196, -26, -53, -83, -61, -238, 8, -86, 37, -80, 127, 9, -70, -20, -75, 260, 119, 117, 33, -68, 38, -102, 173, -16, 251, 214, -83, 197, -105, -68, -202, -41, -128, 87, 21, -7, 68, -252, 119, 10, -270, 173, -17, -202, -24, -197, 63, 227, -113, 43, -83, -60, 70, 57, -217, -204, 521, 131, 176, 42, 152, -92, 8, -107, -62, 94, 153, 164, 72, 7, 56, 3, -66, 45, -31, 30, -194, 86, 41, -26, 84, -155, -156, 77, -76, 199, 214, 262, -47, -68, -248, -63, -151, 56, -213, -264, 184, 134, -72, 56, -26, 96, 227, 28, 92, -86, -199, 49, 33, -156, 166, -26, 122, -73, 34, 103, 257, -75, -22, -5, 194, -58, 5, 3, -129, -244, -171, -37, -23, 54, -118, -62, 31, -85, -17, 172, -175, 20]
6312B0j88J00Q3P6q1j22Q0K15Q5l43n8K0L53j74j13K3J5J7j58O6l5K47k40n4K72
6337A06J25l01J30j25J55k14pJ34j50J32j57M18r8k78K22m6P4o9J33k4k56j3l
6360a12L05k30J64k8n3j4p4j34K06J76j35j34J1J65j24M7k00J44QR6K01l19p5
6383a09J17o7L60k33j88q2PL31P3q6k09Q7rP6k24J97j20l28N03l77K68J25J09
6406B21j02k66L07j53n1r7M06j83lJ41o3k29K08J05L7m21k3N34l93J51l61L68
6428A33l13L18j07j96K06j10n2R6q4K08j28j6R4p3L75l26%M3J6j05R1J8P6j77
6452a3N8j09J27k81J90k40L55k64K08k07j25L34k29R3J03J80j01j23J10O3k62
6473a33O9o6M7j5P3K01j59k34J52J72k34J04J9N5j81J95J19l10J45Q6j93J7O2
$$ y = [20, -168, -68, 15, 91, 10, -112, -32, 183, 268, -75, -133, -113, 240, 66, -47, -24, -9, 8, -150, -84, -119, 128, -112, -166, 106, 231, -70, 60, -65, 90, -124, -131, 3, -147, -15, -172, 246, 148, -130, 92, 46, 120, 51, 184, 160, -96, -109, -112, 193, -37, 127, 99, 46, 32, -42, -176, 30, 206, 71, -63, -52, 113, -11, 36, -164, -20, -12, 84, 285, -34, -109, 8, -59, 301, 68, -120, -202, -195, 136, 209, 123, -86, 1, -8, 68, -156, 41, -79, -407, 96, -281, -13, 112, 221, 119, -147, 160, 7, -44, -141, 265, 82, 79, 220, 157, -72, 136, 241, 278, -143, -166, 368, -25, 126, -235, 133, -180, 138, 31, -165, 41, -69, -121, -25, -109, 99, -29, -45, 49, -24, 351, 25, 25, 68, 84, -21, 70, 88, 164, -13, 45, -64, 63, -218, -28, -268, 87, -177, 31, -176, -301, 33, -196, -103, 0, 180, 79, -44, 66, 129, -133, -64, -130, -83, -98, -25, 176, 17, -217, -65, 107, -127, -23, -4, 51, -130, 65, 184, -126, 19, 105, -88, -71, -9]
6496ij56L08k28L69l14j93O4J85J47k99J35J08r7j5j4J22k16J91j40J05K1j16
6518d2J50l46p6K00j15L09n3K7K13l55J8K64k20O7r3n4K06j37j09J31J49k15j12
6541a93k8K49O0k55K57o8k8k2J80k79k8K24k01J4J68n3M0J3M7J17m70J11J92q2
6565c5o4J91j5K0j12k2j40R8nJ38O4k85K45p8k73M20m0j55j44J14J81k30K39k4
6589H8o1J10r6K9n6K12k53K9o8J59j64J12k90K22qj02J0j53K77O4j01K22k54J62
6613I0LK6l96L63l0K2l9%K37j95M7R1k03q8p3K14J12p0p8k2N6r2o9K64J2j45l1
6640FM6j06j56J86j13K74P8q7k99K32q0J31k46J21l8k51K08J52j5k52J36J23p3
6663b3j67L92j70k8j4J04n5L8k45K35Q8l67K0L14m8q2R5J9j74K9K71m26J38J71
$$ y = [-9, -165, 143, -85, 284, -30, -223, -159, 26, 173, -126, 9, 117, 20, 5, -9, 113, -103, 88, -52, 53, 74, -42, 108, -238, -314, -114, -229, 80, 27, 54, 267, -88, -70, 194, -26, 41, -52, -106, 100, -37, -146, -15, 134, -81, -193, -221, 28, 88, -167, 90, 22, -6, -28, 152, -127, -155, 69, -132, -118, 50, -3, 37, 50, 97, 214, -256, -145, 47, -35, -99, 92, 77, 97, -15, -37, -177, -79, -84, 54, 118, -167, 78, 0, -273, 147, 107, -48, -192, -78, 103, -127, 112, 88, 27, 137, 41, 70, 14, 226, -27, 2, -66, 93, -71, 41, -249, -27, -35, -137, -127, -280, -3, 61, -40, 182, -72, 90, 93, 119, -277, 86, 56, 78, 39, 39, 276, 81, 128, 219, 16, -72, -145, 69, 181, 111, 33, 11, 67, -25, -94, 170, 182, 37, 6, 52, -54, -210, -24, -137, 137, 215, 128, -171, 61, -19, 112, -134, -13, -51, -302, -94, 58, 43, -209, -73, 50, -23, -190, 202, 32, 4, -10, 94, 39, 77, -168, 67, 155, -212, -192, 122, 74, -8, 87, 106, -68, -39, 232, -194, -56, 115]
6687A15j99O3J26r1n0k08L86k71K6K00l53J55r1M46q6l43K72j44N1J45j39k57
6709b47K01l5j5J1J33k03K19J25k72K0k2N8Q2k34ML38P1k08J3k7J43k6k87J21
6733c7j01K02k35J07J19J4o8l9q0Q9O4l35M12n3j83K57o9N4p9r2r6J54j81J78
6757Bk0K3k4O1q6J98l7m5Kj74J93m2q2o2J56n1J22l49j5J14O6K18m21J12J44q2
6783g9K20n71K66J87M9J01l82P2O8K27M6o6j12k2j99L15j14q4J74j01J00l08L91
6806A78q8Mj73nJ75k6K0k0j0l5j27L5n5K62k41k3RK42j6k32K27k66K90P0m5M9
6832A99k53R3J76j10k30J70o7l0m2Q9q8n0Q8K36r9k23J3L27l47N08l75jM05n73
6856a84K74j24J28m7k72Q8J19n7K74P5m48L88l46K37k52L51M7l23j60K09j02J4
$$ y = [115, -84, -21, 105, 14, -36, -244, 142, -129, -103, 97, -256, -101, -192, 254, 168, -175, 97, -47, 4, 149, 10, -247, -46, -81, -96, -85, 48, -155, 64, 189, -83, -63, -85, -27, 55, -179, -175, 163, 234, 26, 39, 12, 155, 129, -158, -37, -138, 64, -171, -64, 55, 69, 1, -38, -118, -29, 35, -300, 112, 59, -124, 133, 64, 118, 39, -53, -149, 5, -176, 2, -18, 5, -19, 42, -44, 154, 117, 72, 74, -100, 93, 51, -31, -93, 63, 12, 134, -215, -230, -116, -50, 168, -253, -141, 3, -79, 141, -430, -164, 23, 72, 173, -209, -137, -69, 158, 204, 138, 26, 4, -195, 120, 6, -78, 96, -5, 95, -213, 178, 90, 94, -79, -84, 91, 65, 85, 65, 55, 20, -107, -72, -127, 135, -106, -129, -120, 122, 106, -126, 101, -165, 125, 195, 150, 199, -54, 39, 215, 105, -125, 45, -22, -52, -94, -5, -93, -143, -55, 181, 82, -141, -128, 199, -148, 360, -15, -16, 389, -184, 90, -34, 94, 47, -225, -137, -18, -75, 199, 274, -174, 214, -132, 105, -147, 204, 251, -72, -232, -23, -125, -111]
6878a11J53l43L32o2o8j32J42K41k56J39N8l8j32j35L44j66N5p1k25M31r3r2J58
6901A29j3j25j42R9K71j57k34J02O7j35M0J24j14j79L03N8k2mj86L3J18j43Q4
6924b6p8j1J62j40J72j34L5K1R9k10K65j23k00K78J00m58L73j37m9J70k04L22
6946B27l38K36k36Q4L75l71J22k85J83N8m5L2j12q6J76R9L2k67J4K1M5k44J52
6969a28J90k5l08L34M8j51n7J41j4j64J28P6j35N2j51J07r7J67j09p8R7J66o5
6992B4j89L2K39j25K39m4l68J69P4k0J88oj87j67K52k0j47L6kK8p7K23j42M8n
7017E3J16J64n32L05NN0k48k6N8K28n1J77k90j01L80m95M00l09J78K47l24Q0r4
7040b9M8l4M4M4J5N0j50q4J84j65J37o5k88M27l03K26p6Oj43L26l00m6L62j8m9
$$ y = [-111, 42, -301, 31, -31, -99, -231, -89, 152, -104, 35, 93, 55, -77, -212, 132, -34, 21, -50, -275, 156, 63, -29, 129, 116, -9, -151, -52, 219, 62, -172, -70, -3, -138, -98, 26, -88, -267, 36, 94, 72, 68, -118, -85, 33, -110, -26, -104, -115, 47, -93, 79, -55, -20, 1, 100, -110, 155, 32, -168, 110, 210, -248, 125, -12, -61, 109, -95, 227, -111, 125, -111, -27, 348, -23, 99, -186, -3, 55, 10, 42, -70, -156, 20, 119, 151, -116, -102, -81, -36, -280, -128, 62, 37, -271, 63, 111, -40, -97, 44, 30, -134, -6, 70, -65, -13, -164, -57, -154, 13, -96, -174, -77, 89, 24, -165, -133, 106, -19, 220, 176, -192, -23, 51, 31, 219, 213, 26, -141, 111, 91, -56, -20, -22, 6, -71, 152, 10, 58, 53, 169, 333, -199, 106, 111, 161, -87, -113, -55, 173, 122, 299, 9, -92, 288, -207, 193, -116, 62, 309, -15, 65, -29, 19, -15, 29, 73, 88, 138, -12, -96, 88, -77, 60, -5, -293, 134, -169, 57, -19, -13, -156, 170, -130, -176, 186, 168, 119]
7065A19M6J7j50j89K29k1m2L7K9j24L82k33L9j78k74K12M4L61l33J6j16k5K74
7088A20j15O4k4k70O0k6K95j62M01n71K10L4n2j24K21q9L30l66J53j18j39M1J71
7111D4p5j9k39M07l27N3K28l1J96l33K19j63J67o5m31K65M7j05Q7K3K4L2k03J27
7135g2R4K8p2l30M67k85K7K18l11J05N3K7K3j4p3N4M7k89K06j75K07K12k82K31
7159I6o4j00N7M4N4m00P1K28O8J61m88J88j47L96l35KJ12M3K02p9k42N4j14K12
7183A9R3j35J84p3j18K2m4K6m1P3J00j27j3j11J68k2j52J70j59J82k13J41M10
7206C80k70O7l15K22J28k06L8k21J13j88P7J99R7j92J03N3l47L74Q5j15j94J47
7228C5m6K51j12k53r6L90j49p6M9l3j01K6J36j39J51k2J65k52K20j80K39R0l65
$$ y = [119, 165, 182, 32, -157, 72, 51, 9, 46, 75, -49, 333, 100, 139, -39, -313, -101, -57, 304, -29, -13, -129, -154, 120, 5, 69, 45, -225, -165, -191, 104, -58, 343, -228, -18, 16, -36, -160, 61, -28, 302, -64, 89, -29, -168, -127, 44, -31, -50, -289, 118, -209, -156, 72, 41, 237, -96, 123, -40, 127, 62, -369, -104, -57, -162, -75, -52, -28, 4, -199, -72, 22, 50, -22, -352, 115, -170, -143, 75, -236, -131, -78, -51, -28, -42, -115, -61, -14, -303, -97, -272, -65, 147, -135, 96, 32, -68, -11, 33, 87, -313, -242, -14, 54, 215, -273, -85, -232, 164, -171, -169, -57, -14, 188, 109, -133, -79, -193, 19, 112, -23, 161, 88, -30, -8, -52, -26, -67, 6, 106, -21, -34, -145, 23, 1, -151, 19, -140, 42, -171, -30, 380, 110, 177, -138, 84, 212, 6, 44, -177, -64, -252, -175, 24, 121, -71, 32, 85, -262, 112, 197, 82, -112, 35, -11, 240, 128, -125, -221, 169, 20, -56, -7, -40, -141, -115, 21, -118, 33, 11, 176, -76, 144, -36, 203, 293, -72]
7251g2k60K92j29K39m2j6P8j24qnN1Q3Q2j32m4J53k38K44r1J75l51j0J65R9k55
7276a16l1K51j62L24n35n2M83k34K55j96J33j80L0K4R9m3j04J86r5k2J13j13J38
7299A53r1j49K6j71K54j98J97M6m2j56P1J66k98K14n8j94L11n8l08O1J25J44j69
7322a24j13J08N7K16k11J52j18J8JO5J1l03K07O6p1J92j45K30m42J68QK08LK39
7346D22o65J09J69q0q3pJ60k0l2Kr1K41m1k34L42k63L74l30Qk13K99j73L34m25
7370a97M41J4m21P3K50j84j8MpR7P5jo0j34M20l46J26k90O3l54K98J14j73R2m5
7395a63o5L29q7k79J95J03L4kn3n2J87l30K74j62Q7J0k10Q0j99L71j03P7k15J66
7419gJ21n00K77K70q4k08P7J1K12j75r5Qp8M45l54J45P1j52m3j05J78L5L48n01
$$ y = [-72, -332, -40, -169, 70, 28, 12, 90, -34, -42, -47, 4, 87, 169, 37, -7, 146, -92, 152, 61, 236, -115, -125, 40, 139, -116, -147, 104, -58, 266, -269, -321, 162, -72, 183, -13, 120, -60, -30, -6, 93, 50, -54, 132, 37, 15, 128, 15, 153, 62, -87, -61, -232, 22, -176, 21, 67, 25, -131, -60, 106, -192, 22, -36, -230, 81, 23, -285, -224, -99, 45, -124, -237, -129, -72, 144, -67, 85, -33, -15, -14, 51, 62, -241, -34, 32, -39, 153, 8, 238, -204, -36, -28, 180, 183, 422, -243, -134, 35, -45, -128, -135, 25, 5, -27, -25, -116, 125, 84, -150, 192, -71, 303, -27, -19, -232, 67, -106, 228, -197, 244, 258, -163, -90, 160, -24, -42, -38, -45, 52, 127, 126, 66, -68, 352, 6, 132, -158, -95, -449, -151, -37, -210, -118, -163, -228, 101, 14, -265, -70, 33, 67, 65, 12, -40, 147, -183, 91, -71, 16, 26, -184, -104, -303, 68, -35, 42, -173, -7, 114, -386, -109, 161, 77, -131, -54, -43, 169, -6, -101, -93, -171, 274, -80, 65, 136, -16, -59, -164, 14, 49, 397, -104]
7443a04J46N9k72Q0J20L1l35J56J06O8p9J6K54j96l0j43Q6r4oO9J60k13O4M6L8
7468B7k20M27k5l17j42N5K64j10J57l09K04J43k75Ok4L41l05K18j19j45L08Q0
7490B39j61l6n2j20N4K30j66K20j91P4j21J69M0k68K44j58J10n4P0j40k24M26
7512A85r9o2j31J59l7O5J77rk90K0j67l1K78j54K58k26q6K55m6m3j00J58p4P5
7536G5P9n8l52M20j37R1l65L48P9r6p6J42n5j49q2J88k71J28K57j75m1r9j18M40
7560A73k61j6J52k34J72J39o3L6J2l6j22L1J16j07l1QJ35k19j96M41j32L9p5j61
7584a99o7L40n6lj01j91K82jj58K33k2k45J34j36J80k6m2N7j57K98p5Q5k16O6
7608b0j12L96m64J45L58m85K92n1J3k23K9L37k86n7K11k8j47jL28k24j8j08J66
$$ y = [-104, 42, 101, -171, -91, 29, 60, -275, -119, -13, 55, -24, -8, 246, 50, 20, -123, -37, -131, -137, -68, 92, -121, -57, -11, 27, -193, 234, 209, -108, -250, -195, 69, -41, 116, -193, 11, 154, -121, -115, -139, 202, -103, 115, -4, -149, 159, 239, 78, 42, -10, -130, -76, 154, -12, 208, 17, 91, -30, 139, 179, -89, 155, -3, 107, 53, 123, -17, -241, 185, 86, 24, -107, 52, 15, 80, 257, 248, -42, -22, -189, -220, 58, -96, 162, -64, -150, 105, 59, 16, -84, 74, 0, 75, 154, 96, -256, 164, 27, 118, -247, 101, 180, 84, 8, 150, 95, -54, -136, 52, -219, -91, 166, -9, -50, -149, -267, 173, -88, -104, 48, -186, -14, 125, 62, 98, 110, 74, -48, -17, 99, -8, -39, -31, 104, -115, -311, 130, -2, 37, -38, -199, -266, 74, 18, 15, -86, -277, 5, 4, -154, 79, 57, -188, -54, -190, -10, -36, -78, -21, -178, 120, 45, 130, -86, -20, -132, 264, -200, -55, 303, -182, 110, 59, 72, -151, -122, 215, -71, -128, 83, 55, -92, -93, 235, 11, -7, -115, 51]
7631E1m6j51O0J75N0l02J00R0m7k57L15R4j09R2L4k7K28k64j62k4L38k64K71l78
7655a33J44mk39J94j7j17P4K30j71o3l9J04j21M2p0n4K20k9N0q3Q3j08J39k14
7679a82M63m89K00j39R9n4J32R3mj20N1j25K0k1O0K89l89n3K56J37j56j4l22m
7703b72L0J84p1J05k2N7R6k89J6r4J62l0J03K83k72J00k64L14l14J61J84m6j02
7726A9j21K34j69K03j84j94K92N1q0j93J81j20j73L71j1k6k7o5J69k6j85J8J36
7749A00r4K03m60L15Km1r5J11j90K48J00k97K69k75J56qj1k16K17P9N9j76k25
7772b29J99o1Q5K1j4P3m7k42L07O4k69k8J46J91k64J41j36r0K73n2k10J58K04
7795B20k27K97l26J79j15j85J88q7J45lk46J69N2J2R3k06K77k45K42j63M9j08
$$ y = [51, 5, -146, -86, 89, 139, -163, -63, 27, -20, -277, 38, 132, 23, 115, 149, 122, 350, 86, -76, -100, 238, -26, 245, -133, 11, 7, -232, -38, -55, -172, -98, 132, -39, -102, -141, -37, -158, -116, -186, -240, -20, -49, 1, -82, 1, -107, 32, -182, 281, -208, -8, -147, -48, -102, 30, 123, 119, -1, 50, -75, -55, -76, -16, 273, -116, -169, 87, 224, 68, 54, -268, -272, -242, -58, -129, -24, -46, 11, 107, -182, -166, -260, -98, -128, -25, 258, -14, 86, -178, 136, -178, -17, 167, 121, 19, -102, 132, -37, 166, -18, -212, 80, 131, 51, -142, 39, -81, -254, 117, 106, 80, 53, -12, 157, 131, -54, -36, 100, 6, 209, -251, 64, 66, 25, -70, 41, -149, 99, 199, -98, 171, -104, 52, 44, 33, -183, 34, 113, 172, -4, -229, -30, -91, -6, 15, 1, 74, 27, -215, 92, 156, -113, -141, 5, 196, -68, 73, -63, -153, 120, 68, -142, 16, 220, -7, 290, -36, 143, 28, -157, 31, -56, 89, 86, -160, 9, 61, 73, 166, -40, 237, -8, 234, 71, 120, 12]
7817A2k31L54j15n9k8J5J15r5K8K45m04J53m7j7J33l23J86J32K21l35K23l7j81
7840e5k34J47k9L24k62N3J55j54j09M1K12k5J42k36j65K45O0J4N7k77J2J59K8
7863A03j48J26j60O5N5N1k27J64k52o3J77L82m22N9L19l91J38p0k4J92qk23J90
7886C3J98m03l0K09K21n90N47k26J05j52qK8J04L2J08r7J73k35o9j06M08k20k82
7909b52L63k65R0L02j73l88L81j07J36J30j23P1P9m53K02o4j17J48mK12k52k5
7931a09J23l34L09j52L21j81o6K51m23K72J06q4j47K09m4k25L91m2o4n5jO9j12
7954A2j40j08L03k44L07O0nj88J4j81J65J33q5j27LK8j97N90k52p7n9j3L9K6L09
7979C13k60m15J97K04K5j68r8K12R6k20J46j28M0J92k92J8J13J11l25L8J94J91
$$ y = [12, -219, 135, 20, -39, -67, -52, 63, -32, -4, 241, -163, -10, -57, -74, 59, -264, -78, 54, 275, -60, 163, 126, -55, -289, -142, -171, 153, -109, -56, 99, -55, -164, -123, 89, 64, 206, -30, -195, 50, 110, 124, 181, -96, -84, 75, 103, -45, 81, -79, -14, 41, 92, -135, 29, -223, -286, -109, 273, -149, -90, 229, -162, -24, -94, -118, 74, 66, -157, 33, 231, -172, -202, 7, 228, -362, 185, -41, 64, -88, -96, -68, 36, 68, 176, 79, 252, 17, -52, -158, 250, 30, -252, 111, -154, -64, 238, 65, -323, 58, -49, 87, 217, 94, 165, 244, -209, -7, -71, -188, -40, -44, 168, -84, -109, 14, -320, -11, -163, 158, -23, -89, 162, -261, 11, 117, 33, -114, 95, 51, -174, 217, 175, 111, 56, 55, 124, 12, -128, -236, 67, -177, 130, 190, 185, -3, 11, -170, -5, 128, 43, -84, -81, -53, -250, 340, 88, 11, -48, -61, -22, 4, 313, 53, -362, -165, 39, 64, -104, -202, 10, 106, -114, 32, -96, -56, 136, -156, -138, -25, 86, -239, -201, -7, 184]
8001A84l96L52n2K43j58n1j46p2P2OK71l71K58Qk15K0j06L33j15k5J66k95M07
8024C18M0n42Q6M1l4L3l5K05l29J58L75k91oJ17k05L4j9J94j86j9k2%j11J53M
8049d1K20p7j27K62j60n6J70K39l81p2J50j40P2K00n88J43L82j41J24j51m7J19
8071A00J52l97J72L7k73J13j00K21J26p3j07Jm2Mk0J02m65L73J08l3O6j2R2k70
8095a25R0N1j46j29M38m5j22J21l42K61n7NJ09p8J0j19K44k19N7m1j09N8m7J72
8119C7j87L9K17%o0J10l20O8L06k15p6J67kl79M1K26J9k30M9L15l97J81Q9m5K20
8144A73nj95K2P5j13K64l18P0j26J06K74j24P5j38J7j13K5K0j61K62j07k2l6K00
8168A25p6Q3j75J15Kn3J73j07j79J61j30k8J4m1n4J24m9p5J5J24J35r5n1
$$ y = [184, -212, 140, 88, 331, 173, 122, -24, -96, -24, -18, 253, -118, 140, 148, -67, -47, -153, 180, 65, 40, 206, -89, 318, 358, -184, -98, -57, -91, -58, -93, 112, -217, -59, 316, 25, 19, 136, -69, -35, -54, 140, -46, -65, -87, -87, -198, -45, -41, 179, 102, -25, 237, 77, 21, 191, 430, 49, -23, 127, -13, 59, 259, -329, -186, 196, 55, 179, 28, -19, 100, 252, -145, 27, 64, -209, -96, -196, 25, 151, 78, -29, -28, -70, -66, -86, 16, -449, -76, 32, -1, 65, 53, 145, -125, -35, 16, -130, -259, 179, 134, 12, 133, -209, 52, -5, 0, 109, 31, 41, -78, 166, -53, 4, -37, -146, -88, -135, 37, -150, -111, 106, 106, 46, 156, -164, -96, 210, -5, -81, 86, 84, -295, -254, -28, -9, -239, -190, 125, -272, -91, -2, -47, 173, 168, -27, -5, 70, -43, 221, -97, -27, -153, -47, 227, 103, 178, 40, 57, -56, -31, -11, -172, 90, -17, -39, -75, 125, 49, 132, -43, 72, 74, 21, 194, 87, -92, 69, -61, -89, -75, -116, -170, -46, -95, -170, -155, -31, 104, 9, -42]
8191d2
$$ Imaginary data points
##PAGE= N=2
##DATA TABLE= (X++(I..I)), XYDATA
0@%%%%%%%%%%%%%%%%%pJ5j6J6j6J6k4L2l2L8m6N0n8O8p7Q7j00J15j29J45j62J81
39I6k02K26k52K79l10L44l79M17m60N07n59O14o77P47q23R09j004J114j240J382
59G29j549J746j984K279k655L155l854M913o739J0804l8839n840k1561m8587K4999
74h2983q626j4419j0255j5519K8906P0541P233R433O5314L1305j8682k255q790
87E1203p08J8353j7089j8561M3410J4781m4985j9992m25k6426k6801k6769j1937
100f5946K9313J0331k6489J3913L0456j5544j8928K421L431J8362J4234n163K6336
113A6727M2420p405j8094J0505N78j1234r124j2720J2012K2199j9437k0265J6743
126B2905n673l4311j5181l940j777P439p314k095K9214Q438k1950J847J3779k995
$$ y = [0, 0, 0, 0, 0, 0, 0, 0, 0, 0, 0, 0, 0, 0, 0, 0, 0, 0, -7, 8, -8, 8, -8, 8, -16, 16, -16, 22, -24, 26, -32, 36, -41, 46, -54, 61, -68, 77, -85, 96, -106, 120, -132, 147, -163, 181, -198, 219, -241, 266, -293, 321, -356, 391, -432, 477, -527, 587, -653, 729, -820, 926, -1058, 1221, -1434, 1721, -2133, 2780, -3959, 6845, -31994, -37834, -59395, -107982, -82983, -91609, -106028, -116283, -131802, -102896, -32355, -25122, -15689, 49625, 80930, 62248, 59993, 51203, 50495, 68848, 51759, 33198, 76608, 91389, 46404, 26412, 25987, -439, -27240, -54009, -65946, -36633, -26302, -52791, -38878, -8422, -23966, -42894, -40473, -37042, -18680, -4446, -9609, 16727, 59147, 51742, 33648, 44153, 44731, 33497, 24373, 11653, 23665, 45864, 26427, 6162, 22905, 17232, -17079, -32260, -36200, -37977, -30538, -37852, -39947, -10733, -2295, -24245, -22398, -8619, -11614]
140a1614J667M565P496K7213J2021j5871O042J6455j6492j9536K49m59J098j858
154A0976j2426L520J0861k0115k2175M631q80r779Q36M252J1545J6131m061o675
168a3359J5912O196j2940J435J2844P855O527o24j675J0257k149k1192o399O176
182H864p217p916p31N85M646l581j4456j045P615q013o971Q488R495N782L446
197a009m81P101Q900p242o625R844O231l635R45K429J970P42j0895r284L704j743
213I52j2061j268N833R6k056l527k206M917k86q675L783J1671J308j80N375M261
229G937L407j012n819K182P247m046m865N488K900m013m890m684j161m6p025m920
245a3320N274L534m620j114L030P41p28k258J47P121M053k111L207P134R18k968
$$ y = [-11614, -9947, -5382, 2114, 29327, 41348, 25477, 31519, 47974, 31482, 11946, 12195, 11736, 12834, 10976, -1450, 2070, 12931, -7184, -29359, -24728, -25608, -35387, -34551, -30299, -18754, -2623, -6684, -13359, 2553, 8749, -4191, -2756, 10088, 17943, 24470, 23846, 22171, 32428, 30279, 9087, 2688, 8864, 1647, -6269, -7000, -6415, -1769, -5350, -19806, -20851, -13236, -21249, -28220, -19732, -10237, -4455, -1009, -1490, 5611, 14511, 7269, 644, 10488, 16719, 13084, 14029, 16458, 18428, 19170, 8275, -1009, 2695, 952, -11109, -12377, -6544, -6448, -8504, -12031, -14237, -9320, -9606, -18281, -14498, -2827, -1519, -1699, 3676, 7937, 11344, 10332, 4513, 6695, 13942, 9896, 5031, 10519, 13419, 9406, 4516, -168, -1329, -1375, -8400, -13320, -8046, -4512, -9132, -10246, -7216, -6475, -7203, -9461, -9314, -2193, 1860, -251, 2956, 10090, 11008, 8040]
261H040j641K26K171j346m233J562M007k660n496j817m94k310m331k724K271L657
277e118j501j736L745K522k186j468J097L836L146n42J531N702J626l238j371
292F045M59n60k023k523J56K739o12m425q94M93k892m044j314J441K165L25l2
309e496K726L368j331k199J425K356M67K11K036L351K135j661j967R0n94l695
325A222k679P28J555m29j660n54O93j479l660j668J360J085n23J297L539L075
341A902m53o97K70J120k27j300J335K986J726q77o50M35j481l141l062o17R32
358a799k80j008J055J657r43k399j565M01J46j50Q82L064L204Q67o78Q39M20j387
376B326j321k80J650J634p14O9J096m21l209k541j151k64p85l63J330K093M00
$$ y = [8040, 6399, 6625, 8796, 7450, 3217, 4779, 8786, 6126, 630, -1187, -1681, -3991, -8322, -11046, -8775, -5118, -6619, -8355, -4610, -2088, -4274, -5742, -4645, -809, 2337, 1795, 3326, 9028, 10654, 7416, 6045, 6504, 5944, 3921, 1398, 1554, 4293, 3681, -744, -1638, -1145, -4037, -8081, -9395, -7954, -5789, -5464, -5496, -2770, 598, -733, -2932, -1507, 849, 1316, 1527, 3563, 6914, 9049, 7388, 5421, 5511, 4917, 1222, -1457, -729, 826, 397, -1263, -1817, -1124, -2603, -6263, -7931, -6571, -5486, -6009, -4712, -1173, 1902, 1449, 752, 1022, 2142, 1915, 615, 1950, 4936, 6662, 5785, 5135, 5570, 4089, 948, -2114, -2731, -1799, -2079, -3087, -2032, -375, -1318, -3717, -5282, -4881, -4735, -4885, -4003, -939, 2265, 3132, 2454, 3293, 3713, 2326, 1005, 725, 2375, 4009, 3295, 3364, 4460, 4039, 830, -1711, -2862, -3126, -3911, -4274, -2944, -851, -451]
393d51j159p06L45p14q83L24J771K891J042L64J251R39j824j863l52k40M61m4
411A152K29Q54J041j979k318l71r97j771j86Q02J332J469J17n94J288m29j720
428b081pJ465M18J157J316R11J232m83j986n19J69j462p45Q13M92M42J20j245
446Gj056Q9j872j531P76P93Q69J272M36O72Q98j383p31N73N52n70J145J554O33
465C126M11p61j090l14p70j924r4J246j59J82j48l73M76j325j731J55O87J39N81
484a686J579Q46M73J12o14m35M00n80n9J444M65K59L08n76r30L3j751j128O31
503a209L38l81P89K31k52j76p62p20L86J41n6J029J530R4K88J48l69k68Q9j020
523a50M90R73j91j10N83k79p39n88j061m75M83n66M33Q30O5j86n0m15j64K4R1
$$ y = [-451, -1610, -2316, -1971, -2685, -3568, -3244, -1473, 1418, 2460, 2824, 4075, 5014, 3190, 1327, 975, 735, 1196, 1152, 1381, 2235, 3276, 1297, -1021, -1392, -2389, -4160, -4346, -3544, -2212, -743, -626, -1220, 68, -361, -2081, -2088, -623, -205, 952, 2268, 3179, 4411, 3928, 1942, 1423, 1592, 130, -615, 198, 690, 1132, 1252, 7, -1049, -960, -2832, -4363, -3587, -2794, -1925, -653, -217, 455, 1353, -30, -761, -188, 364, -206, 939, 2493, 3126, 3537, 2776, 1686, 1372, 602, -1322, -1416, -170, -329, -147, -295, -668, -192, -1517, -3248, -3093, -2406, -2267, -1686, -107, 739, 1212, 1324, 710, 275, 675, 95, 36, 1480, 1945, 2204, 2512, 1936, 1006, 1039, -712, -1840, -1209, -871, -1252, -463, -232, -484, -660, -1422, -2142, -1756, -1615, -1671, -642, 888, 982, 1270, 1418, 1049, 781, 870, -150, 340, 1313, 1122, 1012, 1595, 1316, 577, -11, -1072, -1547, -1064, -1630, -1197, -367, -302, -488, -538, -953, -1117, -1093, -1002]
544a002p6J297P17n5M93R2m84r2j41n18K49L53m34K73P13q07n24l19j110J69l9
565a245k29M93P38J0m20O75m94l35M05j78J67J069J61L1P13j83o87L1k72m88K97
586B59O6k22P21l41r28n7k1q21R5L14k45O47J84j36L90K07k29K1J66j3K97M04
608G58r5M09P7j32m66q5m29l66L31o9jJ69j25k85k27m1m08q9K99j16M79K40k3
631a95L04K17k24K1N4M9O5M79q4R8L3k13l09K2k74o86M43oj95N41n11l32L25m17
655g95q1K01L98l34O67L56o7Q7ml98K03J1n7M08K16k03Q0j24n51J40l00j93K3
678c17k7k51K84K04l05l2Q4k17O4M59k91L87J06J45J49O8J88m70J21j95j66K56
700B44L04m07L40j81k95J73q47jJ3J55K02L1J67j80J32r0k34K83j25K95J6N11
$$ y = [-1002, -1078, 219, 936, 881, 1374, 1466, 982, 890, 749, 231, 480, 833, 399, 672, 1385, 578, 54, -265, -1375, -1206, -1245, -1474, -981, -243, -233, -653, 22, -472, -807, -402, -580, -413, 656, 817, 848, 1561, 1378, 691, 722, 450, -38, 259, 325, 103, 824, 483, -445, -502, -523, -1344, -1249, -935, -1180, -533, -349, -485, -95, 112, -117, -96, 70, 57, 354, 758, 663, 1072, 1149, 1017, 551, 466, 37, -329, 2, -67, -68, 101, -24, -309, -536, -577, -985, -1074, -775, -891, -412, -172, -195, 109, 326, 102, 123, 177, 226, 291, 770, 686, 784, 817, 604, 295, 317, 43, -643, -200, -206, -401, 140, -371, -703, -378, -795, -876, -675, -277, -611, 56, 412, 345, 432, 428, 30, 233, 244, 187, 595, 811, 608, 688, 564, 13, 153, -147, -340, -317, -344, -595, -311, -107, -412, -444, -360, -577, -513, -54, -345, 42, 148, 293, 442, 510, 698, 228, 349, 154, -12, 244, 548, 141, 481, 300, 5, 178, -669, -670, -657, -502, -300, -269, -102, -282, -150, -240, -474, -191, -316, -21, -5, 506]
722E06j23j41J17j54J74k64K96n38L68RO5j54k57k79M2j45o3J82K1j8j14K56K72
745E8j36j47l1J39QK7J04K99L44j5n9k32k23L07o93J73Q9J11J47n11R4N5j70l78
769f40K54p3M5P5K58j14K52j60K18m47L21P7R7R5K89j05R5n4k37j2l50rp9L74
793A70j38k9Q5j89n6j92l15L23jJ96L28j51N8J96l7m6J62k56k58M81R7k53K48
816D23j18l96nrj3l7M8J88l6q2k38J06Q0k1p6j12J20J43OK10K3N6m2l44Q5L25
842B84p5j7R7P7k53J18k98K04l77n5P2K70j19j80K25q1n3j23J93k35K4m0L35r
866a6J49R4j77K93l01k2j12Q7P0kON5j71J83l30N5k97M02j44J4P8R8k5k32K09
891c6kj18r2L5K77J4J94R5j80L7k8J07l88L7P1n4J61l8r7j14J47k40L9J18r8P5
$$ y = [506, 383, 242, 359, 205, 379, 115, 411, -127, 241, 250, 315, 161, -96, -375, -333, -478, -541, -359, -338, -356, -470, -214, 58, -78, -225, -256, -117, -109, -82, 22, 321, 665, 650, 591, 359, 136, 443, -250, -77, 12, 123, 270, -241, -147, -92, -262, -640, -386, -459, -414, -339, -81, -195, 57, -103, 115, -332, -11, 66, 163, 258, 547, 442, 537, 483, 246, 234, -116, -125, -204, 170, 32, 3, 88, -101, -157, -349, -664, -341, -342, -146, 182, 31, 89, 285, 248, 202, 364, 108, -150, 331, 428, 175, 423, 305, -91, -96, -105, -118, -155, -107, 81, 45, -37, -275, -169, -89, -110, -186, -298, -178, -35, -29, 181, 204, 260, 218, -126, -41, 284, 209, 192, 289, 366, 113, 231, -67, 137, -240, -295, -223, 47, -72, -252, -27, -108, -161, -284, -91, -326, -302, -342, -7, -16, 133, 227, 50, 343, 42, 20, -92, -5, 65, 63, 69, 124, -47, 136, -194, -139, -436, -34, -178, -164, -86, 12, -13, -245, -36, -38, -156, -248, -213, 64, 78, 272, 367, 187, 224, 196, 303, -85, -48, 23, -31, 130, 92, -5, -119, 28, -212, -173, -55, -153, -78]
917g8M4J84p1j69L2N3j67J69J95j04o2K51l45J16K40o1kj83j78K46j59O6l1J62
941A48k09q1M5J3l1j30N47l32K49o4l35K80l1j26Q2lO3J83q7j47K60k03Rm7j68
966a15K24j87K23j10m9rR1J7j85p6jM9J01N0K5p6J96j26P7P9j88J56k09r4M90
991C53l57N5j71L61j78j90K34j64L3r1K86k16k65j47K31J35m7j8K43r8j37L8l6
1014a46K98j34M4m3J01J21m45L43l4nm15J83q3Q7J66j35J38q0j45J76j10r8K74
1037E8j09o9J96o9m0J43p9OJK9k29J99J52J53l9q2l49K92k54j70J66J35l06M5
1061b20J51P1j64o1K06J38k6k97J06J9O9J6Q4j98K79L3r1J90l09k36K60K9j27
1084g8J38l9R5j99j2pj84R1K66j1j14L4k25J15J27N5k62L82j14n0J67J51k88l
$$ y = [-78, -34, 150, 79, -90, -58, -5, -172, -3, 192, 88, 26, 277, -68, 48, 288, 227, 225, 42, -136, 110, -49, 17, -14, 148, -61, -142, -97, -84, -115, -245, 302, -30, 219, 155, -180, 100, 69, -57, 25, 22, 85, 268, 181, 34, 294, 91, 100, 53, -115, 109, -78, 145, 35, -14, -23, 68, 85, -100, -176, -177, -128, -27, 23, 48, -28, 168, 42, 119, 198, 10, 166, -43, -137, 353, -4, 51, -120, 241, 63, -127, 107, -57, -24, -115, 171, -45, -310, -457, -226, -91, -138, -156, 87, -11, -148, -110, -146, 152, 18, 62, 19, 120, 241, -204, 139, 105, 100, -315, -132, -215, -128, 38, -97, 41, -39, -184, -8, -118, -216, 58, -51, -120, 76, 7, -33, 110, 31, 37, 38, 67, -162, 37, 189, 342, 303, 221, -128, 164, -90, -260, -94, 41, -265, -220, -69, 2, -162, -223, -17, 121, 95, -202, -96, -77, -8, 8, 92, -106, 173, 206, 115, 305, -4, -240, 20, 49, -78, 60, 21, 116, -83, -95, -102, -286, -195, 71, 60, -54, -20, -245, -130, -3, 52, -210, 172, 58, 8, 175, 326, 38, 35]
1108C5k54J05L22l13jR3J81k09J24k39l6R2P2j82J35j95K87Q5j0l7J8k41L8J96
1132F6j65R2j71K05p3J54j54N3J56l43L49n8k6o2L2j69n3j71K58k1p3k4Q3m3J55
1157cP4mq3J28j44K04k17j5QJ00O1nJ0n6p7J71m36K91N7n3k53O4P5j98J78P0L5
1184a8K4qj77K11L87k36l43R1n2PL5K19Lr5O7L4j1j38J22R6j73j74m7K11o2J32
1210A05m49L49P4j49PJ69j29p4J90k02J0NP7J74j73J21J33l7j64J41l01L1K85
1233A93k33J42O1l34K64J38p08J02K00J30N9J07j80m2L76l90L16m53K95k0J74
1254A97l28L84N4j03k53L21q0j75M8k27P1n4K66j29L9j85p4J27Op7L48j11r7K9
1278cq2N3k49L60k3N4r0J62k77L6K91j71j45j7J69o4k7k19J4J45K01l32K20j41
$$ y = [35, -219, -114, 208, -105, -106, -13, 168, -41, 83, -156, -192, -100, -28, -210, -75, -270, 17, 102, 92, 55, 73, -168, -130, 66, -99, -7, -178, 27, -46, 108, -46, 7, 163, -180, 169, 111, 85, 23, 55, -114, -167, -338, -80, -101, -174, -198, -115, -158, -3, 71, 67, -16, 112, -32, 172, -45, -60, -52, 48, 109, 104, 114, 58, -19, 152, -284, 7, 64, 11, -242, -178, -103, -301, -123, -53, -18, 6, -2, -179, 32, 419, 183, -160, -69, -121, -114, -79, 140, 143, 48, 115, 149, 138, 0, 122, 218, 45, -129, -176, 35, -27, 105, -344, 5, 79, -70, -63, 106, -23, -97, 93, -109, -99, -94, -17, 157, -16, 105, 238, 201, 37, 178, -123, -92, 193, -40, 102, 163, -171, 93, 231, -477, -375, -175, -45, 14, 121, -59, -101, 275, -115, 201, -252, 43, 23, 197, -131, 253, 307, 204, -49, 272, 192, 17, 65, -162, -91, -145, 121, -8, 31, -154, -228, -101, -95, -172, 176, 65, -32, -3, -85, -32, -281, 79, 56, 110, 20, 182, -95, -59, 232, 61, -84, -101, 68, 4, -23, -242, -228, -83, 118, -214, 6, -135]
1302a35J26R2K3j53n4%K81m3j69K21k65L7L00k08m3J04K04j25k04n2K08k51k00
1325c06K28k7K79m6j12k2j55J10k88M50j35L20l0l39J0K23j5k70K54k11o6J17
1347c1K42l28K08k11n4M6pN8J37r3J17j15K61l50L37m0k51J00p4M0J7N1RK69k03
1372A35k15L11k35k51O1m7L13j00o1p1j5J30M0k49K52j00J4j78K10J1K69j71J77
1395B30k92K86l06R4l8J75j91pK07k54P5L2J47l45K24m0j65J08N4k0j42J60k84
1418b92L67j4J1r0m4M9L0J20r4j40J24K7J3j95J79k19J86L6m9K2l9k35Q3J67j58
1443a55J27J19j85R6m0j32J91q8J30k21K62j04K8j56J28N6j51r8M2J96N3n5k5
1466A8o5j74J76P8j59J66j34j29J32J54K2j12J92k90o5K85j3J26L60o83K38P7
$$ y = [-135, -9, 83, 106, -47, -101, -101, 180, 137, -32, 189, -76, -39, 261, 53, 10, 114, 318, 193, -11, -63, 145, -106, -306, -78, -105, 174, 128, 16, -6, -161, -51, -339, 111, -24, 296, 266, -73, -63, 160, 145, -125, 129, -82, -148, -31, 211, -117, 91, -120, -174, -128, -135, -77, 60, -33, 84, -31, 230, -120, 217, 177, -74, 26, -48, -8, 9, 60, 69, 338, 135, -80, 231, -4, -255, -194, -241, 72, -28, -89, -160, -175, -45, -5, -254, -2, -102, -88, -266, -56, -45, 224, 53, 230, -62, 224, -82, 12, -26, 149, -42, -49, 158, -96, -21, 11, 158, -187, 37, -3, -168, -60, -6, -26, -168, -8, -292, 75, 61, 72, -18, -62, -13, 17, 137, 43, -97, 27, 54, 67, -128, 51, -168, 18, 54, 5, 27, -12, -247, -164, 3, -155, -28, 91, -94, 2, -38, -170, 21, -67, 63, -158, 104, 0, 28, -128, 0, 56, -95, -193, -151, 45, 98, 43, 18, -47, -221, -45, 33, -126, 40, -94, -223, -91, 63, 85, -27, 165, -125, -190, 95, 82, 208, 568, -115, 123, 200]
1488B00k25j11Q0J76k11j6qJ23q0K22q8m0K03k95J8J97j25O8M8l56M9Q7j04K20
1512C2J13l35L91k32J33J39k78m6l1J54r7J22j39j17O6r4J82O0j2p9k8K19p2P2
1536A23j77r9J47rj92J42K3J53nq4n2n5o0J94n9L7n4k9o0N9J60r8K63j58m8L5
1562I7j72j93J26M79l74J13N8k7j37L7K0j26J1J55n9j69L13k95L59n5m55J97J29
1585C2j87j15O36k19k39J69j30J20l99L99R7l75K10K02l17L35j90L0R0r2O0K2
1607A39N2k71K14k20O4L20k70k50L07l9r5J65k3j90R0j16M36l74P9KJ6L1o2k27
1631b22K23P5o1N5j48J26o3N7j14R8J56j09j27K69l64J76j46K56j87O2l10J88
1653a10P5j12J10N5l45M48k50J71j05O5k7n5M5j05L10j66pK17j94j78K4j1K45
$$ y = [200, -25, -136, -56, 120, -91, -107, -115, 8, -72, 150, 62, 22, 225, -70, -52, 145, 20, 88, 136, -220, -171, -84, -188, 32, 145, -190, 201, -31, 102, 241, -37, -83, -114, 40, -57, 65, -74, -191, -125, -219, -37, 23, 11, -68, -96, 123, 51, 123, -54, -153, -6, -15, -207, -65, -42, 111, 106, 22, -30, -85, -145, 49, -10, 27, -27, -56, -116, -57, 103, 5, 268, 110, 62, 97, -75, -268, -142, 337, -37, 76, 134, 107, -30, 7, 27, -99, -88, 67, 8, -161, 152, -143, 216, 161, -294, -97, 32, -155, -270, 366, 147, -92, 77, -53, 67, -332, 67, 164, -211, -1, 201, -116, 219, 29, 59, 149, 57, 117, 139, 191, -80, 134, -86, -22, 298, 28, -222, 85, 46, -49, 116, 93, -97, -7, -123, 313, -61, 18, 20, 36, 67, 5, -222, 1, 76, 15, 70, -78, 48, -15, 42, -72, 26, 182, 73, -54, 215, -149, 27, -119, 137, -50, 12, -298, -110, -35, -147, -37, 18, -327, 121, -129, 42, -63, 2, -25, -80, -35, -140, 170, 4, -3, 214, 20, -158, -134, -145, 100]
1676A00Ok75J19K50l01J42J5l9j1o7j7K27j05j1K3k7j3k54J00J97j61j9J96Kj8
1701E9J41l6l04L26m51L63R9O1J2k37k07J38N5R8O2rl58o4M81l96J63o7K9r8J69
1726B9k98M12o7qk8k8l6o0J9M2j00P8p7k4L45k39K75k76M5n6m1J31K14k95K15
1751A72l7J00j61J7j02k39K26n5q0L19l43P2k18J12K4M98k31K1Pj23K07k47J56
1774I5k5J48k75r9n1N35l46J02k76J78K47j04k4j43J34p0k5q6K98k72j86m1J90
1797i6K00J24o5k99L84m15K57R8m0j07N9k18K46p3n1k67K55L02l64M9j12K35j64
1820f2K8j27K91M3m76L78j26Q6l83L78m5O3j58LK32r7L60m10lO9J17q9p0J69k45
1845g4L17k39O1j22m1K08j91o9J50L8k88L90j08m1K9J12o9K35l02j04L92j99J82
$$ y = [100, 106, -169, -50, 200, -101, 41, 56, 17, 6, -61, -78, 149, 44, 33, 56, 29, 16, -238, -138, 59, -102, -121, 75, 77, 59, 200, 164, -140, 186, -265, 98, 197, 258, 270, 33, -174, -36, 19, 117, 179, 170, -188, -252, 229, -167, -4, -71, -42, -140, 29, -269, 143, 76, 68, 40, 12, -24, -84, -65, -23, -123, -45, -122, -146, 199, -40, 235, -41, 4, -52, -93, 38, 252, -43, 172, 135, 235, 74, 91, -11, -250, -24, -79, -159, 160, -183, -111, -329, -217, -193, 305, 74, 95, 102, -21, 186, -61, 95, 70, 218, -57, -156, -207, 328, -18, 84, -192, -14, 233, 129, 105, -38, 96, 26, 1, -85, 213, -59, -245, -286, -96, 104, 228, 163, -136, 248, -167, 90, 188, 148, 41, 100, -118, 128, 55, 4, -263, -8, 294, -70, -21, -133, 102, -62, -34, -161, 130, 173, -303, 75, -51, 35, -348, 30, -15, 48, -110, -107, 125, 28, 388, -22, -25, 44, 161, 72, 2, 171, -74, 243, 4, 65, -57, -98, 110, -81, -150, 0, 38, -250, 140, 32, -9, 20, 132, 63, 298, -4, -108, 284, 85, 267]
1868B67k31k57L39J51k61j70J28j8nl6jj0L22R2n74J11J42LK15j82l7M4J2j35
1892i1J34ok64K45j05p2K00l17K01m5K1O0j14K69j39L0R1L4n4j83M26k06L7k30
1916g8J07L4J1L4k56L52k44J51L6O4k92J37j26Q4n1O6l96K33q3J93N0m4q6o4P1
1941i7J42Q1k45j3K65j71l6O9j20K62Pj36K67n69N29l81J29Q6J32j57k59K77j35
1964g3J05J82j30k15K01j57k3K4p0L03k69J84r8o3K66p4j90K17q7O6j72J92j91
1987g2n9L27l14Jp3J71J52n1j09r4n4K43k76J44J97m3k96K50J77j98m0K87j60
2010A10k34J11j30K68l29L63j88J5J64q5J58m9j38j18J82j87L10l59L20j01o7
2031A6j60K27j40J3j63N3L37l40K18k41L64q2k10L76m14N9J76j0j98O2Q6J62K9
$$ y = [267, 36, -221, 118, 269, 8, -162, -34, -52, -57, -93, -94, -104, 218, 310, -264, -153, -11, -8, 207, 25, -12, 32, 44, -91, 43, 37, -227, 18, -87, -159, 41, -276, -75, -120, -99, -39, -153, 116, -23, 7, 98, 132, 78, -105, 321, 115, 152, -78, 29, 63, 74, 108, -148, 204, -40, 111, 147, 211, -81, 56, -70, 14, -37, 29, -367, -134, -217, -24, 26, -18, -104, -168, -97, 45, 126, -119, -132, 133, -38, -74, -5, -125, 137, 144, 8, 275, -294, 235, -146, -17, 69, 201, 44, -215, 62, -73, 32, 214, 84, -131, 70, -87, -110, -86, -156, 147, -122, 62, -36, -99, 167, 93, -97, 120, 33, 99, -73, 119, -72, -131, 196, -118, -117, -190, -19, 133, 82, -27, -121, -175, 68, -208, -64, 133, 90, -206, 44, 221, 23, -17, 270, 110, -124, -13, -143, 125, -204, 159, -29, -14, 150, 65, 223, 174, 36, -82, 100, -87, 223, -136, 184, 83, 16, -144, 83, -57, -44, -207, -154, 183, -157, 61, -180, 184, 102, -108, 268, -146, -87, 89, 79, -119, -57, 29, 191, 220]
2054B20l38J28m0j8p1J30r0j1l6J76j21P1j11J87l6oK2r0K0J42j69K19j97j59
2078a78K59n5j81K27MM9O5k28Lk11L19j1n4lm2O7j90O1j68L82o4j06J3j18j51
2103c11M18k9l4K0K3j60j06L22l02J61k49P0k0J72J88j56j17P1M2o5Q1p6K47n6
2127A34Nl6j58n3J56j07K24l0k8j88R5J20l52K08J10O9k40K73k86QN3j84J8K46
2151E7k93J04l4m4J85J9J60r8o1O9j68MK57J05j83r9J23J40m5j7k38r1K34j46
2175f0J63l05K24Po6J91j69j23J36k5L3K18k48O7k45K44M3l20K57p3j46L02o4
2198D1n6p9K47r1j04J68l5j66P8j5j01M00m83J43K6j4l6k6J83k33J58M9j30qn9
2223a43L91k67j87Q7J79n1o4K10m1QJ43k84j1P9L7J8k6J09l11j25L36K5J30k62
$$ y = [220, -118, 10, -30, -48, -119, 11, -79, -90, -126, 50, -71, 0, -111, 76, 40, 34, 56, -34, -14, 128, -41, 178, -19, -178, 81, 26, -155, 72, 76, 125, 190, -38, -35, -246, 73, 62, 8, 5, -37, 30, -160, -99, -267, 115, 51, -55, -42, -160, -311, 107, 78, 44, 64, 87, -73, -179, 143, -159, 2, -247, -177, -197, -25, 163, 7, -110, -39, 3, -62, 19, -57, 190, 134, 139, 103, -55, -108, 48, -59, 165, 135, 107, -81, 14, 134, -218, -10, 100, 169, -71, 202, -84, -76, -23, -207, -189, 57, -236, -132, -166, -210, -25, -6, 154, 56, -5, 64, -104, -100, 157, 262, 79, -20, 103, 243, 198, 181, -57, -148, 86, -60, 103, -202, 22, 29, -37, 154, -15, -138, -2, -27, 6, 224, -24, 43, -202, 42, 85, -235, 22, -51, -197, 105, 41, -15, -94, 153, 62, -42, 126, 91, -75, 3, -12, -113, 287, -196, -53, -27, -41, -77, -103, 80, -153, 5, 54, -76, -84, -143, 248, -19, -206, -119, 60, 9, -55, 155, 114, 122, 265, -19, -30, 49, 86, 104, 78, 187, -124, -249, 87, 112, 242, -20]
2247b0k15K80Q6j94L29m73J88O4j3K30k81J44K54n75J10J11J9l05K57J12J10l07
2269h9o2r4K58J22j72J42jj59n9L40l6r0l05N70m26J49l0KO8k95J74N6Q0k89%
2294a46M20k22l9K23L9j32j86K22K2k84J57j08j18K61p6j26J12R0j27J36j33j30
2316a45R7o7o7K84J89l16kJ90k09K19j72L4J65j71o6k22J05J13J49K6K98k62r3
2339G7j34J67k13K06l40J40j74K91J59k59O7J24J3j11P5k83K73j6r5J04r8j42
2361a69J33M8J02j03j95L26j73n8K42k1k54P8Jq1R3r9j06K72Q4k8o1j0R6k49K0
2386a12J23q6K17j85K71o0k77K0Q7n7K33k88o5J09J06Qk84N45r5m70L39r2r1J06
2410Bj91N3J65O2m8k25K54k88M85k15j29Q6N3j16J53j6l7k44p7J70M2Q5J65R8
$$ y = [-20, -235, 45, 131, -63, 266, -207, -19, 45, 32, 262, -19, 125, 379, -196, -86, 25, 44, -261, -4, 108, 218, -89, -151, -245, 13, 135, -37, 105, 104, -55, -114, 226, 190, 100, -205, 365, -61, 88, 58, 60, 128, -167, 7, 63, 143, -146, -146, 274, 52, 13, 236, 275, 143, -43, 179, 201, -83, 74, -34, -152, 109, 33, -93, 19, 109, -18, 118, -15, -145, -48, -115, -182, 102, 291, -25, -27, 163, -46, 173, 1, 35, 200, 29, -37, -259, -154, -41, 108, 134, 432, 170, 77, -57, 110, -103, 103, -237, -97, -271, 20, 179, -80, -13, 111, 124, 13, 88, -195, 78, 62, -33, 71, -27, -169, -36, 12, 114, 11, -184, 142, -31, -89, 153, 132, -122, -44, -43, -124, -31, -130, -236, 36, 120, 92, 31, 21, 117, -132, -112, 11, -75, 142, -43, 228, 168, -109, -89, -2, -59, 174, -114, -179, -70, 36, 44, -240, 305, 210, -260, 79, -13, -104, 2, -189, -136, 29, 91, 43, -182, 72, -216, 269, 54, -75, 11, 64, -52, 101, 85, 48, -196, -273, -103, -61, 24, 189, 287]
2434B87n42K90P1m61L57J40j05R8k22J96J3k34j14K97K7j33M9L15k39o5k46L91
2456A70m57J94J54k96L94k95j5J94p9L43m7j69K4l33M01k06k11M37k80j59J68
2477f8K75j42L00o13K99K94n04RJ21l25L86r0k24K30l3R5j2n7K88m8o5r8J15k80
2501a47O1J32k0J11%m5o4j46J02J0j2j70L51j51K96j53j25j82K80l21J24m3j5
2524a27J76k6j3j57L8L06m15j8K39k7K30l07Rk90K78M1J59o7j1O1l5J32j75Pn1
2549d3k3J8N0K52j83j25k6j3J80L6k32J21l4N0k75K89n4Q7k12K48qj87k6Q3n9
2574h6Q9r3J45j68K00j98K25M4J02k33RO1k55o8M9K08P0l81K16p8K52k07J23Q0
2598A06k04J80k95K59J45j56O8J2J2l2j19l2j08K18M7O8k59L9k0j9r9p9K94J3
$$ y = [287, -255, 35, 106, -355, 2, 142, 37, 135, -87, 109, 122, -112, -226, 71, 98, -35, 14, 329, 90, 25, -221, 170, -287, -93, 61, -235, 159, -136, -151, 43, -36, 307, 260, 91, 115, -218, 183, -23, -234, 203, -77, -236, -68, 207, 65, 365, -248, 51, 345, -159, -150, -29, -354, 32, -58, -282, -52, -85, 10, -2, -59, 229, 181, 116, 18, 133, -147, -86, 46, 26, 137, 137, 92, 28, -118, -16, -6, -18, -188, 163, 12, 308, 155, 30, -152, 128, -193, -69, -112, -127, 49, 23, 10, -147, -109, 197, -218, -236, 3, -24, 206, -101, -92, -382, -104, -63, 96, 29, 18, 79, 44, 176, 1, 8, -43, -66, -48, 2, 254, 71, -54, -80, -93, 87, 123, -109, 12, -22, 28, -247, 42, -12, 75, -137, 111, 103, -84, -110, -27, -86, 3, -90, 55, -113, 87, -111, 114, 158, 260, 27, 36, 97, -158, -226, -177, 31, 101, -280, -64, -142, 110, -97, 26, 106, -98, 82, -213, 46, 191, 35, 103, 115, 127, 95, -24, -56, -164, 54, 101, 169, -90, -51, -71, -90, -189, -268, 26, 39]
2622C9L7k70R6j13L49j17K82r9j09N9j97J02K66k22j90l8m9J71K00r8J7k28K5
2645h7K62j87j53K29j35j73J73J14k29K68M0j40n2j96K55j25K6R8J58l34j08K72
2667b4QJ65j4j44K5j35L73m28J81J88j94j14J66j38L2n2Jq8L04j97K25p8p0K94
2691B86n85M96j89j37l2J73R7k53K59P1m46K35j04J33J49l19J29J55j13K5p5M0
2713eK07L4k91N6q0J81k22K40m7L0k06K0q3K32k5q4LJ79j44Qj04J35O8j53N3o5
2739f3j6o3K26j06k24J92K26J25l90J31j85L19r2k1k33J8J19N7K10k29J43lM2
2762A83j40K1p5P2m3j77J32j5K5P3l65L57j92J88k13L1J57p2n7j11K26K2j17J27
2786C7m8J87P1m34J62J84j51l07K09J22j75nO4K54k4m9j97k5j20K65n8oP2n8k3
$$ y = [39, 76, -194, -98, -211, 138, 21, 303, 204, 95, 154, -43, 59, 325, 103, -87, -125, -174, -3, 197, 99, 116, -112, -87, 175, -12, -165, 64, -71, -244, -71, 43, -186, 82, 122, -18, -70, -266, -11, -136, -110, -12, 146, -188, -296, -24, -16, 149, 135, -9, 16, -119, 254, -174, 7, 195, 1, -113, 53, -85, -53, -105, -104, -192, 112, -85, 140, 62, -8, 286, -299, 197, 8, -129, -161, 12, 109, -144, 115, 186, -260, -25, -129, 4, 153, -166, -37, 118, 5, 30, -45, -5, 202, 236, -55, 1, -79, 102, -120, 120, 73, 103, -103, -83, -166, 66, 41, -43, -40, 139, -5, 3, -101, 34, 102, -51, 2, -63, -79, -142, 84, -22, -246, -54, 172, 297, -93, 38, -147, 172, 80, 59, -174, -156, -37, 20, 230, 1, 144, 141, 183, 43, 64, -11, 61, 18, -159, -27, -42, -17, 56, -309, 48, -144, 44, -169, -138, 19, -53, -110, -221, 5, 27, -90, 37, -11, 176, 247, -187, -25, 159, 8, -299, -90, 32, -143, -148, -84, 170, 146, 97, -100, -125, -245, 20, -38, -44, 28, -30, -53]
2811e3r5O6K00o6R7j51l1Nj20N0J51pj51K42J6m11m2L00n1q0r5J46k61K89qQ8
2837B8M7j55r0k7J09N2R2K05k14l7k19J10J68j03K97n1l13M4J27J88k65p6K4J34
2861G5P4j89j06J19Q1j35K0J78o5K81o44K99J57m61L08n5J42j11l71M83R4k40
2883f6O4rJ84j65j36K43k22r9K56N2j25J67m8o7j0j60M33o6j88j05K06J16j95
2906F0j22J71l01jJ90Q4j15j41K78l48J37N5MN2L3J86j46j35J57k7r8K03k3r9
2930E4Q3j64P8j31o5K85P8j89j6J43l9j5k23K82k86M5j49L17k6J70l34K11o0j25
2954g6O5L51l10j65J09J70l7k63OL12m8j98j05J99J7j82J02N9J8p1K11j88M7j60
2978a37R3O6n9J34K17m20K61j93q0K66k29n2N4J82j1k21K87r3j35q9O2J03P3j31
$$ y = [-53, -148, -82, 118, 52, 149, -2, -33, -28, -148, -98, 53, 46, -105, 137, 153, -258, -300, 0, -51, -131, -226, -80, -341, -52, -60, 28, 75, -80, -170, -197, -88, -36, 56, 261, 47, 10, -209, -99, 69, -34, 263, 212, -101, -57, 70, 258, -7, -83, -59, 75, 149, -40, -146, -27, 54, -81, -61, 117, 52, 333, -311, -12, 145, -316, -8, -63, 79, -32, -403, 80, 174, -66, -2, -11, 173, 8, -128, 115, -107, -206, 50, 102, -23, 144, 96, 29, 19, -141, 292, 226, 38, -67, 139, 255, 60, -62, 109, -192, -193, -3, 81, -34, -175, 103, -245, -108, -53, -49, 3, 36, 222, 76, -59, 98, 71, -27, 176, 153, 54, 137, -27, 51, -80, -145, 140, 218, 29, 13, 156, 117, 102, -121, 161, -125, -80, -229, 88, 62, 232, -102, 109, 49, -76, -11, 340, 30, -135, -26, 144, 107, -156, -150, 162, 114, -84, -189, 10, 27, -155, -53, 6, 24, -47, 164, -24, 23, -137, -44, 22, -37, 97, 314, -106, 155, -38, -118, 148, -81, -133, -79, 103, 92, -129, 158, 65, -70, -159, -97, 6, 79, -52]
3002e2P4j77l2M35l31o7q0K51j0j27l9M9K36L4k05p9J32O8j18JJ79N8p3p4K9j32
3028e0k9L6K04n7q2j34O5O9k55L75j71j01J95j83J78j69k8J57J38l74R2P4K18
3051A68l14J55k96P0J89J91j72J45j78M54k42J40k67J1q8J01L05m28J44j22j49
3072a83J36J00P0k37K9P3j83J80J10Ql63K76R4n2k14K72R4j0j30p5L6M8j52l4
3096a07j2J49j9R4j29J80k28L15j35N1l58K80k1K3Q5j10r9j24l0k1J50j05M05
3119B34r7j34m3K23j58k55K52j2k53R6J47j85M42l97RK38J6j22J90k91K5l9J24
3142A0r6J38j31j6K25r0R5qj6O1k91l6K99k19J74l17K55po2L04k33r5JK3J14r1
3168iP5R4l67N9L2J55l1k52K78k68K43o9%J55j71K01l10J66j20N4Q8j67J20K7
$$ y = [-52, 22, -155, -187, 248, -83, -150, -230, 21, 11, -116, -155, -106, 130, 164, -41, -120, 12, 80, -38, -37, 142, 200, 127, 53, 82, -50, -79, -43, 161, 104, 22, -112, -47, 22, -233, 142, -29, -130, 65, -118, 60, -109, -137, 20, 158, -216, -124, -50, 168, -146, 9, -287, -217, -28, 163, -9, 136, -42, 412, 170, 310, 43, 54, -34, 67, 372, -56, 88, -34, -183, -47, 53, 123, -114, -85, -12, -195, -15, 95, 103, -260, 16, 110, 58, -156, 116, 210, 200, 70, -5, 31, 79, -73, -107, -119, 30, 11, 105, -24, 156, -72, 243, 108, 159, -199, 81, 60, 83, 168, 58, -41, -165, -195, -216, -66, -171, 234, 137, 3, -40, 183, 25, -230, 22, 10, -243, -147, 0, -185, 257, -140, -131, 107, 123, 1, 191, -100, -75, -114, 10, -86, 52, -79, -95, 130, 40, 135, 127, 111, 172, -119, -155, 144, -75, 99, -218, 37, 30, -32, 272, 39, -56, -55, -32, 82, -9, 66, 160, -207, -148, -116, 39, 8, -244, 34, -234, 9, -60, -60, 95, -76, 125, -185, -19, -139, -85, 3, -164, -44, -17]
3192a7j08J21Q6r7r0J52k46J64KJ47qr2m1J34k19o4J02j0R2J15j95R2r6o7Q9l3
3218h7K98j07m3j75L58j63j02j00j3L69k11k6J96m0k17O0j32M1K24K4j52n8k12
3241b68K67l1Mk7j9l7L4K18j53j99R3J74o4J98l59J86J02N1k10J55j82J43K02
3264B78k17J2Q8j47j29rK44j37rpK0Q3q1N1j23nJ06J5l23L00j23j8J58j66P8K18
3290A57j08J1p4j12J31J02k86J58J23R1j73q4K03l03J06m4R8Jk07J96K37k13r1
3313h1j30J08K12J96j66k60J55J45m27L77j33L3k38M83k30n2j41P0K01j46K57
3334B33k60o9K38k54K93n40K78O6l02K53O2Kj68L54l19K20q9jJ18j33l3J25K4
3357I8K1Q1l21N0R8k52L55j16P5k9M4k42Q0j12J57N2J01k17L20l40q4J90j56o
$$ y = [-17, -125, -4, 82, -15, -105, 47, -199, -35, -33, 114, 106, 14, -27, 107, -112, -176, -74, -84, 8, 123, -72, 20, -76, -143, -54, -87, 211, 104, 61, -114, 244, 81, -21, -121, -134, 235, 24, -2, 194, 154, -63, -3, -135, -94, 130, 154, 2, -56, -268, -1, -32, -28, -55, -74, -111, -77, 141, -12, -211, -118, 56, -8, 190, -169, 17, 119, 170, -40, 115, -67, 76, 278, 61, 73, 161, 14, -115, -124, 120, -17, -26, -33, -13, 70, -11, 40, -83, -88, 18, 33, -290, 10, -113, -131, 27, -139, -61, 157, 49, 60, -14, -126, 5, 107, -179, -21, 102, 193, 20, -64, 139, -164, -58, -102, -4, -3, -210, -14, 223, 10, -81, -211, -103, 109, 305, 139, -121, 34, 179, -248, 129, -4, 29, -209, 274, 44, -8, -149, -79, 122, -24, 233, -27, -96, 142, -112, 181, -359, -81, -15, -317, -64, -2, 0, -168, 186, -133, 87, -2, -3, 115, -18, -51, 74, 98, 119, 200, -121, -71, 27, -225, 130, 14, 89, 60, 104, -138, -58, -170, -13, 39, 140, -77, 243, -97, -181, 9, -147, -153]
3381a53K46P6j71L50j76J64l46J65N0j81k82K65J15j70l5J77j59J64M9k68J89
3402F9Jj77k7J37J46l00K0J13n9J97k09K26J5k33P5m2P0j06N6O5J14k32P3l5J00
3427E7Jo6k02K1N15j37j43J5J1l7m1j13L07j07n5N5k56J34J05l15K59n3j6J09
3451D8n2J77k79K20n8J85l05q3L20l19K6K36j41j02J74j80K3j2K09l6o4q8K30
3474A29m04K50J18k50K06J86k61k6Qj0Q4J41%l40K59r0R2m41K61K53l56K64m7
3497B6n6M8r5N9o1Mr0K55J85j92k05M13k09k16K23J4o8lR0qj84K55k25K48l21
3522a13J38p1J52j17K34K3n84L89o7J92l16J66q9o5J96P6k46P9R0K0R3k06J7L13
3546C04k42J91j60j13j26K1L24j39Q3j30r9K03k35K63j98j5K34j62m4L14m06K53
$$ y = [-153, 93, 169, -2, 348, 172, 336, -10, 155, 205, 24, -258, 7, 122, -48, -83, 94, -65, 99, 148, -120, 69, 70, -107, -134, 3, 149, -151, -131, -18, -77, 120, -89, 137, 152, -81, -6, -48, 22, -84, -28, 37, 151, -81, -8, -43, 57, 58, -8, -210, -189, 326, 189, 46, 61, 72, 35, -6, -119, 188, 81, 26, 81, -175, -41, 64, -251, 8, -45, -61, 48, -4, 173, -106, 114, 56, 241, -64, -147, 173, -146, -120, 116, -25, -127, 47, -133, -110, -122, 87, 51, -13, -101, 129, -275, -25, 93, -157, 49, 235, -26, -52, -44, -54, 30, 171, 171, -169, 90, 0, 92, -349, -88, 165, -191, 73, 26, -30, 18, -77, -18, -79, -75, -165, 90, 275, 83, -122, 291, 82, -134, 89, 103, 35, 32, 122, 114, -70, 185, -40, 208, -113, 25, -46, 106, -11, 223, 246, -338, 51, -16, 176, -140, 26, -63, -128, 68, 144, -102, -23, 67, 87, 180, -26, -9, 304, 62, 253, 93, -20, -146, -125, 199, 60, 143, 13, -86, 117, -118, 145, -53, -68, 166, 4, -40, 274, -132, 121]
3568A21k11J12m9j97J70J52j98qJ25J49m6j50j17K25o8j37K98k69K85l22n9J98
3590Dn5j08J44p4j02J56oJ01j78J15N1kj18l0O2pJ73j70Q1n2Q9k19J6J98p7j89
3616a97K84j89J41k10J05Q4J5j11j49L27l3r0K06m2J0j18J14l0N7k86K16O5l48
3639a79L39k70J88j50P7Q4k26j13L2K32J12j64K13o6j31p9K13k18R5oK19k28P1
3662D5P7j36R7R5l30K25l9Nk17K18k71J64J50j01K96m19R1N7j60K58m7r9k0l3
3686i4mJ00p7L95m52J91j0k21J37o6J18j9N8n2N2k79R3Q8J16J05k44o7M6j45J54
3711g7K40L0k52o7P5r1K82k20k21%L54n4m6J64j13k49L84m3Kk97K06p0J4L0n5
3736g4J01j93Q7K3J29L2k5j70j04J70l0j98K69l20L05L5q1PJ04J0k22M08j90k75
$$ y = [121, -90, 22, -27, -224, -54, 98, -100, -108, 17, 166, 120, -30, -147, 78, 10, -127, 171, -98, 187, -135, -194, 4, -51, -159, -15, -89, -191, -35, -41, 60, -118, -3, 48, 46, -72, -102, -40, -47, 126, -44, 37, -15, 74, -145, -129, 69, -8, -197, 87, -102, 39, -171, -66, 18, 33, -78, -227, 100, 67, -23, 183, 141, 151, 33, 147, 117, 174, -112, 104, 169, -179, 160, -110, 78, -72, 5, 89, -137, -250, -218, 14, 126, -38, 175, 109, -22, -101, 112, -106, -11, -17, 202, -26, 45, 122, -14, 83, 178, -152, 73, 34, 39, -178, 40, -231, -67, 83, -18, 278, -141, -50, 7, -153, 105, 58, -41, -61, -94, -98, 2, -75, 320, -132, 59, 49, -172, -35, -101, 17, -2, 56, 4, 56, -223, -130, -42, 74, 179, -65, -132, -86, -231, -77, 163, 193, -59, -126, -51, -142, 140, -80, -301, -301, 53, -1, -47, 117, 4, -245, 139, 96, 98, -199, 7, -63, -49, -19, -74, 27, -166, -79, -56, 73, 105, 80, -90, -194, -24, -54, -252, 17, -303, 2, 37, -44, -37, 67, 77, -145, 263, 73, -202]
3760b02J15Kk4LK42J29j87p8M8k24K11q3J35k58J04J43p6k51K48k14m8L02J19
3783A56j45p1l8KL08j62k6k48K0K32j92P8K24m15J85j98K17K91n8j79L01l18M1
3806Em3p3K22j75K0J1pj4J48n1J21j49J55j17j15K97r5m04K43kl6K69j70j1k2
3831Gk35K54j10R1k00J23J74k61K68k15P7R1k17K91k54J4O6K01k27J0K09k32J42
3854F7o9k5J00N7l88N75l89L41l50R7J8n0K20j92j40m8R0K34l02K57j13M1k61
3877b30K16j16J15q8J45M1p9j12J16J4p8r5K42k84L18Q5m67J03KJ33K1J48j91
3900d1k00L20k6j48M7J68k49J52j78P4J59q7o6l3J55lj76Q4O1j20j0J67k8j46
3924a24L58j79k4j6k36L47j5j54m7j69L28j67L40k95k8O7k2k14L20j35J1M3j33
$$ y = [-202, -87, -85, -109, -106, 136, 265, 78, 0, 48, -176, 35, -48, 87, -171, -67, 76, 0, -251, -3, -217, -265, 37, 156, 11, -60, -98, -96, 212, 50, 24, -224, -204, 28, -164, -86, 138, -277, -92, -290, -73, 218, 160, -19, 282, -36, 5, -38, -111, 111, -64, -44, -33, -40, -54, 94, 43, 164, 15, 170, 53, -62, 235, 140, -264, -21, -23, -59, 210, 40, 29, 7, -228, 26, -84, 7, -193, -70, 104, -157, 111, -104, -27, 64, -153, 138, -116, -102, -36, 165, -62, -52, 157, -75, 67, -2, -27, 73, 130, -258, 317, -72, 269, -81, 16, 34, -16, 204, 12, -128, -176, -86, 148, -154, 103, -10, 31, -230, -14, -130, -15, -103, 42, 83, 4, -108, 8, 22, -56, -151, 91, -193, 125, 210, -257, -154, -152, -19, 2, 150, -41, -241, 79, 53, -95, -48, 120, -129, 23, -155, -81, 78, -9, -75, -108, 47, 44, -132, -48, 13, -107, -117, 50, 22, -124, 234, 55, 31, 15, -221, 126, 111, -43, -90, -259, 69, -98, 242, -53, -81, -14, -36, -250, 70, -65, -54, -11, -144]
3947a44R1P9o3k54L42k13K62N0k02k3j05Q6O0m6J43o7N6k52J21q3K97q4m0J62
3971A73l39K15M7J80k14j91J58m1k18J19J78k62J36r5J77J21m12L17m3J01M7m0
3993A14j04k16L14L7l17K70j40J31k32K0K17n6Nk68L24l77L49j61j02J74K1K7
4015C0j37k29L96k41Q0L22l13K06P8j28k07O9k22J78k12J32J97J07J00j35n3k2
4037dk4J1K75M6l11K33k7N8j27k86J93k30J94n9K23q3j66Qm3M1J58k88R3J33l49
4062c31L31K78j58j18J11J2n2j53N2K95j78j58j7K02r8k37J48N5j36J73J07l24
4084a96J86k8KkJ87l18J25nR3k49J34J58j34J87p4jL87m60n4J77k11J83m2n1J8
4109A2m30M10j17L97m47J9Q5O1k1K45k28j96M2m4K51j46J45j5j38J10m7j08J09
$$ y = [-144, -53, 26, -37, -291, 51, -162, 100, 150, -52, -75, -180, -94, -34, -80, 63, -4, 52, -200, -79, -162, 135, 51, 11, 173, -166, 49, 96, 276, 62, -129, 29, -12, -230, -111, 67, -195, -59, -154, 23, 144, -268, 49, 6, 107, 154, 114, 10, -206, 108, 145, -172, 98, -42, 89, -143, -123, 94, 38, 43, -225, 99, -278, 71, -90, -192, -18, 3, 30, -107, -336, 60, -181, -101, 221, -92, 114, 192, 64, -143, -74, -296, -118, -330, -198, -1, 106, 206, 71, 18, -4, -28, -17, 258, 304, -7, 226, 199, 257, 130, -156, 37, -193, 1, -58, 165, 82, -84, -76, -119, -78, 80, -208, -115, 18, -331, 0, 278, 120, 2, 113, 125, 73, -80, -28, 267, 89, -69, -86, 116, 18, -219, -71, -16, -152, 21, 128, -196, -10, -38, -36, -38, 149, -169, -44, -49, 44, -205, -71, 87, -47, 140, 66, 65, 452, -8, -62, 115, -96, 87, 45, -6, 12, -418, -8, -125, 272, -175, -156, -71, -10, -31, 214, -14, -210, -168, -212, 39, -107, 38, 23, -115, -5, -52, -160, -51]
4132e1Q1j8O5r8O1O1k03kJ87j93K05k03J04k9J79j62R9k3p4r9J42k32K55l5l0
4157a3k91M59k93K11q2K20j27j24j7J06j36J17n4k4J0J27L2k09K78m37L76k31
4179a02j68K06O3J89J14k33r9J82j93K77m7l05K49q5L67l71k99J0R2N76m96l3
4201a06K1R0J33m6k67J17K46k73o9M0K73k34K81k49J38L0m56K76J19k03J42J06
4223A09n6J5o1J33n4j19j01j02J37L91l98L29k22k29K61j95J23P5k06J11K75l07
4245i1J35J6j06j71P2k1L09m12M69m47L38P3n7m2J35k76R1j62J30N7J73j68jj08
4269f4l12Q3K1L51j64J61j83O6j01J46L4J6j68j92J88J26j78L61j94j39J49M3
4291E0P0k71r0K86k32L31J02j57j92J34J14k37Lj61K80j57L14m0Q9l92N38k86
$$ y = [-51, 30, 12, 77, -21, 40, 101, -102, -104, 83, -110, 95, -108, -4, -33, 146, -16, 83, 60, -14, -113, 29, -203, 52, 17, -13, -304, 155, -138, 73, -9, 211, 84, -40, -57, 49, -87, 30, -24, -48, -38, 89, 121, -88, 190, -247, 129, -102, -270, -64, -1, 188, 302, 69, -30, 152, -41, 236, 189, -116, 133, 48, 415, 44, -255, -245, -153, 423, -73, -106, -85, 5, 138, 92, -175, -58, 188, -85, -154, -114, 159, -75, 206, -43, 95, 125, -331, -55, 64, -139, 3, 109, 53, 68, 7, 140, 86, -33, -134, -236, -99, 292, -106, 223, 1, -228, 33, -162, -39, 36, -170, -59, 216, -91, 44, 60, -46, -217, -145, -166, 143, -269, 200, -247, 91, 164, 107, 65, 200, -76, 15, -147, -17, 40, 213, 45, 44, -64, -376, -293, -272, 79, -85, 76, -107, -41, -142, 4, 38, 54, -114, -306, -118, 8, -170, 191, -3, -142, 7, 50, 120, -151, -241, 45, -187, 144, 246, 89, -103, 31, 145, -92, -89, -250, 30, -127, 187, 147, 236, -156, 382, 96]
4313I6J22l34P4J55J32n7o4K7k23j4O6J01Q6K6l97K07K52k79mJ95k50k66K89Q9
4337B9k34J77L4J82Q2l37j5J53j83K21p1j46j14K66M0J6j05M8k1K4L8k10K36j20
4361a0J06r7O9k7j12j43J44p1K08M0l1Q6j33M8j9j39Q3r0K18l11K19j76J21J50
4385A33k6j17K96l84L5M8Rj90K24j15J44l03j89M61Lj77M4j5K50j09j25J63J12
4408A72r6j06j5P3j65L3R2J35J8j22J73j92K2N4j20M0j65O9K6K1J56j69Ko1M0
4433h5J26k22L19J4k45K14j30J50j83K76l55K25k23J01n3R0L0j14J6jj0K51l27
4456a36L01J4j98n2K30o7l0k28RM2J61k27J18j50l3N6P6J08J57k90J48K3J1O4
4480A07k8P2P0j70l10L50j23oM9k58N79m68L22k17P6k23J36p5J72J61q0k64r2
$$ y = [96, 218, -116, -42, 113, 245, 188, 124, 151, -72, -86, -20, 81, 167, 193, -204, 3, 255, -24, -28, 167, -83, -349, -60, 29, -205, -28, 6, 188, 270, -67, -82, 71, -112, 109, 38, -108, -222, 44, 84, 100, -5, 43, 22, 46, 84, -126, 110, -10, 96, -1, 68, 41, -71, -214, -70, -141, 67, 107, 76, 162, 29, 77, 58, -81, 2, -88, 130, -181, 38, -138, -17, 133, 107, -10, 286, -98, -63, -15, -6, -196, 28, -87, 57, -246, -435, 26, 29, -148, -104, -119, 131, 22, -103, 60, 172, 76, -30, -45, 28, -137, -104, -12, 123, 141, 19, 192, 0, 22, 76, -44, -4, -169, -100, -74, -53, 103, -66, -64, -125, -85, 41, -181, 138, 152, -93, 121, -9, 141, -42, 234, -121, 104, -119, -18, -71, 19, 49, -65, -49, -50, -60, 191, -136, 165, 179, -19, -71, 159, 92, 62, -166, -157, -115, 46, -181, -63, -213, -246, -190, -114, -6, 151, -139, 9, 32, 43, 107, 79, 151, 221, 51, -259, 91, -32, -38, 11, -247, 332, -136, 186, -31, 45, -178, -42, -117, 55, 216, 136, -128, -220]
4503b20L90k05j47L83k93J93K1jk54j1K69j36l67N51j04P6L9j93N1J28j23p4L3
4526Fj65K83k73L5P3k01K61O4oj07NoM0j8j37q7J69m3p7K70M7j69j89K21J80j11
4552F5n00P43m71M38k6j48l5l35J09M36k59L5l31J40J71J19j54j12J29jNO8k16
4575a30J75k20K81J06j49kj54j93K01P4l72K60J67J02q0k32o4L29jj09J79j77
4597im7N8l1j70L52j20J36k47j6K6J57N9j93k33L32o4j44K79j15R8j14N5j14k45
4621c10K40J30k32P6J13M3k6k44Q8J33n1L86l57K72l69J90J35j62K47k35j07J86
4643A46j33k8n6Q9l9N4j32K0P7K3o8N5J83k26O1P1l64K90j97Q2R3J23P3l89K52
4668F0Jq3r5J05J11K8j22J04J1j50O7j00J08l46J99M3m1m7K96k50J09j79M61j32
$$ y = [-220, 170, -35, -182, 201, -92, 101, 122, 121, -133, -144, 125, -11, -378, 173, 69, 145, 184, -9, 42, 170, 47, -27, 6, -159, 124, -149, -114, -41, -242, 19, 83, 77, -30, -25, -31, 9, -9, -146, -233, -64, -107, -184, 86, 133, -36, -225, -4, 176, 65, -435, 308, -163, 275, 249, 101, 66, -269, -160, 276, 17, 52, -279, -139, 32, 151, -3, -115, 14, 13, 18, 86, -130, 45, -175, 106, 212, 63, 61, -93, -286, -85, -11, -383, -123, 44, 146, 66, -166, -230, 99, 98, -11, 168, -9, -56, 2, -29, -199, 153, 33, 169, -78, -94, -68, 89, 148, -45, -278, 54, -10, -154, 125, 10, 108, -6, 49, -65, -310, -70, 60, -172, -96, 17, 60, 34, -210, -122, 11, -40, 346, -11, 261, -108, 82, 217, 55, 302, 67, -40, 146, 13, -15, -71, 18, -21, 33, -99, -79, -2, 21, -47, 8, 191, -35, 26, 97, -267, 23, -174, -92, 1, 124, 197, -192, 60, 61, -22, -117, -12, 99, 127, 5, 109, 120, -30, 37, -63, 45, -301, -102, -59, -100, -147, 149, -101, 8, -171, 290, 158]
4692A58k28j44M21m23J74J04j60L3j14M42N2l30K69j73l2K71k39j46J06J00j42
4713an8KJ21k55j4L68l42P4k7L11l55J55n8k8L0K39L2l98J76jJP4n3J66l11L19
4739A67k77R6J08j2k33R7J41k19K03p5k1j73J77J15J03j00j28jK29l22l1K3J66
4762C3o2l2Pk0J26l0r8k6j6J35J54k91l5P0K86l16J79k95L63k51N2K19k20J03
4786C5n1J42j95J84o6O3l28R0K62n2k54J77j1o5M1L10j75j59K0l9K0R3j91N9r6
4811a86J14N6j76L21j58o9J74j58L00j7k66L15l01k14j3J33J85J14k69J23L3J81
4833B22k50lM1J63l43L1j04K70j51Nk10P13k70o8j80K99p8j15j09nK07L21r0k83
4857A3j0j02K50k58L6O6kk25L59l18J89j9L7j28J34L9j73L8L3M7K7m09L25J42
$$ y = [158, -70, -214, 207, -216, -42, 62, -98, -65, -179, 263, 315, -15, 254, 81, 49, 320, 81, -65, 41, 141, -1, -59, -57, 64, -191, -205, 163, -179, -105, -132, 179, -176, -21, -79, -107, -77, 162, 194, -204, -28, -29, -28, 46, -7, 159, -152, 167, -110, -14, 94, 82, -151, -54, 87, -132, 71, -4, -25, -198, -21, 94, 197, 97, -31, -32, 197, -125, -156, -133, 33, -29, -61, -54, -74, 52, 22, -76, -102, -118, 17, 171, -120, -155, -85, 201, -115, 64, -231, 132, -119, -67, 152, -68, 35, -16, 126, -69, 115, 49, 112, -216, -126, 136, 84, -170, 7, -4, -69, -28, 282, 107, -52, -32, -71, -51, 42, -149, -90, -186, -72, -16, -192, 129, -29, -98, 76, -82, 218, 201, -65, 250, -51, -265, -278, -145, 40, 154, -115, 8, 41, 222, -28, -31, 10, 173, -170, -139, -243, 27, -124, -119, -329, 384, 114, 46, -134, 165, 87, -28, -137, -142, 65, 386, 296, 13, 3, -99, 151, -107, -71, -5, -7, -232, 127, -191, -2, -21, 16, -112, 22, 61, -112, -74, -41, 6, 33, -376, -51, 91]
4881I1q0L8P2k05J21o5J02k0r6J43k31J72o7Rj5J38k14Q0K7o4J88m5k59K51k8
4906D3k7J45k7k36j4J10J59k05j0N9l1K4N0p9j10M36l61J01K6k91J2J39M2J04
4930E9j57m8k6K75k22L29k18L21j42j77j14J84M2j03K18j00kk02M3J25k61N3k4
4953a47J37O1j8l3q0N6j53j07K10K78P2j90k57K90j89mM66l83J25k09J03k6n0
4976d8J06j64m0J85N2K5q5q7j81K82l8n1J93j73r7J77OP5O7k62j28J67J92k08
5000c5q2L9r6K36N5J58j74j72Q4N3Kk85L28j41m8O4L60m47J74k29K1J57j68L10
5024A64o6k13J94Oq1m5K22l6j86K70o06K38J67J76l24l1J10J23j7rP8l32O4J14
5048b0k87M68m89K27K1J16q2K87j40j84L06j43O8j3k19j93K69J60Pk54M9K96k20
$$ y = [91, 11, 49, 121, -84, 37, -28, 74, 54, -42, 101, -130, 42, -25, -16, -31, 107, -107, -27, 0, -64, 124, 79, -180, 71, 43, 16, 161, 134, -102, -116, -6, 153, -52, -62, -3, -34, -10, 40, -39, -149, 287, -74, 27, 53, -238, -226, -87, -45, 59, -98, -146, -172, 103, -119, 210, -8, 313, 171, -6, -120, 64, 106, 3, 221, 121, 119, -83, -40, 85, -176, -123, -147, -10, 51, 33, 0, -80, -24, -177, -284, -74, 204, 276, 86, -171, 119, -70, -74, 392, 9, 134, -75, 28, 2, -48, 58, -106, -146, 39, 91, 116, 31, -56, -237, 45, 7, -44, 149, -24, -121, 56, 62, 137, 204, -58, -186, -19, 173, -35, -117, -78, -174, 62, 117, 275, 101, -71, 13, 66, 68, -217, 111, -30, -78, -14, 346, -101, 73, -156, -135, 22, -146, 164, 98, -115, 79, 85, 4, -41, 181, 145, -41, 229, -377, -139, 28, 204, -120, -151, -41, 82, 65, 56, 134, -198, -134, -20, -307, 161, -328, -101, -80, 36, -46, 241, 101, -83, 223, 80, 148, 135, -84, -277, -8, 152, 159, -95, -46, 250, 30]
5071C0O0nj17N5j68oJ5K90J50m64J30j03n4L99k61j09k5Q8J21J24l65Q0P5J11
5095E1N9J03l00N9N5o5M0j1k3J75n2J8j08K8K6r2P0j60K80k79J48P1r0P0o6n9
5121e2J31R5k03P4J45k55R3N6j11O5j68j0J2pL70oj89l20M32k05J23q5k50J94
5145g1L95k13j13Q2j66N4OM08l52j20R8j98M38k63K14k47j00J58J6q3Q3J24k80
5168a30N8RLO2L4k7p2K51k29O5l16K82j37jJ43K65k56j17J23l3o5r6J36J71j37
5193a4k2L36k46O4m7k5j70J96r6K3J01j25j49KM2K52k32Ol6o8n9L24k14L36K9
5218B08j93j46J63m3j33P7L5K21j41k2k2J14J10l8k12J04p9J1j96J30J72k68R2
5241e6J5r6J41J71l06O1J23j49J60j02q0l0J60j6J93j29M9j23K18n9j27q1L04
$$ y = [30, 90, 85, -32, 23, -145, -151, -136, 154, 304, -160, -30, -133, -187, 212, -49, -158, -183, -95, 26, 150, -215, -135, -60, 51, 110, 213, -87, -28, 27, -38, 2, -9, -32, 143, 91, 109, 1, 29, 55, -37, 33, -127, 153, -126, 22, 93, 3, 73, 7, -52, 79, 174, -29, 45, 190, -65, 28, 84, -27, 38, -130, -140, -128, -135, 235, 229, 40, -280, 152, -53, 70, -15, -265, -71, 324, 111, -2, 80, -86, -32, -26, 382, 30, -90, 8, -190, 248, -15, 199, -48, -148, 10, 26, -57, 26, 150, -130, -72, -63, -60, 2, 36, 9, -63, 188, -41, 24, -292, -10, -147, -148, -5, 260, 4, -113, 10, -23, -88, -184, -48, 123, -14, -36, 300, 54, 118, 71, 46, -124, 72, -24, -1, 100, -25, -174, -172, -130, 122, -110, -104, -140, -208, -267, 57, -157, 179, 208, 15, -131, 32, -11, -144, -67, -32, 189, 48, 26, 4, 118, 228, 190, -22, 82, 3, 14, -182, -52, 120, -148, -56, -41, -137, 4, 175, -131, -70, 53, -96, 64, -38, -118, -148, 12, -4, 189, 60, 109, -14, 204, 145, 18, -63, 241]
5264B41k39J75j55j26J11j16P3J28r9R2o3qn7Pk2J44J02j28j36K55k8K6l86M24
5288B15k20k28M67k81K20j77O7O3j30k54L30Ll9o5K1j41L00k26L2P9k66N48l97
5311g9R0j38J12O8j22N5J0M4l19L34j36J42j82J19j07J83jj24j0J73j27K3K52
5334B60j19k29N1Pj06J51j4R5j86Q1k7J31j73K4m0K11j33q7K39j16p7n8L39l75
5358a51J84J3k1P7j51J1J67k17j38K11r7K62j75J57p6np2j20p3J64P8L2l9K0N9
5383A00q6K58j52o9J03l06j06K87J5n5R0J32j71j28j66J79J50J2j66p1kK82M0
5406A70k55R3m5J1j60MN17n17M12n5j28J05K5n1k53J56O8j98J71j46J6j16M6P9
5430e1J34j71K57j87L08l90r4J55J6J0Q3n7j10J48pj22o3L8rM8J33k7L4k9m6J31
$$ y = [241, 2, 177, 22, -104, 7, -109, -36, 92, -7, 85, 22, 14, -43, -36, -58, 86, 188, 60, -76, 179, 151, 177, -209, 215, -5, -233, 234, -47, 173, -4, 63, 126, -4, -258, 72, 75, 36, -29, -8, -149, 151, -75, -43, 36, -230, 318, -79, 11, -127, -15, 53, -69, -14, -4, 40, -279, 55, -81, 61, -121, -2, -109, 74, 73, -51, -61, 112, -15, 8, 260, 141, -88, -37, -30, -136, 15, 1, 96, -90, -9, -36, 95, -78, -54, -94, 117, -16, -103, 136, 20, -57, -115, 224, -151, 33, 46, 25, 102, -49, -38, 129, -88, -226, -15, -112, 150, -25, 132, 56, 51, -21, -141, -214, -50, 28, 60, 21, 41, 100, 14, 272, 120, 51, 154, -152, -258, 29, 44, -11, 79, 211, 40, -88, -254, -75, 75, 87, -79, -150, -152, 130, 170, -85, 8, -37, -26, -186, -182, 335, -182, 230, 175, 47, 152, 177, 126, -127, 29, 97, -101, 70, -76, -60, -176, -130, -51, 83, -88, 169, -18, 290, -100, -194, -39, -23, -13, 70, 13, -97, 51, 44, -78, -141, -103, -112, -64, 69, 42, 76, 47, 1, 132]
5456A32J1pl28P0mQ4N9Q5n7J8k59R7Ll2J28k56K40K01j07m49L60K67j46P9l92
5481b03L62j63J5j57P1K39k96R0m1K55j09k70J97k62J21J63r5M4Q0j11Q9r6m4
5504a21K52j98J1J46k7m8J46q6K9l81K69K11l81K33j71J06P7r1j10K17j96J39
5526B6J84k05O0l6q3n1K40m52J14Q8K36j54J02Pk74L33p2j26j33K79k61k0J14
5549h4K24j55k5J23Ml3K54k71Nq3j73L39k79J82j02M7J84m3k05M79k29k82L17
5572A94k62L2k36M17k75J42O6k37J64O8K7M8Q6l66J4J45j3n2j9J14p9j25L6J22
5596A1K7M7k11K46n11L76MK84n04R0L17k49l6K3K52p2M6o4M2Ko2r7K25l00K65
5621A51k32J51j19k9J58J42k30O8p4p4K72l1m03K49K33m04Q1L39N0j13K6k10k81
$$ y = [132, 143, 136, -192, -122, -126, -42, 17, 102, 45, 63, -196, -99, -96, -128, 0, -256, -16, 185, 78, -371, -11, 256, 110, 189, -203, 159, -4, 11, -146, -75, 164, -132, -42, -83, 172, 63, -207, -10, -272, -151, 12, -83, -39, 41, -70, 19, -77, -121, 131, -67, -56, 90, 63, 15, 161, 75, 104, -277, -8, 203, -178, 55, -116, -10, 67, -24, -134, 83, -113, 26, 210, 5, 65, 29, -54, -105, 135, -317, -203, -115, 121, -33, 69, 76, -198, 135, 63, -63, -196, 83, -178, -198, -84, 140, -15, -40, 83, 87, 54, 308, 37, 42, -41, -214, 125, -154, 28, -74, -27, 157, 114, -91, 388, 159, -123, 194, -68, -36, -272, 145, -130, 12, 78, -159, 5, 73, 100, 148, 234, -132, -118, 27, 14, -38, -57, 57, -22, -147, -111, 11, 38, 85, -126, 120, -391, -15, -11, 273, -231, -141, 176, -73, -109, -86, 166, 94, 140, 76, 118, 120, 58, -39, 186, -114, 151, -81, 70, -49, -78, 80, 222, -8, 60, -14, -88, 184, 153, -250, -1, 232, -172, -91, 248, 298, 185, 211, 1, -280]
5644b80J14K85j25j8K26m74L77j32N1J84k93J27N8K2J94l53J77m05L75j09J09
5665A10l41J95J22j91J67J3r2P1j06J26j55O5P1j08L5j00J41P5J85l68j6L04n1
5688A52l17J94m6k5K34l11J34J84k19Pk34J22J66Q7J0j13j65J69n8K6k47K22L77
5711C49k25j27J8O0j33L0rJ59on3j71Q4L0K77m64R5O4lq8J99j48O0P2Qj29J2P0
5738C1L13l23k74Q2J68O8j41J19j26J16j57K36j63j27K47o8J28K2l2l00J49K14
5760A82k46J39j14j9%K12o7j49J11k60K40J36j67J05n2p0l86M56n6o9M0j29K1
5783a42n4M64l36k8L1j95J65L1N0p7K24j07k3J44j52J13k20K93j48Q5q4k6Pj64
5807a49K97j74J6J67o2j51lm4J18L9J27p2j71P6j58K3M11m8m25O5O9J6J06o4J29
$$ y = [-280, -166, 119, -6, -24, 202, -272, 105, -27, 24, 208, -85, 42, 100, 122, 316, -37, 140, -265, 110, 1, 110, -231, -36, 86, -105, 62, 75, -17, 54, -52, 74, -81, -16, 55, -53, -18, -118, 23, 98, 283, -85, -101, 203, 152, -165, 29, -17, -42, 192, -119, 15, 199, -20, -13, -247, -125, 41, 128, 138, 25, -140, 29, -29, -3, -250, -28, 349, 124, -3, 15, 75, -58, -28, -37, 122, 116, 63, -108, -24, 6, 283, -181, -86, -22, -25, -113, 86, -62, -2, 70, 78, -51, -39, 31, 344, 21, -253, -171, -3, 65, -76, 43, -83, 33, -124, 112, -51, -178, 69, 1, 129, 151, 119, -181, -32, 182, -64, 75, -39, -58, -58, 154, 87, -62, 49, -211, 29, 165, -2, 103, 51, -19, -405, 51, -5, -74, -34, -163, -142, -196, 268, -68, -96, -65, -260, -95, -64, -14, -91, 133, 26, 3, 147, -5, 108, -112, 181, 33, 118, 34, 8, 15, -149, 148, -26, -10, 157, 95, -56, -59, -103, 15, 54, 181, 109, -62, 14, -144, -121, 290, 242, -183, -118, -49, -33, 73, 9, 138]
5832A38j31J3J2K32k69j05K1J10j13K5p6J45k17J54R3K01l04J33J9J22k16j95
5854b08K41J3m5M1K27l38J8q7R9l4r4J64j11L30k47j25J13J79o2P5m0j04J5q2
5878f2jj3j01R6J62k00J43L5q0J47p8l1K30j31k16n3J69J9j05J56M1rm9n1k2j59
5904a63L10q2j8P6L8Q1k92K85M0j33j52J77k52M0j42K19j18K8K40j33o7J47K3
5927A52j94J15l8K97k51M5j93L30j84l4j34L64j58j50J04j58K02j55K50k67J6
5948d1Q3p7P4J2j99L15l14K98j69%L19k93j59K74M2j63J68j15J73j65o1rL26l89
5972g0J99j57q9J86k89M27m64M34m37L5J15J21J15k27OQq7L3J04J09j30J5K11
5995A68k52m8J12K28l12K44j74J03M6k86K89j36n5j79L31j49K35l73J29J67J04
$$ y = [138, 7, 20, 32, 264, -5, -110, -89, 21, -92, -67, -143, 2, -215, -61, 32, 233, -71, 62, 81, 203, -13, -208, 33, 46, 1, 42, 269, -69, -51, -138, -39, -73, -167, -3, -114, 216, -31, -156, -43, 136, 74, 149, 109, 5, 20, -62, -63, -76, -177, -81, 81, -119, 24, 59, -21, 126, 48, 17, 247, 116, -100, -153, 16, 35, -70, 86, 127, 118, 69, 18, -4, -163, 147, 65, 47, 123, 161, 242, -50, 235, 275, 142, -10, 167, -85, -45, -187, 32, -86, -58, 182, 49, -18, 129, 152, -42, 73, 35, 332, 81, 126, -67, 263, 79, 45, -89, 275, 117, -33, 71, -87, 115, -40, 210, -57, -41, 42, -35, 39, 51, -148, 167, -147, 151, -18, -18, 301, 8, -151, 123, 165, 2, 170, 55, 228, 63, 2, -7, 319, -70, 129, -28, -117, 69, -220, 207, -257, 177, -260, -225, -110, 11, 126, -101, -95, -87, -174, -141, -37, 72, -58, -43, 168, -84, -132, -20, 208, -104, 140, -34, 69, 115, -171, 118, -18, -73, -252, 79, -70, 165, -208, -79, 88, 192]
6016A92k55j10J47j0J58j38M8j8N9Q5r6J0j6J58j84O1k10J85m9J1J67o2m9j45
6040f1J47m2K36k90j1Kl8jj18K69j85O1o1K89j75j05k13J59O9q7k2L18j45j00
6064a04r7M98l71J88j86q5N3R3R3L7j90R0l5L5J50J1j90N7J81n6l5j55J2j93L34
6089A35k71J12M2k66J56J34j44J11N3j54K54k78J34k78L79j98j26J92N2o0L5j23
6111a09J43l20M15j98K33J54j56n26N22p1k21L3K80j50O4m1j60K42j57p3J56j32
6133g2j64L10k42L70j20r3j55J47l0K56k45j7K31K3j96JJ43p5Q2P3j72j00k77
6156c22L48n4l4Q6M9k36J41M6N7j81K05j64O8J06n1j54J42p9J93Q7l76K46P6j95
6180DL9q0P5M5l35K00J9r5k6j02M86k78J87o3k77n6K07Np0J17j01J97k89R6l4
$$ y = [192, -63, -173, -26, -36, 122, -16, 32, 14, 73, 158, 62, 72, 56, 214, 30, 91, -119, 66, 17, 28, 195, 133, 84, -61, 86, 44, 280, -10, -21, -19, -57, -58, -176, 93, -92, -31, -92, 197, 22, -83, -296, -137, -68, -155, -177, 141, -4, -104, -201, 297, -74, 114, -72, -157, -104, -11, 82, 119, -71, 19, -16, 19, 169, 180, -10, 47, 228, 172, 137, -18, -6, -199, 135, -136, -24, 18, -248, -92, 42, -102, 9, 62, -92, 162, -116, 18, -260, 119, -79, -205, -13, 39, -21, 14, -109, 34, -286, 129, -69, 164, 318, 162, -364, 158, 87, -134, -101, 179, 29, 93, 52, -108, 134, -23, -96, 60, -72, -236, 74, -168, 202, 82, -11, -166, -19, -49, 207, -38, -55, 176, 199, 3, 4, 147, 72, 154, 227, 55, -45, -322, 26, -28, -62, 24, 73, -163, -22, 24, 81, -100, 105, -59, 9, 115, 64, -90, 52, -27, 166, 253, -123, 123, 199, 4, 43, -37, 38, 83, -252, -52, -33, -128, -154, -256, 230, -48, 139, 76, -201, -257, -50, -45, -115, 2, -99, 98, -191, -95, -129]
6205a29J17Q3J7Q6j25J1n6K17k56j2nm5P2M5L6l0K1K08j36j8J03j23j24J4R8l2
6231C7K0j53K11k61J71j23p0K91n8j49K39j96k6k62N39r2j73l24L34p2m4P4R9
6254A2J62qk60J75p5j90K11k82J87j45K52O9j21j18p7J35O7m7O4n1K8m2Q6k60
6278b28O01l88J6K14j84J67k7j58k97pK63Q2o9K14l52J73l5n1Q2n3rj42J01j23
6302b10L8KR5M0M16n11K9j53K74Q8j66R3J58k42np7k0J47J29k0r9N2j54k5L0q5
6328a76L37k40K05p5J18j94P8Nj09j1K6l4M8J65r4J48k79K45j53R4j3Q3j04k88
6352b18J59J87j2k73K11j73L2Q0m8j43M5L31l40L90l74K36j08K1J32j90J52l05
6374b08K58j99K66o8P4N2j78j31J45J40j09J88j60J28m08M37k53j31K19J57m24
$$ y = [-129, -12, 71, 88, 174, 49, 60, 4, 221, -35, -47, -52, -97, -25, 20, 56, 26, 47, 255, 119, 101, 204, 81, -43, -29, 69, 37, 57, -96, 115, -146, 25, -98, -168, 123, 65, -84, 155, -41, -67, -329, 210, 118, -55, -379, -45, -117, -161, -87, 12, 174, 166, -94, 81, 6, -184, 27, -255, -68, -213, 39, 108, -13, -131, -208, -73, -6, -53, 11, -40, -12, -54, 32, -228, 373, -15, 1, 215, 31, 198, 171, 13, -284, -291, -28, 54, -15, 199, -153, 20, -15, -66, 16, -37, -46, -188, -87, -210, -172, -170, -75, -35, 381, -130, -101, -254, 20, 108, -58, 35, 193, -49, -54, -131, -151, -4, 125, 105, 6, 58, -96, -121, -91, -176, 161, -79, 126, 51, 169, -25, 53, 58, -51, -62, -36, -70, -22, 143, 49, 197, -82, 163, 10, 104, 91, 174, 70, -218, -59, 128, 116, -157, 54, -119, -87, -7, -55, -198, -153, 178, -162, 228, -146, 90, -18, 3, 135, -55, 97, -208, 50, -149, 117, 49, 123, 175, -3, -134, 11, 151, 42, 230, 70, 198, -210, 227, -26, -157, 62, 219, -205]
6395b05K72O4k9n5o5Q0P2r8k9M2j21J29j38K52l45J37R2j41O2p6J31l58L88LM4
6420A08P7j12R4j68k83M17j68J68m6KK2K1m10K04O0J25l7K41r7j40o3n2J33j15
6444a9j58n5J01K90J5m44M16k93J86j91K46j61O0m7M8k41K32j15J62L71n15M03
$$ y = [-205, 67, 131, 102, 47, -18, 62, 134, 36, 7, 49, -72, 57, -81, 171, -174, -37, 55, -86, -24, -100, 31, -327, 61, 64, 108, 185, 73, 167, -1, -284, 133, -35, 133, 87, 89, 111, 132, -278, -74, -14, 111, 74, 315, 218, 78, 15, -37, 96, -19, -177, -232, -131, 159, 174, -270, 146, -147, 39, -152, 94, -67, -7, -54, -6, -247, -15, -130, 32, 403, -112, 291]
$$ [...]
8191H8
##END NTUPLES=NMR FID
##END=
