##TITLE=1H_DE-TEST_isobutal`
 200.13Hz, CCl4.
 8 sc
 18.8.2026
##JCAMPDX= 6.0         $$ Bruker NMR JCAMP-DX V2.0
##DATA TYPE= NMR FID
##DATA CLASS= NTUPLES
##ORIGIN= UXNMR, Bruker Analytische Messtechnik GmbH
##OWNER= pz
$$ XWIN-NMR		Version 3.5
$$ Tue Aug 18 13:03:06 2026 Russian Standard Time (UT+4h)  she@DPX200
##.OBSERVE FREQUENCY= 200.131
##.OBSERVE NUCLEUS= ^1H
##.DELAY= (6, 6)
##.ACQUISITION MODE= SIMULTANEOUS
##.ACQUISITION SCHEME= undefined
##.AVERAGES= 8
##.DIGITISER RES= 18
##SPECTROMETER/DATA SYSTEM= spect
##.PULSE SEQUENCE= zg30
##.SOLVENT NAME= D2O
##.SHIFT REFERENCE= (INTERNAL, D2O, 0, 14.3821)
##AUDIT TRAIL= $$ (NUMBER, WHEN, WHO, WHERE, WHAT)
$$ ##TITLE= Audit trail, XWIN-NMR		Version 3.5
$$ ##JCAMPDX= 5.01
$$ ##ORIGIN= Bruker BioSpin GmbH
$$ ##OWNER= she
$$ F:/spectra/data/she/nmr/H-C/1/audita.txt
$$ ##AUDIT TRAIL=  $$ (NUMBER, WHEN, WHO, WHERE, WHAT)
(   1,<2026-08-18 13:01:27.93 +0400>,<she>,<DPX200>,
      <created by zg, POWCHK disabled, PULCHK disabled
       configuration hash MD5:
       00 E9 B6 7A A2 85 ED C7 34 08 36 98 17 FE 4E 26
       data hash MD5: 16K
       73 BA 1D EE 4E 92 A9 9D 36 B1 C6 7A 04 65 82 50>)
$$ ##END=
$$ 
$$ hash MD5
$$ 6F E6 B6 47 53 7A A6 6F FD 40 6E 5B F2 1B AB E5
##$RELAX= 
##$RELAX= 
##$RELAX= 
##$RELAX= 
##$RELAX= 
##$RELAX= 
$$ Bruker specific parameters
$$ --------------------------
##$DU= <F:/spectra>
##$EXPNO= 1
##$NAME= <H-C>
##$PROCNO= 1
##$TYPE= <nmr>
##$USER= <she>
##$AMP= (0..31)
100 100 100 100 100 100 100 100 100 100 100 100 100 100 100 100 100 100 
100 100 100 100 100 100 100 100 100 100 100 100 100 100 
##$AQSEQ= 0
##$AQ_mod= 1
##$AUNM= <au_zg>
##$AUTOPOS= <>
##$BF1= 200.13
##$BF2= 200.13
##$BF3= 200.13
##$BF4= 200.13
##$BF5= 200.13
##$BF6= 200.13
##$BF7= 200.13
##$BF8= 200.13
##$BYTORDA= 1
##$CFDGTYP= 0
##$CFRGTYP= 5
##$CHEMSTR= <none>
##$CNST= (0..31)
1 1 145 1 1 1 1 1 1 1 1 1 1 1 1 1 1 1 1 1 1 1 1 1 1 1 1 1 1 1 1 1 
##$CPDPRG= <>
##$CPDPRG1= <>
##$CPDPRG2= <>
##$CPDPRG3= <>
##$CPDPRG4= <mlev>
##$CPDPRG5= <mlev>
##$CPDPRG6= <mlev>
##$CPDPRG7= <mlev>
##$CPDPRG8= <mlev>
##$CPDPRGB= <>
##$CPDPRGT= <>
##$D= (0..31)
0 0.7 0 0 0 0 0 0 0 0 0 0.03 0 0 0 0 0 0 0 0 0 0 0 0 0 0 0 0 0 0 0 0 
##$DATE= 1787043687
##$DBL= (0..7)
120 120 120 120 120 120 120 120 
##$DBP= (0..7)
150 150 150 150 150 150 150 150 
##$DBP07= 0
##$DBPNAM0= <>
##$DBPNAM1= <>
##$DBPNAM2= <>
##$DBPNAM3= <>
##$DBPNAM4= <>
##$DBPNAM5= <>
##$DBPNAM6= <>
##$DBPNAM7= <>
##$DBPOAL= (0..7)
0.5 0.5 0.5 0.5 0.5 0.5 0.5 0.5 
##$DBPOFFS= (0..7)
0 0 0 0 0 0 0 0 
##$DE= 6
##$DECBNUC= <off>
##$DECIM= 32
##$DECNUC= <off>
##$DECSTAT= 4
##$DIGMOD= 1
##$DIGTYP= 9
##$DL= (0..7)
0 120 120 120 120 120 120 120 
##$DP= (0..7)
150 150 150 150 150 150 150 150 
##$DP07= 0
##$DPNAME0= <>
##$DPNAME1= <>
##$DPNAME2= <>
##$DPNAME3= <>
##$DPNAME4= <>
##$DPNAME5= <>
##$DPNAME6= <>
##$DPNAME7= <>
##$DPOAL= (0..7)
0.5 0.5 0.5 0.5 0.5 0.5 0.5 0.5 
##$DPOFFS= (0..7)
0 0 0 0 0 0 0 0 
##$DQDMODE= 0
##$DR= 18
##$DS= 0
##$DSLIST= <SSSSSSSSSSSSSSS>
$$ [...]
##$SUBNAM0= <"">
##$SUBNAM1= <"">
##$SUBNAM2= <"">
##$SUBNAM3= <"">
##$SUBNAM4= <"">
##$SUBNAM5= <"">
##$SUBNAM6= <"">
##$SUBNAM7= <"">
##$SUBNAM8= <"">
##$SUBNAM9= <"">
##$SW= 18.0517599122864
##$SWIBOX= (0..15)
0 0 2 0 0 0 0 0 0 0 0 0 0 0 0 0 
##$SW_h= 3612.71676300578
##$TD= 16384
##$TD0= 1
##$TE= 0
##$TE2= 300
##$TE3= 300
##$TEG= 300
##$TL= (0..7)
0 120 120 120 120 120 120 120 
##$TP= (0..7)
150 150 150 150 150 150 150 150 
##$TP07= 0
##$TPNAME0= <>
##$TPNAME1= <>
##$TPNAME2= <>
##$TPNAME3= <>
##$TPNAME4= <>
##$TPNAME5= <>
##$TPNAME6= <>
##$TPNAME7= <>
##$TPOAL= (0..7)
0.5 0.5 0.5 0.5 0.5 0.5 0.5 0.5 
##$TPOFFS= (0..7)
0 0 0 0 0 0 0 0 
##$TUNHIN= 0
##$TUNHOUT= 0
##$TUNXOUT= 0
##$USERA1= <user>
##$USERA2= <user>
##$USERA3= <user>
##$USERA4= <user>
##$USERA5= <user>
##$V9= 5
##$VALIST= <valist>
##$VCLIST= <CCCCCCCCCCCCCCC>
##$VD= 0
##$VDLIST= <DDDDDDDDDDDDDDD>
##$VPLIST= <PPPPPPPPPPPPPPP>
##$VTLIST= <TTTTTTTTTTTTTTT>
##$WBST= 1024
##$WBSW= 4
##$XGAIN= (0..3)
0 0 0 0 
##$XL= 0
##$YL= 0
##$YMAX_a= 360551
##$YMIN_a= -316813
##$ZGOPTNS= <>
##$ZL1= 120
##$ZL2= 120
##$ZL3= 120
##$ZL4= 120
##$ABSF1= 10
##$ABSF2= 0
##$ABSG= 5
##$ABSL= 3
##$ALPHA= 0
##$AQORDER= 0
##$ASSFAC= 0
##$ASSFACI= 0
##$ASSFACX= 0
##$ASSWID= 0
##$AUNMP= <proc_1d>
##$AZFE= 0.1
##$AZFW= 0.1
##$BCFW= 1
##$BC_mod= 2
##$BYTORDP= 1
##$COROFFS= 0
##$CY= -3
##$DATMOD= 1
##$DC= 2
##$DFILT= <>
##$DTYPP= 0
##$F1P= 0
##$F2P= 0
##$FCOR= 0.5
##$FTSIZE= 0
##$FT_mod= 4
##$GAMMA= 1
##$GB= 0.15
##$INTBC= 1
##$INTSCL= 1
##$ISEN= 128
##$LB= 0.25
##$LEV0= 0
##$LPBIN= 0
##$MAXI= 10000
##$MC2= 0
##$MEAN= 0
##$ME_mod= 0
##$MI= 1.114404
##$NCOEF= 0
##$NC_proc= 0
##$NLEV= 6
##$NOISF1= 3.799351
##$NOISF2= 2.8
##$NSP= 1
##$NTH_PI= 0
##$NZP= 0
##$OFFSET= 14.38212
##$PC= 1
##$PHC0= -4490.869
##$PHC1= 9.7923
##$PH_mod= 1
##$PKNL= yes
##$PPARMOD= 0
##$PSCAL= 0
##$PSIGN= 0
##$REVERSE= no
##$SF= 200.129724274929
##$SI= 16384
##$SIGF1= 3
##$SIGF2= 2
##$SINO= 400
##$SIOLD= 16384
##$SREGLST= <1H.CDCl3>
##$SSB= 0
##$STSI= 0
##$STSR= 0
##$SW_p= 3205.1282051282
##$SYMM= 0
##$S_DEV= 0
##$TDeff= 0
##$TDoff= 0
##$TI= <>
##$TILT= no
##$TM1= 0
##$TM2= 0
##$TOPLEV= 0
##$USERP1= <user>
##$USERP2= <user>
##$USERP3= <user>
##$USERP4= <user>
##$USERP5= <user>
##$WDW= 1
##$XDIM= 8192
##$YMAX_p= 0
##$YMIN_p= 0
$$ End of Bruker specific parameters
$$ ---------------------------------
##NTUPLES= NMR FID
##VAR_NAME=  TIME,          FID/REAL,        FID/IMAG
##SYMBOL=    X,             R,               I
##VAR_TYPE=  INDEPENDENT,   DEPENDENT,       DEPENDENT
##VAR_FORM=  AFFN,          ASDF,            ASDF
##VAR_DIM=   8192,          8192,            8192
##UNITS=     SECONDS,       ARBITRARY UNITS, ARBITRARY UNITS
##FACTOR=    0.0002768,     1,               1
##FIRST=     0,             0,               0
##LAST=      2.2672688,     0,               0
##MIN=       0,             -316813,         0
##MAX=       2.2672688,     360551,          0
$$ Real data points
##PAGE= N=1
##DATA TABLE= (X++(R..R)), XYDATA
0 0 0 0 0 0 0 0 0 0 8 -8 8 -8 10 -16 19 -25 30 -35 43 -53 65 -77 92 -107 125 -146 170 -197 228 -259 297
31 297 -336 383 -434 490 -552 620 -693 775 -862 963 -1067 1184 -1311 1448 -1599 1765 -1945
48 -1945 2145 -2360 2597 -2864 3155 -3483 3850 -4261 4732 -5270 5899 -6638 7530 -8621
62 -8621 9994 -11781 14212 -17715 23213 -33074 56008 -210942 7683 280980 -316813 205066
74 205066 139722 -256999 173508 -51803 -240088 288492 -118028 -116914 360551 -193849 -113993
85 -113993 277734 -279820 -19739 208021 -209461 148285 118581 -235574 181346 -31501
95 -31501 -263706 252371 -19245 -178491 294929 -80110 -147772 196411 -176301 -36530
105 -36530 171786 -178532 109671 144734 -227990 114810 63492 -262177 145651 65561 -165808
116 -165808 205274 -13406 -137579 162551 -148437 -69677 200733 -154737 25407 205637
126 205637 -192819 12177 126095 -214660 62752 99965 -150053 165724 19072 -159167
136 -159167 165881 -102916 -136987 211787 -90060 -45802 210360 -136549 -43023 125772
146 125772 -183867 43146 118572 -162266 148203 58372 -193636 149127 -37985 -169461
156 -169461 180944 -39310 -67995 188904 -104018 -54177 124002 -176586 25413 142764
166 142764 -161399 113511 89141 -191179 110178 -3016 -155861 150189 -22185 -72201
176 -72201 171113 -85066 -65371 128858 -151554 -11261 145974 -128743 72565 98065
186 98065 -156311 69028 5636 -134219 119663 1141 -70738 142327 -50002 -81104 106935
197 106935 -102531 -38092 125479 -84400 39498 93991 -118654 33251 17569 -116869
207 -116869 79316 33299 -64466 103186 -10795 -90169 74349 -58059 -52346 107740 -49677
218 -49677 8952 90609 -90192 1700 34947 -98725 40927 55664 -57530 72693 19509
229 19509 -93177 50296 -30172 -65315 98099 -20606 -13249 86944 -68187 -23946 43601
240 43601 -78587 15262 65589 -49713 48579 37300 -86890 32964 -11925 -71088 80704
251 80704 51 -20060 77033 -47635 -37228 36373 -58855 1720 64673 -34510 29037 39055
263 39055 -72691 16935 -1323 -61481 59204 10466 -16230 60428 -29039 -37349 20844 -42139
275 -42139 -6140 54670 -13685 18214 33157 -55676 -231 88 -44549 40240 16906 -6885
287 -6885 39452 -15318 -31074 3456 -24824 -9330 37743 5592 10535 23709 -34837 -14398
299 -14398 -3924 -25225 22838 19578 6464 17623 -6935 -20712 -13878 -9015 -6187 18662 20442
312 20442 6921 11345 -14476 -21227 -12939 -8643 9608 16339 23106 3557 -5496 -9138 -30200 -2770
326 -2770 3568 3199 28938 10407 -4337 -1451 -18985 -24546 5617 4331 4748 37714 -3385 -10829
340 -10829 6804 -40957 -5676 17552 -10677 30819 22024 -21167 4781 -10239 -39661 18259
352 18259 8182 -11869 50502 -5803 -23105 24740 -46426 -14568 33900 -22600 26225 38191
364 38191 -35064 6153 2491 -56642 24555 17491 -28199 60612 -2520 -38607 38520 -46164
376 -46164 -26158 49214 -28598 16198 52935 -44433 2702 18108 -68374 24766 29146 -42875
388 -42875 64273 6091 -53426 46972 -39869 -39812 61071 -27643 2226 66022 -48123 -7498
400 -7498 34389 -74795 17411 44158 -53933 60529 21020 -67048 48016 -26706 -56582 66875
412 66875 -17327 -16128 76642 -41717 -25961 49161 -72775 1363 62023 -58886 46943
423 46943 40955 -77972 40687 -4644 -73024 65029 2053 -37687 80696 -27235 -47730
434 -47730 61817 -64790 -19223 80448 -60745 28219 63891 -87072 27852 20413 -88071
445 -88071 58807 22603 -57000 84013 -13040 -68897 74940 -58223 -41408 99732 -60740
456 -60740 7988 85950 -91752 14003 40821 -98326 53219 37917 -73694 88365 21
467 21 -89704 85328 -46071 -63092 110274 -52289 -10923 95972 -88279 3106 52997
478 52997 -102799 47127 53276 -86676 82090 20750 -102997 77863 -25523 -74751 103270
489 103270 -37319 -20333 95849 -81431 -8709 64847 -101361 28375 73290 -86297 58170
500 58170 42325 -99749 58655 -8748 -76849 94295 -26273 -33511 102611 -68645 -34999
511 -34999 79387 -84468 -4037 87287 -69526 30764 52395 -92764 46378 5870 -87407
522 -87407 92465 -4331 -63071 103449 -35256 -66686 78656 -54475 -29701 86877 -55598
533 -55598 16945 65381 -100095 34571 36481 -107593 74936 36152 -82782 81380 -1587
544 -1587 -76806 67270 -39414 -38513 94113 -59354 -281 94558 -105969 6153 70188
555 70188 -107851 44809 59269 -78803 65626 5076 -80459 75509 -37372 -58167 115048
566 115048 -53361 -33847 112695 -87909 -20915 76472 -92517 32514 56158 -77962 72475
577 72475 9475 -99464 84014 -18332 -84702 114213 -23501 -53890 98743 -64145 -26195
588 -26195 67117 -84058 31049 60875 -85964 61274 34905 -105330 59041 11908 -83902
599 -83902 83093 -1371 -46706 80249 -55402 -28797 70144 -78321 11223 79912 -76232
610 -76232 24232 55688 -86945 25277 27291 -69814 61554 7446 -48906 78078 -39904
621 -39904 -50600 75275 -55065 -21017 85497 -48674 -3704 57468 -70626 9945 35146
632 35146 -71001 55113 25676 -68410 72090 -8794 -73559 66922 -24151 -41513 77129
643 77129 -28365 -16113 59683 -66101 -2553 51154 -75114 39079 50439 -75388 51010
654 51010 14614 -76260 52961 -8054 -46447 72157 -21653 -26725 68802 -59209 -21412 62931
666 62931 -67520 17590 62054 -64728 34259 20591 -71839 44347 -848 -48520 69670
677 69670 -13034 -38309 67446 -44127 -32347 61105 -53848 5336 59115 -54455 26355
688 26355 24535 -67845 33840 8344 -49005 58196 2787 -41237 52593 -27896 -35774 50874
700 50874 -37634 -2133 53060 -42675 13753 28561 -55980 16863 16694 -42172 38589 16192
712 16192 -36108 36660 -13245 -38806 39276 -20935 -10856 48009 -26947 -1907 28842 -40641
724 -40641 1339 22482 -32821 21416 24096 -32234 24856 -102 -40849 29413 -7911 -18108
736 -18108 43067 -13326 -12122 26998 -30216 -9296 26342 -25080 9985 28935 -29929 14903
748 14903 9686 -39149 21017 420 -21893 35993 -3227 -15395 23869 -21866 -16345 24329
760 24329 -17203 3556 30142 -24060 5606 11883 -33222 14124 5989 -19273 26229 1613
772 1613 -14478 17808 -13018 -16884 17661 -10302 -447 26055 -14912 693 9285 -26068 7049
785 7049 7069 -11927 18175 3586 -10967 9230 -7104 -13368 10634 -4026 -2021 18708 -6810
798 -6810 -1155 5803 -17733 1079 4434 -4486 11676 4837 -5185 819 -4120 -9147 3877 2101
812 2101 -1006 10552 -1132 -2531 1549 -8971 -1973 782 1507 5840 4270 1393 -4896 -3206 -5154
827 -5154 -2608 5454 2547 4563 2498 -2437 -4135 -3232 -1519 -2718 6326 2609 664 6890 -6986
842 -6986 -3821 -232 -7413 4458 6687 431 4343 1035 -9807 -1359 658 -6940 10918 3318
856 3318 -4923 10376 -8002 -6878 6184 -9047 1299 11021 -4079 3331 6878 -13921 -790
869 -790 4101 -12941 13119 6825 -9861 13775 -7236 -12505 10944 -8653 -2406 16254 -6647
882 -6647 -319 12240 -16453 -1434 9202 -17703 12321 10671 -14256 15830 -3839 -17853 13306
895 13306 -7061 -6990 20682 -6440 -5005 16264 -17935 -4093 14972 -19932 9961 14612 -18574
908 -18574 15513 1450 -21881 14174 -4035 -12814 23127 -3487 -9859 20023 -17321 -9502 19868
921 19868 -19922 6026 20155 -21327 11573 7734 -24915 12995 2218 -18712 22190 1611
933 1611 -15668 22816 -12853 -16542 23224 -17935 -864 26450 -20784 4994 14163 -27271 8994
946 8994 10220 -22720 19917 7464 -22635 23576 -6418 -23111 26495 -14594 -9167 30977 -19008
959 -19008 -702 20706 -28889 4296 16917 -26676 18083 14314 -28718 23022 -542 -29051
971 -29051 28554 -10224 -15537 33504 -17814 -5849 26559 -28873 -611 22906 -29141 13521
983 13521 21092 -31096 19596 4972 -32232 27251 -5293 -19679 34111 -14578 -12458 29448
995 29448 -24534 -7161 26815 -26028 5949 24488 -28941 14782 9843 -33170 23537 650
1007 650 -23951 32265 -6642 -19118 27759 -16594 -13474 26861 -20090 -95 26058 -27156
1019 -27156 9417 16197 -33874 17700 9246 -27539 25781 2872 -22589 23434 -9286 -18016
1031 -18016 26580 -15366 -6552 30335 -24929 -172 23900 -31375 7865 17640 -26388 17172
1043 17172 9439 -23878 20319 -2921 -23713 27420 -9115 -16336 33805 -17484 -11093 27343
1055 27343 -25187 -610 21494 -24181 12248 14365 -27386 18159 5173 -30085 25737 -89
1067 -89 -23535 31401 -9908 -15745 26602 -21877 -3643 24116 -25166 9067 20538 -30452 13258
1080 13258 12795 -31782 20624 5968 -24241 27526 -6982 -16662 26859 -20219 -7295 27165
1092 27165 -23285 2357 24523 -26354 5762 15377 -27446 14819 7833 -22184 24380 -4018
1104 -4018 -19085 25550 -13834 -13105 25665 -14744 -4868 22397 -18074 24 14776 -22488 9846
1117 9846 10544 -21615 19145 3081 -21387 19306 -4406 -16042 19771 -6480 -8020 19179 -12928
1130 -12928 -3850 16331 -19948 3813 15803 -20626 11362 10149 -20540 12328 1788 -16523
1142 -16523 15773 -1992 -10919 19045 -9191 -9548 19086 -15976 -3559 19295 -17128 4449
1154 4449 13453 -18583 8093 5392 -17626 13799 2327 -14917 18306 -3761 -14447 18706
1166 18706 -10700 -8041 19142 -13615 924 14596 -17348 5337 8463 -18085 10812 6339
1178 6339 -16056 15115 271 -15254 16241 -7365 -9053 17778 -11511 -1070 14933 -15424
1190 -15424 2561 9907 -16206 7217 7810 -14390 11671 2171 -14164 13461 -4893 -9376 15707
1203 15707 -8293 -3127 13386 -11541 -388 9432 -12165 3597 8122 -11477 7551 4045 -12354
1216 -12354 9526 -1383 -9422 11871 -3819 -4720 10567 -6660 -3176 8140 -7773 -159 8479
1229 8479 -8311 3047 6005 -10291 5286 2033 -8896 7984 -83 -5761 7982 -2835 -5265
1242 -5265 7044 -4459 -3010 8633 -5803 -259 7137 -8733 2265 4312 -8179 5426 2274
1255 2274 -6305 6149 -252 -6280 6108 -2144 -4680 8169 -3766 -2053 7376 -7165 178 4982
1269 4982 -6994 3559 3458 -5813 4146 1054 -6025 4668 -393 -4871 6618 -2176 -2772 6338
1283 6338 -5097 -842 4233 -5212 2045 3330 -4045 2431 1340 -4788 2726 563 -3706 4750 -920
1298 -920 -2528 4363 -3280 -875 2942 -3250 1022 2271 -2151 1140 1103 -2913 869 779 -2366 2768
1314 2768 198 -1647 2318 -1865 -797 1366 -1241 541 926 -394 -10 552 -972 -537 688 -978
1330 -978 959 781 -543 617 -806 -366 -245 75 669 -171 984 -546 -396 494 -1077 279 282 -124
1348 -124 446 547 -266 -519 542 -1440 264 1163 -1195 1645 -44 -1522 1079 -898 -666 1326 -199
1365 -199 -513 1429 -766 -1063 1826 -1916 -196 2100 -2241 1501 1137 -2486 1376 -129 -1980 1915
1381 1915 416 -1653 2344 -634 -2248 2921 -1925 -935 3323 -2864 635 2341 -3139 1243 1115
1396 1115 -3091 1834 1209 -2859 2873 113 -3460 3530 -1611 -2019 4298 -2785 -390 3306 -3534
1411 -3534 595 2472 -3614 1417 2161 -3843 2763 1188 -4293 3834 -904 -3247 4866 -2182 -1432
1426 -1432 4157 -3454 -573 3578 -3677 637 3390 -4532 1961 2400 -5030 3705 515 -4499 4724
1441 4724 -1201 -2875 4844 -2517 -2103 4408 -3372 -795 4834 -4538 664 3839 -5759 2768 2326
1456 2326 -5434 4353 215 -4541 4954 -1179 -3549 5279 -2718 -2525 5903 -4283 -565 5325 -6114
1471 -6114 1694 3712 -6175 4033 1670 -5673 4873 -255 -4836 5860 -1863 -3786 6516 -4093
1485 -4093 -1719 6376 -6014 798 4738 -6655 3259 2939 -6276 4403 846 -5819 5618 -713
1499 -713 -4667 6676 -3189 -3002 6726 -5199 -401 5622 -6183 1756 4004 -6098 3263 2354 -6147
1514 -6147 4520 706 -5402 6168 -1529 -4338 6526 -3855 -2031 6177 -4992 27 4798 -5665
1528 -5665 1616 3774 -6083 3227 2291 -6265 5221 317 -5390 6219 -2304 -3729 6317 -3680
1542 -3680 -1639 5808 -4964 -259 5156 -5950 1770 4238 -6810 3864 2203 -6438 5704 -301
1556 -301 -5289 6331 -2291 -3573 6631 -3835 -2156 6422 -5644 -80 5928 -6932 2510 3928
1570 3928 -7328 4807 1495 -6399 6102 -883 -5147 6816 -2727 -3525 7124 -5001 -1478 6752
1584 6752 -6761 1542 5052 -7554 3954 2565 -6892 5701 281 -5893 6521 -1794 -4441 7199
1598 7199 -3997 -2432 6893 -6087 360 5599 -6892 2791 3359 -6715 4434 1468 -5926 5458
1612 5458 -510 -5117 6398 -2367 -3432 6621 -4531 -1398 5755 -5523 1001 4342 -5760 2402
1626 2402 2787 -5642 3694 1368 -5424 5005 -450 -4424 5934 -2574 -2772 5638 -4125 -783 5098
1641 5098 -4700 654 4053 -5454 2008 3052 -5677 3814 1292 -5318 5198 -939 -4017 5587 -2827
1656 -2827 -2389 5507 -3781 -827 4983 -5062 594 4132 -5839 2878 2694 -5947 4599 380 -5119
1671 -5119 5453 -1455 -3600 5589 -2809 -2061 5521 -4287 -498 4796 -5619 1840 3654 -5825 3764
1686 3764 1298 -5361 4681 -556 -3919 5238 -2015 -2656 5273 -3563 -1206 4883 -4886 866 3746
1701 3746 -5157 2843 1741 -4823 3662 -15 -3693 4364 -1125 -2771 4494 -2572 -1679 4363 -3691
1716 -3691 150 3521 -4187 1750 2026 -3990 2497 710 -3390 3046 83 -2803 3448 -1171 -2321
1731 -2321 3618 -2273 -810 3394 -2967 402 2318 -3132 1068 1604 -2970 1739 1091 -2907 2478
1746 2478 80 -2782 3028 -1173 -1649 3278 -1938 -573 2577 -2474 76 2117 -2580 949 1798
1761 1798 -2929 1813 801 -2980 2683 -490 -2096 3101 -1369 -1026 2609 -2084 -442 2261 -2278
1776 -2278 479 2082 -2728 1341 1041 -2893 2259 -127 -2029 2661 -988 -1125 2218 -1544 -619 1942
1792 1942 -1745 139 1894 -2129 863 998 -2370 1628 98 -1516 2009 -589 -882 1497 -1000
1807 -1000 -528 1326 -984 -68 1368 -1365 418 714 -1607 940 61 -848 1215 -283 -447 642
1823 642 -499 -437 604 -294 -153 861 -617 26 439 -877 356 61 -261 506 12 -20 -91 -41 -349
1842 -349 -8 320 -190 429 47 -281 111 -309 -21 -7 262 31 25 377 -588 122 -27 -531 558 -77 10
1863 10 401 -189 -348 47 -128 -404 743 -153 -211 865 -869 -22 385 -943 551 410 -472 533 192
1882 192 -874 337 89 -1000 1207 -54 -675 1439 -1026 -464 1010 -1252 311 1061 -955 486
1898 486 795 -1518 514 522 -1722 1572 196 -1323 1998 -1009 -1030 1640 -1495 -178 1740 -1366 268
1915 268 1457 -2104 484 1080 -2401 1756 651 -2068 2449 -753 -1697 2233 -1445 -760 2423 -1554
1931 -1554 -174 2223 -2449 258 1762 -2975 1738 1195 -2728 2622 -285 -2468 2639 -1152 -1510
1946 -1510 3010 -1464 -900 2924 -2648 -316 2614 -3383 1335 2042 -3342 2476 550 -3256 2733
1961 2733 -495 -2468 3421 -972 -1841 3682 -2507 -1213 3560 -3574 715 3079 -3878 2077 1536
1976 1536 -4010 2695 314 -3387 3732 -492 -2794 4313 -2290 -2047 4298 -3697 44 3913 -4221
1991 -4221 1715 2274 -4582 2582 1034 -4143 3910 99 -3667 4648 -1869 -2874 4823 -3539 -683
2006 -683 4545 -4260 1125 3113 -4918 2108 1974 -4656 3572 1093 -4357 4473 -1055 -3631 5017
2021 5017 -2898 -1590 5057 -3956 44 3969 -4838 980 2979 -4799 2700 2168 -4750 4024 -149
2036 -149 -4513 5055 -1987 -2761 5555 -3152 -1285 4634 -4228 -156 3824 -4746 1862 3164 -5266
2051 -5266 3696 1072 -5639 4857 -677 -3955 5664 -1999 -2547 4976 -3720 -1201 4792 -4810 946
2066 946 4526 -5958 2785 2721 -6432 4155 700 -4909 5476 -1011 -3471 5482 -3376 -2532 5844
2081 5844 -4691 -378 5936 -5971 1538 3860 -6549 3528 1540 -5428 5471 -463 -4413 6086
2095 6086 -2739 -3838 6467 -4082 -1526 6499 -5420 847 4197 -6603 3271 2129 -5972 5399
2109 5399 524 -5399 5799 -1451 -4674 6040 -3064 -2192 6320 -4864 351 4687 -6703 2318
2123 2318 3250 -6198 4180 2174 -5649 4466 -4 -4983 5317 -1955 -2997 6386 -4005 -1079
2137 -1079 5622 -5806 344 4363 -5440 2332 3382 -5163 3253 990 -5537 4916 -739 -4294
2151 -4294 6634 -2663 -2973 6010 -4417 -1341 4870 -4684 998 4132 -5205 2593 2312 -6481 4329
2166 4329 854 -5498 6284 -1050 -4068 5819 -3480 -2265 5373 -4388 88 5248 -5547 1535
2180 1535 3970 -6942 3266 2357 -6069 5523 175 -4636 5651 -2778 -3274 5787 -3786 -1099
2194 -1099 6039 -5088 194 4723 -6515 2294 3051 -6063 4829 845 -4992 5411 -1790 -4098
2208 -4098 5524 -2750 -2085 5962 -3946 -756 4695 -5737 1448 3403 -5518 3894 1511 -4951 4424
2223 4424 -651 -4180 4625 -1546 -2627 5322 -2690 -1503 4541 -4698 131 3784 -4626 2488 2480 -4471
2239 -4471 2777 545 -4121 3355 8 -3141 4352 -1256 -2528 4288 -3262 -1237 3958 -3620 943
2254 943 3262 -3767 1310 1625 -4069 2174 1417 -3446 3594 51 -3383 3878 -2056 -2162 4005 -2715
2270 -2715 -143 3526 -3155 362 2211 -3841 1272 2092 -3431 2976 881 -3666 3282 -1311 -2590
2285 -2590 3782 -1881 -726 3405 -2529 -314 2350 -3211 497 2335 -3070 2235 1401 -3344 2566
2300 2566 -764 -2561 3062 -1021 -764 2858 -1675 -798 1902 -2308 -67 2201 -2190 1350 1480 -2619
2316 -2619 1658 -375 -2098 1970 -427 -484 1943 -721 -920 995 -1364 -501 1735 -1101 706 1222
2332 1222 -1700 687 -187 -1298 926 27 -88 944 109 -736 169 -441 -845 1089 -59 215 1006
2349 1006 -785 -139 -224 -532 123 375 395 -11 591 -485 -592 197 -865 367 625 25 541 13 -516
2368 -516 -615 87 -433 319 1091 -573 616 -18 -1239 465 -405 -313 890 255 -138 581 -358 -1196 702
2387 702 -618 -285 1877 -795 289 789 -1753 231 378 -926 988 943 -1009 835 138 -2049 1334
2404 1334 -377 -1179 2562 -872 -380 1687 -2087 -380 1209 -1590 752 1851 -1796 869 875 -3003
2420 -3003 1675 229 -2146 3135 -628 -1347 2581 -2043 -1090 2191 -1992 196 2834 -2367 640
2435 640 1771 -3810 1737 931 -3016 3480 -173 -2303 3107 -1823 -1903 3012 -2004 -579 3702 -2726
2451 -2726 155 2741 -4378 1371 1761 -3845 3526 716 -3249 3353 -1231 -2979 3630 -1565 -1609 4575
2467 4575 -2693 -860 3868 -4639 705 3025 -4504 2993 1907 -4179 3297 -152 -4201 3934 -796
2482 -796 -2887 5327 -2257 -2121 4790 -4675 -335 4255 -4840 2294 3074 -4953 3010 957 -5249 3998
2498 3998 148 -4095 5760 -1609 -3280 5511 -4413 -1351 5192 -4949 1540 4258 -5485 2364 2243
2513 2243 -5955 3623 1365 -4976 5665 -675 -4300 5922 -3742 -2677 6042 -4515 112 5467
2527 5467 -5298 926 3485 -6183 2619 2658 -5646 5234 664 -5610 5968 -2383 -4349 6392
2541 6392 -3231 -1664 6087 -4398 -501 4465 -6087 1535 4108 -6289 4421 2522 -6763 5257
2555 5257 -491 -5548 6045 -1808 -2840 6343 -3739 -1746 5610 -6031 -11 5870 -6521 2815
2569 2815 4428 -7102 3957 991 -6248 5632 -738 -4097 7004 -2874 -3760 6833 -5182 -2269
2583 -2269 7154 -5782 1001 5519 -6914 3038 2110 -7113 5473 750 -5824 7191 -997 -5680
2597 -5680 6850 -3416 -3716 7171 -4862 161 6091 -7084 2424 3548 -7983 4531 2702
2610 2702 -6648 5852 816 -6090 5837 -2430 -4081 7099 -4553 -728 7079 -6841 679 5070
2624 5070 -7387 2390 4013 -5902 4220 1684 -5876 5232 -1535 -5060 7328 -3194 -2821 7545
2638 7545 -4932 -1627 5439 -5605 550 4421 -5176 3094 2789 -6496 4480 505 -6533 6465
2652 6465 -632 -4454 6606 -2761 -2964 5054 -4413 -549 5121 -5075 1697 4492 -6882 2764
2666 2764 2647 -6856 4750 1130 -4714 5668 -1667 -3592 5246 -3799 -1895 6136 -4449 -118
2680 -118 5725 -6113 1029 3706 -6382 3701 1921 -5028 5373 -708 -4681 5412 -2516 -3473
2694 -3473 6333 -3112 -1652 5885 -5173 -81 4102 -6046 2939 2790 -5347 4592 566 -5366 4586
2709 4586 -1058 -4098 5648 -1861 -2232 5532 -4352 -837 4305 -5478 1929 3525 -4933 3262 1498
2724 1498 -4999 3335 -14 -3934 4675 -950 -2539 5001 -3286 -1608 4134 -4361 682 3701 -3860
2739 -3860 1978 2016 -4341 2003 786 -3761 3654 287 -2991 4184 -1904 -2512 3739 -2969 -488 3724
2755 3724 -2731 650 2516 -3652 713 1673 -3619 2503 1512 -3215 3358 -594 -3179 3241 -1752
2770 -1752 -1359 3635 -1800 -399 2820 -2997 -293 2299 -3290 1529 2243 -3136 2605 189 -3406
2785 -3406 2651 -1015 -1775 3362 -1075 -946 2731 -2394 -950 2387 -2789 874 2529 -2822 1935
2800 1935 728 -3186 1992 -464 -1798 2834 -378 -1106 2287 -1668 -1283 2126 -2052 364 2436
2815 2436 -2194 1199 823 -2593 1267 -94 -1475 1915 115 -932 1576 -950 -1423 1445 -1268
2830 -1268 -29 2014 -1285 639 580 -1823 501 36 -789 1089 484 -530 714 -260 -1238 734 -480
2847 -480 -222 1433 -421 264 359 -1008 -116 -7 -112 387 720 -120 -89 136 -983 82 82 -251 811
2866 811 142 38 -46 -381 -484 -230 396 -86 654 307 -556 214 -644 -386 330 53 319 417 136 -527 39
2887 39 -365 -619 792 -172 314 821 -702 -29 -125 -728 141 571 -80 360 541 -1020 125 -4 -1091
2906 -1091 1096 27 -321 1186 -658 -562 436 -826 -296 1126 -415 114 1183 -1496 3 543 -1701
2923 -1701 1270 520 -969 1468 -395 -1192 995 -654 -843 1763 -548 -382 1854 -1765 -217 1234
2939 1234 -2161 1125 1103 -1525 1566 50 -1890 1214 -405 -1441 2175 -459 -989 2255 -1846 -668
2955 -668 1798 -2327 817 1631 -1903 1425 633 -2340 1180 94 -1973 2355 -2 -1530 2620 -1647
2971 -1647 -1281 2293 -2221 280 2260 -2039 920 1332 -2651 933 799 -2554 2248 582 -2183 2790
2987 2790 -1113 -2043 2613 -1939 -477 2845 -1987 226 1962 -2862 458 1566 -2919 1899 1261
3002 1261 -2676 2728 -491 -2634 2758 -1517 -1182 3199 -1649 -353 2495 -2737 -159 2124 -2930
3017 -2930 1525 1844 -2980 2471 105 -3046 2724 -869 -1843 3215 -1154 -1042 2732 -2377 -752 2483
3033 2483 -2864 930 2493 -3212 1894 958 -3468 2246 -3 -2310 2959 -485 -1686 2870 -1862
3048 -1862 -1495 3003 -2597 -28 3277 -2948 973 1727 -3426 1581 706 -2529 2735 137 -2311 2936
3064 2936 -1187 -2395 3266 -1864 -1041 3440 -2454 245 2133 -3253 1100 1271 -2976 2356 1078
3079 1078 -3047 2573 -111 -3108 2979 -1005 -1544 3433 -2137 -309 2647 -3283 488 2271 -3202
3094 -3202 1483 2139 -3153 1879 716 -3264 2647 -596 -1973 3734 -1858 -1202 3278 -2897 -584
3109 -584 2892 -2690 536 2414 -2841 1347 941 -3354 2632 -161 -2637 3710 -966 -2055 3094
3124 3094 -1897 -1281 2588 -1955 178 2348 -2705 1084 1473 -3588 2108 914 -2963 2840 114
3139 114 -2231 2368 -1106 -1424 2395 -1569 -278 2839 -2519 71 2307 -3261 860 1809 -2600 1854
3155 1854 678 -2215 1925 -622 -1924 2507 -927 -1379 3112 -1638 -1137 2585 -2447 -52 2044
3170 2044 -2223 1321 1122 -2401 1613 166 -2519 2239 124 -1981 2747 -734 -1612 2374 -1859
3185 -1859 -433 2156 -2101 852 1724 -2475 976 973 -2633 1521 817 -2095 2229 -259 -1803 2245
3201 2245 -1539 -904 2445 -1827 134 2094 -2160 230 1371 -2343 953 1181 -1999 1914 120
3216 120 -2023 2057 -973 -1378 2330 -1127 -442 1996 -1500 -270 1346 -1883 473 1339 -1801 1381
3232 1381 604 -1997 1543 -385 -1496 1782 -526 -652 1662 -936 -613 1256 -1415 -49 1472 -1472
3248 -1472 714 922 -1756 876 134 -1368 1200 33 -783 1283 -380 -933 1133 -806 -525 1541
3264 1541 -985 152 1171 -1404 356 498 -1265 777 480 -903 916 99 -1194 935 -326 -877
3280 -877 1404 -618 -256 1200 -1150 -49 663 -1061 378 696 -854 574 347 -1151 690 -47
3296 -47 -938 1184 -295 -418 1086 -823 -222 656 -806 177 715 -631 341 471 -996 433 144 -856
3314 -856 941 -56 -428 826 -542 -309 496 -536 30 621 -394 49 440 -751 150 236 -661 630
3332 630 94 -346 508 -326 -318 271 -225 -43 439 -92 -64 319 -462 -80 261 -378 364 179 -179 231 -145
3353 -145 -190 16 -11 -18 214 130 -196 179 -235 -214 179 -175 145 159 -74 18 -102 -130 -163 107 -20 47 255 -177
3377 -177 42 -110 -262 73 -14 137 97 105 -12 -109 19 -196 83 77 4 279 -87 -81 -22 -146 -34 24 161 6
3401 6 144 -6 -235 90 -245 -63 231 -71 159 86 -167 -122 -20 -176 15 299 -146 182 111 -435 213 -153
3423 -153 -229 400 -43 -22 286 -199 -216 199 -237 -36 507 -300 191 274 -595 262 20 -381 483 0 -237
3444 -237 405 -191 -413 374 -286 -190 628 -394 53 461 -708 189 211 -582 479 166 -388 439 -36 -544
3464 -544 481 -167 -360 750 -367 -118 621 -713 55 432 -619 353 374 -537 378 131 -730 496
3482 496 -15 -578 836 -251 -390 776 -645 -213 648 -660 159 599 -677 217 388 -908 432
3499 432 264 -825 851 -42 -680 873 -470 -435 825 -554 -127 820 -676 0 724 -921 282
3516 282 593 -960 737 271 -908 860 -221 -731 932 -359 -415 951 -544 -292 859 -914 8
3533 8 816 -1037 532 530 -1101 697 68 -969 826 -106 -680 1027 -391 -591 1050 -776 -308 1124
3551 1124 -990 240 875 -1134 489 433 -1098 751 270 -930 1005 -64 -926 1136 -535 -710
3567 -710 1297 -788 -176 1135 -1084 134 738 -1198 530 600 -1166 847 312 -1278 1012 -192
3583 -192 -1003 1286 -534 -500 1295 -967 -150 1045 -1211 195 1048 -1208 555 718 -1361 842 180
3600 180 -1186 1291 -281 -829 1444 -716 -589 1263 -997 -267 1245 -1124 204 949 -1388 653
3616 653 446 -1463 1195 98 -1198 1368 -390 -971 1274 -692 -547 1295 -956 -66 1166 -1400
3632 -1400 359 851 -1505 871 576 -1295 1073 75 -1106 1120 -373 -769 1401 -725 -440 1421
3648 1421 -1238 -96 1233 -1372 411 877 -1279 766 339 -1258 1014 -66 -1133 1394 -374
3663 -374 -933 1434 -853 -589 1327 -1141 88 1075 -1270 531 680 -1424 799 409 -1402 1205
3679 1205 130 -1181 1402 -482 -842 1369 -940 -242 1319 -1215 166 1068 -1425 404 810 -1390
3695 -1390 906 443 -1307 1205 -253 -1094 1424 -705 -584 1448 -990 -236 1163 -1251 55 981
3711 981 -1301 649 694 -1401 1038 56 -1303 1301 -301 -851 1419 -661 -538 1232 -983 -176 1157
3728 1157 -1180 347 964 -1358 741 395 -1364 1064 -8 -960 1205 -343 -707 1131 -762 -489
3744 -489 1171 -952 -5 1106 -1226 384 635 -1292 758 325 -1006 997 15 -891 996 -365
3760 -365 -725 1119 -643 -292 1165 -934 49 844 -1115 411 555 -988 715 334 -968 780 -29
3777 -29 -890 1056 -324 -590 1170 -711 -276 903 -922 80 731 -900 416 503 -992 563 247
3794 247 -993 840 -53 -714 1039 -431 -481 887 -720 -144 776 -682 173 674 -846 322 381 -935
3812 -935 622 190 -758 844 -201 -553 749 -510 -272 696 -453 -56 637 -673 90 471 -811
3829 -811 405 288 -663 596 -51 -576 551 -240 -318 566 -233 -182 560 -402 -106 448 -541 175 349 -491
3849 -491 396 98 -424 320 -58 -280 383 -25 -209 357 -161 -222 341 -299 -23 313 -274 137 127 -255 67
3870 67 19 -191 109 115 -188 188 12 -267 205 -124 -112 274 -68 25 106 -89 -79 42 -44 -38 256 -40 13 146
3894 146 -225 33 34 -56 127 9 9 -22 43 -157 -13 112 -162 160 63 -151 109 -109 -115 55 29 -59 149 61
3918 61 -211 184 -166 -199 280 -170 36 287 -256 40 118 -257 34 223 -192 187 228 -422 268 -32 -416
3939 -416 449 -109 -165 483 -259 -176 333 -352 -85 432 -388 106 431 -635 288 129 -666 536 -29 -395
3959 -395 594 -236 -341 543 -399 -242 657 -456 14 630 -706 271 390 -776 510 157 -584 665
3977 665 -66 -547 665 -300 -469 818 -470 -173 836 -780 96 576 -898 399 356 -748 620
3994 620 114 -757 659 -151 -698 898 -360 -432 984 -738 -117 802 -987 281 613 -887 538
4011 538 381 -925 681 129 -916 962 -173 -708 1148 -615 -388 990 -876 26 852 -931 309
4028 309 668 -1065 528 382 -1115 913 58 -910 1140 -403 -693 1106 -754 -309 1064 -902 56
4045 56 839 -1102 318 674 -1252 784 383 -1141 1114 -129 -934 1150 -542 -511 1215 -753 -235
4062 -235 1125 -1048 49 960 -1299 544 681 -1257 966 124 -1127 1116 -280 -851 1236 -526
4078 -526 -560 1248 -890 -310 1146 -1189 232 957 -1340 748 448 -1313 981 84 -1073 1179 -193
4095 -193 -880 1269 -663 -555 1312 -1071 -30 1206 -1313 438 837 -1376 703 427 -1207 1028
4111 1028 103 -1044 1237 -433 -909 1400 -876 -433 1388 -1179 72 1004 -1317 419 666 -1285
4127 -1285 813 386 -1265 1158 -63 -1160 1366 -527 -711 1417 -902 -226 1141 -1170 171 891
4143 891 -1238 598 721 -1289 910 273 -1263 1156 -179 -916 1304 -618 -440 1192 -983 -171
4159 -171 1065 -1074 169 958 -1228 524 582 -1281 910 94 -1033 1177 -323 -733 1208 -612
4175 -612 -537 1149 -842 -173 1115 -1033 241 821 -1255 687 418 -1158 1017 75 -953 1079 -264
4192 -264 -749 1088 -532 -451 1175 -921 -66 962 -1201 363 644 -1171 705 324 -1021 822 -20
4209 -20 -866 981 -352 -639 1135 -695 -321 1023 -990 95 817 -1025 451 514 -920 636 195
4226 195 -920 842 -51 -754 1045 -416 -497 1027 -745 -145 823 -877 221 615 -881 426 368
4243 368 -935 603 131 -850 815 -175 -646 871 -517 -290 791 -623 -7 655 -672 151 531
4260 531 -767 363 377 -789 637 65 -667 714 -225 -437 704 -380 -221 647 -468 -98 580 -613
4278 -613 127 491 -705 403 236 -658 526 -33 -509 585 -176 -359 582 -295 -274 578 -443 -65 558
4297 558 -582 194 353 -612 398 115 -483 437 17 -368 493 -117 -331 543 -311 -164 529 -438 76
4316 76 389 -495 222 210 -472 320 90 -346 353 -10 -365 387 -185 -238 438 -298 -40 350 -395 75 184
4337 184 -338 166 158 -277 228 75 -345 293 -27 -232 345 -137 -62 302 -226 28 202 -207 48 148 -173
4358 -173 79 148 -250 128 47 -215 238 -62 -109 190 -108 -60 91 -121 -52 122 -89 -21 161 -174 6 78
4380 78 -193 105 9 -38 102 -10 -49 53 2 -62 73 47 -45 111 -68 -16 116 -64 55 16 -26 3 10 -21 -19 21
4406 21 -46 8 51 -83 48 -33 -48 44 -40 3 -31 38 -40 -14 43 -83 29 7 -61 76 -17 -12 55 18 -11 46 26 -63
4434 -63 112 -36 -36 129 -86 24 119 -107 76 21 -83 70 56 -127 85 35 -135 146 -41 -137 188 -143 -54
4457 -54 178 -177 26 121 -181 43 89 -197 73 146 -233 166 48 -189 251 -85 -128 252 -103 -68 198 -156
4479 -156 -23 212 -187 48 194 -259 157 117 -286 233 -32 -208 259 -90 -171 243 -134 -108 234 -182 -31
4500 -31 263 -298 50 206 -310 180 90 -282 264 1 -193 280 -65 -213 326 -147 -139 366 -246 -6 316
4521 316 -321 113 194 -309 191 142 -303 229 26 -306 293 -75 -273 371 -198 -151 367 -337 -9 289 -345
4542 -345 97 246 -347 162 152 -370 254 79 -350 391 -81 -263 427 -228 -118 392 -287 -2 355 -339
4562 -339 89 307 -398 197 198 -432 336 14 -360 422 -154 -244 411 -222 -168 394 -288 -47 391 -408 69
4583 69 304 -486 258 168 -457 335 20 -365 395 -121 -284 454 -224 -211 509 -348 -35 448 -465 136 299
4604 299 -489 276 134 -417 377 -8 -400 418 -107 -337 481 -269 -197 475 -432 -37 399 -487 119 229
4624 229 -484 296 172 -473 384 37 -430 482 -125 -348 558 -301 -165 519 -414 58 414 -456 185 303
4644 303 -483 300 206 -501 434 17 -434 522 -189 -259 512 -357 -130 454 -413 4 357 -464 154 288 -536
4665 -536 334 164 -514 470 -51 -404 530 -239 -278 502 -310 -130 485 -428 8 444 -543 210 297 -552 419
4686 419 128 -497 504 -69 -402 506 -211 -301 530 -349 -173 549 -488 37 431 -581 271 260 -552 387
4706 387 75 -506 467 -65 -409 536 -211 -315 584 -404 -96 499 -525 143 367 -530 293 217 -517 396
4726 396 52 -472 513 -70 -380 609 -283 -196 574 -426 -4 414 -482 127 356 -499 245 201 -500 381
4746 381 35 -495 507 -176 -332 514 -346 -131 466 -419 23 367 -435 145 355 -505 313 185 -532 439
4766 439 1 -399 501 -191 -240 457 -262 -119 448 -346 -28 420 -415 135 284 -497 298 124 -425 416
4786 416 -32 -345 407 -180 -246 378 -264 -148 414 -400 -22 366 -471 174 210 -421 305 85 -351 364 -14
4807 -14 -286 397 -129 -211 437 -268 -95 426 -381 68 295 -408 205 138 -341 234 25 -301 283 -32 -253
4828 -253 384 -181 -202 368 -339 -18 278 -332 94 179 -303 151 135 -293 217 56 -257 296 -55 -189 339
4849 339 -189 -50 283 -190 60 221 -200 45 174 -211 124 118 -222 239 1 -194 236 -127 -79 179 -151
4870 -151 -53 136 -139 -19 131 -154 16 161 -184 101 37 -139 159 -39 -65 129 -55 -59 108 -17 -85 127
4892 127 -60 -48 141 -123 55 87 -101 84 15 -29 57 10 -80 26 19 -103 58 32 -81 88 -68 -28 46 -58
4916 -58 -7 -12 -45 -18 48 -4 -36 37 -55 7 42 -57 46 16 25 16 11 -17 -32 93 -24 29 58 -100 76 -12 -78 125 13
4945 13 -19 63 17 -88 106 7 -111 158 -75 -35 152 -177 9 55 -161 74 57 -111 70 15 -159 126 -9
4968 -9 -169 234 -69 -106 230 -191 37 183 -203 91 139 -183 96 145 -223 158 37 -238 277 -79 -178 288
4990 288 -175 -80 203 -256 2 196 -269 65 195 -283 154 107 -363 298 -31 -239 345 -139 -158 257 -205
5011 -205 -65 285 -212 25 318 -293 124 229 -371 273 71 -327 367 -48 -235 326 -169 -163 356 -232 -116
5032 -116 385 -358 43 321 -460 209 164 -438 338 -12 -359 343 -72 -284 385 -164 -189 430 -327 -84 421
5053 421 -463 179 314 -460 317 155 -387 351 27 -363 422 -70 -314 499 -263 -170 498 -439 38 354
5073 354 -460 206 222 -483 265 112 -469 392 -34 -433 488 -207 -295 550 -381 -72 449 -476 133 334 -484
5094 -484 234 241 -524 391 151 -522 497 -82 -355 594 -275 -148 532 -395 -15 463 -455 76 351 -502
5114 -502 259 236 -582 480 -15 -475 550 -215 -323 542 -332 -154 484 -426 -24 440 -493 175 360 -617
5134 -617 403 142 -537 517 -88 -364 540 -216 -266 525 -355 -116 512 -493 96 482 -604 283 270
5153 270 -593 423 16 -433 506 -145 -328 492 -299 -251 560 -424 -59 527 -545 153 314 -583 336 127
5173 127 -489 442 -5 -401 508 -138 -340 565 -267 -163 560 -449 69 381 -524 242 232 -458 388 123
5193 123 -451 433 -19 -431 508 -214 -245 551 -406 -57 448 -524 114 309 -489 228 206 -477 340 45 -470
5214 -470 450 -133 -330 562 -303 -140 474 -427 36 368 -397 166 292 -423 274 139 -460 441 -12 -388
5234 -388 515 -219 -217 453 -336 -59 336 -372 58 293 -450 172 220 -499 327 35 -420 459 -97 -238 381
5255 381 -249 -131 375 -309 -9 353 -342 112 266 -428 255 126 -404 405 -24 -254 402 -154 -167 379
5275 379 -216 -87 367 -325 38 335 -396 143 199 -339 277 7 -273 286 -66 -244 303 -157 -173 343 -234
5296 -234 -86 293 -330 91 195 -310 212 122 -261 253 26 -243 287 -55 -169 343 -132 -109 306 -273 58
5317 58 248 -302 118 127 -256 168 26 -246 187 2 -243 254 -68 -162 274 -252 -41 217 -248 80 144 -211
5339 -211 106 56 -224 135 57 -181 230 -38 -176 232 -172 -35 214 -150 74 154 -151 95 128 -176 78
5360 78 79 -175 195 41 -138 180 -118 -72 177 -178 -3 102 -143 -33 78 -154 20 94 -149 97 19 -147
5382 -147 126 -65 -92 143 -49 15 98 -36 -14 97 -62 -17 89 -90 79 61 -98 116 -15 -55 74 8 -23
5405 -23 53 -2 -62 65 -74 -38 92 -111 11 46 -92 36 -22 -60 4 6 -24 31 51 -50 22 -47 -53 75 -36 36
5431 36 61 -29 8 1 11 0 33 39 -10 78 -25 26 21 -68 39 3 -12 21 12 -11 -44 32 -71 -5 20 -47 75 -28 -37 31
5461 31 -38 -22 20 -5 -15 50 21 -77 83 -65 27 108 -72 73 36 -93 86 25 -53 89 43 -67 113 -24 -84
5486 -84 143 -117 7 132 -125 50 65 -134 24 7 -108 84 11 -113 116 -9 -132 165 -98 -44 158 -125
5508 -125 35 98 -145 35 73 -132 46 87 -104 147 -3 -148 167 -89 -83 208 -130 10 152 -158 33 106
5530 106 -145 80 125 -158 159 31 -236 176 -109 -138 240 -141 -38 175 -145 -11 147 -190 66 136 -190
5551 -190 150 91 -252 268 -20 -143 259 -83 -78 239 -135 -45 196 -241 -9 231 -238 115 142 -280 250 10
5573 10 -222 261 -75 -135 249 -150 -108 249 -221 -47 291 -285 96 172 -317 158 51 -267 273 1 -197
5594 -197 284 -94 -175 284 -175 -104 349 -272 81 237 -348 208 145 -313 256 51 -258 246 -17 -227 310
5615 310 -184 -154 347 -279 14 304 -378 125 178 -336 187 73 -308 235 16 -303 333 -100 -221 428 -219
5636 -219 -105 368 -315 33 242 -298 140 172 -296 229 106 -337 355 -17 -293 422 -130 -128 404 -300 -8
5657 -8 317 -369 103 238 -376 160 152 -424 274 51 -366 399 -113 -208 396 -306 -69 340 -297 18 351 -361
5679 -361 139 256 -403 234 101 -371 415 -37 -255 425 -233 -158 443 -232 -69 371 -311 4 301 -410
5699 -410 189 153 -465 347 26 -350 390 -109 -283 347 -207 -134 402 -279 -24 365 -419 110 274 -458 273
5720 273 142 -379 373 -45 -283 357 -123 -218 430 -220 -112 416 -390 0 338 -431 202 194 -344 287 40
5741 40 -348 293 -37 -317 410 -154 -211 426 -313 -91 344 -380 103 254 -376 211 109 -368 279 49 -342
5762 -342 385 -44 -265 440 -209 -135 347 -309 81 322 -307 161 215 -344 200 141 -373 324 31 -290 392
5783 392 -165 -205 334 -259 -43 303 -301 50 234 -337 77 208 -359 176 103 -331 320 -73 -237 351 -190
5804 -190 -87 312 -197 -46 306 -263 9 266 -277 165 159 -334 277 -9 -290 300 -116 -155 298 -120 -122 295
5826 295 -255 -64 253 -286 83 185 -322 199 31 -312 224 -36 -195 261 -69 -181 244 -129 -106 289
5846 289 -254 59 238 -285 151 109 -264 182 22 -162 221 3 -145 234 -95 -122 297 -182 -9 232 -241
5867 -241 92 95 -225 99 62 -194 145 31 -132 153 -32 -198 226 -128 -42 213 -185 17 78 -151 23 88
5889 88 -106 111 72 -135 92 -10 -165 186 -23 -67 190 -99 -8 101 -91 -16 65 -48 12 85 -140 51 64
5912 64 -147 101 -26 -71 91 -23 -42 18 -35 -36 69 -7 10 120 -69 6 60 -134 46 47 -13 70 0 2 48 3 -19
5939 -19 49 32 -33 96 12 -51 48 -59 8 15 9 42 -4 10 -45 7 -52 -37 80 -70 54 16 -61 -21 -11 -12 1 11 -3
5968 -3 13 44 -86 42 3 -103 127 -9 -12 104 -32 -5 51 -6 -29 111 -46 -15 139 -152 44 67 -152 124
5992 124 26 -108 109 -36 -82 61 -39 -119 124 -60 -76 195 -170 -15 124 -200 94 69 -137 129 29 -146
6014 -146 98 24 -153 215 -11 -93 256 -180 -6 212 -164 68 133 -151 109 124 -182 105 90 -235 215 11
6036 11 -181 235 -142 -146 211 -202 14 184 -184 43 163 -254 53 139 -285 204 90 -260 281 -61 -183
6057 -183 255 -151 -48 262 -125 -34 252 -255 18 253 -300 154 166 -315 277 -20 -257 269 -113 -155 257
6078 257 -146 -145 311 -255 -117 286 -342 73 220 -321 237 85 -333 308 -20 -243 321 -51 -222 322 -173
6099 -173 -155 341 -298 49 326 -390 195 173 -377 261 123 -288 294 49 -259 304 -134 -225 406 -269 -74
6120 -74 399 -380 94 250 -377 124 139 -356 223 104 -358 362 -90 -349 423 -191 -160 439 -276 6 289
6141 289 -318 95 215 -350 232 221 -420 288 103 -414 411 -95 -225 411 -247 -47 325 -364 -10 332
6161 332 -377 79 305 -403 178 126 -430 309 -41 -301 410 -165 -176 381 -236 -133 371 -271 -31 385 -348
6182 -348 122 228 -432 344 82 -344 430 -30 -296 345 -126 -207 358 -198 -99 404 -349 41 296 -495 230
6203 230 146 -425 315 63 -307 266 -52 -260 320 -188 -191 442 -308 -55 378 -413 76 276 -347 216 177
6224 177 -314 258 13 -325 356 -74 -318 474 -184 -169 414 -335 -3 318 -309 134 181 -355 202 91 -406
6245 -406 276 64 -360 389 -117 -253 356 -273 -78 282 -304 66 250 -352 104 210 -369 197 154 -353
6265 -353 332 -11 -236 342 -175 -130 325 -216 -14 306 -291 -3 257 -329 114 220 -336 284 35 -295
6285 -295 303 -126 -184 297 -160 -128 265 -168 -117 262 -291 30 229 -325 187 96 -296 267 5 -240 268
6306 268 -25 -157 265 -80 -148 285 -212 -34 312 -285 116 180 -303 185 68 -228 179 56 -216 228 -16
6327 -16 -209 245 -164 -125 315 -256 38 226 -275 81 93 -206 127 76 -194 149 30 -218 226 -94 -165 302
6349 302 -145 -38 201 -188 47 135 -142 80 132 -176 85 105 -222 197 -18 -151 228 -96 -38 147 -122
6370 -122 -33 80 -143 -6 136 -146 68 122 -191 111 -6 -143 166 -36 -68 115 -97 -29 73 -62 -50 141
6392 141 -59 40 146 -141 63 95 -126 148 28 -58 97 -34 -40 48 -7 -47 147 -56 -60 151 -139 -44 67 -109
6416 -109 37 29 -40 34 22 -67 26 26 -80 110 28 -73 121 -47 -18 54 -67 33 27 -9 10 52 -29 9 90 -59 56
6443 56 45 -89 72 -43 9 40 -50 33 0 1 -3 1 -4 -72 47 -40 -25 23 -40 8 -41 -26 -14 -34 -4 -17 47 -55 13 62
6473 62 -58 49 48 -27 36 -16 26 -12 9 -19 23 50 -56 75 -22 -41 63 -30 13 29 -35 11 6 6 -16 11 -91 31
6501 31 71 -131 87 -12 -100 86 -58 -18 63 -32 18 56 -15 -29 95 -62 3 128 -128 104 35 -108 106 -29
6525 -29 -56 102 -10 -53 97 -16 -79 110 -79 -24 133 -121 40 51 -167 66 4 -79 90 -16 -110 74 4
6548 4 -125 120 -52 -54 195 -160 29 87 -178 66 46 -97 103 90 -101 94 51 -176 127 -2 -131 233 -97
6571 -97 -21 150 -162 -3 105 -158 49 82 -174 56 77 -206 83 -14 -185 208 -98 -114 195 -153 -63 127
6593 127 -146 -14 178 -140 11 145 -211 130 70 -194 247 -8 -124 189 -75 -87 184 -53 -62 195 -152
6614 -152 5 182 -243 63 124 -236 149 66 -196 166 -37 -164 157 -58 -116 230 -133 -97 233 -226 -20
6635 -20 194 -199 112 92 -172 180 5 -160 171 0 -180 272 -47 -172 276 -172 -86 238 -215 65 143
6656 143 -219 92 119 -232 105 89 -264 197 12 -246 243 -126 -137 263 -207 7 217 -215 26 169 -205
6677 -205 60 152 -238 147 61 -225 261 -26 -172 306 -126 -61 280 -153 -34 193 -169 17 219 -215 131
6698 131 141 -294 223 34 -262 261 -59 -172 217 -126 -144 204 -161 -77 251 -260 53 202 -315 139 100
6719 100 -258 170 12 -186 217 -47 -138 259 -115 -120 307 -194 -28 275 -254 74 173 -235 155 92 -198 197
6741 197 1 -225 246 -37 -225 308 -133 -121 231 -234 13 175 -237 117 93 -238 147 77 -262 175 65
6762 65 -245 260 -62 -131 286 -178 -40 241 -226 39 202 -181 75 199 -229 116 97 -233 214 -4 -171
6783 -171 275 -135 -83 222 -174 -43 178 -165 -51 184 -244 43 117 -257 177 28 -243 259 -63 -167 242
6804 242 -101 -90 187 -88 -43 228 -162 38 192 -260 131 152 -237 216 36 -165 195 -47 -114 151 -54
6825 -54 -108 219 -153 -73 239 -224 50 141 -221 106 45 -195 92 -6 -175 154 -18 -146 235 -112 -108 245 -162
6848 -162 16 181 -181 77 89 -138 106 42 -141 163 25 -169 217 -39 -167 202 -119 -42 178 -155 13
6869 13 112 -113 60 92 -153 88 85 -184 131 11 -165 178 -84 -75 174 -105 17 102 -108 33 107 -107 44
6892 44 120 -161 88 45 -149 164 -18 -56 134 -62 -42 108 -77 -53 111 -82 -12 115 -140 43 49 -161 85
6915 85 -24 -62 111 -28 -42 49 -15 -65 89 -41 -44 145 -72 6 67 -91 71 22 -58 76 3 -38 11 28 -55 82
6941 82 36 -52 99 -58 27 62 -110 65 8 -25 19 12 -59 -40 48 -54 -32 15 -68 50 -36 -24 23 -65 -30 3 -9 -10
6969 -10 -20 19 -41 56 -9 -6 55 -34 75 9 -7 24 -7 13 -40 61 -27 -8 87 -82 11 10 -53 34 -39 -17 22 -51 -27 -40
6999 -40 4 -62 25 -14 -64 60 -71 15 22 -77 36 5 -39 21 38 -62 17 40 -83 75 0 -68 105 -73 -8 74 -55
7026 -55 8 75 -18 -2 91 -66 -18 95 -105 100 52 -97 137 -69 -61 87 -59 -48 54 -33 -54 89 -71 -20 145
7051 145 -142 73 72 -119 114 8 -102 100 0 -64 138 1 -66 140 -34 -54 189 -149 45 134 -162 114
7073 114 56 -155 100 61 -113 91 16 -152 158 -49 -164 192 -142 -27 164 -162 15 94 -180 58 91 -157
7095 -157 83 76 -188 187 10 -167 237 -107 -95 230 -137 -2 162 -106 35 137 -140 87 158 -240 154
7116 154 37 -229 242 -67 -151 231 -127 -82 160 -177 -40 165 -193 38 176 -269 107 98 -270 208 19
7137 19 -179 266 -115 -83 195 -121 -71 212 -146 -10 249 -226 67 150 -272 199 43 -195 235 -32 -172
7158 -172 186 -67 -163 245 -123 -102 240 -202 -1 184 -303 148 94 -274 190 39 -216 171 5 -192 202
7179 202 -53 -125 286 -175 -49 282 -248 95 190 -228 174 108 -180 156 79 -204 226 -35 -200 328 -131
7200 -131 -132 279 -234 3 208 -224 75 119 -228 99 90 -278 193 43 -287 288 -85 -205 276 -174 -69 220
7222 220 -199 23 186 -214 63 197 -317 131 131 -298 269 13 -195 285 -117 -121 237 -165 -41 228 -226
7243 -226 -1 258 -282 109 191 -289 193 46 -253 253 -90 -176 241 -108 -139 217 -128 -85 246 -225 37
7264 37 228 -270 186 122 -268 207 25 -210 238 8 -154 225 -60 -136 291 -158 -8 262 -263 69 184
7285 184 -295 142 86 -202 139 27 -198 193 -52 -198 250 -170 -123 253 -236 13 188 -227 71 108 -181
7306 -181 128 101 -187 174 34 -207 239 -69 -120 268 -145 -33 175 -169 36 128 -168 51 113 -196 108
7327 108 67 -252 190 -31 -191 225 -101 -95 159 -130 -42 132 -166 23 147 -201 28 132 -265 134 36 -217
7349 -217 199 -54 -92 182 -89 -52 144 -83 -24 193 -125 -3 142 -187 109 67 -190 152 -12 -121 140
7370 140 -55 -79 92 -56 -108 142 -126 -64 154 -160 31 92 -141 92 27 -100 73 -17 -126 117 1 -92
7392 -92 136 -57 -34 193 -97 39 85 -107 75 36 -88 57 39 -88 52 32 -124 85 -3 -81 131 -99 -29
7415 -29 66 -120 46 18 -69 18 40 -94 -17 66 -111 61 -9 -74 113 -41 -21 89 -21 19 18 -17 13 59 -7 -3 92
7442 92 -50 59 23 -79 85 -54 -25 63 -27 0 29 1 -41 25 -34 -20 56 -78 29 23 -85 57 -21 -57 1 -23
7468 -23 -10 -13 -20 -40 26 -5 -43 62 -42 17 37 -33 64 -21 45 4 5 9 1 32 -12 40 -12 -32 53 -15 -33 24 -45 18 -54 15
7500 15 -30 5 52 -51 54 -45 -19 29 -49 10 14 -9 11 -3 24 -41 82 -15 2 89 -28 69 9 -12 79 -21 4 48
7528 48 20 2 50 22 -31 44 -52 -3 55 -78 46 27 -69 57 -2 -51 46 39 -63 2 12 -59 79 -24 -45 69 -51
7555 -51 31 45 -43 40 9 -13 25 57 -12 60 33 -68 49 -6 -50 102 -38 3 54 -80 15 28 -42 7 52 -59 6
7582 6 38 -108 80 18 -103 118 -71 -16 50 -60 -33 63 -25 -2 65 -56 -10 88 -94 79 47 -98 114 -18 -29
7607 -29 103 -11 -52 83 6 -63 130 -52 -29 84 -123 32 37 -122 101 18 -84 73 -33 -72 68 -6 -91 87
7631 87 -69 -73 132 -109 33 69 -87 59 55 -86 66 32 -87 69 24 -96 90 -22 -66 114 -69 -11 102
7654 102 -62 24 76 -87 45 64 -77 10 46 -107 98 -16 -111 101 -54 -53 75 -83 -18 47 -82 -3 40 -80
7678 -80 25 82 -102 71 66 -118 112 -11 -47 136 -26 -16 103 -40 -20 70 -52 -8 110 -82 50 26 -135
7701 -135 101 -1 -86 81 -33 -51 69 -78 -49 89 -50 -27 90 -80 11 67 -110 56 14 -102 91 16 -50
7724 -50 96 33 -80 105 1 -61 133 -81 18 70 -65 43 49 -80 67 53 -46 55 41 -94 69 -23 -86 107
7748 107 -72 -5 104 -82 16 51 -69 13 67 -67 3 52 -96 37 26 -74 113 -30 -52 107 -52 0 60 -60
7772 -60 10 71 -31 -4 67 -90 54 40 -81 76 13 -61 77 -13 -43 69 -17 -34 60 -39 -40 75 -89 29 59 -99
7798 -99 46 -2 -77 56 -14 -55 56 -12 -70 80 -11 -39 67 -20 -14 65 -31 33 51 -30 46 48 -45 36 33 -59 63 -14 -90
7827 -90 53 -28 -41 75 -69 16 29 -77 -17 -9 -51 21 19 -71 26 40 -55 64 -24 -25 81 -41 -14 46 -34 7 38 -20
7855 -20 9 69 -52 26 26 -55 67 45 -34 59 -24 -21 49 -48 -15 14 -39 -27 56 -37 13 29 -60 29 49 -75 39 -23 -40
7884 -40 16 3 -43 25 -3 -63 76 -11 10 76 -15 13 46 -27 69 25 -24 31 48 0 53 0 -15 68 -5 -19 55 -40 24 29
7914 29 -33 7 -2 -57 18 21 -30 12 13 -64 32 17 -45 63 -39 5 54 -18 3 49 -1 19 61 -13 9 57 -37 39 -8 -33 48
7945 48 3 10 45 5 -12 31 -27 0 56 -17 15 50 -32 46 -5 -29 25 12 -4 10 1 -11 16 -17 -38 36 -27 -20 46 -35 21 21
7977 21 -8 52 -3 -20 -2 -1 -3 -8 8 -26 53 1 -21 41 -15 41 46 -34 -2 17 -15 0 -16 -5 -7 -12 -27 5 -16 -25 5 -22 -20 18
8011 18 2 -2 12 25 18 1 6 4 12 7 23 18 8 28 -8 8 28 -2 19 15 -7 -6 -23 -49 -8 -2 -8 -4 -17 13 -4 -31 2 5 -15 7 -21
8048 -21 5 -9 -18 10 -12 8 19 -1 14 -11 11 -2 20 4 -15 27 -1 25 23 -14 14 19 7 18 -4 6 17 -8 -33 -25 9 -14
8080 -14 13 -7 -26 25 -34 11 -9 -1 13 41 -20 0 -12 -38 28 -5 -15 12 1 -33 27 -28 -2 47 -3 40 25 -30 54 62 -32
8111 -32 43 17 3 48 11 -16 34 -6 -19 18 -13 -23 25 -44 8 31 -64 1 7 -54 49 4 -56 43 -34 -28 44 -49 4 69 -54
8142 -54 3 66 -34 33 32 -29 65 -3 -24 76 -1 -38 37 -35 -18 67 -25 -23 43 -45 7 25 -58 26 -2 -89 43 -4 -56 67
8172 67 -25 -39 45 -37 -26 53 -68 -27 58 -66 51 27 -35 63 19 -53 67 34 -64
8191f4
$$ Imaginary data points
##PAGE= N=2
##DATA TABLE= (X++(I..I)), XYDATA
0 0 0 0 0 0 0 0 0 0 0 0 0 0 0 0 0 -8 8 -8 8 -9 16 -17 23 -25 33 -38 43 -52 60 -71 81 -92 107 -121 138 -155
36 -155 178 -201 225 -252 282 -314 353 -393 434 -482 531 -588 649 -715 790 -869 953 -1050
54 -1050 1155 -1269 1400 -1542 1703 -1882 2087 -2320 2581 -2879 3209 -3546 3794 -3561 819
69 819 25223 298646 -270291 -84017 289908 -247655 105969 179197 -253532 164694 17596
80 17596 -314081 271379 -14833 -225128 352277 -77477 -194565 251641 -197224 -71514
90 -71514 212719 -195612 101603 179007 -263349 131496 86612 -313980 172603 81344 -213009
101 -213009 238329 2958 -160392 172813 -154104 -80514 204734 -161378 40612 221231
111 221231 -217218 16631 138350 -243545 72060 116743 -163851 170733 22544 -162215
121 -162215 169824 -106929 -143186 219473 -92629 -59138 233431 -132204 -66616 142242
131 142242 -183836 24095 131575 -157914 141536 64323 -199392 149504 -25056 -188315
141 -188315 185031 -22091 -100960 202966 -80845 -81838 141447 -174187 -2396 160704 -166078
152 -166078 105072 120755 -206702 96653 25322 -185254 144438 10413 -101413 181813
162 181813 -66406 -92202 152371 -157959 -36249 174866 -146657 62069 138311 -176359
172 -176359 60876 32971 -168737 121873 24381 -100421 168081 -44018 -113257 139989
182 139989 -114653 -60144 159318 -104061 29952 122788 -137819 36544 36458 -146767 87866
193 87866 43631 -91642 131366 -5433 -114326 98878 -70387 -68191 129298 -61184 7404
204 7404 106253 -102886 4731 47097 -115534 43681 62014 -75622 85329 27344 -102473
215 -102473 63365 -36334 -76079 104402 -25924 -13459 97816 -70891 -27950 52173 -86610
226 -86610 10618 75694 -60963 50595 47279 -95420 40874 -9072 -83964 83687 683
237 683 -27897 89678 -42577 -48587 47213 -65946 -10738 81598 -43580 28218 54843 -87618
249 -87618 20484 8409 -77034 64563 15877 -31894 71792 -22137 -50999 37027 -46833
260 -46833 -22032 72028 -25248 15617 52133 -70827 2750 10348 -61120 47132 23627 -22957
272 -22957 50391 -11332 -45488 21251 -29084 -22758 54951 -8501 8642 42554 -49187 -9309
284 -9309 4174 -43442 29713 25614 -6657 30904 -4113 -35724 1177 -14426 -17074 36149 7717
297 7717 4482 26668 -27705 -16031 -4468 -23511 13955 21000 11298 13725 -444 -21899 -18807
310 -18807 -6043 -7654 18473 21371 6940 8612 -12561 -18078 -16095 -5065 6707 11522 26852
323 26852 2828 -3261 -5730 -31781 -6599 3819 3299 26693 17553 -6600 -4678 -13307 -31054
336 -31054 7461 9143 -1750 39433 -1340 -14802 10538 -36818 -12964 19594 -9247 21608
348 21608 31995 -20192 -1607 -140 -47746 13463 17348 -18341 50959 2579 -30846 24846
360 24846 -37925 -25715 36614 -15611 12024 48405 -31160 -4879 16520 -61606 13912 28903
372 28903 -34821 56983 12081 -46035 34924 -33593 -40728 49302 -16151 -546 62687 -36701
384 -36701 -13593 32389 -69313 9783 42625 -47618 55167 24038 -59434 39549 -22879 -55500
396 -55500 56813 -10702 -16165 74003 -34447 -27283 46480 -70837 -1658 58033 -54174 45949
408 45949 40404 -69798 35345 -5750 -70024 56512 3902 -34601 78452 -21928 -45772
419 -45772 57043 -62857 -20690 72807 -53419 27506 59682 -74980 21627 17997 -80811
430 -80811 47298 25316 -52438 75907 -3659 -65806 64975 -49469 -43266 87591 -48375
441 -48375 4139 80305 -76146 3320 41315 -89144 36443 45917 -69038 74588 14038
452 14038 -87001 73209 -35358 -67623 100499 -40041 -18524 96099 -74290 -11976 59184
463 59184 -95802 28982 64047 -84929 71755 33411 -105606 74070 -16202 -84849 102239
474 102239 -28120 -33400 101223 -69916 -23033 72294 -97753 15995 82479 -90056 54438
485 54438 52893 -107889 59143 540 -87039 92938 -17702 -42007 103167 -60233 -40822
496 -40822 82736 -85615 -9877 94202 -75189 29819 62265 -98144 43489 11288 -89442
507 -89442 87762 -1352 -61864 101671 -34212 -67155 82358 -55855 -34661 91475 -56320
518 -56320 13108 68214 -95697 31772 32786 -103197 73247 34690 -81402 81483 1962
529 1962 -82660 66887 -31256 -45978 91537 -50426 -4731 90333 -97615 3156 67668
540 67668 -104515 37164 65873 -77210 55686 19728 -83815 62430 -24160 -62262 108474
551 108474 -42397 -39013 112050 -81287 -32208 83837 -86389 13784 69850 -73317 53965
562 53965 26322 -99520 72215 -7447 -92686 114222 -14534 -65448 106841 -57865 -43828
573 -43828 76469 -78718 16202 73140 -86882 53949 48175 -117181 61063 23455 -103644
584 -103644 90114 9616 -62271 89285 -47859 -41383 74398 -79372 5502 89844 -82445
595 -82445 24833 67475 -101724 27310 37319 -82799 65465 12445 -55482 82995 -39222
606 -39222 -53661 80082 -59804 -26478 94156 -51174 -7276 67170 -74037 4604 37479
617 37479 -71614 55239 24688 -65970 74397 -11592 -73936 69477 -25095 -47190 80094
628 80094 -25442 -19995 64468 -63766 -6372 50038 -77222 38577 53328 -75485 50926
639 50926 20123 -81204 48385 216 -52186 69459 -14532 -31588 70916 -56206 -25119
650 -25119 67067 -71176 11340 70427 -66351 29039 32993 -76671 36153 9270 -56686
661 -56686 69075 -3412 -48013 73204 -40035 -43698 69802 -53167 -5978 68275 -54760
672 -54760 19526 36339 -72029 29647 16339 -61610 61823 11423 -53647 63276 -25227
683 -25227 -49200 61183 -39275 -10143 63690 -47691 9668 39310 -64254 17998 26043
694 26043 -56099 42940 21711 -47450 47483 -12357 -47113 47782 -26738 -14846 57608 -32475
706 -32475 -2987 37111 -48853 1452 29924 -41474 24301 27493 -39772 31108 725 -44696
718 -44696 34295 -11392 -21708 47199 -14039 -13140 31725 -32806 -12187 29990 -28618 10955
730 10955 32665 -34374 16571 10832 -42194 23892 1770 -25545 37040 -1922 -19120 28211
742 28211 -20771 -21159 28727 -20407 1175 36739 -27517 5723 15496 -38955 14706 10188 -23910
755 -23910 28481 4982 -21634 22317 -11103 -23485 24816 -13146 -5693 33881 -18692 144
767 144 15751 -32409 5989 11759 -17752 21060 9078 -18591 13109 -5889 -21035 18577 -5237
780 -5237 -6739 25957 -11701 -2643 12398 -22856 831 8505 -10978 13954 10103 -11198 5459
793 5459 -3626 -17242 10136 379 -3855 18327 -5487 -3892 6057 -14105 -1401 4632 -3727 7391
807 7391 8009 -3553 -337 -1895 -11769 1722 3233 -223 11365 271 -3210 -1076 -7644 -2234
821 -2234 797 3584 3477 3998 2206 -4688 -1646 -5110 -3832 3182 3003 5117 3594 624 -6275 -4430
837 -4430 -1967 -4478 8491 3944 22 6497 -6918 -4832 705 -5659 1537 7235 74 2391 5482
852 5482 -9715 -2427 1570 -10511 9931 6180 -4582 10747 -5846 -10182 4967 -6113 -1874
865 -1874 13120 -2391 -1250 10190 -13401 -2737 7707 -14957 9549 9255 -10417 13189 -1816
878 -1816 -15002 8282 -5373 -7624 17696 -2143 -4999 15083 -15561 -5931 13179 -17252 8130
891 8130 13664 -15271 12484 2656 -18917 10519 -2112 -13286 19722 -678 -9526 19472 -14991
904 -14991 -10342 17455 -18269 5228 18992 -18050 9565 7229 -22562 10532 3420 -17940 19780
917 19780 2283 -15304 22173 -11307 -15427 20983 -17507 -912 24153 -17616 4924 13153
929 13153 -25045 6402 10279 -21061 18052 8322 -21528 21448 -5407 -21317 23901 -12754
941 -12754 -9001 27416 -15461 -1902 19716 -24676 428 16813 -24013 14438 16109 -26450
953 -26450 19422 1067 -27998 24984 -6542 -15698 30109 -13211 -8986 25183 -23852 -4652
965 -4652 23560 -26797 9590 23149 -29904 17319 7621 -33054 24182 -1827 -20875 32615
977 32615 -10163 -15656 28959 -22005 -10627 29277 -25655 3263 27618 -30218 13165 12980 -34402
990 -34402 21743 2932 -25333 31743 -3898 -21356 28744 -15968 -17093 29819 -19984 -2251
1002 -2251 29095 -27905 7697 17551 -34123 16849 10197 -28186 25621 4590 -24208 24440
1014 24440 -8191 -20922 27361 -15021 -7186 31506 -24701 129 23165 -32130 8029 18073
1026 18073 -26735 17055 11069 -24919 19821 -1691 -24524 26925 -9241 -15719 33947 -17525
1038 -17525 -10216 26946 -25406 -2004 21906 -22872 10439 16186 -26534 16034 6230 -30412
1050 -30412 24840 870 -24452 31451 -7586 -17587 26391 -18749 -7818 24046 -21928 5248
1062 5248 23000 -28719 10179 15509 -33389 18583 9521 -26595 26643 -2739 -19773 26347
1074 26347 -16622 -11503 28202 -21626 -1603 28805 -27061 3083 20421 -30957 12984 12048
1086 12048 -25472 24575 -811 -22041 26883 -12782 -16820 29072 -15567 -8330 27804 -20313
1098 -20313 -1806 19538 -26110 9541 12805 -24868 21122 4359 -24062 22086 -4193 -19760
1110 -19760 22816 -6588 -10999 22538 -13742 -4955 18547 -21872 4385 16466 -22743 12644
1122 12644 10981 -22053 13199 2917 -18388 16035 -1198 -12158 19943 -9253 -9637 19993
1134 19993 -17052 -3385 19864 -17830 4063 14394 -18442 7085 6661 -17844 12917 3122
1146 3122 -15695 18856 -3358 -15456 19829 -10487 -9545 19962 -12808 -913 15640 -16531
1158 -16531 3437 10332 -18713 9677 8667 -18278 15223 2513 -17962 16941 -5466 -11757
1170 -11757 18730 -9955 -3785 16678 -14996 -171 13176 -17457 5433 11657 -17100 11313
1182 11313 5129 -17150 14299 -3235 -12212 17421 -7547 -5756 16199 -12058 -2957 12989 -14189
1195 -14189 2541 11640 -14560 8293 5964 -15538 11534 -867 -11935 14383 -4088 -6712
1207 -6712 13397 -7853 -4763 10918 -10069 -203 10940 -10973 4502 6964 -12912 7050 1969
1220 1969 -10478 9746 -203 -6818 9529 -3284 -6224 8532 -5638 -3335 10071 -6970 528
1233 528 7830 -9879 2675 4173 -8723 5756 2795 -6736 6389 133 -7312 6734 -2196 -5476
1247 -5476 9156 -4097 -2237 8192 -7498 -229 5334 -7500 3159 4663 -6385 4182 2187
1260 2187 -7657 5176 122 -6324 8000 -2149 -3717 7707 -5405 -1697 5485 -6053 1156
1273 1156 5051 -5175 2462 3184 -6803 3310 1288 -5835 6291 -624 -3805 5969 -3676 -2073
1287 -2073 4420 -3983 115 4067 -3488 1045 2987 -4859 1691 1476 -4505 4191 252 -2736 4008
1302 4008 -2328 -1769 2654 -2165 -64 2639 -1634 52 1996 -2720 436 1315 -2749 2163 502
1317 502 -1426 2134 -1109 -1006 691 -702 -40 1103 183 -560 759 -912 -595 860 -915 677
1333 677 378 -291 469 -437 106 -731 128 331 -367 1290 -389 -345 281 -882 11 412 254 -153 801
1352 801 -465 -819 1245 -1405 237 1182 -1519 1292 386 -1252 857 -269 -1205 1005 492 -1112
1368 -1112 1805 -439 -1829 2124 -1642 -376 2500 -2074 642 1390 -2258 793 998 -2201 1234
1383 1234 1196 -2494 2341 288 -2931 2965 -1467 -1661 3581 -2021 -206 2622 -2861 2 2265 -2872
1399 -2872 1027 2333 -3579 2242 1199 -3958 3415 -732 -2916 4107 -1679 -1321 3621 -2760 -1001
1414 -1001 3217 -3230 349 3562 -4106 1699 2126 -4831 3376 422 -3817 4245 -1032 -2615 4236
1429 4236 -2020 -2112 4062 -3112 -877 4647 -4077 826 3448 -5432 2466 1849 -4668 4001 408 -4017
1445 -4017 4168 -859 -3496 4792 -2212 -2590 5507 -3759 -653 5047 -5409 1153 3326 -5491 3173
1460 3173 2177 -5024 3882 487 -5057 5066 -965 -4068 6249 -3268 -2251 6151 -5194 103
1474 103 4737 -5978 2194 3492 -5800 3685 1795 -6134 5014 -50 -5165 6740 -2534 -3472 6732
1489 6732 -4860 -963 5832 -5887 1100 4444 -6170 2859 3116 -6491 4423 1027 -6027 6332
1503 6332 -1270 -4440 6756 -3816 -2415 6221 -4840 -282 5233 -5662 1253 4233 -6266 3233
1517 3233 2540 -6545 5156 344 -5326 6258 -2054 -3748 6020 -3487 -1872 5802 -4612 -456
1531 -456 5163 -5899 1703 4215 -6608 3763 1934 -6196 5374 -145 -4869 5838 -2020 -3688
1545 -3688 6201 -3378 -2267 6307 -5311 -311 5664 -6478 2250 3819 -6873 4120 1770 -6048
1559 -6048 5483 -103 -5377 6269 -2034 -4154 7177 -4221 -2170 6870 -6182 605 5496 -7010
1573 -7010 2898 3361 -6878 4772 1529 -6355 6037 -841 -5470 7332 -3214 -3262 7464 -5744
1587 -5744 -607 6238 -6838 2006 4379 -7081 3814 2574 -6743 5506 298 -6107 6830 -2212
1601 -2212 -4054 7373 -4615 -1717 6289 -6016 781 5013 -6303 2505 3375 -6489 4140 1694
1615 1694 -6188 5646 -616 -4919 6510 -2679 -2888 5970 -4283 -1096 5228 -4823 634 4352
1629 4352 -5665 2099 3073 -5931 4044 1200 -5365 5261 -936 -3967 5605 -2555 -2681 5386 -3585
1644 -3585 -1201 5255 -4771 315 4315 -5798 2518 2845 -5698 4174 622 -4979 5031 -962
1658 -962 -3833 5431 -2404 -2705 5708 -3999 -992 5281 -5578 1246 4069 -5947 3278 2148 -5673
1673 -5673 4251 388 -4681 5185 -1222 -3693 5717 -3223 -2038 5720 -4875 189 4611 -5590
1687 -5590 2274 2820 -5408 3461 1028 -4817 4584 -343 -3969 5276 -2374 -2694 5374 -3875 -412
1702 -412 4454 -4717 1355 2818 -4711 2597 1470 -4331 3563 320 -3738 4330 -1380 -2858 4464
1717 4464 -2806 -934 4021 -3496 468 2717 -3730 1286 1990 -3476 2185 1189 -3476 2956 -98
1732 -98 -2946 3427 -1418 -1680 3446 -2066 -618 2747 -2660 -101 2419 -2764 918 2112 -3165 1804
1748 1804 905 -3184 2683 -276 -2228 3049 -1069 -1394 2702 -1812 -960 2599 -2292 130 2609 -2917
1764 -2917 1161 1400 -3291 2109 307 -2357 2733 -504 -1771 2541 -1297 -1309 2591 -1894 -319 2654
1780 2654 -2557 747 1598 -2993 1657 535 -2159 2260 -133 -1613 1982 -875 -1360 2146 -1318
1795 -1318 -481 2240 -1955 412 1366 -2282 1080 449 -1589 1583 75 -1077 1248 -476 -1106 1354
1811 1354 -707 -414 1624 -1194 183 869 -1479 631 240 -840 852 118 -473 503 -98 -718 532
1828 532 -177 -332 980 -436 -13 368 -741 167 33 -102 261 192 13 -188 173 -376 -62 271 -245
1847 -245 399 86 -88 -41 -180 -62 -251 448 -83 74 483 -595 153 15 -465 386 65 -58 276 146
1867 146 -488 156 49 -696 811 -101 -372 956 -727 -148 487 -789 225 597 -478 244 610 -1062
1885 -1062 282 396 -1272 1146 129 -919 1490 -704 -711 1078 -955 -233 1283 -832 -2 1290
1901 1290 -1578 246 1057 -1957 1371 571 -1658 1830 -438 -1409 1606 -895 -825 1966 -997 -471
1917 -471 2010 -2004 -19 1690 -2491 1348 1135 -2288 2067 -30 -2112 2006 -671 -1473 2583 -980
1933 -980 -1049 2660 -2235 -443 2389 -2907 1116 1869 -2846 1977 588 -2810 2167 -131 -2283 2941
1949 2941 -579 -1860 3296 -2120 -1272 3163 -3087 502 2818 -3234 1524 1499 -3503 1990 742 -3176
1965 -3176 3095 95 -2832 3779 -1683 -2242 3916 -3001 -361 3737 -3426 933 2480 -4076 1660
1980 1660 1628 -3928 3214 826 -3755 4132 -1270 -3141 4484 -2805 -1157 4429 -3566 412 3307
1995 3307 -4477 1323 2396 -4593 3110 1599 -4454 4234 -666 -3896 4742 -2404 -1861 4952 -3375
2010 -3375 -380 4078 -4452 495 3311 -4833 2362 2564 -4801 3874 219 -4574 4670 -1602 -2830
2025 -2830 5250 -2626 -1598 4592 -3875 -684 4065 -4592 1392 3455 -5054 3317 1361 -5323 4329
2040 4329 -484 -3906 5181 -1425 -2694 4847 -3176 -1754 4666 -4398 554 4530 -5453 2387 2766
2055 2766 -5976 3613 983 -4827 4769 -301 -3612 5079 -2484 -2954 5500 -4148 -845 5966 -5404
2070 -5404 1012 4135 -6164 2649 2173 -5312 4429 605 -4736 5510 -1589 -4433 6328 -3406
2084 -3406 -2470 6705 -4770 -24 4789 -6164 2108 2895 -5890 4407 1590 -5847 5463 -464
2098 -464 -5476 6252 -2463 -3186 6632 -4393 -444 5234 -6301 1619 3795 -6363 3715 2912
2112 2912 -6112 4531 611 -5689 5576 -1659 -3506 6565 -4009 -1343 5862 -5788 182 4773
2126 4773 -5799 1942 3932 -5573 3183 1540 -5797 4854 -585 -4318 6552 -2528 -3056 5962
2140 5962 -4162 -1613 5149 -4431 436 4411 -5164 2201 2683 -6340 4148 1053 -5575 5967
2154 5967 -583 -4272 5494 -2729 -2838 5215 -3597 -564 5285 -5234 1022 4206 -6725 3010 2726
2169 2726 -6104 4927 709 -4845 5256 -1907 -3808 5689 -3174 -1879 6464 -4830 -601 5360
2183 5360 -6473 1600 3838 -6056 4153 1615 -5377 4981 -869 -4789 5739 -2171 -3143 6700
2197 6700 -3764 -1637 5545 -5923 744 4255 -5815 3573 2442 -5651 4211 192 -5207 5030
2211 5030 -945 -3675 6010 -2723 -2144 5354 -5066 -71 4310 -5171 2552 3058 -5055 2981 959
2226 959 -5013 3872 175 -3736 5159 -1550 -2854 4876 -3715 -1208 4307 -3983 1010 3552 -4013
2241 -4013 1446 1922 -4550 2330 1417 -3803 4136 -4 -3536 4071 -2241 -2302 4176 -2566 -387 3798
2257 3798 -3087 43 2693 -4053 961 2410 -3826 3055 1275 -3896 3383 -1111 -3040 3756 -1513
2272 -1513 -1165 3810 -2302 -935 3013 -3525 143 2941 -3621 2216 1945 -3791 2783 -382 -3287
2287 -3287 3173 -785 -1499 3505 -1507 -1463 2771 -2824 -439 3018 -2983 1462 2034 -3292 2021 119
2303 119 -2847 2353 -268 -1445 2735 -665 -1502 2137 -1969 -907 2547 -1974 904 1844 -2455 1080
2319 1080 193 -1999 1391 175 -918 1655 1 -1245 1236 -1016 -1039 1701 -999 495 1415 -1323
2335 -1323 313 -61 -1117 462 455 -190 604 464 -970 252 -187 -976 908 -139 85 851 -332 -197
2353 -197 -300 -323 -325 470 531 -154 748 -510 -619 227 -683 262 512 160 171 247 -313 -781 439 -645 47
2374 47 1211 -562 645 171 -1157 121 -131 -354 683 679 -547 499 -46 -1498 990 -431 -587
2391 -587 1794 -678 -6 956 -1423 -290 656 -976 436 1599 -1220 578 615 -2450 1232 104
2407 104 -1419 2451 -419 -904 1682 -1422 -1022 1635 -1267 -100 2501 -1826 384 1569 -3288 1229
2423 1229 819 -2395 2843 175 -1898 2278 -1250 -1958 2454 -1284 -806 3436 -2220 -134 2530 -3821
2439 -3821 1004 1623 -3188 2870 905 -2722 2623 -759 -2959 3022 -1046 -1628 4273 -2221 -917
2454 -917 3419 -4152 510 2664 -3772 2534 1889 -3511 2625 196 -3990 3241 -367 -2818 4949
2469 4949 -1767 -2057 4339 -4109 -634 3797 -4034 1685 3137 -4258 2187 1438 -5013 3255 662
2484 662 -4069 5300 -948 -3297 5092 -3719 -1801 4754 -4103 819 4367 -4713 1514 2623 -5802
2499 -5802 2931 1815 -5032 5333 -152 -4347 5503 -3170 -2915 5513 -3938 -341 5443 -4693 501
2514 501 3800 -6088 2147 2941 -5649 4981 967 -5360 5584 -2059 -4265 5980 -2922 -1884 6123
2529 6123 -3953 -895 4751 -5913 1018 4177 -6109 4124 2626 -6411 4965 -303 -5562 5603
2543 5603 -1338 -3247 6186 -3041 -2214 5618 -5553 -402 5681 -6326 2595 4390 -6724 3649
2557 3649 1346 -6122 4970 -168 -4228 6442 -2181 -3876 6589 -4750 -2398 6978 -5618 669
2571 669 5591 -6430 2430 2536 -6678 4555 1262 -5774 6564 -412 -5897 6803 -3027 -4275
2585 -4275 7317 -4433 -677 6293 -6431 1541 3998 -7528 3709 3382 -6996 5530 1698
2598 1698 -6894 5949 -1564 -4930 7169 -3905 -1504 7201 -6410 71 5626 -7427 1846 4924
2612 4924 -6545 3883 2608 -6649 5277 -1005 -5486 7475 -3100 -3050 7844 -5038 -2040 6040
2626 6040 -5802 110 5171 -5519 2864 3179 -6805 4703 485 -6720 6854 -779 -4695 6926
2640 6926 -2626 -3410 5330 -4222 -1034 5452 -5078 1585 4749 -7090 2885 2838 -7132 4794 1539
2655 1539 -5011 5467 -1038 -4012 5053 -3327 -2352 6336 -4337 -477 6180 -6283 613 4097
2669 4097 -6407 3197 2469 -4972 4872 -148 -4959 5172 -2092 -4052 6655 -2856 -2212 6432 -5040
2684 -5040 -672 4447 -5981 2382 3312 -5383 4254 1313 -5927 4558 -390 -5044 6019 -1385
2698 -1385 -3040 6179 -4142 -1482 4767 -5662 1358 4273 -5261 3018 2564 -5852 3271 755 -5083
2713 -5083 5081 -483 -3376 5770 -3278 -2202 4854 -4735 156 4498 -4287 1710 2991 -5013 2083
2728 2083 1267 -4667 4119 344 -3525 4972 -2122 -2818 4289 -3356 -758 4185 -3105 574 3121
2743 3121 -4057 905 1953 -4270 2868 1481 -3504 3849 -683 -3287 3376 -1895 -1613 3836 -1816
2758 -1816 -591 3227 -3174 -350 2627 -3710 1540 2411 -3396 2756 496 -3543 2648 -744 -2221
2773 -2221 3434 -805 -1413 3211 -2328 -1312 2911 -3058 664 2873 -3114 1889 1102 -3421 1988
2788 1988 -32 -2417 2913 -67 -1759 2902 -1644 -1838 2787 -2454 92 3000 -2631 1191 1312
2803 1312 -3052 1344 431 -2142 2225 440 -1759 2295 -928 -1949 2284 -1749 -291 2629 -1813
2818 -1813 661 1177 -2363 616 540 -1496 1490 749 -1378 1383 -421 -1727 1527 -925 -371 1971
2834 1971 -956 292 755 -1484 2 329 -724 711 946 -713 537 -53 -1397 670 -308 -266 1250
2851 1250 -231 53 233 -641 -416 100 -40 106 897 -136 -112 173 -1021 -22 103 -45 667 303 17
2870 17 -306 -147 -557 -201 537 -197 697 360 -467 146 -515 -406 123 322 201 436 388 -779 62 -366
2890 -366 -684 887 -86 229 764 -510 -284 5 -568 -265 806 -160 212 920 -1141 41 87 -1247
2908 -1247 973 341 -332 1050 -261 -894 453 -478 -737 1417 -275 -222 1534 -1450 -195 800 -1722
2925 -1722 856 881 -977 1240 227 -1574 733 -211 -1422 1883 -116 -819 2088 -1554 -662 1439
2941 1439 -1976 530 1483 -1482 1079 819 -2063 861 246 -2009 2097 131 -1391 2531 -1412 -1201
2957 -1201 1921 -1970 114 2058 -1640 669 1374 -2383 697 844 -2489 2022 593 -1979 2659
2972 2659 -932 -1839 2250 -1719 -583 2540 -1565 85 2026 -2576 212 1627 -2804 1720 1316
2987 1316 -2575 2515 -270 -2476 2437 -1217 -1362 2899 -1271 -653 2612 -2449 -452 2245 -2907
3002 -2907 1282 1980 -2904 2207 317 -2979 2422 -570 -1947 3024 -855 -1335 2885 -2101 -1015
3017 -1015 2641 -2853 746 2559 -3054 1781 999 -3319 2071 151 -2379 2850 -246 -1923 2899
3032 2899 -1689 -1587 3037 -2549 -62 3124 -2943 970 1762 -3328 1397 923 -2612 2495 461 -2461
3048 -2461 2874 -1054 -2479 3311 -1856 -1002 3458 -2365 46 2196 -3046 808 1472 -2824 2118
3063 2118 1275 -3019 2556 -53 -3175 3022 -933 -1634 3405 -1842 -509 2511 -2984 228 2289
3078 2289 -3007 1314 2263 -3271 1782 895 -3398 2522 -359 -2015 3527 -1505 -1228 3106 -2714 -896
3094 -896 3030 -2602 275 2896 -2990 1122 1317 -3499 2428 126 -2703 3623 -745 -2230 3209
3109 3209 -1732 -1788 2986 -1882 -265 2894 -2744 854 1713 -3770 2120 1033 -3170 3010 299 -2544
3125 -2544 2504 -921 -1876 2565 -1559 -497 3093 -2618 234 2412 -3596 999 1868 -2807 1920
3140 1920 903 -2269 1904 -504 -2098 2555 -1039 -1363 3350 -1859 -992 2741 -2658 -126 2053
3155 2053 -2272 1220 1272 -2319 1592 260 -2703 2326 67 -2233 3012 -705 -1763 2498 -1825
3170 -1825 -628 2125 -2012 723 1881 -2456 939 1217 -2910 1511 998 -2357 2321 -51 -1915
3185 -1915 2261 -1488 -1017 2403 -1771 -44 2365 -2149 69 1757 -2544 822 1379 -2236 1961
3200 1961 296 -2149 2198 -927 -1552 2469 -1132 -711 2357 -1556 -534 1811 -2084 386 1586
3215 1586 -2197 1538 738 -2281 1793 -270 -1817 2025 -433 -987 1987 -986 -847 1679 -1693 -57
3231 -57 1763 -1827 893 1090 -2019 1069 215 -1611 1387 57 -1016 1529 -446 -1059 1444 -1080
3247 -1080 -507 1726 -1254 266 1242 -1587 456 503 -1369 843 533 -1017 1070 107 -1292 1151
3263 1151 -470 -882 1583 -706 -223 1282 -1159 -104 764 -1097 352 895 -951 661 502 -1382
3279 -1382 792 -4 -1071 1371 -300 -517 1168 -825 -389 791 -861 48 986 -766 335 701
3295 701 -1260 513 211 -1062 1119 -8 -565 978 -527 -505 675 -575 -141 892 -550 126 686
3312 686 -1012 247 304 -901 792 180 -469 706 -322 -491 431 -310 -224 726 -259 -87 609 -736
3330 -736 9 328 -629 513 198 -298 400 -127 -381 164 -67 -204 460 30 -140 392 -420 -125 217 -344
3350 -344 237 193 -74 119 -79 -266 -98 44 -143 240 183 -182 216 -186 -229 119 -143 132 177 60 -22 -53
3372 -53 -90 -235 145 -32 77 289 -124 60 -108 -182 -26 -9 122 49 175 -45 -122 47 -248 79 30 3 216
3395 216 -15 -33 -110 -92 -121 -12 199 -75 187 11 -267 133 -232 -70 203 -54 58 144 -91 -200 78 -154
3417 -154 -44 371 -225 192 176 -403 145 -84 -213 297 61 -118 252 -52 -353 293 -192 -170 546 -295 62
3438 62 332 -567 158 107 -398 356 182 -291 339 2 -539 412 -154 -332 709 -302 -67 539 -614 26
3458 26 326 -523 282 358 -465 330 160 -677 466 -5 -533 834 -218 -289 676 -564 -177 499 -519
3477 -519 111 550 -562 228 371 -838 405 196 -713 783 -26 -507 739 -434 -430 667 -444 -136
3495 -136 771 -579 -12 630 -920 236 500 -899 709 219 -785 735 -208 -678 795 -304 -395
3512 -395 959 -446 -306 862 -889 -25 783 -959 544 500 -940 634 110 -902 758 -42 -652
3529 -652 1002 -284 -540 1015 -756 -285 975 -924 233 825 -1031 427 388 -1037 609 270 -895
3546 -895 983 -25 -890 1098 -552 -637 1193 -755 -150 1072 -937 117 709 -1091 415 563 -1108
3563 -1108 834 338 -1179 1029 -140 -990 1244 -515 -480 1185 -831 -201 951 -1092 136 961
3579 961 -1227 510 739 -1327 791 184 -1152 1189 -196 -756 1293 -651 -614 1240 -940 -291 1256
3596 1256 -1058 146 1022 -1336 566 500 -1362 1113 137 -1144 1297 -321 -1018 1237 -618 -620 1370
3613 1370 -881 -157 1239 -1367 319 876 -1507 858 606 -1311 1063 156 -1197 1106 -311 -828
3629 -828 1428 -713 -473 1452 -1236 -97 1209 -1383 436 903 -1250 717 376 -1268 956 -8
3645 -8 -1122 1394 -394 -885 1508 -880 -591 1321 -1115 46 1098 -1175 469 690 -1421 757
3661 757 453 -1404 1210 159 -1190 1355 -453 -861 1315 -878 -280 1310 -1115 75 1095 -1440
3677 -1440 338 906 -1450 868 584 -1355 1200 -154 -1103 1352 -626 -672 1481 -886 -331 1304
3693 1304 -1231 -56 1106 -1344 578 790 -1394 1051 139 -1343 1265 -246 -909 1424 -528 -649
3709 -649 1330 -950 -320 1224 -1225 317 1047 -1422 744 505 -1431 1007 73 -1097 1257 -223
3725 -223 -867 1246 -698 -584 1327 -1042 -39 1197 -1307 399 745 -1341 712 393 -1122 968
3741 968 81 -982 1102 -344 -834 1257 -699 -343 1246 -1044 39 896 -1189 367 645 -1046
3757 -1046 672 380 -1043 877 -22 -1019 1106 -326 -617 1198 -707 -277 946 -976 54 800
3773 800 -914 377 648 -1052 575 291 -1061 889 -35 -812 1078 -405 -539 943 -705 -248 898
3790 898 -720 98 804 -987 285 495 -1062 686 262 -854 913 -148 -643 808 -466 -409 835
3807 835 -518 -145 854 -784 33 598 -962 431 404 -779 689 11 -671 629 -235 -452 717 -280
3825 -280 -270 757 -554 -136 628 -740 186 462 -656 449 150 -575 433 -80 -448 549 -31 -318
3843 -318 588 -292 -259 471 -489 37 442 -417 228 202 -408 164 64 -363 228 117 -302 374 -64 -316 321
3864 321 -245 -91 336 -176 64 148 -219 -43 98 -185 26 247 -190 172 98 -281 175 -82 -121 176 -2
3885 -2 -18 80 -37 -134 66 -21 -92 244 -67 -11 100 -208 -48 -3 -50 20 109 -7 -36 110 -148 -55 156 -157 124
3910 124 107 -109 51 2 -142 4 103 -126 146 142 -294 241 -66 -279 294 -142 -31 303 -130 -107 163 -244
3932 -244 -111 335 -295 106 333 -477 219 105 -452 374 -3 -281 413 -91 -261 370 -273 -252 523 -381
3952 -381 -15 532 -595 161 278 -680 418 141 -482 527 -13 -525 518 -225 -438 713 -396 -215
3970 -215 790 -671 46 510 -773 346 334 -678 491 162 -701 582 -44 -663 837 -294 -434
3987 -434 898 -672 -155 688 -807 196 568 -755 402 409 -890 521 192 -875 922 -134 -660
4004 -660 1029 -547 -402 890 -777 -49 804 -815 226 678 -1024 428 408 -1077 834 111 -861
4021 -861 1072 -347 -679 1002 -656 -326 1011 -782 -31 939 -1048 214 667 -1179 692 395 -1078
4038 -1078 1017 -84 -905 1040 -454 -624 1109 -611 -305 1106 -992 -46 957 -1235 503 696
4054 696 -1198 872 236 -1096 987 -189 -861 1184 -438 -636 1228 -861 -365 1157 -1184 194
4070 194 939 -1242 669 512 -1265 862 159 -1117 1128 -94 -926 1300 -574 -652 1305 -1043 -93
4087 -93 1174 -1215 408 858 -1307 615 498 -1246 959 207 -1073 1209 -301 -927 1383 -828
4103 -828 -448 1369 -1091 17 1046 -1249 315 762 -1287 729 483 -1306 1126 10 -1195 1364
4119 1364 -508 -770 1445 -858 -332 1175 -1108 36 1019 -1282 484 807 -1409 903 367 -1380
4135 -1380 1203 -148 -990 1312 -574 -556 1226 -900 -206 1190 -1154 125 1055 -1322 556 609 -1353
4152 -1353 899 126 -1082 1166 -272 -798 1215 -610 -605 1233 -838 -234 1173 -1117 225 821 -1282
4169 -1282 682 448 -1169 1001 88 -1028 1042 -221 -880 1159 -531 -551 1232 -911 -111 987
4185 987 -1228 352 707 -1184 678 444 -1087 842 92 -1010 1035 -247 -726 1231 -690 -388
4201 -388 1079 -1026 24 912 -1026 389 631 -1033 605 330 -1064 877 14 -879 1129 -393
4217 -393 -618 1109 -744 -228 922 -867 161 739 -930 358 510 -1031 673 238 -934 962
4233 962 -160 -726 967 -513 -408 874 -650 -87 794 -760 98 639 -908 380 417 -895 700
4250 700 98 -739 788 -263 -490 795 -397 -257 762 -561 -144 680 -720 116 559 -775 468
4267 468 284 -702 580 -17 -573 597 -137 -410 662 -331 -336 643 -550 -101 650 -626 246 383 -653
4286 -653 383 147 -558 438 34 -507 542 -111 -454 615 -327 -222 594 -495 40 499 -566 197
4304 197 284 -532 327 183 -505 390 53 -450 485 -184 -313 546 -348 -93 425 -426 64 298 -396 147
4324 147 236 -410 263 136 -450 364 -91 -324 410 -226 -140 385 -263 10 250 -288 30 251 -302 106 193
4345 193 -352 247 6 -323 302 -101 -154 231 -155 -86 170 -133 -51 211 -142 5 197 -230 121 60 -213
4366 -213 187 -5 -94 155 -21 -130 96 -14 -87 172 -74 -65 137 -135 14 97 -120 57 45 -78 26 31 -80
4389 -80 6 91 -96 76 7 -98 107 -50 -53 67 -31 26 4 7 -46 13 -33 -67 54 -39 -1 54 -67 58 5 -4 -13 -10
4417 -10 14 -26 76 -72 -14 45 -69 46 40 -40 59 -19 -28 40 7 -93 53 49 -67 108 14 -76 115 -130 -54 100
4443 100 -71 26 80 -81 -15 82 -142 58 102 -182 164 -5 -181 183 -97 -79 161 -73 -30 187 -118 -62 179
4466 179 -193 18 192 -252 163 79 -229 207 -22 -186 203 -71 -129 211 -162 -138 229 -167 -29 280 -266
4487 -266 58 142 -294 163 64 -259 214 13 -189 236 -75 -197 282 -151 -106 304 -264 0 252 -298 120
4508 120 191 -288 187 115 -264 212 45 -304 265 -77 -268 359 -231 -135 340 -305 -26 254 -317 70 168
4529 168 -341 137 155 -350 275 56 -332 348 -98 -224 368 -221 -105 336 -267 -42 308 -325 66 297
4549 297 -375 203 190 -419 339 43 -317 382 -123 -210 358 -205 -163 386 -279 -69 349 -423 74 287 -451
4570 -451 243 129 -407 366 -23 -353 400 -79 -285 429 -220 -221 447 -345 -50 435 -421 136 285 -466 242
4591 242 150 -421 338 46 -388 430 -120 -320 487 -276 -195 478 -419 0 398 -443 99 261 -456 225 183
4612 183 -468 359 40 -451 471 -167 -304 504 -319 -147 484 -418 0 413 -461 131 294 -507 284 216
4632 216 -531 424 10 -431 504 -170 -319 533 -328 -88 474 -412 -11 426 -478 167 304 -535 325 133
4652 133 -513 489 -38 -395 532 -183 -264 486 -307 -169 510 -463 10 443 -523 195 290 -537 371 85
4672 85 -462 450 -34 -366 502 -179 -306 561 -323 -174 510 -492 66 421 -546 238 277 -508 355 99
4692 99 -502 455 -10 -425 524 -220 -308 598 -391 -105 495 -495 109 386 -525 205 268 -535 364 120 -507
4713 -507 508 -62 -401 605 -270 -220 559 -426 -29 477 -485 108 367 -522 248 258 -528 408 35 -507
4733 -507 565 -157 -354 528 -296 -165 494 -385 -59 439 -484 87 368 -560 308 184 -534 422 -25 -395
4753 -395 500 -163 -244 514 -266 -190 439 -373 -62 457 -473 139 323 -527 361 119 -457 394 -23 -335 443
4774 443 -126 -286 446 -233 -179 445 -411 4 390 -476 190 231 -449 292 114 -384 350 2 -357 452 -126
4795 -126 -250 468 -289 -104 417 -405 103 280 -405 175 193 -401 233 146 -385 366 -29 -348 440 -201 -211
4816 -211 423 -275 -18 331 -319 75 211 -362 181 161 -386 241 85 -356 321 -79 -252 374 -199 -101 316
4837 316 -220 -23 250 -250 43 191 -305 171 153 -334 266 -14 -244 289 -137 -132 259 -150 -65 184 -182
4858 -182 -49 190 -226 73 145 -267 142 62 -204 173 -62 -121 154 -38 -100 123 -92 -97 198 -124 10 163
4880 163 -150 69 93 -177 109 20 -104 84 28 -79 103 23 -125 86 -57 -95 156 -84 10 56 -92 65
4902 65 6 -46 13 63 -71 -14 70 -97 48 2 -80 90 -34 3 47 -55 -20 -3 12 -27 37 20 -44 88 -26 -41
4928 -41 30 -40 12 6 -10 -35 37 -39 -45 88 -37 32 73 -88 55 6 -76 29 5 -72 44 53 -138 86 19 -139 174
4955 174 -69 -70 145 -110 40 93 -110 6 107 -135 50 105 -186 116 49 -192 225 -42 -130 203 -139 -68
4977 -68 170 -150 -30 177 -186 44 195 -265 128 116 -266 243 -52 -230 289 -118 -151 235 -132 -77 264
4998 264 -205 -26 264 -279 119 200 -358 247 85 -291 294 -84 -203 282 -119 -173 327 -155 -133 369 -322
5019 -322 13 271 -418 188 161 -334 299 25 -310 296 -23 -289 369 -136 -235 412 -328 -53 374 -390 132
5040 132 244 -390 229 134 -385 251 50 -349 416 -27 -317 497 -282 -193 469 -410 21 351 -417 118 267
5061 267 -437 174 171 -464 390 59 -447 484 -148 -316 496 -340 -108 417 -393 42 340 -462 119 288 -553
5082 -553 310 183 -512 488 -65 -386 530 -261 -188 508 -356 -58 460 -435 27 400 -525 224 277 -588
5102 -588 442 53 -480 500 -179 -324 517 -281 -197 515 -388 -144 477 -523 127 364 -616 364 137 -572
5122 -572 447 -42 -414 504 -144 -302 550 -307 -217 534 -476 27 480 -581 266 285 -604 376 71 -487
5142 -487 452 -64 -400 523 -223 -298 586 -419 -98 544 -551 139 382 -559 260 156 -469 386 48 -457
5162 -457 503 -100 -405 578 -301 -208 564 -420 36 432 -508 186 285 -494 338 181 -504 435 32 -451 534
5183 534 -181 -296 549 -365 -79 457 -512 68 337 -503 180 274 -509 338 152 -517 459 -87 -383 562
5203 562 -305 -177 519 -411 -59 405 -440 83 365 -445 233 208 -524 404 -7 -400 537 -173 -269 471 -272
5224 -272 -145 407 -362 -36 368 -446 109 260 -538 329 80 -444 422 -81 -295 436 -190 -176 407 -297
5244 -297 -77 401 -403 66 348 -514 275 172 -438 379 27 -339 367 -145 -238 370 -190 -176 431 -316 -10
5265 -10 354 -448 155 211 -400 280 64 -322 266 -49 -291 328 -118 -220 393 -222 -98 367 -375 64 238
5286 238 -300 194 115 -289 204 25 -296 274 -35 -251 385 -146 -143 312 -249 -25 244 -294 131 148 -269
5307 -269 164 102 -320 194 88 -258 300 -86 -191 309 -235 -61 265 -255 69 204 -251 75 124 -264 129
5328 129 103 -292 288 -42 -202 286 -152 -93 229 -181 32 179 -153 45 156 -252 77 102 -248 216 -17
5349 -17 -196 211 -121 -93 200 -117 -34 173 -123 -27 135 -225 37 109 -215 170 34 -199 189 -65 -86 149
5371 149 -69 -27 157 -47 -70 106 -115 9 106 -162 59 52 -96 107 -37 -66 86 -2 -44 87 -16 -93 96
5394 96 -80 -32 110 -105 57 56 -97 81 -5 -63 30 15 -12 34 14 -75 65 -38 -41 92 -54 5 54 -54 36 20
5420 20 -50 -17 37 -21 32 70 -53 70 4 -65 73 -13 13 60 13 9 -22 -11 -35 31 22 -17 54 -52 20 5 -53 -9 25
5449 25 16 16 33 1 -27 37 -45 25 52 -86 84 -31 -45 33 -29 -17 27 51 -36 40 7 -63 97 -81 -10 80 -75 64
5477 64 52 -79 3 28 -83 28 56 -124 78 1 -121 126 -78 -46 132 -126 2 69 -122 28 64 -101 45
5500 45 89 -145 117 7 -164 143 -73 -87 188 -72 4 105 -109 14 101 -124 73 135 -172 131 19 -164
5522 -164 186 -74 -85 161 -102 -43 151 -159 -45 148 -159 19 151 -209 100 90 -232 169 -8 -126 213
5543 213 -74 -64 205 -106 -101 191 -187 -4 228 -232 97 160 -243 163 51 -217 203 -23 -131 227 -77
5564 -77 -151 220 -175 -61 289 -229 30 193 -276 149 77 -247 240 8 -216 226 -56 -197 268 -131 -126 300
5586 300 -208 15 228 -309 103 127 -275 204 94 -238 259 14 -275 267 -120 -168 346 -200 -45 297 -325
5607 -325 69 206 -287 148 144 -278 196 74 -295 321 -68 -232 412 -190 -119 328 -291 4 243 -273 106
5628 106 195 -292 228 117 -345 296 -20 -303 404 -143 -173 336 -247 -66 269 -289 47 260 -335 161 216
5649 216 -434 282 62 -353 349 -88 -248 399 -213 -133 342 -309 -44 357 -330 102 324 -392 219 146 -382
5670 -382 348 -33 -290 375 -159 -182 359 -198 -113 371 -297 -1 303 -400 178 194 -404 296 24 -346 356
5691 356 -41 -315 351 -116 -223 406 -236 -84 371 -385 75 279 -488 250 188 -369 298 59 -323 303
5711 303 -49 -261 412 -213 -160 461 -360 5 358 -399 148 251 -377 224 114 -380 296 -12 -332 399
5731 399 -128 -252 449 -291 -109 386 -356 53 268 -328 149 158 -406 256 91 -401 381 -53 -311 409 -206
5752 -206 -193 416 -298 36 294 -309 103 235 -391 208 183 -384 349 36 -342 403 -141 -217 387 -228 -60
5773 -60 347 -320 -2 300 -384 68 251 -379 285 120 -360 302 -97 -231 326 -162 -149 343 -188 -82 330
5794 330 -284 -7 307 -320 171 169 -327 279 -11 -304 304 -64 -216 338 -102 -182 304 -205 -81 292 -282
5815 -282 53 209 -331 204 68 -313 228 33 -250 258 -54 -207 280 -122 -151 295 -292 26 252 -274
5835 -274 145 143 -278 180 66 -223 231 37 -241 252 -82 -200 315 -209 -38 287 -269 62 121 -288 83
5856 83 121 -194 160 68 -208 203 -63 -192 254 -155 -80 238 -185 32 142 -161 20 98 -157 104 119 -200
5878 -200 163 28 -191 210 -75 -72 214 -107 -21 137 -123 -12 118 -128 69 138 -171 79 57 -190 128 -31
5900 -31 -92 149 -15 -30 64 -49 -83 59 -96 -31 143 -136 27 92 -146 29 32 -69 78 5 -25 20 -5 -80 47
5925 47 -6 -79 116 -70 -34 89 -94 30 32 -11 57 -9 7 5 -7 -52 33 42 -95 81 -21 -25 13 -22 5 -26 12 -3
5953 -3 11 -2 -75 41 -30 -31 77 -56 19 28 8 -33 21 0 -27 70 4 20 45 -105 48 26 -79 58 -6 -63 44 14
5981 14 -71 33 7 -84 134 -71 -73 124 -129 -13 89 -107 49 54 -81 43 23 -110 62 16 -157 229 -21
6004 -21 -147 216 -142 -39 129 -147 51 109 -103 5 76 -183 74 74 -204 208 10 -174 216 -141 -98 174
6026 174 -148 -41 157 -112 -8 158 -237 30 138 -291 183 52 -245 210 -89 -156 204 -100 -95 214 -141
6047 -141 -34 241 -249 3 215 -305 179 142 -250 230 -17 -254 221 -49 -158 266 -71 -155 300 -211 -121
6068 -121 298 -305 58 181 -296 179 62 -298 190 2 -233 270 -28 -218 332 -153 -175 319 -302 48
6088 48 316 -349 164 181 -360 183 154 -280 256 73 -299 310 -132 -225 381 -307 -64 393 -326 52 270
6109 270 -329 46 194 -320 203 133 -335 338 -52 -331 415 -198 -179 391 -232 -59 277 -308 36 252 -350
6130 -350 164 207 -418 295 63 -404 382 -58 -224 385 -208 -87 319 -274 -40 319 -350 76 349 -457
6150 -457 154 138 -418 327 -19 -277 384 -159 -209 362 -230 -184 374 -304 -86 366 -385 101 204 -413 293
6171 293 63 -326 391 -36 -302 373 -69 -213 397 -200 -116 384 -336 36 273 -440 203 190 -397 302 116
6192 116 -337 262 -7 -309 359 -146 -188 425 -330 -43 371 -463 79 289 -356 151 151 -340 213 55 -359
6213 -359 361 -58 -261 477 -221 -196 431 -293 -31 289 -296 119 223 -349 164 124 -417 313 40 -395 418
6234 418 -114 -243 392 -268 -90 328 -260 22 283 -346 90 262 -394 197 166 -376 325 -18 -254 345
6254 345 -166 -136 349 -220 -41 364 -292 -29 353 -353 120 215 -329 251 54 -276 317 -88 -224 340 -102
6275 -102 -171 329 -197 -145 315 -318 18 244 -338 196 91 -329 248 -15 -256 255 -6 -239 283 -85 -192
6296 -192 300 -215 -47 313 -332 147 177 -292 130 104 -289 144 87 -229 267 -45 -211 279 -188 -119 304
6317 304 -264 20 223 -238 48 157 -217 81 144 -235 171 50 -254 268 -116 -200 309 -153 -37 240 -180
6338 -180 8 145 -215 23 180 -220 121 109 -282 234 3 -197 246 -79 -83 164 -148 -72 152 -154 -35
6359 -35 164 -203 52 106 -266 128 34 -229 180 -37 -111 149 -47 -94 125 -66 -67 165 -120 16 161 -175
6381 -175 64 79 -138 129 24 -79 96 -3 -72 77 -12 -88 153 -63 -35 170 -153 28 71 -129 66 34 -81
6404 -81 53 8 -86 55 2 -105 124 -15 -98 120 -122 -19 49 -68 37 17 -48 -4 42 -62 19 66 -122 85
6428 85 34 -76 74 -88 -41 39 -35 19 25 -6 -39 39 -66 -39 70 -65 34 52 -46 51 -47 -5 13 -38 7 24 39 -60
6456 -60 7 -14 -77 49 -25 39 22 4 14 -51 -24 4 17 -10 -25 74 3 -22 22 -38 19 -7 7 6 -4 -34 -32 32 -74 40
6486 40 48 -65 87 -11 -51 54 -39 -50 7 -2 -12 67 -13 -30 71 -83 6 95 -93 101 22 -78 63 -51 -47 43 57
6513 57 -28 84 18 -94 113 -122 -33 100 -100 83 55 -102 70 -22 -69 48 22 -93 66 42 -138 130 -35
6536 -35 -64 149 -139 17 84 -109 37 63 -127 40 73 -113 102 11 -135 135 -27 -120 166 -103 -34 127 -126
6559 -126 18 80 -133 12 147 -153 75 91 -184 139 -7 -164 154 -80 -66 142 -93 -58 120 -93 -47 173
6581 173 -141 21 155 -175 116 68 -181 203 -28 -127 170 -37 -121 158 -56 -90 202 -149 -17 167 -197
6602 -197 92 134 -224 172 38 -163 138 -19 -137 147 -5 -135 204 -143 -113 208 -230 -14 172 -235 90
6623 90 127 -197 101 30 -184 169 -25 -193 252 -42 -147 278 -187 -53 219 -160 31 175 -170 78 107
6644 107 -223 132 105 -266 201 13 -209 221 -143 -128 213 -183 18 197 -198 21 156 -241 30 177 -259
6665 -259 179 102 -229 223 -87 -161 257 -144 -88 251 -109 -93 190 -197 6 229 -219 132 115 -283 250 17
6687 17 -246 231 -24 -133 215 -69 -111 227 -146 -81 237 -266 64 240 -303 161 109 -261 168 39 -219
6708 -219 193 -35 -198 211 -131 -133 306 -226 -47 269 -261 43 160 -229 127 100 -180 167 37 -199 231
6729 231 -49 -238 314 -128 -119 249 -230 -3 183 -224 89 137 -242 133 122 -291 187 56 -255 261 -77
6750 -77 -148 272 -164 -31 206 -230 9 192 -234 41 205 -274 141 115 -269 221 -22 -139 272 -109 -114 224
6772 224 -128 -49 223 -166 -47 211 -262 59 151 -283 186 41 -224 229 -50 -168 233 -77 -124 221 -102
6793 -102 -67 205 -191 26 185 -274 161 94 -253 182 34 -174 180 0 -120 206 -56 -122 240 -167 -45
6814 -45 218 -234 71 113 -223 116 71 -181 104 38 -149 172 -13 -172 247 -136 -131 241 -193 -6 182 -182
6836 -182 38 93 -189 75 61 -181 137 80 -220 225 -56 -161 211 -108 -65 160 -146 27 134 -178 22
6857 22 123 -170 77 72 -237 173 -29 -178 172 -80 -82 173 -106 -32 121 -127 -26 143 -156 38 139 -192
6879 -192 128 54 -154 169 -43 -83 138 -45 -53 88 -58 -50 158 -106 -18 143 -148 81 85 -134 105 -5 -126
6902 -126 79 -11 -83 75 -33 -89 105 -48 -60 135 -97 23 58 -116 68 24 -39 61 21 -81 76 28 -108
6925 -108 106 -5 -84 114 -73 3 63 -89 2 15 -43 15 33 -95 1 43 -110 44 -7 -74 89 -51 -3 47 -89
6950 -89 3 27 -29 -39 18 -28 -32 43 -80 21 -8 -49 88 -39 -30 4 -40 1 2 16 -2 -9 36 -49 0 4 6 28 -33 16 -3
6981 -3 -2 0 -17 24 -33 31 -17 -3 36 -53 9 -16 -46 52 -15 -3 -18 24 -54 12 68 -45 77 -14 -46 75 -71 -12 27 -47
7011 -47 6 55 -2 -32 49 -63 -45 70 -94 66 -4 -76 113 -64 -75 70 -47 -50 59 -3 -55 80 -108 -40 88
7036 88 -149 62 41 -124 99 -5 -46 72 36 -79 67 22 -97 142 -52 -79 160 -144 47 115 -124 62
7058 62 59 -116 18 50 -124 61 27 -136 150 -39 -155 164 -141 -26 141 -121 33 113 -135 -15 74 -160
7080 -160 58 77 -189 154 6 -161 222 -86 -55 184 -115 7 109 -127 -1 126 -169 57 109 -215 141
7101 141 40 -210 175 -58 -133 208 -92 -103 140 -130 -75 168 -190 9 162 -245 92 105 -248 188 -21
7122 -21 -162 161 -101 -107 206 -98 -125 232 -167 -33 257 -248 77 168 -258 176 44 -159 194 -11 -127 177
7144 177 -53 -173 245 -121 -111 240 -209 16 171 -287 111 84 -223 142 64 -234 157 43 -244 241 -50
7165 -50 -175 288 -196 -32 203 -262 69 181 -225 101 145 -209 154 84 -219 221 -14 -206 297 -181 -79
7186 -79 280 -206 -5 206 -192 19 153 -235 69 115 -287 191 40 -263 294 -81 -204 292 -175 -70 218
7207 218 -178 19 218 -227 31 195 -275 139 129 -298 267 -2 -201 234 -105 -110 262 -126 -71 230 -212
7228 -212 -39 279 -287 47 186 -299 215 59 -244 224 -66 -215 259 -65 -150 243 -141 -97 257 -211 9
7249 9 210 -268 153 114 -282 193 20 -205 192 -12 -195 260 -69 -147 299 -197 -22 256 -268 99 164 -272
7271 -272 112 98 -232 115 57 -213 206 -34 -223 267 -144 -134 244 -231 -5 223 -228 29 152 -200 83
7292 83 93 -248 177 41 -240 261 -73 -154 280 -160 -40 214 -157 -5 142 -189 58 175 -229 144 101
7313 101 -262 208 -31 -201 236 -98 -87 185 -114 -48 148 -161 -1 195 -234 39 159 -271 182 25 -204
7334 -204 179 -73 -127 160 -67 -65 190 -92 -59 207 -187 7 193 -200 132 72 -203 141 -7 -137 122 -3
7356 -3 -127 176 -63 -134 203 -149 -17 177 -174 66 97 -155 95 11 -129 78 15 -146 99 18 -137 187
7378 187 -52 -66 152 -130 52 100 -120 50 58 -89 39 71 -112 105 29 -141 119 -33 -84 150 -100 -14 88
7401 88 -103 17 45 -84 -7 51 -108 17 78 -138 77 -6 -85 113 -103 -44 69 -70 3 76 -25 -23 80 -78
7425 -78 -1 57 -110 76 5 -71 99 -35 -38 58 -32 -31 62 -18 -26 93 -76 -37 59 -75 61 25 -72 65 -20 -41 26
7452 26 -33 -19 1 43 -44 67 -27 -30 106 -68 32 4 -56 50 5 -12 11 18 -21 -5 44 -34 22 0 -52 46 -52 5 33
7481 33 -10 29 -43 -12 -20 1 0 -55 8 -36 12 30 -63 51 -7 0 -32 -1 -12 -34 15 -35 -44 -14 -62 56 -17 -42 55 -50 -20
7512 -20 -4 23 -29 71 -1 -21 59 -26 -7 56 -51 61 -31 -58 30 -17 -13 -30 0 -69 31 12 -69 83 -49 -41 76 -52
7540 -52 14 36 -52 9 31 -13 -2 52 -62 34 25 -82 91 -16 -5 65 -45 23 52 -21 37 57 -20 -22 47 -50 12 62 -103
7569 -103 98 6 -67 66 -44 -39 28 -36 -40 45 -37 -35 60 -59 -3 90 -123 74 41 -91 67 29 -39 66 -17 -40 76
7596 76 2 -63 85 -64 -22 113 -91 33 44 -63 63 -8 -51 38 -15 -70 76 -26 -73 123 -64 -80 95 -85
7620 -85 31 71 -78 12 50 -50 41 45 -119 67 23 -96 125 0 -56 117 -82 -20 100 -75 13 61 -54 -3
7644 -3 72 -53 35 63 -124 98 -21 -83 104 -75 -78 37 -102 -14 79 -68 -8 86 -80 -16 78 -98 73 52 -145
7669 -145 93 -42 -71 87 -15 -19 63 -33 -54 99 -82 -16 106 -93 62 49 -124 79 -16 -48 72 -8 -61 56
7693 56 -16 -85 81 -56 -56 102 -112 -7 90 -121 43 1 -84 40 44 -78 85 10 -112 89 -34 -60 127 -81
7717 -81 15 105 -87 55 55 -77 34 60 -93 85 35 -75 89 -13 -64 92 -82 -24 60 -95 15 29 -84 -7
7741 -7 48 -98 13 51 -102 56 10 -73 74 -36 -70 90 -27 -22 61 -65 -29 59 -61 -11 88 -120 39 50 -98
7766 -98 68 -22 -55 71 9 -29 44 -32 -47 89 -30 -50 63 -76 37 17 -94 53 7 -74 45 -5 -79 53 -7
7791 -7 -71 63 -26 -40 106 -56 9 55 -65 34 53 -37 42 27 -24 19 24 -68 44 1 -55 60 -51 -19 63 -54 2
7818 2 27 -51 -8 17 -92 -20 24 -65 42 -18 -78 47 -27 -40 43 -63 -27 30 -29 -25 22 -57 -37 53 -89 31 14 -64
7846 -64 63 5 -26 60 -16 -15 37 -3 -39 62 -37 -48 71 -59 -4 34 -60 37 -14 -62 38 -18 -56 26 -29 -57 82 -33
7874 -33 -43 46 -38 -23 31 -61 -9 12 -36 22 17 -28 37 9 -51 25 -3 -33 41 -28 -17 57 -61 4 32 -45 22 32 -41 -15
7904 -15 8 -22 9 -1 -72 22 -23 -44 51 -12 17 33 -15 -28 12 -29 -16 42 -64 -1 21 -47 39 6 -49 44 -1 -23 56 -15
7934 -15 -11 38 11 -7 75 -38 -8 4 -74 32 23 -71 27 -24 -27 44 10 -23 5 -41 -40 37 -30 -18 12 -42 -7 15 -42 50 -6
7965 -6 -24 38 -12 -16 14 -2 -20 54 17 1 41 -57 3 18 1 6 25 -33 -12 10 -59 15 -3 -25 11 -10 -39 14 -10 -15 -1 -11
7997 -11 28 4 -29 2 -1 -61 10 19 -14 37 -19 -12 35 -9 8 2 -20 18 4 -20 12 18 -20 8 -1 -11 14 -23 -36 -14 -28 -2 2 -17
8031 -17 -2 11 -27 -35 8 5 -6 -15 1 19 29 -1 18 -24 -7 2 -22 -1 28 3 1 -13 16 37 9 14 36 -47 -6 -13 -32 -1 -27 -25
8065 -25 21 -9 -35 -22 -39 -5 18 -25 6 10 -49 -6 -15 -8 22 -2 -15 14 -23 -25 31 -24 24 13 -24 26 36 -2 -10 29 -11 40 5
8098 5 -48 52 4 -21 56 -39 -1 33 -11 -18 30 -21 1 31 -27 23 -3 -68 16 -29 -45 28 -23 -38 25 -13 -9 37 -32 -23 36 -47
8130 -47 10 39 -47 8 8 -14 48 2 -24 20 -17 -25 35 -32 -16 44 -49 -6 53 -44 15 -21 -51 32 16 -69 38 -37 -67 51
8160 51 -49 -32 34 -41 10 66 -64 13 38 -91 43 25 -31 75 -12 -58 68 15 -12 76 -45 -4 69 -66 5 38
8186 38 -65 63 27 -72 33
8191C3
##END NTUPLES=NMR FID
##END=
