##TITLE=1H_DE-TEST_D2OHDO
 200.13Hz,D2O.
 8 sc
 3.6.2026
##JCAMPDX= 6.0         $$ Bruker NMR JCAMP-DX V2.0
##DATA TYPE= NMR FID
##DATA CLASS= NTUPLES
##ORIGIN= UXNMR, Bruker Analytische Messtechnik GmbH
##OWNER= pz
$$ XWIN-NMR		Version 3.5
$$ Wed Jun  3 14:39:14 2026 Russian Standard Time (UT+4h)  she@DPX200
##.OBSERVE FREQUENCY= 200.131
##.OBSERVE NUCLEUS= ^1H
##.DELAY= (6, 6)
##.ACQUISITION MODE= SIMULTANEOUS
##.ACQUISITION SCHEME= undefined
##.AVERAGES= 8
##.DIGITISER RES= 18
##SPECTROMETER/DATA SYSTEM= spect
##.PULSE SEQUENCE= zg30
##.SOLVENT NAME= D2O
##.SHIFT REFERENCE= (INTERNAL, D2O, 0, 14.3821)
##AUDIT TRAIL= $$ (NUMBER, WHEN, WHO, WHERE, WHAT)
$$ ##TITLE= Audit trail, XWIN-NMR		Version 3.5
$$ ##JCAMPDX= 5.01
$$ ##ORIGIN= Bruker BioSpin GmbH
$$ ##OWNER= she
$$ F:/spectra/data/she/nmr/H-C/1/audita.txt
$$ ##AUDIT TRAIL=  $$ (NUMBER, WHEN, WHO, WHERE, WHAT)
(   1,<2026-06-03 14:37:43.14 +0400>,<she>,<DPX200>,
      <created by zg, POWCHK disabled, PULCHK disabled
       configuration hash MD5:
       00 E9 B6 7A A2 85 ED C7 34 08 36 98 17 FE 4E 26
       data hash MD5: 16K
       E1 7A 99 E4 C1 C6 33 69 C0 02 E3 3F DF 16 28 12>)
$$ ##END=
$$ 
$$ hash MD5
$$ 46 CF 09 28 06 8C 83 6D C7 9A C4 17 15 D9 80 AF
##$RELAX= 
##$RELAX= 
##$RELAX= 
##$RELAX= 
##$RELAX= 
##$RELAX= 
$$ Bruker specific parameters
$$ --------------------------
##$DU= <F:/spectra>
##$EXPNO= 1
##$NAME= <H-C>
##$PROCNO= 1
##$TYPE= <nmr>
##$USER= <she>
##$AMP= (0..31)
100 100 100 100 100 100 100 100 100 100 100 100 100 100 100 100 100 100 
100 100 100 100 100 100 100 100 100 100 100 100 100 100 
##$AQSEQ= 0
##$AQ_mod= 1
##$AUNM= <au_zg>
##$AUTOPOS= <>
##$BF1= 200.13
##$BF2= 200.13
##$BF3= 200.13
##$BF4= 200.13
##$BF5= 200.13
##$BF6= 200.13
##$BF7= 200.13
##$BF8= 200.13
##$BYTORDA= 1
##$CFDGTYP= 0
##$CFRGTYP= 5
##$CHEMSTR= <none>
##$CNST= (0..31)
1 1 145 1 1 1 1 1 1 1 1 1 1 1 1 1 1 1 1 1 1 1 1 1 1 1 1 1 1 1 1 1 
##$CPDPRG= <>
##$CPDPRG1= <>
##$CPDPRG2= <>
##$CPDPRG3= <>
##$CPDPRG4= <mlev>
##$CPDPRG5= <mlev>
##$CPDPRG6= <mlev>
##$CPDPRG7= <mlev>
##$CPDPRG8= <mlev>
##$CPDPRGB= <>
##$CPDPRGT= <>
##$D= (0..31)
0 0.7 0 0 0 0 0 0 0 0 0 0.03 0 0 0 0 0 0 0 0 0 0 0 0 0 0 0 0 0 0 0 0 
##$DATE= 1780483062
##$DBL= (0..7)
120 120 120 120 120 120 120 120 
##$DBP= (0..7)
150 150 150 150 150 150 150 150 
##$DBP07= 0
##$DBPNAM0= <>
##$DBPNAM1= <>
##$DBPNAM2= <>
##$DBPNAM3= <>
##$DBPNAM4= <>
##$DBPNAM5= <>
##$DBPNAM6= <>
##$DBPNAM7= <>
##$DBPOAL= (0..7)
0.5 0.5 0.5 0.5 0.5 0.5 0.5 0.5 
##$DBPOFFS= (0..7)
0 0 0 0 0 0 0 0 
##$DE= 6
##$DECBNUC= <off>
##$DECIM= 32
##$DECNUC= <off>
##$DECSTAT= 4
##$DIGMOD= 1
##$DIGTYP= 9
##$DL= (0..7)
0 120 120 120 120 120 120 120 
##$DP= (0..7)
150 150 150 150 150 150 150 150 
##$DP07= 0
##$DPNAME0= <>
##$DPNAME1= <>
##$DPNAME2= <>
##$DPNAME3= <>
##$DPNAME4= <>
##$DPNAME5= <>
##$DPNAME6= <>
##$DPNAME7= <>
##$DPOAL= (0..7)
0.5 0.5 0.5 0.5 0.5 0.5 0.5 0.5 
##$DPOFFS= (0..7)
0 0 0 0 0 0 0 0 
##$DQDMODE= 0
##$DR= 18
##$DS= 0
##$DSLIST= <SSSSSSSSSSSSSSS>
##$DSPFIRM= 0
$$ [...]
##$SUBNAM0= <"">
##$SUBNAM1= <"">
##$SUBNAM2= <"">
##$SUBNAM3= <"">
##$SUBNAM4= <"">
##$SUBNAM5= <"">
##$SUBNAM6= <"">
##$SUBNAM7= <"">
##$SUBNAM8= <"">
##$SUBNAM9= <"">
##$SW= 18.0517599122864
##$SWIBOX= (0..15)
0 0 2 0 0 0 0 0 0 0 0 0 0 0 0 0 
##$SW_h= 3612.71676300578
##$TD= 16384
##$TD0= 1
##$TE= 0
##$TE2= 300
##$TE3= 300
##$TEG= 300
##$TL= (0..7)
0 120 120 120 120 120 120 120 
##$TP= (0..7)
150 150 150 150 150 150 150 150 
##$TP07= 0
##$TPNAME0= <>
##$TPNAME1= <>
##$TPNAME2= <>
##$TPNAME3= <>
##$TPNAME4= <>
##$TPNAME5= <>
##$TPNAME6= <>
##$TPNAME7= <>
##$TPOAL= (0..7)
0.5 0.5 0.5 0.5 0.5 0.5 0.5 0.5 
##$TPOFFS= (0..7)
0 0 0 0 0 0 0 0 
##$TUNHIN= 0
##$TUNHOUT= 0
##$TUNXOUT= 0
##$USERA1= <user>
##$USERA2= <user>
##$USERA3= <user>
##$USERA4= <user>
##$USERA5= <user>
##$V9= 5
##$VALIST= <valist>
##$VCLIST= <CCCCCCCCCCCCCCC>
##$VD= 0
##$VDLIST= <DDDDDDDDDDDDDDD>
##$VPLIST= <PPPPPPPPPPPPPPP>
##$VTLIST= <TTTTTTTTTTTTTTT>
##$WBST= 1024
##$WBSW= 4
##$XGAIN= (0..3)
0 0 0 0 
##$XL= 0
##$YL= 0
##$YMAX_a= 37274
##$YMIN_a= -34505
##$ZGOPTNS= <>
##$ZL1= 120
##$ZL2= 120
##$ZL3= 120
##$ZL4= 120
##$ABSF1= 10
##$ABSF2= 0
##$ABSG= 5
##$ABSL= 3
##$ALPHA= 0
##$AQORDER= 0
##$ASSFAC= 0
##$ASSFACI= 0
##$ASSFACX= 0
##$ASSWID= 0
##$AUNMP= <proc_1d>
##$AZFE= 0.1
##$AZFW= 0.1
##$BCFW= 1
##$BC_mod= 2
##$BYTORDP= 1
##$COROFFS= 0
##$CY= -3
##$DATMOD= 1
##$DC= 2
##$DFILT= <>
##$DTYPP= 0
##$F1P= 0
##$F2P= 0
##$FCOR= 0.5
##$FTSIZE= 0
##$FT_mod= 4
##$GAMMA= 1
##$GB= 0.15
##$INTBC= 1
##$INTSCL= 1
##$ISEN= 128
##$LB= 0.25
##$LEV0= 0
##$LPBIN= 0
##$MAXI= 10000
##$MC2= 0
##$MEAN= 0
##$ME_mod= 0
##$MI= 1.114404
##$NCOEF= 0
##$NC_proc= 0
##$NLEV= 6
##$NOISF1= 3.799351
##$NOISF2= 2.8
##$NSP= 1
##$NTH_PI= 0
##$NZP= 0
##$OFFSET= 14.38212
##$PC= 1
##$PHC0= -4302.886
##$PHC1= 13.79229
##$PH_mod= 1
##$PKNL= yes
##$PPARMOD= 0
##$PSCAL= 0
##$PSIGN= 0
##$REVERSE= no
##$SF= 200.129724274929
##$SI= 16384
##$SIGF1= 3
##$SIGF2= 2
##$SINO= 400
##$SIOLD= 16384
##$SREGLST= <1H.CDCl3>
##$SSB= 0
##$STSI= 0
##$STSR= 0
##$SW_p= 3205.1282051282
##$SYMM= 0
##$S_DEV= 0
##$TDeff= 0
##$TDoff= 0
##$TI= <>
##$TILT= no
##$TM1= 0
##$TM2= 0
##$TOPLEV= 0
##$USERP1= <user>
##$USERP2= <user>
##$USERP3= <user>
##$USERP4= <user>
##$USERP5= <user>
##$WDW= 1
##$XDIM= 8192
##$YMAX_p= 0
##$YMIN_p= 0
$$ End of Bruker specific parameters
$$ ---------------------------------
##NTUPLES= NMR FID
##VAR_NAME=  TIME,          FID/REAL,        FID/IMAG
##SYMBOL=    X,             R,               I
##VAR_TYPE=  INDEPENDENT,   DEPENDENT,       DEPENDENT
##VAR_FORM=  AFFN,          ASDF,            ASDF
##VAR_DIM=   8192,          8192,            8192
##UNITS=     SECONDS,       ARBITRARY UNITS, ARBITRARY UNITS
##FACTOR=    0.0002768,     1,               1
##FIRST=     0,             0,               0
##LAST=      2.2672688,     0,               0
##MIN=       0,             -34505,          0
##MAX=       2.2672688,     37274,           0
$$ Real data points
##PAGE= N=1
##DATA TABLE= (X++(R..R)), XYDATA
0@%%%%%%%%%%%%%%%%%%%%%%lJ1j6J6j6J6j6J8k5L1l2L4m1M8n1N8o6P3q1R0j00
$$ 0 0 0 0 0 0 0 0 0 0 0 0 0 0 0 0 0 0 0 0 0 0 0 -3 8 -8 8 -8 8 -8 10 -15 16 -16 18 -23 25 -26 32 -34 39 -42 48 -52
43e2J10j22J35j50J67j84K00k20K44k68K95l27L61l99M46m98N58o32P22q34R76
$$ -52 58 -64 71 -79 88 -96 104 -116 128 -140 155 -172 189 -210 236 -262 296 -336 386 -448 528
64E28j169J448j883K667m529J7828K2384l537L301j537J457j545K54j893o78k349
$$ 528 -641 807 -1076 1591 -2938 14890 37274 33737 37038 35501 36958 35413 35667 33774 33096 30747
80C0747j468k818k120l187k618l500k968l619l183l627l240l529l120l348k930
$$ 30747 29279 26461 24341 21154 18536 15036 12068 8449 5266 1639 -1601 -5130 -8250 -11598 -14528
95a4528l006k567k564k134k036j601j421j018p95l94j43K51M75Q56J086J408J653
$$ -14528 -17534 -20101 -22665 -24799 -26835 -28436 -29857 -30875 -31670 -32064 -32207 -31956 -31481 -30625 -29539 -28131 -26478
112b6478J919K111K347K512K674K787K888K963K983K958K991K887K869K750K614
$$ -26478 -24559 -22448 -20101 -17589 -14915 -12128 -9240 -6277 -3294 -336 2655 5542 8411 11161 13775
127A3775K474K296K104J884J646J397J144Q74N82L13L8k40n15p98j046j289j525
$$ 13775 16249 18545 20649 22533 24179 25576 26720 27594 28176 28489 28527 28287 27772 26974 25928 24639 23114
144B3114j752j922k109k295k397k505k598k665k624k695k678k579k540k462k333
$$ 23114 21362 19440 17331 15036 12639 10134 7536 4871 2247 -448 -3126 -5705 -8245 -10707 -13040
159a3040k180k028j845j663j446j205j000p29m72k46K7K65N17P62R99J212J427
$$ -13040 -15220 -17248 -19093 -20756 -22202 -23407 -24407 -25136 -25608 -25854 -25827 -25562 -25045 -24283 -23284 -22072 -20645
176b0645J600J799J964K087K198K311K366K409K414K459K399K346K322K234K098
$$ -20645 -19045 -17246 -15282 -13195 -10997 -8686 -6320 -3911 -1497 962 3361 5707 8029 10263 12361
191A2361J967J843J681J458J286J077Q56O39L96J96p4k71n15p49r35j145j333
$$ 12361 14328 16171 17852 19310 20596 21673 22529 23168 23564 23760 23686 23415 22900 22151 21216 20071 18738
208A8738j524j660j821j933k057k135k215k211k244k281k218k163k127k035j942
$$ 18738 17214 15554 13733 11800 9743 7608 5393 3182 938 -1343 -3561 -5724 -7851 -9886 -11828
223a1828j804j677j506j354j150r75o88o14k96j36P8K86N74O07J022J109J259
$$ -11828 -13632 -15309 -16815 -18169 -19319 -20294 -20982 -21596 -21892 -22028 -21950 -21664 -21090 -20483 -19461 -18352 -17093
240a7093J402J702J655J758J926K018J989K104K134K075J999K130J869J980J710
$$ -17093 -15691 -13989 -12334 -10576 -8650 -6632 -4643 -2539 -405 1670 3669 5799 7668 9648 11358
255A1358J589J657J293J261J107P60O82N54K04K2j37l45m77p31r40j109j245j257
$$ 11358 12947 14604 15897 17158 18265 19025 19707 20261 20465 20487 20350 20005 19528 18797 17857 16748 15503 14246
273A4246j610j605j825j795j903j882j965k026j972j824j953j786j717j623j525
$$ 14246 12636 11031 9206 7411 5508 3626 1661 -365 -2337 -4161 -6114 -7900 -9617 -11240 -12765
288a2765j436j159j155p66q70n22l76j45KJ92M05N43P21R56J036J188J365J475
$$ -12765 -14201 -15360 -16515 -17281 -18151 -18673 -19049 -19194 -19192 -19000 -18595 -18052 -17331 -16375 -15339 -14151 -12786 -11311
306a1311J558J640J747J803J793J826J872J821J760J737J681J595J497J377J257
$$ -11311 -9753 -8113 -6366 -4563 -2770 -944 928 2749 4509 6246 7927 9522 11019 12396 13653
321A3653J117R53Q22O34M68K79J28o6k41l94n92p47q83j049j171j294j411j501
$$ 13653 14770 15723 16545 17179 17647 17926 18054 17988 17747 17353 16761 16014 15131 14082 12911 11617 10206 8705
339H705j576j644j693j675j754j743j713j633j616j552j473j376j251j133j000
$$ 8705 7129 5485 3792 2117 363 -1380 -3093 -4726 -6342 -7894 -9367 -10743 -11994 -13127 -14127
354a4127q66p25n46l83k28o1J15K79M47N96P57Q81J020J140J262J357J440J511
$$ -14127 -14993 -15718 -16264 -16647 -16875 -16936 -16821 -16542 -16095 -15499 -14742 -13861 -12841 -11701 -10439 -9082 -7642 -6131
372f131J561J568J607J624J642J573J526J500J434J357J257J129J025Q93P48O18
$$ -6131 -4570 -3002 -1395 229 1871 3444 4970 6470 7904 9261 10518 11647 12672 13565 14313 14931
388A4931M62L09J52Kj70l13m79n97p52q73r95j100j217j291j379j430j456j475
$$ 14931 15393 15702 15854 15856 15686 15373 14894 14297 13545 12672 11677 10577 9360 8069 6690 5260 3804 2329
406B329j525j532j518j464j386j399j312j240j138j026r20q01o71n21l91k40j03
$$ 2329 804 -728 -2246 -3710 -5096 -6495 -7807 -9047 -10185 -11211 -12131 -12932 -13603 -14124 -14515 -14755 -14858
423a4858M3J89L30M72N97P23Q54R69J062J152J231J299J334J375J387J440J429
$$ -14858 -14815 -14626 -14296 -13824 -13227 -12504 -11650 -10681 -9619 -8467 -7236 -5937 -4603 -3228 -1841 -401 1028
440A028J417J349J315J280J207J156J043R38Q34P10N94M68L21K00O5q3k09l46
$$ 1028 2445 3794 5109 6389 7596 8752 9795 10733 11567 12277 12871 13339 13660 13860 13925 13842 13633 13287
458A3287m66n96p23q25r29j018j093j179j229j262j284j311j355j334j319j267
$$ 13287 12821 12225 11502 10677 9748 8730 7637 6458 5229 3967 2683 1372 17 -1317 -2636 -3903
474c903j212j182j118j043r49q62p56o32n23l97k90j44j5R8K48L37M88N77P07
$$ -3903 -5115 -6297 -7415 -8458 -9407 -10269 -11025 -11657 -12180 -12577 -12867 -13011 -13026 -12928 -12680 -12343 -11855 -11278 -10571
493a0571P90Q88R83J048J098J174J184J213J249J251J246J221J175J123J081J035
$$ -10571 -9781 -8893 -7910 -6862 -5764 -4590 -3406 -2193 -944 307 1553 2774 3949 5072 6153 7188
509G188R59Q81P81O87N74M64L52K30J15Nj27k35l42m82n66o57p57q64r18j002
$$ 7188 8147 9028 9809 10496 11070 11534 11886 12116 12231 12236 12109 11874 11532 11050 10484 9827 9070 8206 7288 6286
529F286j039j109j098j139j177j190j164j152j093j056j023r53q83q14p23o34
$$ 6286 5247 4138 3040 1901 724 -466 -1630 -2782 -3875 -4931 -5954 -6907 -7790 -8604 -9327 -9961
545i961n29m20l21k21q6PJ37K50L38M56N57O39P42Q12Q84R50R99J049J048J082
$$ -9961 -10490 -10910 -11231 -11452 -11538 -11531 -11394 -11144 -10806 -10350 -9793 -9154 -8412 -7600 -6716 -5766 -4767 -3718 -2670 -1588
565a588J121J122J097J096J014R84R56Q88Q34P57O68N74M73L78K77J74O3m2j56
$$ -1588 -467 655 1752 2848 3862 4846 5802 6690 7524 8281 8949 9523 9996 10374 10651 10825 10888 10846 10690
584A0690k43l63m47n46o31p17p97q58r01r51r80r75j055j058j045j041r99r67
$$ 10690 10447 10084 9637 9091 8460 7743 6946 6088 5187 4236 3256 2281 1226 168 -877 -1918 -2917 -3884
602c884r02q94q18p64o86o18n28m25l30k35j48k6P2J59K50L53M41N27O12O94P45
$$ -3884 -4786 -5680 -6498 -7262 -7948 -8566 -9094 -9519 -9849 -10084 -10232 -10258 -10186 -10027 -9777 -9424 -8983 -8456 -7844 -7150 -6405
623f405Q13Q51R00R15R47R77R90R86R83R40R00Q42Q26P64P11O24N72M84L99K98
$$ -6405 -5592 -4741 -3841 -2926 -1979 -1002 -12 974 1957 2897 3797 4639 5465 6229 6940 7564 8136 8620 9019 9317
643I317K07J09K8n7j68k65l47m30n14n82o49p22p61q22q43q61r10r18r46r26r11
$$ 9317 9524 9633 9661 9604 9436 9171 8824 8394 7880 7298 6649 5927 5166 4344 3501 2640 1730 812 -134 -1060 -1971
664a971q86q50p76p74p08o59n85n12m50l54k86j79j13j0Q5J64K51L48M19M80N59
$$ -1971 -2857 -3707 -4483 -5257 -5965 -6624 -7209 -7721 -8171 -8525 -8811 -8990 -9103 -9113 -9028 -8864 -8613 -8265 -7846 -7366 -6807
685f807O33O73P38P68Q06P95Q57Q79Q69Q88Q55Q33P89P22P33O60O20N52M71M15
$$ -6807 -6174 -5501 -4763 -3995 -3189 -2394 -1537 -658 211 1099 1954 2787 3576 4298 5031 5691 6311 6863 7334 7749
705G749L21K61J60Q7Jr3j59k52l25l94m61n31n92o54o73p38p37p88q13q05q37
$$ 7749 8070 8331 8491 8578 8579 8486 8327 8075 7750 7356 6895 6364 5772 5118 4445 3707 2970 2182 1369 564 -273
726b73q28q07p75p60o84o48o25n70n12m49l91k87k34j43q2jJ01J40K38L13L89
$$ -273 -1101 -1908 -2683 -3443 -4127 -4775 -5400 -5970 -6482 -6931 -7322 -7609 -7843 -7986 -8068 -8069 -7968 -7828 -7590 -7277 -6888
747f888M30M97N72O06O53O87P04P30P60P89P80P87P34P42P25O14O23N94N29M94
$$ -6888 -6458 -5961 -5389 -4783 -4130 -3443 -2739 -2009 -1249 -460 320 1107 1841 2583 3308 3922 4545 5139 5668 6162
767F162M04L56K79K12J43O2Jq9j56k19l09l50m15m83n23n74o23o32o65p10p17
$$ 6162 6566 6922 7201 7413 7556 7618 7619 7530 7374 7155 6846 6496 6081 5598 5075 4501 3878 3246 2581 1871 1154
788A154p31p56p16p24p02o58o39n52n42n08m54l93l24k62k02j32m7NQ0J57K05
$$ 1154 423 -333 -1049 -1773 -2475 -3133 -3772 -4324 -4866 -5374 -5828 -6221 -6545 -6807 -7009 -7141 -7188 -7183 -7103 -6946 -6741
809f741K89L43M03M55N08N50N82O04O43O53O90O88P05O94O77O58O40N79N18N20
$$ -6741 -6452 -6109 -5706 -5251 -4743 -4193 -3611 -3007 -2364 -1711 -1021 -333 372 1066 1743 2401 3041 3620 4138 4658
829D658M67M43L63K98K45J85J08M7k2o9j57j97k83l25l86m40m73n29n51n58o17
$$ 4658 5125 5568 5931 6229 6474 6659 6767 6814 6792 6723 6566 6369 6086 5761 5375 4935 4462 3933 3382 2824 2207
850B207o29o44o64o56o59o40o28n74n75m97m71m44l98l46k88k33j57j13m1LQ7
$$ 2207 1578 934 270 -386 -1045 -1685 -2313 -2887 -3462 -3959 -4430 -4874 -5272 -5618 -5906 -6139 -6296 -6409 -6450 -6447 -6360
871f360J49J92K74L08L52M29M63M85N38N36N75O04O12O29O29O23O11N72N70N35
$$ -6360 -6211 -6019 -5745 -5437 -5085 -4656 -4193 -3708 -3170 -2634 -2059 -1455 -843 -214 415 1038 1649 2221 2791 3326
891C326M69M44M28L78L15K68K16J57R7M6j8p9j52j91k45l11l65l84m44m75m81
$$ 3326 3795 4239 4667 5045 5360 5628 5844 6001 6098 6144 6126 6047 5895 5704 5459 5148 4783 4399 3955 3480 2999
912B999n23n66n79n86n88o18n85n81n59n28n07m70m02l85l53l09k35k01j55q3
$$ 2999 2476 1910 1331 745 157 -461 -1046 -1627 -2186 -2714 -3221 -3691 -4093 -4478 -4831 -5140 -5375 -5576 -5731 -5814
932e814k7K1Q5J47J97K40L08L30L90M12M52M77M99N47N45N73N68N66N67N41N37
$$ -5814 -5841 -5820 -5735 -5588 -5391 -5151 -4843 -4513 -4123 -3711 -3259 -2782 -2283 -1736 -1191 -618 -50 516 1083 1624 2161
953B161N03M86M34L69L71L26K86K23J91J22O6K8l1j04j25k08k43k85l21l69m01
$$ 2161 2664 3150 3584 3953 4324 4650 4936 5159 5350 5472 5538 5566 5535 5431 5306 5098 4855 4570 4249 3880 3479
974C479m27m58m92m96n38n33n43n46n43n04m98m82m55m13l73l18l08k61k14j68
$$ 3479 3052 2594 2102 1606 1068 535 -8 -554 -1097 -1601 -2099 -2581 -3036 -3449 -3822 -4140 -4448 -4709 -4923 -5091
994e091j15n1j7L6P8J46J96K29K81L13L63L66M20M34M79M68N15N09N17N16N10
$$ -5091 -5206 -5257 -5274 -5238 -5160 -5014 -4818 -4589 -4308 -3995 -3632 -3266 -2846 -2412 -1933 -1465 -950 -441 76 592 1102
1015A102M81M86M48M20M02L50K88L01K31K03J49J05N7Rm2r4j41j91k16k80k97
$$ 1102 1583 2069 2517 2937 3339 3689 3977 4278 4509 4712 4861 4966 5023 5032 4990 4896 4755 4564 4348 4068 3771
1036C771l38l61l95m25m49m76m80m83n03m90m78m56m52m33m09l71l41k98k36k32
$$ 3771 3433 3072 2677 2252 1803 1327 847 364 -139 -629 -1107 -1563 -2015 -2448 -2857 -3228 -3569 -3867 -4103 -4335
1056d335j82j52q1m5mN1R5J43J73K34K65K90L20L54L71M24M31M49M49M71M69M73
$$ -4335 -4517 -4669 -4750 -4795 -4799 -4748 -4653 -4510 -4337 -4103 -3838 -3548 -3228 -2874 -2503 -2079 -1648 -1199 -750 -279 190 663
1078F63M53M46M21M03L80L56L34K75K27K03J69J22R8M0qo8q1j46j68k24k52k61
$$ 663 1116 1562 1983 2386 2766 3122 3456 3731 3958 4161 4330 4452 4550 4590 4582 4514 4433 4287 4119 3895 3643 3382
1100C382l25l38l68l96m03m43m29m49m54m49m37m20l99l77l84l34k85k85k21j73
$$ 3382 3057 2719 2351 1955 1552 1109 680 231 -223 -672 -1109 -1529 -1928 -2305 -2689 -3023 -3308 -3593 -3814 -3987
1120c987j60j04q0l7JO3Q6J42J64K17K36K62L15L18L47L98L83M15M28M25M27M23
$$ -3987 -4147 -4251 -4331 -4368 -4367 -4304 -4218 -4076 -3912 -3695 -3459 -3197 -2882 -2564 -2217 -1819 -1436 -1021 -593 -168 259 682
1142F82M10L97L92L78L44L04K96K53K30J76J17J10M9M1j5n3j00j23j82j85k24
$$ 682 1092 1489 1881 2259 2603 2907 3203 3456 3686 3862 3979 4089 4138 4179 4164 4111 4011 3888 3706 3521 3297
1163C297k74k77l27l45l66l82m03m02m04m07m23m00l75l71l46l26l00k80k38k17
$$ 3297 3023 2746 2419 2074 1708 1326 923 521 117 -290 -713 -1113 -1488 -1859 -2205 -2531 -2831 -3111 -3349 -3566
1183c566j77j11q4o5k1K5N2R7J30J63J91K27K60K74K99L55L55L56L95L80L92M09
$$ -3566 -3743 -3854 -3938 -4003 -4024 -3999 -3947 -3850 -3720 -3557 -3366 -3139 -2879 -2605 -2306 -1951 -1596 -1240 -845 -465 -73 336
1205C36L95L74L63L49L33L17K94K54K33J99J62J35Q1L0J2j0o3j01j26j56k11k25
$$ 336 731 1105 1468 1817 2150 2467 2761 3015 3248 3447 3609 3744 3825 3855 3867 3857 3794 3693 3567 3411 3200 2975
1227B975k41k89l08l10l64l38l73l95l68l77l75l73l42l36l20k94k75k46k20j77
$$ 2975 2734 2445 2137 1827 1463 1125 752 357 -11 -388 -763 -1136 -1478 -1814 -2134 -2428 -2703 -2949 -3169 -3346
1247c346j45j28o6m2rL7O7J08J30J67J93K26K44K82L05L01L41L60L38L69L65L63
$$ -3346 -3491 -3619 -3685 -3727 -3736 -3699 -3632 -3524 -3394 -3227 -3034 -2808 -2564 -2282 -1977 -1676 -1335 -975 -637 -268 97 460
1269D60L54L59L30L13K96K80K58K34J87J70J45R6P5L5Qm5n9j04j38j59k05k22
$$ 460 814 1173 1503 1816 2112 2392 2650 2884 3071 3241 3386 3482 3557 3592 3600 3555 3496 3392 3254 3095 2890 2668
1291B668k51k68k83l06l30l22l57l56l43l46l45l40l15l09k76k75k32k27j72j69
$$ 2668 2417 2149 1866 1560 1230 908 551 195 -148 -494 -839 -1179 -1494 -1803 -2079 -2354 -2586 -2813 -2985 -3154
1311c154j23r5n6l4jL8Q2R9J33J57K01K15K47K63K91K95L11L27L34L34L40L49
$$ -3154 -3277 -3372 -3428 -3462 -3463 -3425 -3343 -3244 -3111 -2954 -2753 -2538 -2291 -2028 -1737 -1442 -1131 -804 -470 -136 204 553
1333E53L31L19K98K87K73K53K27K09J72J42J16R8M3J8j3n2p0j04j49j69j94k19
$$ 553 884 1203 1501 1788 2061 2314 2541 2750 2922 3064 3180 3278 3321 3339 3326 3274 3204 3100 2951 2782 2588 2369
1355B369k32k65k92k87l03l17l27l09l29l23l23k99k88k76k60k37k06j89j53j28
$$ 2369 2137 1872 1580 1293 990 673 346 37 -292 -615 -938 -1237 -1525 -1801 -2061 -2298 -2504 -2693 -2846 -2974
1375b974j18o6l8j4K8M1P9J32J13J81J92K07K51K41K75K76K96L04L12L11L09L16
$$ -2974 -3092 -3158 -3196 -3210 -3182 -3141 -3062 -2930 -2817 -2636 -2444 -2237 -1986 -1745 -1470 -1194 -898 -594 -282 29 338 654
1397F54L02K94K70K47K51K17K00J72J55J25R1Q0K7Lk5n1q3j09j48j60j72k15k22
$$ 654 956 1250 1520 1767 2018 2235 2435 2607 2762 2887 2978 3058 3085 3088 3063 3012 2929 2820 2672 2512 2340 2125 1903
1420A903k51k66k76k81l05l03k97k96l00k91k79k59k55k23k09j94j64j54j11q3
$$ 1903 1652 1386 1110 829 524 221 -76 -372 -672 -963 -1242 -1501 -1756 -1979 -2188 -2382 -2546 -2700 -2811 -2894
1440b894o4k1MJ3O9O4J31J32J76J79K03K53K22K66K65K87K81K96K96K85K83K94
$$ -2894 -2958 -2979 -2975 -2962 -2893 -2829 -2698 -2566 -2390 -2211 -2008 -1755 -1533 -1267 -1002 -715 -434 -138 158 443 726 1020
1462A020K54K53K42K20K06J63J61J33R5P1M6K4Jl9p5q8j21j36j54j93k14k24k44
$$ 1020 1274 1527 1769 1989 2195 2358 2519 2652 2747 2818 2864 2888 2889 2850 2775 2687 2566 2430 2276 2083 1869 1645 1401
1485A401k45k58k81k79k83k89k70k77k62k46k42k21k10j84j69j42j25q2o3m0k2
$$ 1401 1156 898 617 338 55 -234 -504 -781 -1043 -1289 -1531 -1752 -1962 -2146 -2315 -2457 -2582 -2664 -2727 -2767 -2789
1506b789J5M1P1Q1J42J33J58J78K15K11K30K53K50K73K60K86K64K67K78K44K39
$$ -2789 -2774 -2733 -2662 -2581 -2439 -2306 -2148 -1970 -1755 -1544 -1314 -1061 -811 -538 -278 8 272 539 817 1061 1300
1527A300K26K24J84J76J58J42J05P6O5M0jj5n7o4r8j15j51j66j75k03k14k23k40
$$ 1300 1526 1750 1934 2110 2268 2410 2515 2591 2656 2696 2695 2680 2623 2559 2461 2346 2195 2029 1854 1651 1437 1214 974
1550I74k63k58k62k68k53k64k53k46k35k13k08j78j74j41j15r9p3n7k5PJ8N3Q4
$$ 974 711 453 191 -77 -330 -594 -847 -1093 -1328 -1541 -1749 -1927 -2101 -2242 -2357 -2456 -2529 -2586 -2611 -2604 -2586 -2533 -2449
1573b449R3J26J37J60J93K02K04K34K31K47K68K54K60K53K43K36K44K06K14J93
$$ -2449 -2356 -2230 -2093 -1933 -1740 -1538 -1334 -1100 -869 -622 -354 -100 160 413 656 892 1136 1342 1556 1749
1593A749J87J47J20J31Q6N7L3K6j4l0n8q6r0j32j49j69j76j93k11k18k29k44k59
$$ 1749 1936 2083 2203 2334 2420 2477 2510 2536 2522 2492 2434 2348 2258 2126 1977 1808 1632 1439 1228 1010 781 537 278
1616B78k52k37k49k38k31k24k13j86j85j65j40j19r9q8n8k5j5PM6N5R4J02J34
$$ 278 26 -211 -460 -698 -929 -1153 -1366 -1552 -1737 -1902 -2042 -2161 -2260 -2348 -2406 -2431 -2446 -2439 -2393 -2338 -2244 -2142 -2008
1639b008J39J69J80J96K15J97K26K37K38K57K23K43K14K32K16J84J96J67J51J25
$$ -2008 -1869 -1700 -1520 -1324 -1109 -912 -686 -449 -211 46 269 512 726 958 1174 1358 1554 1721 1872 1997
1659A997J23J04N4N4J8Rj4l7q3o7j10j29j48j68j72j99j99k07k29k11k47k25k45
$$ 1997 2120 2224 2278 2332 2350 2359 2345 2308 2225 2158 2048 1919 1771 1603 1431 1232 1033 826 597 386 139 -86 -331
1682c31k16k18k28j95j97j58j61j47j24j07p8o8m3j5nL7M3O8R2J20J11J49J64
$$ -331 -547 -765 -993 -1188 -1385 -1543 -1704 -1851 -1975 -2082 -2160 -2228 -2271 -2286 -2291 -2254 -2211 -2143 -2051 -1931 -1820 -1671 -1507
1705a507J69J98J92K19K17K19K31K23K20K26K17K03J94J81J61J49J20J17J10O8
$$ -1507 -1338 -1140 -948 -729 -512 -293 -62 161 381 607 824 1027 1221 1402 1563 1712 1832 1949 2059 2127
1725B127M8L9Pnl3o8o3r5j13j28j48j60j77j81k08k01k14k16k23k16k22k09j90
$$ 2127 2175 2214 2221 2216 2183 2115 2052 1957 1844 1716 1568 1408 1231 1050 842 641 427 211 -12 -228 -450 -659 -849
1748h49j86j95j63j52j44j22j19p4o5n3j0pJ8L4O3P9R4J18J33J48J58J62J99J80
$$ -849 -1035 -1230 -1393 -1545 -1689 -1811 -1930 -2004 -2069 -2122 -2132 -2139 -2121 -2087 -2024 -1945 -1851 -1733 -1600 -1452 -1294 -1132 -933 -753
1772g53K13K12K04K16K05J99K01J95J91J60J60J47J37J19Q5P1N4L5J6jmo2n3p7
$$ -753 -540 -328 -124 92 297 496 697 892 1083 1243 1403 1550 1687 1806 1891 1962 2016 2051 2067 2066 2062 2000 1947 1870
1796A870j18j15j33j38j65j68j82k00j95k00k05k16j91j94j96j84j63j71j50j33
$$ 1870 1752 1637 1504 1366 1201 1033 851 651 456 256 51 -165 -356 -550 -746 -930 -1093 -1264 -1414 -1547
1816a547j19r9q5o6o0l5PjM4L9O7P5J10J18J32J53J66J68J62K03J94K01J92K09
$$ -1547 -1666 -1765 -1850 -1916 -1976 -2011 -2004 -2005 -1961 -1922 -1855 -1780 -1670 -1552 -1420 -1267 -1101 -933 -771 -568 -374 -173 19 228
1840B28J90J86J92J74J69J45J48J16J20Q4P6N6M2J7Lj4l3n6o9r7j01j16j40j45
$$ 228 418 604 796 970 1139 1284 1432 1548 1668 1752 1828 1884 1926 1943 1946 1932 1899 1843 1774 1677 1576 1460 1320 1175
1864A175j66j61j89j84j80k01j87j85j93j82j76j63j63j31j38j09j14p3o6n5k9
$$ 1175 1009 848 659 475 295 94 -93 -278 -471 -653 -829 -992 -1155 -1286 -1424 -1533 -1647 -1720 -1786 -1841 -1870
1885a870k1NK3M8N9Q0J03J10J07J35J64J51J61J73J83J97J73J91J81J78J83J47
$$ -1870 -1891 -1886 -1863 -1815 -1756 -1676 -1573 -1463 -1356 -1221 -1057 -906 -745 -572 -389 -192 -19 172 353 531 714 861
1907H61J63J38J33J24R7R3Q4O2K8L0Lj1j4o0o4q5r4j08j24j27j46j52j66j59j98
$$ 861 1024 1162 1295 1419 1516 1609 1693 1755 1783 1813 1816 1805 1791 1731 1667 1582 1488 1380 1256 1129 983 831 665 506 308
1932C08j62j86j80j71j69j77j51j42j35j29j15q4q7p9m5l5j8LNL2M7P2Q4Q4J31
$$ 308 146 -40 -220 -391 -560 -737 -888 -1030 -1165 -1294 -1409 -1493 -1580 -1659 -1704 -1739 -1757 -1754 -1749 -1717 -1670 -1598 -1514 -1430 -1299
1957a299J19J36J35J67J49J74J79J62J76J69J68J65J63J47J39J42J10R5R2Q1N5
$$ -1299 -1180 -1044 -909 -742 -593 -419 -240 -78 98 267 435 600 763 910 1049 1191 1301 1396 1488 1569 1624
1978A624M4L0J5nk5l7o0p0r1r0j16j20j30j49j56j61j67j60j68j67j67j63j41
$$ 1624 1668 1698 1713 1708 1683 1646 1586 1516 1425 1335 1219 1099 969 820 664 503 336 176 8 -159 -326 -489 -630
2001f30j67j37j45j18q9j15q0o2n6k9k7MOK8M8O2P4Q7R5J17J38J21J36J65J40
$$ -630 -797 -934 -1079 -1197 -1286 -1401 -1481 -1543 -1599 -1628 -1655 -1651 -1645 -1617 -1569 -1507 -1433 -1346 -1251 -1134 -996 -875 -739 -574 -434
2026d34J64J57J70J64J67J39J44J43J40J10J24J00Q8P2N2M4K6K3rpl8m6n2q6q4
$$ -434 -270 -113 57 221 388 527 671 814 954 1064 1188 1288 1376 1448 1500 1544 1570 1593 1584 1577 1539 1493 1441 1355 1271
2051A271j06j18j09j37j38j43j50j65j46j58j49j61j45j38j40j25j13j13p9r6
$$ 1271 1165 1047 938 801 663 520 370 205 59 -99 -248 -409 -554 -692 -832 -957 -1070 -1183 -1262 -1358
2071a358o4m9m4k4j0KK7L5N0P4P8Q5R3J05J24J27J48J35J48J50J64J50J50J39
$$ -1358 -1422 -1471 -1515 -1539 -1549 -1547 -1520 -1485 -1435 -1361 -1283 -1198 -1105 -1000 -876 -749 -601 -466 -318 -168 -4 146 296 435
2095D35J44J45J19J25J07J03Q3P1O6N2L5J5Lpk1l9n1p6p5j00j02j14j13j29j44
$$ 435 579 724 843 968 1075 1178 1261 1332 1398 1450 1485 1500 1503 1496 1475 1436 1385 1309 1234 1134 1032 918 805 676 532
2120E32j45j52j36j60j30j65j43j22j29j16j22r1j02p5o6n3l2m1pj0K2K5M6N7
$$ 532 387 235 99 -61 -191 -356 -499 -621 -750 -866 -988 -1079 -1181 -1256 -1322 -1375 -1407 -1448 -1455 -1465 -1443 -1418 -1372 -1315
2144a315Q1Q4R0R4J23J14J30J25J56J38J33J47J28J51J37J33J25J02J10R6R2O3
$$ -1315 -1234 -1150 -1060 -966 -843 -729 -599 -474 -318 -180 -47 100 228 379 516 649 774 876 986 1082 1174 1237
2166A237O3M8K7J5K5pl4j1n7n3p2q9r8r6j12j19j24j24j37j43j38j37j27j38j33
$$ 1237 1300 1348 1375 1390 1415 1408 1374 1363 1306 1253 1181 1092 994 898 786 667 543 419 282 139 1 -136 -263 -401 -534
2191e34j21j29j03j01j05o2p0n6m5k5k3%J3NM2N3N9P4Q3R1J00J19J25J17J25J44
$$ -534 -655 -784 -887 -988 -1093 -1155 -1225 -1281 -1326 -1351 -1374 -1374 -1361 -1356 -1314 -1261 -1202 -1128 -1045 -954 -854 -735 -610 -493 -368 -224
2217b24J21J40J42J30J22J41J17J09J06R5Q6O7N6N9M0K1K4j1j0k9m2m2q7o6q0
$$ -224 -103 37 179 309 431 572 689 798 904 999 1085 1152 1208 1267 1307 1328 1352 1341 1331 1302 1260 1218 1131 1065 985
2242I85r7r5j24j15j31j17j41j38j29j14j44j22j18j13j04r9q4q5o4n7m4l2k2
$$ 985 888 793 669 554 423 306 165 27 -102 -216 -360 -482 -600 -713 -817 -916 -1000 -1085 -1149 -1206 -1250 -1282 -1304
2265a304qlL2K0N1M9Q0O9R1R4R7J26J06J29J10J37J26J25J29J35J08J09J19R0
$$ -1304 -1312 -1315 -1283 -1263 -1212 -1163 -1083 -1014 -923 -829 -732 -606 -500 -371 -261 -124 2 127 256 391 499 608 727 817
2289H17J03P8O2P1N1K8L4K3Nj0l2k4m2o0p4p6q9r3j04j07j13j21j19j37j21j29
$$ 817 920 998 1060 1131 1182 1210 1244 1267 1272 1262 1230 1206 1164 1104 1030 954 865 772 668 561 448 327 208 71 -50 -179
2315a79j14j27j03j29q9q5j00p8p4m7n0k7l1k1J2J4K0L8O1M6P5Q5O8J10J08J03
$$ -179 -293 -420 -523 -652 -741 -826 -926 -1004 -1078 -1125 -1175 -1202 -1233 -1254 -1242 -1228 -1208 -1170 -1109 -1063 -988 -903 -835 -725 -617 -514
2341e14J09J26J22J19J27J12J28J10J10J03J15Q9Q1O3P2M6N1K0J2K5j8j0l5l9
$$ -514 -405 -279 -157 -38 89 201 329 439 549 652 767 856 937 1000 1072 1118 1169 1189 1201 1226 1208 1198 1163 1124
2365A124n1o6o1r2q8r0j22j02j08j23j27j15j18j21j14j05j16j04r5q3q1o4n4
$$ 1124 1073 1007 946 854 766 676 554 452 344 221 94 -21 -139 -260 -374 -479 -595 -699 -794 -877 -958 -1022 -1076
2388a076n1k3k8j9kJ0J0N9K1N7P1O8Q7R4J00J06J05J21J13J04J43J06J08J14J09
$$ -1076 -1127 -1150 -1178 -1197 -1199 -1189 -1179 -1120 -1099 -1042 -971 -903 -816 -722 -622 -516 -411 -290 -177 -73 70 176 284 398 507
2413E07J00J00Q6R1O6O3L0N3L1L5Roj0l0k8m8p5n3q0q7q1r7j03j08j14j21j01
$$ 507 607 707 793 884 950 1013 1043 1096 1127 1162 1171 1165 1155 1125 1097 1049 974 921 841 754 673 576 473 365 251 130 29
2440B9j15j21j17r6j09r3r4q9p0p2o1n1l9k4l2jkK4J3N0N5M6P8O3R2Q9R2J20R8
$$ 29 -86 -207 -324 -420 -529 -622 -716 -805 -875 -947 -1008 -1059 -1098 -1122 -1154 -1155 -1157 -1133 -1120 -1070 -1015 -969 -891 -828 -736 -647 -555 -435 -337
2469c37J05J14J19J09J13J06J10R7J07R0P7Q2O8M8N4L0K3J9Plk3k2m7m5o4o9r3
$$ -337 -232 -118 1 110 223 329 439 536 643 733 810 892 960 1008 1062 1092 1115 1134 1141 1138 1115 1093 1046 1001 937 868 775
2496G75o9r2j03j09j12j06j12j19j08j18r4j04j08q4r1q6o6n9n5k9l3k8lkOK4
$$ 775 706 614 511 402 290 184 72 -47 -155 -273 -367 -471 -579 -663 -754 -840 -906 -965 -1020 -1049 -1082 -1110 -1113 -1115 -1109 -1085
2522a085L7M9L4Q0Q1P4Q2R9R5R4J17J06J06J14J12R5J18R1R7R1P9Q5M8O2M5K9
$$ -1085 -1048 -999 -965 -885 -804 -730 -648 -549 -454 -360 -243 -137 -31 83 195 290 408 499 596 687 766 851 899 961 1006 1035
2548A035L6J3qJ0j6l7k3m5n5o9p6p9p0j13q8j12j00r7j13j04r4j19r4j03r8p9
$$ 1035 1071 1084 1076 1086 1070 1033 1010 965 910 841 765 686 616 503 415 303 203 106 -7 -111 -205 -324 -418 -521 -619 -698
2574f98q2o4o2m7l7n1j5k1NkK9K6M0M0O2P0Q1O3R2R7R3R4R8J09J13J09J05J02
$$ -698 -780 -844 -906 -953 -990 -1041 -1056 -1077 -1072 -1074 -1045 -1019 -979 -939 -877 -807 -726 -663 -571 -474 -381 -287 -189 -80 33 142 247 349
2602C49R2Q3R6Q2P2P3O2M7L5L1K0K1opl0j8m8n0o6o0p0q4r9q8j02r4r9j24r4j05
$$ 349 441 524 620 702 774 847 909 956 991 1022 1042 1063 1057 1050 1020 1002 954 904 838 778 708 624 525 437 335 241 142 18 -76 -181
2632a81j06r4j01q1r4p1o3p5m8l8n2j7l2J1QJ6J4K5N7N8N1O9Q3P6R8R7J05R7R7
$$ -181 -287 -381 -482 -563 -657 -728 -791 -866 -914 -952 -1004 -1021 -1053 -1042 -1034 -1018 -1004 -979 -922 -864 -813 -744 -661 -585 -487 -390 -285 -188 -91
2661i1J09R7J06R9R4Q5Q4P4Q1O1O0N6K9L5J2K4knj1l3m6m3o0o2n4q8q1r7q5j10
$$ -91 18 115 221 320 414 499 583 657 738 799 859 915 944 979 991 1015 1013 1008 997 964 918 875 815 753 699 611 530 433 348 238
2691B38q0j16r5r5j09q5q2j00q3p6o4n7p3l4l6k0j7j9PJ1K1J8M4M9O5O4N8R4Q2
$$ 238 158 42 -53 -148 -257 -342 -424 -524 -607 -683 -747 -804 -877 -911 -947 -967 -984 -1003 -996 -985 -964 -946 -902 -853 -788 -724 -666 -572 -490
2720d90Q5R2R2R4R7R9J03R1R6R7P2J03N4P4N6N5L9L3L1J2Kj1rj2m3m5m8o7o6q3
$$ -490 -405 -313 -221 -127 -30 69 172 263 359 456 528 631 685 759 815 870 909 942 973 985 987 976 967 955 912 867 819 752 686 603
2750F03p2q0r2q8r8j01j01r2q6j04q5r8o1q2o6p4n1m1m1l0j9lj1J1J7K0M7L3N7
$$ 603 531 451 359 271 173 72 -29 -121 -207 -311 -396 -494 -555 -637 -703 -777 -828 -869 -910 -940 -959 -962 -973 -962 -945 -925 -878 -845 -788
2779g88N8Q7O9Q3Q5R8Q6R3Q7J00Q6R8R0R0P9P1P9O8M3N3M1K9K9K1J6mrl0j7m6
$$ -788 -730 -643 -574 -491 -406 -308 -222 -129 -42 58 144 242 332 422 501 572 651 719 762 815 856 885 914 935 951 947 938 908 891 845
2809H45n3n0o2p7p0p6o2j15r9r7p4o4r0j18m2j57n4r9l8m2j33J0k8p2m7P0m2J1
$$ 845 792 742 680 603 533 457 395 280 181 84 10 -54 -144 -262 -304 -461 -515 -614 -652 -694 -827 -817 -845 -917 -964 -894 -936 -925
2837i25qO0M5j9M0R5M9J23O0J36%J07Q5J46K6J16R7K3J21Q5J05qR1J15j8R0j1
$$ -925 -933 -873 -828 -847 -807 -712 -663 -540 -480 -344 -344 -237 -152 -6 20 136 233 256 377 462 567 559 650 765 747 837 826
2864H26L4K6M1k9J3k3m7j0kj04j12K0j33m6o8p2p4j45n7j32j08Lj35l3q3j34o9
$$ 826 860 886 927 898 911 888 841 831 829 725 613 633 500 454 386 314 240 95 38 -94 -202 -199 -334 -367 -450 -584 -653
2891f53n4p2l4j9m9j4M5K6q9L8PK9J2O4L8Q7Q4N3N7R3R7P4R7J06P8Q2P7Q6Q1O4
$$ -653 -707 -779 -813 -832 -881 -895 -850 -824 -913 -875 -868 -839 -827 -763 -725 -638 -554 -501 -444 -351 -254 -180 -83 23 101 183 260 346 427 491
2921D91P6Q7M1L0L1M2N4J7j4Jk0M0m9l2l4l9q2n3m8r4o8p0q9q2q7r5q4p7q2p5
$$ 491 567 654 695 725 756 798 852 869 855 856 836 876 827 795 761 722 640 587 539 445 377 307 218 136 49 -46 -130 -207 -289 -364
2951c64p8p6o1m5n8m1m4l6k4k8JJ5j5K2K3L4N0N3N5N5O9O5Q3P8P1R4Q4P4Q3Q8
$$ -364 -442 -518 -579 -624 -682 -723 -767 -803 -827 -855 -854 -839 -854 -832 -809 -775 -725 -672 -617 -562 -493 -428 -345 -267 -196 -102 -18 56 139 227
2981B27Q0P0O5O9P4N8M8M1K8L5K4J6MJk2j9j4l7m9l5o4p4n6o4q6p9q0r3p8p9p4
$$ 227 307 377 442 511 585 643 691 732 760 795 819 835 839 840 818 799 785 748 699 664 600 526 470 406 320 241 161 68 -10 -89 -163
3012a63q6o9p6o9p5n4n1m0m8m1k7j2mOrJ9J8K5L8N6M7N2O3O8O9P3P9Q3Q3P3Q1
$$ -163 -249 -318 -394 -463 -538 -592 -643 -683 -731 -772 -799 -811 -815 -809 -818 -799 -781 -756 -718 -662 -615 -563 -500 -432 -363 -290 -211 -128 -45 28 109
3043A09P3P9P9O8O7O5M7N8L8M2M0KK4J5j0oj2j8m1l7n0m6o1p4n8o1q0p1p1q3p2
$$ 109 182 261 340 408 475 540 587 645 683 725 765 767 791 806 796 790 778 760 719 682 632 586 525 451 393 332 252 181 110 27 -45
3074d5q8q4o6o9o5o5n8m5n8m0k3l3l0jpmQK8J0L8M5M5M1O2N0P8O2Q7O5P2P6O6
$$ -45 -133 -217 -283 -352 -417 -482 -540 -585 -643 -683 -706 -739 -769 -770 -777 -781 -773 -745 -735 -697 -652 -607 -566 -504 -454 -376 -314 -227 -162 -90 -14 52
3106E2Q2P2O7P8O5N3N5O0M2M0M1K8J6J9j1%nj3l4l5m1m3n6o4m8p4o5p2p5p3o6
$$ 52 134 206 273 351 416 469 524 584 626 666 707 735 751 770 759 759 754 741 707 672 631 588 532 468 420 346 281 209 134 61 -5
3137eq7o6q3o5n3o5n7o8m6m0l8j7k1m7lRkJ2K5L6K5M4M3N5M7P1P2N7O9Q7P1O5
$$ -5 -92 -158 -241 -306 -359 -424 -481 -549 -595 -635 -673 -690 -711 -758 -761 -752 -754 -742 -717 -681 -656 -612 -569 -514 -467 -396 -324 -267 -198 -111 -40 25
3169B5Q4P5O8O3O2N7N6N6L8L3L4L8J4K3j1Njj3j4m1k7m8m1n3o8m7o5p7p5n5q1
$$ 25 109 184 252 315 377 434 490 546 584 617 651 689 703 726 715 720 719 706 692 651 624 576 535 482 414 367 302 225 150 95 14
3200A4o7o3p7p0m7p4n9n3m7k6m9l5l2j9LrLJ2J1K2K1L8M2M4M9O5N9O5O4N9P2P2
$$ 14 -53 -116 -193 -263 -310 -384 -443 -496 -543 -569 -618 -653 -685 -704 -701 -710 -707 -695 -684 -662 -641 -603 -561 -517 -468 -403 -344 -279 -215 -156 -84 -12
3232a2O4Q0O4N8N9O0M7O0M6M1M8K5J3K6J3j2Nnk2j4l2m0k7m8n8m5o5n5p0p4o1
$$ -12 52 132 196 254 313 373 420 480 526 567 615 640 653 679 692 680 685 680 658 644 612 572 545 497 439 394 329 274 204 130 69
3263F9n7p2o5o7p0o6n7l7o7l7n0k8l1k4j7JLrJ0J4L1L7L1M3N2M8N5N5O8O1P2O6
$$ 69 12 -60 -125 -192 -262 -328 -385 -422 -489 -526 -576 -604 -635 -659 -676 -675 -672 -681 -671 -657 -626 -589 -558 -515 -463 -415 -360 -305 -237 -176 -104 -38
3295c8O5N8P0O0M9P3N4M3M4L5M8L4K8J5J5J0kj4lk2k6l3l1l4n5m6o8n0o7o0p1
$$ -38 27 85 155 215 264 337 391 434 478 513 561 595 623 638 653 663 661 647 644 622 596 563 532 498 443 397 329 279 212 152 81
3326H1m8o3o4n8p1n8n1m7m1m6m8l4k3k2l2j1KjRK2kK5K5J7Q0k1J30K5N3Q1%J28
$$ 81 33 -30 -94 -152 -223 -281 -332 -379 -420 -466 -514 -548 -571 -593 -625 -636 -634 -635 -626 -604 -606 -581 -556 -539 -459 -480 -350 -325 -272 -191 -191 -63
3358f3L9K3N9J86K3m7J43o3kJ56q8J38J13n2K0M5j60J00M1L9K3r5Lj43%Pj22M7
$$ -63 -24 -1 58 244 267 220 363 300 298 454 366 504 617 565 585 630 470 570 611 650 673 578 581 438 438 445 323 370
3386C70l3l4r7j52l7n6n9j20l1Nj07l9n8j0l1nk7j03NkK9l5j4J1R1M4o1Q0J18
$$ 370 337 303 206 54 17 -39 -98 -218 -249 -244 -351 -390 -448 -458 -489 -494 -521 -624 -619 -621 -592 -627 -641 -630 -539 -495 -556 -476 -358
3415c58l7K4J31J3R1oR6J25OP3K4J15J4J1J9JP6J25N1J6o5L0P1m8k3J9k9j3k8
$$ -358 -395 -371 -240 -227 -136 -142 -46 79 85 158 182 297 311 322 341 342 418 543 594 610 545 575 646 598 575 594 565 552 524
3444E24k7l4m0l5n8n6n0p0m9n9o1n5n4n2o0n5m3n4l7m3l2j9k6l1j7J0j0LK0MK5
$$ 524 497 463 423 388 330 274 224 154 105 46 -15 -70 -124 -176 -236 -291 -334 -388 -425 -468 -500 -519 -545 -576 -593 -583 -593 -590 -570 -566 -541
3475e41K2L2L0L8N7M0M6N2O6M6O8M3O3N9M7O6L6O2L4M1M6K9J5M0K8J0L%loml3
$$ -541 -519 -487 -457 -419 -362 -322 -276 -224 -158 -112 -44 -1 62 121 168 234 270 332 366 407 453 482 497 537 565 575 578 578 575 569 565 532
3507E32j9l1n0k5n5m6n1m3o0m8n8o5o2n0m1o4n2n8l1m8l0k8k9l1k3nqJ3nPRL7
$$ 532 513 482 432 407 352 306 255 212 152 104 46 -19 -81 -131 -172 -236 -288 -346 -377 -425 -455 -483 -512 -543 -566 -571 -579 -566 -571 -564 -555 -518
3539e18J0L7L2L2O3M2N3O0N3M9O2N9N0N8M9M7N3L6M9M1L8L3K9RJ0K2kKrpj3k4
$$ -518 -508 -471 -439 -407 -344 -302 -249 -189 -136 -87 -25 34 84 142 191 238 291 327 376 417 455 488 517 526 536 558 556 558 549 542 529 505
3571E05m0j9m7m4l1n5m4n6l6o1o6m8n3n8m9m2n9l3m5m8k5l0k2k0j3j3J1nlL1R
$$ 505 465 446 399 355 324 269 225 169 133 72 6 -42 -95 -153 -202 -244 -303 -336 -381 -429 -454 -484 -506 -526 -539 -552 -541 -546 -549 -518 -509
3602e09K7K2K8M1L0M2N8M8M3N7L9O3M9M6O2M4N3N1K7O4J7L9K3K9L0KJ5ljmj4q
$$ -509 -482 -460 -432 -391 -361 -319 -261 -213 -170 -113 -74 -11 38 84 146 190 243 294 321 385 402 441 464 493 523 525 540 537 536 532 518 510
3634E10k9k9k4m2l5o0l5m6n3n4n8n1m1n8n2l6n6l5n2l8k8m1l2k1j4pj5Kj1J8J
$$ 510 481 452 428 386 351 291 256 210 157 103 45 -6 -47 -105 -157 -193 -249 -284 -336 -374 -402 -443 -475 -496 -510 -517 -532 -530 -541 -523 -522
3665e22J6L5K2L7M3L3K9L8P0M6O1N3M5M8O0L8N2M3N0L8M5K9J9L7J5K0J5J3j2j
$$ -522 -506 -471 -449 -412 -369 -336 -307 -269 -199 -153 -92 -39 6 54 114 152 204 247 297 335 380 409 428 465 480 500 515 528 516 515
3695E15j0%l0j8k9l7l1m2m6n0n6l5m5o2m2m7n4m8m2n6l8l9m1j8k1l1k2j2jk3J5
$$ 515 505 505 475 457 428 391 360 318 272 222 166 131 86 24 -18 -65 -119 -167 -209 -265 -303 -342 -383 -401 -422 -453 -475 -487 -488 -511 -496
3726d96kJ5NK4K7K3K4M5L3L2O5L8N2M4M1M9M9M9N0N1K6M6N0K7L2L5J5J9J2ONj
$$ -496 -498 -483 -478 -454 -427 -404 -380 -335 -302 -270 -205 -167 -115 -71 -30 19 68 117 167 218 244 290 340 367 399 434 449 468 480 486 491 490
3758D90jqj3k5j9l1k6m6l1m3m6l9n3m4m8m0n6n2m3l7n2l3l8l8l2j6k7k1j6jrn
$$ 490 489 481 468 443 424 393 367 321 290 247 201 162 109 65 17 -23 -79 -131 -174 -211 -263 -296 -334 -372 -404 -420 -447 -468 -484 -485 -494 -499
3790d99MJ4K1J8L0L0K8L4M5M5L7M7M4N2L9N4N6M1M7L3L6N7L0K5L8J3K8J6KQPq
$$ -499 -495 -481 -460 -442 -412 -382 -354 -320 -275 -230 -193 -146 -102 -50 -11 43 99 140 187 220 256 313 343 368 406 419 447 463 465 473 480 472
3822D72rj2k2j6k3m2j0n1m3l4l6n5l8n2m0m6n0l9m2l7m7l5k4l4k1k7j5j1rj0O
$$ 472 463 451 429 413 390 348 338 287 244 210 174 119 81 29 -11 -57 -107 -146 -188 -225 -272 -307 -331 -365 -386 -413 -428 -439 -448 -458 -452
3853d52jJ0J6LL6L7J4L5K8K8M6M5M6N4J7N3M3N1M2L6L0M3L6K8K7K4K9K8oJ9jP
$$ -452 -453 -443 -427 -424 -388 -351 -337 -302 -274 -246 -200 -155 -109 -55 -38 15 58 109 151 187 217 260 296 324 351 375 404 432 426 445 444 451
3885D51j4Nj3l2k0k4k6j8l3m4l8n2k8o3k2l9m3n1m9l3m4l5l2l2l0k8j2j0k1lj
$$ 451 437 442 429 397 377 353 327 309 276 232 194 142 114 51 29 -10 -53 -104 -153 -186 -230 -265 -297 -329 -359 -387 -399 -409 -430 -433 -434
3916d34k0J4RL1RQK9L4L4K9L4M1M6M3N4K5N3M9K0M6M3L7L5K2L7J9K9J7K0%Rjj
$$ -434 -454 -440 -431 -400 -391 -383 -354 -320 -286 -257 -223 -182 -136 -93 -39 -14 39 88 108 154 197 234 269 291 328 347 376 393 413 413 422 421 420
3949D20Ok2rj6k8l0k9k8l8l1m1m3l2n5k8m1l0n7k6m4k9l1l3j4l2k6j1j5j0LjO
$$ 420 426 404 395 379 351 321 292 264 226 195 154 111 79 24 -4 -45 -75 -132 -158 -202 -231 -262 -295 -309 -341 -367 -378 -393 -403 -400 -401 -395
3981c95J9oK8nL5K1J8M6L1L5L7L0M2M3K4M0M8K9M8K8K6L3K9K3J5K2K3J1KJ0jJ
$$ -395 -376 -382 -354 -359 -324 -303 -285 -239 -208 -173 -136 -106 -64 -21 3 43 91 120 168 196 222 255 284 307 322 344 367 378 380 390 389 390
4013C90j4pj0j5l8jm4l1j4n0k7m2k3m4l1n2k2m2l9k7l5l0k4l3j8k1j0k3jqKJJ9
$$ 390 376 369 359 344 306 305 261 230 216 166 139 97 74 30 -1 -53 -75 -117 -156 -183 -218 -248 -272 -305 -323 -344 -354 -377 -378 -386 -384 -383 -364
4046c64KJ6K7J5J9K3L0L1M4K8M0M6L5L3L7L4M3L4K1L1L1J4L5J8K5pK2j0NOj3n
$$ -364 -362 -346 -319 -304 -285 -262 -232 -201 -157 -129 -89 -43 -8 25 62 96 139 173 194 225 256 270 305 323 348 341 363 353 358 364 351 346
4078C46k2%k0k3k1k8j5m2l3m9k7k8l9l2m0l4l3l6k5k1l1k5j7k1j8Jlj0JKMJ0P
$$ 346 324 324 304 281 260 232 217 175 142 93 66 38 -1 -33 -73 -107 -140 -176 -201 -222 -253 -278 -295 -316 -334 -333 -336 -346 -345 -343 -339 -329 -322
4111c22K4OK8K3RM1J9L3M4J9K5M7M1J8L6L3L2K4K3K3K6J6J9J1J5OJ6J0j5j3lp
$$ -322 -298 -292 -264 -241 -232 -191 -172 -139 -95 -76 -51 -4 37 55 91 124 156 180 203 226 252 268 287 298 313 319 335 345 330 317 314 307
4143C07j9ql0k0j6k3m6j7l6k2l7l3k9l4k5m0j6l5l1k9j3k3j0k0j2jkMMqLK8PL
$$ 307 288 280 250 230 214 191 145 128 92 70 33 0 -29 -63 -88 -128 -144 -179 -210 -239 -252 -275 -285 -305 -317 -318 -320 -316 -312 -320 -317 -289 -282 -279
4177b79L2K1J9K4L2L3K9L9L4OM7L2J9L8K8K3L2K3K0J4J8J3LRknLpj2Jj6k3k8r
$$ -279 -247 -226 -207 -183 -151 -118 -89 -50 -16 -10 37 69 88 126 154 177 209 232 252 266 284 297 300 309 307 302 305 298 286 287 271 248 220 211
4211B11l3k7j3m6k6j5l7k5m2k1l0k8k9k8k1j9j0j2k4kj9%LOnNJ4J7J1PK4J7K6
$$ 211 178 151 138 92 66 51 14 -11 -53 -74 -104 -132 -161 -189 -210 -229 -239 -251 -275 -277 -296 -296 -293 -287 -292 -287 -273 -256 -245 -238 -214 -197 -171
4244a71K8K2K0M0K0K3M1K7J7K8L3J3L7J4K9J0RMK6JOOjlJj5ok3j5j5j6l0j8j5
$$ -171 -143 -121 -101 -61 -41 -18 23 50 67 95 128 141 178 192 221 231 240 244 270 271 277 283 282 279 280 265 259 236 221 206 190 160 142 127
4278A27k6l1k6k8l6k8k3l6k2k3l1j9j3k0k0jj2j1pmlnK6J2RJ4K1J4J7L6PK9K9
$$ 127 101 70 44 16 -20 -48 -71 -107 -129 -152 -183 -202 -215 -235 -255 -256 -268 -279 -286 -290 -293 -298 -272 -260 -251 -237 -216 -202 -185 -149 -142 -113 -84
4311h4K4J8L7L9K7J4L8J8K8J6PK9J9nJ9J5J0PpmLj6omk8j7j6l2qk0k9k2m0j4l9
$$ -84 -60 -42 -5 34 61 75 113 131 159 175 182 211 230 225 244 259 269 276 269 265 268 252 246 242 214 197 181 149 141 121 92 70 30 16 -23
4346b3j3l0j6l4j7j6l2ok9j3oj0ooMkPpJ8QPJ8J9J5PM0K2J1J9M1J6K1K4K7J8K5
$$ -23 -36 -66 -82 -116 -133 -149 -181 -187 -216 -229 -235 -245 -251 -257 -253 -255 -248 -255 -237 -229 -222 -204 -185 -170 -163 -123 -101 -90 -71 -30 -14 7 31 58 76 101
4382A01J2K2J9K5RJ9J5KJJJ2lL%j2j9j9prj6j1k3k4k2j7l2k0k1k4l2k6k0qk8j5
$$ 101 113 135 154 179 188 207 222 224 225 226 238 235 238 238 226 207 188 181 172 156 145 122 98 76 59 27 7 -14 -38 -70 -96 -116 -124 -152 -167
4417a67k5pj8j6LJj3Qj5LJ3KQJ7J9NK6K0J4K0K4J7L0L0K0J7K7K8K6K2J6J7J3J8
$$ -167 -192 -199 -217 -233 -230 -229 -242 -234 -249 -246 -233 -231 -223 -206 -187 -182 -156 -136 -122 -102 -78 -61 -31 -1 19 36 63 91 117 139 155 172 185 203
4451B03J2RJ2j5J5j0J5nj4j7oopk8j6l1pk8rp3J2j8k0j9k8rl3pk4k8orok1qLj2
$$ 203 215 224 236 221 236 226 241 236 222 205 199 193 186 158 142 111 104 76 67 -6 6 -12 -32 -51 -79 -88 -121 -128 -152 -180 -186 -195 -201 -222 -230 -227 -239
4488b39QJ0OqJ1RJ7K2RJ7K3K2J8K5J8K0K5J8K3J9K2KL2J8RK0PK0j1J7oJ9j3j1
$$ -239 -231 -221 -215 -223 -212 -203 -186 -164 -155 -138 -115 -93 -75 -50 -32 -12 13 31 54 73 95 97 129 147 156 176 183 203 192 209 203 222 209 198
4522A98Rqj5nkj3l3mj1k5j9k8j9j0k3k0k0k2k5j5j2j4l0j6Nk5j3JJJoQoOJ3J5
$$ 198 207 199 184 179 177 164 131 127 116 91 72 44 25 15 -8 -28 -48 -70 -95 -110 -122 -136 -166 -182 -177 -202 -215 -214 -213 -212 -218 -210 -216 -210 -197 -182
4558a82J1J6J4J3K7J5K5J8K1K1J4L7J0J8K7jL3J8K0NRJJ6NJ1kj9Lj2lqrqk8j5
$$ -182 -171 -155 -141 -128 -101 -86 -61 -43 -22 -1 13 50 60 78 105 104 137 155 175 180 189 190 206 211 222 220 201 204 192 189 181 172 164 136 121
4593A21j4k6jl3k3k0k3k0j9k1j3k0j8qj8k4pJ4pj0K5j02L2Q8n5m7R3j4K3RJ0J7
$$ 121 107 81 80 47 24 4 -19 -39 -58 -79 -92 -112 -130 -138 -156 -180 -187 -173 -180 -190 -165 -267 -235 -147 -202 -249 -156 -170 -147 -138 -128 -111
4625a11J4K5J8J6RJ7K4K2K9LJ8J6J4J4K0MRPNPNnomMnmj3k3Mj8j4k2j6k5pj5j6
$$ -111 -97 -72 -54 -38 -29 -12 12 34 63 66 84 100 114 128 148 152 161 168 173 180 185 180 174 170 174 169 165 152 129 133 115 101 79 63 38 31 16 0
4663@j4l0j3j1k0k7nj3j4j1j5lpnjmRkoJ5J0J8J5KK4LK5K4MK1K7LL0J7K0jK7K4
$$ 0 -14 -44 -57 -68 -88 -115 -120 -133 -147 -158 -173 -176 -183 -188 -189 -193 -184 -186 -192 -177 -167 -149 -134 -132 -108 -105 -80 -56 -52 -31 -4 -1 29 46 66 65 92 116
4701A16MJ6K1QK2nOrJJ0j3Lj1kj7rj7j6j7kk9k0j3j3j8j6l2k5nk0rj0j7pmj5j8
$$ 116 120 136 157 165 187 182 188 179 180 190 177 180 169 167 150 141 124 108 91 89 60 40 27 14 -4 -20 -52 -77 -82 -102 -111 -121 -138 -145 -149 -164 -182
4738a82kJ0oNO%QqK5J2RJ3QK3J0K1RJ6J9J9J3K5PJ2J1J5RJ9%J4J4j1J3j0K0j2
$$ -182 -184 -174 -180 -175 -169 -169 -161 -169 -144 -132 -123 -110 -102 -79 -69 -48 -39 -23 -4 15 28 53 60 72 83 98 107 126 126 140 154 143 156 146 166 154
4774A54j0J6rj0%j2j7j9nj3j3j4k0pk5j7j4qk7oqk5kk3nj6JknpoJ8j2LJ6qJ6J5
$$ 154 144 160 151 141 141 129 112 93 88 75 62 48 28 21 -4 -21 -35 -43 -70 -76 -84 -109 -111 -134 -139 -155 -154 -156 -161 -168 -174 -156 -168 -165 -149 -157 -141 -126
4812a26PPL2J1jJ4K9J2K3J1J7J9L2MNJ6PRPJ5LQmoJ4n%j5j4%k1pj1j0qk2j4k6
$$ -126 -119 -112 -80 -69 -70 -56 -27 -15 8 19 36 55 87 91 96 112 119 128 135 150 153 161 157 151 165 160 160 145 131 131 110 103 92 82 74 52 38 12
4850A2lj7j8j7j4j5j2j1j1j9rrjj1J0rjmJ1nQLJ0J1J2J8MJ4K0RJ2J9K2%J5J3J2
$$ 12 9 -8 -26 -43 -57 -72 -84 -95 -106 -125 -134 -143 -144 -155 -145 -154 -155 -159 -148 -153 -145 -142 -132 -121 -109 -91 -87 -73 -53 -44 -32 -13 9 9 24 37 49
4887D9K0J3J4QRQjJ6pKMkLMj3nOk0rj0qj4rj3j8jj6k3j2j1j0j2k0pnj8Nj1rpj7
$$ 49 69 82 96 104 113 121 120 136 129 131 135 133 136 140 127 122 128 108 99 89 81 67 58 45 27 26 10 -13 -25 -36 -46 -58 -78 -85 -90 -108 -103 -114 -123 -130 -147
4928a47JNkKqJ9ljK3MJ7KJ9%K0OJ4PK4KK4J6J8MJ0K1j0K1K0lQ%Lo%mlJj7Jrj6
$$ -147 -146 -141 -143 -141 -149 -130 -133 -134 -111 -107 -90 -88 -69 -69 -49 -43 -29 -22 2 4 28 44 62 66 76 97 87 108 128 125 133 133 136 130 130 126 123 124 107 108 99 83
4970H3orj1k1oj3j5j7qj5j8qj5j1qj4jnkrMmjJM%J1LJJ4kJ6J8jJ6J0J3J3K0kK6
$$ 83 77 68 57 36 30 17 2 -15 -23 -38 -56 -64 -79 -90 -98 -112 -113 -118 -120 -129 -125 -129 -130 -129 -125 -125 -114 -111 -110 -96 -98 -82 -64 -65 -49 -39 -26 -13 7 5 31
5011C1RQQKJ2RK5kJjPRlNj0jjj1pllqrqj5Lk6Jj3k6pLj9j1j8%mj6JorrPrLkm%
$$ 31 40 48 56 58 70 79 104 102 103 102 109 118 115 120 110 109 108 97 90 87 84 76 67 59 44 47 21 22 9 -17 -24 -21 -40 -51 -69 -69 -73 -89 -88 -94 -103 -112 -105 -114 -111 -113 -117 -117
5059a17KNJ9kJJ0NjK1J3%K7%K3QLJ5KK0jK1J0NLJ0oJ5k%mJ1j0nkknj4loj5j8q
$$ -117 -115 -110 -91 -93 -92 -82 -77 -78 -57 -44 -44 -17 -17 6 14 17 32 34 54 53 74 84 89 92 102 96 111 109 109 105 116 106 101 99 97 92 78 75 69 54 36 28
5101B8j0opj4k3jk2mJk0qmj4pKO%j2MMPlkJ6kK3klK5qJ3J6J5NQJ2OK6mJ5QjJ2
$$ 28 18 12 5 -9 -32 -33 -55 -59 -58 -78 -86 -90 -104 -111 -109 -103 -103 -115 -111 -107 -100 -103 -105 -89 -91 -68 -70 -73 -48 -56 -43 -27 -12 -7 1 13 19 45 41 56 64 63 75
5144G5P%NlJ2%j0J2oNj3j3Nmj3j1jkpj2j1rj4qj2J7k9lomoj9jOk2J2ppJ7j7Oq
$$ 75 82 82 87 84 96 96 86 98 92 97 84 71 76 72 59 48 47 45 38 26 15 6 -8 -16 -28 -11 -40 -43 -49 -53 -59 -78 -79 -73 -95 -83 -90 -97 -80 -97 -91 -99
5186i9J3QQMnJ0J4JOQJ0RJ3qK3qK2KQRR%J3MNRlKK%Pmr%j2kpj3Mj6lj0j6kj6K
$$ -99 -86 -78 -70 -66 -71 -61 -47 -46 -40 -32 -22 -13 0 -8 15 7 29 31 39 48 57 57 70 74 79 88 85 87 89 89 96 92 83 83 71 69 62 49 53 37 34 24 8 6 -10 -8
5232hk9Pkqj9mkpj1JoJqNJrK6j1J2mkJ1J2oK0LK8lQJ2LoJ0K4lJJ7MKrJ7KMpjk
$$ -8 -37 -30 -32 -40 -59 -63 -65 -72 -83 -82 -88 -87 -95 -90 -89 -98 -72 -83 -71 -75 -77 -66 -54 -60 -40 -37 -9 -12 -4 8 11 5 15 39 36 37 54 58 60 51 68 70 74 67 66 64
5278F4oJ1pmkolpmnlj0lpq%j1oj1kOj5j2Nj2%lj4NlkMqJ2lKOoJ9LjnJ8LjK0j0
$$ 64 58 69 62 58 56 50 47 40 36 31 28 18 15 8 0 0 -11 -17 -28 -30 -24 -39 -51 -46 -58 -58 -61 -75 -70 -73 -75 -71 -79 -67 -70 -68 -62 -68 -49 -46 -47 -52 -34 -31 -32 -12 -22
5325b2MPK0nQJ4OJ4mLLJ2j8J2N%J4lnMj1Jm%rrkj3kkj5jj4Pj3qn%j7Jpj2jkKl
$$ -22 -18 -11 9 4 12 26 32 46 42 45 48 60 42 54 59 59 73 70 65 69 58 59 55 55 46 37 35 22 20 18 3 2 -12 -5 -18 -26 -31 -31 -48 -47 -54 -66 -67 -69 -67 -70
5371g0NplJ3pLRkQpK1JkJ0J3KJ1KPlJ3MJ2jOoQJ4jMm%ROj8LjmqmJRj8Mqoj5Nl
$$ -70 -65 -72 -75 -62 -69 -66 -57 -59 -51 -58 -37 -36 -38 -28 -15 -13 -2 0 7 4 17 21 33 32 38 32 40 54 53 57 53 53 62 68 50 53 52 48 40 36 37 46 28 32 24 18 3 8 5
5420Enj0moj0Qj1rJ1j5jpRplNkqKJ7oJrJ2kNK%PRRlJ1lOPJ0JRNJJ3Kj5K1nJ3p
$$ 5 0 -10 -14 -20 -30 -22 -33 -42 -31 -46 -47 -54 -45 -52 -55 -50 -52 -60 -58 -41 -47 -46 -55 -43 -45 -40 -38 -38 -31 -22 -13 -16 -5 -8 -2 5 15 16 25 30 31 44 46 31 52 47 60 53
5468E3J%mLOl%j0j8J1ok4Rljj2Lj2pj0Mj4%mqj1lPj4J0oP%rJ3JpJ1J0LLJMOKO
$$ 53 54 54 50 53 59 56 56 46 28 39 33 9 18 15 14 2 5 -7 -14 -24 -20 -34 -34 -38 -46 -57 -60 -53 -67 -57 -63 -56 -56 -65 -52 -51 -58 -47 -37 -34 -31 -30 -26 -20 -18 -12
5514a2J0J0qNJ2RmJ7oRJ3%jNj7PJ3j0p%prK3l0Opnj2J7j1Mnj2nJlj7JlQolj4K
$$ -12 -2 8 0 5 17 26 22 39 33 42 55 55 54 59 42 49 62 52 45 45 38 29 52 22 28 21 16 4 21 10 14 9 -3 -8 -7 -10 -27 -26 -29 -21 -27 -30 -44 -42
5558d2pKnMPoOmJ%nnNJ5kP%J3j5J2jRLJJ3MJ2j2K0rNjJ3pJ9q%j%QpKjJNjj6kN
$$ -42 -49 -47 -52 -48 -41 -47 -41 -45 -44 -44 -49 -54 -49 -34 -36 -29 -29 -16 -31 -19 -20 -11 -8 -7 6 10 22 10 30 21 26 25 38 31 50 42 42 41 41 49 42 44 43 44 49 48 32 30 35
5607C5qj7Pk1kJj1kmlj0rj4J6j8J7%rQj3j0J6qMOPLLMMKoJ9lJ4MJJ1OMLJoRKJ
$$ 35 27 10 17 -4 -6 -5 -16 -18 -22 -25 -35 -44 -58 -42 -60 -43 -43 -52 -44 -57 -67 -51 -59 -55 -49 -42 -39 -36 -32 -28 -26 -32 -13 -16 -2 2 3 14 20 24 27 28 22 31 33 34
5653C4J1rJ1Mj8J6j2J3rj0JrLj6oRNpj2qKoJJj1Qkj7%NlmlQk2LJJ9j3OkPlkqJ9
$$ 34 45 36 47 51 33 49 37 50 41 31 32 23 26 10 4 13 18 11 -1 -9 -7 -13 -12 -11 -22 -14 -16 -33 -33 -28 -31 -35 -38 -30 -52 -49 -48 -29 -42 -36 -38 -31 -34 -36 -44 -25
5699b5JMJ1pNKQnQpMJ8j4J7pRMrJ9oJ2kLqOlLjj1nkKQpoj2Orj4%Jkqolkln%%j5
$$ -25 -24 -20 -9 -16 -11 -9 -1 -6 2 -5 -1 17 3 20 13 22 26 17 36 30 42 40 43 35 41 38 41 40 29 24 22 24 32 25 19 7 13 4 -10 -10 -9 -11 -19 -25 -28 -30 -33 -38 -38 -38 -53
5750e3jMn%QMmJ6j3KJ5jMRmLRnJ4J2nJ0J1oJ2pRNkkqLLKj0Mjmm%Rj3mJj3J4qp
$$ -53 -54 -50 -55 -55 -47 -43 -47 -31 -44 -42 -27 -28 -24 -15 -19 -16 -7 -12 2 14 9 19 30 24 36 29 38 43 41 39 31 34 37 39 29 33 32 28 24 24 33 20 16 17 4 18 10 3
5798Cj0KkpJqQqJ5j9r%PMj1QnRklPj1RmLNMmjMRRKj3J0LKPQj6QnMLpJ4lOLjKj6
$$ 3 -7 -5 -7 -14 -13 -21 -13 -21 -6 -25 -34 -34 -27 -23 -34 -26 -31 -22 -24 -27 -20 -31 -22 -26 -23 -18 -14 -18 -19 -15 -6 3 5 -8 2 5 7 14 22 6 14 9 13 16 9 23 20 26 29 28 30 14
5850A4J8j1Mj0J5jj4JmknJ3j4JoNj0o%Oj3oMj6LNmkLj0KKJ4j0PQj2RpK1JJj0R
$$ 14 32 21 25 15 30 29 15 16 12 10 5 18 4 5 -1 4 -6 -12 -12 -6 -19 -25 -21 -37 -34 -29 -33 -35 -32 -42 -40 -38 -24 -34 -27 -19 -31 -22 -29 -8 -7 -6 -16 -7
5894gJ7rJ4KmJ2qRjkNlMKMjmqjOj4R%j5KRj3j0kmj%rrJ4ljj5OPrJQLj0LJkJ2%
$$ -7 10 1 15 17 13 25 17 26 25 23 28 25 29 31 35 34 30 22 21 27 13 22 22 7 9 18 5 -5 -7 -11 -12 -12 -21 -30 -16 -19 -20 -35 -29 -22 -31 -30 -22 -19 -29 -26 -25 -27 -15 -15
5944a5kmPjmJ0rK3rK%kJ3lj%J3rMj8J8J3rj0J4ojJQjknkLlMj%qPj0jpRqKLj7P
$$ -15 -17 -21 -14 -15 -19 -9 -18 5 -4 -2 -2 -4 9 6 5 5 18 9 13 -5 13 26 17 7 21 15 14 15 23 22 20 15 13 16 13 17 16 16 8 15 5 4 -3 6 -2 0 3 -14 -7
5993grqP%oJnmNj1J3rJ2j3LlJ0lRmRlMKMOJ2qJ4oRlnJ1Qj7NRmqQPrMj1JOj3%J
$$ -7 -16 -24 -17 -17 -23 -22 -27 -31 -26 -37 -24 -33 -21 -34 -31 -34 -24 -27 -18 -22 -13 -16 -12 -10 -6 0 12 4 18 12 21 18 13 24 32 15 20 29 25 17 25 32 23 27 16 17 23 10 10 11
6043A1nkMj1poJNmlJl%Oj5J3lOj2JJJ1pRLlLj3MMR%MPj1MO%PoMpMM%OkrmlPjO
$$ 11 6 4 8 -3 -10 -16 -15 -10 -14 -17 -16 -19 -19 -13 -28 -15 -18 -12 -24 -23 -22 -11 -18 -9 -6 -9 -6 -19 -15 -11 -2 -2 2 9 -2 2 8 8 15 9 13 6 10 14 14 20 18 9 5 2 9 8 14
6096A4pJoK%qPqPnjJ1%OmnjmLOj5kjKoQJj1j1K4j9JOLRj0jnPkmNPj3K3rPjmj4
$$ 14 7 8 2 4 4 -4 3 -5 2 -3 -4 7 7 13 9 4 3 -1 2 8 -7 -9 -10 -8 -14 -6 -5 -16 -27 -3 -22 -21 -15 -12 -3 -13 -14 -19 -12 -14 -18 -13 -6 -19 4 -5 2 1 -3 -17
6146a7K1NlJRj1mNJ2nJNKj1oJ3lkj0N%j0jMqPqqMjMkj1J0oNkoNKJ0rLJKKLj0J3
$$ -17 4 9 6 7 16 5 1 6 18 13 14 19 21 10 4 17 14 12 2 7 7 -3 -4 0 -8 -1 -9 -17 -13 -14 -10 -12 -23 -13 -19 -14 -16 -22 -17 -15 -5 -14 -11 -10 -8 -6 -3 -13 0
6195@j0J6Rj2qJ0pJ4LjJjpJ0nlMp%j2J2lpkNKjPknj0PlkJ1pMj7J1Rj%j4J0PJ0
$$ 0 -10 6 15 3 -5 5 -2 12 15 14 15 14 7 17 12 9 13 6 6 -6 6 3 -4 -6 -1 1 0 7 5 0 -10 -3 -6 -8 3 -4 0 -17 -6 3 2 2 -12 -2 5 15
6241A5j6kpJ0oJ1mqKjJJ6rj7J9pjjlKJ0j1J3j4J4knoRj3J9qJKLk%PoJNqj%Ppn
$$ 15 -1 -3 -10 0 -6 5 1 -7 -5 -6 -5 11 2 -15 4 -3 -4 -5 -8 -6 4 -7 6 -8 6 4 -1 -7 2 -11 8 0 1 3 6 4 4 11 5 6 11 3 2 2 9 2 -3
6288cmKrNLjjkPMj0j3NJnMoMNKkjJ1j5K8j5LMjLKMj0J1lRNPj2JJ6k0%KOjloJq
$$ -3 -7 -5 -14 -9 -6 -7 -8 -10 -3 1 -9 -22 -17 -16 -21 -17 -23 -19 -14 -12 -14 -15 -4 -19 9 -6 -3 1 0 3 5 9 -1 10 7 16 21 28 16 17 33 13 13 15 21 20 17 11 12 4
6338DklMkNk2kJ0Jpj5NJMOLj4QLrOKlKlQLpQ%OLjOqPkk%J1%lKMpnQkk%Kkj0lJ0
$$ 4 2 -1 3 1 6 -16 -18 -8 -7 -14 -29 -24 -23 -19 -13 -10 -24 -16 -13 -22 -16 -14 -17 -15 -18 -10 -7 -14 -6 -6 0 3 2 8 0 7 5 3 3 14 14 11 13 17 10 5 13 11 9 9 11 9 -1 -4 6
6393FMrOo%J5onkljQj0kOqLlJ1Jj5J4k6RNnjLOj0oMJm%NKpMOMlJ4j9RkPMO%OL
$$ 6 10 1 7 1 1 16 10 5 3 0 -1 7 -3 -5 1 -7 -4 -7 4 5 -10 4 -22 -13 -8 -13 -14 -11 -5 -15 -21 -17 -16 -20 -20 -15 -13 -20 -16 -10 -6 -9 5 -14 -5 -7 0 4 10 10 16 19
6445A9J0Kj4lMKoPLOj2mRj1PrJ0pnNoj5%MlPpmmLj0Ojj3J3j2J5qmlJ0JljJ6j1
$$ 19 29 31 17 14 18 20 14 21 24 30 18 14 23 12 19 10 20 13 8 13 7 -8 -8 -4 -7 0 -7 -11 -15 -12 -22 -16 -17 -30 -17 -29 -14 -22 -26 -29 -19 -18 -21 -22 -6 -17
6491a7OLnJ2Qj0LJ5nONmO%j3OjRj5NmjkjJ5j0j1OlJJlpJ3qlK%LrjkLnlQooJ2q
$$ -17 -11 -8 -13 -1 7 -3 0 15 10 16 21 17 23 23 10 16 15 24 9 14 10 9 7 6 21 11 0 6 3 4 5 2 -5 8 0 -3 -1 -1 2 -7 -8 -10 -7 -12 -15 -7 -13 -19 -7 -15
6541a5JkJMooOkqJ5JlkmJ6lnJ3poJ0lMOlJ5j0J1KLJJrQq%RpK%lOn%LpNj1qNj2
$$ -15 -14 -16 -15 -11 -17 -23 -17 -19 -27 -12 -11 -14 -16 -20 -4 -7 -12 1 -6 -12 -2 -5 -1 5 2 17 7 18 20 23 24 25 16 24 16 16 25 18 20 20 17 23 18 18 21 14 19 8 0 5 -7
6592gQp%JrOkj2%mqJ0molOknJ5rJ0LLJjJ3mkPJ0jJJ8j8K4k7J5LlMJ2nQj3%Rj7
$$ -7 1 -6 -6 -5 -14 -8 -10 -22 -22 -26 -34 -24 -28 -34 -37 -31 -33 -38 -23 -32 -22 -19 -16 -15 -16 -3 -7 -9 -2 8 7 8 26 8 32 5 20 23 20 24 36 31 39 26 26 35 18
6639A8LPlkoJ2j4nJ0poj4J1o%pmOkj2J9j9RoqlJ1QrjjOj1J3joJ1qMOmmJ1lMPr
$$ 18 21 28 25 23 17 29 15 10 20 13 7 -7 4 -2 -2 -9 -13 -7 -9 -21 -2 -21 -12 -18 -26 -29 -18 -10 -19 -20 -21 -15 -26 -13 -14 -20 -9 -17 -13 -7 -11 -15 -4 -7 -3 4 -5
6686eJ6mj3J6%mJ3qkK3rQJJn%PrLknJ2omm%jqJ2kj9pKNppJj4LKplj0OKKj1Mj1
$$ -5 11 7 -6 10 10 6 19 11 9 32 23 31 32 33 28 28 35 26 29 27 22 34 28 24 20 20 19 11 23 21 2 -5 -3 2 -5 -12 -11 -25 -22 -20 -27 -30 -40 -34 -32 -30 -41 -37 -48
6735d8J5kOjJ3rlJ5nJ8OmQOrJ6LJ0ljJjJ1Rj0qJ0qNpRJj2Ok0NrolLrKNj3mLqj2
$$ -48 -33 -35 -29 -30 -17 -26 -29 -14 -19 -1 5 1 9 15 6 22 25 35 32 31 32 31 42 51 41 33 43 35 40 33 42 43 31 37 17 22 13 7 4 7 -2 0 5 -8 -12 -9 -17 -29
6783b9J1j0J0mlj1MRoNlnKMKMjmJJ3pk%PjQ%J0JJRj1J8kj4kJ9mJ3j5ONKlJ1nk
$$ -29 -18 -28 -18 -22 -25 -36 -32 -23 -29 -24 -27 -32 -30 -26 -24 -20 -21 -25 -24 -11 -18 -20 -20 -13 -14 -6 -6 4 5 6 15 4 22 20 6 4 23 19 32 17 23 28 30 27 38 33 31
6830C1j0J0Jo%Krj2J0Jqjj2lrJ1nj8J5j1njj7J1lokRj1MjLPmMj2L1qljJ2oJ3O
$$ 31 21 31 32 26 26 28 19 7 17 18 10 9 -3 -6 -15 -4 -9 -27 -12 -23 -28 -29 -46 -35 -38 -44 -46 -37 -48 -44 -45 -42 -35 -39 -35 -47 -16 -24 -27 -28 -16 -22 -9 -3
6874cQLJRO%KK2pnjJ1pPmjjQpooqJkpNlj6JnLmq%k3JJ3Lpj6J4qQqq%QNj1J1oK
$$ -3 5 8 9 18 24 24 26 48 41 36 35 46 39 46 42 41 40 48 41 35 29 21 22 20 13 18 15 -1 0 -5 -2 -6 -14 -14 -37 -36 -23 -20 -27 -43 -29 -37 -29 -37 -45 -45 -37 -32 -43 -32 -38 -36
6926c6KM%OPPOpJ0%OJjlJ6pRjOj%jMRmNMqJ1Nk1J8opLj1J9ok4Nkj1lkj3kqmjK
$$ -36 -34 -30 -30 -24 -17 -10 -4 -11 -1 -1 5 6 5 2 18 11 20 19 25 24 24 23 27 36 32 37 41 33 44 49 28 46 40 33 36 25 44 38 14 19 17 6 3 1 -12 -14 -22 -26 -27 -25
6976b5oj1Rkpj3jJ2mqqJ6kKLJ4loPLJ7%J2LKPoMK0PlJ0JO%Np%LPJ2j4j1jMkqj7
$$ -25 -31 -42 -33 -35 -42 -55 -56 -44 -48 -56 -64 -48 -50 -48 -45 -31 -34 -40 -33 -30 -13 -13 -1 2 4 11 5 9 29 36 33 43 44 50 50 55 48 48 51 58 70 56 45 44 48 46 38 21
7024B1J2oj3mj9J7mj0j0mpMnMpj0oLj3JRj2JJ8OLo%QmKKKJ4MmJ7j5J1jOKLMKJ4
$$ 21 33 27 14 10 -9 8 4 -6 -16 -20 -27 -23 -28 -24 -31 -41 -47 -44 -57 -56 -47 -59 -58 -40 -34 -31 -37 -37 -29 -33 -31 -29 -27 -13 -9 -13 4 -11 0 -1 5 7 10 14 16 30
7070C0JmRMoPpJ0nLmNkpMj1J3j5%Oj0pLooj2kqJ2%k4kjoPkj6j5MQJ0j5J1j2j0
$$ 30 31 27 36 40 34 41 34 44 39 42 38 43 41 34 38 27 40 25 25 31 21 14 17 11 5 -7 -9 -17 -5 -5 -29 -31 -32 -38 -31 -33 -49 -64 -60 -52 -42 -57 -46 -58 -68
7115f8J7KnJ2NNJnJ3J7mJ1qJ9KPJ4MPMnlJ7qJ0poJ6j2J0rmNj3lQj7Nj2j5jJj9
$$ -68 -51 -49 -54 -42 -37 -32 -31 -36 -23 -6 -10 1 -7 12 14 21 35 39 46 50 45 42 59 51 61 54 48 64 52 62 53 49 54 41 38 46 29 34 22 7 6 7 -12
7158a2kjnrJ3j6%j4LoM%j0NMnPJLJ0j7QJ1mNKMJ2PqLLRMOOJ1nRj2jJ3PJ5j1Lj0
$$ -12 -14 -15 -20 -29 -16 -32 -32 -46 -43 -49 -45 -45 -55 -50 -46 -51 -44 -43 -40 -30 -47 -39 -28 -32 -27 -25 -21 -9 -2 -10 -7 -4 5 9 15 21 32 27 36 24 23 36 43 58 47 50 40
7205D0LpJ5p%Mo%k0J9pnjplj4O%j3pn%j3pJ6j8Kj5j%Nj2OLrOlkOLjPmJ5OJJ8l
$$ 40 43 36 51 44 44 48 42 42 22 41 34 29 28 21 18 4 10 10 -3 -10 -15 -15 -28 -35 -19 -37 -35 -50 -51 -51 -46 -58 -52 -49 -58 -52 -55 -57 -51 -48 -49 -42 -46 -31 -25 -24 -6 -9
7253iJ4OLRjJ1JOMLNJRKJ1lj3oMoj4KJNj3omoqqklj2j1PqKj6Klkmj4QJkMJj3J1
$$ -9 5 11 14 23 22 33 34 40 44 47 52 53 62 64 75 72 59 53 57 51 37 39 40 45 32 26 22 16 8 0 -2 -5 -17 -28 -21 -29 -27 -43 -41 -44 -46 -50 -64 -56 -55 -57 -53 -52 -65 -54
7303e4PjRjRj0J9%J9j3J4j0J2mK5mN%mK2QrkrJ2Qj1J3j2J5rQj7PRj5MMqK9l3k5
$$ -54 -47 -48 -39 -40 -31 -41 -22 -22 -3 -16 -2 -12 0 -4 21 17 22 22 18 40 48 39 37 28 40 48 37 50 38 53 44 52 35 42 51 36 40 44 36 65 32 7
7345GM8l6m2J1j0jk7K7L1m8nnL7m1ql3R4p2Q2m9l9j2O8n1K5l9QN5q7Q5l0N0Om7
$$ 7 55 19 -23 -12 -22 -23 -50 -23 8 -40 -45 -50 -13 -54 -62 -95 -1 -73 9 -40 -79 -91 -23 -74 -49 -88 -80 -25 -112 -27 -57 -7 -1 -48
7379d8pJ10p5N1l8P7k4K1NL7n5KPK1Ql8J25j09mJ0n2L1p0J12j8n3l7R1o8n5N7
$$ -48 -55 55 -20 31 -7 70 46 67 72 109 54 56 63 84 92 54 179 70 66 76 24 55 -15 97 79 26 -11 80 12 -43 14
7410A4r2J25rq0N3q6N4j8qL6j1r8K3O7j5Qk3%j3N2j1K0kJp8J2R8k3rl6L8l8p1
$$ 14 -78 47 38 -42 11 -75 -21 -39 -47 -11 -22 -120 -97 -30 -45 -37 -60 -60 -73 -21 -32 -12 -14 -13 -91 -79 19 -4 -13 -49 -11 -49 -120
7443a20K36j18m1O8j8O3jl4k7j1L6L5n9K8P0l3o1K7P8p4N9m6l0P7j03m5N0j7k2
$$ -120 116 -2 -43 25 7 70 69 35 8 -3 33 68 9 37 107 74 13 40 118 44 103 57 27 104 1 -44 6 -11 -33
7472c3L9mL7Ln4M1l2m1Q9j29J08n6J6m5J8qk7K0j2n2M4JN5MJ9Op8L6LJ5n0N2J5
$$ -33 6 2 39 42 -12 29 -3 -44 45 -84 24 -32 -16 -61 -43 -51 -78 -58 -70 -122 -78 -77 -22 -18 1 7 -71 -35 -32 -17 -67 -15 0
7505@J2n0Q9n4L4k0j9J7N1ol3L9J3Oq6O7k8K4k3N7n9j8K2lM3j0qK7r4N8m0Qj4
$$ 0 12 -38 51 -3 31 11 -8 9 60 54 21 60 73 79 -7 60 32 56 33 90 31 13 35 32 75 65 57 84 -10 48 8 16 2
7538BL1k2m3l0K2L8k4l6K4Q%l1jLNnj5L1QmplRjJ0MjJ6jjjRJJ8JJ0%kMjJ1KjK
$$ 2 33 11 -32 -62 -40 -2 -26 -62 -38 -30 -30 -61 -62 -59 -54 -59 -74 -43 -35 -39 -46 -49 -40 -41 -31 -27 -28 -12 -13 -14 -15 -6 -5 13 14 24 24 22 26 25 36 38 37 39
7582C9%Mj3RPj0On%rP%Knkj4oNkKj4Qj8j2LNrmj0oKjKk2jLONj2Ojl%QJ5rJ9j9
$$ 39 39 43 30 39 46 36 42 37 37 28 35 35 37 32 30 16 10 15 13 15 1 9 -9 -21 -18 -13 -22 -26 -36 -42 -40 -41 -39 -61 -62 -59 -53 -48 -60 -54 -55 -58 -58 -50 -35 -44 -25 -44
7630d4J1KOPJ2j0J9mOJ3J1Lj%J4%RJjnJ3kj1loPJ%oj4Jqklpj9J2j0opj8J3oj6
$$ -44 -33 -31 -25 -18 -6 -16 3 -1 5 18 29 32 31 31 45 45 54 55 54 49 62 60 49 46 40 47 48 48 42 28 29 21 19 16 9 -10 2 -8 -14 -21 -39 -26 -32 -48
7674d8J2j2Mj6rJ2J0nj2J3j1K0JnMJNlOMOJQRMPj0PJ3MJ6pjOj1J4MoQj1JKJKo
$$ -48 -36 -48 -44 -60 -69 -57 -47 -52 -64 -51 -62 -42 -41 -46 -42 -41 -36 -39 -33 -29 -23 -22 -14 -5 -1 6 -4 3 16 20 36 29 28 34 23 37 41 35 43 32 33 35 36 38 32
7719C2JjlKpjJ1j3jNk5opJjMrj2OnkKj2Kr%Pj2%LqMm%RKKJ2LJJ0j8K7jQkQJ1O
$$ 32 33 32 29 31 24 23 34 21 20 25 0 -6 -13 -12 -13 -9 -18 -30 -24 -29 -31 -29 -41 -39 -48 -48 -41 -53 -53 -50 -58 -54 -58 -58 -49 -47 -45 -33 -30 -29 -19 -37 -10 -11 -3 -5 3 14 20
7768B0OQkJ4pOmJ5qPQj6L%%qQJj2pj1JMokj4kj2%lj2j0Rj3j0Pj1kkrJ4rPNj2O
$$ 20 26 34 32 46 39 45 41 56 48 55 63 47 50 50 50 42 50 51 39 32 21 22 26 20 18 4 2 -10 -10 -13 -25 -35 -26 -39 -49 -42 -53 -55 -57 -66 -52 -61 -54 -49 -61 -55
7814e5KJ3mM%J7%nJ6QljJ0kJ2N%RKKQKqMJNJ2pPqkNkllplPk6J7j0j1On%j0%q%
$$ -55 -53 -40 -44 -40 -40 -23 -23 -28 -12 -4 -7 -8 2 0 12 17 17 26 28 30 38 40 32 36 37 42 54 47 54 46 44 49 47 44 41 34 31 38 12 29 19 8 14 9 9 -1 -1 -9 -9
7863ikj8J2j5kjj8KpKPpQooPPkJqJ2J0LnOLJ5j0JJ3J8KNKJ4jJ3qJ4PnM%njmLr
$$ -9 -11 -29 -17 -32 -34 -35 -53 -51 -58 -56 -49 -56 -48 -54 -60 -53 -46 -48 -47 -55 -43 -33 -30 -35 -29 -26 -11 -21 -20 -7 11 13 18 20 34 33 46 38 52 59 54 58 58 53 52 48 51 42
7911D2K4k0oQj5Kj1olj2nkj6Qj4oorJ0j6Oj2Lj3J1MrkNJ2rlJ9mKK4mnOMjOJ6j
$$ 42 66 46 40 48 33 35 24 18 15 3 -2 -4 -20 -12 -26 -32 -38 -47 -37 -53 -47 -59 -56 -69 -58 -54 -63 -65 -60 -48 -57 -60 -41 -45 -43 -19 -23 -28 -22 -18 -19 -13 3 2
7955BLPLQjnMJ0oJ0mQljNJ7l1OQj4OJKj0%lJrPj3j3J0j3Jmj0J1j9qnrOj2J4%j0
$$ 2 5 12 15 23 22 17 21 31 25 35 31 39 36 35 40 57 26 32 40 26 32 33 35 25 25 22 23 14 21 8 -5 5 -8 -7 -11 -21 -10 -29 -37 -42 -51 -45 -57 -43 -43 -53
8001e3MqNJj1JJ2kM%%ROJJ6jLJ5lOnJ7J0JjPPPjQj3NJ9pJ3k2OJj2j1JqNJj4lJ
$$ -53 -49 -57 -52 -51 -62 -61 -49 -51 -47 -47 -47 -38 -32 -31 -15 -16 -13 2 -1 5 0 17 27 28 27 34 41 48 47 55 42 47 66 59 72 50 56 57 45 34 35 27 32 33 19 16 17
8048A7k4pj2J6oorqLj3mjLrkJ5q%Pj4RRJkj2J7J3LLjJ8%JnRKK4kkJ0OOj3J3q%
$$ 17 -7 -14 -26 -10 -16 -22 -31 -39 -36 -49 -53 -54 -51 -60 -62 -47 -55 -55 -48 -62 -53 -44 -43 -45 -57 -40 -27 -24 -21 -22 -4 -4 -3 -8 1 3 27 25 23 33 39 45 32 45 37 37
8094C7Pj1J5j3J2kmPj4jjojoRk0J2j0j2J1j3M%j6Knj0Qj9Rj5%Lj1%pJ1qJ5kmM
$$ 37 44 33 48 35 47 45 41 48 34 33 32 26 25 19 28 8 20 10 -2 9 -4 0 0 -16 -14 -19 -29 -21 -40 -31 -46 -46 -43 -54 -54 -61 -50 -58 -43 -45 -49 -45
8136d5rJ8oJ3oMOQJ0lJ0PQlJ9pOJ3lnJ4J0jLqJ4J0l0J7j0oj0%kj5Rjj4Joroop
$$ -45 -54 -36 -42 -29 -35 -31 -25 -17 -7 -10 0 7 15 12 31 24 30 43 40 35 49 59 58 61 53 67 77 47 64 54 48 38 38 36 21 30 29 15 16 10 1 -5 -11 -18
8180a8qKj3j7KoJNlj9K0
$$ -18 -26 -24 -37 -54 -52 -58 -57 -52 -55 -74 -54
8191e4
$$ Imaginary data points
##PAGE= N=2
##DATA TABLE= (X++(I..I)), XYDATA
0@%%%%%%%%%%%%%%%%%%%%%%%%%%jRj6J6j6J6j6J6j6J9k7L2l2L4l8M4n0N3n9O7
$$ 0 0 0 0 0 0 0 0 0 0 0 0 0 0 0 0 0 0 0 0 0 0 0 0 0 0 0 -1 8 -8 8 -8 8 -8 8 -8 11 -16 16 -16 18 -20 24 -26 27 -32 35
46C5p4Q1r0R9j09J20j30J44j60J77j96K19k45K74l09L52m07M77n70P05r13J286
$$ 35 -39 42 -48 51 -58 62 -68 76 -84 93 -103 116 -129 145 -164 188 -219 258 -312 393 -520 766
68G66k163Q194P920n661k247m504k919m185l028l838k926l451k644k952k229k393
$$ 766 -1397 6797 14717 9056 6809 2305 -614 -4799 -7827 -11665 -14591 -18042 -20686 -23638 -25867 -28260
84b8260j693j723j068j027m33l01K43L99Q89J051J494J674K050K200K516K619
$$ -28260 -29953 -31676 -32744 -33771 -34204 -34505 -34262 -33863 -32974 -31923 -30429 -28755 -26705 -24505 -21989 -19370
100a9370K877K944L109L143L199L168L228L086L065K958K820K648K472K248K044
$$ -19370 -16493 -13549 -10440 -7297 -4098 -930 2298 5384 8449 11407 14227 16875 19347 21595 23639
115B3639J765J528J227R59O52L59N5k21n16q06j074j344j584j813k023k206k392
$$ 23639 25404 26932 28159 29118 29770 30129 30184 29963 29447 28641 27567 26223 24639 22826 20803 18597 16205
132A6205k533k631k741k798k787k818k827k715k697k595k453k329k157j958j768
$$ 16205 13672 11041 8300 5502 2715 -103 -2930 -5645 -8342 -10937 -13390 -15719 -17876 -19834 -21602
147b1602j544j302j042q01n39k78OK61N24P73J022J251J465J673J854K021K186
$$ -21602 -23146 -24448 -25490 -26291 -26830 -27108 -27102 -26841 -26317 -25544 -24522 -23271 -21806 -20133 -18279 -16258 -14072
164a4072K298K399K483K522K525K584K525K460K421K333K209K072J923J765J558
$$ -14072 -11774 -9375 -6892 -4370 -1845 739 3264 5724 8145 10478 12687 14759 16682 18447 20005
179B0005J346J141R15O87M32K09l5k93n16p44r66j179j370j558j741j862k024
$$ 20005 21351 22492 23407 24094 24526 24735 24700 24407 23891 23147 22181 21002 19632 18074 16333 14471 12447
196A2447k119k214k295k302k311k372k308k237k218k138k024j875j748j587j410
$$ 12447 10328 8114 5819 3517 1206 -1166 -3474 -5711 -7929 -10067 -12091 -13966 -15714 -17301 -18711
211a8711j217j026q04o00l69j71Q5K95N17P25R24J119J305J478J625J763J864
$$ -18711 -19928 -20954 -21758 -22358 -22727 -22898 -22813 -22518 -22001 -21276 -20352 -19233 -17928 -16450 -14825 -13062 -11198
228a1198K012K079K112K110K176K160K202K090J974J970J857J756J561J518J242
$$ -11198 -9186 -7107 -4995 -2885 -709 1451 3653 5743 7717 9687 11544 13300 14861 16379 17621
243A7621J095R29O30N11L51J34j34l89m57o60r76r67j353j449j487j659j792j865
$$ 17621 18716 19645 20275 20786 21137 21271 21137 20748 20291 19631 18655 17688 16335 14886 13399 11740 9948 8083
261H083k004j975j992k090k009j873k007j914j870j646j625j532j194j148j054
$$ 8083 6079 4104 2112 22 -1987 -3860 -5867 -7781 -9651 -11297 -12922 -14454 -15648 -16796 -17850
276a7850p16n61o00j39N4J50M49M35O67J054J075J201J313J556J608J711J696
$$ -17850 -18566 -19127 -19727 -19866 -19812 -19662 -19213 -18778 -18111 -17057 -15982 -14781 -13468 -11912 -10304 -8593 -6897
293f897J932J872J838J869J983J797J838J691J697J570J411J331J186R66Q84O81
$$ -6897 -4965 -3093 -1255 614 2597 4394 6232 7923 9620 11190 12601 13932 15118 16084 16968 17649
309A7649N11L37J51n2k14m04n68p45r07j049j195j314j441j531j635j697j733
$$ 17649 18160 18497 18648 18596 18382 17978 17410 16665 15758 14709 13514 12200 10759 9228 7593 5896 4163
326D163j726j788j821j747j692j686j610j540j429j314j197j051r18p48o09m26
$$ 4163 2437 649 -1172 -2919 -4611 -6297 -7907 -9447 -10876 -12190 -13387 -14438 -15356 -16104 -16713 -17139
342a7139k64q9Q6K67M22N90P38Q96J029J147J286J363J490J530J618J620J661
$$ -17139 -17403 -17492 -17406 -17139 -16717 -16127 -15389 -14493 -13464 -12317 -11031 -9668 -8178 -6648 -5030 -3410 -1749
359a749J691J680J646J589J563J494J407J318J188J082R36Q21O56N01L54J73K8
$$ -1749 -58 1622 3268 4857 6420 7914 9321 10639 11827 12909 13845 14666 15322 15823 16177 16350 16378
376A6378j33k94m67n91p54q76j025j129j220j336j410j469j524j524j572j567
$$ 16378 16245 15951 15484 14893 14139 13263 12238 11109 9889 8553 7143 5674 4150 2626 1054 -513
392e13j592j523j448j459j362j294j195j076r58q50p01n67m30k71j14L4J70L16
$$ -513 -2105 -3628 -5076 -6535 -7897 -9191 -10386 -11462 -12420 -13270 -13971 -14538 -14968 -15239 -15353 -15319 -15149 -14833
410a4833M75O11P38Q69R72J072J197J258J344J376J416J427J468J495J457J418
$$ -14833 -14358 -13747 -13009 -12140 -11168 -10096 -8899 -7641 -6297 -4921 -3505 -2078 -610 885 2342 3760
426C760J356J326J255J191J108R77Q74P51O22N03L68K28O6n5k11l26m73o08p16
$$ 3760 5116 6442 7697 8888 9996 10973 11847 12598 13220 13723 14091 14319 14385 14330 14119 13793 13320 12712 11996
445A1996q40r47j045j128j202j255j319j322j357j386j383j373j301j272j220
$$ 11996 11156 10209 9164 8036 6834 5579 4260 2938 1581 195 -1188 -2561 -3862 -5134 -6354
460f354j163j092r98q95p94o77n57m32l08j57m5J09K18L45M68N93P00Q15R14R96
$$ -6354 -7517 -8609 -9607 -10502 -11296 -11973 -12530 -12962 -13270 -13427 -13472 -13363 -13145 -12800 -12332 -11739 -11039 -10224 -9310 -8314
480h314J083J131J204J233J238J275J313J294J270J211J169J141J059R99R26Q02
$$ -8314 -7231 -6100 -4896 -3663 -2425 -1150 163 1457 2727 3938 5107 6248 7307 8306 9232 10034
496A0034P14O06N00L76K47J34Lj16k44l46m73n69o94p78q75r52j020j077j120
$$ 10034 10748 11354 11854 12230 12477 12611 12614 12498 12254 11908 11435 10866 10172 9394 8519 7567 6547 5470 4350
515D350j158j174j196j220j208j182j132j075j054r99r18q46p56o47n49m50l42
$$ 4350 3192 2018 822 -398 -1606 -2788 -3920 -4995 -6049 -7048 -7966 -8812 -9568 -10215 -10764 -11214 -11556
532a1556k17j14J6J26K36L41M60N71O65P47Q26R05R57J026J062J095J098J143
$$ -11556 -11773 -11887 -11871 -11745 -11509 -11168 -10708 -10137 -9472 -8725 -7899 -6994 -6037 -5011 -3949 -2854 -1756 -613
550f13J158J119J127J065J013R90R20Q72P79P06N97M98M11L07J83Q1l1j35k45
$$ -613 545 1664 2791 3856 4869 5859 6779 7651 8430 9136 9733 10231 10642 10949 11132 11213 11182 11047 10802
569A0802l55m49n54o35p40p98q69r28r76j008j022j064j091j103j048j056r99
$$ 10802 10447 9998 9444 8809 8069 7271 6402 5474 4498 3490 2468 1404 313 -790 -1838 -2894 -3893
586c893r37r18q71p93p13o40n44m60l44k67j44n6O0J57K58L54M50N46O14P09P63
$$ -3893 -4830 -5748 -6619 -7412 -8125 -8765 -9309 -9769 -10113 -10380 -10524 -10580 -10520 -10363 -10105 -9751 -9301 -8755 -8141 -7432 -6669
607f669Q37Q80R28R46R89J000J020J017J011R66R29Q84Q44P86P28O52N95N06M18
$$ -6669 -5832 -4952 -4024 -3078 -2089 -1089 -69 948 1959 2925 3854 4738 5582 6368 7096 7748 8343 8849 9267
626I267L08K25J32K2p1j62k58l48m31n24n97o67p36p75q55q72q88r13r69r60r59
$$ 9267 9575 9800 9932 9954 9883 9721 9463 9115 8684 8160 7563 6896 6160 5385 4530 3658 2770 1857 888 -72 -1031
647a031r32r11q71q15q17p30o83o03n45m56l78k93j97r7k3Q3J66K46L47M26N01
$$ -1031 -1963 -2874 -3745 -4560 -5377 -6107 -6790 -7393 -7938 -8394 -8772 -9065 -9262 -9359 -9382 -9299 -9133 -8887 -8540 -8114 -7613
668g613N76O39O88P45P99Q09Q64Q71Q97R07Q98Q82Q54Q24P54P47P05O25N63M88
$$ -7613 -7037 -6398 -5710 -4965 -4166 -3357 -2493 -1622 -725 182 1080 1962 2816 3640 4394 5141 5846 6471 7034 7522
688G522M32L34K72J72R2mp6j65k44l25m10m73n59o04o60p06p60p74p97q23q50
$$ 7522 7954 8288 8560 8732 8824 8820 8744 8579 8335 8010 7600 7127 6568 5964 5304 4598 3838 3064 2267 1444 594
709E94q49q55q22q10p69p01o93o40n94n29m54l91l28k37j60q4J0P3J75K34L30
$$ 594 -255 -1110 -1932 -2742 -3511 -4212 -4905 -5545 -6139 -6668 -7122 -7513 -7841 -8078 -8238 -8322 -8312 -8239 -8064 -7830 -7500
730g500L81M44N21N75O41O44O96P44P61P87P90Q21P86P74P67P24O78O24O09N48
$$ -7500 -7119 -6675 -6154 -5579 -4938 -4294 -3598 -2854 -2093 -1306 -516 305 1091 1865 2632 3356 4034 4658 5267 5815
750E815M99M33L58K91K29J44P6j2r5j40k39l14l55m21m97n51n85o50o55o70p20
$$ 5815 6314 6747 7105 7396 7625 7769 7845 7833 7738 7598 7359 7045 6690 6269 5772 5221 4636 3986 3331 2661 1941
771A941p52p49p67p48p35p14o97o18n84n84n14m69m03l38k64k01j45n7OO9J59
$$ 1941 1189 440 -327 -1075 -1810 -2524 -3221 -3839 -4423 -5007 -5521 -5990 -6393 -6731 -6995 -7196 -7341 -7398 -7392 -7323 -7164
792g164K17K88L43M12M65N33N68N78O32O58O75O95P22P35O99P00O61O56O14N56
$$ -7164 -6947 -6659 -6316 -5904 -5439 -4906 -4338 -3760 -3128 -2470 -1795 -1100 -378 357 1056 1756 2417 3073 3687 4243
812D243N26M87M39L68L10K67K06R9M3kp6j50k33k68l30l97m49m89n39n54o11o18
$$ 4243 4769 5256 5695 6063 6373 6640 6846 6945 6988 6986 6910 6760 6527 6259 5929 5532 5083 4594 4055 3501 2890 2272
834B272o37o68o67p01o74o45o36o13n75n12m99m65m02l51k87k38j68j23m0jR2
$$ 2272 1635 967 300 -401 -1075 -1720 -2356 -2969 -3544 -4056 -4555 -5020 -5422 -5773 -6060 -6298 -6466 -6589 -6629 -6630 -6538
855f538J39K09K73L22L64M27M75M87N40N71N91O20O26O41O45O54O09N99N84N40
$$ -6538 -6399 -6190 -5917 -5595 -5231 -4804 -4329 -3842 -3302 -2731 -2140 -1520 -894 -253 392 1046 1655 2254 2838 3378
875C378M97M54M29L95L26K79K32J59R3N1k2q4j32j98k63l05l72m00m52m76n11
$$ 3378 3875 4329 4758 5153 5479 5758 5990 6149 6242 6293 6271 6187 6055 5857 5594 5289 4917 4517 4065 3589 3078
896C078n29n57o07o01o05o21o09n76n83n46n24m70m18m13l65l01k67k06j47j07
$$ 3078 2549 1992 1385 784 179 -442 -1051 -1627 -2210 -2756 -3280 -3750 -4168 -4581 -4946 -5247 -5514 -5720 -5867 -5974
916e974k5L4P8J39K05K42L07L35L98M18M62N04N04N56N57N78N76N97N83N57N40
$$ -5974 -5999 -5965 -5887 -5748 -5543 -5301 -4994 -4659 -4261 -3843 -3381 -2877 -2373 -1817 -1260 -682 -106 491 1074 1631 2171
937B171N18M82M67L90L85L24L02K45J90J22Q4K2l0q2j49j97k38k90l36l93l92
$$ 2171 2689 3171 3638 4028 4413 4737 5039 5284 5474 5596 5680 5702 5672 5590 5441 5244 5006 4716 4380 3987 3595
958C595m39m76m73n37n51n29n67n60n51n33n03n04m55m42l46l51l34k72k16j71
$$ 3595 3156 2680 2207 1670 1119 590 23 -537 -1088 -1621 -2124 -2628 -3083 -3525 -3871 -4222 -4556 -4828 -5044 -5215
978e215j13p4j4K4Q8J52J89K40K76L37L49L90M31M43M64N12N27N04N33N33N06
$$ -5215 -5328 -5402 -5416 -5392 -5304 -5152 -4963 -4723 -4447 -4110 -3761 -3371 -2940 -2497 -2033 -1521 -994 -490 43 576 1082
999A082N06M92M61M38M12L57L19K88K38K14J56J13N2J9m2r2j29j94k25k81l03
$$ 1082 1588 2080 2541 2979 3391 3748 4067 4355 4593 4807 4963 5076 5128 5147 5105 5013 4884 4690 4465 4184 3881
1020C881l36l84m14m13m67m79m91m91n09n02m94m80m65m31m14l95l40k93k70k36
$$ 3881 3545 3161 2747 2334 1867 1388 897 406 -103 -605 -1099 -1579 -2044 -2475 -2889 -3284 -3624 -3917 -4187 -4423
1040d423j96j36r4o0oN1Q8J48J76K33K71K76L34L76L97M02M42M70M59M89M76M87
$$ -4423 -4619 -4755 -4849 -4909 -4915 -4864 -4776 -4628 -4452 -4219 -3948 -3672 -3338 -2962 -2565 -2163 -1721 -1251 -792 -303 173 660
1062F60M49M80M26M10M02L68L14K81K61K00J76J42P6M2Km9r7j36j90k20k47k77
$$ 660 1109 1589 2015 2425 2827 3195 3509 3790 4051 4251 4427 4569 4645 4687 4689 4640 4543 4407 4217 3997 3750 3473
1084C473l25l51l80m05m12m47m43m50m64m62m57m16m11m08l71l40l07k73k34j95
$$ 3473 3148 2797 2417 2012 1600 1153 710 260 -204 -666 -1123 -1539 -1950 -2358 -2729 -3069 -3376 -3649 -3883 -4078
1104d078j56j20p5m2oO2R8J42J67J87K44K85L28L29L67L81M06M06M50M37M31M31
$$ -4078 -4234 -4354 -4429 -4471 -4477 -4415 -4317 -4175 -4008 -3821 -3577 -3292 -2964 -2635 -2268 -1887 -1481 -1075 -625 -188 243 674
1126F74M27M02M05L72L50L37K80K63K28J88J52R9N2L8j1m9r7j24j77j87k43k68
$$ 674 1101 1503 1908 2280 2630 2967 3247 3510 3738 3926 4078 4177 4229 4267 4256 4207 4110 3986 3809 3622 3379 3111
1148C111l12l15l45l68l99l98m09m22m31m12m11l85l73l62l33l07k86k53k14j63
$$ 3111 2799 2484 2139 1771 1372 974 565 143 -288 -700 -1111 -1496 -1869 -2231 -2564 -2871 -3157 -3410 -3624 -3787
1168c787j35j08n7j0OM8R6J33J57K01K41K73K78L14L46L53L70L98L94M02M00L98
$$ -3787 -3922 -4030 -4087 -4097 -4091 -4043 -3947 -3814 -3657 -3456 -3215 -2942 -2664 -2350 -2004 -1651 -1281 -883 -489 -87 313 711
1190G11L95L75L59L44L09K95K72K39K04J48J33R3N2K7pn6r6j32j61k09k28k57
$$ 711 1106 1481 1840 2184 2493 2788 3060 3299 3503 3651 3784 3877 3929 3956 3949 3893 3797 3665 3504 3295 3067 2810
1212B810k81l05l44l34l61l78l88l82l96l88l75l51l41l14l18k77k54k38j86j50
$$ 2810 2529 2224 1880 1546 1185 807 419 37 -359 -747 -1122 -1473 -1814 -2128 -2446 -2723 -2977 -3215 -3401 -3551
1232c551j12p8n4pK2O2J07J27J58K04K30K45K77L06L17L49L40L69L85L67L70L64
$$ -3551 -3663 -3741 -3795 -3802 -3780 -3718 -3611 -3484 -3326 -3122 -2892 -2647 -2370 -2064 -1747 -1398 -1058 -689 -304 63 433 797
1254G97L50L54L18L08K96K56K34K12J79J36J12N5L3J4l5p1r8j50j58k01k04k51
$$ 797 1147 1501 1819 2127 2423 2679 2913 3125 3304 3440 3552 3607 3640 3654 3619 3548 3450 3300 3142 2941 2737 2486
1276B486k83k82l09l35l41l42l66l50l61l46l41l26l05l04k60k52k20k00j53j31
$$ 2486 2203 1921 1612 1277 936 594 228 -122 -483 -829 -1170 -1496 -1801 -2105 -2365 -2617 -2837 -3037 -3190 -3321
1296c321j14o3k4KM7P0R7J35J59K00K19K42K68K87K93L19L26L42L51L36L54L34
$$ -3321 -3435 -3498 -3522 -3520 -3473 -3403 -3306 -3171 -3012 -2812 -2593 -2351 -2083 -1796 -1503 -1184 -858 -516 -165 171 525 859
1318H59L17L08L02K84K56K28K06J96J46J19R7N3K0km7o0j08j40j60k07k17k45
$$ 859 1176 1484 1786 2070 2326 2554 2760 2956 3102 3221 3318 3371 3391 3389 3342 3282 3174 3034 2874 2667 2450 2205
1340B205k52k71l01l27l18l24l40l24l38l20l00l05k78k72k36k34j77j70j60r8
$$ 2205 1953 1682 1381 1054 736 412 72 -252 -590 -910 -1210 -1515 -1793 -2065 -2301 -2535 -2712 -2882 -3042 -3140
1360c140o5m8j3J6M8Q9J00J46J59J91K13K40K68K80K77L05L03L24L13L18L16L05
$$ -3140 -3205 -3253 -3266 -3250 -3202 -3113 -3013 -2867 -2708 -2517 -2304 -2064 -1796 -1516 -1239 -934 -631 -307 6 324 640 945
1382I45K96K76K70K60K22J98J79J62J24R0P2N8j4j2m5r0j19j29j62j85k19k22
$$ 945 1241 1517 1787 2047 2269 2467 2646 2808 2932 3022 3094 3152 3138 3126 3081 2991 2872 2743 2581 2396 2177 1955
1404A955k56k74k80k80k99l19l00k96l14k90k82k66k49k48k10j99j72j37j23r8
$$ 1955 1699 1425 1145 865 566 247 -53 -349 -663 -953 -1235 -1501 -1750 -1998 -2208 -2407 -2579 -2716 -2839 -2937
1424b937o3l9JL4N1P4J21J29J61J83K13K33K45K68K57K92K96K97K91K99K99K82
$$ -2937 -3000 -3039 -3038 -3004 -2953 -2879 -2758 -2629 -2468 -2285 -2072 -1839 -1594 -1326 -1069 -777 -481 -184 107 406 705 987
1446I87K66K66K30K25K10J89J58J45R8P9N1L0pl4n6r3j19j29j65j89k16k20k47
$$ 987 1253 1519 1749 1974 2184 2373 2531 2676 2774 2853 2904 2934 2927 2893 2837 2744 2625 2496 2331 2142 1926 1706 1459
1469A459k54k62k79k85k93k82k94k72k82k50k40k25k21j92j72j59j12j00p5l8
$$ 1459 1205 943 664 379 86 -196 -490 -762 -1044 -1294 -1534 -1759 -1980 -2172 -2344 -2503 -2615 -2715 -2790 -2828
1489b828k4J5M2P0Q8J25J43J67J80K03K19K59K41K49K61K84K78K78K77K66K56
$$ -2828 -2852 -2837 -2795 -2725 -2637 -2512 -2369 -2202 -2022 -1819 -1600 -1341 -1100 -851 -590 -306 -28 250 527 793 1049
1510A049K58K23K12J96J89J75J22J25Q0N4M6Nj6m0o3j04j15j49j56j81k03k21
$$ 1049 1307 1530 1742 1938 2127 2302 2424 2549 2629 2683 2729 2734 2718 2678 2615 2511 2396 2247 2091 1910 1707 1486
1532A486k23k44k64k54k69k65k66k79k47k45k46k15k17j88j61j63j36j02q3m4
$$ 1486 1263 1019 755 501 232 -33 -299 -578 -825 -1070 -1316 -1531 -1748 -1936 -2097 -2260 -2396 -2498 -2581 -2625
1552b625k9MK5L7P7J12J10J51J44K04J88K16K34K30K52K76K55K61K55K43K64K33
$$ -2625 -2654 -2650 -2625 -2588 -2511 -2399 -2289 -2138 -1994 -1790 -1602 -1386 -1152 -922 -670 -394 -139 122 377 620 884 1117
1574A117K16K22J98J73J57J42J21R0P1M3K3Qm0o2p4j09j26j44j67j75j95k18k25
$$ 1117 1333 1555 1753 1926 2083 2225 2346 2436 2507 2550 2573 2581 2541 2479 2405 2296 2170 2026 1859 1684 1489 1271 1046
1597A046k32k49k45k63k42k45k50k40k30k05k04j89j67j50j28j07p9o6l1j2J1
$$ 1046 814 565 320 57 -185 -430 -680 -920 -1150 -1355 -1559 -1748 -1915 -2065 -2193 -2300 -2379 -2445 -2476 -2488 -2477
1618b477K7P2O6J23J21J42J61J85K03J95K32K20K42K42K39K45K39K38K25K26J97
$$ -2477 -2450 -2378 -2312 -2189 -2068 -1926 -1765 -1580 -1377 -1182 -950 -730 -488 -246 -7 238 477 715 940 1166 1363
1639A363J98J62J63J41J17R5O9M6L4Knl9o5q4j01j23j63j58j78j88k05k25k17
$$ 1363 1561 1723 1886 2027 2144 2239 2308 2354 2388 2390 2385 2346 2281 2197 2096 1973 1810 1652 1474 1286 1081 856 639
1662F39k42k27k38k32k24k32k18j98j86j88j64j51j33r8j06n7m8k0mK3M5O7Q9
$$ 639 397 170 -68 -300 -524 -756 -974 -1172 -1358 -1546 -1710 -1861 -1994 -2092 -2198 -2255 -2303 -2323 -2327 -2304 -2259 -2192 -2103
1685b103J06J31J50J67J73J91J97K23K07K22K31K39K18K37K06K12J97J84J70J52
$$ -2103 -1997 -1866 -1716 -1549 -1376 -1185 -988 -765 -558 -336 -105 134 352 589 795 1007 1204 1388 1558 1710
1705A710J41J21R3P7O5L7QLk3o7p5q9j02j52j41j52j79j93j98j98k26k18k12k21
$$ 1710 1851 1972 2065 2142 2207 2244 2252 2255 2232 2165 2090 2001 1899 1747 1606 1454 1275 1082 884 686 460 242 30 -191
1729a91k16k21k12j95j78j82j57j40j41j04r2p6l6l2j8J9K0N6Q4R1J15J42J49
$$ -191 -407 -628 -840 -1035 -1213 -1395 -1552 -1692 -1833 -1937 -2029 -2105 -2141 -2173 -2191 -2172 -2152 -2096 -2012 -1921 -1806 -1664 -1515
1752a515J47J92J80J97J94K14K17K14K09K16K02K03J92J76J58J54J29J23J00Q3
$$ -1515 -1368 -1176 -996 -799 -605 -391 -174 40 249 465 667 870 1062 1238 1396 1550 1679 1802 1902 1985
1772A985O3K8J6J8l3k8o6q7q6j17j36j46j63j77j78j94k07j97k17j95k16k00k04
$$ 1985 2048 2076 2092 2110 2077 2049 1983 1896 1810 1693 1557 1411 1248 1071 893 699 492 295 78 -117 -333 -533 -737
1795g37j91j67j65j56j37j30j15p7o9o0k3j5KK6N1N9P9J11J22J39J37J68J57J83
$$ -737 -928 -1095 -1260 -1416 -1553 -1683 -1798 -1875 -1944 -2004 -2027 -2042 -2040 -2014 -1963 -1904 -1825 -1714 -1592 -1453 -1316 -1148 -991 -808
1819h08K02J86K02J98J96K04K02J88J72J72J60J43J26J23R1P9O6L9L0J4k0k7n1
$$ -808 -606 -420 -218 -20 176 380 582 770 942 1114 1274 1417 1543 1666 1757 1836 1902 1941 1971 1985 1965 1938 1887
1842A887p8q3r5j27j32j56j51j77j71j91j89j90j88k12j83k01j79j68j63j29j37
$$ 1887 1809 1726 1631 1504 1372 1216 1065 888 717 526 337 147 -41 -253 -436 -637 -816 -984 -1147 -1276 -1413
1863a413j38j01q1p7n2l8j9nK8L7O2P2R2J11J18J43J41J58J63J75J90J83J87J86
$$ -1413 -1551 -1652 -1733 -1810 -1862 -1900 -1919 -1924 -1896 -1859 -1797 -1725 -1633 -1522 -1404 -1261 -1120 -962 -799 -624 -434 -251 -64 122
1887A22J96J79J79J73J48J64J32J26J04R1R2N3M5L7Rml2l5o7q4r3j14j24j27j59
$$ 122 318 497 676 849 997 1161 1293 1419 1523 1614 1706 1759 1804 1841 1850 1846 1814 1779 1712 1628 1535 1421 1297 1170 1011
1912A011j57j46j76j87j65j92j82j84j70j74j58j47j43j23j23r5q7p1m9l8k4m
$$ 1011 854 708 532 345 180 -12 -194 -378 -548 -722 -880 -1027 -1170 -1293 -1416 -1511 -1598 -1669 -1718 -1756 -1780 -1784
1934a784J2K2M7P4Q7R1J14J11J41J47J54J55J64J77J83J64J80J73J72J56J52J44
$$ -1784 -1772 -1750 -1703 -1629 -1542 -1451 -1337 -1226 -1085 -938 -784 -629 -465 -288 -105 59 239 412 584 740 892 1036
1956A036J26J39J09R3P4O4L9L0K3kj2m4m6p4q1j04j12j15j28j53j56j53j72j64
$$ 1036 1162 1301 1410 1503 1577 1641 1680 1710 1733 1731 1719 1675 1629 1555 1474 1370 1258 1143 1015 862 706 553 381 217
1980B17j74j72j58j70j72j59j26j41j37j03r9q2p1n8m8j5j8J2K3L2P5P0Q3J07
$$ 217 43 -129 -287 -457 -629 -788 -914 -1055 -1192 -1295 -1394 -1476 -1547 -1605 -1653 -1668 -1686 -1674 -1651 -1619 -1544 -1474 -1391 -1284
2004a284J02J37J27J38J56J59J55J67J69J56J62J58J69J42J40J26J15J04Q3Q5
$$ -1284 -1182 -1045 -918 -780 -624 -465 -310 -143 26 182 344 502 671 813 953 1079 1194 1298 1381 1466
2024A466N5L9M2J8Qj2l6m1p2p6q0j18j03j26j23j51j40j43j70j49j70j55j43j57
$$ 1466 1521 1560 1602 1620 1628 1616 1580 1539 1467 1391 1311 1193 1090 964 841 690 550 407 237 88 -82 -237 -380 -537
2048e37j47j38j35j13j15r1q6o0o7l6l4mKJ3M7L8N3Q4R6R0J08J36J12J51J36J59
$$ -537 -684 -822 -957 -1070 -1185 -1276 -1362 -1422 -1489 -1525 -1559 -1563 -1561 -1548 -1501 -1463 -1410 -1326 -1230 -1140 -1032 -896 -784 -633 -497 -338
2074c38J48J56J53J50J55J32J48J35J24J08J06R3P0O0N8M4J9Opj9l6o0o0q5r0
$$ -338 -190 -34 119 269 424 556 704 839 963 1071 1177 1270 1340 1400 1458 1502 1521 1527 1520 1501 1465 1405 1345 1260 1170
2099A170j01j16j13j30j37j35j64j41j46j61j36j47j44j22j32j15j03j04q5p1
$$ 1170 1069 953 840 710 573 438 274 133 -13 -174 -310 -457 -601 -723 -855 -970 -1073 -1177 -1262 -1333
2119a333m3n6l0j5%J6K1L4O4O2Q6R2R5J16J26J25J41J40J41J46J56J27J51J43
$$ -1333 -1376 -1432 -1462 -1477 -1477 -1461 -1440 -1406 -1342 -1280 -1194 -1102 -1007 -891 -765 -640 -499 -359 -218 -72 84 211 362 505
2143E05J31J31J16J09Q9R7P6N9M5L9L1%J4l1k6n2n3q1o8j07q2j18j34j21j37j29
$$ 505 636 767 883 992 1081 1178 1254 1313 1358 1397 1428 1428 1442 1411 1385 1333 1280 1199 1131 1024 942 824 690 569 432 303
2169C03j41j37j45j30j41j27j32j28j12j03r1p3q1n1m3l0k2pkK4L0N9N0Q2Q0R6
$$ 303 162 25 -120 -250 -391 -518 -650 -778 -890 -993 -1084 -1157 -1238 -1289 -1332 -1362 -1384 -1391 -1393 -1369 -1339 -1280 -1230 -1148 -1068 -972
2195i72R6J08J16J31J38J24J49J29J37J33J36J18J38J16Q9J01R5P3O4M8N1K7J5
$$ -972 -876 -768 -652 -521 -383 -259 -110 19 156 289 425 543 681 797 886 987 1082 1155 1219 1267 1318 1345 1360
2218A360rok3m3l8o7q2p6r5j00j11j45j02j28j45j31j18j46j19j30j35j09j17
$$ 1360 1351 1345 1322 1279 1241 1174 1092 1016 921 821 710 565 463 335 190 59 -59 -205 -324 -454 -589 -698 -815
2241h15r2q9q3p1o7l2m0k7kpJ4K2M9N5O6P2R8Q9J05J03J25J31J25J32J10J45J22
$$ -815 -907 -996 -1079 -1150 -1217 -1249 -1289 -1316 -1318 -1325 -1311 -1289 -1240 -1185 -1119 -1047 -949 -860 -755 -652 -527 -396 -271 -139 -29 116 238
2268B38J33J33J08J11J03R4P8P9O8M7M4L2J8J1rk3k6n4n6p4o9r1q3j11j12j14
$$ 238 371 504 612 723 826 920 998 1077 1145 1192 1236 1268 1286 1297 1288 1265 1239 1185 1129 1055 986 895 812 701 589 475
2294D75j23j17j39j14j20j32j18j16j26j03r0q9r5m7p5m4l1m2jrNK8M1M6N7P2
$$ 475 352 235 96 -18 -138 -270 -388 -504 -630 -733 -823 -912 -1007 -1054 -1129 -1173 -1204 -1246 -1247 -1256 -1251 -1223 -1182 -1136 -1079 -1007
2320a007Q6Q0R7R5J11J01J34J22J19J31J14J37J04J21J09J07Q0R2P3O9M6M2K9
$$ -1007 -921 -841 -744 -649 -538 -437 -303 -181 -62 69 183 320 424 545 654 761 841 933 1006 1075 1121 1163 1192
2343A192L3Qmrl0l6n9n2q3o9r9r3j00j27j01j21j15j13j31j25j12j20j06j11q9
$$ 1192 1225 1233 1229 1220 1190 1154 1095 1043 960 891 792 699 599 472 371 250 135 22 -109 -234 -346 -466 -572 -683 -772
2368g72r1p9p0o2n0l6k7j9NqK1L5M8N9O3P6P6R0R7R4J15J03J30J27J13J27J09
$$ -772 -863 -942 -1012 -1074 -1124 -1160 -1187 -1206 -1201 -1209 -1188 -1153 -1105 -1046 -983 -907 -831 -741 -644 -550 -435 -332 -202 -75 38 165 274
2395B74J06J17J09R2R4Q0Q0O6N4L7M1K7MPll0l9m8m6o4r2q2q3r0j12j20j00j16
$$ 274 380 497 606 698 792 872 952 1018 1072 1109 1150 1177 1181 1188 1185 1155 1116 1068 1022 958 866 784 701 611 499 379 279 163
2423A63j22j06j14j15j12j04j07r1r0p6p2n7n8m2j4k0k4OJ0M1L2L8N6Q0P1P6R2
$$ 163 41 -65 -179 -294 -406 -510 -617 -708 -798 -874 -946 -1003 -1061 -1103 -1117 -1137 -1161 -1155 -1145 -1104 -1072 -1034 -978 -898 -827 -751 -659
2450f59R3J20R5J16J16J08J05J27J11J02J05J02P8R4Q2O3M2N3L5L1J7J3j3j7j2
$$ -659 -566 -446 -351 -235 -119 -11 94 221 332 434 539 641 719 813 895 958 1000 1053 1088 1119 1136 1149 1136 1119 1107
2475A107n4l5o9o6p8q2j03p9j24j01j18j01j17j00j10j17j09j00r6q9p5p0o9m6
$$ 1107 1053 1018 949 883 805 723 620 541 417 316 198 97 -20 -120 -230 -347 -456 -556 -652 -741 -816 -886 -955 -1001
2499a001m7l9k4k1RQL0K2M7M1O8O9P7R0R2Q7J11J05J13J18J07J00J21J09R9R8
$$ -1001 -1048 -1087 -1111 -1132 -1123 -1115 -1085 -1063 -1016 -975 -907 -838 -761 -671 -579 -492 -381 -276 -163 -45 62 162 283 392 491 589
2525E89Q0R2Q4N1O7M8M8K5J4J0Rk2k1l2m2n9q5o3q2q5q7j01j09j01j07j24q3j21
$$ 589 669 761 845 896 963 1011 1059 1084 1098 1108 1117 1095 1074 1042 1000 941 856 793 711 626 539 438 329 228 121 -3 -86 -207
2553b07j03j02j07r4p5q1p5o4m8m2m5j3k4J%J3L3M0L9O4O0Q7O8R3Q7J05J12J00
$$ -207 -310 -412 -519 -613 -688 -769 -844 -908 -956 -998 -1043 -1056 -1080 -1079 -1079 -1066 -1033 -993 -954 -890 -830 -743 -675 -582 -495 -390 -278 -178
2581a78R3J17J04J02J05R2J05P8R3P2P2N4M9M9J9L4Mkok5k8l5n1n0p4o7q7r2q3
$$ -178 -85 32 136 238 343 435 540 618 711 783 855 909 958 1007 1026 1060 1064 1062 1056 1031 1003 968 917 867 793 726 639 547 464
2610D64r7j02j07j05r5j24r3r7r7r2r1p7q4n3n0n3m2k5j5k1J2J5J6K6N0M8P8O2
$$ 464 367 265 158 53 -42 -166 -259 -356 -453 -545 -636 -713 -797 -850 -900 -953 -995 -1020 -1035 -1056 -1044 -1029 -1013 -987 -937 -889 -811 -749
2638g49P1Q3R4J00R3R7R4J09Q3J20J02R5R3Q5R2P3O0O6N5M7K7K3J1J7nk4k2m5
$$ -749 -678 -595 -501 -401 -308 -211 -117 -8 75 195 297 392 485 570 662 735 795 861 916 963 990 1013 1024 1041 1036 1012 990 945
2666I45l7m3p7n5q8r9p9r7j01q5j11r7r7j18r0r5q4r1q5o1o6m8l6m1l6l1j3J6
$$ 945 908 865 788 733 645 546 467 370 269 184 73 -24 -121 -239 -329 -424 -508 -599 -684 -745 -811 -859 -895 -936 -972 -1003 -1016 -1000
2694a000jJ9K5L9N2M9P1O2Q8R6P4R0J10Q4J06J01R2J09Q6J08P6P4P6P2N0O8M0
$$ -1000 -1001 -982 -957 -918 -866 -817 -746 -684 -596 -500 -426 -336 -226 -142 -36 65 157 266 352 460 536 610 686 758 808 876 916
2721I16L5J1J6J5kj3k5k7m4m8n9o3q1o5r6q2r0j05j02q8r6r4r8r6q4q7p7o7o5
$$ 916 951 962 978 993 991 978 953 926 882 834 775 712 631 566 470 388 298 193 91 3 -93 -187 -285 -381 -465 -552 -629 -696 -761
2750g61o4m1l0m3k7jqQJ8J5L5N1N5O0P3O4O9R9Q9R6Q6J00R8Q2J01R5P6Q5Q8P1
$$ -761 -825 -866 -896 -939 -966 -967 -975 -967 -949 -934 -899 -848 -793 -733 -660 -596 -527 -428 -339 -243 -157 -57 41 123 224 319 395 480 568 639
2780F39Q3N2M5N2M3J1K5RoLl2k3l8m4n6o7p3o8q4q0q7j10q7q2r9r2q3r2r1q6p5
$$ 639 722 774 819 871 914 925 950 959 953 956 924 901 863 819 763 696 623 555 471 391 304 194 107 25 -74 -166 -249 -341 -432 -518 -593
2811e93p5n2n8k1o7o1j0Nk1J0J5M5RQ2l2J35N4N5J2J66M6J17R8J07L7R9R3J36
$$ -593 -668 -720 -778 -799 -866 -927 -937 -932 -953 -943 -928 -883 -874 -792 -824 -689 -635 -580 -568 -402 -356 -239 -141 -34 3 102 195 331
2839C31Q9l9J71P0k4J06Q5L0L8K2N2j2m0K3K8m1mj18n0m4l2r4p1p5o9r9l8j44
$$ 331 420 381 552 622 598 704 789 819 857 879 931 919 879 902 930 889 885 767 717 673 641 547 476 401 332 233 195 51
2867E1j06p5p9r4j09l4j21m8n7p7n3k3jn6pl7K9j3J5L6N3O3J1R9L7M2J20N8J08
$$ 51 -55 -130 -209 -303 -412 -446 -567 -615 -672 -749 -802 -825 -826 -882 -889 -926 -897 -910 -895 -859 -806 -743 -732 -633 -596 -554 -434 -376 -268
2896b68R3J11N6J31J8Q3J80J9M2R1N7R9K5M1L7P2K1m2J4K0j1k7m9k3m6l2j33n1
$$ -268 -175 -64 -8 123 141 224 404 423 465 556 613 712 737 778 815 887 908 866 880 900 889 862 813 790 744 712 579 528
2924E28q6p1n6o9q4p6j13r0p2r0p4q5p8m7p5n2m4m7j7m1j5qj0QK4J1N5K9M8N5
$$ 528 442 371 315 246 162 86 -27 -117 -189 -279 -353 -438 -516 -563 -638 -690 -734 -781 -798 -839 -854 -862 -872 -864 -840 -829 -774 -745 -697 -642
2954f42O5P3P6P1P2Q1P8Q3R5P8Q6Q2Q3O7O3P2N1N8M4M6K1K3J5J2j2ll3j3l8l8
$$ -642 -577 -504 -428 -357 -285 -204 -126 -43 52 130 216 298 381 448 511 583 634 692 736 782 803 826 841 853 841 838 805 792 754 716
2984G16m8n3p1o8o3p9q2q3q0q1q5q2q2p1o6p8p6n0n6n2m6k1l6l3Rj5J4J4OM1K5
$$ 716 668 615 544 476 413 334 252 169 89 8 -77 -159 -241 -312 -378 -456 -532 -582 -638 -690 -736 -757 -793 -826 -817 -832 -818 -804 -798 -757 -732
3015g32O3L6N7P0O1O8P7Q7O9P8Q5Q8Q1O8P9P4O1O7N0N5M2L6M4K3J7QJ4k0ol2k5
$$ -732 -669 -633 -576 -506 -445 -377 -300 -213 -144 -66 19 107 188 256 335 409 470 537 587 642 684 720 764 787 804 812 826 806 800 768 743
3046G43l4n1n7m5p5o2p6o1r4q0n9q9r1o8p5p3o1o5n8o4m2n1l2l3j9j9nNPJ7L5
$$ 743 709 658 601 556 481 419 343 282 188 108 49 -40 -131 -199 -274 -347 -408 -473 -531 -595 -637 -688 -720 -753 -772 -791 -796 -791 -784 -767 -732
3077g32K5L2N3N2N3O7O1O8Q4O0Q1P2P5Q5P4P3P0N9P2N4M6M7M2L9K1J0K4Nj1%j8
$$ -732 -707 -675 -622 -570 -517 -450 -389 -321 -237 -177 -96 -24 51 136 210 283 353 412 484 538 584 631 673 712 733 743 767 772 761 761 743
3108G43l0l0m5m0n1n2o4p6n2q0p8p5p8n7r7o3p1o4o2o7n5l3o5l7k9k2j4k4kJ2
$$ 743 713 683 638 598 547 495 431 355 303 223 145 70 -8 -65 -162 -225 -296 -360 -422 -489 -544 -577 -642 -679 -708 -730 -744 -768 -770 -758
3138g58J6J0K9L8M5L9N6N4N4P3P6N3P6P6Q5O1P6P9N7P5N3O3N5N2M2L3K7K6J1R
$$ -758 -742 -732 -703 -665 -620 -581 -525 -471 -417 -344 -268 -215 -139 -63 22 83 159 238 295 370 423 486 541 593 635 668 695 721 732 741
3168G41mlj7j0l4m2l2n4m8n6o8o2q5n6o2p7p4n6r5o5p1m3n9o2m3n9l1k2l9k2n
$$ 741 737 734 717 707 673 631 599 545 497 441 373 311 226 170 108 31 -43 -99 -194 -259 -330 -373 -432 -494 -537 -596 -627 -649 -688 -710 -715
3199g15j4KJ3J3L2L1K1L9N1N6N0P0O4O6O2P6P0O5O8O8Q5M0O2O5M5N1L4M7L0K2
$$ -715 -729 -727 -714 -701 -669 -638 -617 -578 -527 -471 -421 -351 -287 -221 -159 -83 -13 52 120 188 273 313 375 440 485 536 570 617 647 669
3229F69J7MJ3j2mj7k5k9l7l8l9n2o9m1p3n7o7p6o9n4o3q1n8n8n4o9m6l9l8l4l1
$$ 669 686 690 703 691 687 670 645 616 579 541 502 450 381 340 267 210 143 67 -2 -56 -119 -200 -258 -316 -370 -439 -485 -524 -562 -596 -627
3260f27k9k5lJKJ0J1J4M5K5M0M1M9P2N7N2O2O7P2N6P3O6O4P5N3O5L7M8M7L0M0
$$ -627 -656 -681 -684 -683 -681 -671 -660 -646 -601 -576 -536 -495 -446 -374 -317 -265 -203 -136 -64 -8 65 131 195 270 323 388 425 473 520 550 590
3291E90K2K0K9J1j2klj5k0l7n0k6m4o3m3p1n6o4p0o1o9n8p2n6n2o6m4m6n3m5l2
$$ 590 612 632 661 672 660 658 655 640 620 583 533 507 463 400 357 286 230 166 96 35 -34 -92 -164 -220 -272 -338 -382 -428 -481 -526 -558
3322e58l0k4j0k6j1J5pJ5K9J3L8M1M0L0N3O2N7N7O6O1O3N8M8P5O7N9M0J0O7M5
$$ -558 -588 -612 -622 -648 -659 -644 -651 -636 -607 -594 -556 -515 -475 -445 -392 -330 -273 -216 -150 -89 -26 32 80 155 222 281 321 331 398 443
3352D43O6K5O2k5m3O9M2Mm6K8O3r0o6M4r5r8l2l2o9j04L8m0j82l4k7J0r6r1k6
$$ 443 509 534 596 571 528 597 639 643 597 625 688 598 532 576 481 383 351 319 250 146 184 144 -38 -72 -99 -89 -185 -276 -302
3381c02j53On9Kk6p7O6p8J3k0L8n8L2K4m3J02O7n6R8N0L6O9oJ34L3J59m9J27P7
$$ -302 -455 -449 -508 -506 -532 -609 -543 -621 -608 -628 -590 -648 -616 -592 -635 -533 -466 -522 -424 -374 -338 -269 -275 -141 -108 51 2 129 206
3410B06M5J20j8P2J9pR1J3jk2J19M5n5m6N5o3M0q7lJ4j18r5L8q7m9j8j45J0p6
$$ 206 251 371 353 425 444 437 528 541 540 518 637 682 627 581 636 573 613 526 523 537 419 324 362 275 226 208 63 73 -3
3439ck9r3m9o4m1o0l7o2j7n0l3k7qk8Jj6J0PK0K3K5K1M5N8K5N0M9O6M4O3N5P0
$$ -3 -32 -125 -174 -238 -279 -339 -376 -438 -455 -505 -538 -565 -573 -601 -600 -616 -606 -599 -579 -556 -531 -510 -465 -407 -382 -332 -283 -217 -173 -110 -55 15
3471A5M9O2M6N2N9N5M3L3K9M9L0J9K7K0oJmj5j3k2j4l8k8m5n3m5m5n8n0n3o2p2
$$ 15 64 126 172 224 283 338 381 414 443 492 522 541 568 588 582 583 579 564 551 529 515 477 449 404 351 306 261 203 153 100 38 -34
3503c4m5o0m8n2o4k9l7m7m6l0k0k4l5J0j6mOQJ5L0J4L2M2M9L5M2O1L8O6M4O9M8
$$ -34 -79 -139 -187 -239 -303 -332 -369 -416 -462 -492 -512 -536 -571 -561 -577 -581 -575 -567 -552 -522 -508 -476 -434 -385 -350 -308 -247 -209 -143 -99 -30 18
3535A8O1O2M4M2O7L6L2O0L4K2M0QK3J0J0lrj3rk2l0k9l3m8m6m2m5o1m8o8m8n3
$$ 18 79 141 185 227 294 330 362 422 456 478 518 526 549 559 569 566 557 544 535 513 483 454 421 373 327 285 240 179 131 63 15 -38
3567c8n8n4m9n3m8l2m8m1m2j7l3k0j6jkJJqK8K3L3K4M9L2M2N2M4N6M8O2M0N6N6
$$ -38 -96 -150 -199 -252 -300 -332 -380 -421 -463 -480 -513 -533 -549 -550 -552 -551 -550 -558 -530 -507 -474 -450 -401 -369 -327 -275 -231 -175 -127 -65 -25 31 87
3600H7N3N5M3N5L3M6M2K9K7J8K4J1J1J8k8J0j7j4k3j8m0l1m3l7n8m0n7n4n0m6
$$ 87 140 195 238 293 326 372 414 443 470 488 512 523 534 552 524 534 517 503 480 462 422 391 348 311 253 213 156 102 52 6
3630Fn5n2n2l7m9o2l0m3l6l2k4k9k0lk3jLJ6PK4J1L7K8L6L9L2N7L6N0O0M4N0N4
$$ 6 -49 -101 -153 -190 -239 -301 -331 -374 -410 -442 -466 -495 -515 -518 -541 -542 -539 -523 -516 -492 -481 -444 -416 -380 -341 -309 -252 -216 -166 -106 -62 -12 42
3663D2N4N5N1M8L8L8M2K9M2K8K3NK1NnNj0jk4k4k6m0l6l3m9m4n2m5n2m9n1n2n3
$$ 42 96 151 202 250 288 326 368 397 439 467 490 495 516 521 516 521 511 510 486 462 436 396 360 327 278 234 182 137 85 36 -15 -67 -120
3696a20n1n2m0m6l3l8l1k9k4k0l1j0J7j0RpK6J3J4L7L5L8K9M6N1O0L5N0N3N0M4
$$ -120 -171 -223 -263 -309 -342 -380 -411 -440 -464 -484 -515 -525 -508 -518 -509 -516 -490 -477 -463 -426 -391 -353 -324 -278 -227 -167 -132 -82 -29 21 65
3727F5N7M3M2L8M7N4J7K8M4J7K1MJ5Jj0Jmj8j5k9k7k8l1m0m2m5m1n3m6m2o3m9
$$ 65 122 165 207 245 292 346 363 391 435 452 473 477 492 493 483 484 480 462 447 418 391 363 332 292 250 205 164 111 65 23 -40 -89
3759h9n3l0m8n9k9m3k2k3l5k1k1j5JjkROPK2L6K4L1L4L8L7M1N3M6M3N7L2N3M6
$$ -89 -142 -172 -220 -279 -308 -351 -373 -396 -431 -452 -473 -488 -487 -488 -490 -481 -475 -468 -446 -410 -386 -355 -321 -283 -246 -205 -152 -106 -63 -6 26 79 125
3792A25N3M7L4L2M0K8M0J9K0K2RJ6rOj5mk1j3l2j9m2l3m9k5m7n4m2m5m5m7n1k8
$$ 125 178 225 259 291 331 359 399 418 438 460 469 485 476 482 467 463 442 429 397 378 336 303 254 229 182 128 86 41 -4 -51 -102 -130
3824a30m7m8l8l4l8m8jl4j7k2jllOLqL9J6K8L3K6L1L9N2L8L3M6M9L6N7M2N0L9
$$ -130 -177 -225 -263 -297 -335 -383 -384 -418 -435 -457 -458 -461 -464 -458 -455 -463 -424 -408 -380 -347 -321 -290 -251 -199 -161 -128 -82 -33 3 60 102 152 191
3857A91L3M1L0M0K1K8J3K8J0J2%Olj3jl2j8k2l8k7k5l8l6k9o6m7k9n2l2n4m1m7
$$ 191 224 265 295 335 356 384 397 425 435 447 447 453 450 437 436 404 386 364 326 299 274 236 200 171 105 58 29 -23 -55 -109 -150 -197
3889a97l9l3l6l3k2l0lj1k4j3kPP%RK3J9L3J3L4L9K7M9L0M3M3M8M3N3K6M1M2L9
$$ -197 -236 -269 -305 -338 -360 -390 -393 -404 -428 -441 -443 -436 -429 -429 -420 -397 -378 -345 -332 -298 -259 -232 -183 -153 -110 -67 -19 24 77 103 144 186 225
3922B25L5K1M6K0J5L2RJ8KOOj5rqk8j0m0j9l6k4l6l9m7m8l6l8m5l9l4m3l4l8l6
$$ 225 260 281 327 347 362 394 403 421 423 429 435 420 411 403 375 365 325 306 270 246 210 171 124 76 40 2 -43 -82 -116 -159 -193 -231 -267
3955b67k3l0j3m0j1k5Jj0KLJ4qL5K0J6K1K5L6L2L7L4L8L7M7L4M1L8M3L8K7L1M7
$$ -267 -290 -320 -333 -373 -384 -409 -408 -418 -416 -413 -399 -407 -372 -352 -336 -315 -290 -254 -222 -185 -151 -113 -76 -29 5 46 84 127 165 192 223 270
3987B70K4K3K2K0J4J8LM%rlj4j9j0k2k6k9k9l3m3k5l8m2l6l3m2k9m6l3k4m2k5
$$ 270 294 317 339 359 373 391 394 398 398 389 386 372 353 343 321 295 266 237 204 161 136 98 56 20 -13 -55 -84 -130 -163 -187 -229 -254
4019b54k1k8k7j2j5k0kmmROKK2J2K9J9K5L2M3K3L4M4K7L7L9L0M4K8L9K8L4M1J0
$$ -254 -275 -303 -330 -342 -357 -377 -379 -383 -387 -378 -372 -370 -348 -336 -307 -288 -263 -231 -188 -165 -131 -87 -60 -23 16 46 90 118 157 185 219 260 270
4052B70J8K6K6J1J4QnKj7%nkl0k5j1l8l6l0k7l1l8l6l7m2k9l6k8m7l6j9k2k4j7
$$ 270 288 314 340 351 365 373 368 370 353 353 348 346 316 291 280 242 206 176 149 118 80 44 7 -35 -64 -100 -128 -175 -211 -230 -252 -276 -293
4085b93j9j2k3qjnNJK1PJ3J8J9K1K1L7K7L4L8K0M1L2M5K7J2N2M3J3K9L3K0J8K7
$$ -293 -312 -324 -347 -355 -356 -361 -356 -355 -334 -327 -314 -296 -277 -256 -235 -198 -171 -137 -99 -79 -38 -6 39 66 78 130 173 186 215 248 268 286 313
4118C13RJ3JJQj1llj8ol5j4j4k0k8l7j9m6k3l7l5l8k9l1k0j8l4k9l2k9j7ppj8
$$ 313 322 335 336 337 345 334 331 328 310 304 269 255 241 221 193 156 137 91 68 31 -4 -42 -71 -102 -122 -140 -174 -203 -235 -264 -281 -288 -295 -313
4152c13j1KlMNQJ5J2J9J4K3J6L0K8L1L7K4L6K5L4L1L2K9K9K6K3K8J6J5J7K9JK
$$ -313 -324 -322 -325 -321 -316 -308 -293 -281 -262 -248 -225 -209 -179 -151 -120 -83 -59 -23 2 36 67 99 128 157 183 206 234 250 265 282 311 312 314
4185C14P%koj0ll0j1j6k0k9l5k9k1k2m5l1k1l5j9l9k9k4k8k8k4qk7j4kj7MlrL
$$ 314 321 321 319 313 303 300 270 259 243 223 194 159 130 109 87 42 11 -10 -45 -64 -103 -132 -156 -184 -212 -236 -244 -271 -285 -287 -304 -300 -303 -312 -309
4220c09J6NJ4J5J3K5J1L0K2K4M4J3K6M5K1J6L8J9L9J7L9J5J6L1QJ5J1QJ0%nmn
$$ -309 -293 -288 -274 -259 -246 -221 -210 -180 -158 -134 -90 -77 -51 -6 15 31 69 88 127 144 183 198 214 245 253 268 279 287 297 297 292 288 283
4253B83rj9pj0l5pl3j8k8k6k7l8j9k0l7k8k6k1k4k1k3j9pk0k1j3JJopJ7lJ1OK5
$$ 283 274 255 248 238 203 196 163 145 117 91 64 26 7 -13 -50 -78 -104 -125 -149 -170 -193 -212 -219 -239 -260 -273 -272 -271 -277 -284 -267 -270 -259 -253 -228
4288b28LK6J5K5K6L3K2K5J9L0L0K7J6M3J9K6J6LL7J7RQL1jpqQ%j6Qk4k1k4j1j2
$$ -228 -225 -199 -184 -159 -133 -100 -78 -53 -34 -4 26 53 69 112 131 157 173 176 213 230 239 247 278 277 270 262 270 270 254 262 238 217 193 182 170
4323A70k4k4k1k5l4j7l5l4k6j7k6ol3k1rl2j7mqk4J3j3J0MmNQK4J1J9J7J8J8K8
$$ 170 146 122 101 76 42 25 -10 -44 -70 -87 -113 -119 -152 -173 -182 -214 -231 -235 -243 -267 -254 -267 -257 -253 -257 -252 -244 -220 -209 -190 -173 -155 -137 -109
4357a09K0K1K3K8K3K9K5K7J5K9J9K8JK7jJ3K5J5j2Lj1Rrj6lj1j2ll3j0k8j7k3
$$ -109 -89 -68 -45 -17 6 35 60 87 102 131 150 178 179 206 205 218 243 258 246 249 238 247 238 222 219 208 196 193 160 150 122 105 82
4390H2k4j9l9j5k9j6j6l0j6k7k1j3j5j9nj4kjkJlJ6kJ7MJ0K8PK5J3K5K7J8L0J0
$$ 82 58 39 0 -15 -44 -60 -76 -106 -122 -149 -170 -183 -198 -217 -222 -236 -238 -239 -241 -240 -243 -227 -229 -212 -208 -198 -170 -163 -138 -125 -100 -73 -55 -25 -15
4425a5L7J4K2K9J5J9K1K4J5J2J1J0QKJ3nOkj6pj1nj0j0k0l1j5k0k1k3j3l1k2l2
$$ -15 22 36 58 87 102 121 142 166 181 193 204 214 222 224 237 232 238 236 220 213 202 197 187 177 157 126 111 91 70 47 34 3 -19 -51
4459e1j5l4k3j2k1j9pqj8j0jj1njRLOJ4NQK2NK2J7K7K9J2K2K1K7J7K4K3J4J4K8
$$ -51 -66 -100 -123 -135 -156 -175 -182 -190 -208 -218 -219 -230 -235 -236 -227 -224 -218 -204 -199 -191 -169 -164 -142 -125 -98 -69 -57 -35 -14 13 30 54 77 91 105 133
4495A33J2J3J8J1J4J1jO%Plnj6orqk3j3k2j5j5j8l0j7j8j2l4j6j4l7ml3Mk5j8
$$ 133 145 158 176 187 201 212 211 217 217 224 221 216 200 194 185 177 154 141 119 104 89 71 41 24 6 -6 -40 -56 -70 -107 -111 -144 -140 -165 -183
4530a83qkj0rQnolOJ4NPJ3J7%L5K0J6K3J4K8OK0K4K2K8J9RJ5K2J3J6J1KJ8mNQ
$$ -183 -191 -193 -203 -212 -204 -209 -215 -218 -212 -198 -193 -186 -173 -156 -156 -121 -101 -85 -62 -48 -20 -14 6 30 52 80 99 108 123 145 158 174 185 187 205 201 206 214
4568B14pKoj1qj8nk1ok4j3k7ll6j5k0k1j8k7k7j0j8pol1j1Kj6k1QL%J0kPPRJ9
$$ 214 207 209 203 192 184 166 161 140 134 110 97 70 67 31 16 -4 -25 -43 -70 -97 -107 -125 -132 -138 -169 -180 -178 -194 -215 -207 -204 -204 -194 -196 -189 -182 -173 -154
4606a54OJ9J9J5J4J8%R2m3M0o8J53mm0N7j6M5oRJ7J2nK0j4OJ3j5lqrrj6mk6k2
$$ -154 -148 -129 -110 -95 -81 -63 -63 29 -14 26 -42 111 107 67 124 108 153 147 156 173 185 180 200 186 192 205 190 187 179 170 161 145 141 115 93
4641I3lk0j9j5k5j5j7j2k9j6j5nk7j2j1orj2rRj0NoPmK1pJ3J9KK4J6QK0K1J7J4
$$ 93 90 70 51 36 11 -4 -21 -33 -62 -78 -93 -98 -125 -137 -148 -154 -163 -175 -184 -175 -185 -180 -186 -179 -183 -162 -169 -156 -137 -135 -111 -95 -87 -67 -46 -29 -15
4678a5J9K5OK5J7J5J7RK3kQK8KP%MllonKj7nj5k1qj1j6j8l1j5j4k4qk0j5k4j0
$$ -15 4 29 35 60 77 92 109 118 141 139 147 175 177 184 184 188 185 182 176 171 173 156 151 136 115 107 96 80 62 31 16 2 -22 -30 -50 -65 -89 -99
4716i9k9llj9j4Jpnn%nOJ2NKJ3K1OJ1K6RK0J3J3K5K0J3J4J4K6J3J0RJ1J7J6J%
$$ -99 -128 -131 -134 -153 -167 -166 -173 -178 -183 -183 -188 -182 -170 -165 -163 -150 -129 -123 -112 -86 -77 -57 -44 -31 -6 14 27 41 55 81 94 104 113 124 141 157 158 158
4754A58NMJ2j3Opmj8Jj7Jqk2j3k2jl0k2rk0qk1j8k2%j8k3Jj1j2kLomO%rNJ3OJ5
$$ 158 163 167 179 166 172 165 161 143 144 127 128 120 98 85 63 62 32 10 1 -19 -27 -48 -66 -88 -88 -106 -129 -128 -139 -151 -153 -150 -156 -160 -154 -154 -163 -158 -145 -139 -124
4795a24J0oK9RJ6MJ9J3J6K4K3J0K3MJ5OK5JJ0J0LJ6PnPnkj0Kj4Kj0j5j9pj6j0
$$ -124 -114 -120 -91 -82 -66 -62 -43 -30 -14 10 33 43 66 70 85 91 116 117 127 137 140 156 163 158 165 160 158 148 150 136 138 128 113 94 87 71 61
4832F1j5j7pk7rk4kj4k1j3j2j3j2j5lqnkkMmNnK8j3J7J0J8QJ2K2J3J6OJ3J2K0
$$ 61 46 29 22 -5 -14 -38 -40 -54 -75 -88 -100 -113 -125 -140 -143 -151 -156 -158 -160 -156 -160 -155 -160 -132 -145 -128 -118 -100 -92 -80 -58 -45 -29 -23 -10 2 22
4869B2K3%K0J8OJ9LK2NlLlJ2Ln%pj5mKj1qk2lk5j2Lk4k4lj4k3j3%k5nrk1oMk1
$$ 22 45 45 65 83 89 108 111 133 138 135 138 135 147 150 145 145 138 123 119 121 110 102 80 77 52 40 43 19 -5 -8 -22 -45 -58 -58 -83 -88 -97 -118 -124 -120 -141
$$ [...]
8191a7
##END NTUPLES=NMR FID
##END=
