##TITLE=1H_DE-TEST_D2O
 200.13Hz,D2O.
 8 sc
 3.6.2026
##JCAMPDX= 6.0         $$ Bruker NMR JCAMP-DX V2.0
##DATA TYPE= NMR FID
##DATA CLASS= NTUPLES
##ORIGIN= UXNMR, Bruker Analytische Messtechnik GmbH
##OWNER= pz
$$ XWIN-NMR		Version 3.5
$$ Wed Jun  3 14:04:21 2026 Russian Standard Time (UT+4h)  she@DPX200
##.OBSERVE FREQUENCY= 200.131
##.OBSERVE NUCLEUS= ^1H
##.DELAY= (6, 6)
##.ACQUISITION MODE= SIMULTANEOUS
##.ACQUISITION SCHEME= undefined
##.AVERAGES= 8
##.DIGITISER RES= 18
##SPECTROMETER/DATA SYSTEM= spect
##.PULSE SEQUENCE= zg30
##.SOLVENT NAME= D2O
##.SHIFT REFERENCE= (INTERNAL, D2O, 0, 14.3821)
##AUDIT TRAIL= $$ (NUMBER, WHEN, WHO, WHERE, WHAT)
$$ ##TITLE= Audit trail, XWIN-NMR		Version 3.5
$$ ##JCAMPDX= 5.01
$$ ##ORIGIN= Bruker BioSpin GmbH
$$ ##OWNER= she
$$ F:/spectra/data/she/nmr/H-C/1/audita.txt
$$ ##AUDIT TRAIL=  $$ (NUMBER, WHEN, WHO, WHERE, WHAT)
(   1,<2026-06-03 14:02:40.82 +0400>,<she>,<DPX200>,
      <created by zg, POWCHK disabled, PULCHK disabled
       configuration hash MD5:
       00 E9 B6 7A A2 85 ED C7 34 08 36 98 17 FE 4E 26
       data hash MD5: 16K
       5F 8E A1 9F 15 0D 24 71 24 A0 C1 AD 6D B5 59 E6>)
$$ ##END=
$$ 
$$ hash MD5
$$ A3 9A E1 0F DF 52 D3 04 87 4A A0 8A 58 02 1D 01
##$RELAX= 
##$RELAX= 
##$RELAX= 
##$RELAX= 
##$RELAX= 
##$RELAX= 
$$ Bruker specific parameters
$$ --------------------------
##$DU= <F:/spectra>
##$EXPNO= 1
##$NAME= <H-C>
##$PROCNO= 1
##$TYPE= <nmr>
##$USER= <she>
##$AMP= (0..31)
100 100 100 100 100 100 100 100 100 100 100 100 100 100 100 100 100 100 
100 100 100 100 100 100 100 100 100 100 100 100 100 100 
##$AQSEQ= 0
##$AQ_mod= 1
##$AUNM= <au_zg>
##$AUTOPOS= <>
##$BF1= 200.13
##$BF2= 200.13
##$BF3= 200.13
##$BF4= 200.13
##$BF5= 200.13
##$BF6= 200.13
##$BF7= 200.13
##$BF8= 200.13
##$BYTORDA= 1
##$CFDGTYP= 0
##$CFRGTYP= 5
##$CHEMSTR= <none>
##$CNST= (0..31)
1 1 145 1 1 1 1 1 1 1 1 1 1 1 1 1 1 1 1 1 1 1 1 1 1 1 1 1 1 1 1 1 
##$CPDPRG= <>
##$CPDPRG1= <>
##$CPDPRG2= <>
##$CPDPRG3= <>
##$CPDPRG4= <mlev>
##$CPDPRG5= <mlev>
##$CPDPRG6= <mlev>
##$CPDPRG7= <mlev>
##$CPDPRG8= <mlev>
##$CPDPRGB= <>
##$CPDPRGT= <>
##$D= (0..31)
0 0.7 0 0 0 0 0 0 0 0 0 0.03 0 0 0 0 0 0 0 0 0 0 0 0 0 0 0 0 0 0 0 0 
##$DATE= 1780480960
##$DBL= (0..7)
120 120 120 120 120 120 120 120 
##$DBP= (0..7)
150 150 150 150 150 150 150 150 
##$DBP07= 0
##$DBPNAM0= <>
##$DBPNAM1= <>
##$DBPNAM2= <>
##$DBPNAM3= <>
##$DBPNAM4= <>
##$DBPNAM5= <>
##$DBPNAM6= <>
##$DBPNAM7= <>
##$DBPOAL= (0..7)
0.5 0.5 0.5 0.5 0.5 0.5 0.5 0.5 
##$DBPOFFS= (0..7)
0 0 0 0 0 0 0 0 
##$DE= 6
##$DECBNUC= <off>
##$DECIM= 32
##$DECNUC= <off>
##$DECSTAT= 4
##$DIGMOD= 1
##$DIGTYP= 9
##$DL= (0..7)
0 120 120 120 120 120 120 120 
##$DP= (0..7)
150 150 150 150 150 150 150 150 
##$DP07= 0
##$DPNAME0= <>
##$DPNAME1= <>
##$DPNAME2= <>
##$DPNAME3= <>
##$DPNAME4= <>
##$DPNAME5= <>
##$DPNAME6= <>
##$DPNAME7= <>
##$DPOAL= (0..7)
0.5 0.5 0.5 0.5 0.5 0.5 0.5 0.5 
##$DPOFFS= (0..7)
0 0 0 0 0 0 0 0 
##$DQDMODE= 0
##$DR= 18
##$DS= 0
##$DSLIST= <SSSSSSSSSSSSSSS>
##$DSPFIRM= 0
$$ [...]
##$SUBNAM0= <"">
##$SUBNAM1= <"">
##$SUBNAM2= <"">
##$SUBNAM3= <"">
##$SUBNAM4= <"">
##$SUBNAM5= <"">
##$SUBNAM6= <"">
##$SUBNAM7= <"">
##$SUBNAM8= <"">
##$SUBNAM9= <"">
##$SW= 18.0517599122864
##$SWIBOX= (0..15)
0 0 2 0 0 0 0 0 0 0 0 0 0 0 0 0 
##$SW_h= 3612.71676300578
##$TD= 16384
##$TD0= 1
##$TE= 0
##$TE2= 300
##$TE3= 300
##$TEG= 300
##$TL= (0..7)
0 120 120 120 120 120 120 120 
##$TP= (0..7)
150 150 150 150 150 150 150 150 
##$TP07= 0
##$TPNAME0= <>
##$TPNAME1= <>
##$TPNAME2= <>
##$TPNAME3= <>
##$TPNAME4= <>
##$TPNAME5= <>
##$TPNAME6= <>
##$TPNAME7= <>
##$TPOAL= (0..7)
0.5 0.5 0.5 0.5 0.5 0.5 0.5 0.5 
##$TPOFFS= (0..7)
0 0 0 0 0 0 0 0 
##$TUNHIN= 0
##$TUNHOUT= 0
##$TUNXOUT= 0
##$USERA1= <user>
##$USERA2= <user>
##$USERA3= <user>
##$USERA4= <user>
##$USERA5= <user>
##$V9= 5
##$VALIST= <valist>
##$VCLIST= <CCCCCCCCCCCCCCC>
##$VD= 0
##$VDLIST= <DDDDDDDDDDDDDDD>
##$VPLIST= <PPPPPPPPPPPPPPP>
##$VTLIST= <TTTTTTTTTTTTTTT>
##$WBST= 1024
##$WBSW= 4
##$XGAIN= (0..3)
0 0 0 0 
##$XL= 0
##$YL= 0
##$YMAX_a= 441825
##$YMIN_a= -364734
##$ZGOPTNS= <>
##$ZL1= 120
##$ZL2= 120
##$ZL3= 120
##$ZL4= 120
##$ABSF1= 10
##$ABSF2= 0
##$ABSG= 5
##$ABSL= 3
##$ALPHA= 0
##$AQORDER= 0
##$ASSFAC= 0
##$ASSFACI= 0
##$ASSFACX= 0
##$ASSWID= 0
##$AUNMP= <proc_1d>
##$AZFE= 0.1
##$AZFW= 0.1
##$BCFW= 1
##$BC_mod= 2
##$BYTORDP= 1
##$COROFFS= 0
##$CY= -3
##$DATMOD= 1
##$DC= 2
##$DFILT= <>
##$DTYPP= 0
##$F1P= 0
##$F2P= 0
##$FCOR= 0.5
##$FTSIZE= 0
##$FT_mod= 4
##$GAMMA= 1
##$GB= 0.15
##$INTBC= 1
##$INTSCL= 1
##$ISEN= 128
##$LB= 0.25
##$LEV0= 0
##$LPBIN= 0
##$MAXI= 10000
##$MC2= 0
##$MEAN= 0
##$ME_mod= 0
##$MI= 1.114404
##$NCOEF= 0
##$NC_proc= 0
##$NLEV= 6
##$NOISF1= 3.799351
##$NOISF2= 2.8
##$NSP= 1
##$NTH_PI= 0
##$NZP= 0
##$OFFSET= 14.38212
##$PC= 1
##$PHC0= -4227.562
##$PHC1= 13.79229
##$PH_mod= 1
##$PKNL= yes
##$PPARMOD= 0
##$PSCAL= 0
##$PSIGN= 0
##$REVERSE= no
##$SF= 200.129724274929
##$SI= 16384
##$SIGF1= 3
##$SIGF2= 2
##$SINO= 400
##$SIOLD= 16384
##$SREGLST= <1H.CDCl3>
##$SSB= 0
##$STSI= 0
##$STSR= 0
##$SW_p= 3205.1282051282
##$SYMM= 0
##$S_DEV= 0
##$TDeff= 0
##$TDoff= 0
##$TI= <>
##$TILT= no
##$TM1= 0
##$TM2= 0
##$TOPLEV= 0
##$USERP1= <user>
##$USERP2= <user>
##$USERP3= <user>
##$USERP4= <user>
##$USERP5= <user>
##$WDW= 1
##$XDIM= 8192
##$YMAX_p= 0
##$YMIN_p= 0
$$ End of Bruker specific parameters
$$ ---------------------------------
##NTUPLES= NMR FID
##VAR_NAME=  TIME,          FID/REAL,        FID/IMAG
##SYMBOL=    X,             R,               I
##VAR_TYPE=  INDEPENDENT,   DEPENDENT,       DEPENDENT
##VAR_FORM=  AFFN,          ASDF,            ASDF
##VAR_DIM=   8192,          8192,            8192
##UNITS=     SECONDS,       ARBITRARY UNITS, ARBITRARY UNITS
##FACTOR=    0.0002768,     1,               1
##FIRST=     0,             0,               0
##LAST=      2.2672688,     0,               0
##MIN=       0,             -364734,         0
##MAX=       2.2672688,     441825,          0
$$ Real data points
##PAGE= N=1
##DATA TABLE= (X++(R..R)), XYDATA
$$ [...]
2877g39m42q20l15m93n74n41j47m64q40N5j61l93M8j37lK28J35J49j18J34L18
2898e120M92M65L10O96K70P71L61P55N51M94Q01M48L20P80O30K33N88M67L05O34
2918E251K25Q9M99r5J78J81k37k87k28k7k88n62P0o18m26n55m23l85p04o67n88
2939D03m52p90n08m76p45n27o20m56j69m20m19p12K51m99J57k96J17J4O8m8N03
2960e624L64J5L43O14L89O40P04L88N62N67O15O79M81Q49L60N49P40M81K54P62
2980D732O2O75K17R5L89K92n6m1r1j61k43j24k31j38n90o41k40m42j037r4q36
3001A497n23m90q99m29p73o36l03p47l37r58Q9p64l28J34n62k62J33n0k43M0K13
3022f198J6J59M30M58K37O87M30N05L18O20Q94O44L37R46O44P50O24L69L46Q15
$$ plain form
2877 -739 -1181 -2001 -2316 -2809 -3383 -3924 -4071 -4535 -5375 -5320 -5481 -5874 -5826 -5963 -5966 -5738 -5603 -5454 -5572 -5438 -5120
2898 -5120 -4628 -4163 -3853 -3157 -2887 -2116 -1755 -1000 -449 45 846 1294 1614 2394 3024 3257 3845 4312 4617 5251
2918 5251 5476 5565 6064 5969 6147 6328 6091 5804 5576 5549 5261 4699 4769 4151 3725 3170 2747 2362 1658 991 403
2939 403 -49 -839 -1347 -1823 -2568 -3095 -3715 -4171 -4340 -4760 -5179 -5891 -5640 -6139 -5982 -6278 -6161 -6147 -6079 -6127 -5624
2960 -5624 -5260 -5245 -4902 -4288 -3899 -3259 -2555 -2167 -1605 -1038 -423 256 737 1586 1946 2495 3235 3716 3970 4732
2980 4732 4794 5469 5686 5781 6170 6462 6406 6365 6274 6113 5870 5746 5515 5377 4787 4146 3906 3464 2427 2333 1497
3001 1497 974 484 -415 -844 -1617 -2253 -2556 -3303 -3640 -4598 -4509 -5273 -5601 -5467 -6029 -6291 -6158 -6208 -6451 -6411 -6198
3022 -6198 -6182 -6023 -5593 -5135 -4898 -4211 -3781 -3276 -2958 -2338 -1444 -800 -463 483 1127 1877 2501 2870 3216 4031
3042D031M31J55P05L53L01L33k65M96Mj20N7N5k19m78k00l38n45l08n42n50n51
3063B805p31m46o26o99m56p58p78m77n57n51m95m07n36o76j80l58n57J93k5p3
3083f388k78J0J61J55L68M73J47O33L51N38K16Q05J022K25M52Q54M65N44R51M73
3103B177P61L79N31P15L42L51K78L26M73J89L3m6O7j02O1l68k65l73Q1q52j54
3124D604p22m84p30m05n78r90l90q88n01p52n97m76p69m45m36m44n76n7m07n13
3144f556R0K4r0j17k7J91M22J45J43N28L49O04P07J46N53P69O07O01P21O53O44
3165A107P80K80R92J91O41M78N82K94J60M57J53K70k75L96K1J22k09n09J1j29
3185E813n41j79n67m28q32l69j041l86n68r03n50m84o43p29n59p12k38j047p4
$$ plain form
3042 4031 4462 4617 5322 5675 5976 6309 6044 6540 6544 6424 6481 6536 6317 5839 5639 5301 4756 4448 3906 3356 2805
3063 2805 2074 1628 1002 303 -153 -911 -1689 -2166 -2723 -3274 -3769 -4176 -4712 -5388 -5568 -5926 -6483 -6290 -6315 -6388
3083 -6388 -6666 -6656 -6495 -6340 -5972 -5499 -5352 -4719 -4368 -3830 -3614 -2809 -1787 -1562 -1110 -256 209 753 1704 2177
3103 2177 2938 3317 3848 4563 4905 5256 5534 5860 6333 6522 6555 6509 6576 6474 6535 6167 5902 5529 5610 4758 4604
3124 4604 3882 3398 2668 2263 1685 695 305 -583 -1084 -1836 -2433 -2909 -3678 -4123 -4559 -5003 -5579 -5636 -6043 -6556
3144 -6556 -6466 -6442 -6532 -6649 -6676 -6485 -6063 -5918 -5775 -5247 -4898 -4294 -3587 -3441 -2888 -2119 -1512 -911 -190 463 1107
3165 1107 1887 2167 3159 3350 3991 4469 5051 5345 5505 5962 6115 6385 6110 6506 6527 6649 6440 5931 5942 5813
3185 5813 5272 5093 4526 4098 3266 2897 1856 1470 902 -1 -551 -1035 -1678 -2407 -2966 -3678 -3916 -4963 -5037
3204e037l33n87K9k73l26OP6j2K8k4J71M53M06L68R2Q42N40L75M52N44P65O01
3226h44O92M67J147J35Q12N49P41M34N33L06L55L85K99j04P76j55j02K65nm53
3246F233j74l89J38o71n25n46o21k74m55r42n13k69p22q02o28o92n10p36l78p11
3266d187m86j61p61j53l42l6J57r3l96J26k23N68K14J04o7O49N70K41Q05K36Q80
3287b355P09M94L56P47Q75K50Q62M53O74M61P89K81N64L92J32L16J68JK8L63J4
3308F574k15j3j11n64l77k39o18n07m38j71j097m24o60n89n27j017m63m53n54
3327b463l14o78n77o59k80n00j00l42k11J80m15j12J34K1K52L47K02PQ14K94N87
3348c813O01M61M80P21N43M81P92L09P39P27O11N97N08J70O49K42M50L57J50J89
$$ plain form
3204 -5037 -5370 -5957 -5928 -6201 -6527 -6521 -6445 -6457 -6429 -6453 -6282 -5829 -5423 -5055 -4963 -4121 -3581 -3206 -2754 -2210 -1445 -844
3226 -844 -152 315 1462 1597 2409 2958 3699 4133 4666 4972 5327 5712 6011 5907 6683 6528 6426 6691 6686 6233
3246 6233 6059 5670 5808 5137 4612 4066 3445 3171 2716 1774 1261 992 270 -532 -1160 -1852 -2362 -3098 -3476 -4187
3266 -4187 -4673 -4834 -5595 -5748 -6090 -6126 -5969 -6062 -6458 -6332 -6555 -5987 -5773 -5669 -5736 -5087 -4517 -4276 -3471 -3235 -2355
3287 -2355 -1646 -1152 -796 -49 826 1076 1938 2391 3065 3526 4315 4596 5160 5552 5684 6000 6168 6169 6197 6560 6574
3308 6574 6359 6346 6235 5671 5294 5055 4437 3930 3492 3321 2224 1800 1140 551 24 -993 -1456 -1909 -2463
3327 -2463 -2777 -3455 -4032 -4691 -4971 -5471 -5571 -5913 -6124 -5944 -6359 -6471 -6337 -6316 -6064 -5717 -5515 -5508 -4694 -4400 -3813
3348 -3813 -3212 -2751 -2271 -1550 -1007 -526 266 575 1314 2041 2652 3249 3757 3927 4576 4818 5268 5625 5775 5964
3368E964L34J28k65j25J07j04l78k61k48n37l52n81m41m35l64p08p13m42q09n34
3388g64o96n31m49o34n77o12n08p4m73k45l54r7l05J81J57m8j39J57L92J97M36
3409d986L24N25N22L09N04O12N73K86R92N92O71N06M53P66N51O70P9L60M83L33
3429E125K90J46K14L93rK5O3j59l11l42j40k39m24o09l40o39m15o33l87o34p65
3450B10o42m64n02o88n94k19p32m34l56n32n61J9j74m21k8QJ48R3J37j23N66K92
3472d997M76R2N47O24L05L25N09N23P67O70M58N56O39O49K78O05O67L69L16J99
3492D577M39M54K34K32j03j3k19J87j12r2m99N8o39j11n80m47k89p94m15p06l77
3513G85m45n14q90m94m70n28o38l52l72n42k30j86n41l4j64k23pj52j40M46N29
$$ plain form
3368 5964 6298 6426 6161 6036 6143 6039 5661 5400 5152 4615 4263 3682 3241 2806 2442 1734 1021 579 -230 -764
3388 -764 -1460 -1991 -2440 -3074 -3651 -4263 -4771 -4845 -5318 -5563 -5917 -6014 -6319 -6138 -5981 -6029 -6168 -6011 -5619 -5422 -4986
3409 -4986 -4662 -4137 -3615 -3306 -2802 -2190 -1617 -1331 -339 253 924 1430 1883 2649 3200 3870 3949 4309 4792 5125
3429 5125 5415 5561 5775 6168 6159 6184 6247 6088 5777 5435 5295 5056 4632 4023 3683 3044 2629 1996 1609 975 210
3450 210 -432 -896 -1398 -2086 -2680 -2899 -3631 -4065 -4421 -4953 -5514 -5495 -5669 -6090 -6118 -6110 -5962 -5869 -5732 -5855 -5289 -4997
3472 -4997 -4521 -4429 -3882 -3258 -2953 -2628 -2119 -1596 -829 -159 299 855 1494 2143 2421 3026 3693 4062 4378 4577
3492 4577 5016 5470 5704 5936 5833 5820 5601 5788 5676 5584 5085 5143 4504 4393 3813 3366 3077 2283 1868 1162 785
3513 785 340 -174 -1064 -1558 -2028 -2556 -3194 -3546 -3918 -4460 -4690 -4876 -5417 -5451 -5615 -5838 -5845 -5997 -6137 -5691 -5162
3534e162k29L66N43K88N65J60R74p3R65K00O89L16Q26N84M92O09L93O40N16K68
3554C930M41N23J93L43J64K14J78O1k68p1Q7k11n80k02k40k20n05l53p57k72n90
3575A865q80m71l64n59p30n73n36k64o03m37m72r5q92%q2m06R2j34j84J89J60
3596e376J60Q6J50J59K61M56N11M53M44P38J39Q04N96J37M02Q00N40N60N70K24
3616B814P44K43N62L92K33K04K72k86L04j22K89r3k16K22n64m00n9q47P6o10o62
3637B496q1o95l55o53n45n72m77n15q62j46o28j17o57m50j66l64j29l15j66k25
3657e622J92L2k0J47R7J98K26M50M74J37N65P38J77N75O64N66M78M58L18Q20M96
3678B166L62R5Q09M45J91K88K66L46Q0K50J83J9L3m0l31J54o40j84o33j73K2p45
$$ plain form
3534 -5162 -5391 -5025 -4482 -4194 -3629 -3469 -2495 -2568 -1603 -1403 -714 -398 428 1012 1504 2113 2506 3146 3662 3930
3554 3930 4371 4894 5087 5430 5594 5808 5986 6047 5779 5708 5795 5584 5004 4802 4562 4342 3837 3484 2727 2455 1865
3575 1865 985 514 150 -409 -1139 -1712 -2248 -2512 -3115 -3552 -4024 -4119 -5011 -5011 -5093 -5499 -5407 -5541 -5725 -5536 -5376
3596 -5376 -5216 -5130 -4980 -4821 -4560 -4104 -3593 -3140 -2696 -1958 -1819 -1015 -419 -282 120 920 1460 2020 2590 2814
3616 2814 3558 3801 4363 4755 4988 5192 5464 5178 5482 5360 5649 5556 5340 5562 4998 4598 4539 3692 3768 3158 2496
3637 2496 2415 1720 1365 712 167 -405 -882 -1397 -2259 -2405 -3033 -3150 -3807 -4257 -4423 -4787 -4916 -5231 -5397 -5622
3657 -5622 -5430 -5398 -5418 -5271 -5174 -4976 -4750 -4300 -3826 -3689 -3124 -2386 -2209 -1634 -970 -404 74 532 850 1670 2166
3678 2166 2528 2623 3432 3877 4068 4356 4622 4968 5048 5298 5481 5500 5533 5493 5162 5316 4676 4492 3859 3686 3708 2963
3700B963k82q15m13m90n62l16p34n68m52l78n92m69m12j92n95m1j87m58p0j85
3720e248j49k98N79j92K53K43r0N20J1P81L48K02P48J10P08M74O25N66L56L50
3740H97P86L37M30N06M36L06N42m9M16J44M3M43k0J72k37J47n05N7l48k05j55
3761D143o27k02m76l50p94j37p35n47l31m84o89k41m02o08o54l42l06j38m72k38
3781d630n1j94n6q2q6r7K31P6J38J89K58M07K50O82M0M88K77O11N17N45N65M67
3803E45N09M55L22O30O16K25K62L00N03P2J95K78n3J96J58k90L12l61m35j6j32
3824D291k79l51n67j65m86p04m11m76k55m73o80o26m71l38k35o66m37m22l18l17
3844d386j89j35K3l81p4q8qO16k07K91J31M01L37J48L80N78L98L48M89M01O39
$$ plain form
3700 2963 2681 1866 1453 963 401 85 -649 -1217 -1669 -2047 -2639 -3108 -3520 -3712 -4307 -4348 -4535 -4993 -5063 -5248
3720 -5248 -5397 -5695 -5116 -5308 -5055 -4812 -4902 -4382 -4371 -3590 -3242 -3040 -2292 -2182 -1474 -1000 -375 191 547 897
3740 897 1683 2020 2450 2956 3392 3698 4240 4191 4607 4751 4794 5237 5217 5389 5152 5299 4794 4851 4503 4298 4143
3761 4143 3516 3314 2838 2488 1694 1557 822 275 -56 -540 -1229 -1470 -1872 -2480 -3134 -3476 -3782 -3920 -4392 -4630
3781 -4630 -4681 -4875 -4931 -5013 -5099 -5196 -4965 -4889 -4751 -4562 -4304 -3897 -3647 -2965 -2925 -2437 -2160 -1549 -1032 -487 78 545
3803 545 1054 1509 1831 2461 3077 3302 3564 3864 4367 4439 4634 4912 4859 5055 5213 4923 5235 4874 4439 4423 4291
3824 4291 4012 3661 3094 2929 2443 1739 1328 852 597 124 -556 -1182 -1653 -1991 -2226 -2892 -3329 -3751 -4069 -4386
3844 -4386 -4575 -4710 -4687 -5068 -5142 -5230 -5238 -4622 -4829 -4538 -4407 -4006 -3669 -3521 -3141 -2563 -2165 -1817 -1328 -927 -288
3865b88J90R30L70L00N86L78O71P8M73L52j16M77J2L78L67j19j45M9j86Oj85l76
3887D202m7l25m17k59o03k72o39k08p26k21m66o34o45k26l96o31k94k60o32k7
3907c726l46k93n40J91n1l02M03l96K85q0O57m00M08N47J94M91L45K79O33K83
3927a418N52N21N13M49N55K85M08O58J79O77J90J36M11L22K79J86QK3o9p5K7q4
3949D733l01k30J4n17l20m79k02n24o47R5p35o78m72l83l81n21q35l21k23k81
3969c208n50J0l22m26Q4m00p6j28L58K7QL5k9M60M19J72L11N11J08O63M02K76
3991a295M46N46M44L01P18O98K92M76K56R7M44L00N70J05M76j35j05K67j63k5
4011D713m3k19l18J82l16l64n67m49m12j74k88l88r37j14n29p30m61p05m5m88
$$ plain form
3865 -288 -98 832 1202 1502 2088 2466 3137 3215 3688 4040 3924 4401 4413 4791 5158 5039 4894 4943 4757 4763 4578 4202
3887 4202 4155 3830 3413 3154 2551 2279 1640 1432 706 485 19 -615 -1260 -1486 -1882 -2513 -2807 -3067 -3699 -3726
3907 -3726 -4072 -4365 -4905 -4714 -4765 -5067 -4664 -5060 -4775 -4855 -4198 -4598 -4190 -3643 -3449 -2958 -2613 -2334 -1701 -1418
3927 -1418 -866 -345 168 617 1172 1457 1865 2523 2702 3379 3569 3705 4116 4438 4717 4903 4911 4934 4865 4790 4817 4733
3949 4733 4432 4202 4216 3699 3379 2900 2698 2174 1527 1622 887 209 -263 -646 -1027 -1548 -2383 -2704 -2927 -3208
3969 -3208 -3758 -3748 -4070 -4496 -4412 -4812 -4888 -5016 -4658 -4631 -4623 -4588 -4617 -4157 -3738 -3566 -3255 -2744 -2636 -1973 -1571 -1295
3991 -1295 -849 -303 141 442 1160 1858 2150 2626 2882 2979 3423 3723 4293 4398 4874 4739 4634 4901 4738 4713
4011 4713 4670 4451 4133 4315 3999 3635 3068 2619 2207 2033 1745 1357 420 306 -223 -953 -1414 -2119 -2164 -2652
4031b652k06n77m14r9n75J64l7L8m94J05M0j50K76J59N4N04k5L74K65K30P21K91
4053b008N06K11M81P14K81N70M71O24K76L96K38K11P22J71L30Q3K73M11m04M40
4073D997k17r6k33o5j51j17p5n73k1q93l96k50l63m46m56n43k46p10l88o92j54
4094b088j90p22l27j46o03k78j06J55k90r8l2K74r2q5K54K01K54J79L75K53J92
4115b920O93M38N84J01O28L23M77O59L29L07M47L64O37J80L19J96M45J24K45J
4135D577J73K0j08l1j42j90j25j70m69k63l59k34n93k80m07p13k97j46p94j39
4155f90n97l23p60J5q14l9m39j77m07j1j96j43o9j44L15J79jJ38J81J6K75M31
4177c260L26N71K85J6N02N28M32M39R09p3O88L30N24L19L69M18R0N60L4J17K07
$$ plain form
4031 -2652 -2858 -3435 -3849 -3948 -4523 -4359 -4396 -4358 -4852 -4747 -4707 -4857 -4581 -4422 -4368 -3864 -3889 -3515 -3250 -3020 -2299 -2008
4053 -2008 -1502 -1291 -810 -96 185 755 1226 1850 2126 2522 2760 2971 3693 3864 4194 4277 4550 4961 4557 4997
4073 4997 4780 4684 4451 4386 4235 4118 4043 3470 3449 2556 2160 1910 1547 1101 645 102 -144 -854 -1242 -1934 -2088
4094 -2088 -2278 -3000 -3327 -3473 -4076 -4354 -4460 -4305 -4595 -4693 -4725 -4451 -4543 -4628 -4374 -4173 -3919 -3740 -3365 -3112 -2920
4115 -2920 -2227 -1789 -1205 -1104 -476 -153 324 983 1312 1619 2066 2430 3067 3247 3566 3762 4207 4331 4576 4577
4135 4577 4750 4770 4662 4631 4489 4299 4174 4004 3535 3272 2913 2679 2086 1806 1399 686 389 243 -551 -690
4155 -690 -1287 -1610 -2370 -2355 -3169 -3208 -3647 -3824 -4231 -4242 -4438 -4581 -4650 -4794 -4479 -4300 -4301 -4163 -3982 -3966 -3691 -3260
4177 -3260 -2934 -2363 -2078 -2062 -1560 -1032 -600 -161 748 675 1363 1693 2217 2536 2905 3323 3413 3973 4007 4124 4331
4198D331J91K86j32j11K3Oj40k02n10m36J41q08k43l67k41m70p51l33l94m03o28
4219a191j12m52n16m24j6n40l18k96m90j0j18J0k24j28L24K45O0j64M38J47K53
4240c522M32N02J13J92P39R8M34Q00L72J60J019J64L02M59L53K42M56M98R0L46
4260D249J27K00j9R5r3j41K11m32L5j82l42j30n03l31l94l27n58k64n66k34o17
4281b16k17n01m21o61l82l82l08j27o00R3l99j96j43j37L2j46L86j05j64P50J12
4302c732Q2K20N95R7M92K36O36N66J99L85L95N12N56K12M48L12N63M85K16L17
4322C792j48O58o7R8L01j09l24K13k74RL8n69J69n40m02k26k72m62p31Ol98p18
4344D4l75l05o71m87j37m65m44l80k69j51m74%j65k34K46j55q3J58r9M31k01M12
$$ plain form
4198 4331 4522 4808 4676 4565 4588 4594 4454 4252 3742 3306 3447 2639 2396 2029 1788 1318 567 234 -160 -563 -1191
4219 -1191 -1303 -1755 -2271 -2695 -2711 -3251 -3569 -3865 -4355 -4365 -4483 -4473 -4697 -4825 -4501 -4256 -4196 -4360 -3922 -3775 -3522
4240 -3522 -3090 -2588 -2475 -2283 -1544 -1446 -1012 -212 160 320 1339 1503 1805 2264 2617 2859 3315 3813 3903 4249
4260 4249 4376 4576 4557 4652 4559 4418 4629 4197 4232 4050 3708 3578 3075 2744 2350 2023 1465 1201 635 401 -216
4281 -216 -433 -934 -1355 -2016 -2398 -2780 -3088 -3215 -3815 -3722 -4121 -4317 -4460 -4597 -4565 -4711 -4325 -4430 -4594 -3844 -3732
4302 -3732 -3650 -3430 -2835 -2738 -2246 -2010 -1374 -808 -609 -224 171 683 1239 1451 1899 2211 2774 3259 3475 3792
4322 3792 3644 4302 4235 4333 4634 4525 4201 4414 4140 4149 4187 3618 3787 3247 2845 2619 2347 1885 1154 1160 762 44
4344 44 -331 -636 -1307 -1794 -1931 -2396 -2840 -3220 -3489 -3640 -4114 -4114 -4279 -4513 -4267 -4422 -4505 -4347 -4446 -4015 -4216 -3804
4366c804K66M79N04k0K56O31L41M94M49J16Q74K32L04O78M10J25L17L92L56n5
4386C345O78o3J98p9R9K58j95J09j79j82l69Pm41k21l90k33l48j92o23k88n22
4407C69n03m97Qp19l37n98k1m41l54l49l45m8k26J27m22J16r7P4J62R5Q6J23M4
4430c753Q34j70O56J46L53L19M97J80O06N22K10N73N67J65M21K68O12J43J22K57
4450C528M78j36J22L10k02K42k88R7j86o9k58k73l9m24n68j82m90K0l85n61m48
4471B88l89n95l74l72n92j74n46j45n0m06l95N9m00o2Q4K56j14l14N8M49Q4q5
4493c735L33J80L59M95K83L37M16K57J018k1N45K59L96M61M29J65M18J95J77L31
4513C298J73K26J98L27j21j49K13l5l58J25k40k99k75k10m64k38k17l93k91l60
$$ plain form
4366 -3804 -3538 -3059 -2555 -2575 -2319 -1688 -1347 -853 -404 -288 586 818 1122 1800 2210 2335 2652 3044 3400 3345
4386 3345 4023 3960 4158 4079 4178 4436 4241 4350 4171 3989 3620 3627 3186 2965 2575 2342 1994 1802 1179 891 369
4407 369 -134 -631 -623 -1342 -1679 -2277 -2298 -2739 -3093 -3442 -3787 -3835 -4061 -3934 -4356 -4240 -4337 -4263 -4101 -4006 -3920 -3797 -3753
4430 -3753 -2919 -3089 -2433 -2287 -1934 -1615 -1118 -938 -332 190 400 973 1540 1705 2126 2394 3006 3149 3271 3528
4450 3528 4006 3870 3992 4302 4100 4342 4054 4151 3965 3896 3638 3365 3326 2902 2334 2152 1662 1682 1297 736 288
4471 288 -101 -696 -1070 -1442 -2034 -2208 -2754 -2899 -2949 -3355 -3750 -3691 -4091 -4153 -4069 -3813 -3927 -4241 -4183 -3734 -3650 -3735
4493 -3735 -3402 -3222 -2863 -2368 -2085 -1748 -1332 -1075 -57 -78 467 726 1122 1583 2012 2177 2595 2790 2967 3298
4513 3298 3471 3697 3895 4222 4101 3952 4165 4130 3772 3897 3657 3358 3083 2873 2409 2171 1954 1561 1270 910
4533I10q02l6n52k10o85P4m19o40n7m93j83k21Q3p17K43j22J0j23k09J12L16R8
4555c623Q2J23L78K31O4M90M71O49J78L34P6O12M01K09M40O66L9L98L75L15Q2
4576B990K38K19J73L13j77K66K22l81k00J75k1m36k09k73k58k80l28l96n24j68
4596I45m02k92k50o92M3k78p50j83j43p46J48o92j27O3m88J99j93M1N4n3K74P3
4618c449k72L19K00M60K46P7M06M40J54O08N6L67P22K68N59n5N30M35K51n1P20
4639B991k7L08K99l6J36o0M0J37k10%j4l82K32n26R6p87o6j5m85m27m20l51l82
4662E1j01l63o35J2o83l62k09n27K75n39Mk65j73j53j77Q0K53p6J75o2L83M1M54
4685b597j27L38L86J03L36M14L54K44M03O40M57J03M9M70K87L45M74J23K25J48
$$ plain form
4533 910 108 72 -480 -690 -1375 -1301 -1720 -2360 -2417 -2910 -3093 -3314 -3231 -3948 -3705 -3827 -3817 -3940 -4149 -4037 -3721 -3623
4555 -3623 -3541 -3418 -3040 -2809 -2745 -2255 -1784 -1135 -957 -623 -547 65 466 675 1115 1781 1820 2218 2593 2908 2990
4576 2990 3228 3447 3620 3933 3756 4022 4244 3863 3663 3838 3817 3381 3172 2899 2641 2361 2033 1637 1113 945
4596 945 543 251 1 -691 -648 -926 -1676 -1859 -2002 -2748 -2600 -3292 -3419 -3356 -3844 -3645 -3838 -3797 -3743 -3796 -3522 -3449
4618 -3449 -3721 -3402 -3202 -2742 -2496 -2419 -2013 -1573 -1419 -811 -755 -388 334 602 1161 1106 1636 2071 2322 2271 2991
4639 2991 2964 3272 3571 3535 3671 3611 3651 3788 3578 3578 3564 3182 3414 2888 2984 2197 2131 2116 1631 1204 784 433 51
4662 51 -50 -413 -1048 -1036 -1719 -2081 -2290 -2817 -2542 -3081 -3077 -3342 -3515 -3668 -3845 -3765 -3512 -3588 -3413 -3475 -3092 -3051 -2597
4685 -2597 -2724 -2386 -2000 -1897 -1561 -1147 -793 -549 -146 494 951 1054 1103 1573 1860 2205 2679 2802 3027 3175
4705C175M3J50K74Oj99K50m00Q6j50j87qn5k46n62l86j47k56m42k05n15%n02n92
4728h68j76n5l50m13l50l99N3j85l68o5j84p7m2J16q5K23O2j60L23K1M52M69k20
4751b278M79R2L61M34M70M51R9K07K38O21J02O06J23K94K04N6R5L50L06K66k32
4772C344J4j65J93m4l52k25L45l20l30j62j97m99o8m32n98O0l53k92m60j22l10
4793i73l45k48k54l76Mj77l11k43j38n2j74m8L40m76L76n3L96l1L96J79k01L72
4815b037K49L81K82K23L02K48L25L88K89K69L41K05L54M36Nn0L20K84R0LJ98r
4837C096L6J47l70K63o01j51j51k16J68m49l02M2n35j76j52n39k15o50J57m83
4857a081j68k54l22k50Ol21J3l89j14j38k13J58J14K62o7j09K58J58K8L60l1N12
$$ plain form
4705 3175 3218 3368 3642 3648 3449 3699 3299 3385 3235 3048 3040 2985 2739 2177 1791 1644 1388 946 741 226 226 -276 -868
4728 -868 -1044 -1099 -1449 -1862 -2212 -2611 -2558 -2743 -3111 -3176 -3360 -3437 -3479 -3363 -3448 -3225 -3163 -3323 -3000 -2979 -2527 -2058 -2278
4751 -2278 -1799 -1707 -1346 -912 -442 9 108 315 553 1174 1276 1882 2005 2299 2503 2559 2654 3004 3310 3576 3344
4772 3344 3358 3193 3386 3342 2990 2765 3110 2790 2460 2298 2101 1602 1534 1102 504 564 211 -81 -541 -663 -973
4793 -973 -1318 -1566 -1820 -2196 -2192 -2369 -2680 -2923 -3061 -3113 -3287 -3335 -2995 -3471 -3095 -3148 -2752 -2783 -2387 -2208 -2409 -2037
4815 -2037 -1788 -1407 -1125 -902 -600 -352 -27 361 650 919 1260 1465 1819 2255 2260 2210 2530 2814 2904 2907 3105 3096
4837 3096 3132 3279 2909 3172 2571 2420 2269 2053 2221 1772 1470 1512 977 801 649 110 -105 -755 -598 -1081
4857 -1081 -1249 -1503 -1825 -2075 -2069 -2390 -2377 -2766 -2880 -3018 -3231 -3073 -2959 -2697 -2764 -2873 -2615 -2457 -2429 -2069 -2100 -1588
4879a588L42k9L20QO95k1O41K85K7M01M3L97L09M07j43qM78rJ35P8J74k1O1j07
4903B875j14n8k29l7j18l37j59l94j89k27J43m57m19K60q07l44p3k17l57k72j31
4924a661l0l03l45J20k59j33K%j96J85l26L66k5J68J98j38M55J70J99L35L25q
4946i01L57P6K95J78L00K17O28J95nL04K92L63K06m58M76l17J09R8J77KjJ9o4
4969B546j12j65k26j08j88k22k87l69n4l35l28l21m2q3m76j60l61r0r4n87L16
4990a746k94n8m16Q5R8k1k21N14l26P2j4L82l26L57M14j96L92K86K11K46P8K19
5012b64M73K44J00k05M21O39KO3K42J97Q4j93K35K95J90j72j0M3O7j56M3n84J13
5035A867j82J7k04j41l49j79m04Or6l93l19j67K6m15k24M0j81k51k09j68N0j89
$$ plain form
4879 -1588 -1246 -1275 -955 -947 -252 -273 368 653 680 1081 1124 1521 1830 2237 2094 2086 2564 2555 2690 2768 2942 2921 2982 2875
4903 2875 2761 2703 2474 2437 2319 1982 1823 1429 1240 1013 1156 699 280 540 -267 -611 -684 -901 -1258 -1530 -1661
4924 -1661 -1691 -1994 -2339 -2219 -2478 -2611 -2609 -2609 -2805 -2620 -2946 -2580 -2605 -2437 -2239 -2377 -1922 -1752 -1553 -1218 -893 -901
4946 -901 -544 -468 -173 5 305 522 1150 1345 1340 1644 1936 2299 2505 2047 2523 2206 2315 2413 2590 2592 2591 2610 2546
4969 2546 2434 2269 2043 1935 1747 1525 1238 869 815 480 152 -169 -211 -294 -770 -930 -1291 -1381 -1475 -2062 -1746
4990 -1746 -2040 -2098 -2514 -2429 -2331 -2352 -2573 -2059 -2385 -2313 -2327 -1945 -2271 -1914 -1500 -1696 -1304 -1018 -807 -561 -483 -264
5012 -264 209 453 553 348 769 1408 1410 1473 1715 1912 1996 1803 2038 2333 2523 2351 2341 2384 2451 2295 2338 1754 1867
5035 1867 1685 1702 1498 1357 1008 829 425 431 335 -58 -377 -544 -518 -933 -1157 -1117 -1298 -1549 -1758 -1926 -1876 -2065
5057b065%j20J55j01j54J34K18j60K58j41M79K39k48L87K21O9J04L61M74l3K04
5078B81K07M49k31M25L0J47L69j61K38j52M46j75R7k36L51j63L68l98o4M7l40
5099A535J88m43J46l57k02k10P3Nm82k10l38l50J80m19n7j69L5l27j15N5k19k96
5121a977j41J02L9J48K09l74L24K7J24j90M05j60M04kJ10M83j30K47L41N0K51
5142B90J02J51R0L5K96N2K66J35J90K61j80L34k24K66m20K53j73J41l76j50L01
5163A640m91O4k28J01k57r1n28R1L2m65m8l38p0J3nn77J78rm18nR3l77M34l17
5187a578k06K33M2j30K64l31K44M47l09K29N7j2J77J23P3K08J21K39J53L74P0
5208D88j8J48J73K89%m82N90j6J25M15l79N33J19q9n9k08l10J11j53n59Q20n71
$$ plain form
5057 -2065 -2065 -2185 -2030 -2131 -2285 -2151 -1933 -2093 -1835 -1976 -1497 -1258 -1506 -1119 -898 -829 -725 -364 110 77 281
5078 281 488 937 706 1131 1161 1308 1677 1516 1754 1602 2048 1873 1970 1734 2085 1922 2290 1892 1828 1875 1535
5099 1535 1723 1280 1426 1069 867 657 730 735 253 43 -295 -645 -465 -884 -941 -1110 -1075 -1402 -1517 -1462 -1681 -1977
5121 -1977 -2118 -2016 -1977 -1829 -1620 -1994 -1670 -1643 -1519 -1709 -1304 -1464 -1060 -1062 -952 -469 -599 -352 -11 39 290
5142 290 392 543 633 668 964 1016 1282 1417 1607 1868 1688 2022 1798 2064 1644 1897 1724 1865 1489 1339 1640
5163 1640 1149 1213 985 1086 829 738 210 301 333 -132 -180 -518 -588 -575 -580 -1157 -979 -988 -1406 -1411 -1318 -1695 -1261 -1578
5187 -1578 -1784 -1551 -1509 -1639 -1375 -1706 -1462 -1015 -1324 -1095 -1038 -1050 -873 -750 -677 -469 -348 -109 44 418 488
5208 488 470 618 791 1080 1080 598 1188 1172 1297 1712 1333 1866 1985 1896 1837 1629 1319 1430 1277 718 1538 967
5230I67O4m21N7l10N06l70p01K93M39r90P88l21p75l13P00o81l43M5J40p8O4J64
5252a076m95j46j196P53J373j559P57J120p41M11J38k8Q68j062L47N19m03N91
5270A71n30J438p53P53q0l60M56m45M42N29Nj92nN08n31J79L4r05j60L14J60m9
5292I79J14r23P34J04K43n99O3r75O25n42J80k14k98l97K58P9j78j31L15m4o99
5313a306j00k48N61j21j50J10j37Q2L00k30L00L31m15l51J013l39L62k61J95N5
5333c49L01K17mK23J33K64l01M31J95m59N43j44P6k28L07J90j7l05J63J31j28
5354A239m54R67j161L59M2l29j56J63l10l61j36N39m24p3j36m98R6M7o0L16m61
5375g91p10J01N23k49j36L69l95Q15j174K30O3N70p01O71n1nK61l4O7q0K58k13
$$ plain form
5230 967 1031 610 667 357 863 493 -208 85 524 -466 322 1 -774 -1087 -387 -1068 -1411 -1366 -1226 -1304 -1240 -1076
5252 -1076 -1571 -1717 -2913 -2160 -787 -2346 -1589 -469 -1210 -799 -661 -689 179 -883 -536 -17 -420 171
5270 171 -359 1079 326 1079 999 639 1095 650 1092 1621 1626 1434 1429 1937 1406 1585 1619 714 554 868 1028 979
5292 979 1093 170 904 1008 1251 652 715 -260 365 -177 3 -211 -509 -906 -648 -569 -747 -878 -563 -607 -1306
5313 -1306 -1406 -1654 -1093 -1214 -1364 -1254 -1391 -1309 -1009 -1239 -939 -608 -1023 -1374 -361 -700 -338 -599 -404 -349
5333 -349 -48 169 165 388 521 785 484 915 1110 651 1194 1050 1126 898 1205 1395 1378 1073 1236 1367 1239
5354 1239 785 1752 591 950 992 663 507 670 360 -1 -137 402 -22 -95 -231 -729 -633 -586 -646 -330 -791
5375 -791 -1501 -1400 -877 -1126 -1262 -893 -1288 -473 -1647 -1417 -1354 -784 -1485 -814 -865 -870 -609 -643 -576 -656 -398 -611
5397f11P55m03N49K48P6m33L18k15K50N71k35jJ94k85o2K42P6K59j41j46Q0J80
5419A266m28J30j82L0j33J52R2m18j90N4m48K06k36L1R4l00l8j64K6k34L01m72
5441h61J55p1n5p1j79m2J1K55m3K13p2l10K22K12k98K03J1LL85l40M54rp3K77
5465b3J00L60j24Q6j29J86L90o9k0J08p9J15L19l55J32j52J36M9L1j32l3qj61
5488G27m16M63j72j30l28N70o78J93k51j39%j01R4l47J05m71K2K63k79l05M63
5509g17k81M50o57J38j08P1M5J30nO3J10J04R5P9l24K39l0R8Q4L63K34J82m17
5532e4R2J10K98r2K77p6j43p2J81K70n4k8K66n5j39K79k26L12j50k33j14j11J02
5555F40q3P4k84j76R3K0r1N7j34j32k01l69J57j7k77K47j93Qj22j65j84K05M04
$$ plain form
5397 -611 144 -259 290 538 614 181 499 284 534 1105 870 869 1063 778 716 958 1034 1293 1152 1006 1086 1266
5419 1266 838 968 786 816 683 835 927 509 319 373 -75 131 -105 -74 20 -280 -318 -482 -456 -690 -389 -861
5441 -861 -706 -777 -832 -903 -1082 -1124 -1113 -858 -901 -688 -760 -1070 -848 -636 -934 -731 -720 -717 -332 -672 -218 -227 -300 -23
5465 -23 77 437 313 399 270 456 846 777 757 865 786 901 1220 865 997 845 981 1030 1061 929 896 888 727
5488 727 311 774 602 472 144 714 36 229 -22 -161 -161 -262 -168 -515 -410 -881 -859 -596 -875 -1180 -717
5509 -717 -998 -548 -1205 -1067 -1175 -1104 -1059 -929 -934 -871 -761 -657 -562 -483 -807 -568 -598 -500 -416 -53 181 363 -54
5532 -54 38 148 446 354 631 555 412 340 521 791 737 709 975 920 781 1060 834 1146 996 763 649 538 640
5555 640 557 631 347 171 264 284 193 250 116 -16 -217 -586 -429 -446 -723 -476 -669 -661 -783 -948 -1132 -927 -523
5578e23j80l47L38k64j14j59K73n1K73m2K79N2j27L42K3k76M30j9K62j29K98j12
5600B27J60j17L86P8M0j20M3j28J12jN7K44j89j94J98j42J43j41J44N3n43K35
5622E45J23k22k52j39J23l04L92q46L52k36l7J13k22J8j10k22L8m8j43L79n65
5643a263L82K46j26l30K93Q0j58J6m5KJ40M08k06j63Q08m32M26j29L84j61K42
5664D14j85J22l7K96L37l04O8J22J98J44m63L23J0j78r3K47J45o22M28k74j66
5685E32l8k21J79K42l47j11k8n9l29p5L9j57m28J06n6q1K14n3k38j3l3P6k33M8
5709a064k3Kl1J38P7J01j05J44K94p5j96J51R3M27k18n7M25J44O3K04k82K69K1
5732E02M62l05L42k69J96J71k45K62Pj76n2R1k32J42J31j85n4j09k87L49m19k0
$$ plain form
5578 -523 -703 -1050 -712 -976 -1090 -1249 -976 -1027 -754 -796 -517 -465 -592 -250 -227 -503 -73 -92 170 41 339 227
5600 227 387 270 656 734 774 654 697 569 681 680 737 981 792 598 796 654 797 656 800 853 310 545
5622 545 668 446 194 55 178 -126 266 -580 -228 -464 -501 -388 -610 -592 -702 -924 -886 -934 -1077 -698 -1263
5643 -1263 -881 -635 -761 -1091 -798 -718 -876 -860 -905 -903 -763 -355 -561 -724 84 -348 78 -51 333 172 414
5664 414 229 351 314 610 947 643 711 833 1031 1175 712 1035 1045 867 774 1021 1166 544 972 698 532
5685 532 494 273 452 694 347 236 208 149 -180 -255 -216 -373 -801 -695 -751 -832 -618 -671 -909 -922 -955 -879 -1112 -1064
5709 -1064 -1087 -1085 -1116 -978 -901 -800 -905 -761 -467 -542 -738 -587 -494 -67 -285 -342 83 227 290 494 212 481 502
5732 502 964 659 1001 732 928 1099 854 1116 1123 947 895 986 754 896 1027 842 788 679 392 741 322 302
5754C02nq5k1k70p5m3k81j66K97l89K1j51J73l05j03J72j67j55J38m8J90j05J44
5777i32j08J01K77l72J86J91K89k73M06J30L7j01J69n4J32j3O60j18l3r5K95J24
5799H98M9J08k46K41J95k95M43m25K22j30PJ02l56JO5l07l30L7j10K83k59p1k88
5822a66J53k28j66j98K16k01N2n37L94k95K19k95R0k19J15J27m8k08K98m74L98
5843i73Lk0J6L06q7K13m4L10p4M63m12L80K61j19J91K82O9K5K39j76L70j09J44
5866A258l31K70K10n11QJ61Q0M1l21J91m10P2j57K66k12l10M9O5k16l05pJ6j57
5889b50k78k96K4n5j97j30j11J20L9K42l88J26j57k03N68K5j67k16L33J83k14
5910a002M73j07L81k89M32k81K94L37j00J79J85J93q7J94K53J33j97j23Q3l6m6
$$ plain form
5754 302 297 212 191 -79 -154 -197 -478 -644 -347 -736 -715 -866 -693 -998 -1101 -929 -1096 -1251 -1113 -1161 -971 -1076 -932
5777 -932 -1040 -939 -662 -1034 -848 -657 -368 -641 -235 -105 -68 -169 0 -54 78 65 725 607 574 479 774 898
5799 898 947 1055 809 1050 1245 950 1393 968 1190 1060 1067 1169 813 814 879 572 242 279 169 452 193 122 -166
5822 -166 -13 -241 -407 -605 -389 -590 -538 -1075 -681 -976 -757 -1052 -962 -1181 -1066 -939 -987 -1195 -897 -1371 -973
5843 -973 -970 -990 -974 -668 -755 -542 -586 -276 -350 113 -299 81 342 223 414 696 765 790 1029 853 1223 1114 1258
5866 1258 927 1197 1407 896 904 1065 1145 1186 865 1056 646 718 561 827 615 305 354 419 203 -102 -109 -93 -250
5889 -250 -528 -824 -800 -855 -1052 -1182 -1293 -1173 -1134 -892 -1280 -1154 -1311 -1514 -946 -921 -1088 -1304 -971 -788 -1002
5910 -1002 -529 -636 -255 -544 -112 -393 -99 238 138 317 502 695 608 802 1055 1188 991 868 951 915 869
5931H69N07k20J70l8l07J20J67Jo9j07m11k07%M7J76m82j00m31K77m33n0K53l78
5954f46K3k16J02j83k99K1j46J75o8P6j68J71m3L8J2J00K80k11K97l22J36K79
5976e92p0K75K22K30n5R6L53n4J61j7M06j31K12o6M6j02M46k29K58o3J20K22m99
5999A169L19k33j48j4J4j0k96J56j18l41j44J06p51J01O2p2k80k58o7k30p7P5
6021a037Rp9L5k85q7K33k94J69O3k23K93j47J69K57N3k6J27p7J54L12J1j13O06
6044A23j63Q2L95r6N78k7n1k6J22L05l1Qo3M79k94j94K11N1k51J13L0l62Q8k00
6068H27o0P9k53O8J1k4m75r4p7l92k12M7k90J5j96OP3j1j19l13R5M1j49J01J08
6093a194N5rJ59k90p7K68J42K81m8j62K50L06L36rJ5J48K06J6lL27j5J78J47j63
$$ plain form
5931 869 1376 1156 1326 1288 981 1101 1268 1269 1200 1093 682 475 475 522 698 216 116 -315 -38 -471 -521 -268 -646
5954 -646 -623 -839 -737 -920 -1219 -1198 -1344 -1169 -1237 -1161 -1329 -1158 -1201 -1163 -1151 -1051 -771 -982 -685 -1007 -871 -592
5976 -592 -662 -387 -165 65 10 106 459 405 566 549 955 824 1036 970 1016 914 1360 1131 1389 1326 1446 1668 1169
5999 1169 1488 1255 1107 1093 1107 1097 801 957 839 498 354 460 -291 -190 -128 -200 -480 -738 -805 -1035 -1112 -1037
6021 -1037 -1028 -1107 -1072 -1357 -1444 -1211 -1505 -1336 -1273 -1496 -1203 -1350 -1181 -924 -871 -897 -770 -847 -693 -381 -370 -483 123
6044 123 -40 42 437 341 919 892 841 815 937 1242 1211 1219 1156 1635 1341 1147 1358 1409 1158 1271 1301 939 1027 827
6068 827 767 846 593 661 672 648 173 79 2 -390 -602 -555 -845 -830 -1026 -1020 -947 -958 -1077 -1390 -1295 -1254 -1403 -1302 -1194
6093 -1194 -1139 -1148 -989 -1279 -1356 -1088 -946 -665 -713 -875 -625 -319 17 8 23 171 377 393 390 717 702 880 1027 864
6117H64M26j22J19Q1L2P1k02K27n19M25J94l88J46l68O1l07j17K0j06m8j76k76
6139C7J00l12j63j14k82r8k0j05J73n01K50k42k89J93J4P3p2mk84J88L59k60O1
6162a298K61j87N46J40Q0K04O0j06K01P3L38R5N3R3J99K30J81oj47K36J38j13
6184A271K42j56RJ5L23k5j15k24k34N3Pk42j96L5k86k47N91n38m23J62m86j53
6206f17J02j49m54kj41O5j59Pj60P3O1n6j43k0J08K51l05M31o9J59j03J40P9J41
6230g61M4L71J81P3J18L49Q3J7L58N1M0M07O0p1p0p8P05k22mj35j03J6j21O3K74
6255A645k61k08j67O8k28l1P8m05j07k9m49n6J50n16p4Po76L74j06l3l72j17K15
6278a298l19O1j48J40M3L4k42K32M1J12k3J13L7J63M9M15J47K43o6M47Q6oK84
$$ plain form
6117 864 1290 1168 1287 1368 1400 1471 1269 1496 977 1402 1596 1208 1354 986 1047 740 623 643 537 489 313 37
6139 37 137 -175 -338 -452 -734 -832 -852 -957 -784 -1285 -1035 -1277 -1566 -1373 -1359 -1286 -1358 -1362 -1646 -1458 -1099 -1359 -1298
6162 -1298 -1037 -1224 -678 -538 -458 -254 -194 -300 -99 -26 312 407 460 553 752 982 1163 1157 1010 1246 1384 1271
6184 1271 1513 1357 1366 1381 1704 1679 1564 1340 1106 1159 1166 924 728 763 477 230 821 283 -140 22 -464 -617
6206 -617 -515 -664 -1118 -1120 -1261 -1196 -1355 -1348 -1508 -1435 -1374 -1430 -1573 -1593 -1485 -1234 -1539 -1108 -1177 -1018 -1121 -981 -902 -761
6230 -761 -717 -346 -165 -92 26 375 458 475 833 884 924 1331 1391 1320 1250 1172 1877 1655 1651 1516 1413 1429 1308 1371 1645
6255 1645 1384 1176 1009 1077 849 818 896 491 384 355 -94 -150 0 -516 -590 -583 -1259 -885 -991 -1024 -1396 -1513 -1298
6278 -1298 -1617 -1556 -1704 -1564 -1521 -1487 -1729 -1497 -1456 -1344 -1367 -1254 -1217 -1054 -1005 -590 -443 -200 -266 181 267 261 545
6301E45K84R5j23K69J87K3K9j45M56m1P8r8l0j29L51l38nk2o7k55j2j08j22j99
6325F23n3L6j80r8k35k23j93K8m28j08J3m37K22k72m18M29j33J25m99L3J64P4
6347a530k23K47J79k76K22L69J71l05L80K55Q1k16N63k74L17K10K82N5M08j93
6367G22j4J91K99m5J27L00j51K22j70M16l14J58k46j19Nk24K64k1n67m8K9k36
6389E78J81k24q8l32j92J36m30R3k37m08q4k22o8p5j56K5Nm08Q4o3L00n4j30J11
6413a658K32r8K37K58k41L60J57J80Q1K13K95M8k54K94K89J09R1L72J26J41k4
6434A208n9P1K31K99J25l38K97q2j34k37L30j75m46K38k49J65k86j93r8k39J40
6455E68l81k09j25j32J73l54l44k50J07j30k81k17J59k44J41j44J09kk70M13k11
$$ plain form
6301 545 829 924 801 1070 1257 1280 1309 1164 1620 1579 1657 1559 1529 1400 1751 1413 1408 1386 1319 1064 1052 944 822 623
6325 623 570 606 426 328 93 -130 -323 -295 -723 -831 -818 -1255 -1033 -1305 -1723 -1294 -1427 -1302 -1801 -1768 -1604 -1530
6347 -1530 -1753 -1506 -1327 -1603 -1381 -1012 -841 -1146 -766 -511 -430 -646 -83 -357 -40 170 452 507 915 722
6367 722 708 899 1198 1153 1280 1580 1429 1651 1481 1897 1583 1741 1495 1376 1381 1157 1421 1400 833 785 814 578
6389 578 759 535 447 115 -77 59 -371 -278 -515 -923 -1007 -1229 -1297 -1372 -1528 -1503 -1498 -1906 -1822 -1885 -1585 -1639 -1769 -1658
6413 -1658 -1426 -1524 -1287 -1029 -1270 -910 -753 -573 -492 -279 16 64 -190 104 393 502 593 965 1091 1232 1208
6434 1208 1149 1220 1451 1750 1875 1537 1834 1752 1618 1381 1711 1536 1090 1328 1079 1244 958 765 667 428 568
6455 568 187 -22 -147 -279 -106 -460 -804 -1054 -947 -1077 -1358 -1575 -1416 -1660 -1519 -1663 -1554 -1556 -1826 -1413 -1624
6476a624N7J95j42R8M65k74J64J51j8N32J71N6q8J80L13K78J72J36J47K71J73
6497A413q7O4L70k66K35j47J10Q1j2j38J79l26O7j3kl0k70k89k89m0Q7k38l86
6520G3k8l85k87K33k30l30J05k77j88l49J1M11n64k7J30k70J54L5j56K62%M30
6542a247k71K35J35Q3K76l11N16P4R2L54L03k6K55K64K66k8k39O21J5N0k1L91
6564A787m9j69L03l09oJ71K29J7k29l04J90l37j68k20q2j64r1k49M2p9m65k31
6586d13J25k43k4m06j43L0k39K52n95k2p5k44O8K88J6k50M0L60j46J97K37j89
6608a376K41nK70J81oM04j6R7J51M70j7mM46K06L31k28J71J99K38k03J65J71N
6631A891r1K43l09j28L0J38j44j18n9j33k43j67j93l91N5j55l62k70K2k09j64
$$ plain form
6476 -1624 -1567 -1372 -1514 -1416 -951 -1225 -1061 -910 -928 -396 -225 -169 -257 -77 236 514 686 822 969 1240 1413
6497 1413 1326 1390 1760 1494 1729 1582 1692 1773 1761 1623 1802 1476 1543 1530 1528 1498 1228 939 650 610 697 459 73
6520 73 45 -340 -627 -394 -624 -954 -849 -1126 -1314 -1663 -1652 -1241 -1805 -1832 -1702 -1972 -1818 -1783 -1939 -1677 -1677 -1247
6542 -1247 -1518 -1283 -1148 -1065 -789 -1100 -584 -510 -418 -64 239 213 468 732 998 970 731 1352 1367 1417 1396 1787
6564 1787 1738 1569 1872 1563 1557 1728 1957 1974 1745 1441 1631 1294 1126 906 824 660 569 320 362 283 -182 -413
6586 -413 -288 -531 -555 -961 -1104 -1074 -1313 -1061 -1656 -1678 -1753 -1997 -1929 -1641 -1625 -1875 -1835 -1475 -1621 -1424 -1187 -1376
6608 -1376 -1135 -1140 -870 -689 -695 -291 -307 -210 -59 411 394 390 836 1042 1373 1145 1316 1515 1753 1550 1715 1886 1891
6631 1891 1800 2043 1734 1606 1636 1774 1630 1512 1453 1320 1077 910 717 326 381 226 -136 -406 -384 -593 -757
6652g57r5n0k05l06j17K2j71n5M2j75p0L99l43K08p8J5O3QJ68K41J25K00K40j62
6676h53N25J07J88j71K57M69m0Q3L35J91j08L64J30o5R1L24R8N3l7k59K41n9k29
6699A635K86m08kM0k59j85j0o0m77N7l47k72k34K40k75k71k58j51j12K75n12M8
6721a252ol89j7m3l99M69m79L98j14j18K30p7K96J79J61l37M93R6L48J65j16L57
6743a55l8M76J99QJ49O6K95J76K8K24L46J39l66L16J1j82lM74l06j7r7q9j02K9
6767A581j98j59l52n0k3k39j94k57j69m7m40n3m4k36M1k33m38j32qlQk94J1KK22
6792a704j90L58l19K10j52J81J65N50j40R8J34J21K41o9M64MK95PM51J39Q7k1
6814I10L82O8L01m18K58N2K49J16r0O5j57J3K32j35J3l25J39m50k5k12O1l02l20
$$ plain form
6652 -757 -852 -902 -1107 -1413 -1530 -1508 -1679 -1734 -1692 -1867 -1937 -1538 -1881 -1673 -1751 -1736 -1673 -1665 -1497 -1256 -1131 -931 -691 -853
6676 -853 -328 -221 -33 -204 53 522 482 565 900 1091 983 1347 1477 1412 1503 1827 1925 1978 1941 1682 1923 1864 1635
6699 1635 1921 1513 1511 1551 1292 1107 1097 1037 560 617 270 -2 -236 4 -271 -542 -800 -951 -1063 -788 -1300 -1252
6721 -1252 -1258 -1647 -1664 -1707 -2106 -1637 -2116 -1718 -1832 -1950 -1720 -1797 -1501 -1322 -1161 -1498 -1005 -909 -561 -396 -512 -155
6743 -155 -193 283 482 490 639 705 1000 1176 1204 1428 1774 1913 1547 1863 1874 1692 1689 2163 1857 1840 1743 1654 1552 1581
6767 1581 1383 1224 872 822 799 560 366 109 -60 -107 -547 -600 -644 -880 -839 -1072 -1510 -1642 -1650 -1653 -1645 -1939 -1928 -1926 -1704
6792 -1704 -1894 -1536 -1855 -1645 -1797 -1616 -1451 -901 -1041 -943 -809 -688 -447 -516 -52 -48 247 254 705 844 931 910
6814 910 1292 1360 1661 1243 1501 1553 1802 1918 1828 1893 1736 1749 1981 1846 1859 1534 1673 1223 1198 986 1047 745 425
6837D25r1l90n8r7n53l6N3j96k93J08k91m40L74j08l64Q7K69n17J16O0L78j56
6859a720o2J54l1J08J65J71R6O1N12j0K15K32K89K28J10l8L62K19j65K32R3J84
6881A405L15l6L2J47K30P5k55J6j2n21L49K68l64j25j95k63j91l0j68j22k28O7
6903C94k16j19l18l93l30M7K61o79J12m43j44N6m5j4J38j30l90L38L6j15K07%
6925a747J21J90N1L05n1N62o4L13l6K98j48Q06k47L41J13J59P2pK70l9K14J35
6947A611L01j75L66r9j62J42j49k21K8j99j60mK5k68k13J07o2n47j09p4m54L1
6969b85q8k55m00l5k7p1j60k45Nj68j79L43j36P3k69J14R6J9m5Q6j82M03o4M52
6993a018J48LN83P0O2J58PK61K59J60Q8K83k2J25L35J68J99P7j61J82k57J04K58
$$ plain form
6837 425 334 -56 -114 -211 -764 -800 -747 -943 -1236 -1128 -1419 -1859 -1485 -1593 -1957 -1870 -1601 -2118 -2002 -1942 -1564 -1720
6859 -1720 -1782 -1628 -1659 -1551 -1386 -1215 -1119 -1058 -546 -556 -341 -109 180 408 518 480 842 1061 896 1128 1221 1405
6881 1405 1720 1684 1716 1863 2093 2168 1913 1929 1917 1396 1745 2013 1649 1524 1329 1066 875 845 677 555 327 394
6903 394 178 59 -259 -652 -982 -935 -674 -1353 -1241 -1684 -1828 -1772 -1817 -1831 -1693 -1823 -2213 -1875 -1839 -1954 -1747 -1747
6925 -1747 -1626 -1436 -1385 -1080 -1131 -569 -633 -320 -356 -58 -206 600 353 694 807 966 1038 1031 1301 1262 1476 1611
6947 1611 1912 1737 2103 2004 1842 1984 1835 1614 1642 1443 1283 1279 1304 1036 823 930 868 321 212 138 -316 -285
6969 -285 -373 -628 -1028 -1063 -1090 -1161 -1321 -1566 -1561 -1729 -1908 -1565 -1701 -1628 -1897 -1783 -1687 -1668 -1713 -1627 -1809 -1406 -1470 -1018
6993 -1018 -870 -867 -284 -214 -152 6 13 274 533 693 781 1064 1042 1167 1502 1670 1869 1946 1785 1967 1710 1814 2072
7016B072l66JK9n1k1p4j18j00m48K21l14k29l58k97L97n82p6j63j58K6m67j37
7038a213J28n41Q9j75K59l05j13l6lL10q2o2P0j59J51K56l04O19J4M21p1K87j41
7061f01K88J87M28l4K08M76K6j0K81k7n9J80P0Q4M01j02J38j59Q7q2k8L3k13K2
7085A594k81J3k25K0n0n67K28n72J96l63r2j06k64l05k37J04j57n52L23l35l3
7106a661K26m61J34j18l02K32k1N8K47L6O7r3J40K83J00O8K14K82K37K48k6M60
7128C50L3K5J57K94RJ99J60J29M18k0j68K31k76N62j32j68J19n56N36r5k90j60
7150A357j22o4P6m17k29k3J1o86J64k11r4l72k10q4j68j86J44l19J04k58j8j36
7172a741q8J11J7q4M1j71O6L55O2M2J04K57k5J78M2N00l3l6J34N26j89L15K08
$$ plain form
7016 2072 1706 1707 1736 1685 1664 1590 1472 1372 924 1145 831 602 244 -53 344 -238 -314 -477 -635 -609 -1076 -1213
7038 -1213 -1085 -1626 -1537 -1712 -1453 -1758 -1871 -1907 -1910 -1600 -1682 -1744 -1674 -1833 -1682 -1426 -1730 -1111 -1097 -676 -747 -460 -601
7061 -601 -313 -126 302 268 476 952 978 968 1249 1222 1163 1343 1413 1497 1898 1796 1934 1775 1862 1780 1752 1785 1572 1594
7085 1594 1313 1326 1101 1121 1071 504 732 160 356 -7 -99 -205 -469 -774 -1011 -907 -1064 -1616 -1293 -1628 -1661
7106 -1661 -1435 -1896 -1762 -1880 -2182 -1950 -1971 -1913 -1666 -1630 -1563 -1656 -1516 -1233 -1133 -1065 -851 -569 -332 -84 -110 350
7128 350 383 408 565 859 868 1067 1227 1356 1774 1754 1586 1817 1541 2103 1971 1803 1922 1366 1902 1807 1517 1357
7150 1357 1235 1171 1247 830 601 578 589 -97 67 -144 -238 -610 -820 -904 -1072 -1258 -1114 -1433 -1329 -1587 -1605 -1741
7172 -1741 -1829 -1718 -1701 -1785 -1744 -1915 -1849 -1494 -1432 -1390 -1286 -1029 -1054 -876 -834 -334 -367 -403 -269 257 68 383 591
7195E91K29P7J64N50k32r2J3M31k49J56M0L5J07oj75J70k23L60l09l08j16n8l74
7218G81k39o3L3j26m36R4o41L22m50n9l15K60m70k26K37k13q4m21L08k21j23K6
7240b026K25P3J09J07j1J81J04N8K37j13J28K81J76L26K58j3K49Q2L94K59K9J11
7262A224J11j22K30L22k14K26j65K17n7K4O0l98K50k18Np3l29J43q2m87j60K17
7284G24k62k22j13l14l4j48n87J79o14L12l44J69l95K7j1j76J01j84K13J35m91
7305b035M24k71M44rpk48O62L2r0N20Q7K6K75K14k15N70l0M31M0K56Q1L07j33
7328A331Q9K28J71k27J91r5q6J63L9j67j9J32k65l19K38m29J83k90j93J61l25
7349E11m93J00k82j17m3l13J45l24l30J3q5k03k38M7J92j57j41j27O0R2K81k21
$$ plain form
7195 591 820 897 1061 1611 1379 1287 1300 1731 1482 1638 1678 1713 1820 1814 1639 1809 1586 1946 1637 1329 1213 1155 781
7218 781 542 479 512 386 -50 44 -597 -275 -725 -784 -1099 -839 -1309 -1535 -1298 -1511 -1595 -2016 -1708 -1929 -2052 -2026
7240 -2026 -1801 -1728 -1619 -1512 -1523 -1342 -1238 -1180 -943 -1056 -928 -647 -471 -145 113 100 349 431 825 1084 1113 1224
7262 1224 1335 1213 1443 1765 1551 1777 1612 1829 1772 1796 1856 1458 1708 1490 1495 1422 1093 1236 1154 667 507 724
7284 724 462 240 127 -187 -221 -369 -956 -777 -1391 -1079 -1423 -1254 -1649 -1622 -1633 -1809 -1708 -1892 -1679 -1544 -2035
7305 -2035 -1611 -1882 -1438 -1447 -1454 -1702 -1040 -1008 -1098 -578 -491 -465 -190 24 -191 379 349 780 820 1076 1157 1464 1331
7328 1331 1420 1648 1819 1592 1783 1688 1602 1765 1804 1637 1618 1750 1485 1166 1404 975 1158 868 675 836 511
7349 511 18 118 -164 -281 -324 -637 -492 -816 -1146 -1133 -1218 -1421 -1659 -1612 -1420 -1577 -1718 -1845 -1785 -1693 -1412 -1633
7371a633K8L09n17L42L08oK98L12K5J92J66o8N18J00R8L06j34N03K8q3L57j9L74
7394A804J84l38J34j19J13P7j47J62j60j76K44o34R8r5l61Qj54k5p9n33P5l58
7416b80k40Q9l18P7k51l1j83k39J8j96j47m4L9J14r7j06K3K34m8K62j93R9L93
7439a025q7O5M24J74J27l2K3M26j35N80N6j70L93K3K18J52L20k15L4K49K40k55
7461A585L2J87j09J9k40K07l09J1j91J15j05m9l47j15k68j23m19L42l76q5m39
7482f77j16J53k36m6k49k74J94P1k22j11k41K57j47r8j28J90L5q3M53L24k10J33
7504a028J81k19N17n5J67O58m60J71K60L29K5J76k9L19K24K50j41J98lj5J29P4
7526A728k17J13J39m59L71l95J70l75J48j71l49N9k50k23p9k95j83J25Rl35o4
$$ plain form
7371 -1633 -1605 -1296 -1813 -1471 -1163 -1169 -871 -559 -534 -342 -176 -244 274 374 472 778 644 1147 1175 1092 1449 1430 1804
7394 1804 1988 1650 1784 1665 1778 1855 1708 1870 1710 1534 1778 1144 1242 1147 786 794 640 615 536 3 78 -280
7416 -280 -520 -431 -749 -672 -923 -954 -1137 -1376 -1358 -1554 -1701 -1745 -1706 -1592 -1689 -1795 -1772 -1538 -1586 -1324 -1517 -1418 -1025
7439 -1025 -1112 -1047 -623 -449 -322 -354 -331 95 -40 540 596 426 819 842 1060 1212 1532 1317 1351 1600 1840 1585
7461 1585 1617 1804 1695 1714 1474 1681 1372 1383 1192 1307 1202 1153 806 691 423 300 -119 223 -153 -238 -677
7482 -677 -793 -640 -876 -922 -1171 -1445 -1251 -1180 -1402 -1513 -1754 -1497 -1644 -1742 -1870 -1680 -1645 -1728 -1275 -951 -1161 -1028
7504 -1028 -847 -1066 -549 -604 -437 221 -239 -68 192 521 546 722 693 1012 1236 1486 1345 1543 1540 1525 1654 1728
7526 1728 1511 1624 1763 1304 1675 1280 1450 1075 1223 1052 703 762 512 289 210 -85 -268 -143 -134 -469 -533
7547e33k15J00m61k54j1J01j21l65K77l05K9J39K40k60K41J9j75O2K86P5K60J12
7569g59L1k39N21j46Q15j31j50N15r5J02J91M49r2K33j20J51L92k61j37K47KJ58
7591A677q6k69J97j98J31k29o8j04o6m9l0q8j15j26m10o9k18l81J16k48k90K0
7613i03j28j70l49M01Pk65m44M04P1k50J40m8l4n3L2L88J21o3R6J56k32M08K08
7636e07K20Q0N07m18N15m4k42N73L57q2K5L13pP3L77k63N5j00O8ml3J26l91L62
7660A560j75j34k4k43l02m5j67j28j17j33j47m6m3l53k77k4J31m72K1R3j84q4
7682a293Q5k25j60M22k22q7j11j79K27K36o3J07J72J15M4j53N32J47J80J77N3
7703Do1K30J57K39J25o9N93j37J8j95K83J96r5J35j25K3q4L34j69L1rj60j29k03
$$ plain form
7547 -533 -748 -648 -1109 -1363 -1374 -1273 -1394 -1759 -1482 -1787 -1758 -1619 -1379 -1639 -1398 -1379 -1554 -1492 -1206 -1131 -871 -759
7569 -759 -728 -967 -446 -592 223 92 -58 457 362 464 655 1104 1012 1245 1125 1276 1668 1407 1270 1517 1519 1677
7591 1677 1591 1322 1519 1321 1452 1223 1155 1051 985 936 906 818 703 577 167 98 -120 -501 -385 -633 -923 -903
7613 -903 -1031 -1201 -1550 -1149 -1142 -1407 -1851 -1447 -1376 -1626 -1486 -1534 -1568 -1621 -1589 -1201 -1080 -1143 -1047 -891 -1123 -715 -507
7636 -507 -287 -207 300 -118 397 353 111 684 1041 959 984 1297 1290 1363 1740 1477 1532 1432 1500 1496 1463 1589 1198 1560
7660 1560 1385 1251 1227 984 682 637 470 342 225 92 -55 -101 -144 -497 -774 -798 -667 -1139 -1118 -1025 -1209 -1293
7682 -1293 -1208 -1433 -1593 -1171 -1393 -1480 -1591 -1770 -1543 -1307 -1370 -1263 -1091 -976 -932 -1085 -553 -406 -226 -49 4
7703 4 -57 173 330 569 694 625 1218 1081 1099 904 1187 1383 1288 1423 1298 1321 1237 1571 1402 1433 1424 1264 1135 932
7727I32j4L2m41O7k49jk56k1j65n42L76j73m10RJ99r1n24N9j21kl07L06j24N4
7751a407Q8k17L38k14K04K05k37L10P1L5j3L42K2K07J3K87j1J16J05L41K78m5
7773H18Q0K30j3k40N95k58K98J5m44M37J3K71n44N0j49l5k7J3m50K29lk23l43
7796C20J89j76k85o0l84j57j57K61m10j01k14j3k01O3J08J46j35l20K47J83m13
7817a509L03j89J44L1j3M98j87j33L57J2J70L44J89l6K1L03L0K52J09J81oP7M0
7840I88K76M8j54l6P7L53k33j16K1O8R4Pk07l57K57j46k20J49m28K64n72j21L5
7863D7j97j8k51K55l26k46k79Q5K9l55K32l36o4K36j10J2r6l8J82L2m5l0J18K39
7887i24k2L36q8L43k05J12K80M0R5N7K84K60Q3K30m9J82J23k18L56o2k17L36j17
$$ plain form
7727 932 918 950 509 576 327 326 70 49 -116 -658 -282 -455 -865 -856 -657 -748 -1272 -1213 -1334 -1336 -1643 -1337 -1461 -1407
7751 -1407 -1319 -1536 -1198 -1412 -1208 -1003 -1240 -930 -859 -824 -837 -495 -473 -266 -253 34 23 139 244 585 863 818
7773 818 898 1128 1115 875 1470 1212 1510 1525 1081 1518 1531 1802 1258 1308 1159 1124 1097 1110 660 889 886 663 320
7796 320 509 333 48 -12 -396 -553 -710 -449 -859 -960 -1174 -1187 -1388 -1325 -1217 -1071 -1206 -1526 -1279 -1096 -1509
7817 -1509 -1206 -1395 -1251 -1220 -1233 -735 -922 -1055 -698 -686 -516 -172 17 -19 2 305 335 587 696 877 871 948 988
7840 988 1264 1312 1158 1122 1199 1552 1319 1203 1224 1292 1386 1393 1186 829 1086 940 720 869 441 705 133 12 47
7863 47 -150 -168 -419 -164 -490 -736 -1015 -930 -901 -1256 -1024 -1360 -1424 -1188 -1298 -1286 -1382 -1420 -1238 -1206 -1251 -1281 -1163 -924
7887 -924 -946 -610 -698 -355 -560 -448 -168 -128 -33 24 308 568 651 881 832 1014 1137 919 1275 1213 996 1332 1215
7910A215K52rq1j87Q0Q9m03L11m75J19l14J71j99j42l60K13j44j89m5q0k11Ol56
7933g39j11q9j65J88m29Q4k4j45K02k67J16R8J16k96K05O5J01j7J11K26k9J99
7955f00Q6J47J55K14QJ13K65N8J59j0M07n8J02m7j32O01l40j04M28J38r1k01j10
7978A188K43j41k40l5J3J4m1j45o3m92J5k61Ol7q8j42k04R8l37j10J13k81m9k93
8002a269K8m3L4p4M2j2j69K04K98l71N4L09k44N34R3Q7j8j4M22l45N22N2j92O8
8026dK92L64m13N97J28O8j07L35L01r7j40k74M49l52L72l05k01J34J5m90M85j72
8048I85k73L42l10k29j22j67k61J05m2m54m0M57o70k3l24K77l10J20j90j65P5
8069a219N8o3n8J31j64m6L70l36L60O5m9K9K51M5K39O9J08M4K30j73M8J98K77
$$ plain form
7910 1215 1467 1458 1377 1190 1270 1359 956 1267 792 911 597 768 569 427 67 280 136 -53 -98 -178 -389 -383 -739
7933 -739 -850 -939 -1104 -916 -1345 -1261 -1285 -1430 -1228 -1495 -1379 -1281 -1165 -1461 -1256 -1191 -1090 -1107 -996 -770 -799 -600
7955 -600 -514 -367 -212 2 10 123 388 446 605 595 1002 944 1046 999 867 1468 1128 1024 1452 1590 1499 1298 1188
7978 1188 1431 1290 1050 1015 1028 1042 1001 856 793 301 316 55 61 24 -64 -206 -410 -312 -649 -759 -646 -927 -976 -1269
8002 -1269 -1241 -1284 -1250 -1324 -1282 -1294 -1463 -1259 -961 -1332 -1278 -969 -1213 -679 -586 -499 -517 -531 -109 -454 68 120 -72 -4
8026 -4 288 652 239 836 964 1032 925 1260 1561 1464 1324 1050 1499 1147 1519 1214 1013 1147 1162 672 1157 985
8048 985 712 1054 744 515 393 226 -35 70 28 -426 -466 -9 -679 -702 -1026 -749 -1059 -939 -1129 -1294 -1219
8069 -1219 -1161 -1224 -1282 -1151 -1315 -1361 -991 -1327 -967 -902 -951 -922 -671 -626 -387 -318 -210 -166 64 -109 -61 137 414
8092D14J72m2L44K11j48Q1J78k07K28kj65J29P9L1k04j69J0k8J52k69L21l78j4
8115G24m44j38J96k54k72J73M3l50j72J69n28J39j71L5Q7j96k25k99J46L66n05
8136a476J56j49j0K99k71K98J50j6P3N41j73j15j85M52J20L68N4K44j11P5J89
8157E13OK42j55J88K37j00J24J12k73K40J75k3J11j63Lr7j61O3k20L15j24o80
8179C33L66l90q5Q7j79m44K00k81k14k8q8M9
$$ plain form
8092 414 586 544 888 1099 951 1032 1210 1003 1231 1229 1064 1193 1272 1303 1099 930 940 912 1064 795 1116 738 724
8115 724 280 142 338 84 -188 -15 28 -322 -494 -325 -853 -714 -885 -850 -763 -959 -1184 -1483 -1337 -971 -1476
8136 -1476 -1320 -1469 -1479 -1180 -1451 -1153 -1003 -1019 -946 -405 -578 -693 -878 -426 -306 62 116 360 249 324 513
8157 513 519 761 606 794 1031 931 1055 1167 894 1134 1309 1286 1397 1234 1237 1140 979 1042 822 1137 1013 333
8179 333 699 309 224 311 132 -312 -112 -393 -607 -635 -723 -674
8191f74
$$ Imaginary data points
##PAGE= N=2
##DATA TABLE= (X++(I..I)), XYDATA
0@%%%%%%%%%%qJ0j0J6j8K1k8L5m3N2o2P7r2J08j26J47j71J99k30K63l00L45l93
33b08M45n02N66o37P13p96Q91r95J104j225J361j506J663j838K027k234K462k713
51a422K988l292L631m012M439m923N477o116O869p767Q857j0222J1984j4358J7757
66I890k3066L2621n5348K18926K58802n3102L1954k5955J0796k5036l174k9000
78C48308j2860l3008k1130l6582k7347m0344l2150m1642l4828m2162l5461m1207
90e0413l5268l8235l2671l5165k9120l0474k4063k3956j8217j7484j1960j0253
102c57279m778k677K141M730R152J1379J5775J7811K1034K3570K6405K7883L0201
115a74653L0857L2850L3303L3961L3667L3868L3253L2761L1475L0032K8667K6279
$$ plain form
0 0 0 0 0 0 0 0 0 0 0 0 -8 2 -8 8 -10 11 -17 18 -25 27 -35 42 -50 58 -68 79 -92 107 -123 140 -160 185 -208
33 -208 237 -265 301 -336 377 -419 472 -523 581 -644 717 -789 874 -964 1063 -1171 1291 -1422
51 -1422 1566 -1726 1905 -2107 2332 -2591 2886 -3230 3639 -4128 4729 -5493 6491 -7867 9890
66 9890 -13176 19445 -35903 183023 441825 388723 420677 394722 405518 380482 377308 348308
78 348308 335448 302440 281310 244728 217381 177037 144887 103245 68417 26255 -9206 -50413
90 -50413 -85681 -123916 -156587 -191752 -220872 -251346 -275409 -299365 -317582 -335066 -347026 -357279
102 -357279 -362057 -364734 -362593 -357863 -348711 -337332 -321557 -303746 -282712 -259142 -232737 -204854 -174653
115 -174653 -143796 -110946 -77643 -43682 -10015 23853 57106 89867 121342 151374 180041 206320
127B06320K4252K1848J9704J6467J3521J0726P353M376R76k063m690q402j1065
140B99323j4297j6632j9034k1961k3541k5341k7311k8033k9785k9896l0915l0531
152B046l0483l0257k9589k8388k7305k5427k4161k1672j9625j7543j4680j1951
164b79035r171o712l459m07K040M828Q186J0850J3163J5679J8158K0140K2082
177a83658K3722K5348K6139K7646K7876K8433K8369K8587K8221K6583K6463K5206
189A38935K3191K2194J9840J7804J5810J3228J1033Q029N420L166K63k805n190
202B70918p892j0637j2400j5467j7191j9196k0870k2680k3316k4976k5757k6468
214D4068k6554k6457k6667k6153k5260k4278k3231k1848k0448j8361j6425j4392
$$ plain form
127 206320 230572 252420 272124 288591 302112 312838 320191 324567 325543 323480 318790 310388 299323
140 299323 285026 268394 249360 227399 203858 178517 151206 123173 93388 63492 32577 2046
152 2046 -28437 -58694 -88283 -116671 -143976 -169403 -193564 -215236 -234861 -252404 -267084 -279035
164 -279035 -288206 -294918 -298377 -298784 -296744 -291916 -283730 -272880 -259717 -244038 -225880 -205740 -183658
177 -183658 -159936 -134588 -108449 -80803 -52927 -24494 3875 32462 60683 87266 113729 138935
189 138935 162126 184320 204160 221964 237774 251002 262035 270064 275484 278650 278913 276108 270918
202 270918 263026 252389 239989 224522 207331 188135 167265 144585 121269 96293 70536 44068
214 44068 17514 -8943 -35610 -61763 -87023 -111301 -134532 -156380 -176828 -195189 -211614 -226006
226b26006j1746j0341p351m614k399J64L072N249P602R993J2349J4443J6745J8339
240a74501K0000K0915K3010K3433K4262K4985K4946K5161K5020K4714K3820K3000
252A08765K1798K0542J8871J7228J5539J3348J1317Q956O284M254K015m51l060
265B45406n125p862r547j2199j4220j5668j7759j9355k0595k1387k2536k3438
277E5715k3694k4172k3942k3757k3069k2693k1984k0513j9045j7889j6066j4536
289a95645j2126j0593p977o217l613j448J166L189N610P634J0176J2044J3544
302a84256J5608J7214J8385K0012K0852K2105K1861K2724K2747K3005K2559K2458
314F5274K1166K0527J9483J7744J6959J4899J3571J1528R572P024N361L003R42
$$ plain form
226 -226006 -237752 -248093 -255444 -260058 -262457 -262293 -259221 -253972 -246370 -236377 -224028 -209585 -192840 -174501
240 -174501 -154501 -133586 -110576 -87143 -62881 -37896 -12950 12211 37231 61945 85765 108765
252 108765 130563 151105 169976 187204 202743 216091 227408 236364 242648 246902 248917 248466 245406
265 245406 240281 232419 222872 210673 196453 180785 163026 143671 123076 101689 79153 55715
277 55715 32021 7849 -16093 -39850 -62919 -85612 -107596 -128109 -147154 -165043 -181109 -195645
289 -195645 -207771 -218364 -226341 -232558 -236171 -237619 -236453 -233264 -227654 -220020 -209844 -197800 -184256
302 -184256 -168648 -151434 -133049 -113037 -92185 -70080 -48219 -25495 -2748 20257 42816 65274
314 65274 86440 106967 126450 144194 161153 176052 189623 201151 210723 217747 223108 226111 227053
327B27053j560l466n886p722r703j1630j3487j5347j6605j7748j9262k0406k0281
340F3950k1471k1587k1921k2145k1526k0659k0456j9731j8235j7063j6006j3744
352a70594j2289j0911q604o941m156k756p04J630L977N911P722R689J1631J3000
366a63395J4869J6015J7208J8637J9422K0126K0679K0414K1024K0734K0590K0021
378F6344J9310J8281J7379J6160J4740J2760J2202R683P611O138M092K304j08
391B06896k007l882n816p996r538j1428j3119j3882j5885j6791j7778j8602j9172
404E1000j9990j9819k0066j9621j9546j8799j8444j7447j6226j4976j3776j2553
416a60263j0377r244p205n635l390j764N77K122M201O197P252R539J1249J2607
$$ plain form
327 227053 225493 222027 216141 208419 198716 187086 173599 158252 141647 123899 104637 84231 63950
340 63950 42479 20892 -1029 -23174 -44700 -65359 -85815 -105546 -123781 -140844 -156850 -170594
352 -170594 -182883 -193794 -202398 -209339 -213495 -216251 -216955 -215325 -211348 -205437 -197715 -188026 -176395 -163395
366 -163395 -148526 -132511 -115303 -96666 -77244 -57118 -36439 -16025 4999 25733 46323 66344
378 66344 85654 103935 121314 137474 152214 164974 177176 186859 194470 200608 204700 207004 206896
391 206896 204889 201007 195191 187195 177657 166229 153110 139228 123343 106552 88774 70172 51000
404 51000 31010 11191 -8875 -28496 -48042 -66841 -85285 -102732 -118958 -133934 -147710 -160263
416 -160263 -170640 -179884 -187089 -192724 -196114 -197878 -197301 -195179 -190978 -184781 -177529 -167990 -156741 -144134
430a44134J3646J5201J6082J7515J7694J8548J8641J9087J8756J8938J8453J8021
442F6448J7561J6066J5435J4510J2807J1763R892P966O982M771L116J483r37k164
456A85699m029n975p774r207j0772j1943j3430j4484j5862j6743j6768j7865j7937
469B2910j8284j8099j7693j7651j7215j6628j5282j4376j3736j1878j0958r444
481a58334p722o025m448k627j060O25K809M035N892P831Q927J0812J1471J3133
495a14681J4208J5073J5771J6421J6928J7238J7355J7315J7152J6945J6040J5669
507H1434J4671J3488J2556J1616J0432Q325P362N438L788K311P69j187k752m337
521A63914n838p400q874j0102j1593j2624j3744j4232j5221j5900j6228j6651
$$ plain form
430 -144134 -130488 -115287 -99205 -81690 -63996 -45448 -26807 -7720 11036 29974 48427 66448
442 66448 84009 100075 115510 130020 142827 154590 164482 172448 179430 184201 187317 188800 187863 185699
456 185699 181670 175695 167921 158714 147942 135999 122569 108085 92223 75480 58712 40847 22910
469 22910 4626 -13473 -31166 -48817 -66032 -82660 -97942 -112318 -126054 -137932 -148890 -158334
481 -158334 -166056 -172081 -176529 -179156 -180216 -179591 -176782 -172747 -166855 -159024 -150097 -139285 -127814 -114681
495 -114681 -100473 -85400 -69629 -53208 -36280 -19042 -1687 15628 32780 49725 65765 81434
507 81434 96105 109593 122149 133765 144197 152522 159884 165322 169110 171421 172190 171003 168251 163914
521 163914 158076 150676 141802 131700 120107 107483 93739 79507 64286 48386 32158 15507
533A5507j6304j6680j6251j6249j5519j4677j3641j3389j1421j0976q986q430
545a47016o301n122l573k036m99J495K876M234O069P201Q849R880J1239J1997
559a00707J3246J3685J4680J5110J5676J5654J5677J5825J5300J5261J4673J4029
571G8109J2816J2499J0833J0428Q708P367O175M787K988J912L04j622k999l920
585A48385n406p293q611r574j0470j1890j2848j3261j4022j4507j4782j5052j5052
598d383j4862j4810j4432j3768j3330j2606j1125j0583r632q085p298n622m390
611a44926k888j648j29J579K902M264N582O860P737R338J0439J1313J1913J2894
625f4770J3230J4038J4429J3790J4529J4696J3882J3769J3166J2242J1931J1361
$$ plain form
533 15507 -797 -17477 -33728 -49977 -65496 -80173 -93814 -107203 -118624 -129600 -138586 -147016
545 -147016 -153317 -158439 -162012 -164048 -164547 -163052 -160176 -155942 -149873 -142672 -133823 -123943 -112704 -100707
559 -100707 -87461 -73776 -59096 -43986 -28310 -12656 3021 18846 34146 49407 64080 78109
571 78109 90925 103424 114257 124685 133393 140760 146935 151722 154710 156622 156926 155304 152305 148385
585 148385 142979 135686 127075 117501 107031 95141 82293 69032 55010 40503 25721 10669 -4383
598 -4383 -19245 -34055 -48487 -62255 -75585 -88191 -99316 -109899 -119531 -127616 -134914 -140536 -144926
611 -144926 -147814 -149462 -149591 -148012 -145110 -140846 -135264 -128404 -120667 -111329 -100890 -89577 -77664 -64770
625 -64770 -51540 -37502 -23073 -9283 5246 19942 33824 47593 60759 73001 84932 96293
637I6293R581Q951Q032O484M969M415K593J209m99j173k711m458n454o497q146
652A13589r019r873j0623j1838j2126j2690j3606j3471j3513j3900j3366j3279
664c3715j3393j2217j1859j0979j0415r422q459p654n706m909l633k176j274M66
678a35345J673K754M167N411O535P529Q727R471J0306J0915J1840J2600J2265
691c1152J2870J3010J3077J3056J2340J2547J1818J1033J0543R821Q888P757O899
704A12507N832M705L180K142Q62o13j776k536m043n517o003p333q548r028j0103
719G3728j0969j0655j1739j2510j2304j2219j2303j2227j2285j1573j1083j0897
731f7036r616r241q525p258o221n277m111l172j623o18L79J587L098M203N011
$$ plain form
637 96293 105874 114825 122857 129341 134310 138725 141318 142527 142028 140855 138144 133686 128232 121735 113589
652 113589 104570 94697 84074 72236 60110 47420 33814 20343 6830 -7070 -20436 -33715
664 -33715 -47108 -59325 -71184 -82163 -92578 -102000 -110459 -118113 -123819 -128728 -132361 -134537 -135811 -135345
678 -135345 -133672 -130918 -126751 -121340 -114805 -107276 -98549 -89078 -78772 -67857 -56017 -43417 -31152
691 -31152 -18282 -5272 7805 20861 33201 45748 57566 68599 79142 88963 97851 105608 112507
704 112507 118339 123044 126224 128366 129228 128615 126839 124303 120260 114743 108740 101407 92859 83831 73728
719 73728 62759 52104 40365 27855 15551 3332 -8971 -21198 -33483 -45056 -56139 -67036
731 -67036 -76652 -85893 -94418 -101676 -107897 -113174 -117285 -120457 -122080 -122698 -122319 -120732 -117634 -113431 -108420
746a08420O058P332Q251Q892R518J0216J0796J1074J1512J2060J1402J1927J1489
759B2107J1480J1000J0330J0301R133Q802P249P126N681N171L875K625J325M90
773A16695n92j962l064l635n306o036o840p884q303r453r489j0289j0394j1213
787B2235j1144j1001j1344j0939j0685j0584r947r103q906p931p357o689n277
800i8672m451l686k457j350m00Q40J782L046L609N048N789O643P471Q184Q969
815e9635R406R476J0183J0571J0508J0633J0553J0726J0067J0011R060R190Q289
828F9038P584O383O314N326L823L304K215J164P7r68j862k673m254m769n171o880
844G8651p029p723q545q999r703r536j0011r892j0215j0169r809r708r159q777
$$ plain form
746 -108420 -102362 -95030 -86779 -77887 -68369 -58153 -47357 -36283 -24771 -12711 -1309 10618 22107
759 22107 33587 44587 54917 65218 74351 83153 90402 97528 103209 108380 112255 114880 116205 116695
773 116695 116103 114141 111077 107442 102136 96100 89260 81376 73073 63620 54131 43842 33448 22235
787 22235 11091 90 -11254 -22193 -32878 -43462 -53409 -62512 -71418 -79349 -86706 -93395 -98672
800 -98672 -103123 -106809 -109266 -110616 -111016 -110176 -108394 -105348 -101739 -96691 -90902 -84259 -76788 -68604 -59635
815 -59635 -50229 -40753 -30570 -19999 -9491 1142 11695 22421 32488 42499 51559 60749 69038
828 69038 76622 83005 89319 94645 98468 101772 103987 105151 105228 104260 102398 99725 95471 90702 85531 78651
844 78651 71622 63899 55354 46355 36652 27116 17105 7213 -3002 -13171 -22980 -32688 -41847 -50624
858e0624q254p922p023o053o019m557l447l196j689r47L24N53K019L031L778M756
874h5270N163O189O879P695Q122Q391R165R015R494R455R331R774R504Q807Q933
889D0647Q010Q009P532O452N819N216M203L484K684J613R08k47j099j728k650
904H8853l984m288n179o120o565o997p684q250q708q499q768r317q719r488q587
919b2300q627q186p951p466o508o440n610m818l822l262k543j254o75M7J182J798
935h6435K581L634M456N110N359O596O955P275P792Q020Q620Q242Q627Q768Q398
950A3998Q290Q007P989P254O905O078O231N101M606L336K959K520R52R13n64r02
966H3673k372k557l191m436m698n554n887o937o751p326q046p537q054q435q035
$$ plain form
858 -50624 -58878 -66800 -73823 -79876 -85895 -90452 -93899 -97095 -98784 -99731 -99407 -98854 -96835 -93804 -90026 -85270
874 -85270 -80107 -73918 -67039 -59344 -51222 -42831 -33666 -24651 -15157 -5702 3629 13403 22907 31714 40647
889 40647 48657 56666 64198 70650 76469 81685 85888 89372 92056 93669 94577 94330 93231 91503 88853
904 88853 84869 80581 75402 69282 62717 55720 48036 39786 31078 22579 13811 4494 -4225 -13713 -22300
919 -22300 -30927 -39113 -47064 -54530 -61038 -67478 -73088 -77906 -81728 -84990 -87533 -88787 -89462 -89415 -88233 -86435
935 -86435 -83854 -80220 -75764 -70654 -65295 -58699 -51744 -44469 -36677 -28657 -20037 -11795 -3168 5600 13998
950 13998 22288 30295 38284 45538 52443 58521 64752 69853 74459 77795 80754 83274 84226 85139 84575 83673
966 83673 81301 78744 75553 71117 66419 60865 54978 48041 41290 33964 25918 18381 10327 1892 -6143
981f143q009q031p687p098p068o289o018n582m526m089l504k743k164r14j70K85
997g9750Q31J764K845L112M231M564N301N729O407O440O917P466P449P713P549
1012a432Q038P432P153P366O873O573O274N501N084M543L401L670K397J703J107
1027G5683N14q46j051j744k354l296l903m548n081n389n972n901o963p019o910
1042A5220p405p279p285p291p118o746o190o275n723n339m522m203l709k934k165
1057f8964j716j081k53N10J106J950K569L116L700M109M974N564N251O073O121
1072b6971P081O372P185O742O350O864O603O716O044N486N559M992M321L752L565
1087F0661K707J871J635P27L64n25j138j887k196l107l278m338m492n039n425
$$ plain form
981 -6143 -14152 -22183 -29870 -36968 -44036 -50325 -56343 -61925 -66451 -70540 -74044 -76787 -78951 -79865 -80035 -79750
997 -79750 -78919 -77155 -74310 -71198 -66967 -62403 -57102 -51373 -44966 -38526 -31609 -24143 -16694 -8981 -1432
1012 -1432 6606 14038 21191 28557 35430 42003 48277 53778 58862 63405 66806 70476 72873 74576 75683
1027 75683 76197 75351 74300 72556 70202 66906 63003 58455 53374 47985 42013 36112 29149 22130 15220
1042 15220 7815 536 -6749 -14040 -21158 -27904 -34094 -40369 -46092 -51431 -55953 -60156 -63865 -66799 -68964
1057 -68964 -70680 -71761 -72014 -71504 -70398 -68448 -65879 -62763 -59063 -54954 -49980 -44416 -39165 -33092 -26971
1072 -26971 -19890 -13518 -6333 409 6759 13623 20226 26942 32986 38472 44031 49023 53344 57096 60661
1087 60661 63368 65239 66874 67601 67965 67440 66302 64415 62219 59112 55834 51496 47004 41965 36540
1102C6540n629n980o231o339o441o393o504o338o142n952n746n525n171n030l838
1117e0719l549l184k380k063j298j036N5N98R60J956K359K704L398M171M019M510
1133c9499N377N352N811O112N599O192O062O330N623O253N373N654M892M815M287
1148D4233M167L117K916K443J979R27M79J75o97j043j790k070k988l000l898l975
1164D0975m599m727n373n243n827n482n953n893n342n549n604n376n059m724m397
1179c8173m299l409l001k768k013j630j051m51L9J34J589J426K504K887L056L319
1195d1841M056M379M320M988N226M965N344N536N308N388N572N070M732M712M314
1210C2069M346L718L057K999K698J889J396Q10M48l8m05j458j679j557k734k961
$$ plain form
1102 36540 30911 24931 18700 12361 5920 -473 -6977 -13315 -19457 -25409 -31155 -36680 -41851 -46881 -50719
1117 -50719 -54268 -57452 -59832 -61895 -63193 -64229 -64174 -63576 -62616 -60660 -58301 -55597 -52199 -48028 -44009 -39499
1133 -39499 -34122 -28770 -22959 -16847 -11248 -5056 1006 7336 12959 19212 24585 30239 35131 39946 44233
1148 44233 48400 51517 54433 56876 58855 59782 60261 60436 59739 58696 56906 54836 51848 48848 44950 40975
1164 40975 36376 31649 26276 21033 15206 9724 3771 -2122 -7464 -13013 -18617 -23993 -29052 -33776 -38173
1179 -38173 -42472 -45881 -48882 -51650 -53663 -55293 -56344 -56795 -56756 -56622 -55033 -53607 -51103 -48216 -45160 -41841
1195 -41841 -37785 -33406 -29086 -24098 -18872 -13907 -8563 -3027 2281 7669 13241 18311 23043 27755 32069
1210 32069 36415 40133 43190 46189 48887 50776 52172 52982 53430 53392 52987 51529 49850 48293 45559 42598
1226D2598l632l512m354m187m233n246m611n206m986n222m668n012n069m596m831
1241b6767l861l828l225l142k864k005k072j465p29l51N8N31J266J369K102K429
1257d2554K951K960L715L614L938M643M393M845M669M690M895M879M674M401M392
1272B1105M251L581L920L008K815K890J717J846J215P35N69o08n62j205j192k009
1288D2076k639k492l023l335l699l976m069m234m268m508m551m571m610m215m419
1303a6533l876m029l467l192l155k529k458j776j464q02p21p14M53O71J259J173
1319d1160J830K113K552L033L078L503L637L964L874M176L957M429M081M379L850
1334A1296M045L842L367L606K837K961K594K046J948J222J216R0P94k08j104m41
$$ plain form
1226 42598 38966 35454 31100 26913 22680 17434 12823 7617 2631 -2591 -7259 -12271 -17340 -21936 -26767
1241 -26767 -30628 -34456 -37681 -40823 -43687 -45692 -47764 -49229 -49958 -50309 -50251 -49720 -48454 -47085 -44983 -42554
1257 -42554 -39603 -36643 -32928 -29314 -25376 -20733 -16340 -11495 -6826 -2136 2759 7638 12312 16713 21105
1272 21105 25356 28937 32857 35865 38680 41570 43287 45133 46348 47083 47652 47044 46482 45277 44085 42076
1288 42076 39437 36945 33922 30587 26888 22912 18843 14609 10341 5833 1282 -3289 -7899 -12114 -16533
1303 -16533 -20409 -24438 -27905 -31097 -34252 -36781 -39239 -41015 -42479 -43281 -44002 -44716 -44263 -43592 -42333 -41160
1319 -41160 -39330 -37217 -34665 -31632 -28554 -25051 -21414 -17450 -13576 -9400 -5443 -1014 3067 7446 11296
1334 11296 15341 19183 22550 26156 28993 31954 34548 36594 38542 39764 40980 41070 41864 41656 40552 40111
1350D0111j448k025j942k498k713k898l171l409l541m147l369m288l821l949l701
1365f809m134l713l375l450l307k861k598k294j935j560j551o03o50j77K92M00
1381c8325R69J318J544K132K443K201L108L080L493L243L484L509L606L951L621
1396C377L441M050L342L135L173K865K453K788K098J908J511Q10J040Q39k3k45
1412C6562o28j100r82j901j575k034k493l173k588l370k801l357l398l515l601
1427D6l363l493l603k947l195l012k754k216k626j778j553j380j249q32k78n4
1443c4287M66K66R54J216J604J717K055K174K701K564L192K792L017L526K868
1458c175L547K846L403L151K943K926K741K279K433K249J870J405J554N31Q35
$$ plain form
1350 40111 38663 36638 34696 32198 29485 26587 23416 20007 16466 12319 8950 4662 841 -3108 -6809
1365 -6809 -10943 -14656 -18031 -21481 -24788 -27649 -30247 -32541 -34476 -36036 -37587 -38190 -38840 -39017 -38725 -38325
1381 -38325 -37356 -36038 -34494 -32362 -29919 -27718 -24610 -21530 -18037 -14794 -11310 -7801 -4195 -244 3377
1396 3377 6818 10868 14210 17345 20518 23383 25836 28624 30722 32630 34141 34951 35991 36830 36807 36562
1412 36562 35934 34834 33852 31951 30376 28342 25849 22676 20088 16718 13917 10560 7162 3647 46
1427 46 -3317 -6810 -10413 -13360 -16555 -19567 -22321 -24537 -27163 -28941 -30494 -31874 -33123 -33955 -34233 -34287
1443 -34287 -33821 -33555 -32601 -31385 -29781 -28064 -26009 -23835 -21134 -18570 -15378 -12586 -9569 -6043 -3175
1458 -3175 372 3218 6621 9772 12715 15641 18382 20661 23094 25343 27213 28618 30172 30703 31538
1473C1538L95K67n28l49q17j382j389j385k123k404k015k925k330k953k999k871
1489E730k833l092l251k900k997k903k574k408k349k476j864j458j490j205p23
1504b8793o33n63J52K43O30O50J108J007J869J609K017K239K547K675K508K765
1520g970K710L105K658K949K588K765K491K495K295K254K159K055J283J236J503
1535B6576P97M71k8K32k34k91q68r75j433j513j482j855k367k270k404k092k668
1552G596k509l082k499k538k830k467k416k203k330k372j559j607j738j212q80
1567b4646q27m93k47J46J75M56Q19J084P69J628J485J817J915K233K146K287K582
1584f671K225K512K582K685J956K528K646K037J707K111J873J292J514J446N15
$$ plain form
1473 31538 31933 32200 31672 31323 30506 29124 27735 26350 24227 21823 19808 16883 14553 11600 8601 5730
1489 5730 2897 -195 -3446 -6346 -9343 -12246 -14820 -17228 -19577 -22053 -23917 -25375 -26865 -28070 -28793
1504 -28793 -29426 -29989 -29837 -29594 -28964 -28314 -27206 -26199 -24330 -22721 -20704 -18465 -15918 -13243 -10735 -7970
1520 -7970 -5260 -2155 503 3452 6040 8805 11296 13791 16086 18340 20499 22554 23837 25073 26576
1535 26576 27373 27844 27816 28048 27814 27523 26655 25680 24247 22734 21252 19397 17030 14760 12356 10264 7596
1552 7596 5087 2005 -494 -3032 -5862 -8329 -10745 -12948 -15278 -17650 -19209 -20816 -22554 -23766 -24646
1567 -24646 -25473 -25966 -26213 -26067 -25892 -25436 -24617 -23533 -22764 -21136 -19651 -17834 -15919 -13686 -11540 -9253 -6671
1584 -6671 -4446 -1934 648 3333 5289 7817 10463 12500 14207 16318 18191 19483 20997 22443 22958
1599B2958P03O77L26M6l02o97l50j031j184j331j617j540j869j816k315k086k284
1616F288k282k348k188k209k305k302k107k100k168j817j225j676j375o41j159
1631b1614l51n47m63J79K56K35O59R02J123J083J690J255J790J753K104K043K065
1648e838K432J914J893K443J768K419J947K012J634J557J657J486J181R02Q22
1663B0229P04K51L44j90k23m01m08p22r06j434j333j236j579k247j628j583k088
1680E550k221j864k333j846j911k050j703j940j290j835j587j001j128p39j002
1695a8900n02n29l43Q9j40J178L08O09R63J366R21J692J534J262J927J478J838
1712e249J967K067J888J560K169J365J948J883J634J653R72J284J318M99P78K81
$$ plain form
1599 22958 23661 24338 24664 24710 24408 23711 23361 22330 21146 19815 18198 16658 14789 12973 10658 8572 6288
1616 6288 4006 1658 -530 -2739 -5044 -7346 -9453 -11553 -13721 -15538 -16763 -18439 -19814 -20455 -21614
1631 -21614 -21965 -22512 -22975 -22796 -22540 -22305 -21646 -20744 -19621 -18538 -16848 -15593 -13803 -12050 -9946 -7903 -5838
1648 -5838 -3406 -1492 401 2844 4612 7031 8978 10990 12624 14181 15838 17324 18505 19407 20229
1663 20229 20933 21184 21528 21338 21115 20714 20306 19584 18678 17244 15911 14675 13096 10849 9221 7638 5550
1680 5550 3329 1465 -868 -2714 -4625 -6675 -8378 -10318 -11608 -13443 -15030 -16031 -17159 -17898 -18900
1695 -18900 -19402 -19931 -20274 -20185 -20325 -19147 -18839 -18230 -17267 -15901 -14980 -13288 -11754 -10492 -8565 -7087 -5249
1712 -5249 -3282 -1215 673 2233 4402 5767 7715 9598 11232 12885 13857 15141 16459 16958 17736 18017
1728A8017P39m4J20k00l60n80o24q66q70j277j232j713j295j699j846j220k055
1745B995j791j761j889j898j418j494j910j104j429j138j155q99j075n43m95l30
1761a7334l03M33K2J03M67R10P42O48J241J266J402J063J689J688J650J549J715
1778a049J480J846J556J139J913J536J177J789N71J200J118M13P26L37L05N11
1794A6568l96J46k82o06p50n72j057r58j048j059j485j112j667j632j544j504
1810A042j493j537j600j272j687j152j363j015j140p86r85r41k90o04k33k21P8
1827a5199R5M56J51O08P59P01Q54J500J306J019J054J046J412J698J376J244J753
1844A833J199J340J602R86J231J116J096R60O63O79K64O89M31q9J62j61l1p34
$$ plain form
1728 18017 18756 18712 18832 18632 18272 17692 17068 16202 15332 14055 12823 11110 9815 8116 6270 5050 2995
1745 2995 1204 -557 -2446 -4344 -5762 -7256 -9166 -10270 -11699 -12837 -13992 -14891 -15966 -16509 -17004 -17334
1761 -17334 -17637 -17204 -17182 -17079 -16612 -15702 -14960 -14312 -13071 -11805 -10403 -9340 -7651 -5963 -4313 -2764 -1049
1778 -1049 431 2277 3833 4972 6885 8421 9598 11387 11958 13158 14276 14689 15415 15752 16057 16568
1794 16568 16172 16318 16036 15430 14680 14108 13051 12093 11045 9986 8501 7389 5722 4090 2546 1042
1810 1042 -451 -1988 -3588 -4860 -6547 -7699 -9062 -10077 -11217 -12003 -12988 -13929 -14219 -14823 -15056 -15277 -15199
1827 -15199 -15104 -14648 -14497 -13889 -13130 -12429 -11575 -10075 -8769 -7750 -6696 -5650 -4238 -2540 -1164 80 1833
1844 1833 3032 4372 5974 6960 8191 9307 10403 11363 12026 12705 12969 13658 14089 14000 14162 14001 13970 13236
1862A3236m88n26q47q80p80j154j095j335j171j393j116j211j556j359j249j034
1878c958j544r65j174r16j239o70n44q22m34n09k18l60L39L55k05N51O01M72O45
1897a0595J026O98Q33J337J064J086J119J201J120J256Q81J568J010J402P87J037
1913F830J166J034N35O86N91N00O75j72P6Q1k86K08m01o21l54p57q85n43q24j188
1933F351p70j231j171j099q38j236j003j130j119j011j317p80q99p49r18m84n73
1950i977l18m87m5k97O3K09%M45J75M32P98M18R22N18J138J012Q36J127R90R86
1970a055J093J094R41R93R14R78N47J107L04R36N00O56M80J47J58M08j70l13K09
1989I927K2n20n21m79p11n14p46r26q61p66j071q34j214p63p40r72r18r09q46
$$ plain form
1862 13236 12748 12222 11375 10495 9715 8561 7466 6131 4960 3567 2451 1240 -316 -1675 -2924 -3958
1878 -3958 -5502 -6467 -7641 -8557 -9796 -10466 -11010 -11832 -12266 -12775 -12993 -13353 -13014 -12659 -12864 -12313 -11712 -11240 -10595
1897 -10595 -9569 -8871 -8038 -6701 -5637 -4551 -3432 -2231 -1111 145 1026 2594 3604 5006 5793 6830
1913 6830 7996 9030 9565 10251 10842 11342 12017 11845 11921 12002 11716 11924 11523 10902 10548 9791 8906 8363 7539 6351
1933 6351 5581 4350 3179 2080 1242 6 -997 -2127 -3246 -4257 -5574 -6354 -7253 -8002 -8920 -9404 -9977
1950 -9977 -10295 -10782 -10827 -11124 -11061 -10852 -10852 -10407 -10232 -9800 -9002 -8584 -7662 -7144 -6006 -4994 -4158 -3031 -2041 -1055
1970 -1055 38 1132 2073 3066 3980 4958 5505 6612 6916 7852 8352 9008 9488 9635 9793 10201 10031 9718 9927
1989 9927 9949 9429 8908 8429 7718 7204 6458 5532 4671 3905 2834 2000 786 23 -717 -1689 -2607 -3516 -4362
2008d362q73n52r17m36p11m63m22m49m7j54O2q8N47J39M79P6L15R10O66J38Q92
2029e250Q02Q12P92R00J053P91J188M61P55R88O80R25M64N74P72L97L64N64J5
2048H047O0K10K17n9l14k07j65m87l71n13n07n83m53r38p03m22j141q49o65r10
2068g53m61p18j011o12q39m52n71m94m50m70k67j99k44J69l37J28l1K68M88K20
2088f636K71O8P45N95O51M95P54N47P35R03O44N17O88R42M53P03N72M82N81O07
2108E317L19M61K77J30J13L39j5j61o8j42p4p35O2n55k23o83k29p81m11p05o27
2129A609m79q62l92q19q47m24l64n85o68l04k99l43l98n01j75j64L17n34J45k77
2149f364P36%J31L90L49J11M48N44P07N12L93M51O12M85M87P07O71L99M31O08
$$ plain form
2008 -4362 -5235 -5787 -6704 -7140 -7851 -8314 -8736 -9185 -9232 -9386 -9324 -9412 -8865 -8726 -8247 -8171 -7856 -6946 -6280 -6142 -5250
2029 -5250 -4448 -3636 -2844 -1944 -891 -100 1088 1549 2304 3292 3972 4897 5361 5935 6707 7104 7468 8032 8047
2048 8047 8107 8317 8534 8475 8161 7954 7789 7302 6931 6418 5911 5328 4875 3937 3234 2812 1671 822 157 -753
2068 -753 -1214 -1932 -2943 -3555 -4394 -4846 -5417 -5911 -6361 -6831 -7098 -7297 -7541 -7372 -7709 -7581 -7612 -7344 -6856 -6636
2088 -6636 -6365 -6297 -5552 -4957 -4306 -3811 -3057 -2510 -1775 -872 -228 289 977 1919 2372 3075 3647 4129 4710 5317
2108 5317 5636 6097 6374 6504 6617 6956 6941 6780 6712 6570 6496 5761 5823 5268 5045 4362 4133 3352 2941 2236 1609
2129 1609 1130 268 -124 -943 -1790 -2214 -2578 -3163 -3831 -4135 -4434 -4777 -5175 -5676 -5851 -6015 -5698 -6232 -6087 -6364
2149 -6364 -5628 -5628 -5497 -5107 -4758 -4647 -4199 -3655 -2948 -2436 -2043 -1592 -980 -495 -8 699 1370 1769 2200 2808
2169B808N05K70J06M49M85L98L16K32q7j27J42m12l0k2l10Q5l38j96k78p54n35
2190B707n93k78k91n31n73o16j37p56k23n62m05n57k17jp23m0n52P5k43k85J09
2211d692Q1j10J98p4K50K91K35N66K83j20K60O67J04M61R17J12J82O44O16n3N18
2232A336M36M43J80O9N52L03L76j15j1k6M49q2K46k28k70N7k73j68j20m12K03
2253B945o52j88m78k21j60m46m88q8n01k94n69K4m78l92j39j97j82j30k8l76j40
2274c178mL6n0j40J64k0J67L26M0K13J51J48L15K43K87M51q3L13M30N05j01M10
2296F23nN41J62KL68L69Q4L7M52N1k67K05r7k71L90M6l75l1l0j25k57n8j75j15
2320A524ro08j57q0j38j81q1p28Qm8m42K00j83l46n35j8J68k49j03L50k29l7l99
$$ plain form
2169 2808 3313 3583 3689 4138 4623 5021 5337 5569 5482 5355 5497 5085 5055 5033 4723 4808 4470 4274 3996 3242 2707
2190 2707 2114 1836 1545 1014 441 -175 -312 -1068 -1291 -1853 -2258 -2815 -3032 -3033 -3756 -3796 -4348 -4273 -4516 -4801 -4692
2211 -4692 -4611 -4721 -4523 -4597 -4347 -4056 -3821 -3255 -2972 -3092 -2832 -2165 -2061 -1600 -683 -571 -389 255 871 818 1336
2232 1336 1772 2215 2395 2464 3016 3319 3695 3580 3569 3543 3992 3910 4156 3928 3658 3715 3442 3274 3154 2742 2945
2253 2945 2293 2105 1627 1406 1246 800 312 224 -277 -571 -1140 -1116 -1594 -1986 -2125 -2322 -2504 -2634 -2662 -3038 -3178
2274 -3178 -3182 -3146 -3196 -3336 -3172 -3192 -3025 -2699 -2659 -2446 -2295 -2147 -1832 -1589 -1302 -851 -934 -621 -191 314 213 623
2296 623 618 1159 1321 1323 1691 2060 2144 2181 2633 2684 2417 2622 2525 2254 2644 2690 2315 2284 2254 2129 1872 1814 1639 1524
2320 1524 1515 907 750 670 532 351 270 -458 -450 -498 -940 -740 -923 -1269 -1804 -1822 -1654 -1903 -2006 -1656 -1885 -1922 -2321
2343b321M91k36k1k78L19K04j9J54o9O23j1Q4J36J32M63k5jK96K54o5K90%Q4L76
2367H60q6M19k39L56P1K99k71L96j91j66K63j53J8J98p6j75L65p65J35M4j88r2
2389A022l19N07m72j56k44k03O4j42R5l01p7k30l37J09o1l02L35m35j15j16J77
2410a201j65J82j91k87L31j54o0Q2P0j17K14L49k24n7J1N78j94K60O3J66J21M9
2432a74K3K04L7L82J3L70q5j1M9J49J96L8J00JQK46o6j93K40J17l59J21L00m59
2456A247J58j99K53k85j54j42k37J36j52J11l99r3l96J95j91k30j24l83QP8j76
2477i75j64m24L13j15l71J03R2m50M3L11j56j59L6O8K00K13j40J46N9K68J23M2
2499i37K99M51l44K06O10k07J89L06J17N40p0oK25N7L83L2L58j45P6J22l9O4m5
$$ plain form
2343 -2321 -1830 -2066 -2087 -2365 -2046 -1842 -1861 -1707 -1776 -1153 -1164 -1080 -944 -812 -349 -374 -375 -79 175 110 400 400 484 860
2367 860 774 1193 954 1310 1381 1680 1409 1805 1614 1448 1711 1558 1576 1774 1698 1523 1888 1123 1258 1302 1114 1022
2389 1022 703 1210 738 582 338 135 199 57 152 -149 -226 -456 -793 -684 -745 -1047 -712 -1147 -1262 -1378 -1201
2410 -1201 -1366 -1184 -1375 -1662 -1331 -1485 -1545 -1463 -1393 -1510 -1296 -947 -1171 -1228 -1217 -639 -833 -573 -510 -344 -223 -174
2432 -174 -151 53 90 472 485 855 770 759 808 957 1153 1191 1291 1292 1300 1546 1480 1287 1527 1644 1285 1406 1706 1247
2456 1247 1405 1206 1459 1174 1020 878 641 777 625 736 337 244 -152 43 -148 -378 -502 -885 -877 -799 -975
2477 -975 -1139 -1563 -1250 -1365 -1736 -1633 -1541 -1991 -1948 -1637 -1793 -1952 -1916 -1848 -1648 -1435 -1575 -1429 -1370 -1102 -979 -937
2499 -937 -638 -187 -531 -325 285 78 267 573 690 1230 1160 1154 1379 1436 1819 1851 2209 2064 2140 2262 2223 2287 2242
2522B242K07l01j90K75k41j13k78k9k07j81k65j11m98r4k31m4k85k10k83j21l74
2543a332J92m91j87m60K98m56n8k2Q7k9l35K2P0K18J16j42M73k32Q8N70q0J96
2565a494M39j86N41M48J06P21j41L99K58M93j55L91L27L05o0K29j8M87k32o7J22
2586B913L37k41J6J04N2k56j04n09M4m02k73k73l5k28o15o9m19m56l04l27k84
2607a329o98J85j79m13j80l92j02l08K3m5n05N14k40K62J12L2K00L5J00Q9N76
2628b263K23J62L32O29k2M53M02J94O08R8M66M79K97K78K50K13K14K55K16J57
2648C641N0L57m16K81k0k11J62k97j2n15j57k21k38k50l07o42l81l5p13o6n21
2669e11o75lm32n37k10k30n17m60k08P8k39k49j42m1n1K43K82k77K11L81K48j83
$$ plain form
2522 2242 2449 2148 1958 2233 1992 1879 1601 1572 1365 1184 919 808 310 216 -15 -59 -344 -554 -837 -958 -1332
2543 -1332 -1140 -1631 -1818 -2278 -1980 -2436 -2494 -2516 -2429 -2458 -2793 -2771 -2701 -2483 -2367 -2509 -2036 -2268 -2180 -1610 -1690 -1494
2565 -1494 -1055 -1241 -700 -252 -146 575 434 833 1091 1584 1429 1820 2147 2452 2392 2621 2603 3090 2858 2791 2913
2586 2913 3250 3009 3025 3129 3181 2925 2821 2312 2356 1954 1681 1408 1373 1145 530 461 42 -414 -718 -1045 -1329
2607 -1329 -2027 -1842 -2021 -2434 -2614 -3006 -3108 -3416 -3393 -3438 -3943 -3429 -3669 -3407 -3295 -3263 -3063 -3028 -2928 -2839 -2263
2628 -2263 -2040 -1878 -1546 -917 -939 -486 -84 110 718 816 1282 1761 2058 2336 2586 2799 3013 3268 3484 3641
2648 3641 3691 4048 3632 3913 3893 3682 3844 3547 3535 3020 2863 2642 2404 2154 1847 1205 824 789 76 10 -511
2669 -511 -1186 -1189 -1621 -2158 -2368 -2598 -3115 -3575 -3783 -3705 -3944 -4193 -4335 -4376 -4427 -4184 -3902 -4179 -3968 -3587 -3339 -3522
2691c522N19N24K96J47N46J60R52J30K78O45J59O65K88P55kM04K90L26L65L63
2711D288k6L9K23l41M91j7K6l31j53J32o94O2m76l21j27o64n41m44l18l65m24
2732A9o08m91l46l62n74k88p29j72n10l6J9n44K61o24K96j75m37O48L00j64J13
2753d404K35N69j23N94M25M38K98N91M09N06M05O14M89P88K80K73N67L14L14K66
2773C848N98r5K15M38o1l0M3P8J36l23M2m59J4m03n20l53m89n00m25m69l73l65
2795E47o76k90n14o98k22q91l62k00l14o76l27K9m90j54J88l69J16J3j16L07M90
2816d609nK36N6O03L67N08N72L79K22M60N34O00Q40K81P85M39L49N47N97M44o5
2837D140K71N83K57R0j8K87N1m9j65J5k14j99n80k29j51o30l88o11j69o88l18
$$ plain form
2691 -3522 -3003 -2479 -2183 -2036 -1490 -1330 -378 -248 30 675 834 1499 1787 2542 2540 2944 3234 3560 3925 4288
2711 4288 4262 4301 4524 4183 4674 4657 4683 4352 4199 4331 3637 3699 3223 2902 2775 2111 1570 1126 808 443 19
2732 19 -589 -1080 -1426 -1788 -2362 -2650 -3379 -3551 -4061 -4097 -4078 -4622 -4361 -4985 -4689 -4864 -5301 -4653 -4353 -4517 -4404
2753 -4404 -4169 -3600 -3723 -3129 -2704 -2266 -1968 -1377 -968 -462 -57 557 1046 1834 2114 2387 2954 3268 3582 3848
2773 3848 4446 4351 4566 5004 4943 4913 4956 5034 5170 4847 4889 4430 4444 4041 3521 3168 2679 2179 1754 1285 912 547
2795 547 -129 -419 -933 -1631 -1853 -2744 -3106 -3306 -3620 -4296 -4623 -4594 -5084 -5238 -5050 -5419 -5303 -5290 -5406 -5099 -4609
2816 -4609 -4614 -4378 -4322 -3719 -3352 -2844 -2272 -1893 -1671 -1211 -677 -77 763 1044 1829 2268 2617 3164 3761 4205 4140
2837 4140 4411 4994 5251 5341 5323 5610 5661 5612 5447 5462 5248 5049 4469 4240 4089 3459 3071 2460 2291 1603 1285
2858A285q49p52l57l37p30o98o25m16j27o18m66r1l56l57j40r0Q6j57R4j84J17
2879e768O93%J64O48L31K29K72P23N00N96M70N16O75P75P19K25K95R51M08K34
2899C656O20O44O3J52J50O27p2M03j28j69K9j54n80%k44k93o86m45j58q87l33
2920B195n36p68p40q4p19m57p92q35m63m92k75p07k67m23j94k92j75k19K17q5
2940f111k44L38K59J55K21K57M02K20P93J55Q68L70O63O71O14M06R14N21O17O55
2960B744l4J112K78L67K90P96j54K26K53M07J34J8j77J1m37K0l95l54k77o06k60
2981C962m07r09k78p48o17o14r18l12p23n44l03n11n42q24l68o13k23Op98oo8
3002f358P2j1P8P9J17L40K23K59N54L08M16P59N08N71K94R74M09Q67L96O84O05
$$ plain form
2858 1285 436 -316 -673 -1010 -1740 -2438 -3063 -3479 -3606 -4224 -4690 -4781 -5137 -5494 -5634 -5724 -5638 -5795 -5701 -5885 -5768
2879 -5768 -5075 -5075 -4911 -4263 -3932 -3703 -3431 -2708 -2208 -1612 -1142 -626 49 824 1543 1768 2063 3014 3422 3656
2899 3656 4276 4920 4983 5135 5285 5912 5840 6243 6115 5946 5975 5821 5241 5241 4997 4704 4018 3573 3415 2528 2195
2920 2195 1659 891 151 67 -652 -1109 -1901 -2736 -3199 -3691 -3966 -4673 -4940 -5363 -5557 -5849 -6024 -6243 -6026 -6111
2940 -6111 -6355 -6017 -5758 -5603 -5382 -5125 -4723 -4503 -3710 -3555 -2687 -2317 -1654 -983 -369 37 951 1472 2089 2744
2960 2744 2710 3822 4100 4467 4757 5553 5399 5625 5878 6285 6419 6437 6260 6271 5834 5854 5459 5105 4828 4222 3962
2981 3962 3555 2646 2368 1620 1003 389 -529 -841 -1564 -2108 -2411 -2922 -3464 -4288 -4656 -5269 -5492 -5486 -6284 -6290 -6358
3002 -6358 -6286 -6297 -6219 -6140 -6023 -5683 -5460 -5201 -4647 -4339 -3923 -3164 -2656 -2085 -1791 -817 -408 459 855 1539 2144
3023B144N47Q01M31J51R75K43K22P05K2RK18k10K67j46k8m01J11l77m88m70j56
3044D570p76j86q20m92q64n07p90n97m15n88o02q98l38q69k91m91m72m8o75l2
3064f181k90j10K89j60o9K66J36J93K16N26L29M56N04K04Q77O57R88J45N35N16
3084B7J010M03P53O70M74N47P67K96K29N17J54O42K2O6k15Q0J29j03l72k02m6
3105E848n70n02l30o09l96o96r8j264l10q72m90n72r55l36p17k98q58n05n22m86
3125e538m3m98P5m69J04r4m04K85K48K65j1M92L52J82N80N95O42L93Q76P04M37
3146h27Q39K69Q16Q45N42L94O67P26N1O78N31L17J16K34K13Q4M24l20j31l17J48
3167F299l10l01l46n87l68p78j13p03o44q45m40p01o52p05k78j079o36j07p11
$$ plain form
3023 2144 2691 3492 3923 4074 5049 5292 5514 6219 6241 6250 6468 6258 6525 6379 6351 5950 6061 5684 5196 4726 4570
3044 4570 3794 3608 2788 2296 1432 925 135 -462 -877 -1465 -2067 -2965 -3303 -4172 -4463 -4954 -5426 -5474 -6149 -6181
3064 -6181 -6471 -6581 -6292 -6452 -6521 -6255 -6119 -5926 -5710 -5184 -4855 -4399 -3895 -3691 -2814 -2157 -1169 -1024 -489 27
3084 27 1037 1440 2193 2863 3337 3884 4651 4947 5176 5693 5847 6489 6511 6577 6362 6442 6571 6468 6096 5894 5848
3105 5848 5278 4776 4446 3837 3441 2745 2647 1383 1073 201 -289 -861 -1816 -2152 -2869 -3167 -4025 -4530 -5052 -5538
3125 -5538 -5581 -6079 -6004 -6473 -6369 -6463 -6867 -6582 -6334 -6069 -6080 -5588 -5236 -5054 -4474 -3879 -3237 -2844 -1968 -1264 -827
3146 -827 12 281 1097 1942 2484 2878 3545 4271 4322 5000 5531 5848 5964 6198 6411 6495 6919 6599 6468 6151 6299
3167 6299 5989 5688 5342 4755 4387 3609 3496 2793 2149 1304 864 163 -489 -1194 -1472 -2551 -3187 -3294 -4005
3186d005n97m36l90o22mj62q3k93j13J86M6J18M96j67J91O76K45M90N30O56M10
3207b828P86O56N95Q07N86N60O97M43J069K58P43K41M55M86M49PN6L27KJ44k3
3228F516j28j07j86k39l98j41m80n80k82r58n09p8j045m06j041o04o97n85k86
3247b234o79n81n89p41j12n32k62k83k56j40N7j13j99J00L78J89M66m4N70L70
3267d635K45P46N54O00O64R24J78M48J014N15P95N91M00P11M83M16M77L4P95j44
3287E811L45J97J9k0p7K31l58k07o46O5k95p47m04j88n90r58l30n64p46n01p20
3308f83o05n94o03m05p64o23l91k32n29j44j23o99j55o9N74n38R5P83o6N8N45
3329e168O0M13P66P33L55L94M74P52O59N10O97M00Q51P45N20K68M94M97K43O16
$$ plain form
3186 -4005 -4602 -5038 -5428 -6050 -6054 -6216 -6299 -6592 -6705 -6519 -6473 -6355 -5859 -6026 -5835 -5159 -4914 -4424 -3894 -3238 -2828
3207 -2828 -2042 -1386 -791 16 602 1162 1859 2302 3371 3629 4372 4613 5068 5554 6003 6010 6066 6393 6395 6539 6516
3228 6516 6388 6281 6095 5856 5458 5317 4837 4257 3975 3017 2508 2430 1385 979 -62 -666 -1363 -1948 -2234
3247 -2234 -2913 -3494 -4083 -4824 -4936 -5468 -5730 -6013 -6269 -6409 -6352 -6465 -6664 -6564 -6186 -5997 -5531 -5575 -5005 -4635
3267 -4635 -4390 -3644 -3090 -2490 -1826 -902 -724 -276 738 1253 2048 2639 3039 3750 4233 4649 5126 5160 5955 5811
3287 5811 6156 6353 6372 6352 6275 6506 6148 5941 5295 5360 5065 4318 3914 3726 3136 2178 1848 1284 538 37 -683
3308 -683 -1288 -1882 -2485 -2890 -3654 -4277 -4668 -4900 -5429 -5573 -5696 -6395 -6550 -6619 -6045 -6583 -6488 -5705 -5771 -5713 -5168
3329 -5168 -5108 -4695 -3929 -3196 -2841 -2447 -1973 -1221 -562 -52 645 1045 1896 2641 3161 3429 3923 4420 4663 5279
3349E279K79L27K40R8J16j86K78l36q7j95l44n8m31m00q72k09n93p94n14p15m21
3370D62m68r32n45n26m81j049l7n10l81o80k87l58k12O8j44k59J6L84q8R7J10
3391e820M52N1P24K54N34O19L79L43R55M32P89O77N48L65O76O54O24L72K47N12
3411D387M59N75J70N19J76k16J05j18L81k47n51k1l75l47k67n74m28o08n04m37
3431B079m33p95r10j22p98o89n06k11m74q74k58m84k54n43j93l56k25q9P3l54
3451f416K60Q2K04L30M34L50N12L46J34N53O02N23R46J90Q94M14N53N87O62M06
3471B566M48R61K68O1N36N39k16M44K76L83k53P6k03l59K25o11k9k01o31k68n99
3492C413l65l82j037l36m42p24n11n64p49m08o61k41o38l89k65n65m11j20k13
$$ plain form
3349 5279 5558 5885 6125 6223 6339 6153 6431 6095 6008 5813 5469 5411 4980 4580 3708 3499 2906 2112 1598 883 462
3370 462 -6 -938 -1483 -2009 -2490 -3539 -3576 -4086 -4467 -5147 -5434 -5792 -6004 -5936 -6080 -6339 -6323 -5939 -6027 -5930 -5820
3391 -5820 -5368 -5317 -4593 -4339 -3805 -3186 -2807 -2464 -1509 -1077 -288 389 937 1302 1978 2632 3256 3628 3875 4387
3411 4387 4846 5421 5591 6110 6286 6070 6175 6057 6438 6191 5640 5619 5244 4897 4630 4056 3628 3020 2516 2079
3431 2079 1646 851 -59 -181 -979 -1668 -2174 -2385 -2859 -3733 -3991 -4475 -4729 -5272 -5465 -5821 -6046 -6135 -6062 -6416
3451 -6416 -6156 -6074 -5870 -5540 -5106 -4756 -4244 -3898 -3764 -3211 -2609 -2086 -1140 -950 -56 358 911 1498 2160 2566
3471 2566 3014 3975 4243 4304 4840 5379 5163 5607 5883 6266 6013 6089 5886 5527 5752 5141 5112 4911 4280 4012 3413
3492 3413 3048 2666 1629 1293 851 127 -384 -948 -1697 -2105 -2766 -3007 -3645 -4034 -4299 -4864 -5275 -5395 -5608
3511e608l60P2J94j59k8K3K39P15o6L84L77O03K4P16L41M46O12P61M92O06O17
3532A001O06L60O94O88J48M15L08N18L0M95K61K34J78j56r9J03k31k9j89n29j63
3553D643m27l03n75l31o63o02n23l52o74o27o25n15m18o63l31n07k59o70k74l46
3573e042m6m69k12J41K75l27K16j6K1N09J73N25J39N57L70N18M27O03L72P62N85
3594H1K33M21Q16M17R57K14J86M74M84K26L59M08L49q8j31J10K50k8m68j99n6
3615E015k72j88k64o00p25k07o16n36l29o52n67o92l26o07m22n94k73p46j10n09
3635d220n19L9k53k42l84R8N7q2K8K31J94K02L95K79L52M97L2O03N74N00N75L75
3657f69L47P43M18P67N79M70L73M19K51P18J23K76K03L00K12J40J63o41J2K17
$$ plain form
3511 -5608 -5968 -5896 -5702 -5861 -5889 -5866 -5627 -4912 -4978 -4594 -4217 -3614 -3590 -2874 -2533 -2087 -1475 -714 -222 384 1001
3532 1001 1607 1967 2661 3349 3497 3912 4220 4738 4768 5263 5524 5758 5936 5780 5681 5784 5553 5524 5335 4806 4643
3553 4643 4216 3913 3338 3007 2344 1742 1219 867 193 -434 -1059 -1574 -1992 -2655 -2986 -3493 -3752 -4422 -4696 -5042
3573 -5042 -5088 -5557 -5769 -5628 -5353 -5680 -5464 -5480 -5459 -4950 -4777 -4252 -4113 -3556 -3186 -2668 -2241 -1638 -1266 -504 81
3594 81 314 735 1551 1968 2925 3139 3325 3799 4283 4509 4868 5276 5625 5537 5406 5516 5766 5738 5270 5071 5015
3615 5015 4743 4555 4291 3691 2966 2759 2143 1607 1278 626 59 -633 -959 -1566 -1988 -2582 -2855 -3601 -3711 -4220
3635 -4220 -4739 -4700 -4953 -5195 -5579 -5481 -5424 -5506 -5478 -5247 -5053 -4851 -4456 -4177 -3825 -3328 -3296 -2693 -2119 -1619 -1044 -669
3657 -669 -322 421 839 1606 2185 2655 3028 3447 3698 4416 4539 4815 5018 5318 5530 5670 5833 5192 5204 5421
3677E421m72k41j56m43k50m59m22m64m25p79m06l80m93n95k06p48n70o08r7n55
3697c348q63L9k91j88k20k91k02J65k72J10K45mJ79L52K71M17n8Q39L19Q7Q14
3718a900K18P39N58L34L58Q40L06P12M54J19Q54J16N32N03k30N13O1N1K00J5j08
3739E245J0k34k21Om87j46n63m63j86m51m37n44p16l14o32o69l62k41o84k33n97
3760b919m47k37m30l83k74j89k08L4K46m51l7K19j7L16K09M96j8M00O54K23M29
3781b384M05O66M53N50L26N77M73L79M44O64L56M33M34P3N73J80J02L90l68L28
3801E054J10K6k11J8m23k27j3l00l78m39l57n64j95n65q38k54n50n05n32q89m7
3822b079m46k76q04j67k20m37Pn84JJ95m21j08L33n6p0J99O50P1M70M58QN86L88
$$ plain form
3677 5421 4949 4708 4552 4109 3859 3400 2978 2514 2089 1310 904 524 31 -564 -770 -1518 -2088 -2696 -2793 -3348
3697 -3348 -4211 -4172 -4463 -4651 -4871 -5162 -5364 -5199 -5471 -5361 -5116 -5120 -4941 -4589 -4318 -3901 -3959 -3120 -2801 -2714 -1900
3718 -1900 -1682 -943 -385 -51 307 1147 1453 2165 2619 2738 3592 3708 4240 4743 4513 5026 5087 5138 5338 5353 5245
3739 5245 5255 5021 4800 4806 4319 4173 3610 3147 2961 2510 2073 1529 813 499 -133 -802 -1164 -1405 -2089 -2322 -2919
3760 -2919 -3366 -3603 -4033 -4416 -4690 -4879 -5087 -5053 -4807 -5258 -5295 -5076 -5093 -4777 -4568 -4072 -4090 -3690 -3036 -2813 -2384
3781 -2384 -1979 -1313 -860 -310 16 593 1066 1445 1889 2553 2909 3342 3776 3849 4422 4602 4704 5094 4726 5054
3801 5054 5164 5190 4979 4997 4574 4347 4334 4034 3656 3217 2860 2296 2101 1536 698 444 -106 -611 -1143 -2032 -2079
3822 -2079 -2525 -2801 -3605 -3772 -3992 -4429 -4422 -5006 -5005 -4810 -5231 -5339 -5006 -5062 -5132 -4933 -4283 -4212 -3742 -3284 -3276 -2690 -2302
3845b302L92O52J08O81N96K70O09O39Q45k08O58J52O49M63r7K21K30K89J74J15
3865E136j68j53J82k49l2j58l61m53l09l99p23k52l92l96n52m62l97m94l37q85
3885a854l01m70k31m64m20m87Jl77jj99q7j39p7P5J0N63o3J87K79J55P25N6M99
3908b620N75J22N82L82N31M75R72NP17j3O65M29L38M94K20K59L33K7L66j96J23
3929D786K53k59M3l36j55j57m4l20r1r03k00l58o20l94l17n72m28n35q95r6m48
3950b046l87p56m19q9L7m39o11M9k59R6j39q8M30k21M1L06O9O08J91M58K37L83
3972b549N71L44N67n2J085K04N53K45N94P04J17O52p4R55M6K12L36J19kJ72J24
3993D923o9jj94L9j65n04j53k00l30l90n38m32k03q04m56l08l91n34m92l97j83
$$ plain form
3845 -2302 -1910 -1258 -1150 -469 127 397 1006 1645 2490 2282 2940 3092 3741 4204 4107 4328 4558 4847 5021 5136
3865 5136 4968 4815 4997 4748 4716 4558 4197 3744 3435 3036 2313 2061 1669 1273 721 259 -138 -632 -969 -1854
3885 -1854 -2155 -2625 -2856 -3320 -3740 -4227 -4226 -4603 -4604 -4803 -4890 -5029 -5106 -5031 -5021 -4458 -4521 -4334 -4055 -3900 -3175 -3119 -2620
3908 -2620 -2045 -1923 -1341 -959 -428 47 1019 1024 1741 1728 2393 2822 3160 3654 3874 4133 4466 4493 4859 4663 4786
3929 4786 5039 4780 4823 4487 4332 4175 4131 3811 3720 2817 2617 2259 1639 1245 928 356 -72 -607 -1502 -1598 -2046
3950 -2046 -2433 -3189 -3608 -3697 -3660 -4099 -4710 -4661 -4920 -4824 -4963 -5051 -4621 -4842 -4801 -4495 -4426 -3818 -3627 -3169 -2932 -2549
3972 -2549 -1978 -1634 -1067 -1119 -34 170 723 968 1562 2266 2383 3035 2961 3916 3962 4174 4510 4629 4627 4799 4923
3993 4923 4854 4853 4659 4698 4533 4029 3876 3676 3346 2956 2418 1986 1783 979 523 215 -176 -710 -1202 -1599 -1782
4014a782p14m41j44l70l82r1n83Q1p1j80K2k17N1L52K8q8M29J60L20J38M59O03
4036b420N76K19K71N53N93N29L64P25M74K21K89P14P3M71K53J56K80k9M20J22
4056D854j38O7j99Q4m90n7p5m18J5m55l66n02k50o55j77l67m35o01o77n85l32
4077a759m23m92r4n98l17l53J71n39j40J71l57R3K9K12j42K21KK42M14J39N76
4098b944K78N69K5P47R5P67L66K65P83M38j41J119L65J00M03O08J44J41M13q0
4118D461L36n9N6k17K24l51j70J60n76q2l16m56k45n20k11n82o25l93o47l11k29
4139g53n49k58p35J96p84o70k35J39n34J18n53Q0k52J17N5J69k58M84j49O50r
4160c731O13K41L49L89K61L67M93N32N34L41L49Q42L09K29O50K64K25L82N9L87
$$ plain form
4014 -1782 -2496 -2937 -3081 -3451 -3833 -3924 -4507 -4426 -4497 -4677 -4655 -4872 -4821 -4469 -4441 -4529 -4100 -3940 -3620 -3482 -3023 -2420
4036 -2420 -1844 -1625 -1354 -801 -208 321 685 1410 1884 2105 2394 3108 3181 3652 3905 4061 4341 4312 4732 4854
4056 4854 4716 4783 4584 4668 4178 4121 4046 3628 3643 3188 2822 2320 2070 1415 1238 871 436 -165 -842 -1427 -1759
4077 -1759 -2182 -2674 -2768 -3366 -3683 -4036 -3865 -4404 -4544 -4373 -4730 -4637 -4608 -4396 -4538 -4317 -4315 -4073 -3659 -3520 -2944
4098 -2944 -2666 -2097 -2072 -1325 -1230 -463 -97 168 951 1389 1248 2367 2732 2832 3235 3843 3987 4128 4541 4461
4118 4461 4797 4738 4794 4577 4801 4450 4280 4440 3864 3782 3466 3010 2765 2245 2034 1452 827 434 -213 -524 -753
4139 -753 -1302 -1560 -2295 -2099 -2883 -3553 -3788 -3649 -4183 -4065 -4618 -4538 -4790 -4673 -4618 -4449 -4707 -4223 -4372 -3722 -3731
4160 -3731 -3118 -2877 -2528 -2139 -1878 -1511 -1018 -486 48 389 738 1580 1889 2118 2768 3032 3257 3639 3698 4085
4180D085J69M2l6M52q5L80n52j73m5l51N3m70o4j42o33m51m33n08l41l89k98r56
4202g46j44n57p63q3m25k11l46j30m98l16r5p6j01K8j50mQ4J79j6M42L6M11R7
4225c384O44K80L56M15L62N70M43N61K08O28L70M11O60J08K93N17J25L64J69J69
4245D269J82n4N7L72l26k81L14o00j20k12l45l01r0o59l69n4p26j06m75m15q91
4266h30k27l08o70k41l64n22j99m7n24k27K49l65k07k94K2L66J47k04N0M42K54
4287c699O9L30O98K57M51O07J88N68K30N61N49L47L20M22M71K35M81O4K91O90
4307D130%P9K41N1L2m3N4r4j54j83m06n3m13k73l13j19p26l46m62l75n64n08m97
4330i42l65j48m76l59n84k02m17l17k35n5p3k96j59L21k18K63J31k59L25L15L46
$$ plain form
4180 4085 4254 4296 4260 4712 4627 5007 4455 4282 4237 3886 3939 3469 3405 3263 2630 2179 1746 1238 897 508 210 -746
4202 -746 -890 -1447 -2210 -2293 -2718 -2929 -3275 -3405 -3903 -4219 -4314 -4390 -4491 -4463 -4613 -4617 -4533 -4354 -4370 -3928 -3892 -3481 -3384
4225 -3384 -2740 -2460 -2104 -1689 -1327 -757 -314 247 455 1083 1453 1864 2524 2632 2925 3442 3567 3931 4100 4269
4245 4269 4451 4397 4454 4826 4500 4219 4533 3933 3813 3601 3256 2955 2865 2206 1837 1783 1057 951 476 61 -830
4266 -830 -1057 -1365 -2035 -2276 -2640 -3162 -3361 -3408 -3932 -4159 -3910 -4275 -4482 -4776 -4754 -4388 -4241 -4445 -4395 -3953 -3699
4287 -3699 -3630 -3300 -2602 -2345 -1894 -1287 -1099 -531 -301 260 809 1156 1476 1898 2369 2604 3085 3149 3440 4130
4307 4130 4130 4209 4450 4501 4533 4490 4544 4450 4296 4113 3707 3654 3241 2968 2655 2536 1810 1464 1002 627 63 -445 -942
4330 -942 -1307 -1455 -1931 -2290 -2874 -3076 -3493 -3810 -4045 -4100 -4173 -4469 -4628 -4307 -4525 -4262 -4131 -4390 -4065 -3750 -3404
4351c404J71R8N72M79L86L93J97N16M57L74N00O23j08P12J92O02L73K57K62M05
4371D057l30L97J24R3J96k22j12Nn2j38l77k34n73l3l24k85p19j58m46o25m55
4392b11m64j90k63n23n61K4n63l36j51k22j19l65l55Q7k8p5K49k20K97j09M03
4413c695K34j58R35j41N03M11O68j10L16P24M79J12N19N71L32N47O8K92L21N18
4433C446R5R1L73J21m1k8J79j79r5L02m79j22l43J43m17m44l74n32j61n92j89
4454G54o44k66l38n68m48k35l65k83n55q5l41k37N1n47p0J18j80oQ5J59M19j98
4476c780L51j5L43N96l3J46N28O36J69M55M23O62J53L03M64L35O02P3O12L50J31
4497C504K78m8K36L14m92J71J98m8J57l85k54l3l81l62j36k85m82l00l35m82m13
$$ plain form
4351 -3404 -3233 -3135 -2563 -2084 -1698 -1305 -1108 -592 -135 239 739 1362 1254 1966 2158 2760 3133 3390 3652 4057
4371 4057 3727 4124 4248 4341 4537 4315 4203 4208 4156 4018 3641 3407 2834 2801 2477 2192 1473 1315 869 244 -211
4392 -211 -675 -865 -1128 -1651 -2212 -2188 -2751 -3087 -3238 -3460 -3579 -3944 -4299 -4212 -4240 -4315 -4066 -4286 -3989 -4098 -3695
4413 -3695 -3461 -3619 -2684 -2825 -2322 -1911 -1243 -1353 -1037 -313 166 278 797 1368 1700 2247 2315 2607 2928 3446
4433 3446 3541 3632 4005 4126 4085 4057 4236 4057 3962 4264 3785 3663 3320 3463 3046 2602 2228 1696 1535 943 754
4454 754 110 -156 -494 -1062 -1510 -1745 -2110 -2393 -2948 -3033 -3374 -3611 -3560 -4107 -4177 -4059 -4239 -4245 -4160 -4001 -3582 -3780
4476 -3780 -3429 -3444 -3101 -2505 -2538 -2392 -1864 -1228 -1059 -604 -181 481 634 937 1401 1736 2338 2411 3023 3373 3504
4497 3504 3782 3734 3970 4284 3792 3963 4161 4113 4270 3885 3631 3598 3217 2855 2719 2434 1952 1652 1317 835 422
4518D22l63l50l75n70o1m66n21q6n98j98Po51L5k56O9L34n00K35J67k0J11j99
4540c834L88L59L30L02K51L20J46M33M35N17K60N38P22kN27j03N88M39L83R9K45
4561C343K43K35r2J86J12k18N9j32j84J4j37m22Q5n79R6n27j93o03k73l55l48
4582C10k13n31m13l13l72m69n70J06l49k82l87O4m75Q7p7K08k04m2K89j19K66
4603c486J26M8L86J92J70O78M71K40L78M22J52M21L21K51P48Q4L84R3N54L09J43
4624C085K09L30J58j29K9J14N3J98o24J59k7k08k87m71J24k79m04m20k54p09O
$$ plain form
4518 422 59 -291 -666 -1236 -1297 -1763 -2284 -2370 -2968 -3166 -3159 -3810 -3775 -4031 -3962 -3628 -4128 -3893 -3726 -3746 -3635 -3834
4540 -3834 -3446 -3087 -2757 -2455 -2204 -1884 -1738 -1305 -870 -353 -93 445 1167 1165 1692 1589 2177 2616 2999 3098 3343
4561 3343 3586 3821 3729 3915 4027 3809 3868 3736 3552 3566 3429 3007 3092 2513 2609 2082 1889 1286 1013 658 310
4582 310 97 -434 -847 -1160 -1532 -2001 -2571 -2465 -2814 -3096 -3483 -3419 -3894 -3807 -3884 -3676 -3880 -3922 -3633 -3752 -3486
4603 -3486 -3360 -3312 -2926 -2734 -2564 -1886 -1415 -1175 -797 -375 -223 198 519 770 1518 1602 1986 2079 2633 2942 3085
4624 3085 3294 3624 3782 3653 3682 3796 3849 4047 3423 3582 3555 3347 3060 2589 2713 2434 2030 1610 1356 647 653
$$ [...]
8191i15
##END NTUPLES=NMR FID
##END=
