##TITLE=1H_DE-TEST_CCl4_TMS_TFA
 200.13Hz,CCl4.
 8 sc
 8.6.2026
##JCAMPDX= 6.0         $$ Bruker NMR JCAMP-DX V2.0
##DATA TYPE= NMR FID
##DATA CLASS= NTUPLES
##ORIGIN= UXNMR, Bruker Analytische Messtechnik GmbH
##OWNER= pz
$$ XWIN-NMR		Version 3.5
$$ Mon Jun  8 14:30:09 2026 Russian Standard Time (UT+4h)  she@DPX200
##.OBSERVE FREQUENCY= 200.131
##.OBSERVE NUCLEUS= ^1H
##.DELAY= (6, 6)
##.ACQUISITION MODE= SIMULTANEOUS
##.ACQUISITION SCHEME= undefined
##.AVERAGES= 8
##.DIGITISER RES= 18
##SPECTROMETER/DATA SYSTEM= spect
##.PULSE SEQUENCE= zg30
##.SOLVENT NAME= CDCl3
##.SHIFT REFERENCE= (INTERNAL, CDCl3, 0, 14.3821)
##AUDIT TRAIL= $$ (NUMBER, WHEN, WHO, WHERE, WHAT)
$$ ##TITLE= Audit trail, XWIN-NMR		Version 3.5
$$ ##JCAMPDX= 5.01
$$ ##ORIGIN= Bruker BioSpin GmbH
$$ ##OWNER= she
$$ F:/spectra/data/she/nmr/H-C/1/audita.txt
$$ ##AUDIT TRAIL=  $$ (NUMBER, WHEN, WHO, WHERE, WHAT)
(   1,<2026-06-08 14:28:04.98 +0400>,<she>,<DPX200>,
      <created by zg, POWCHK disabled, PULCHK disabled
       configuration hash MD5:
       00 E9 B6 7A A2 85 ED C7 34 08 36 98 17 FE 4E 26
       data hash MD5: 16K
       04 D8 1F 18 58 83 20 67 8E FB 51 1A BB 6C 8B FA>)
$$ ##END=
$$ 
$$ hash MD5
$$ 51 7A 26 2B 35 7B 78 8F AA D2 9C BC 15 49 B7 95
##$RELAX= 
##$RELAX= 
##$RELAX= 
##$RELAX= 
##$RELAX= 
##$RELAX= 
$$ Bruker specific parameters
$$ --------------------------
##$DU= <F:/spectra>
##$EXPNO= 1
##$NAME= <H-C>
##$PROCNO= 1
##$TYPE= <nmr>
##$USER= <she>
##$AMP= (0..31)
100 100 100 100 100 100 100 100 100 100 100 100 100 100 100 100 100 100 
100 100 100 100 100 100 100 100 100 100 100 100 100 100 
##$AQSEQ= 0
##$AQ_mod= 1
##$AUNM= <au_zg>
##$AUTOPOS= <>
##$BF1= 200.13
##$BF2= 200.13
##$BF3= 200.13
##$BF4= 200.13
##$BF5= 200.13
##$BF6= 200.13
##$BF7= 200.13
##$BF8= 200.13
##$BYTORDA= 1
##$CFDGTYP= 0
##$CFRGTYP= 5
##$CHEMSTR= <none>
##$CNST= (0..31)
1 1 145 1 1 1 1 1 1 1 1 1 1 1 1 1 1 1 1 1 1 1 1 1 1 1 1 1 1 1 1 1 
##$CPDPRG= <>
##$CPDPRG1= <>
##$CPDPRG2= <>
##$CPDPRG3= <>
##$CPDPRG4= <mlev>
##$CPDPRG5= <mlev>
##$CPDPRG6= <mlev>
##$CPDPRG7= <mlev>
##$CPDPRG8= <mlev>
##$CPDPRGB= <>
##$CPDPRGT= <>
##$D= (0..31)
0 0.7 0 0 0 0 0 0 0 0 0 0.03 0 0 0 0 0 0 0 0 0 0 0 0 0 0 0 0 0 0 0 0 
##$DATE= 1780914484
##$DBL= (0..7)
120 120 120 120 120 120 120 120 
##$DBP= (0..7)
150 150 150 150 150 150 150 150 
##$DBP07= 0
##$DBPNAM0= <>
##$DBPNAM1= <>
##$DBPNAM2= <>
##$DBPNAM3= <>
##$DBPNAM4= <>
##$DBPNAM5= <>
##$DBPNAM6= <>
##$DBPNAM7= <>
##$DBPOAL= (0..7)
0.5 0.5 0.5 0.5 0.5 0.5 0.5 0.5 
##$DBPOFFS= (0..7)
0 0 0 0 0 0 0 0 
##$DE= 6
##$DECBNUC= <off>
##$DECIM= 32
##$DECNUC= <off>
##$DECSTAT= 4
##$DIGMOD= 1
##$DIGTYP= 9
##$DL= (0..7)
0 120 120 120 120 120 120 120 
##$DP= (0..7)
150 150 150 150 150 150 150 150 
##$DP07= 0
##$DPNAME0= <>
##$DPNAME1= <>
##$DPNAME2= <>
##$DPNAME3= <>
##$DPNAME4= <>
##$DPNAME5= <>
##$DPNAME6= <>
##$DPNAME7= <>
##$DPOAL= (0..7)
0.5 0.5 0.5 0.5 0.5 0.5 0.5 0.5 
##$DPOFFS= (0..7)
0 0 0 0 0 0 0 0 
##$DQDMODE= 0
##$DR= 18
##$DS= 0
##$DSLIST= <SSSSSSSSSSSSSSS>
$$ [...]
##$SUBNAM0= <"">
##$SUBNAM1= <"">
##$SUBNAM2= <"">
##$SUBNAM3= <"">
##$SUBNAM4= <"">
##$SUBNAM5= <"">
##$SUBNAM6= <"">
##$SUBNAM7= <"">
##$SUBNAM8= <"">
##$SUBNAM9= <"">
##$SW= 18.0517599122864
##$SWIBOX= (0..15)
0 0 2 0 0 0 0 0 0 0 0 0 0 0 0 0 
##$SW_h= 3612.71676300578
##$TD= 16384
##$TD0= 1
##$TE= 0
##$TE2= 300
##$TE3= 300
##$TEG= 300
##$TL= (0..7)
0 120 120 120 120 120 120 120 
##$TP= (0..7)
150 150 150 150 150 150 150 150 
##$TP07= 0
##$TPNAME0= <>
##$TPNAME1= <>
##$TPNAME2= <>
##$TPNAME3= <>
##$TPNAME4= <>
##$TPNAME5= <>
##$TPNAME6= <>
##$TPNAME7= <>
##$TPOAL= (0..7)
0.5 0.5 0.5 0.5 0.5 0.5 0.5 0.5 
##$TPOFFS= (0..7)
0 0 0 0 0 0 0 0 
##$TUNHIN= 0
##$TUNHOUT= 0
##$TUNXOUT= 0
##$USERA1= <user>
##$USERA2= <user>
##$USERA3= <user>
##$USERA4= <user>
##$USERA5= <user>
##$V9= 5
##$VALIST= <valist>
##$VCLIST= <CCCCCCCCCCCCCCC>
##$VD= 0
##$VDLIST= <DDDDDDDDDDDDDDD>
##$VPLIST= <PPPPPPPPPPPPPPP>
##$VTLIST= <TTTTTTTTTTTTTTT>
##$WBST= 1024
##$WBSW= 4
##$XGAIN= (0..3)
0 0 0 0 
##$XL= 0
##$YL= 0
##$YMAX_a= 147284
##$YMIN_a= -162491
##$ZGOPTNS= <>
##$ZL1= 120
##$ZL2= 120
##$ZL3= 120
##$ZL4= 120
##$ABSF1= 10
##$ABSF2= 0
##$ABSG= 5
##$ABSL= 3
##$ALPHA= 0
##$AQORDER= 0
##$ASSFAC= 0
##$ASSFACI= 0
##$ASSFACX= 0
##$ASSWID= 0
##$AUNMP= <proc_1d>
##$AZFE= 0.1
##$AZFW= 0.1
##$BCFW= 1
##$BC_mod= 2
##$BYTORDP= 1
##$COROFFS= 0
##$CY= -3
##$DATMOD= 1
##$DC= 2
##$DFILT= <>
##$DTYPP= 0
##$F1P= 0
##$F2P= 0
##$FCOR= 0.5
##$FTSIZE= 0
##$FT_mod= 4
##$GAMMA= 1
##$GB= 0.15
##$INTBC= 1
##$INTSCL= 1
##$ISEN= 128
##$LB= 0.25
##$LEV0= 0
##$LPBIN= 0
##$MAXI= 10000
##$MC2= 0
##$MEAN= 0
##$ME_mod= 0
##$MI= 1.114404
##$NCOEF= 0
##$NC_proc= 0
##$NLEV= 6
##$NOISF1= 3.799351
##$NOISF2= 2.8
##$NSP= 1
##$NTH_PI= 0
##$NZP= 0
##$OFFSET= 14.38212
##$PC= 1
##$PHC0= -4217.411
##$PHC1= 10.39229
##$PH_mod= 1
##$PKNL= yes
##$PPARMOD= 0
##$PSCAL= 0
##$PSIGN= 0
##$REVERSE= no
##$SF= 200.129724274929
##$SI= 16384
##$SIGF1= 3
##$SIGF2= 2
##$SINO= 400
##$SIOLD= 16384
##$SREGLST= <1H.CDCl3>
##$SSB= 0
##$STSI= 0
##$STSR= 0
##$SW_p= 3205.1282051282
##$SYMM= 0
##$S_DEV= 0
##$TDeff= 0
##$TDoff= 0
##$TI= <>
##$TILT= no
##$TM1= 0
##$TM2= 0
##$TOPLEV= 0
##$USERP1= <user>
##$USERP2= <user>
##$USERP3= <user>
##$USERP4= <user>
##$USERP5= <user>
##$WDW= 1
##$XDIM= 8192
##$YMAX_p= 0
##$YMIN_p= 0
$$ End of Bruker specific parameters
$$ ---------------------------------
##NTUPLES= NMR FID
##VAR_NAME=  TIME,          FID/REAL,        FID/IMAG
##SYMBOL=    X,             R,               I
##VAR_TYPE=  INDEPENDENT,   DEPENDENT,       DEPENDENT
##VAR_FORM=  AFFN,          ASDF,            ASDF
##VAR_DIM=   8192,          8192,            8192
##UNITS=     SECONDS,       ARBITRARY UNITS, ARBITRARY UNITS
##FACTOR=    0.0002768,     1,               1
##FIRST=     0,             0,               0
##LAST=      2.2672688,     0,               0
##MIN=       0,             -162491,         0
##MAX=       2.2672688,     147284,          0
$$ Real data points
##PAGE= N=1
##DATA TABLE= (X++(R..R)), XYDATA
$$ [...]
1917A65m88Q5N89j91o40K04R14J4j036J8Q75j96j332M07J164j5j100L36N13L52
1937F38j013j30Q08N39r57n41P28P35q86n36Q54J95m98o75N55M57k26p97Q66J71
1957B87J75q98Q9O94k51p82K49Q77K3q96K79R19k84o76l16R84J73r67k87J050
1977D42L26j102l0N36N24q04n86N93O84o83n56N22N56j94p61N29P05p17n36N34
1997a8N50n29n78L13P08p3r66Q6J115l07p58j26J061N6r19P6Q27N8q21l82Q67
2018B40J61q02J26N81K76o35n95P47P32q08p43N52O98n30o53M64Q05n29m59M09
2038C7K53k89l74J03N23j11o68M69P27k41q46J28M13L36q11k08R25Ko35k33O75
2059A75L52q73m86R71M71r34k42R48P1l29m63M66M54p17m97N15Q38m31o10K50
$$ y = [165, -323, -238, 351, 160, -480, -276, 638, 652, -384, -366, 509, 313, -1019, -612, 552, 537, -563, -227, 286, 638, -375, -505, 303, 842, -115, -656, 72, 807, -79, -615, 239, 434, -64, -739, -184, 273, 47, -750, 116, 287, 462, -436, -347, 347, 96, -686, -437, 440, 463, -433, -154, 765, 481, -195, -511, 473, 646, -321, -608, 442, 768, -334, -364, 172, 696, -108, -694, -101, 583, -100, -656, -134, 422, 228, -533, -4, 701, -16, -552, -18, 532, 3, -575, -262, 446, 373, -593, -507, 608, 301, -457, -583, 478, 534, -385, -309, 518, 576, -245, -627, 240, 401, -401, -275, 306, 582, -53, -648, 99, 831, 23, -720, -168, 530, 0, -653, -189, 616, 87, -372, 37, 290, 1, -373, -270, 253, 142, -526, -57, 670, 429, -417, -289, 124, 460, -351, -559, 366, 368, -267, -500, 175, 527, -346, -832, 139, 610, -324, -566, 382, 453, 124, -339, 127, 581, -136, -633, -118, 720, 289, -321, -71]
2079g1O21n54m77oP21j67o14K75M44J03p15J66M64K89q10l66J044J72p04k71O14
2100A58J87p37J57L47Kj82m15M54P28p27l01L80O02o13o01K20R05l79m66K01O93
2121F13k13q81N8R38l76o60K00N52J96q30L09N15k01o21q8O99K60p86J51K79M48
2142E62q45j15O23L26p49l67O42N42m71m94O35K70l25n93L17N81l77o55L50O15
2162D72m2j041N51O45l65o12K74P37j50p24j97P57q5k98j51O52l25m72L8M98L14
2183D76p48k06N61K93m70m2J14L84j91n95L53N13m38n22M75K89j09m99K29O07
2203D74j21p65j45R10r2n88J24O57m61l98MQ00m45j76n8L91O24r66k45P61J25
2224D10n05n18N64L13j91n08M13N27n47n70O35M50m62m05K92K72k36j52J84O07
$$ y = [-71, 550, -4, -481, -487, 234, 67, -547, -272, 172, 275, -440, -274, 190, 479, -331, -697, 347, 519, -185, -456, 158, 345, -392, -235, 112, 114, -68, -483, -29, 699, -28, -329, 51, 653, 40, -561, -341, 564, 185, -281, -80, 613, 400, -481, -423, 515, 139, -521, -321, 231, 427, -403, -94, 421, 220, -401, -489, 210, 470, -316, -165, 114, 562, -283, -398, 225, 551, -198, -565, 77, 619, 148, -346, 289, 559, 234, -359, -42, 539, 162, -493, -143, 472, 430, -611, -60, 585, 220, -392, -118, 619, 469, -255, -452, 305, 220, -78, -229, 423, 98, -374, -336, 162, 476, -272, -478, 83, 376, -94, -136, -22, 362, 171, -424, -71, 442, 4, -518, -43, 246, 137, -362, -133, 474, 353, -412, -557, 353, 261, -327, -203, 454, -7, -405, -401, 399, -46, -222, -280, 111, 735, -231, -476, 285, 410, -95, -613, -49, 264, 73, -435, -22, 505, -42, -612, 23, 473, 11, -394, -102, 170, -66, -218, -34, 573]
2244E73l61o28K75K55J69m70k89Q25r1o17PN19j16m75k35J059Ko33P5J59M62o92
2266b27l41P44k5m53R2J34N50o58j54J42N91n18m03L64O39m22l10O6N26m1m86
2287a90M7M14j42l55K51M9K04n65j54N72j14k33L4K76K50m43j14M50Qm24m4K35
2309A2M29k94m40K13N17n60l43N70L64k88p89N31L79k52n63M95L01o6n89J78O12
2330D17j40n46j34N42jm25j05O48l2k94n46P44J49m13M1rN01n06m25O18J49j53
2352H0l65K40L56q9n01J53N79m83l66K68M94l43m64K49O63l44m93L44K87j31n43
2373d09PO62M4n01p9O61k1m38J75OJ27m88KL48K36k30l31K40R9j90k74K78M59
2396C83m23m18L15O41k12n09J15L26j1m32J81L37k11l21Q9L82k1m62N5O92n92
$$ y = [573, 212, -416, -141, 114, 283, -187, -476, 349, 258, -359, -352, 167, 51, -424, -659, 400, 402, -231, -156, 3, 465, -227, -568, 176, 151, -302, -210, -76, 474, -184, -338, -196, 395, -123, -526, -162, 477, 55, -255, -189, 337, 296, -190, -143, 271, 129, -226, 25, 74, 278, -287, -441, 131, 17, -216, -182, 94, 344, -99, -213, 237, 245, -179, -223, 12, 441, 147, -293, -80, 437, -123, -466, 104, 468, 180, -609, -78, 301, 49, -514, -19, 282, 216, -373, -195, 417, 277, -269, -403, 139, 138, -287, -392, 256, 224, -70, -616, 128, 277, -136, -95, -104, 397, -109, -534, 84, 233, 80, -285, -45, 311, 222, -279, -126, 453, -30, -396, -128, 366, 23, -441, -192, 471, 127, -366, -22, 265, 134, -409, -402, 260, 304, -197, -276, 385, 364, -74, 101, 107, 234, -254, -252, 96, 332, 102, -229, 11, 110, -80, -354, -76, 383, -40, -458, -143, 498, 286, -223, -108, 218, 207, -225, -44, 293, 82, -239, -150, 232, 211, -251, -196, 496, -96]
2417i6l37L17L92pn79j74O33K05k97q9J07o9m2q4R1L75m97j40K95N02m53m31J76
2440b02N16n7m20P8K39%l61K83Q9o1m83K59O04j41q67K22R62l92j544O14P62l01
2462b01P35k01m1K4l80L09M4K89l47p61J036l93r80L81M34Q45M31j447P93l94
2482A76J51q19Q63L06J3j250L68M82m43k77N98R30j090q75P08L78k06L24n93N12
2502B56j74l55J72K31K47n42j29O9M12o70J50N14L24k67p30M11L84n8k10M84l80
2523A39Q7n73K44M63m32k12J07J65n1j83p3L15j69j23L49P6M17r30L19R1L72l23
2545G5l59M76q7j39m18N44k41O0k49M92J29m07J08J22l2om28J33M63l47J43k34
2567b02N00j23l89O7L09j90j80M01l2l4r0m74N78j54k33J55L95n0n21R3L28K38
$$ y = [-96, -433, -116, 276, 269, -310, -484, 149, 354, 57, -32, 75, 6, -36, -120, -29, 346, -151, -291, 4, 506, 53, -378, -202, 314, 257, -163, -85, 154, 154, -207, 76, 165, 104, -379, -120, 484, 343, -524, -302, 660, 268, -1276, -662, 100, -201, 534, 333, 292, 316, -64, 245, 289, 578, 231, -530, 506, 113, -867, -486, -52, 793, 1224, -223, 570, 176, 327, -492, 371, 677, 690, -560, -192, 290, -153, -430, 168, 1098, 8, -867, -159, 219, 13, 337, -256, 256, 82, -273, -101, 130, 377, -165, -294, -225, 187, -483, -333, 181, 505, 238, -492, -81, 303, 245, 35, 519, 139, 226, -347, -103, 360, -72, -284, -177, -12, -63, -246, -319, -4, -173, -296, 53, 129, 546, -384, -65, 26, 398, 75, -284, 192, 105, -34, -452, 92, -149, -89, -338, 154, 283, -124, -16, 106, 74, 68, -360, -227, 236, -111, 32, -202, 298, 175, -214, -147, 162, -28, -208, 193, 161, 127, 37, -437, 141, -13, -246, -91, 304, 254, -267, -174, 154, 392]
2589C92m66l46Q4L80j51j00j35O36l11k22K40J23j33m08L89K46l99j36K8O83k06
2610A88l73J19J21J45m41Q8N2M0P2k78M81j39l36J98N7K00m43K65N6J6k34j8J00
2633f4L66l03j67K22K99n57k7O3K78P2n77L99j16J16l83L38J17n8k73M49K5n5
2655A64l56J07K46o9k59K7M85l38P1j20J58Rj62p9J74R9l02J06J84N9r7k03K30
2678A34q4k13rOK66J58o66J57M53j72k63K98nk72J90J32K2k79L8r7M31O3m87L7
2702a62M11q3l11J77L65n20O7j35J10L74l73j25O3L92k12m06O40k63l05k7L25
2723BR8j35o3M5L12k03m97L11L53l70mj79M48j79k47J25L90k89pM2L7K78m93m7
2747b72N35j85j84Q7q6K28q9j42L67j20j81JJ72J32k46l02O6M76l18j42M8K68
$$ y = [392, -74, -420, -336, 44, -107, -207, -342, 294, -17, -239, 1, 124, -9, -417, -28, 218, -181, -317, -289, 394, 188, -185, -66, 55, 200, -241, -153, -101, -61, 11, -267, 214, 75, -261, -63, -6, 194, -249, 16, 72, 88, -146, -164, -64, 302, -1, -168, 54, 353, -204, -231, -168, 110, 182, -395, 4, -112, 4, -379, -41, 76, 18, -255, 194, 219, 164, -192, -85, 161, 92, -167, -140, 345, 7, 78, -42, 116, 125, -37, -116, 58, 157, -145, -39, 145, 204, 107, -96, 134, 50, -163, -172, -166, 100, 258, -408, -251, 202, 30, -233, 65, 60, -212, -22, 110, 132, -147, -109, -206, 225, 288, -199, -162, 249, 166, -145, 32, 397, -123, -56, -191, -81, 293, -80, -205, -142, 250, 38, -368, 272, 9, -296, -323, 2, 100, -35, -98, -53, 259, 56, -441, -130, 223, -147, -151, -330, 118, -61, -308, -183, 207, -82, -89, -47, -10, 268, -225, -272, 263, 78, -106, -19, -105, 123, 34, -108, 259, 139, -42, -41, 131, 263, 17, -285, -219, 257, -61, -203, -155, 113]
2769A13K01l04m6M8J7j26ML85j03j98k00J65J92o0k12K37j66j39j72N09k07l0
2791i2m5M13l9n37J79N9K35k56j02K63L16l75l42P02j02l10k31J77L58m9n05M93
2813B10k49J85l27J99M55k37m04o1J62J92k90K7M00j86l68R1M87j04j01p6r4J95
2835A06j69K3R2m8j72o7K48R4l79J43J95Ro1j09J44J60l01j8N0J78j3k73j61L53
2859B4j58j86J85K82k36k06K10J73K20j02l51P2J23j51O4K08Q9l32m5M2J4r1J87
2882C5j45J81J41m20J06j1mj96J96K73j48l87J43K32j99J38J53o3J97l55J7L54
2904B38M9m53L08k93P9J17kJ3K9k47p8J94K29j65k93L57k7jl61K30K09K0j49q
2928eK91l31j65k55N45ql17L51J59k97J27k9q8L3k93J04K95o2m2lJJ34m71M57
$$ y = [113, 314, 10, -36, 12, 29, -97, -93, 292, 189, -9, -209, -44, 148, 88, -124, 113, -53, -192, -364, 145, -62, -92, -137, 276, 237, -300, -121, -62, 173, -83, -185, 78, 394, 19, -323, 379, 277, -33, -264, -87, 271, 222, -283, 210, -39, 146, -181, 18, 473, 236, -168, -229, -67, 125, -165, -138, 262, 76, -292, -201, 286, 182, 81, 5, -89, 106, -63, -40, 52, 4, -168, -235, 13, 107, -272, -129, 66, 75, 14, -95, 49, 209, -92, -110, -60, 118, 105, -168, -329, 24, -134, -320, -135, 147, -89, -295, -85, 88, 308, 206, -145, -73, 50, -101, -37, 171, 260, -72, -117, -75, -61, -152, 35, -110, 71, 212, -208, -102, -113, -117, -313, -117, 156, 8, -379, -236, -4, -203, -65, 88, 25, 222, -133, -116, 238, 287, -166, 142, -151, -72, 45, 43, 56, 85, -162, -240, -46, 183, 18, -275, 82, 55, 54, -307, -77, 132, 152, 3, -5, 286, -45, -210, -465, 80, 72, -245, 106, 265, -32, 95, 66, -22, 11, -282, -178, 117, 55, 13, 10, 11, 145, -326, 131]
2952A31M6m2j82j17Q5P0P9k61O7k46M91l80M61j86p9j03%L61l31J4J52L43k61
2975A12m53K91J8j4K59n13M87l5m36K39K90r2m08J52K7K67l44J16L8m6J27k85
2997b03K69N3J25m47K74J75l19j20K40j01P8k96O0L99j53q9j6J51j58P6K14J26
3019C38k29j10j49K52k5l63K53pK06j87j51L63l96L7k5J92K47l60K0L1J1K02k78
3042a28J66o4r0J99M3k42j3pJ67J69l0l06J59o7J38j57J20n4n0j65L20J5O4L4
3066B21k79J93l57k4J19L70M8l95j00J56M3q7R7J87j19j93j0M17l06k36K6M30
3088B01j11j37j8OJ9j29m3K79j5qK2m70Q06k32m22J40M15o8m62K19k3n4J18Jk5
3113IJ8k28K4K48J01j67p4J93j79K28k72J40O1o9mJ70l61J52j86R8J85j53o3K3
$$ y = [131, 177, 135, -47, -164, -79, -9, 70, -191, -124, -370, 121, -259, 202, 16, -63, -166, -166, 195, -136, -122, 30, 373, 112, -341, -50, -32, -46, 213, -300, 187, 152, -284, -45, 245, 153, -255, -103, -76, 191, -153, -37, 1, -45, 82, -203, 66, 119, 244, -203, 71, 246, -73, -193, 47, -54, 24, -272, -212, 187, 34, -55, -71, 80, -78, -2, 212, 338, 109, -1, -150, 102, 77, -286, -33, -40, 166, -21, -172, 191, -205, -168, -193, -1, 246, -114, -94, -63, -52, 150, -128, 38, -26, -116, 83, 126, -116, -129, -136, 31, 200, 170, -136, 23, -44, 94, -63, 57, 3, -47, -212, 108, 123, 187, 221, -58, 135, -222, -246, -127, 243, 291, -104, -204, -48, -5, -92, 5, 192, 73, -120, -130, 287, -19, -255, -229, 201, 90, -47, -65, -59, -40, -169, -212, 67, 52, 44, 66, -404, 402, 170, -252, -112, 303, 235, -227, -8, -31, -85, 33, 34, 9, 27, -201, -177, 71, 172, 5, -69, 124, -55, 173, -99, 41, 102, 33, 29, 199, -162, -10, -196, -98, 87, -66, -129, -106]
3137a06k0K03j02K9J26ok21k71L17nk9%r6L41j73k6n5l5K07l68L98rm09L30o9
3162d9R7j28L2K86j53k34K43q1n4M1j76J77l2K38n64L12J8r9k5Q9K98j8o22K87
3186a17lK10k46J97J3k35J35n6K27Q8k41j35k4J87K93l78q2J72j46J25K10J34
3208C28k52k33J68n3N7l0j52J31K29l18K30L4j02j40K30pj39L0J0J22l8k47j11
3231b53K98j6j18K91k12L41k98l70O46n63J05N4o7J04m0k32M29J58m17j7J2L50
3253A85l4o4K0J85m19J01Q3k5m1O6p7J75k45j83M06N8j8l2k45J45J54n94M02J42
3277A45j76n2J06oK07k91K2J92Q8l83J52j87Q4J30O2k61J85j18j80L24qP8K2n05
3301c70N79j02j41m9J17l13L27n2N4J13j65K26j92J6O0k02K79k5j99J53j05R4
$$ y = [-106, -126, 77, -25, 4, 130, 124, -97, -368, -51, -56, -85, -85, -181, 160, -13, -39, -94, -129, 78, -290, 108, 99, -310, 20, -49, 48, -80, -48, 238, 85, -149, 94, 13, -41, 0, -176, 1, -31, 207, -357, -45, -27, -126, -151, -62, 236, 218, -404, -117, -120, 90, -156, 41, 54, -181, -46, -102, 125, 213, -28, -163, -187, 0, 293, -85, -167, 5, -141, -16, 194, 328, 76, -157, 11, -42, 15, -15, -167, -36, 193, -125, 105, 139, 37, -103, 127, 120, -19, 11, 21, 143, 105, -142, -253, 45, 29, -89, 202, -10, 331, 33, -337, 309, -254, -149, -95, -162, -58, -98, -330, 99, 257, -160, -177, -165, 185, 151, 87, 107, 292, -127, -26, 57, 32, -9, 57, -20, 155, -90, -273, 133, 191, 173, 141, -104, 41, 195, -399, 3, 145, -31, -83, 23, 17, 224, -67, -45, 147, 235, -148, 4, -183, -99, 31, 93, -168, 17, -101, -281, 43, 35, 113, 135, -370, 209, 107, -34, -83, 34, -279, 48, -4, 50, 163, -2, 224, 32, 48, 108, -94, 185, 160, -39, 114, 9, 103]
3323A03j91O1P1J40J74l11K5O8l17J98J06nk32q0K65m9o7k5j19K66k32k8K26J49
3347A96j13j51O9J5M35n71J35j64O0k8mK51o0Q4l9J7j45L1k57J55K12l19K34o6
3371b3O2Q1k68J68j16j01J49J61j66J18k5J60j52k26J28j35J76O2k28J8L86k07
3393B2K64n16K91j59j28K33l2J35R6m93K34L27r0r2l57K22j8O8m8K78j60j06l1
3416f0PN9O0j80M18k13K6j45j28j13L56l44J58qL68q63M54oj16N73k17m95M54
3439D5L90o60Q32m44l95M43j15J48o02j61J196q74L66k16P15o88L07o7l88O12
3459D44j617J202m38l39P70o19Q64l9k26K71p58N24R27l35J08o81k65O23l58L05
3479C63m71j56K96p4M7q1K69n50P11o13N32j33k46J01J87j45k1L05k26M4l0m6
$$ y = [103, -88, -27, 44, 184, 358, 47, 72, 140, -177, 21, 127, 122, -110, -190, 75, 26, -41, -66, -185, 81, -151, -179, 47, 196, 83, -68, 1, 16, 451, -120, 15, -149, -89, -117, -121, 130, 70, 154, 115, 132, -13, 18, -239, -84, 128, -191, 43, -23, 39, 120, -148, 20, -96, -197, -48, 113, -53, 65, 40, 200, 48, -178, -50, -185, -9, 53, -175, -157, 229, 22, 286, -230, 61, -98, -226, 7, -25, 110, 206, -287, -53, 274, 184, 92, -265, -43, -61, 7, -41, 237, 77, -29, -60, -53, 6, 66, -114, 304, 91, 117, -28, -156, -269, 87, -257, -99, -107, 261, -602, -148, -154, -270, 303, 86, -409, 45, 435, -225, 607, 163, -232, 211, 96, 244, -358, -519, 677, -197, 169, -47, 668, -20, 287, 220, -168, 444, -1173, 29, -409, -748, 22, -597, 267, 228, 2, 273, -485, 39, 966, 631, 739, 58, -207, 416, 58, 363, -108, -264, 32, -42, 5, -76, 193, -357, 354, -259, 273, 140, -106, -5, 182, 37, 16, 321, 95, 139, 109, 63]
3501F3l97M81o6m7k8K11O3L50o24R5J13l42J36K15j71J48k82M77n33l47M15Lj27
3524a94l3O1J44J30j81Q2MM3J33l31l3L02l37q3J0K09J96k60M9L42l1l16J19n3
3548b8J87j54o8K37k14j25j28L96O3k90K04q4J81Jj76m1K41j26j70K69j67J18
3570A26J57m46q6L34k12M11j68qj88n9J2p8K22O5L8k74J38j02J52J69k68J53k6
3593F2q1j00jJ10j2q4J16J89j87l4q2J85J18QQ8j29j20Q3j22j51L35K1k86J23
3617D9J30j24k21K93k60M57l83J54qj69j62L63J07mj94j28Q1n8J76j42Q9k36K03
3640A3j26q1l6M04j14L23k78m04K30K98M2q0n0l45QL99k35k53N56l40J87J59l43
3663f6Q0k42J20K21K3j8J4n4M3k00K57j97r9L55j90M4N8k8L0j80J70k29j10M09
$$ y = [63, -334, 147, 81, 34, 6, 217, 280, 630, 6, 101, 214, -128, 8, 223, 52, 200, -82, 395, -138, -485, -70, -67, -194, -227, -166, -22, 108, -73, 9, 13, 56, 189, -142, -175, 127, -210, -293, -283, -74, 122, -138, -89, 253, 222, -94, 25, -28, 159, 5, -63, 174, -40, -165, -293, 103, 166, -124, 80, -4, 177, 178, 2, -39, 202, 76, -94, 175, 8, 126, 283, -163, -249, 85, -127, 284, 116, 108, -80, -139, -127, -205, 17, 82, 120, -154, -16, -118, 34, 203, -65, 88, 62, -19, -119, -120, -10, -22, -106, 10, 199, 12, -22, -104, 81, 199, 207, 295, 166, 46, 129, 7, -144, 191, 212, -74, 49, 179, 55, -166, 127, -133, 324, -59, 95, 87, -82, -244, 119, 226, 222, 28, -100, -19, -77, 99, -43, 46, -190, 13, -113, -194, -230, 174, 60, 383, 105, -299, -69, 229, 271, 191, 141, -204, -196, 203, -32, -285, 271, -69, 118, 277, -66, 14, -228, -108, 113, 136, 118, 132, 78, 121, -79, 178, -19, -118, 237, 47, 91, 149, 121, 151, -29, 141, -88, -198, 211]
3687B11j22k25J24l4J29q7m9M31j68l92o2K55l9J04O2k2l49J06K84K4L4k70O5
3710A0K81j00k12k96M03j01K47j79PJ33n11L20k29L62j95j15j52M34J0m9l6r3
3732f1K3J17n0QM8q7l91L65K89p0l3J26r6l26Q0J22k38J35J80l43O72n85L50k59
3756b4j53o0J89m9L47n27K09M10k98Q6k01k0M0R8l5j73K80k12K71j11k7m9j15
3779a24J89j49k0o0L9K11P3k8k50J45J68k43Q3r7N3j18N6JJ73k14K70k37P5n4
3803e8K42r1k8j79O2k9k1Q7n4Q0J11O9p4r1Pp6K18l78L15j76J00r8K06O0j13j09
3829a8m9O1M6k15J34R5j35n4M3J31k14J80o4n7k02K31K44k56k5j94L94m5j23J99
3853A07k27k16L87n8l9l1K50l83K01R1Pk06J56p7J97j42j03Q3J56j36J60k17P1
$$ y = [211, 89, -136, -12, -46, 83, -4, -53, 378, 210, -182, -244, 11, -28, 76, 138, 116, -233, -127, 157, 181, 215, -55, 10, 291, 191, -21, -317, 86, -15, 232, 53, 60, 193, -318, 2, -227, 135, -60, -175, -327, 107, 117, 68, 32, -61, -38, 79, 29, 37, 85, -2, -393, -28, 261, 191, 158, 284, 188, -138, -58, 64, -174, -39, 141, -202, 470, -115, 235, -24, -177, -237, -48, -97, 250, -277, -68, 342, 44, 130, -71, -91, -51, 47, 12, -161, 119, -93, 178, 67, 40, -9, -124, 65, -84, -104, -164, -125, 86, 159, 131, -119, 26, 194, -49, 34, -63, -10, -128, -72, -71, 102, -112, 158, -79, -4, -58, 184, 93, 65, -114, -52, -81, -102, -15, -69, 11, 122, 191, 117, 26, 33, -43, 175, -203, 112, -64, 36, -62, 144, 204, 91, -18, -67, -6, 40, -175, -41, 54, -81, -135, -92, 39, -175, 5, -59, -116, -318, -87, 157, -99, -124, -318, 76, 31, -92, 107, -120, -336, 51, -7, -46, -77, 173, -210, -9, 82, 89, -117, 39, -38, 159, 17, -86, -3, 153, 17, 177, -40, 31]
3876C1M9j9n5j4o3K20j81lR2o13O54R8N9l48J24M7K8m5r7J46k63L09o19M63L9
3901C9p7l9pJ70j24j45J53j03J52%j2M8JP8k79J81l07J39J31J54l64M55l41K10
3925A13k69K55K3j34K58k31j7j12K12q0jo9J47l16K60q3J46j21J79l78L72k74
3947a20R9J88j24l9r0o4k1j34L42p2J67P0l58J08O6j11J72o2o3N6L56n03jL16
3971A78j01j00L5j86J16J65q8K24l87O1P9k5l00J36J85K5K43k38k29J7K95k39
3993a34K08j30K14j28m6rO5M5j2J27m83M29j03R1j06k14L97j33k96J6L35j30Q8
4016I1o6j82r0M0J70K19o24M17J06mN8j56k08O8J70p0k93L52k1R2j9k02N24k51
4040A21j69R7J23K8j54J07l59L28j82K56J4j96j41Q1J57j52o7r%m5K19j53J91
$$ y = [31, 80, 61, 6, -8, -71, 149, -32, -35, 57, -556, 98, 196, 255, -93, 31, 78, 106, 61, -36, 110, -153, 156, -463, 0, 39, -38, -77, -84, 86, -38, -183, -30, -133, 19, 19, 7, 55, 56, 134, -145, 36, -271, -132, -1, 153, -211, 244, -97, 113, -156, 99, 122, -12, 246, 15, -2, -114, 98, 18, 17, -52, 95, -221, 39, -44, 102, -19, 160, -218, 154, -120, -21, 167, 43, 4, -86, -150, -171, -305, 37, -35, 132, 202, -156, -48, 18, -93, 79, 17, -46, 10, 366, -137, -138, 178, 77, -23, 12, -174, -58, 107, 19, 243, -144, -83, -4, -29, -329, -193, -8, 17, 260, 22, -207, -190, 105, -134, 74, -56, 158, 30, -16, -25, 40, 85, 73, 200, -283, 146, 43, 134, 28, -186, 211, 78, -218, -202, 133, 3, 91, 25, -157, -247, -207, -37, 182, -442, -25, 81, 77, 135, -21, -229, -161, 9, -61, -354, -2, -23, 69, 50, -152, 372, 121, -48, 49, 172, 200, 46, 153, -206, 122, -60, 196, 210, 14, -127, -46, 111, -41, -108, -117, -117, -162, 57, -96, 95]
4063I5j02j6J04R2l05J89l4m4k7l2k5p5K96l68L40j23l15L34L24j1k61j71L06
4086A71j02Q5j81J48j91j12j72M84k25J9J61k7N6j53R0J55j60l63K95j52M30j1
4108B45k13q8j33Q5o0N9m2J89l66M56l50K29o6R4o2j69P0J19O4k46R5M3j46K3
4132a70J34O1k0j04Q3J00l25K18j51K12j40l4M5n7L03m3k23m2j34L72K29l71P9
4155B2k3j70L15K09l79K1L58m58l6j29L54j58J69j46Q7n3j09Q5K21L2j34K04k64
4178A8J77k64L03l48M3j55R5N2K53q7Lj97J1P4L8q8J22j26J43k25J54J41o0j36
4202e9p8K12k50n1K47j35R6j51K68j72K26k33M3j02J86j76R7K44k78K21k60P0
4224c5J37j45j13K24mo5L8j79K79k16K28k02p4J26n6K6q1R3j86K60K6O3k33n8
$$ y = [95, -7, -23, 81, 173, -132, 57, 23, -21, -48, -80, -105, -180, 116, -252, 88, -35, -350, -16, 308, 297, 36, -135, 171, 69, 154, -27, 121, -70, -182, -354, 130, -95, -76, 85, 58, 114, -39, 51, 206, 46, -317, -22, -174, 256, 245, 32, -56, -189, -104, -164, -105, -147, 42, -324, 132, -218, 11, -55, 39, -23, -192, -122, -3, 61, -185, -90, -47, -193, -170, -36, 25, 5, -99, -16, 84, -241, -23, -174, 38, -102, -136, -91, -148, 155, 112, -111, -153, -287, 85, 314, -57, 22, -1, -171, 144, 353, -26, -5, 353, -105, -141, -270, 84, -74, 95, -51, 36, -17, -126, -41, 180, 212, 78, 282, 18, 195, -69, 234, -114, -71, -226, -131, -79, 174, 87, 90, -107, -96, -22, 16, -72, 50, -76, 67, -158, -4, 137, 77, -59, -137, 75, -175, -226, 21, -114, -18, -169, 99, -73, 153, -80, -37, -139, 47, -129, -32, 212, -66, 155, -105, -35, 102, -43, -156, 68, 64, -1, 37, -142, 137, -79, 149, -53, -127, -1, -57, -31, -112, -19, -205, 55, 81, 144, -89, -147]
4248a47N7RK07j19o1j44J49j26J66k3n3K66k19kJ49k01J11j17L17j64l15N23k35
4271B8k45M65m2l63oK54j90J70p4l3m1j81M56m70J6J88J28j24L27k69m4Q8p7j1
4295e0O4n4P1Kl6LoO2r6K25j07o0l35L23Lj75O0k05L55k42M9J71O9K2j83L3K4
4322a3j79J93l8M7j7l3l94M87j97L77k38n0J61l90L25L20q18M05J43j28k4J1K09
4345A59j19j44K95l8p2k04K17j87L3L9K93j43j58j43J55J05J24j60j50j41j9O9
4367a89J73N5J1J70n05L37j61r1J54n1K55lj31RQ4l89M94l29Q0j29l5K18j45J03
4391a5J6K1J14j90qK65j46k46M24l70J9L00J24m31O8k3J26p0j06K37J5K05l27
4414BK51l22J42N7j28o4K96m35L17p6j21Q0j83L66j49q3J55j65nMj10K39k25K34
$$ y = [-147, -90, -81, 126, 7, -54, -198, -49, -175, -9, -32, -85, 181, -38, -40, 109, -92, 19, -98, 219, 55, -260, 263, 28, -217, 248, 206, -157, -163, 91, -99, 71, -3, -36, -77, -258, 198, -272, -256, -68, 60, -64, 263, -6, -50, 38, -39, -50, 14, -40, 31, 33, -3, 0, -6, 56, -40, 185, 78, 18, -317, 6, 9, -166, -106, -311, 44, -198, -149, 22, 91, 113, -70, -37, -13, -192, 1, -37, 10, -7, -40, -434, 53, -144, 233, -5, -55, 106, -284, 41, 361, -457, -52, 91, -37, -61, -50, 159, 40, -104, 191, 153, 81, -123, 94, -93, -60, -21, 272, 129, -29, -172, -17, 88, 212, 52, -98, -239, -258, -189, -16, 39, 50, 220, -285, 52, -109, -200, -46, -97, 158, 155, 24, 33, 117, -272, 222, -107, -27, -156, -191, 27, -118, -15, 1, 22, 136, -54, -62, 203, 57, -189, 235, -135, -116, 184, 308, -123, -55, -78, 48, -22, -128, 109, 124, 329, 2, 253, -69, 73, 130, 2, -62, 234, -201, 116, 40, -81, -1, -184, 182, 33, -50, 105, -60, -65, -61, -171, 68, -157, 77]
4438G7q6n1K84J08n29j97M81jm84L92N7k19J9K83O9k46M3kN7j08J36j74j5j32
4462b38M58k91J77l84L10r5m1rJ43k55J24N5j24R5K17k5O9k24p2Q8P1p8j21L37
4486A87j88k21K53o9j16LL9J14Q2j77K87l26j11M92j98j48J68j30J53Q6l53K49
4508G6k10M71k31k2%K9J23m35L97m89J38M4J79l5NK03l08j0L3J14k06J34J0J05
4532A15k23J70j60J11J34l9K9k11Q5J24l23M16n02K00J86n9J14j60J15p1o8K7
4554A0j6n7J57l8n9P0Po7l25L02N6n9j44M10k58m7J27J92m54o3L94J51l76J52
4578F5j83NJ72j69l2J21N9J66q2Jk69J09p9k14L46P6q5j33J77J01k29K9o4N3j21
4603a80M19m07K17j46R3J35j3k98K12q8R2Ok6j07j8O5N0j37J00K26k59l9K53J12
$$ y = [77, -9, -60, 224, 332, -197, -394, 87, 86, -398, -6, 51, -168, -149, 134, 203, -43, 0, -2, 55, -53, 83, -91, -106, -238, 220, -71, 106, -278, 32, -63, -104, -113, 30, -225, -101, -46, -170, -75, 142, 117, 186, -38, -110, -22, 49, -29, -150, 187, -1, -222, 31, -38, -154, -151, -112, 2, 84, -93, 194, -132, -243, 249, 51, -97, 71, -59, 94, 180, -173, 76, -134, 337, 106, 84, 84, 113, 236, -199, 198, -291, -153, -109, 70, 35, 40, 243, -65, -75, -42, 72, -134, 0, 10, 115, -108, 62, -98, 13, 147, 108, 137, -74, 11, 135, -188, 228, -274, -74, 112, 53, 167, 7, 122, 51, -17, 10, -6, -63, 94, 56, -3, 67, 74, 7, -318, -16, 40, -19, -163, 247, -11, -58, 69, 261, -193, -256, 138, 289, -87, 65, -118, -113, 59, -110, -142, -21, 38, 204, 122, 123, -146, -37, -116, -330, 16, 92, 7, -126, 51, 152, -77, -48, -112, -59, -180, 239, -168, 49, -97, -4, 131, 118, -180, 32, -56, 36, 42, 16, -91, -109, -44, 6, -131, -31, 195, -64, -103, 150, 262]
4627B62n54L77l4m2O7m89K95M37l64L6J36k51K53l31K52j68m0J76j74K53l35j07
4649c45M6N21k92L28l51J35j02j90J29M81o08k1J15K83N3k93J52j63Q0J23J71
4670B52m17J46J59j42J72j07k15O1k2R1p5K57j18j52L25k65K1LP9q6l1J59N2P1
4694B18p9j90K68k21L5j67J28L1l3j46L31N8k23J35j86j23K78k63p3K63l7J36
4716A40p3j15N8O5K8K65l42m5M9K0L5l18M82l85j12J53k78N18j99m8L1J54J18
4739B01k92Ql3m7K07o6Q6j69J03jl0R2J46j52l5j38K06j52J52J7k33k41L95K34
4763B58r5mj6o1J44j69l2K23l36J77k07K5J05n3N7J08J66m50R9l9K00q9Q4j38
4787d3j82K50k81L27M9n3j99L10l65%M62k37k53K58k7J2k25J14k81M43r1O1j35
$$ y = [262, -292, 85, 51, 9, 76, -413, -118, 319, -45, -9, 127, -124, 129, -202, 50, -118, -158, 18, -156, 97, -238, -345, -299, 222, -70, 258, -93, 42, -60, -250, -121, 360, -248, -269, -154, 129, 182, -111, 41, -122, -42, 81, 252, -165, -19, 140, -2, 170, 63, -152, -91, -113, -22, -97, 160, 42, -110, 215, -50, -29, -26, 53, -33, -64, 95, 147, 218, 139, -51, 217, -4, 31, -136, -8, 23, -10, -156, 175, 233, 10, 145, -41, -164, 114, -149, -222, 41, 4, 140, 67, -48, 10, 75, 103, 368, 26, -19, 30, 50, 85, -233, 249, -136, -248, -95, -373, 145, -54, -102, -71, 83, 201, -91, -83, -116, -163, 44, -22, 64, -105, -2, -3, -33, 59, 205, 53, 18, -120, 86, -66, 86, 103, -130, -371, 24, 258, 163, 159, 143, 82, 226, 57, 25, 248, -88, 89, -118, -93, 12, -41, 16, 124, 290, -160, -61, -100, 100, 11, 95, -43, -225, 25, -256, 71, 120, 67, -132, 178, -187, -187, 275, 38, -215, 43, 16, 28, -197, -83, -364, 79, -12, 49, -86]
4810h6J26K3R3j01M5N2k35J14r5m7K6j26L75l36J84k06J82K60qj94l32K15K94
4833B23p62N23O6k92L39J69j28k26j2P2J24O8o1j24N9Q2j3p2P2j90K76j51l46
4856c04J79J60k41J94P8m97L10J45k48L95m56J63J52K3j58j40J50K03J1k59J95
4877E5l48K09J55j05O9j3J87J32k40j12j31J62J1n2j52pO5K74K8Qk14N8Q4J29
4901B52j1j59j35k50J28K18M9j33r1P5Q8J60j83k8K52k96K09j66K26K2n90L97
4923C4mj56J26j07R9m5l7M8p5J15m2K36l54M18m59K34K06j72k87K98L5n3J48j23
4947H3K09m43j29L05p0J32J58k34P1j42J58n9p4j65J97k9N3j78L0L10k35J73l3
4970H8l3o0p9oK76k66J24Mm2p5j11J61ol0q2K2J86j60n7K47j25j5K49j99J13k95
$$ y = [-86, 40, 63, 156, 55, 100, 152, -83, 31, -64, -111, -85, -211, 164, -172, 12, -194, -12, 248, 240, 46, -286, -71, 223, -539, -16, 50, -242, 97, 266, 138, -88, -100, -28, 96, 164, 103, -21, 38, 120, 107, 35, 107, -83, 193, 42, -304, -125, 35, -206, -12, 66, -431, -121, 24, -224, 171, -285, -122, 30, 53, -105, -245, -95, 108, 119, -140, 55, -293, -84, 71, -34, 35, 22, 209, 341, 101, -11, -142, 20, 31, -21, -173, -180, -115, 159, 187, 195, -19, 39, 123, 252, 241, 82, -53, -303, -175, 43, 92, -41, -132, -57, 31, 191, 8, -20, 232, -64, 145, -21, 205, 227, -363, 34, 30, -126, 0, -107, -8, -53, -90, -42, -117, -2, -44, 192, -162, 256, -203, 31, 237, 65, -222, 76, 111, 58, 206, 83, 292, -151, -280, 25, -45, 87, 245, 11, 82, -60, 98, 39, -35, -200, -3, -32, 21, -157, -127, 183, -52, 121, 88, 55, -5, -84, -90, 186, -80, 44, 48, 6, -69, -180, -19, -25, -55, -137, -115, 71, -89, -146, 101, -24, -39, 210, 11, 124, -171]
4996a71L91j17p4j53K34k29r5L08Q3q8l16J55J08k73M71J02k81n6j40L35k67o6
5018a39j0K29j02n7J27n5K14j79J76l73K3k5L10r1p1P8l77L75p4J32j28N9kj12
5042g2K17l28R5M06k88q0K56j45p3p3J51l62M73l20K46j40M58m90K28Kk60j2J84
5065G3j53m2j45L08k0j73k8L63r2n6m14K36J49K3J50l44L2Q2j47L73k96j6J78
5088D1O9J56l53jK08l33K95J55m96nK04J49k13N17m71M18m55k90J099o81M5Q13
5110H71j352R05l19K71k69j52J44l6J43n4j23j29J36j60L8J45J58j80J96K3k03
5131E3k58K67P5L5P7j53L2k60J42K42j98J26J41k99N8k26J99Jl74L18m4L4J91
5154A79k61L56m20O3K58l93L38j40K11k5M7j63Q9k69j2Q3j51M8K45q6L35m73M8
$$ y = [-171, 220, 103, 29, -124, 110, -119, -214, 94, 177, 89, -227, -72, 36, -237, 234, 336, 55, -1, -141, 194, -73, -139, -149, 80, -22, -79, 48, -7, 207, 28, 204, -169, -146, -171, 139, 48, -23, 55, -322, 53, -21, 111, -17, 42, 40, -72, 145, -183, -88, 318, 30, -50, 206, 61, -12, -85, 66, -296, 177, -143, 103, -37, 421, -69, 159, 161, -99, -111, 73, -80, -122, -267, 41, 21, -152, -180, 183, 91, 35, -379, -143, 6, 29, 179, -165, -133, -51, -198, 175, -121, -137, 41, 110, 266, -87, -88, 120, -213, 82, 237, -259, -264, -60, 89, -124, 393, -78, 340, -115, -405, 694, 13, 58, 871, -481, 424, 105, 376, 107, -45, 99, 63, 206, 152, 29, -100, 36, -124, -86, 59, 217, 37, 233, 256, 53, -205, 62, 137, 172, 249, 96, 128, -132, 10, 252, 54, 180, 321, 22, 80, -146, 53, 54, -320, -2, -46, -12, 179, -82, 274, -146, -83, 175, -218, 120, -20, 191, 166, 213, 50, 139, -130, -142, -59, -210, -162, 83, -3, 332, -141, -93]
5177i3M0K0J98n7l33K71P8l06RJ71L1jp6Pj92O85l51q60J799q40m78J91J99j16
5201dL50j58J40m47J65l6J34n4o0P5j96L66n74L77n4n40M11K04M7k91K3j05M8
5224a79K31J91j47J83j44k80M32l65O7j0R7r4J75j86l3J4o0oM95l13L92m33M1
5247F8k34K1J13k38M75m46L03l24O6M54j61r7Rk70K88j44J51K5k11O7K3J24J1
5270G3R0j04j01R9j04L52m20L65m3m18k3K30J04P8J31l59J8L1o5r0k3k7J28J80
5294A02o7j05M0K85k29L4n8ON3j86M2J80j38K06j52L2k69m5J32N7Q1J46j85j57
5318a95L96m34L65k4rk14n3j8J39p2r4K68n2k5j89K30J52J14o5k86n1J8J85j72
5342h6L08n64K77k1K04l88j18K57j4L57q9l54J70r0P6L41k81N9N8O2j48j78o7
$$ y = [-93, -53, -33, 165, 108, -225, 46, 124, -182, -173, -2, 29, 28, -48, -41, -233, 452, 101, -759, 1040, 200, -278, -87, 112, -4, 346, 188, 328, -119, 46, 10, 144, 90, 30, 105, -91, 275, -299, 78, 24, -516, -105, 99, 146, -145, -122, -227, -179, 52, 243, 96, 279, 135, -145, 287, -78, -11, -21, 76, -18, 157, -29, -62, -48, -108, -114, 381, 68, 460, 27, 68, -166, -145, -32, -270, 205, -241, 62, -262, -196, 258, 97, 0, 9, -261, 27, -117, 34, 59, -152, -85, -62, 62, 73, 163, 59, -42, 57, -47, 305, -115, 250, 207, -211, -234, -4, 100, 178, 309, -50, -32, -1, -66, -156, -179, -206, -78, 102, 35, -70, -30, 255, 26, 60, 2, 8, 61, -125, -83, 97, -41, 165, 13, 45, -224, -269, -137, -80, 1, 147, -38, -195, 201, -233, 132, 108, 99, -115, -168, -186, -47, -119, -213, 55, 3, -22, -211, 19, 171, 285, 220, -66, -117, -99, 86, -86, 222, -342, -65, -86, 118, -270, -388, -131, -145, 212, 123, -231, -61, -151, -75, 266, -15, 44, 102, 164, 16, -162, -229]
5365b29K87K2j53j07P1r5N04j94j90Q2j02L14n46M31l6J85m03j66M74l64L24P
5387A16k58j26L42r9K01J1r6P0Kk56L12l63Q7J09j00n7K2p0K52j55J22m7K43j25
5411A37m0k58M38j42p7Q5l53J97M6K07m09J40J18j56j26J41J16j98K69J57m39
5432a47N8JK80j43l61L58k71M07l43J48j35O0J32j30J93j23o8J1J06k25K34N9
5454A01l86N77k55K15l09J12l24M35m4k31P3qJ82M8k46J47P5l69J21Q5m4J4r5
5477a26R6J08j5j11J03m5J48k50L21m68L72m4l39L81j6k07L8Q4k04K56P2k13R
5500e0Mj06JJ30k8j67K78O7k8m1J83K20n44K26l41K56k48L37l27J59J09j70M94
5523D14o21M9M45k78j4m0K8P3k24p1L84l8k88J01Q4J72J1j87L1j13K52k18j04
$$ y = [-229, 58, 80, -73, -180, -109, -204, 300, 106, -84, -2, -104, 210, -336, 95, 59, 244, -159, -325, 149, -215, 109, 116, -142, -268, 74, -25, 176, 187, 91, 161, 163, -93, 219, -144, -57, 52, -48, -105, -83, -153, 99, -56, 66, 19, 262, 137, 97, -161, 277, 135, 58, 143, -210, -13, 33, 240, -169, -29, 89, -67, -193, -52, 64, -134, 135, 292, -147, -89, -88, 192, 49, -312, 46, -225, 182, -161, -13, -148, -88, 44, -86, 107, -16, -84, -73, 33, -192, 42, 101, -285, 292, 37, 252, -57, 55, -269, 166, 122, -109, -36, -44, 138, 186, -60, 87, 162, -207, -86, -1, -45, -31, -126, -30, 78, 63, -48, 55, 10, 158, -92, 229, -239, 133, 89, -250, 131, 115, -92, -54, 30, -174, 82, 154, -59, -50, -46, -152, -151, -21, -49, -216, 62, 129, 101, 60, 243, 463, -81, 145, -196, 60, -188, 149, -178, -19, 90, -80, 414, -207, -158, 287, 9, -5, -45, -17, 56, -168, -239, 145, 107, -181, -80, 4, 176, 187, 0, 31, -82, 170, -48, -152]
5546a52k4K45O8j41K13m47L43j03K07k87R9J27j25k55K72L01k65p6J4o0M18n01
5568a29r0L23n1K58l27J05P8j46J10j22O5j68K51j86J75j94R4k13L92o01L84k6
5590a8J23J3n28N69l14K90k87J53J87j20o7J60n11M83K1J11l55K19j95M2Ok90
5612c08L35L0l2L1L9K5k22K62p5l41J54j67N18n41O43m37m2p5L11R7l61J10J30
5635H4m0K03l69L03q9j72J53k7m9k17J80L4K43k89J33lk54J69J42j86J77p1j59
5658a04k91M46l96L8K49J74j13j28o1K34o1j51L19l80J28k35J76J5L15l20O2K26
5680A42k54k21N4J11Q1n7J97R7k43N0J83m2k73L45l94M42l26k18K60J17l9k4J04
5703I2k85K17m2n5J05l3k02M35k56Q2M9k00j59J89J91j71J74j86K23l71J27O3
$$ y = [-152, -176, 69, 137, -4, 209, -238, 105, 2, 209, -78, 21, 148, 23, -232, 40, 341, 76, 0, 14, -46, 372, -129, -219, 104, 53, 311, -16, 89, 167, 21, 131, 9, 74, -94, 157, -29, 146, -48, 46, -167, 225, -376, 8, -18, 105, 118, -410, 159, -155, 135, -152, 1, 188, 68, 1, 161, -350, 133, 154, 265, -90, 129, -66, -24, -18, -308, 27, 57, 25, 56, 95, 120, -102, 160, 85, -256, -102, -269, 249, -292, 351, -86, -128, -203, 108, 205, -156, -46, 84, 44, 247, -122, 181, 92, -80, 73, 46, -3, -220, -40, -6, 237, -52, 81, 78, -176, -7, 135, -51, 126, 55, -104, -395, 51, -345, -307, -58, 116, 3, -125, -186, 48, -13, -164, 155, -225, -97, -332, -156, -141, 174, -146, -84, 142, -112, -333, -279, -168, -87, -144, 53, 150, -93, -43, 140, 98, -175, 170, -224, 218, -108, -326, -66, 51, 12, -12, 92, -193, 24, -18, -73, 32, -1, -203, 232, -24, 58, 107, -93, -252, -63, 128, -43, 131, -55, 168, -203, -76, -13]
5725a3P7N3q6J07k63J42j67K74K1k10K64j95q7j13O50n49O2P4n4j8j34m8J89J21
5749I7r5J49r5j01J17j22n8J96l4j64J15K28k23p6J30R3k36M8L7R1j37J41J16
5772B17r4j85L81m63K21J77l63J97Q2m7p1j80o6J96j01o3O5J38K09l95K83N8j88
5795Hk2M1L02k60lj70J25l2m4k03M27k10J30p6j72M30l67J82k55K89l13K30N5
5818I2P9k62K1j6L51n72M74l34J36N8k27J95k11K75k36M20k20k6l8j11J49k4n0
5841g7j86J40Q7M5j20o0K3J34l05M54m0l3k07J05j00J70j65NK15j62Q8o0j10K87
5865A28l2r8J58j70n8K58j62j61M7L6k08K40N2j94O8J47q4k86L05J6P4j80L1j03
5889a76K71l60L92l5j18J1J96j37K62m28L46q0k51n9J29m36N24n2J95k87k8k09
$$ y = [-13, 64, 117, 31, 138, -125, 17, -150, 124, 145, -65, 199, 4, -83, -196, 454, -95, -33, 41, -13, -31, -165, -213, -24, 97, 2, 151, 56, -45, 72, -50, -108, 88, 54, -110, 5, 233, 10, -66, 64, 157, -79, -31, 6, 97, -40, 101, 217, 123, -62, 319, -144, 77, 254, -109, 88, 170, 123, 52, -128, -194, 2, -99, -162, -97, 41, 250, -145, 138, 196, 8, -14, 27, 329, 69, 66, -104, 21, -11, -55, -258, 169, -41, 89, 13, -159, 271, -96, 86, -169, 120, -193, 37, 92, 171, -91, -70, -86, 265, -307, 167, -167, -31, 27, -200, -5, -216, 59, -177, 243, 23, -3, -41, -152, -3, -27, -77, -263, -123, -36, 9, -111, -171, -148, -14, -319, 135, 95, 62, -145, -40, -140, 30, -135, -130, 85, -77, 11, -49, -159, 128, 96, -2, 156, -14, -72, 186, 24, -137, -90, -54, -262, -22, 30, -164, -96, 51, -33, -319, -14, 2, 76, -104, -73, -176, 95, -265, 127, 92, -26, -15, 181, 44, 306, -122, 224, 144, -107, -166, -37, -473, 51, -1, 194, -93, -121, -330]
5911c30N25l68K79J7j66r8K24r0k65K88j05k09L15K29m06n3M07j78n6j43K50J28
5933A95l9j63K95j45j31m8J34k61J20K29n19K13K91k30K00m34K48%J40j59J97
5954A33r4r2j14L13l61j77L48q5R3J5J43l21J69J33k39M4J26k40r2O91k41j43
5976Iq5k6P3j00L3kJ3J32J48p9j39J44j52q9o0N44k63l43J21J85K12m58k4L75
6000A69l67J93O4k05p7L56j83j10L59q8P0K6m44J14J78P7k31M8l5O7M3R3n2L39
6024D04l83m7l03K94R4j51K01k05K20J7j77q7m8n0K04k0j28M3K52j01J93j36k29
6047a43J07J89j81J9P7r0p4K42j86m5K5LPJ05j32l7NL59l82M8l0L75k59r2K86
6072A96J26l11o9J3q6J4j42Q7L86j60j57K37j26j28j27J47P0J03l7j0k02J15j30
$$ y = [-330, 195, -173, 106, 123, -43, -141, 83, -7, -272, 16, -89, -298, 17, 246, -160, -213, 194, 16, -40, -183, 67, 195, 156, -7, 288, 143, 12, -36, 98, -163, -43, 186, -333, -120, 171, -59, 141, -293, -45, -45, 95, -64, 133, 39, -53, -167, 146, -215, -392, -44, -129, -36, -21, 122, -199, -30, 103, -136, -92, 34, -206, -298, 393, 152, 9, -76, -102, -29, -129, -96, -98, -85, 47, 195, 116, -23, 121, -31, -120, -180, 364, 101, -242, -121, 64, 276, -182, -206, 169, -198, -5, 59, -146, -223, 133, -50, -160, 199, 111, 181, 207, -237, -123, 55, 132, -99, -51, -86, -19, 24, 117, 65, 404, 21, -26, -329, -35, 59, -92, 109, -96, 124, 141, -36, -123, -171, -221, -17, -37, -165, -122, 130, 29, 222, 86, -143, -36, 153, -28, -9, 68, -22, -96, 146, -40, -85, -60, -57, -50, 55, -77, -114, -109, 250, -132, -84, -114, 261, 2, -90, 196, 322, 11, -58, -45, -131, -117, -259, -172, 214, 54, -103, 134, 8, -120, -247, -100, -30, 73, 36, 26, -176, -61, -191]
6095a91JL28l60L60m25L64n2R6j18k13L18P2k04J74P7k13j35J13j06J67k22J25
6117d4K39j23j15k5n3q4K06J49j76k55N22p4k02K06k44o8m3j08L19j83L11l39
6139a84K44J92k69j85Q9K32q1l50J27K7J47N1j51K05l91K03n8K22j18k10L85L6
6161A63k40R0o1K9N9m0J57j08P2k78K87k90p0M72l22k46K87K11j94j00k1J94N2
6184A03l03K87K98l73jk57J38L01k47JK5J85q9o0r5K15k24K5J84j52j66J56K20
6207A71k40l6J60j68O7J18J35m63K68j50N6k02L22j6P5k7j36J57J22m05J31K80
6229B19jJ07m44L59p6k90O0j86K41K0j6J01j59J59l71K23N7j63J18m6J82O3k0
6252A37k72o7J63J22J65l17r1J90K70k40O7k15O4n9J35k10J78k38K70l38J36J00
$$ y = [-191, -190, 138, -222, 138, -287, 77, 25, 121, 3, -210, 108, 180, -24, 150, 227, 14, -121, -8, -114, 53, -169, -44, 195, 72, -43, -68, -121, -205, 1, 150, -26, -281, 241, 167, -35, 171, -73, -141, -184, -292, 27, -156, 155, -184, 60, 252, -17, -202, -113, 119, 38, -312, -185, -158, -11, 40, -111, 94, -297, -94, -152, 70, -48, -258, 127, 163, -77, 13, -48, -19, 40, 0, 157, 49, 121, -157, 130, -160, -230, 242, -80, -326, -39, 172, -22, -122, -143, 51, 103, -200, 87, 385, 12, 11, -246, -108, 193, -54, -53, -28, 157, 68, 8, -87, 128, -96, -71, 113, -39, -205, -49, 171, -69, -105, 55, -113, -46, 72, 207, -256, 12, -138, -82, -284, 38, 22, 97, 70, -66, 91, 213, -192, -61, 219, 218, 325, -119, 240, 164, -126, -66, -252, -11, 9, -7, 94, -65, 94, -277, -54, 3, -160, -42, -88, 94, 157, 137, -135, -202, -39, 83, 248, -69, -160, 30, 300, 60, 127, -88, -24, -83, 52, -158, 20, -218, 52, -286, -150, -50]
6274e0R3l9k07L56q6l52K18j14J24J05K21k17j11J68j8Jl10K65J30l80K13K6o8
6297c2J65k33R7J4k50K25q2K89j86p2j02K06J7n29M49K94l79mJm5K53L9j9l8j31
6322e3J25m6k39M87k37j28q6R2J09J01K09l17n1Q6j90K85r3K3K0j63J21m0j93
6345a78J14n7K58k93o9K67p5q2l0N5L20k40N3K65k66o1P8J24J9J09l66L31p71
6368d95N40L1j63J73j70j07Q9K06j37R0q3J98l1j23j57K08N8l9l2mQ1M9l45m2
6392b05K66k30K34j58NJ66m5j3J40j93J44q8j40J13J29k57J7J92j43J8rj13r8
6415b68L35o2jj76J28m7j57R4J18j73Q7M28k28j77J11J46k61M11k08j86J39M1
6437I4n5J04j40j29qJ88J82k23J50J4k20J80j89J51l98J41LJ13M8k23L56k31k19
$$ y = [-50, 43, 4, -203, 153, 67, -285, -67, -181, -57, 48, 269, 52, -59, 109, 91, 92, -218, 47, 177, -203, 10, 36, -32, 133, -100, -3, 11, -239, -14, -96, 193, 7, -65, -167, 39, 56, -473, -24, 270, -109, -113, -112, -157, 96, 135, 116, 78, -53, 72, 26, -213, 274, 37, -91, -177, -85, 24, 125, 334, 17, -34, 52, -138, 147, 54, 77, 97, -66, 55, 15, -178, -64, -121, 137, -156, -225, 42, -33, -115, -145, -90, 230, -10, 43, 308, 42, -19, 59, 183, 202, 311, -55, 276, -495, 45, 76, -87, 86, -84, -191, -102, 104, -33, 57, -26, 172, 141, 18, -139, 69, 127, 88, 56, 52, 133, 182, -163, -205, 61, -169, 65, -93, -88, 78, 33, 20, 160, -33, 111, 23, -117, -4, 125, -132, -115, 77, -66, -48, -57, -170, -268, 67, 5, 4, -172, -44, -91, -248, -154, -36, -209, -122, 306, 78, -99, 12, 158, -103, 308, 100, -86, 53, 94, 39, 143, 3, -126, -134, 54, 236, 13, 163, 177, -43, 137, -52, 99, -299, -158, -155, -42, 6, -217, 139, -92, -311]
6460c11J31r6M09ln2M1k28J18j2J46j83j52N12l75j84K89o4J65k48K04k26K00
6482H1j47j39J83M8k61J89Q8q1R3J03k03J0k03P13o92M85K03n33k11K92J70j15
6504G3k70L23K84J19J60j71j46j014L04J084j390J79k79N79m76K55Q95j595P72
6523c14n1O96l4K95k44rK38j389O8K18R16k85j26j45p7j0j99N14m01P32m98o8
6545a73J0qK73q4J33k16N8J00l68K38K76o73L13p7J58q1J70k32P3L13J07j4o07
6568c11k15Q29j10l25Ln6Q45j082Q68o50J65L98j47m85N29m01m38N69j20O1M23
6589C50j463J098l5k28J065n72M39j131L32l44P63l33M40n97M20l04j34L85M0
6608A91J2j30Q7n83L09L60l28J08n46L41K21r4J28l24M18j02r4j4J92K2k55K65
$$ y = [-311, -180, -276, 133, 130, 78, 119, -109, 9, -3, 143, -40, -192, 320, -55, -239, 50, -14, 151, -97, 107, -119, 81, -66, -205, -22, 26, -235, -46, 42, -39, 54, 157, -46, -36, -239, 474, -218, 267, 470, -63, -274, 18, 188, 73, -197, 126, 410, 529, 689, 518, 372, -642, -338, 746, -644, -465, -744, -165, -641, -386, 509, -1086, -314, -365, 331, 297, 592, 348, 339, 577, -812, -744, -526, 390, 105, -21, -166, -243, -253, -452, 62, -339, 393, -105, -173, -163, -171, 102, 18, 151, -65, -7, 93, -275, -37, 239, -434, -121, -198, -40, -121, 49, -183, -110, 203, 310, 296, -311, -526, 303, 193, -132, -129, -185, 660, -422, 446, -204, -39, 359, 212, -273, 256, -145, -583, -14, -134, -73, 350, -1113, -15, -50, -278, 787, 215, 654, -477, -145, -489, 274, -59, 381, -216, 204, -100, -234, 151, 191, 203, 73, 160, -423, -114, 246, -82, 26, -520, -179, 42, -52, 76, -248, 170, 68, -26, -40, 152, 174, -81, 184]
6630A84k71N3J25j90l6K79l43K41j26j7k8MJ06Q4Q9k89n50Q50n77O56o88L83O23
6653E62n69n1rj31Q67m31k58K14j6k53p2J90k3K01l66K20k15K58j87M3L24j64
6675A34k11j10P5J57j73MM1j16J77o4L9M3PK42l68J0K07j14m8j12K71qk28J62
6699A7k62K07J06j81j5L91l20r3K15M6k74J27L23k88j70J62K62k91j52M28q8j65
6721a5L6j54J45j54J02n0J09j91K5O8M17l9j51j49R3k32K42k99J97K17l79J40
6743b2N3j4L2k24J74k1P0Q5K9k15J27J28l26Q2k0J8J82j66j65K71l6k35J35J89
6767A31k64K74j45j25N3l43K40K70K0J5j17J20j61L4j02K20q9N1L2O0j64k40K70
6790D0M1j26J17l16K47OP6q7k67j65N00j33J16n3j88K48j40l4J70o2j11K09K84
$$ y = [184, -87, -34, 91, -99, -135, 144, -199, 42, -84, -101, -129, -125, -19, 65, 154, -135, -685, 165, -412, 244, -444, -61, 562, -7, -58, -67, -198, 669, 238, -20, 194, 178, -75, -147, 43, 20, 221, -145, 75, -140, 118, -69, -26, 298, 134, -77, -187, -112, 45, -128, -124, -83, -199, -22, -86, -47, -4, 3, 245, -123, -113, 94, -20, -68, -180, 91, 83, -145, 17, -245, -38, 68, -113, -128, 263, -57, -150, 65, 111, -163, -36, 287, -1, -171, -9, 253, -38, -190, 238, 150, -15, 21, -133, 12, -142, -40, -90, 19, -172, -147, -79, 338, 299, 148, -1, 92, -140, 102, -197, 0, 217, -162, -22, 31, 17, 49, -175, -1, -22, 48, 133, 162, -53, 74, 202, -124, -42, -62, -44, 138, -28, -193, 78, 42, -193, -58, 131, -133, 141, -4, -129, -76, -419, -179, 91, 111, 126, 9, 129, -32, 2, -100, 120, 31, 82, 114, 174, 10, -230, 40, 81, -45, 72, -244, 3, 9, 85, -2, -269, -434, 66, -67, 49, -4, -192, 56, -84, -118, 52, -10, -121, 88, 372]
6813C72k49j64R3k08K80n3L22j47k09J58l7j38m8K2N9O8L7k17L1l9J0K02O6j47
6837F4k32j11L66m55J87J17J24n5J49j55k40J81N0j28J13r2m5K74j35J46l23L69
6859A69j09J6R6l27J09L9j07K40Nj50J92l3k16L3K6Q8k82K84p5j2L8n5J12K34
6883C15n15J61K07k30J56o0J43j45j02k13J88N2N6J73k1P5k97o1J52M7n5K66k32
6906F0j39J33J28q1l40J73K61j53j51j8J82j03J28l7l41M89j98j38M8K06k03J61
6928F7q9j88J95J08oK33k71k28O9R9J24o7J51k66kO8K12k70j02N17n20K28j59
6951i7k07L51m12L60K35j37j51j48O1mM6N5j35L33p9o2L9j57J18qO4j42p4K26
6975G5j94K31l3k3j21J04J52r4l33L01j28QO4k79L13k5l20M66k51J86k81MK18
$$ y = [372, 123, -41, 52, -156, 124, 71, 393, 246, 37, 195, 158, 20, -28, -6, 53, 121, 158, -59, -28, -67, -57, 145, 211, 64, -168, -279, 87, -368, -181, -64, 60, 5, 154, -1, -241, -60, -10, -138, -25, -117, -162, 112, -23, 123, -200, 169, 60, 76, 172, -155, -46, -7, -114, 126, 131, -19, 173, 140, -76, -43, -17, 71, -211, 73, -2, -14, 24, -31, 81, 315, -200, -39, 168, -62, 94, 34, 177, 32, -70, -283, -95, -43, 13, 186, 165, 240, -57, -118, 34, 81, 26, 292, 60, -79, 54, 182, 101, -239, -66, 195, 42, -109, -127, 55, -48, 80, 43, -298, 191, -7, -145, -97, 109, -94, 67, -22, -210, -15, 93, 87, 320, 49, -179, -110, -11, 113, 46, 197, -69, -71, -3, 209, -61, -163, 354, -166, 62, -97, -304, 47, -365, -5, 230, 93, -58, -206, -145, -149, -103, -48, -183, 150, 71, 9, 48, -109, 9, 1, 65, -77, -151, 75, -119, 112, 79, 56, -65, 39, 191, 97, -236, 65, -63, -55, 9, -270, 43, 18, -302, 164, -87, 99, -182, -178, 40]
6998D0j15L13k93K89j75r6k48L50K8R9k23J24k19M4n6l1J22j54K49j51m7O5L7
7021d8j21J77J1N8j34l1q4J61n9j35K34L38n91M12m2k65K86r2l12K59J46J8n44
7044c58N44m47N85l98%J7J04j28J68n8N8j93K05N9k47Q1r9K66k67K08Q8j92k37
7067b41L08J4o5J35j15m5j43N21k91j2J21m21K81j54O9l9M23k78J35j41n4K1K88
7090C17m87L65j23j04j95K98k4p7j47KK1J34R5j36J75N2m13K59J59l25K61j36
7112b9K12j62r8M8n6k4j03M75j02Q6k11j79J24j88J33l8J17J8k4j84K63j76pK80
7136A75j14o4Q5l52J43p2K1J89K93l45j21J08J89p0j0J26J9q0j22rK2j67K35N5
7160A34J13l14L43k30l45K51K39kl15K94j51j38P6O7j89O5J05k6J00r9Q2j41k49
$$ y = [40, -75, 238, -55, 234, 59, -37, -285, 65, 93, 192, -31, 93, -126, -82, -138, -169, -47, -201, 48, -103, -150, -85, -48, -169, 8, 19, 77, -57, -88, -172, -11, -70, -205, 29, 367, -224, 188, 146, -119, 167, 75, -237, 22, 168, 186, -358, 186, -261, 324, -74, -74, -57, 47, -81, 87, 29, 87, -106, 99, 158, -89, -8, -107, 159, -108, 100, 188, -4, -241, 67, 81, 16, 151, 36, -9, -152, 369, 78, 66, 187, -234, 47, -107, -38, -77, 346, 68, 203, 62, 8, 29, 317, -170, 195, 72, -32, -227, 71, 47, -30, -177, -175, -154, -20, 75, -61, 114, 166, -247, 12, 171, -154, 107, -29, 183, 21, -77, -29, -85, -109, -212, 263, 161, 247, 36, -143, -19, -207, -74, -112, 5, 23, -1, -185, 78, -98, -105, 175, 61, -3, 82, -270, -127, -199, -178, 11, 304, -41, -162, -54, 135, 65, 55, 181, 200, 120, -2, -11, 11, -156, 79, 134, 247, -67, 276, 46, -299, -48, 191, 189, -126, 168, 17, -121, -45, 22, -167, -102, 3, -23, 77, -22, 60, -81, -330]
7183c30J28j74N94l99K24j59K45l28J4N42k04mq4n6rJ79k36n9J44J12Q7l12l9
7206a24J77l2j2KJ82j13j78k3L69k92L33j86l9j39R9J67n18J10J34j0p1L55j88
7229Cj04J89M4k10j12L92n47M20O8j20j18Q2j9j07K73oL22o08K17n6n9K3J33j30
7253c0M62k62j92K63l59J99J35l07K0J19m8J39L58m98n1n2P7J7K6k17O58k09k87
7276c9n0j87L47o0J39j12j18jJ51j06J06j67K4J33k2k17L06N0P7j09j35k37J53
7299g4Q3J35Q5j86q1j62L37m06K79J48j25K2QR6k78p9J56J35nn4j23J68L0j38
7323b9K15L0p9m13K73k64M00j5j47K87j74k48K48Q6j8k18J01J8j31m7l9k6M31
7346B41m29J58L18m53L26nk05J05n0j8J56m50K24R3K7j94J07J97K1l51M28k49
$$ y = [-330, -202, -376, 218, -181, 43, -116, 129, -199, -185, 357, 153, 149, 65, 9, 0, 179, -57, -116, 28, 140, 227, -85, -124, 53, 21, 9, 11, 193, 80, -98, -121, 248, -44, 289, 103, 64, -75, 24, 191, -327, -217, -83, -93, -164, 191, 3, -101, 88, 132, -78, -190, 202, -345, 75, 143, 23, -95, -13, -32, -139, 134, 128, 450, -158, 59, 3, -56, -33, 100, -30, 432, 170, -22, 241, -118, 81, 216, -91, -71, 48, 0, 139, 497, -1, -52, -104, -27, -10, 16, -201, 457, 248, -39, -89, -276, 71, 11, 150, 38, -80, -81, 70, -36, 70, -97, -73, 60, 38, -179, 127, 177, 254, 145, 10, -227, -74, 9, 144, 229, 43, -38, -200, 137, -269, 10, 158, 33, 55, 63, 159, -119, -198, -42, 93, 88, 34, -89, 79, 109, -29, 186, 216, 137, -276, -3, -267, 133, 118, -29, 258, 84, -164, 84, 170, 152, -66, 35, 53, -78, -125, -164, -190, 241, -188, -30, 288, -165, 161, 156, -49, 56, 6, -12, 144, -306, -82, 11, 38, -156, -49, 148, 169, -182, 246, -3]
7368co6J34k78K41m6Q4o4M2J40n19N01j67l8J56n9l05Q7J11J80l00J9O9N6n9J13
7393B9j1k2j46N42l97o9N6l0Ql34L36K24j6j46k12J17L16l89L45J98m46J17Q1
7416A51p6r6j19N2K09l15K02j76J73o2m3K10j56J82l85K19j6j01L5o4l4K66k1
7439C5O4K98n29K28j44or9M12m03J00J38k08K84k60P3l3K98m91K33R6j0j53J07
7462C0m4l7l7J90k19J0N9R4j37j3k8L40M5k48J22k01L9J07j31p7K02n9k31K10
7486a4J07Q5Q3j17k42J73j83J99J27p9K00j85j7k7j17J70j87L7J06l0j28L9j54
7509a54J88k31L46k3r3n8O3P5n0j69J85j66r7K32k01O2K3J82K5k00K09p3l17M02
7533A60n0N1k9k63J40j0O6J03j29M7N8J68l22K94n67N86k83l9j0J64p1j58J91
$$ y = [-3, -69, 65, -213, 28, -18, 66, 2, 44, 184, -335, 166, -1, -39, 117, 58, -247, -160, -49, 131, -169, -150, -81, -25, -84, 29, 18, -4, -150, 392, -5, -74, -18, -48, -40, -374, -38, 186, 170, 24, -188, -71, 245, -144, 201, 399, -47, 70, 151, 75, -21, -140, -88, 121, -194, 8, -168, 5, -57, -100, 110, -46, 136, -249, -30, -46, -147, -112, -176, -210, 56, 35, 99, 397, -132, 96, -48, -54, -153, 259, -144, -44, 94, -114, 170, -90, -17, -50, 248, -243, -10, 86, 76, -77, 30, -14, -51, -88, 102, -117, -107, -48, 46, -91, -104, -132, 208, 253, 5, 127, -74, -35, 72, -59, -136, 66, 7, -224, -14, 93, 178, 261, 144, -98, 75, -108, 91, 218, 139, 339, 154, 137, 110, -7, 163, -24, 13, 119, 89, -39, 0, -154, 34, -197, 149, 126, 33, -25, 38, 113, 63, -106, 79, -87, -184, 48, -153, -91, -68, 114, 139, -61, 148, 75, -242, 160, 110, 161, 132, -131, 9, -1, 65, 168, 39, 86, 144, 312, -10, 284, -283, 303, 20, -19, -29, 135, 64, -94, 97]
7556I7l14J65K5J34j9j31j02J34n9N7j07K41j45k98K67j17K32J49j77L4J9k33
7578a48K7K15m22J50K91l10Q1K47l3k78M68l65K47Jj3k71K20k8OP0l77K37N9l6
7602C8j98J7L1K06k5M2k91O5J7l7K11q1r1Q0k85L38O5l52J68O9q9P1Pp5K4L00
7628B25m62M76l44K9p7j7j48L66LK3J32m35K45j88L68n9n0j00j33J70KO2j29j47
7652a88L62k01J03J30m28J3L87Mn8M8k47JJ60l22J07J68k80J83L11j06k17J38
7674F8j02mL15l22M5J4J4n1J07k09N5j30l1k1L86Qk29p0J70l7J08o9m2l21N15
7699A67l2J26k78j85L2J73n3J51o0k33L97j92QJ01k5j13K72m11J77J36r4n5M8
7722E7j89K04K5%m28K41R1K25J16L5l01j42J83k5j6j63J36j6q1L60k37p4j88K82
$$ y = [97, -217, -52, -27, 107, 88, -43, -145, -11, -70, -13, -120, 121, -24, -322, -55, -172, 60, 209, 32, 66, 85, -148, -121, 94, -328, -178, 113, -197, -116, 131, 98, -180, 288, -77, 170, 171, 158, -113, 107, 79, 85, 155, -222, 15, 74, 38, -160, -143, -112, 94, 69, 111, -180, -115, -98, -135, 76, -5, -96, -16, -301, 37, 102, -250, -82, -13, -102, -31, -24, -99, -75, 225, -237, 239, -105, -76, -153, -170, -318, 48, 51, 74, 206, -229, 16, -172, 196, 137, 87, -13, -146, 24, 26, 88, -41, -188, 174, -27, 76, 206, -222, -209, 178, 182, 124, 172, -75, -74, 86, -236, -129, 39, -241, -58, 253, 147, -70, 68, -34, -38, 277, -45, 0, 14, 28, -23, 84, -125, -70, -200, -231, -252, 134, 142, -87, -157, 13, -24, 84, 15, -27, -348, 167, 135, 261, -17, -202, -170, 3, -50, 101, 41, -192, 205, 13, 21, 122, 97, -16, 256, -155, 22, 158, 64, 9, 57, -132, 72, 97, 97, -331, -90, 1, 226, 342, 377, 76, -66, 117, 92, 76, -87, 49, 33, -48, 312, 75, 1, -187, 95]
7746I5l96M71l12K93j96K29j98j30k9L74l29j0Q5K09j42k90J27L36k23N0M04n55
7768a37K28q5r2j66L38k2n5j07N1N6j45J67J8K11k68K71m9O0p9j58M6J72l19j5
7792g9L04j40j09j72K75k16K01k3k20J50j24J41L3J19k15J25M2j0lk8j98J17r
7815c9J82k67L57j85l0j51L11k27n2m0J79o2j62R2m3J02J42l6l9l43L24j58J32
7838a3J33k24R9L13j38j47j0q5j0N1L3p7P6Ro5K9M4J45j57j62N77m08n5p7o8R3
7864i4q0J86K4P6R6j87rJ41o2j48K34l15J38J72m59l8K31M01k21k88R3K13j00
7887Dl2M6k28L88J28l49L5p8m6K97l90L47K48p2k87j7J63j44j36K3J16K51j41
7910A26j60K09k23K89k41M3n0L1m0K45o3j96L7K54j72k77J23K20k60K10K35m28
$$ y = [95, -301, 170, -142, 151, -45, 184, -14, -144, -173, 201, -128, -138, -53, 156, 14, -276, -149, 187, -36, 14, 418, -137, 91, 6, -86, -252, 86, 64, 9, -98, -47, 9, -136, 31, 49, 260, -8, 263, 214, 274, 195, 37, 83, 255, -64, -79, 225, 85, -24, -196, 79, -137, 64, 41, -179, -29, -153, -12, 21, 140, -75, 50, 92, 82, 79, 51, -147, -30, -39, 143, -124, 233, 48, 18, -133, 178, -49, -101, -141, 38, -24, -186, -94, -137, -35, 107, 71, 32, -311, 13, -145, -13, 120, -104, -5, 308, 170, 23, 13, -72, -82, -31, 2, -75, 1, 10, -55, -26, 18, 163, 6, -156, 421, 13, -42, -119, -187, -94, -174, 12, 36, 112, 208, 21, 12, 153, 91, -57, 177, -138, 0, 172, -287, -325, -94, 307, 86, -202, -109, 104, 4, -28, 18, -210, 178, 306, -43, -8, -86, -132, 165, -225, 122, 370, 298, 11, -6, 157, 13, -123, -100, 16, 267, 126, -34, 175, -48, 241, 0, 43, -7, 24, -16, 229, 166, -30, 7, 261, 89, -188, -65, 155, -105, 105, 340, -88]
7932h8k02L88l28o2k1K78K15k47OK11m0Nk73M46l93J59K4Q6j54J48r6P9k24L6
7956d7K86j44K44n19J7k7k63N24L5m84j18K45M54L33J79k532J453N76k50m82J292
7977G72m88n56P80j39j245l7Q33O03n78R52m20j059L8q2L04N6O08k06L22l70j89
7998a01m94J412j135J659j420M44j12l29M45k79m27o73J803o30J29N54j046N94
8016C94K36r15R59j400R7P49l89p5K27j57Q05m10n13M03L45O32j161L35j48m1
8036b7L10L00p07n4M52n74L43J55O8N8k63k76K48m01K57l33Jj5O58k18L08o22
8058c32K84L27n71K71j38J03K17k16L3K33l32K92o5M7p1J37l71O8K53p22M82j72
8080b43oK90N6l63N16l21p51J409j91l96Kq2K92q47L63j84M74LJ54l51J70M85
$$ y = [-88, -290, 98, -230, -292, -313, -35, 180, -67, -61, 150, 110, 115, -158, 288, -105, 54, 78, 164, 10, 158, 62, 141, -83, -47, 239, 95, 339, -180, -163, -190, -453, 71, 106, -378, -496, -251, 203, 536, 715, -1817, -364, 212, -38, -520, 772, 284, -272, 508, 369, -876, -913, -80, 523, -55, 897, 477, -582, -544, -626, -322, -266, 342, 136, 458, 88, -101, -595, 817, -318, 1341, -79, 365, 253, -76, 369, 90, -337, -1010, 793, 163, 292, 846, -200, 394, 630, -285, 674, -726, -629, 120, -269, -344, -117, -274, 531, 121, -392, 11, 356, 988, -173, 162, 14, -27, 283, 583, -124, -178, 274, -300, 43, 198, 266, 324, 61, -215, 33, -368, -111, -444, -443, -458, 200, -18, 290, -332, -48, 279, -292, -21, -159, -56, 161, -55, -22, 211, -121, 171, 106, 153, 82, 219, -152, -84, 169, -553, -71, -243, -249, 41, 97, -266, 250, -71, -822, 587, 396, 0, 2, -80, 212, -635, -272, -456, 18, 21, 175, -176, -6, 479]
8102D79q27K57J68Q3k08l8L65j78p02R64l46J42k57M57l97J1K99J1k02O34j084
8123c69J14O30k44K66l50%J44l72L09k15L88m8m7j50j4j7k09M63j52Mk27L7J16
8146E7k21L19j67K09L0k70Rj39J73R1j28m4q1M2J49K1l56K59K24m23L58j48K05
8169A69k91k5K01k1o8j32L03k82J04M1r6J93J79m00J99j62J85q9k2j70j41K85
$$ y = [479, -348, -91, 77, 160, -48, -86, 279, 101, -601, 363, 17, 159, -98, 359, -38, -27, 272, 283, 81, 715, -369, -255, 375, 131, 397, 47, 47, 191, -181, 128, -87, 301, 253, 206, 56, 42, 25, -184, 279, 127, 131, -96, -59, 57, -164, 155, -12, 197, 227, -43, -34, -173, 0, 91, -37, -81, -162, -120, 29, 50, -306, -47, 177, -246, 112, -36, 169, -122, -147, 54, 33, -35, -167, 136, -146, -42, -1, -97, 96, 275, -125, 74, -88, 97, 8, -14, -184, -325, -40]
8191d0
$$ Imaginary data points
##PAGE= N=2
##DATA TABLE= (X++(I..I)), XYDATA
0@%%%%%%%%%%%%qJ6j6J6j6K4l2M0m8N6p2Q2r2J08j30J52j73J99k27K59k95L35
34A78l80M29m83N42o07O77p54Q39r30J032j143J264j395J538j698J870k058K268
52A189k499K755l042L364l730M146m625N188n858O668p673Q963j0678J3088j6750
67i494K3045l6775J21713r2200j68780K00149J6348l5302j0073q6624K9900J89178
79A41085j23491j65364J76733Q0250j83273L8672J01084j00531m409R0713o8868
90a7399Q71O5766r2817O794J49514j11861j30718J76226N8362j72772J9222R5202
102D6390m4445R475R442q5469O8155Q4494j46812k6303J72761n3314j27158J09017
114A6233M7264r9790K2773L1627m3167N3231J308j04781P8390J00326j42967m3420
$$ y = [0, 0, 0, 0, 0, 0, 0, 0, 0, 0, 0, 0, 0, -8, 8, -8, 8, -8, 16, -16, 24, -24, 32, -40, 42, -50, 58, -72, 80, -93, 106, -121, 138, -157, 178, -202, 227, -256, 286, -321, 356, -398, 441, -489, 543, -600, 664, -731, 807, -891, 979, -1079, 1189, -1310, 1445, -1597, 1767, -1963, 2183, -2442, 2746, -3112, 3556, -4117, 4846, -5832, 7256, -9494, 13551, -23224, 98489, 6289, -162491, 37658, 54006, 18704, 8631, -77993, -48093, 141085, 17594, -147770, 28963, 109213, -74060, -35388, 65696, -34835, -39244, 51469, -17399, -16528, 49238, -43579, -36785, 112729, 868, -129850, 46376, 104738, -68034, -48812, 46390, 1945, 11420, 20862, -64607, 3548, 88042, -58770, -85073, 87688, 34374, -92784, 16233, 63497, -36293, -13520, 18107, -25060, 28171, 29479, -75302, 3088, 103414, -39553, -82973]
126h2973J55345k7434j11285O0907L0493m0902L6131k2830n1419R3729J0011j29187
138g9414N8859J11816j11786n3385J13894r007o3273M0593n000j4363N7515n0280
150c831o7120J09839K6106j34900L3818J09604p1820m8585O5766j1127j9138L0737
162A9349m6592n900Q9951m7108q3499J00563M2159j16540J1258Q4246m2612k6461
174b1186L1331k3966J6639L9765p3019j2395J04938l8207r7650P6611N1914q2853
186b8078p16M9108k2973O419J1159m9104L4082N6439q2464k9306J05007j6103
198C3470q8045N1575M5523m9393N1J1477k4067L5627O973p0706L4730P4630p4159
211a2314m4063Q8051N95o7238K6659K2859k1852J8926j0683l3095N6267J6068
$$ y = [-82973, 72372, 44938, -66347, -5440, 25053, -15849, 20282, -2548, -53967, 39762, 49773, -79414, -20555, 91261, -20525, -73910, 39984, 30977, -32296, 8297, 3297, -11066, 46449, -3831, -70951, 38888, 64994, -69906, -36088, 73516, 1696, -46889, 18877, 7750, -11388, 19349, -27243, -33143, 56808, 9700, -73799, 26764, 68923, -47617, -36359, 47887, 5275, -21186, 10145, -13821, 2818, 42583, -30436, -42831, 62107, 23900, -73750, 2861, 54775, -28078, -28794, 20314, -2659, 3760, 14919, -34185, -103, 56336, -26128, -55434, 49573, 33470, -54575, -3000, 42523, -6870, -6819, 4658, -19409, 16218, 23191, -47515, -12785, 61845, -12314, -56377, 31674, 32269, -34969, -8310, 14549, -7303, 11623, 940, -32155, 24112, 40180]
223D0180q4193K1596P9186n5325m8901O2694P883l8574J5552l402p903L9661k4498
236C956n0800O1149K9979q2701N716P4367l1652l8479L5874J874j1006J5695k8502
249a4530q196N8743k2127o1822N4773M1224o8931r056N3724j6366k1161J4633
261I08j2458J0732K8826m3399j7013O7080j1810o7267L8904M3710m6207j1945
273a9939L0195q898L064O975l2146J6913M1493m8827k9711O4970K827o0047K1515
286a1616L5646k5595m521P906j3752K1672Q305m7617J5106N4443l8514l8239N2928
299A6152J1026m4010P907J7066j0209R268o680k3757L4761J7490n4532L574N4818
312C2874k6334l9303L5365J3801k2619L999o63n383K6392j1565l6203L5447K7319
$$ y = [40180, -44013, -22417, 56769, 1444, -47457, 15237, 23120, -15454, 98, -3304, -11207, 28454, 3956, -46844, 14305, 44284, -38417, -32701, 41666, 10014, -28465, 7409, 9283, -1723, 13972, -14530, -22726, 36017, 13890, -47932, 6841, 48065, -20866, -29922, 23802, 7436, -13725, 908, -11550, -818, 28008, -15391, -32404, 34676, 22866, -44401, -5497, 38213, -7994, -19939, 10256, 1358, 4422, 11397, -20749, -3836, 37657, -11170, -40881, 24089, 26916, -33131, -11616, 24030, -1565, -6086, 1820, -11932, 9740, 18045, -29572, -14466, 39977, 1463, -36776, 16152, 27178, -16832, -8925, 8141, -2068, 7200, 520, -23237, 11524, 29014, -25518, -21944, 32874, 6540, -32763, 2602, 16403, -6216, -2217, -2880, -8263, 18129, 6564, -29639, 5808, 33127]
325C3127n1633p411M9695j1929k9431J8207N653o606R415j8462r048L7838p352
338A2063m5137K9726L5218l9872j4094L4506l743j5294O841p062O640K0054k6047
351f201j7171M4020N85m7248J6416L3497k5285j4235J8414j256J332L729k1694
364a5097Q385L1645k7626k6465M1228J0240m0975O933K7234j1892o291L643p537
377f575J3737P207l2579M400L8795k0653l0899L1933J5119k8946r55J2587m357
390a186N353m346j6101K1835J6525l5592l710L8814j1681l0080J8825J3768j3803
403a379k9l40k957J7246o379k7386K1096K3437l2496j1642L3243j951k2504Q451
417c590P304k124N388j2178p513K5829j329l2509J5752K7873k3754j5241K2694
$$ y = [33127, -18506, -25917, 23778, 11849, -17582, 625, 6278, -328, 9087, -9375, -18423, 19415, 12063, -33074, -3348, 31870, -8002, -22096, 12410, 8667, -6627, 214, -6848, -208, 19846, -6201, -23372, 20648, 21233, -26015, -9599, 23898, -1387, -15622, 2792, 1536, 2868, 6597, -15097, -6712, 24933, -2693, -29158, 12070, 22310, -18665, -11732, 15502, 3610, -2681, 962, -6575, 7162, 14369, -18210, -13810, 24985, 4332, -26567, 5366, 20485, -8461, -9416, 3171, -1186, 4167, -179, -16280, 5555, 22080, -13512, -17222, 21592, 9911, -20169, -1344, 12424, -1379, -1408, -1748, -4705, 12541, 6162, -21224, -128, 23309, -9187, -20829, 12414, 10463, -12041, -3590, 3714, 1590, 6978, -5200, -12713, 13116, 11787, -20722, -4970, 22903, -851, -16092, 6602]
430F602K782j2002J041m313L984J4333j6443j3907K9096N619l3463O171K6212
443A5712j3601j3593J1239K657J088J538j4141M497K2338j6042k1474K5321J1557
456A7096k7102r57J9717m340p160J145l624R145O330k1354k77K7315j0524k4060
470a8650J8626J5454j7646m521R132r78K198l501j1336J3926J3433k3348o429
483a3640K6796l510k3515R089J2924p807l307m12j52J2062l102j9369J2081J8573
497A6711k0369j2125K3026L654j7247K041O919J0K040q137n068J7178M45k3397
511a4319O968K2214j3592j4069J4393N784q148j388j895K978R923j0581j1111
524a2843J9540P009k2655O33J9583o645j2575N717M094J090K19r804K899J5581
$$ y = [6602, 9384, -2618, -1577, -5890, -1906, 12427, -4016, -17923, 11173, 16792, -16671, -10500, 15712, 2111, -11482, -243, 2414, 3502, 5040, -9101, -4604, 17734, 1692, -19782, 5539, 17096, -10006, -10963, 8754, 4414, -2746, -1601, -5225, 3920, 10250, -11104, -11381, 15934, 5410, -18650, -24, 15430, -2216, -6737, 2395, 1417, 3615, 114, -11222, 2704, 16137, -7211, -13640, 13156, 9646, -13869, -4780, 8144, 337, -2970, -3382, -3534, 8528, 5426, -13943, -1862, 16711, -3658, -15783, 7243, 10897, -6350, -4309, 2610, 2620, 4660, -3477, -8545, 8633, 9078, -14319, -7351, 14863, 1271, -12798, 1595, 7379, -769, -2157, -4052, -1074, 8849, -1732, -12843, 6697, 13706, -8949, -8316, 11267, 4622, -7953, -2236, 1858, 2948, 3167, -6637, -3738, 11843]
538A1843r719j7384J5982J2173j8204m219J4485J4o349q93q84P205M248j4773
552f475k330J9543m293j8864J0281J3674j1229o787O044K247J343l525q510R072
566A91J0171j5286o200J9795Q05j7894L469J0625l460m097k75N45Q326k018j3776
581i079O894J4450j2770j1591J4521N306j1732q42O085J251O11o085m137J2031
595D913K302j6072K894J6220p192j1929Q452O918n054k991j310K580O411p155
609a013q814J2927O889j5613k536J4724k220r908K152M077J654p78o613K166J1739
624H833n477j3097R560R899j1778n767J0439K302m925j959n47M961K682j0185
638e059k172J3737r87j4291N451J0828o458n910L838L403L43l342n141O010Q224
$$ y = [11843, 2124, -15260, 722, 12895, -5309, -9528, 4957, 4971, -1378, -2271, -3155, 4050, 8298, -6475, -8805, 10738, 6445, -12419, -2138, 11536, 307, -6480, -436, 1811, 3154, -371, -8881, 191, 10362, -4924, -11124, 8671, 9476, -8418, -4949, 5676, 2216, -1881, -2156, -1611, 6715, 4697, -9079, -2185, 12265, -505, -12096, 2425, 7731, -4001, -4843, 1242, 2493, 3104, -2981, -7118, 4913, 7215, -8857, -5963, 10257, 3065, -8864, -412, 6506, 1452, -1539, -2849, -269, 6142, -1013, -9827, 3100, 9989, -5624, -8160, 6564, 4344, -5564, -3412, 665, 2319, 1541, -5072, -2906, 8833, 3356, -9741, -181, 9718, -2060, -7827, 2612, 4914, -11, -1970, -2517, 2444, 5126, -5059, -7231, 6506, 5519, -8772, -3321, 7507, 1049, -4861, -1023, 2380, 2723, -619, -5760, 250, 8474]
653H474j0432o009J2571L355j2884L49Q769j453m725j380J268O294j029r573M197
668b208J0593p796r913R779O224q351k216M730K168l12m764k064Q350J529j2044
683f295P47J2476l524r976M809O238l415l512o56L225M553n272o323Q406N934
698G415j0535k902J0699P47q532rM273J154j263m335R93Q297k962j0038N586Q442
714G030p662n990O953L404l929k078M81M305J747p474k030R698M47j0745K657
729c186R457l727o534K557L522L32l139m044M458N795o765n607R350L835r637
744c333j143P117K71m427j542J770M653q40o933K499Q692n002p806N752N331n887
760h28l426M102K620m64l960j645N917J559q421n53R525r65q119K939N869j997
$$ y = [8474, -1958, -7967, 4604, 7959, -4925, -4576, 4193, 2740, -1985, -3365, -2097, 4197, 3168, -6405, -2208, 8385, 589, -9324, 455, 6679, -1672, -3888, 842, 3010, 2698, -2066, -4130, 4220, 5749, -6295, -5548, 6928, 3404, -6572, -1763, 4475, 1060, -2452, -3108, 117, 4670, -602, -6925, 1481, 7415, -3120, -6022, 4677, 5424, -3108, -3117, 1156, 2310, 1047, -3288, -2295, 6002, 3040, -6998, -1412, 7030, -632, -6622, 331, 3735, -194, -2272, -1791, 2514, 4261, -3213, -5243, 4455, 4902, -5843, -3186, 6271, 2544, -3990, -1433, 2089, 2421, -718, -4762, -304, 5491, -1274, -6881, 2469, 6304, -3333, -4476, 2641, 2912, -1515, -3057, -1287, 3366, 2526, -4407, -1908, 6784, 1782, -6024, -272, 5059, -828, -4254, -152, 2468, 2004, -1956, -3601, 2316, 3875, -4546, -5099, 4426, 3461, -4658, -1719, 4150, 2153]
776B153l879m99K827L216l852n057O130M986p674l694P930J974o632j408M063
791E84J580j765l790J389O356k072p510M106P268n567o038N271M058l189k988
806b307J018L587J324n764k006P343N16q607J146P858j686n519R98M195j09l037
822a050k821M008M506m848m657O446L802p126k029N800J056l907j842J937L600
837B875j324n299J374O942k706o823M020N531m488m167L119L369p88k978r74M927
853B610J200o528j137P519o46o523J022N578o53m301q57K989K625l789l923N313
869D99M157n852l176O089K309n435j663L707K081k148l457J857M838j760n903
884c857K545N734l230n477L323M255l066l179J137L477J201m733j258N338J098
$$ y = [2153, -1726, -2225, 602, 3818, -34, -5091, 1039, 6025, -1649, -5343, 2587, 4561, -2071, -3479, 584, 2164, 399, -3391, -2002, 4354, 2282, -5228, -1122, 6146, 579, -5459, -188, 3870, 681, -2307, -1289, 2298, 3622, -2142, -4148, 3195, 3711, -4896, -3750, 4108, 2422, -3097, -2099, 2096, 1987, -1050, -3871, 137, 4643, -205, -4862, 1584, 5386, -1740, -3769, 2031, 3087, -820, -2662, -725, 2875, 1551, -3748, -2374, 4568, 1862, -4961, -941, 4590, 102, -4065, -946, 2423, 1635, -1343, -2317, 2610, 3810, -2718, -3855, 3664, 3018, -3505, -2483, 3095, 2442, -1859, -2716, 273, 2898, -891, -4814, 499, 4656, -1196, -4372, 1717, 4026, -1409, -3072, 635, 2716, 568, -2889, -1032, 3806, 2046, -3857, -1312, 4422, 1192, -4285, -962, 3293, 227, -2952, -1815, 1662, 2863, -1870, -3128, 2210, 3308]
899C308o701N9O339Rn385K20M226K93k718k696L254L445m041l847M966L517n264
916a016l049M707K093l460k374K429L516j542m301J562N516k081n902K723M958
931C779k624m321K105L402p65l362n99M492J153n557j405N645R30n814R7N104
947B260K26l853r74L516K048l397l550L583M180m305l627M794L077m772k339L056
963g7K507k312l105J662M225j268n344K083N361k359m757K195L903j460l570O56
979a660L896O29m198j361M986R18n408r07N391N58m894m27M000J137l302k200
995b842K666L294l381l720M309L551m015k951L615K499k938k703J888L402j333
1010A341m066R98N007j115n567J720M435j512m104J079L746k93l364n89L633J714
$$ y = [3308, -3393, -3334, 3005, 3014, -2371, -2151, 2075, 2368, -350, -3046, 208, 3653, -388, -4235, 731, 4248, -1016, -4065, 642, 2735, -725, -3099, -670, 2846, 1304, -2997, -1435, 4081, 2000, -3902, -1179, 3779, 1155, -3166, -1061, 2341, 1576, -1786, -2385, 2107, 3260, -2297, -3702, 1943, 2873, -2941, -2844, 2260, 2486, -1367, -2341, 1175, 3223, -174, -3724, -141, 4039, -266, -3893, 901, 3978, -794, -3133, -77, 2430, 118, -2987, -1325, 2900, 1632, -3712, -1629, 3732, 1373, -3384, -1189, 2714, 1254, -2316, -1660, 2236, 2865, -1333, -2694, 2292, 3210, -2198, -3105, 2286, 2844, -2050, -2477, 1523, 2660, -642, -2842, -176, 3118, -263, -3983, 326, 3877, -138, -3089, 526, 3025, 87, -2616, -728, 2674, 1341, -2725, -1727, 3280, 2165, -3402, -1682, 2753, 1241, -2863, -1784, 1962, 1669, -1695, -2284, 1349, 3063]
1026C063m273j982N162J081n018q58M367J062l247j470K787K069k727l465L191
1041b58L395l162l840M226K808m240j358J741J809r07k068n1N515j080n170J502
1057a138L463r52m824J923L730j83m145k03L847Q38l829j442L353K137m431j768
1073c624M532M91k928k91L601J617m048j581J729L177k592l264L040K721k319
1088B61l379K969K989k661k865J287K952j33n094K118M504p83n297J604M230O
1104B708m683j62M380J00l794j175L002J950l759j435M186K162m845j992L777
1119D20J661l197j951K847K395j589l390J776L250j405m209L246L331j979l395
1134b189J440K850j456k768K7L897j130l130R20L977l33m673M53M009m61l055
$$ y = [3063, -1210, -3192, 1970, 3051, -1967, -2825, 1542, 2604, -643, -2113, 674, 2743, 16, -3449, -258, 3137, -25, -3865, 361, 3169, -1071, -2429, -688, 1121, 214, -1854, -1905, 3610, 2530, -2640, -1138, 2325, 1373, -3451, -1528, 2202, 2019, -2126, -2329, 1518, 2356, -1473, -2915, 438, 2575, -1856, -3624, 908, 1399, -1529, -1820, 1781, 3398, -650, -2231, -502, 2675, 83, -3181, -141, 2580, 261, -3118, -149, 2840, 179, -2686, -1399, 1553, 1420, -3674, -1556, 2948, 2165, -3132, -1528, 2702, 2708, -1975, -2137, 2243, 2343, -1451, -2626, 376, 2326, -1433, -2868, 1318, 3480, -1365, -3357, 420, 2081, -1116, -3067, -220, 2175, 586, -2804, -1028, 2222, 817, -3392, -146, 3185, 1206, -2189, -749, 2101, 645, -2123, -2096, 1801, 671, -2459, -1539, 2438, 2105, -2568, -2115, 1894, 1433, -1622]
1150a622n94L690J084l301j510L029K527l886k131M131O50k841j440K624K103
1165B513k281k781K033L021k015m054K698L087j607l324J766L413j649k419N11
1180a088L101q04l474P68L373K50m075k53L662J25l626o33L945Q07k782q62K302
1197G36J347k772k505L455J678l078k388L333K154k161j547J177L674k923k748
1212b568J801K669j188l143J304K997j298j892Q69K407j140l768M71L276P67l465
1228a901k65L924R7k741j227K377J163k301q93J502J904j746k004K771R08k034
1244d66k162J486K688k882j268K269K747j851k616J620K810j022k808N85K756
1259A886j718j365O01K313l45k884K21K281N81l363n24K998J374l275j001L945
$$ y = [-1622, -2216, 1474, 2558, -743, -2253, 776, 3303, -583, -2714, 1417, 2067, -774, -2214, 410, 2513, 232, -2549, -516, 2505, 490, -3564, -866, 2221, 614, -2710, -944, 2469, 820, -1599, -1088, 2013, 1209, -2265, -1497, 1876, 2126, -1949, -2202, 1460, 1585, -2041, -2674, 1271, 2078, -704, -1566, 736, 2083, -689, -3194, 261, 1939, -1139, -3527, -194, 1960, -201, -1748, -571, 3103, 180, -2568, -767, 1902, 714, -2429, -1125, 1872, 574, -1318, -449, 1958, 818, -2950, -2479, 797, 1564, -1901, -2166, 1758, 1855, -886, -2113, 264, 1427, -874, -1767, -265, 1639, -107, -2111, 660, 1568, -466, -2628, -1142, 1546, -1336, -2604, -335, 2412, 561, -2055, -435, 2375, 1353, -1455, -870, 1886, 168, -1197, -596, 1717, 1372, -1512, -1291, 990, 1571, -1792, -2316, 682, 2056, -1219, -2220, 1725]
1275A725K0k984j205L393L99j444j773K067K230k593j789J900J901j688k512K559
1291B06R73j094j893R52K637j062k436O71L119j194k828J120K437n99l009J194
1307h06K571o36k518k11K674M39k836l77K861J267l763k28K656O7j842p34J499
1324H3J727j698r37R87K297j548l505K816J833j808j826J276K989j811k430P99
1340g56J621l01k145p0L237n48k821M68K190k11j786l2K031O29k307q46K469J586
1358B408l014q81K500R26k285j022J617J311j772j438J753J697j643j754J497
1373a00J921j704k118J518K099j052j827Q15K047p09k116M29J944J6k505K73K291
1390A222n6j927n02J982O20k304j50J605P66k066q71K026J271k005r65J925O86
$$ y = [1725, 1745, -1239, -2444, 949, 1348, -96, -1869, 198, 2428, -165, -1954, -54, 1847, 159, -2353, 206, 1179, 85, -1808, -856, 1781, 719, -1717, -1046, 2073, 879, -1949, -829, 1608, 1009, -2000, -806, 1765, 1129, -1389, -1600, 1074, 1513, -1323, -1700, 1161, 2428, -1335, -1563, 1093, 1160, -682, -1416, 83, 1810, 112, -825, 162, 2459, 911, -2594, 222, 2055, 247, -1579, -303, 2686, 875, -1555, -756, 865, 564, -1581, -1651, 1586, 1038, -1783, -1315, 875, 664, -1122, -1154, 877, 1506, -801, -1647, 822, 2408, -606, -1487, 1013, 1939, -346, -1368, 249, 1560, -212, -1650, 103, 1800, 157, -1597, -100, 1821, 117, -2001, -483, 1616, 564, -1263, -448, 1599, 890, -1226, -797, 1147, 1163, -1342, -1069, 1222, 1166, -761, -1263, 719, 1339, -965, -1115, 490, 1256, -810, -1681, 345, 1616, -389, -1354, 571, 1257]
1407A257j609j102J271J698j505j612J518J800j222j784Q93J617q75j921P74J954
1423A152m26j720J00K113l51k143r3K427J90k208j22K176J91j465j081K148N12
1440A400k018r32J749J171j616j401J928J175j837q63J071J481j166j403P67J977
1456A483r65j955J113J887j010j843O20J742l03j937N85J867j90j839k58J827
1472H24M8k036j29K247K27j738k35J216P80j997l60J594J015k007r10J611J163
1489A313j346j260J790R00j487j255J062J341q57j495R52J409o54j523Q36J632
1505A358q03j336Q9J549J25j945K13J830j34j920J55J443J97j383o41J785L43
1522I25j316p99J459P17j406j018J629J117j574j160J761J006j394q45R40J404
$$ y = [1257, -352, -1454, -183, 1515, 10, -1602, -84, 1716, 494, -1290, -397, 1220, 345, -1576, -802, 1152, 726, -994, -894, 1219, 868, -1275, -1368, 1059, 1249, -959, -1081, 1095, 1286, -179, -1260, 888, 1400, -618, -1550, 199, 1370, -246, -1647, 281, 1456, -381, -1244, -173, 1308, 142, -1261, -494, 1483, 518, -1437, -324, 1563, 553, -1290, -670, 1072, 769, -1168, -583, 1284, 1094, -745, -1003, 824, 872, -1164, -1293, 954, 1181, -557, -792, 424, 1204, -793, -1153, 441, 1456, -551, -1461, 150, 1313, -33, -1293, 497, 1397, -90, -1345, -283, 1058, 201, -1294, -342, 1067, 413, -1110, -274, 1358, 555, -781, -692, 857, 982, -963, -750, 1080, 946, -974, -819, 624, 821, -562, -1203, 582, 925, -391, -1190, 269, 986, -420, -1438, 191, 1308, -266, -1426, 335, 1341, -53, -898, 42, 1446]
1538A446p58j560M82J700q38j744N70J698p54j126K65J538m94j489L29J442K65
1555I72j291k84J345J45j576j02J421N64j535n33J676Q6j020q65J040Q91q67j516
1573a449J459J123r14j073Q13Q76m24j129N84J199r02j060K81J563j58j571L03
1590d79J681n64j590L12J235K58j589j63J435L72j531l82J536N05j307n29J262
1607D62M72j110p17J006R27j144p33J014Q37j022j187J538O39j034r38O93J280
1624I83r88q93N00J198q0j702L35J553l59j346J08J326R8j341K9J434m04q38m05
1643g92J053M99j421k15J262L75j193n63J117P31r67o43Q71Q56j249n69O01J205
1661I58j006p89R62Q33r17p97N44J137p29p24K18J406p10j158K14J327j22j300
$$ y = [1446, 688, -872, -390, 1310, 472, -1272, -702, 996, 242, -884, -619, 919, 425, -1064, -735, 707, 972, -319, -603, 742, 887, -689, -791, 630, 1194, -341, -874, 802, 888, -132, -997, 43, 934, 67, -1449, 10, 1133, 219, -854, -41, 835, 411, -718, -134, 1065, 163, -897, -616, 947, 789, -782, -479, 1202, 638, -952, -640, 595, 853, -736, -899, 536, 908, -623, -1005, 531, 1036, -271, -800, 462, 934, -176, -893, 113, 1040, -104, -837, 177, 1014, -8, -1195, 343, 982, -52, -990, -297, 983, -5, -898, -398, 800, 720, -982, -647, 906, 547, -799, -691, 635, 733, -608, -579, 855, 451, -387, -792, 261, 760, -661, -876, 386, 761, -432, -995, 122, 853, -114, -757, 114, 970, -279, -848, -247, 958, -48, -837, 125, 958, 41, -756, -212, 925, 196, -528, -310, 1096, 386, -772, -558, 769, 647, -653]
1679f53J30R91K25j146J08R01J76j264l72J178P16j286m43R88P54j209k27P67
1697C34L26m07j099L70J167p53q49N76J459q45j005K99J349p17j199O03J039n9
1715E89j176K7J158j34j112K42J028k04j011r4Q89K42o79n02R96N15q74q95J005
1734A0P46q75n53J009N54o73r71Q07R26q44j289J004R92o23j202P55Q16n53q29
1753g93K03R14j05p39K53O67J80r62J8J083k8j032n36J313N2r26r6O94L50r77
1773d67n59R70Q56r92o14P66M34n13m26K72P77k70q34M88Q32o55p27M13J151k36
1793F66j448M43R69m59r42L07J114o11m06l5J111j12j067n0P00M09p75j73Q60
1812E01J71r92l46R78P22j022p05J090M61p93q93Q08O34n93o01N05Q47o33q25
$$ y = [-653, -523, 468, 693, -453, -345, 556, 732, -532, -904, 274, 990, -296, -739, 249, 1003, -206, -433, 334, 660, 253, -846, -476, 691, -62, -911, -335, 1124, 279, -726, -427, 922, 205, -994, -391, 648, 589, -587, -560, 598, 464, -648, -406, 622, 418, -593, -687, 202, 444, -235, -737, 259, 774, -100, -995, 10, 756, -119, -672, 337, 891, 218, -753, 54, 980, 136, -1153, -149, 843, 220, -982, -227, 589, 36, -793, -590, 324, 219, -520, -267, 400, 580, -382, -364, 719, 691, -341, -877, 436, 488, -438, -534, 160, 510, -467, -1026, -56, 800, -192, -806, -40, 394, -119, -545, -273, 504, 234, -600, -112, 720, 65, -662, -249, 902, 666, -782, -339, 630, 171, -771, -464, 650, 39, -367, -402, 709, 597, -470, -520, 180, 589, -186, -359, 501, 672, -320, -666, 312, 1034, 12, -693, 397, 858, 65, -828, -20, 614, 21, -580, -75, 772, 139, -686]
1831f86M17Q49l02r32O44Q74l82q41j90J041k00j027N10Q68p5p51k83R41J03j088
1851e10k85J077K76q73n37J152L06p53m23O32O43r49m97P40N33l03o81M48O77
1870F73m56o80K76N58j50p02O9J215o94l98j08J291l75j067l7Q93J76r31J78O08
1890C39J94r06k19Q69K46q58o46J140L82p15n17O79L31n85m99P10O63o69p67R06
1910G8N79o16q01M89O32j39p94L60P95l33j037N91Q20l60l89j74P91j31q16J24
1930c31N30K38o04o4P29q6o26k28R99L6q27k11N88O06o38p23K68Q14o69l20N24
1951EL25n32o00N78O04k0r05J16J146j01j071n3J135j48j193N30O68K67r25j48
1971c22Q17j3q25m43J073J25n71j17P05N3q82l07Q35N09n74p02M84O87l63q62
$$ y = [-686, -269, 580, 278, -654, -10, 864, 482, -359, -549, 492, 292, -735, -225, 643, 568, -183, -466, 475, 578, -510, -795, 282, 558, -315, -852, 300, 606, -147, -570, 62, 705, -244, -741, -1, 532, 229, -452, -4, 673, 217, -463, -187, 371, 221, -481, -412, 803, 109, -289, -397, 894, 519, -548, -585, 308, 484, -447, -269, 339, 533, -373, -592, 277, 523, -335, -981, 159, 541, -174, -691, -12, 319, -266, -765, -55, 608, -61, -828, 78, 657, 41, -760, -271, 361, 222, -572, -212, 583, 250, -787, -196, 624, 264, -125, -299, 492, 361, -455, -331, 199, 437, -167, -231, 498, 412, -214, -442, 557, 593, -234, -445, 143, 749, 111, -612, -344, 470, -199, -519, 5, 330, -202, -802, -224, 380, 360, -545, -429, 717, 616, -455, -508, 627, 479, -714, -184, 484, 751, -174, -322, 495, 482, -343, -786, 287, 412, -159, -276, 429, 482, -400, -707, 128, 637, 63, -639, -155, 532, 169, -693]
1991f93P48M05l04o70K27R07k34r88L99P49l05p01K14N05o2o28Q0O64L7m44l25
2012d19R34J69r52j98P87K45j020j8N78L57l94n02O42M03p03o06N79M67m22m64
2032e37L76N10k96p02O05N48k82n38J39P60j02r77L57N41n4r73J79O99r3p31j54
2053g25J402k92o26l05R53j05o25m29J145J73l86o43N57N03o11k33L29L17n17
2072a18o89P87O10m28q43L05P49j57q67M37O11l35l80L26M54k98n52J86L89K10
2092C97q03n6J189j86p76k45Q39N4n11o88Q87K50p02k18O26L76m51k02K64M31
2112D75n34o90N45K89J04m77L49K64m1q67J57P93j74n47K9N98K11j127N21M71
2132C49k74l56j3Q70j68n24m16Q07M7m53k41M51L82m41n32O49K27o29j1J83M65
$$ y = [-693, 55, 460, 156, -514, -287, 620, 386, -602, -203, 546, 241, -460, -246, 259, 197, -431, -351, 313, 350, -94, -419, 515, 684, -268, -466, 321, 566, -454, -472, 106, 463, 69, -433, 209, 612, -91, -697, -118, 349, -73, -537, -161, 349, 53, -649, -44, 504, 222, -316, -177, 583, 481, -496, -139, 402, 348, -625, -446, 253, 160, -571, -725, 677, 385, -241, -546, 407, 302, -323, -752, 393, 566, 180, -463, 94, 597, -14, -247, 82, 399, -118, -807, -20, 590, 162, -681, -376, 373, 216, -651, -214, 397, 62, -318, 8, 462, 164, -388, -202, 187, 397, -406, -462, 727, 541, -235, -480, 359, 413, -98, -786, 101, 351, -351, -569, 57, 433, -18, -220, 44, 475, -59, -749, -204, 85, 189, -288, 61, 325, 284, -583, -426, 367, 193, -354, -325, 273, 484, -643, -122, 349, 75, -281, -294, 576, 408, -116, -532, 275, 322, -131, -372, 79, 461, 20, -512, 137, 364, -265, -276, -93, 372]
2153C72o28k58L76N15m05k42K1N95j9o77L4P16l91k05l0N16R8q00k4Q33o7p31
2175d01J18K34L99p05n1N75K13q85MP10J58m56m33M27O14o99n23O46N79o38m02
2196e16M91N88o41n05M53M21m53n54N02O82o5p13R1O92k75o26K28K75K87o28l7
2217c03N48m3m16j21M61J46l07n59O55J59k60m29N73K52m11n38P95K84n46m21
2237d81M06P11l87m29j3N66k94n61L11N43j77n04K05M23j9m54l51P60j83o85K18
2258c95P41K56j031R2K45O76p35l09J008l8m93n20M86L03m00m76M45K12k43n04
2278f80O42N13k95m21P9O49l90n85J09Q22m07k96J3N81j33o57K73N49j44m57j46
2299c81Q41j95n34J5K93J80l91j64N27K32k88m98O14J06m49k28K09L55l08l25
$$ y = [372, -256, -514, -138, 377, -28, -270, -249, 346, 327, -350, -316, 400, 9, -196, -226, 290, 388, -412, -436, 397, 330, -401, -283, -49, 350, -355, -406, 169, 382, -503, -499, 211, 369, -87, -520, -93, 521, -178, -701, -55, 524, -114, -516, -25, 563, -78, -583, -130, 291, -162, -716, -214, 468, 403, -310, -219, 473, 198, -428, -200, 75, 362, -266, -303, 245, 202, -214, -335, 126, 272, -35, -594, 61, 220, -40, -469, 104, 356, -55, -593, 202, 486, -60, -481, -75, 636, 249, -180, -193, 373, 79, -482, -171, 372, 195, -309, -104, 319, 300, -154, -505, 255, 72, -613, -395, 346, 602, -429, -337, -92, 584, -151, -460, 548, 510, 17, -503, -17, 286, -114, -590, -145, 67, -176, -680, -38, 475, 180, -241, -162, 487, 97, -488, -379, 443, 36, -260, -247, 334, 201, -456, -183, 366, 222, -235, -381, 460, 265, -269, -254, 39, 219, -172, -336, 191, 423, 135, -363, 251, 357, -92, -320, -111, 244, -64, -389]
2319c89K89L40o6m01J42J90N0n37O7Q32k76o55Q5N40k40n41M01N16J40n58k91
2340c62N90K25l81l63M85%k85j83M52P8l67k43L44J76k5n72O44K48l50n75N57
2361I3K27N4o50k08Q55j68k22j86N31j57n28Q9P14j82p41L08M11K6o19q8L76J73
2383A08m44J12N53j00m37r4N51Q0j41m99M73J75m08l32K92L52l30l96L69N60j59
2404B85n80J4O46r4n01K65K89k76k78j18L13K87m55L1N51j86m71j63O80j07j43
2425a1m31N12P4l08Kq1M18m46k67O48oJm56L34M11j60k79K5M59m12k33n7K17L15
2449B69j155Q21J79l00L16n95J515k19k037P70N62J047k131Q24N22J46n32M84
2467D86r99J387o01j234J085j59J25q47J389O4J70j043m71L32n74M97L32N6J2
$$ y = [-389, -100, 240, 174, -227, -85, 105, 155, -382, -315, 517, 241, -414, -329, 211, -29, -570, -169, 347, 487, -71, -362, 228, 453, 72, -291, 194, 194, -91, -274, 178, 256, -111, -354, -10, 166, 141, -431, 213, 461, 111, -464, 93, 320, 374, -276, -484, 371, 203, -19, -205, 326, 169, -359, -270, 444, 262, -479, -171, 240, 266, -353, -441, -65, 108, -336, -224, 329, 229, -208, -302, 249, 329, 188, -311, 162, 337, -71, -403, -111, 241, -89, -485, -116, 444, 285, -295, -281, 365, 271, -230, 35, 324, 48, -230, -348, -35, 252, -203, -172, 379, 193, -278, -441, 239, 132, -11, -442, 70, 144, -164, -162, -243, 175, -271, -538, 110, 104, 105, -351, -17, 394, 234, -45, -20, 439, 27, -206, -263, -46, 269, -886, -65, 114, -186, 130, -465, 1050, 831, -1206, -436, 126, 1173, -958, -134, 388, 534, 2, 486, -513, 874, 273, -961, 124, -35, 90, -757, 632, 696, 866, -177, -648, -316, -890, -393, -61, -5, 7]
2486Gj031Q26N74k07q52L14J69M23q03N21N93j77o26L8M26j94J35m74M71K19m97
2507a45Q7J27O91j017K62R7J18n66K18Q1J80J26m81R5L75k51m84M33q4L7l5J86
2529E0J31J60n87J4M48j8l55k20M95Q8m23p1K41j21j8r2K75K49k33l66M50Rj88
2552h2j05K25K21l26l5k8L50j29l55K57J48Ol47K35jL7k35M5M81k32n80M30K81
2575B61m0n72M48J8J64k52n28P04q2l63r1O25m3k42k47M2P02n77m2K51J66m40
2597a38k87M37J25p1l45K03K53l38j49K33J41n5j77J95J83k60j96p3N66O2m12
2618a03j96M58j02r9k55L65j68J11j0K87j21k78j18J44M32m56J1K56Q8ln35L03
2640A1lk15K06m2P5Q2rl74M26l7k55M44j8l76j56J42L81l17k02K49R0k9j78K01
$$ y = [7, -1024, -198, 376, 169, -683, -369, -200, 223, -580, -59, 534, 357, -269, -231, 195, 1, 136, -338, 133, 352, -145, -58, 69, 760, -257, 5, 102, 220, -346, -128, -47, 133, 259, -222, -127, 248, -3, -487, -54, -138, -101, -136, 50, 181, 341, -246, -232, 216, 198, -157, -377, 118, 206, -217, -288, -47, -168, -186, -278, -3, 246, 13, -353, 97, 106, -82, -187, 38, 259, -67, -102, -130, 220, 91, -264, -7, 141, 147, -200, 35, 34, 71, -164, -119, 362, 130, -450, -20, 261, 221, -351, 97, 115, 279, 27, -501, 203, 121, -242, -333, 292, 249, 7, -240, -198, 504, -73, -115, 136, 302, -138, -425, 12, 137, 66, -279, -76, 177, -161, -310, -77, 64, 9, -168, 27, 210, -50, -246, -319, 247, 309, -103, -299, 159, 57, -42, -297, 68, -100, 11, 1, 288, 167, -111, -229, -85, 347, -109, -98, 158, 246, 243, -292, 11, 8, -207, -1, -43, 32, 114, 105, -269, 157, 120, -135, 309, 291, -85, -241, -99, 282, -35, -237, 12, 102, 73, -105, 96]
2664I6M33k98l91r6J70K29j70n06P28J10k97l20M20L94n11j75P8J88m9k10K86
2685A09r7J38m72J44L04ok55N8L74r4o5j70n3R4P0k53J95l0j93o1J08J06N7n5
2709d7L60k49j54l36M83K25m49K1M52o7k71k15L48q3J51j75k27M77j67k74K75
2730G8j9j75q0Q9K10j82l6K3M32n18J2K17l0J32m17%K01L59m11K6K00jj71N3J35
2755A27k6j76J90j63J39qj11j75N00m88o3J45M56l35l39K03L19o6k77J15J25j
2777I1j61k0O4R8k57J75P3L4o6p3K24j85l1j55L56R1k45k50L64J33m68K13R0J44
2801B39K2l74J47R6j67k14J99K79m75J17J55J83j28k42J05J9L33k75j62M52l74
2822f5K04l34K54k29n9MM20j81M6o9O1p8O9k34J93J18j73k7N3J88j70k22K07K3
$$ y = [96, 529, 231, -160, -256, -86, 143, -27, -533, 195, 305, 8, -312, 108, 502, -9, -184, -106, 82, 33, -177, 109, 12, 150, -322, -178, 126, 120, -135, -77, 297, 203, 138, -32, -85, 9, 79, -174, 21, -9, -202, -263, -155, -49, 8, -47, 313, 64, -90, -426, 57, 282, -167, -146, 306, 239, -32, -247, 101, 18, 169, -6, -233, 244, 77, -197, 78, 59, -116, -196, -107, 103, -79, -115, -92, 340, -178, -166, 51, 21, 153, -264, -264, -63, 296, -115, -89, 111, 110, -61, -8, 127, 101, -75, 115, -48, 91, 83, -28, -203, 297, -191, -254, -109, 347, 12, -327, -124, 195, 129, -148, -33, 92, 91, -70, -90, -26, 72, -185, -10, 63, 97, 31, -42, 182, -3, -34, -189, 167, 258, 13, -237, 127, 260, -208, 5, 95, 239, 261, -113, 34, 130, -37, -251, -52, 227, -248, -131, 24, 207, 79, -163, -58, -39, 294, 19, -143, 309, -65, 139, -195, 59, -170, -229, -225, 195, 14, 60, -9, 52, -26, 43, -191, 2, 120, -53, -80, -27, 161, -9, -231, -24, -1]
2846al5k3p2K63k16J33j15L23k91L9l9L8o2j2J07j01J48j55m5J77k91L03J48k38
2870a7L46m09l77N62j42l02j8M11k6j28L9M4J64j01Mk8O7j48l36L22K54J22l52
2893d9J2J13j20p1J28L19R3o21M6J37Q7J5k77J96k7l44K66J72k7K74m15N2j61
2916b02j15J14R9J63j64j83L63N3k82K72k07K47m6j25n8N33k30k97M8l1k23K01
2938g0l9J22P1j92p1q0L71k44K58m2J52m55K00k10L75k50L1J52K00m29j62M17
2960A05R3o9l34J67J02j88j76J66K29l86J70N8j71K51j31K6K68K85n99K08N7K9
2982A60j44p9RJ6j55Q6N6q6j60N24k43L27l84J10L1J01j87OML11m60n6L72j82
3006b3j2k62M64O6l78R0J84Mj3j66K69J94m54n1K55q1k6l92J83K18j16K28j24
$$ y = [-1, -36, -59, -131, 132, -84, 49, -66, 257, -34, 5, -34, 4, -58, -70, 37, -64, 84, -71, -116, 61, -230, 73, 221, -17, 329, -80, -457, 105, -37, -339, -357, 54, 28, -100, -61, -17, 147, 46, 50, 22, 89, -59, -395, -73, 181, 303, -49, -37, 76, -44, -115, 13, 332, 425, -196, -150, -13, 74, 89, -188, 8, -19, -363, -97, 75, 48, 322, -93, -41, -202, -317, -203, -104, 59, -105, -288, 75, 128, -154, 118, -89, 158, 112, -13, -71, 462, 232, -65, -17, -48, -271, -70, -109, 13, 84, -108, -179, -259, 112, -132, 126, 84, 236, -219, -19, -229, 146, -104, -73, 79, 279, -150, -312, 105, 198, 129, -205, -38, 64, -124, -300, -134, 95, -291, -121, -63, -234, 17, -114, -88, 180, 465, -134, 74, 131, 160, 16, -63, -54, -38, -193, -107, -51, -137, -297, 227, -16, 311, -73, 37, 68, 169, -18, -12, -8, 303, -157, -213, 159, -23, -35, -297, 167, 233, -145, -55, 129, 133, 120, -46, 223, 417, -37, -88, 167, 86, 60, -332, -149, 69, -47, 181, 57]
3029E7Pn3P0j53J89r8j64L12q1j53l7P8KK13k58K58l67J23n3q3P8K45p0l8k88
3054b64O00l55j77J10J96J24j84j38K01k14K90K0n8r6j53K59n4n0q7Q1L46o45
3076b48rK52K11J05l15k25K34o6j48M45m14N5j02K64Lk01L8P3j58L42l15Q9J97
3099A07n8O2k80J28K78k86k24K13j7j58K92k59K86j7j57k25K76P1k77m0K85J74
3121A74j45j95j46N54j4m10L78o0k03j38K93j10N3P1J46J4k17j88J43J4k62J93
3143e5N8K56j99j33pK68j77K77k51J40J86k11p6L8o9k06LJ45J81m83J06J74K50
3166B15J1l44K12J0l4j88J03Q7j29l08N1K91J37n7J8N4Nk04K51k60K77k92K35
3189A41l2J95l59O3q5J82j90m1Q7R0N6m18L33r9r2K70r7M9K8m32K97m0n4j11L33
$$ y = [57, 64, 11, 81, -72, 117, 19, -145, 167, 86, -67, -104, -26, -24, 189, -69, 189, -178, -55, -108, -191, -113, 132, 62, 24, -264, 336, -19, -196, -86, 110, 234, 50, -88, 113, -101, 189, 209, 151, 55, -98, 161, 107, 57, -30, 51, 397, -248, -257, -5, 206, 311, -4, -229, 5, -61, -209, 236, -178, -123, -225, 39, 42, -159, -121, -48, -206, 136, -179, -90, 107, 49, 111, -169, -41, 237, -49, -273, -60, -77, -235, 57, -202, 84, 67, -90, -315, -39, 32, -245, -285, 0, 174, 29, -166, -312, 242, 228, -182, 196, 136, -67, -205, 88, -22, 31, 102, 248, 262, 45, -143, 0, 14, -248, -55, 3, 259, 60, -73, -80, 188, 11, 288, 37, 177, 363, 152, 76, 114, 45, -161, -158, -13, 168, -315, -209, -35, 215, 226, -118, 94, 104, 70, -118, -15, 72, -57, -365, -314, -23, 114, 57, 75, 129, 134, -70, 181, -79, 198, -94, 141, 109, 304, -55, 8, -77, 105, -85, -126, -39, 51, 107, -311, 22, -77, -169, 101, 4, 53, 81, -351, -54, -94, -148, -259, 74]
3214G4j7j52P3J77k21j6j35K22K31l65LM2L88k22k01Q3J68K8l92m8L38j8O2r1
3238A1q7L12j69l3l72M74j68Q6OQ5j84O4O1j55PK49O3l92j66L16L9j07%m0J64
3263F4j93K52l49J02J78j48p9J97j18J90J6j18QR1j07j92L53j01k74L71k02K74
3285B15k24n7N5O1m43K65j24L43n6n7O9p6J90l21J52j52R9Q6j51M0m2j19M16m44
3309b75M08j35j89K57J1p6k48M04j53J78l81nK43k51N7K05J95k83j08nK58j17
3331a0J6R6j78K9J4L6q5J92k86Q8O03l99j47L30k19k05K14j35J80M1k14j55L02
3354A08k57J61j65M76k52k15K5J06Q2m68L15J53j39J24n6J41l7k43r3R2O3J30
3376E1L7p8l49j8K55K06k26K1j21K20M2j22L21j91L5q5k8kK11n5k20R4R8J4j94
$$ y = [74, 57, -95, -22, 155, -66, -82, -217, 5, 236, -129, -126, -84, 304, 82, -119, -36, 132, 160, -232, -280, 58, 40, 102, 11, -76, 236, 67, 34, -338, 136, -32, 54, 60, 145, -39, 25, 86, -69, -62, 187, 250, -142, -308, 8, 47, -60, -60, -100, 64, -129, 123, -226, -124, 54, -94, -173, 24, -94, 96, 112, -6, 2, 93, -14, -206, 147, 46, -228, 143, -59, 215, -9, -66, -11, 50, -393, -128, -252, 91, 35, -22, 47, -29, 161, -160, -8, -160, -61, 25, -126, -86, -128, -247, 169, -275, 133, -2, -191, 66, 77, 1, -247, 157, 4, 182, -199, -204, 39, -212, -155, 50, 245, -38, -146, -151, 107, -10, 6, 102, -76, -47, -33, 3, -82, 110, -176, -88, 515, 116, -31, 299, 80, -125, 89, -46, 134, 175, -39, -194, 108, -149, 12, -153, 323, 71, -144, -119, -13, 69, -399, -84, 69, -70, 54, -2, 139, 102, -141, -234, -142, -79, 51, 88, 10, -339, -357, -102, 104, -122, -101, -222, -2, 40, -82, 239, 48, 83, -2, -30, -32, 179, 124, -96, -2, 96, 110, -84]
3401h4o5M94m70J07J44k05m3q1N44l29K47m24O6O4J12j33J44L45n40j3j09Q6L16
3424A73k15k58O25r1N9o52J023L18j149K53J86K5K59L3o30J59n98j1R39m43k66
3445b61l07O21q13J803j040o4O29j36o78O87j84N06p16k46L0q37J065K92m09M34
3465C76j5p11K49K70m57m3J235o36k16k33J23j47P36m59k75o9M27nl26K18J4j57
3487a01Q0j53rn4R9j1K84j84m36M57K03l94j56N09K56m77J13j0K40p5R8q0p5k91
3511a67k26l0N27L6j05N0J81j95n5l79M37L6j25j43j0M05l22n7J00j0k9J90q2
3534B7J51l02J30R1K9k2q3O6l14%J89K92l6l84J87j13K41l17K1MJ79j68K52k42
3558a22J35N5j64j4J50K32k56j97P7J30J17k20J04J46k51j92M50o5o8n3J00j16
$$ y = [-84, -149, 345, -125, -18, 126, -79, -122, -203, 341, 12, 259, -165, -99, -35, 77, -56, 88, 433, -107, -120, -229, -143, 173, -42, -300, 325, 234, 293, -359, 664, 982, -167, 86, 272, 297, 556, 589, -41, 118, -480, -491, 448, 5, -261, -568, 53, -760, 1043, 3, -61, 568, 432, -246, 441, 257, 763, 47, -199, -169, -1006, 59, 351, -58, 376, 361, -350, -101, 169, -288, -331, 904, 268, 52, -181, -58, -205, 531, 72, -203, -272, 155, 150, -176, 42, 56, -101, -21, -174, -183, -237, -138, -149, 135, -49, -485, -28, 175, -219, -375, 134, 390, -87, 26, 16, 256, 181, 279, 199, 124, -167, -393, -423, 104, 140, 35, 85, 266, 71, 16, -363, 74, 110, -15, -158, -168, 237, -85, -142, -42, -52, -81, 109, 27, 178, -124, 6, 97, 126, 104, 21, 87, -227, -227, -38, 254, 218, -166, 21, -92, 149, -168, -147, -143, 36, -132, 120, -122, 13, 68, -96, -110, 40, 272, 16, -181, -104, 26, 143, -77, 27, 173, -78, -270, 180, 115, 47, -6, 94, -22]
3580b2j92L69j24j23R5q3K27l67L79k8j66j23J8L59k25pM4j68N26o16M06k63O
3603g8J49l80L90j38K69j32J55k22J88p5r1j40j92P41l47n7j59O1J41j28J15n8
3625A2P1l7M4K08Q3m52K23Pk11K8R1o7J84m34L08k17L40j51l45M15q5j89L70j57
3649C9J35m49L56J8j1l08K75j83K13M9j01l0k16L83k10M4r4J16o4j19Q1l02L85
3672Go0j85M02k22N3J91m5r7k69K04M7l15L03m4Q2N5k0J47k44K33j29j7j78K45
3696A44P8j24j76R4K07k60j16OJ03J25L9l11K22p6L21l14o6J99m5J08j68%J91
3719A81Jj36j77K70q9K6k42J66m0J8m3J70k15P4J43K49k63k7j30l1Q6J7j46J56
3743A8kk9j72J33J23j54J23P4j18N1J10k08O4j08J7K02M6n0k96K42o2J55j62R
$$ y = [-22, -214, 155, 31, -92, 3, -80, 147, -220, 159, 131, -35, -158, -140, 219, -6, -13, 31, -137, 389, -227, 179, -84, -78, 71, -309, 81, -57, 212, 80, 235, 13, 201, 126, 35, -105, -297, 444, 97, 40, -119, -58, 83, -45, 70, 12, 83, 46, 90, 298, 381, -71, 152, 159, -52, -24, 67, 0, 184, -250, 58, -159, 181, 30, -315, 100, 15, -174, 196, 39, 174, -275, 81, 99, 88, -220, 55, -128, 85, 134, 33, 3, -213, 170, -40, 4, -90, 26, -38, -157, -76, -378, 7, -53, -238, 164, -58, -5, 186, 141, 44, -225, -21, 26, -289, 14, -30, 52, 107, 87, 234, -10, 223, 94, 77, -101, 144, 222, 98, -78, 16, 223, -37, -153, -147, -44, 81, 120, -191, 31, -45, 276, -38, -104, 95, 50, 158, -10, -10, 181, 182, 46, -131, 139, 50, 76, -166, 0, -40, -22, -65, 105, -110, -36, 107, 356, 93, 66, -64, -95, -9, 8, -138, 18, 16, -13, -185, -52, 71, -83, 40, 114, -4, 47, 157, -51, 13, -95, -78, 124, 170, 120, -176, 66, 4, 159, -3, 6]
3767Fk1J75L0k38j04J72q1LK02k13O6q5L6MK39J35m06N2j3R9M4j26O8o8J55J78
3793C09k76j16n0K28o8Q9l02K58P9j78j5J96k59J88j24j37J43J89l5l5mJ3j15
3816b2j76J12j81J61J61L06n37O9L5RK05l77M51l50k8M25l72J22j99nO6J19m0
3839d6j78Q6L24k37O4qJ55k92L77O8l59k11L12k77J28L22n0k70J14k27J11q5K07
3862B8q6J64O2j63Q9j57m1K06J91k69j54K2j32K83N6j88L19l93J27l3JL79m43
3885a32J16o1L64ol03j54J51M96o16J68J65k95p6Q5J24J41l07Q5J27q5k9J12j83
3908a13q8J02n5Koo3R9J82j96J43K44m13MJ45k30K42M1P6j74K08j74j7K86l62
3932a17L57N2l11k06K86j20Q8j66J65j64J19k5K51q3l97L49N3k01K04l3j4j74
$$ y = [6, -15, 160, 190, -48, -152, 20, -61, -58, 144, -69, -3, -88, -52, -48, 191, 326, -80, -28, -41, 58, 102, -24, 44, -24, 131, 309, 33, -83, -133, 95, 27, 116, -186, 72, 151, -27, -42, 154, -105, 83, -41, -178, -35, 154, 119, 84, 80, 93, -22, -198, -86, -267, -106, 55, 361, -176, -107, -72, -63, 142, -235, 216, -134, -162, 263, -109, 13, -186, -191, -125, -6, -46, -224, -138, 186, -51, 13, 5, 160, -132, 245, 313, -46, -257, 55, -222, -94, 228, 178, -92, 22, -205, -94, -179, 28, -58, 106, 168, 5, 94, -63, -104, 102, 293, 24, -130, -108, -240, 43, 99, -89, 230, -163, -36, -69, -68, 311, -132, -16, -77, 287, 281, -22, -176, -25, 471, -145, 23, 188, -107, -183, -98, 26, 167, -140, -55, 72, -13, -42, 70, -113, -201, -99, -154, -152, -158, -221, -122, 60, -136, 7, 251, -162, -158, -13, -243, -1, 40, 116, -58, 150, -24, -41, 245, -117, 240, 292, -19, -225, 61, -59, 29, -137, 28, -136, -17, -42, 209, 126, -271, 78, 131, -70, 134, 101, 87, -87]
3954h7K83l61J62K2nO7p7rJ71j82j98K78lo0k14J65q1J44p1K11J8k71J91n8J36
3979A71J4k18K15p3k22L30j14j57j41Q7K90j37K7K50m14K06k24P1K36j04m4k69
4001b20o2K71K3O5pp7r5K2O0J9k46J99q5OJ10J6J20J39k36k58J30J4J69J91k72
4026dk15J17K71n51M09o4M5l43N28l9q7o5L0n9O3m1q1K25j33N9m9K3L52m12K04
4051A83n7j84O6M9R2n1j20J55l6l15K47L1M0k04J94p0K08j51j12N9k10M7lR4k
4076e0j45M08m0j79L3M2k36L1J6L98m35np2P4L02k06K49j35r3J4R0r1j90lK14
4101iJ77k66K79j11n3LnK60m23J39P7q6K04k26J40K10q6l38J67j05J01k27K57
4124G9o4m0J36j44M3l0J45J3k15j27J76qj40M20n10J17J18P7l7o9M5J34M1M1k69
$$ y = [-87, 196, -165, -3, 19, 14, 81, 4, -5, 166, -16, -214, 64, 61, 1, -213, -48, -129, 15, -56, 155, 173, -98, 93, 35, 171, 185, -33, 182, 109, -113, 217, 103, -54, -195, -108, 182, 45, 72, 322, -92, 114, -110, -39, 197, 93, 49, -220, -282, -11, 12, 77, 70, -7, -102, -80, -20, -1, -247, -48, -133, -127, -17, -1, 119, 258, 22, -236, -106, -92, 77, 268, -4, -219, -102, 169, -382, 27, -37, 8, -335, 193, 154, 67, 2, 32, -27, 36, -5, -86, 139, 6, 65, 16, 39, 391, -21, 183, 126, -58, 8, 57, 149, 98, -22, 133, 97, -218, 29, 60, 100, -104, 90, 20, 228, 77, -35, 24, -186, -139, -142, -48, -50, -195, 213, 173, -6, 27, 69, -167, -136, -120, 278, -157, -162, -234, -160, 142, -64, 185, 50, -43, -29, 61, -30, -220, -223, -9, 168, -98, 181, 70, 17, 20, 15, 275, -148, -9, 68, -18, 186, -40, 100, 310, 224, -114, 53, -52, 49, -178, 79, 15, -25, 111, -33, 10, -20, 125, 138, -77, -204, -28, -36, -176, 244, -266, -149, -31, 46, 9, -60, -15, 119, 160, 201, -68]
4149f8o4K31l49N74l44r8j84K43L90m25O0J4L79m90O3N9j18L11k77j55K49J11
4171A12k08J36j7k45K36K8n4j22J22p5J55J15j46R1j98m4j97J46K56N4l14J52
4193a7K31r3k33M6lj6rJ19l17M00k98K80j55N8M5O0j93R8o5J87K0mj21J19j21
4218A8P5R1l22M20k73k45L07P0n2p3j7j93L98j18k76M2L07k40M88l47q9p7j55
4241b61n7K57L50l23j25J38J61j09J2p1j13k1K81n6j03J63P2j60lk41K93Ol20
4264b30L61l69K38k88K59j35j27K66l9r6J54L25k36j3j69J7N4j6l28M34qj03j85
4287b34K41l6n1K0K09l16k4O0N6P0j34L32p6j66r4J07l7Q0k50K29j83J4K96o2
4311E1l0r2J92j7n21L19L86j02M5j41n1r3L0k08L05K5J88j51j30k25J05l3q8L34
$$ y = [-68, -132, 99, -250, 324, -20, -118, -302, -59, 331, -94, -34, -20, 359, -131, -68, -9, -127, 184, -93, -248, 1, 112, -96, 40, 23, -222, 14, 42, -12, -134, -12, -87, 68, 183, 37, 128, -70, -114, -311, -165, 91, 145, -169, -17, 214, 121, -112, -66, -69, -85, -94, 25, -292, 108, -190, 90, -65, -7, 38, 98, -95, 3, -62, 125, 145, 141, 20, 139, 18, 93, 184, -138, 282, 9, -236, 71, 141, 89, 16, -1, -194, 204, 86, -190, -148, 159, -81, 407, 60, -29, -106, -261, -318, -61, 289, -34, -159, -21, 140, 31, 43, -28, -141, -162, 119, 63, -40, 123, 195, 35, 32, -209, 84, 90, -230, 131, -238, 0, -288, -29, -164, -291, -25, -64, -160, -6, 319, 83, 70, -99, -82, -28, -44, -372, 62, 54, -49, -234, 7, -29, -80, -60, 149, -167, -191, -131, -75, -5, -139, 193, 117, -49, -143, -36, -73, 7, -243, -14, -197, -183, 113, 51, 21, -71, 121, 104, -417, -98, 288, 186, 231, 90, 39, -54, -24, -232, 73, 98, 286, 135, 5, -220, -115, -148, -236, 98]
4335I8J84k47J77l23rJ13mQ1l64M15k9l28K38p5J77l0J89j53jj18J11j18O1m9
4359dR0p1q8Q2J55j50n5J73p5o28M47N7n0O4L9j07n5OK43n3n5P9J22j19L6j21
4385c8r9K07j27K53k08n3K54k30J31m4j14M2M5j79N4k38K85J36j03m0j09Q7J97
4408A09P9l9n1K19n29P3J28L9q9J23J49k93J02k67L01O6m4Kn7mj24N0J32j93K78
4433A60k33n4K11Jk40P5K0J7J47JJ08k27J47k4q4r5J54k0j66J89L8l28J08M1R2
4458C8J29j54K4N2J01j83J78l17k0K88j29P6O8j61k28L10M3k16L41l79J38J16
4480A15N8l33L79l83K35J02l12R7M4J18k91M74l9l06P5l08K87j80K36nJ05k43
4502g5J28J80j58Q9o5j71O3o8J40j99K29k11j21M0M32j86k62J88N6L7J39k93J22
$$ y = [98, 282, 35, 212, -111, -120, -7, -11, 70, -294, 121, 92, -236, 2, -73, 104, 74, 263, 110, 109, -9, 102, -16, 45, -4, 86, 15, -73, 9, 164, 14, -41, 132, 57, -571, -124, -67, -117, -53, -14, -121, -176, -170, 73, 20, -35, 44, 166, 47, 83, -38, -137, 70, -57, 196, -12, -65, 189, -41, 90, 46, -68, -26, 19, -160, -106, -344, -59, 77, -26, -66, -175, -88, 109, 188, 149, 98, 317, -212, -139, -11, 28, -61, 62, 211, -82, 20, -247, 54, 120, 76, 78, 21, 17, -107, -57, 75, -118, 160, -73, -127, 84, 85, -155, -80, -60, -43, 104, 105, 213, -14, 133, 109, 25, -70, 84, 64, -102, 87, 125, -203, -95, -54, 38, 167, 13, 37, 89, 190, 7, 185, -132, -152, 136, 7, 83, 151, -10, -238, 72, 115, -101, 240, -139, -1, 115, 173, -160, 219, -164, 71, 173, -139, -42, 2, 120, -171, 303, 264, -42, 33, -275, 12, -168, 68, 63, 168, -75, 53, 233, 75, 164, 99, -72, -9, -77, 63, -136, 93, -118, -239, -199, 233, 47, -215, -27, 29, 66, 205, -88, 34]
4525C4j16J8Pj00L73qj09k0p4j34J05J83m3k55R9K28k29k2M7N8M9J02k25r0j13
4550b35J25J91k64l7R8J78j80M10n19K70j62k9M14r6k54J22j50M3m6K19R4J11
4572C03m58N90m66j61J15K50m2j87L81m21J34l4o1J19J15j15N0L6p6k12N2J73
4594H5j47J28o5j83O09n15N0J80k21K29k78K11j70J50Q5k64k9q4J27J81k25J55
4616Il02M04L9k55j67K25k63J13L9R3k88N10j17j06J67J56J06k24k52J41p4j37
4638a83j62L42K05k51K16j38l6q4m3J35k1j26o7K08j83M40k01j36o8L26k38P7
4660A2n0j7J38O6j20M0m1m3k58L82l47L40j38K28l44J52k38N52q7p5Q0k37K9l2
4684hJ75o1M1l03L93j94r5L9p0J5j44K26j67J47O9M5J5k68L02k16m4L46j60J0
$$ y = [34, -82, -64, -57, -157, 216, 208, 99, 79, 5, -129, -24, 159, 116, -139, -40, 188, -41, -63, -16, 42, 91, 193, -32, -122, -235, -110, 81, -183, -220, -122, 56, -124, 286, -233, 37, -125, -154, 260, 164, -90, 32, -118, -75, -121, 98, 192, 303, -155, 435, -31, -192, -77, 173, 131, -56, 325, -96, 38, 4, -57, 62, 177, 62, 112, 148, 72, -140, -88, 85, -62, 66, 1, -182, 427, -88, -38, 142, -79, 150, -128, 83, -87, 63, 148, -116, -145, -229, -102, 79, -146, 9, -293, 111, 150, -105, -272, -47, -310, -197, -158, -65, -353, 157, 40, -66, 101, 257, 363, 139, -113, 28, -46, -183, -345, -3, 202, -49, 167, 29, -7, -91, -134, 1, -20, -146, -213, -5, -188, 252, 51, -85, -153, 173, -65, 12, -38, -55, 83, 149, 29, 69, 28, -15, -273, 109, -238, 102, -36, 192, -152, 0, -238, 314, 227, 152, 232, -5, 24, -8, 167, 106, 147, -156, 237, 43, -52, -13, -83, -68, -212, 14, -153, -6, 63, 108, 123, -145, 157, -59, -103, 243, 83, 93]
4708I3Q4j48N8k14L87l60KP5J87nL6m0o5k75K82K5j15L2q9J86j76R1n7J00k21
4733a27Q7J08o2r3M9J07m45K33L5R8J48p3l17K45j29J68P7k32j22L95k63J56q3
4756d0J4J07j20J46n4K1j76K4Oj16K59j88J46l2M1j05P8qM2p0J56j4k35J68j6
4781C4r3N8K67j25r8k25J48r6O8n7J16n0J70k72L87m30J20J40o2l9k2L8J18k55
4805a60K03k23K40k47J77K63l67k9K27j30j7J58k06J78k2k3M1j88K39Q9p1N4k97
4828a11P7j12J64M4k79J16r9J30K51m11J07J28K3L5K50l88Q6j54J85J9O5kj31
4851gJ32O4j83P9l8k14J50J2j85J7M05l13K28j86k04L32j83L66l35J0r1M09k17
4874D8K1k39r8K87j1k5J77m8j3j99o2P5k2j4J35K2m42N5K98J82o5j64J34Nj36
$$ y = [93, 177, 29, 87, -127, 260, -100, -98, -23, 164, 159, 195, 155, 90, -185, 97, 122, 7, 39, -50, 136, -40, 51, -6, 94, -127, -40, 68, 6, -87, -38, 69, -376, -143, -108, -10, 138, 65, -252, -7, -136, 32, 109, -123, -245, 150, -113, 43, -40, -26, 81, -39, 107, 53, 74, -102, -78, -72, -188, 71, -117, 29, -3, 38, -67, 11, 3, 45, -25, 131, 117, -118, 50, 34, -59, -1, 266, 141, 43, -182, -34, -130, -62, -119, -3, -53, 117, -155, 232, -198, -78, 62, 0, -39, -61, -23, 95, -160, 43, -180, 60, -187, -10, 253, -114, -143, 84, -46, -63, 95, -111, 67, 45, 22, 63, -125, 114, 203, 132, 186, -111, -34, -146, 18, 62, -217, -101, -200, -70, 181, -230, -123, 5, 28, 63, 313, -75, 11, -143, 42, 61, 126, 124, -7, 125, 189, 6, 85, 47, -167, -17, -5, -190, -173, 232, -81, 147, -39, -243, 89, -94, 272, -63, -53, -144, 265, 48, 69, -170, -268, 19, 8, -17, 160, 112, 99, -100, -162, -87, -109, -123, 12, 34, -408, -353, -55, 127, 62, -102, 32, 37, -99]
4899i9j3K03o8j40QK0J25r3K98k5k97OR3K2R1p9J24K9L8j91J64j28m3K8k31K19
4925F1m3M9O1j29oK9r0n8J22K15l87M55j66J6m31L4J56J48O5j46j68K58l0L0N6
4950A01J99n82M21k95J16J39O7k55J55l35J32R0J07j33K82r6l39Q8L14k12j28
4971a64K71k81L40l75R6K32O4j76J1J12j74j71K16k54K65K1j78J39j76K26j75
4992a31j20K52q7j0L4J77j42J58k30Q0K26k29r2k2J46q2j11j27L83k27J39l2P4
5015B7k09K03j52K78l2k3j25m6L45k73J48l16K55r6L2j45K11q7J63k15K6j1j12
5038a54K25l9j33J46o7K30N2k82J2j87L12q5J41j91j89K69jrk14K01j2R9o8J17
5062A73m94J99L9P8j13r9K3K24K58k35q4j55L15M8r3j32lK63n69L23J1j96L52
$$ y = [-99, -112, 91, 23, -117, -109, -89, 36, -57, 241, 216, -81, -75, 18, 40, 131, 52, 176, 205, 243, 52, 216, 88, 45, 73, -158, 61, 18, 67, 128, -1, -7, 22, -68, -126, -4, 211, -176, 279, 113, 129, -302, -268, -112, 36, 101, -45, -213, 45, 15, 45, 101, 300, -282, 139, -156, -40, 99, 166, -89, 66, -269, -137, -47, 60, -73, 209, 113, -226, -138, 176, -36, -164, 107, -174, 166, -209, -113, 119, 183, 7, 18, 130, -44, -215, 1, -253, 12, 33, -145, -6, -182, 44, -131, -251, 1, -86, -96, -62, 115, -27, 131, -99, -19, 207, -22, -114, -136, 10, -72, -183, -310, 73, -154, -15, -47, 27, -182, 21, -131, 147, 115, 92, -33, -79, 266, -7, 141, -175, 80, -16, 16, -129, 82, -5, 158, -57, -31, -42, -154, 71, 32, -101, 45, -22, 208, 260, -22, -10, -197, 115, 30, 171, -20, -209, 60, 59, 50, -164, 37, 25, 124, 56, 173, -321, -122, -83, -5, -118, -217, -194, 30, 288, 53, -31, -186, 129, 177, 84, -48, -51, 212, -357, -34, -23, -219, 133]
5085A33K9j75R7j44J48j9l4m3r8J65p2j16J34r9L12K7k6P00j004l79M84k02Q77
5108F95p35r8K79Q6Q4n10K74N8l11L4Q4m2K39o9K2N1o9p8k6l1J89k13K84j34J17
5133A80n52K54qO7m0L02m3k82K77q5j19Q0J95m05L07j6j84j51K33o6k09L53j09
5156b1J62j72o6N9L54l34R3o2K51j60J34j62Rj23J13o8k6m6R9j55J10Q5J6p4M3
5181E9k85K15J42k5j98p0J45m1j68L1L00m4r8L16q93J068n18q2R0R6J57j92mj76
5205a75M8k9L68j05k0J65P0k5k22j82j72L43k06L72j76j5K14j09k03l41O42k00
5227D2qj59J89l00P0K84K01l85k22M79j22p2n36J007r9l97o2j83J68k97L56m1
5249h7K64Lm31R8j7J18O8j61NoK5l4Q8Q7j07L40l25m9J07k00K39J09J78j64M6
$$ y = [133, 162, -13, 84, -60, 88, 69, 35, -8, -106, 59, -13, -129, 5, -94, 218, 245, 219, 919, -85, -464, 20, -182, 695, -40, -138, 141, 227, 311, -199, 75, 133, -178, -144, -60, -102, 137, 68, 90, 141, 72, -6, -32, -63, 126, -87, 197, 63, 180, -372, -118, -126, -59, -99, 203, 160, -122, 155, 70, -49, 31, 226, -179, 128, 112, -72, -223, 10, -56, -265, 88, -21, 141, -31, -97, -38, 316, -18, 75, 13, 264, 104, 238, 76, 85, -38, 75, 7, -19, -65, 34, -121, -11, 74, 90, 16, 59, -226, -11, 131, 106, -92, -162, -17, -58, -226, -195, 105, 61, -37, 279, -614, 454, -64, -146, -56, 40, 197, 5, 1, -175, -127, -156, 212, 107, 87, 252, 322, 297, 75, -107, -279, 64, -142, 230, 54, 39, 253, 144, -59, -400, 242, 42, 34, -125, 64, -236, -166, 118, 319, -66, -288, 191, 69, -3, -539, 468, 369, -28, -90, -273, -105, -402, -46, -87, 177, 180, -251, -153, -170, -52, 16, -145, -140, -146, -121, -155, -67, 20, -87, 253, -72, -121, -14, -214, 25, 134, 312, 148, 194]
5274A94j45p9q7J03r8J0r8K91j21Q8K72m31J49r1K24l38l3L50j59j23J09M7o7
5297c3K51m53K98j17j64K43j72o9n0N14l22J18k47K41l07M8K61j97N26o43QK80
5319A4J7J7J71k98K44m7k0j70P4Lj54J23O4k81L95n83L37O0K7J20l19M02l49M92
5343C39l26R1M2j41j51N4m3n3R5j3Q1P5r1N8j64R1j16K00l6l7k19N06n24L42j16
5368e6J42m6J69k36j49L1Q9K26k91N29l03L3j82j7K8N1j85Q5m7K69m9K4k48M78
5392C45k87p2QJ73j67L2j6l6j02J01J75r2j82J57Jj22j82K11L7j01J32l87L48
5415b6k07J91O8n0N9K43l41K05p9k85J81O5j62R5n7L8J06K12m45J52k54J21n0
5438b20K41j99K9o4L85K4k56J29l21L90k44L01k62L01k62kj03K46o7k07N3J51
$$ y = [194, 49, -30, -117, -14, -112, -102, -200, 91, -30, 58, 330, -101, 48, -43, 181, -157, -190, 160, 1, -122, -13, 34, -33, 218, -235, 63, -54, -218, 25, -147, -216, -266, 248, -74, 44, -203, 38, -269, -221, 40, -157, 369, -274, -266, 14, 31, 48, 219, -79, 165, 118, 98, -72, 2, 5, -149, -26, 38, -243, 152, -431, -94, -34, -7, 113, -206, 196, -153, 339, 13, 104, 146, 5, -146, -92, -135, -188, -93, -106, -25, 50, -41, 17, -147, -56, -172, 28, -8, -45, -264, 242, -282, 60, -56, 86, 40, 209, -27, -176, -145, -56, 170, -121, 408, 105, 138, -44, -61, -33, 18, -167, -82, -129, 140, 91, 115, -133, 345, 58, -14, -6, 167, 0, 32, 16, -20, -122, -21, 154, 62, -120, 37, 38, -84, -266, -55, -18, -119, 13, -374, -26, -233, -42, 26, -24, 35, 278, -63, 142, 63, -222, -41, 24, -138, -43, -100, -62, 44, 256, -189, -37, -291, -170, -220, 21, -178, -149, -213, 172, 196, -60, 69, -252, 138, -106, 195, -67, 234, -28, -30, -133, 113, 46, -161, -108, 43]
5460D3j6k48Q9K45m0m11K13M20k00l52L71k6k65L54l72K27P2j43n0P8LK00k37
5483d5j90K55J97l22j16J60m2l89M73R4L0j50J9jr8K38l28J0J59N0N4l20N57l33
5507c8n3K11j00k2J67j34qj4J61l78J96J26ok02K53J22m8j43k32K86k05J81k20
5530a00J83l08L48k83J20K71k16k3j7MK35j60j93K97n0q3k7RL4k2n4R5j7J30j73
5555@J89l42Q9J00pj06J30j36J17K39k65j06K44j06J9k23K79j39NJ79l26K09r3
5578e0j25K64k17J59NK73m49O94m60q6j53j3J33l30N21j97l3J67K15l30j78o8
5600b58K09K07j5J3j40R6j72K17J78k34j78k5r1M54L9k05n5l93P3O0N08j76o8
5623D4j14L6K14r6K69l66J86j84J56j57r4J61J81m94K58K04j37j84j24K97j52
$$ y = [43, 27, -221, -132, 113, 73, -338, -125, 295, 95, -257, 114, 88, -177, 177, -195, 32, 104, -39, -89, -11, -8, 192, -45, -235, 20, 217, -105, -221, -61, -103, -492, -19, 75, 105, -45, -26, -27, -125, 113, -215, -205, -46, 4, 58, -262, 295, -38, -91, 120, 20, -2, 165, 31, 23, 9, 170, -208, -12, 114, 108, -94, 159, 281, 233, 90, -142, 144, -61, 120, -100, 83, -225, 123, -160, -40, 231, 15, -8, -25, -21, 214, 54, -139, 158, 108, 25, -2, 7, 41, 19, -35, 60, 43, 173, 0, 189, -153, -64, 36, 29, -77, 53, -83, 34, 273, 8, -98, 146, 40, 59, -164, 115, -24, -19, 160, -166, 43, -50, -175, 89, -128, 31, 36, 309, -140, 554, 94, 8, -145, -158, -25, -355, 166, -31, -64, 103, 318, -12, -190, -258, -49, 158, 143, 156, 16, 112, -60, 157, 335, 101, -77, -102, -193, 261, 300, 95, 40, -353, -280, -220, 288, 112, 44, -70, -34, 180, 84, 353, -13, 173, -11, 145, -12, -106, 55, 236, -258, 0, 204, 67, -117, -241, 56, -96]
5644i6J49J54l35O6N0K85j42j73L49l11J25L4l25J64L0N7J71k47o3N2J06m7J10
$$ y = [-96, 53, 207, -128, -62, -12, 273, 131, -42, 307, -4, 121, 155, -170, -6, 24, 81, 252, 5, -58, -6, 100, 53, 163]
$$ [...]
8191a6
##END NTUPLES=NMR FID
##END=
