##TITLE=1H_DE-TEST_CCl4_TMS
 200.13Hz,CCl4.
 8 sc
 8.6.2026
##JCAMPDX= 6.0         $$ Bruker NMR JCAMP-DX V2.0
##DATA TYPE= NMR FID
##DATA CLASS= NTUPLES
##ORIGIN= UXNMR, Bruker Analytische Messtechnik GmbH
##OWNER= pz
$$ XWIN-NMR		Version 3.5
$$ Mon Jun  8 13:44:16 2026 Russian Standard Time (UT+4h)  she@DPX200
##.OBSERVE FREQUENCY= 200.131
##.OBSERVE NUCLEUS= ^1H
##.DELAY= (6, 6)
##.ACQUISITION MODE= SIMULTANEOUS
##.ACQUISITION SCHEME= undefined
##.AVERAGES= 8
##.DIGITISER RES= 18
##SPECTROMETER/DATA SYSTEM= spect
##.PULSE SEQUENCE= zg30
##.SOLVENT NAME= CDCl3
##.SHIFT REFERENCE= (INTERNAL, CDCl3, 0, 14.3821)
##AUDIT TRAIL= $$ (NUMBER, WHEN, WHO, WHERE, WHAT)
$$ ##TITLE= Audit trail, XWIN-NMR		Version 3.5
$$ ##JCAMPDX= 5.01
$$ ##ORIGIN= Bruker BioSpin GmbH
$$ ##OWNER= she
$$ F:/spectra/data/she/nmr/H-C/1/audita.txt
$$ ##AUDIT TRAIL=  $$ (NUMBER, WHEN, WHO, WHERE, WHAT)
(   1,<2026-06-08 13:41:03.20 +0400>,<she>,<DPX200>,
      <created by zg, POWCHK disabled, PULCHK disabled
       configuration hash MD5:
       00 E9 B6 7A A2 85 ED C7 34 08 36 98 17 FE 4E 26
       data hash MD5: 16K
       92 7B 5D E5 F0 F2 B6 73 BF 3D 57 5F 5A 6F 61 9C>)
$$ ##END=
$$ 
$$ hash MD5
$$ 7D F2 CB 05 5B B4 E4 B5 2C 67 34 D6 33 98 9E 9F
##$RELAX= 
##$RELAX= 
##$RELAX= 
##$RELAX= 
##$RELAX= 
##$RELAX= 
$$ Bruker specific parameters
$$ --------------------------
##$DU= <F:/spectra>
##$EXPNO= 1
##$NAME= <H-C>
##$PROCNO= 1
##$TYPE= <nmr>
##$USER= <she>
##$AMP= (0..31)
100 100 100 100 100 100 100 100 100 100 100 100 100 100 100 100 100 100 
100 100 100 100 100 100 100 100 100 100 100 100 100 100 
##$AQSEQ= 0
##$AQ_mod= 1
##$AUNM= <au_zg>
##$AUTOPOS= <>
##$BF1= 200.13
##$BF2= 200.13
##$BF3= 200.13
##$BF4= 200.13
##$BF5= 200.13
##$BF6= 200.13
##$BF7= 200.13
##$BF8= 200.13
##$BYTORDA= 1
##$CFDGTYP= 0
##$CFRGTYP= 5
##$CHEMSTR= <none>
##$CNST= (0..31)
1 1 145 1 1 1 1 1 1 1 1 1 1 1 1 1 1 1 1 1 1 1 1 1 1 1 1 1 1 1 1 1 
##$CPDPRG= <>
##$CPDPRG1= <>
##$CPDPRG2= <>
##$CPDPRG3= <>
##$CPDPRG4= <mlev>
##$CPDPRG5= <mlev>
##$CPDPRG6= <mlev>
##$CPDPRG7= <mlev>
##$CPDPRG8= <mlev>
##$CPDPRGB= <>
##$CPDPRGT= <>
##$D= (0..31)
0 0.7 0 0 0 0 0 0 0 0 0 0.03 0 0 0 0 0 0 0 0 0 0 0 0 0 0 0 0 0 0 0 0 
##$DATE= 1780911662
##$DBL= (0..7)
120 120 120 120 120 120 120 120 
##$DBP= (0..7)
150 150 150 150 150 150 150 150 
##$DBP07= 0
##$DBPNAM0= <>
##$DBPNAM1= <>
##$DBPNAM2= <>
##$DBPNAM3= <>
##$DBPNAM4= <>
##$DBPNAM5= <>
##$DBPNAM6= <>
##$DBPNAM7= <>
##$DBPOAL= (0..7)
0.5 0.5 0.5 0.5 0.5 0.5 0.5 0.5 
##$DBPOFFS= (0..7)
0 0 0 0 0 0 0 0 
##$DE= 6
##$DECBNUC= <off>
##$DECIM= 32
##$DECNUC= <off>
##$DECSTAT= 4
##$DIGMOD= 1
##$DIGTYP= 9
##$DL= (0..7)
0 120 120 120 120 120 120 120 
##$DP= (0..7)
150 150 150 150 150 150 150 150 
##$DP07= 0
##$DPNAME0= <>
##$DPNAME1= <>
##$DPNAME2= <>
##$DPNAME3= <>
##$DPNAME4= <>
##$DPNAME5= <>
##$DPNAME6= <>
##$DPNAME7= <>
##$DPOAL= (0..7)
0.5 0.5 0.5 0.5 0.5 0.5 0.5 0.5 
##$DPOFFS= (0..7)
0 0 0 0 0 0 0 0 
##$DQDMODE= 0
##$DR= 18
##$DS= 0
##$DSLIST= <SSSSSSSSSSSSSSS>
$$ [...]
##$SUBNAM0= <"">
##$SUBNAM1= <"">
##$SUBNAM2= <"">
##$SUBNAM3= <"">
##$SUBNAM4= <"">
##$SUBNAM5= <"">
##$SUBNAM6= <"">
##$SUBNAM7= <"">
##$SUBNAM8= <"">
##$SUBNAM9= <"">
##$SW= 18.0517599122864
##$SWIBOX= (0..15)
0 0 2 0 0 0 0 0 0 0 0 0 0 0 0 0 
##$SW_h= 3612.71676300578
##$TD= 16384
##$TD0= 1
##$TE= 0
##$TE2= 300
##$TE3= 300
##$TEG= 300
##$TL= (0..7)
0 120 120 120 120 120 120 120 
##$TP= (0..7)
150 150 150 150 150 150 150 150 
##$TP07= 0
##$TPNAME0= <>
##$TPNAME1= <>
##$TPNAME2= <>
##$TPNAME3= <>
##$TPNAME4= <>
##$TPNAME5= <>
##$TPNAME6= <>
##$TPNAME7= <>
##$TPOAL= (0..7)
0.5 0.5 0.5 0.5 0.5 0.5 0.5 0.5 
##$TPOFFS= (0..7)
0 0 0 0 0 0 0 0 
##$TUNHIN= 0
##$TUNHOUT= 0
##$TUNXOUT= 0
##$USERA1= <user>
##$USERA2= <user>
##$USERA3= <user>
##$USERA4= <user>
##$USERA5= <user>
##$V9= 5
##$VALIST= <valist>
##$VCLIST= <CCCCCCCCCCCCCCC>
##$VD= 0
##$VDLIST= <DDDDDDDDDDDDDDD>
##$VPLIST= <PPPPPPPPPPPPPPP>
##$VTLIST= <TTTTTTTTTTTTTTT>
##$WBST= 1024
##$WBSW= 4
##$XGAIN= (0..3)
0 0 0 0 
##$XL= 0
##$YL= 0
##$YMAX_a= 56450
##$YMIN_a= -58473
##$ZGOPTNS= <>
##$ZL1= 120
##$ZL2= 120
##$ZL3= 120
##$ZL4= 120
##$ABSF1= 10
##$ABSF2= 0
##$ABSG= 5
##$ABSL= 3
##$ALPHA= 0
##$AQORDER= 0
##$ASSFAC= 0
##$ASSFACI= 0
##$ASSFACX= 0
##$ASSWID= 0
##$AUNMP= <proc_1d>
##$AZFE= 0.1
##$AZFW= 0.1
##$BCFW= 1
##$BC_mod= 2
##$BYTORDP= 1
##$COROFFS= 0
##$CY= -3
##$DATMOD= 1
##$DC= 2
##$DFILT= <>
##$DTYPP= 0
##$F1P= 0
##$F2P= 0
##$FCOR= 0.5
##$FTSIZE= 0
##$FT_mod= 4
##$GAMMA= 1
##$GB= 0.15
##$INTBC= 1
##$INTSCL= 1
##$ISEN= 128
##$LB= 0.25
##$LEV0= 0
##$LPBIN= 0
##$MAXI= 10000
##$MC2= 0
##$MEAN= 0
##$ME_mod= 0
##$MI= 1.114404
##$NCOEF= 0
##$NC_proc= 0
##$NLEV= 6
##$NOISF1= 3.799351
##$NOISF2= 2.8
##$NSP= 1
##$NTH_PI= 0
##$NZP= 0
##$OFFSET= 14.38212
##$PC= 1
##$PHC0= -4195.229
##$PHC1= -15.80771
##$PH_mod= 1
##$PKNL= yes
##$PPARMOD= 0
##$PSCAL= 0
##$PSIGN= 0
##$REVERSE= no
##$SF= 200.129724274929
##$SI= 16384
##$SIGF1= 3
##$SIGF2= 2
##$SINO= 400
##$SIOLD= 16384
##$SREGLST= <1H.CDCl3>
##$SSB= 0
##$STSI= 0
##$STSR= 0
##$SW_p= 3205.1282051282
##$SYMM= 0
##$S_DEV= 0
##$TDeff= 0
##$TDoff= 0
##$TI= <>
##$TILT= no
##$TM1= 0
##$TM2= 0
##$TOPLEV= 0
##$USERP1= <user>
##$USERP2= <user>
##$USERP3= <user>
##$USERP4= <user>
##$USERP5= <user>
##$WDW= 1
##$XDIM= 8192
##$YMAX_p= 0
##$YMIN_p= 0
$$ End of Bruker specific parameters
$$ ---------------------------------
##NTUPLES= NMR FID
##VAR_NAME=  TIME,          FID/REAL,        FID/IMAG
##SYMBOL=    X,             R,               I
##VAR_TYPE=  INDEPENDENT,   DEPENDENT,       DEPENDENT
##VAR_FORM=  AFFN,          ASDF,            ASDF
##VAR_DIM=   8192,          8192,            8192
##UNITS=     SECONDS,       ARBITRARY UNITS, ARBITRARY UNITS
##FACTOR=    0.0002768,     1,               1
##FIRST=     0,             0,               0
##LAST=      2.2672688,     0,               0
##MIN=       0,             -58473,          0
##MAX=       2.2672688,     56450,           0
$$ Real data points
##PAGE= N=1
##DATA TABLE= (X++(R..R)), XYDATA
$$ [...]
2609C73J333k103j418K007J663k050j373J311J986j500j751J303K127j330k124
$$ 373 1706 -397 -1815 192 1855 -195 -1568 -257 1729 229 -1522 -219 1908 578 -1546
2624a546J023K664j366k401R35J916p01k400J151K326p98k244K39K586l72k461
$$ -1546 -523 2141 775 -1626 -691 1225 524 -1876 -725 1601 803 -1441 -1202 1384 1012 -1449
2640a449L68K689j65k401j94K301L04k409n19K304N84k190r13K474J104k373j210
$$ -1449 -1081 1608 1443 -958 -1152 1149 1453 -956 -1475 829 1413 -777 -1690 784 1888 -485 -1695
2657a695J823J487j843j528J934J648j611j781J556K095j858j693J165J810j228
$$ -1695 128 1615 -228 -1756 178 1826 215 -1566 -10 2085 227 -1466 -301 1509 281
2672B81k004J226K202j131k151Q88K139n43k258L64K210o50k003L31K593n01j934
$$ 281 -1723 -497 1705 574 -1577 -689 1450 907 -1351 -987 1223 573 -1430 -1099 1494 993 -941
2689i41j41K419Rk702M1K382K29k031k46K020L31k210q28K145Q75j822j137K046
$$ -941 -1082 1337 1346 -1356 -1315 1067 1296 -735 -981 1039 1370 -840 -1668 477 1352 -470 -1607 439
2707D39J308k126j409J680J829j805j350J418J775j340j984J686J455j141j821
$$ 439 1747 -379 -1788 -108 1721 -84 -1434 -16 1759 419 -1565 121 1576 435 -1386
2722a386J049J987j073k228J013K072j040j954Q04K269p49k359M39K445n61k043
$$ -1386 -337 1650 577 -1651 -638 1434 394 -1560 -756 1513 764 -1595 -1156 1289 728 -1315
2738a315K61K081J19k055m15K511j43j757r98K645M32k025o09K023R51k404o97
$$ -1315 -1054 1027 1146 -909 -1324 1187 1044 -713 -1711 934 1366 -659 -1268 755 1706 -698 -1395
2755a395J893P40j683j150J787J419j628j947J829K150k184j472J440J675j331
$$ -1395 498 1238 -445 -1595 192 1611 -17 -1964 -135 2015 -169 -1641 -201 1474 143
2770A43j250P17J896j166j988J148K117p47k437M98K485p03k113O17J987k05k285
$$ 143 -1107 -390 1506 340 -1648 -500 1617 870 -1567 -1069 1416 713 -1400 -783 1204 999 -1286
2787a286J13K253j39k253P4K436N5j631q97K180O42k222j025K258R18j928j077
$$ -1286 -1173 1080 941 -1312 -1238 1198 1253 -378 -1275 905 1547 -675 -1700 558 1476 -452 -1529
2804a529K190R93k070j154J552J468j727j224J545J690j893j232J321J740j215
$$ -1529 661 1654 -416 -1570 -18 1450 -277 -1501 44 1734 -159 -1391 -70 1670 455
2819D55k103J013J991j099j755R36K469j199k101O89J889o09k169P01K413m54
$$ 455 -1648 -635 1356 257 -1498 -562 1907 708 -1393 -704 1185 576 -1593 -892 1521 1067
2835A067k535M04K259L06k542j54K353jk186j80K054K58j845q57K443M95j695
$$ 1067 -1468 -1064 1195 1501 -1041 -1195 1158 1157 -1029 -1209 845 1103 -742 -1599 844 1339 -356
2852c56j035J551R00j470j055J880J573k111j275J616J250j745j082J431J461
$$ -356 -1391 160 1060 -410 -1465 415 1988 -123 -1398 218 1468 -277 -1359 72 1533
2867A533j364j556J363J413o82k013Q75J786q69j927Q76J965m60k695Q26K419
$$ 1533 169 -1387 -24 1389 707 -1306 -431 1355 486 -1441 -565 1400 940 -1755 -929 1490
2883A490r14j687J97J940k8k042J34K175P3j863n43K015O33k593m72K243M63k011
$$ 1490 576 -1111 -914 1026 998 -1044 -910 1265 1338 -525 -1068 947 1580 -1013 -1485 758 1221 -790
2901g90n17J868J035k016j171K056R14j674j353J855J547j691j265J104J576j112
$$ -790 -1307 561 1596 -420 -1591 465 1379 -295 -1648 207 1754 63 -1202 -98 1478 366
2917C66j997J532J539r78j761O43J927o86k155Q77K100r02j767K31K247j26k068
$$ 366 -1631 -99 1440 462 -1299 -656 1271 585 -1570 -693 1407 505 -1262 -1031 1216 1090 -978
2934i78J67J968M9k315K37J871L14k188P9J730M66k169k72J712O90k204m38K098
$$ -978 -811 1157 1206 -1109 -872 999 1313 -875 -796 934 1400 -769 -1041 671 1361 -843 -1281 817
2952H17N46j924r16J928J204j944j600K085J354j727j287J164K055j356j987J481
$$ 817 1363 -561 -1477 451 1655 -289 -1889 196 1550 -177 -1464 -300 1755 399 -1588 -107
2968a07J690j461j616O09K021k28k265J569q4J181k216R3J775m07j646q5K691
$$ -107 1583 122 -1494 -885 1136 908 -1357 212 128 1309 -907 -814 961 554 -1092 -1177 1514
2985A514m02k035J31J845J56j785n66K358L78j777j150K419L81k148o06K755J57
$$ 1514 1112 -923 -792 1053 1209 -576 -1142 1216 1594 -183 -1333 1086 1467 -681 -1287 1468 1625
3002A625k521l07J410J149j497m45R97R84j065j519J663N42j211j602K227N55
$$ 1625 -896 -1203 207 1356 -141 -586 411 1395 330 -1189 474 1016 -195 -1797 430 985
3018I85q59k029J233K171j777j553J816J547n69k232L54K788j105j470M36J004
$$ 985 126 -1903 -670 1501 -276 -1829 -13 1534 965 -1267 -913 1875 770 -700 -264 740
3034G40R1k594M33K380L25k521j14K853q11j702n12K407P8j757q22J989Q26j670
$$ 740 831 -1763 -1330 1050 1375 -1146 -1260 1593 782 -920 -1432 975 1053 -704 -1526 463 1289 -381
3052c81j028J852J090j660j640J529K053k003j148J191J973j356j918J347J296
$$ -381 -1409 443 1533 -127 -1767 -238 1815 -188 -1336 -145 1828 472 -1446 -99 1197
3067A197r65j666R11J755n29k061O12K042m05k260M99J978m28k019N83J969m6
$$ 1197 232 -1434 -523 1232 703 -1358 -746 1296 891 -1369 -870 1108 680 -1339 -756 1213 1167
3084A167j909l13K204N0j871m33J927L58k026k46J859N47k130o37J865O64j705
$$ 1167 -742 -1055 1149 1199 -672 -1105 822 1180 -846 -1092 767 1314 -816 -1453 412 1076 -629
3101f29r16J991R60j639j144J626J245j521j319J140J718j687j337J519J689j246
$$ -629 -1545 446 1406 -233 -1377 249 1494 -27 -1346 -206 1512 -175 -1512 7 1696 450
3117D50k009R74J753j023j737Q75J934o25j919N44K045k38j959j7J851k10j746
$$ 450 -1559 -585 1168 145 -1592 -717 1217 592 -1327 -783 1262 1024 -935 -952 899 689 -1057
3134a057J67J840L45k049j71J970J89j843l88J677P01j879j160K092R70j954o62
$$ -1057 -890 950 1295 -754 -925 1045 1234 -609 -997 680 1381 -498 -1658 434 1404 -550 -1212
3151a212J321R16j584r65J773J116j118j574J549J219j146j858J305J621j131
$$ -1212 109 1025 -559 -1524 249 1365 247 -1327 222 1441 295 -1563 -258 1363 232
3166B32j639J232J585r60j939R08J864o79k077N16J975n01j370J66K013j47k062
$$ 232 -1407 -175 1410 450 -1489 -581 1283 604 -1473 -957 1018 517 -853 -687 1326 1179 -883
3183h83k04K119M49k719K28J921K10j862l20J744O08j806r28J876N54j482j182
$$ -883 -1087 1032 1481 -1238 -1010 911 1121 -741 -1061 683 1291 -515 -1443 433 987 -495 -1677
3200a677K094P50j234j127J687P65j304j304J430J401j250j141O45J447j017j527
$$ -1677 417 1167 -67 -1194 493 1258 -46 -1350 80 1481 231 -910 -265 1182 165 -1362
3216a362N70J913o81j762P19J841o17k064O49J934l74j868L8K074m4j805r4J855
$$ -1362 -792 1121 440 -1322 -603 1238 621 -1443 -794 1140 766 -1102 -1064 1010 966 -839 -933 922
3234I22L4j885k29J914K46j545o47J695L55j530n63J795P99j676r28J005J559
$$ 922 956 -929 -1158 756 1002 -543 -1190 505 860 -670 -1233 562 1361 -315 -1243 -238 1321
3251A321j831j137J670J377j532j116J409J095r64j785J220J422j181j300J215
$$ 1321 -510 -1647 23 1400 -132 -1248 161 1256 292 -1493 -273 1149 -32 -1332 -117
3266a17J597j082j839Q03J893j006j574O09J704j76j935L98J512L0j851j06K133
$$ -117 1480 398 -1441 -638 1255 249 -1325 -716 988 812 -1123 -725 787 817 -1034 -1140 993
3283I93P3j833p6J909K93k077k51J442M76j765l80J792Q15k061p32J781P08j165
$$ 993 1066 -767 -843 1066 1359 -718 -969 473 949 -816 -1196 596 1411 -650 -1382 399 1107 -58
3301e8j127J268J012j382j036J478J575j523j616J378J243j082j131P48J265n84
$$ -58 -1185 83 1095 -287 -1323 155 1730 207 -1409 -31 1212 130 -1001 -253 1012 428
3317D28j731O51J870p43j892Q29J647l46j892L65J699kj764J11J761j48j679m63
$$ 428 -1303 -652 1218 475 -1417 -588 1059 713 -1179 -814 885 883 -881 -770 991 843 -836 -1299
3335a299K154k0j448l96J850J63j791l82J674P73k089m47J979M99j768q17J572
$$ -1299 855 835 -613 -1009 841 1004 -787 -1169 505 1278 -811 -1258 721 1220 -548 -1365 207
3352B07J046j323q95J258J110j577j164J218J350q90j890J718J164j103j635N06
$$ 207 1253 -70 -965 293 1403 -174 -1338 -120 1230 340 -1550 168 1332 229 -1406 -900
3368i00J897n08j499M59J612l82j589K72J613l65j751M54J780k59j630kJ601K72
$$ -900 997 489 -1010 -551 1061 679 -910 -638 975 610 -1141 -687 1093 834 -796 -798 803 1075
3386A075j792k00J616J141k825L6Q07J171j722m45J452J005j601q25J068J316
$$ 1075 -717 -917 699 1840 -985 -949 -142 1029 -693 -1138 314 1319 -282 -1107 -39 1277
3402A277j545n60J248R52j363j237J070K167j833k136M85J948J94j396J53K326
$$ 1277 -268 -828 420 1372 9 -1228 -158 2009 176 -1960 -1475 473 667 -729 -576 1750
3418A750q28q97n86Q47J093j773R12M64j74j445N5K36R13r93K30M73J20n38j93
$$ 1750 922 25 -561 286 1379 -394 518 982 808 -637 -582 -346 567 -426 -196 277 397 -141 -334
3437c34O70R60r74j138J454L99j763p45K628j78j372j018J985Q55j234j034Q53
$$ -334 336 1296 322 -816 638 1037 -726 -1471 1157 979 -393 -1411 574 1429 195 -839 14
3454A4R73j173q89J099Q85m40j833J110J576j261j403R10J428m15j824Q18J741
$$ 14 987 -186 -1075 24 909 469 -1364 -254 1322 61 -1342 -432 996 581 -1243 -425 1316
3471A316j423n25J04J231j79j417N8J474K87j498Q6J078K53j771m20K169L2j283
$$ 1316 -107 -632 -528 703 524 -893 -835 639 926 -572 -486 592 845 -926 -1346 823 855 -428
3489d28l47J229P09j434q17J214Q02j212j93J105J61j236n07P77J373r77j395
$$ -428 -775 454 1163 -271 -1088 126 928 -284 -477 628 789 -447 -954 -177 1196 219 -1176
3506a176nK643j287j182J774N79j177m10J61J067j8j733J22J608m79j473P54J255
$$ -1176 -1181 1462 175 -1007 767 1346 169 -241 -80 987 969 -764 -642 966 487 -986 -232 1023
3524A023k87j445J66J553l78j257J01J592Q6j777o7J588j6j775J91P97Q64j593
$$ 1023 736 -709 -543 1010 632 -625 -524 1068 1154 -623 -690 898 882 -893 -702 95 959 -634
3542f34k03R09R72j328p18Q05R97j124j140J492J030j077r94P90J288p92j146
$$ -634 -837 72 1044 -284 -1002 -197 800 -324 -1464 28 1058 -19 -1013 -223 1065 273 -873
3559h73O12J090p20j150M70J927j271o81K20J085m07j236N34J093k5j233k65J748
$$ -873 -261 829 109 -1041 -571 1356 85 -596 -376 709 302 -934 -400 693 668 -565 -830 918
3577I18l93j175J74J112N0j405n5J110P98j615m03J221L89r97q96J700J20r97
$$ 918 525 -650 -476 636 686 -719 -774 336 1134 -481 -884 337 726 -271 -1167 533 653 -344
3595c44o62Q36J153j129o22Q03Q36j055n96Q03J147j095r16M21J317p81j150P01
$$ -344 -1006 -170 983 -146 -768 35 871 -184 -780 23 1170 75 -841 -420 897 116 -1034 -333
3613c33J459p10j337M95J222l72j204J49J239j69j252K27Q93J80j081P9J076K38
$$ -333 1126 416 -921 -426 796 424 -780 -631 608 439 -813 -586 307 487 -594 -515 561 799
3631G99j515K52Q91j1j146j52J237K81q09p30J396N41j205n24O57R65j262p09
$$ 799 -716 -464 427 416 -730 -882 355 636 -173 -903 493 1034 -171 -695 -38 927 -335 -1044
3649a044J226P10r55q80J090M12l31j068Q04J144r71j168N73J095j87j175O01
$$ -1044 182 892 -63 -943 147 559 228 -840 -36 1108 137 -1031 -458 637 450 -725 -124
3666a24J016m64j278L95J170j75r03j24J240Jj532M07P00M85j492K7J507j14j080
$$ -124 892 428 -850 -455 715 540 -363 -487 753 754 -778 -371 329 814 -678 -651 856 742 -338
3685c38n00J018N21j409j58Q06R01q79o74N69J049j198n65J021N97p65r53J074
$$ -338 -838 180 701 -708 -866 -60 841 -38 -712 -143 906 -292 -857 164 761 -4 -957 117
3703A17P65r66q77P41J110n81j143L39J255o68r59L28J254m09q87J44J353m89
$$ 117 882 -84 -961 -220 890 309 -834 -495 760 92 -867 -539 715 306 -581 -437 916 427
3721D27q63k26J344J06j364J05R99M35j589K00Q69J77j337k72J252M03j071o06
$$ 427 -436 -662 682 788 -576 -471 528 963 -626 -426 443 620 -717 -989 263 666 -405 -1011
3739a011J263L16r27n71J168M55p57j071Q54J190p91j019J032P37r15q70O06J283
$$ -1011 252 568 -359 -930 238 693 -64 -1135 -281 909 118 -901 131 868 -47 -917 -311 972
3757I72j044l90J18J022l04j181N72Q52m69j134O55J063k20j201N73P31J0j520
$$ 972 -72 -462 -344 678 374 -807 -235 617 148 -986 -331 732 512 -689 -116 615 625 -895
3775h95M15J177j12j276L10R76J28j239o4J047K34j416k59J270K94p52n53Q84
$$ -895 -480 697 585 -691 -381 595 723 -516 -580 467 701 -715 -974 296 590 -162 -715 169
3793A69P52j263q11J311P08j029o82P73O09m96q46O42J046q99p51M88J091o50
$$ 169 921 -342 -1153 158 866 -163 -845 -72 537 41 -805 -163 883 -16 -767 -279 812 162
3811A62q65M32Q60l18j051K36J508n95r28R8Q63K66j185j2J385l62j198p9J521
$$ 162 -703 -271 589 271 -780 -544 964 369 -559 -461 402 668 -517 -529 856 494 -704 -783 738
3830G38k41r67j15J092k3p37n25J071O50j206m42R08M18j159q9J041K87p81n64
$$ 738 497 -470 -585 507 484 -253 -778 293 943 -263 -705 203 621 -538 -627 414 701 -80 -644
3849f44N97P92p76q97N28R36m11j098O15J222j015q46M96J678j115m66P34O0k84
$$ -644 -47 745 -31 -928 -400 536 125 -973 -358 864 -151 -997 -501 1177 62 -404 330 390 106
3868A06q66L80J628p19j368J015O65N1j199J4J668q25j896R78Q73k66P2l78L86
$$ 106 -760 -380 1248 529 -839 176 841 892 -307 -293 1375 550 -1346 -368 505 239 311 -67 319
3887C19O10m99m70P24k63j170j24O72N68r96K43L14J193j053n87N65J122j218
$$ 319 929 430 -40 684 421 -749 -873 -201 367 -629 -386 -72 1121 68 -519 46 1168 -50
3905e0l16K10J195o53r49O01P94l80o99k48J103l10j011o0J650m06j201J88R74
$$ -50 -366 -156 1039 386 -563 38 832 452 -247 -495 608 298 -713 -773 877 471 -730 -542 432
3924D32J70j498J20J192J4j136l00J549J57q27n00R60O27j356j89R66L53r04n23
$$ 432 602 -896 -776 416 430 -706 -1006 543 700 -127 -627 333 960 -396 -585 381 734 -170 -693
3943f93R48M09q96q19R46O85p28o70R34R61j146n19N86L86j26j204Q87Q36n17
$$ -693 255 664 -232 -1051 -105 580 -148 -818 116 1077 -69 -588 -2 384 258 -946 -59 777 260
3962B60q10L23J132p04q18P05K65N2q68j42J134j08q71J6R76O0j090j33R18K74
$$ 260 -550 -227 905 201 -617 88 353 405 -463 -605 529 421 -450 -434 542 602 -488 -621 297 571
3982E71j067l7P78L60q76k86P55K85o11p97J155N70j130m69Q88O22r12k66M70
$$ 571 -496 -533 245 605 -271 -557 198 483 -128 -925 230 800 -330 -799 89 711 -201 -467 3
4001CL20k16q51N42Q29n47m37K18P27n21r00N59Q07j07q70N5P76J07j139K14R87
$$ 3 323 107 -744 -202 627 80 -357 -139 588 67 -833 -274 533 426 -444 -389 387 494 -645 -431 556
4022E56P2j317K26J150k50n31n50R76J45o32p16Q45N65n61n71J172L29j203l43
$$ 556 628 -689 -463 687 437 -94 -644 332 477 -155 -871 -26 539 -22 -593 579 908 -295 -638
4041f38J139K23j095o00J174M19p95o81J164M64q09o54Q21N68q21p69R33P06p29
$$ -638 501 724 -371 -971 203 622 -173 -854 310 774 -35 -689 132 700 -121 -890 43 749 20
4060B0o99O37P70m91q34n0J126J5r45j02J203l04j110L09J145m13p78N8R34j8
$$ 20 -679 -42 728 237 -597 -647 479 494 -451 -553 650 346 -764 -455 690 277 -501 -443 491 473
4080D73j241J39O39M19j066j18R61M07q83n71J260K14p91o49J092N82r15o80P31
$$ 473 -768 -629 10 429 -637 -755 206 613 -270 -841 419 633 -158 -807 285 867 -48 -728 3
4099CQ05o02r77J022K85l06r10M61R45m46q36M91R75q29o69L17P42k51q81N5J198
$$ 3 808 206 -771 251 536 230 -680 -219 726 280 -556 -65 910 81 -588 -271 471 220 -661 -606 592
4120E92Rr61j00J096rj282J18J060k17p95j64J050K59j168k47J039N79r38n22
$$ 592 601 -360 -460 636 627 -655 -537 523 306 -489 -653 397 656 -512 -759 280 859 -79 -601
4139f01O98M10p54n39R16P29r14n76Q83M25o54q58O78R88q34q29Q41R73p07j046
$$ -601 97 507 -247 -786 130 859 -55 -631 252 677 23 -835 -157 831 -3 -832 9 982 275 -771
4159g71L67J027n40q91L61J138k99r11L17Q24j42j166J29J141m62o00N2N13N15
$$ -771 -404 623 83 -808 -447 691 392 -519 -202 622 480 -686 -557 584 122 -478 -426 87 602
4178F02q79m57J108L54j100k64J058K46q43n86J131M92r34p40Q58O38r67o07J249
$$ 602 -277 -734 374 728 -372 -636 422 668 -175 -761 370 862 -72 -812 46 684 -283 -890 359
4197C59M02o79o49M05P81m89q69M28P94m15o81L20J092n36q02J08J140l79j175
$$ 359 761 82 -567 -162 619 130 -739 -311 483 68 -613 -293 799 263 -539 -431 709 330 -845
4216h45K09J154k58r00L28P00R4j261K56R80J14q74l72J198K6q58m4P77J55o81
$$ -845 -636 518 260 -640 -312 388 482 -779 -523 457 571 -303 -675 523 549 -309 -353 424 579 -102
4236a02q06J248L98r89m14Q92N26q38n91P68N51o37r49P24R81q63m59O62O23n07
$$ -102 -908 340 738 -251 -665 227 753 -85 -676 92 643 6 -943 -219 762 -101 -560 102 725 218
4256B18q50J19J116l48q48M22Q33O3j696O43Q74m9q77j9Q17j18r37O6J216n5j172
$$ 218 -632 -513 603 255 -593 -171 662 725 -971 -328 546 497 -380 -399 418 300 -637 -571 645 590 -582
4277e82J71M74K66n14k56Q90J39r13k75Q54M31j231j05R19M42p60o61R70O54q64
$$ -582 -411 63 329 -185 -441 449 588 -325 -600 254 685 -546 -651 268 710 -50 -711 259 913 49
4297D9r47P97Q88p24r58O93Q44n80p13O02N97n12o64N02Q19m80p78J99R85j06
$$ 49 -898 -101 787 63 -895 -202 642 62 -651 -49 548 36 -628 -126 693 213 -565 -366 619 513
4317E13j114M9J242l10r43J24R09J22q46l47J118M8j138L0P75K56j014j42J091
$$ 513 -601 -552 690 380 -563 -439 470 592 -254 -601 517 565 -573 -543 232 488 -526 -668 423
4336D23J63n90p76J076L38q33l93O29N96q10n28N04J082q55p62Q10P58p86p50
$$ 423 586 -4 -780 296 634 -199 -592 37 633 -177 -705 -201 881 26 -736 74 832 46 -704
4355g04M99P74m53p80M28J286o04q56nP68K01j174J92J072L6j358J83R15J85r67
$$ -704 -205 569 116 -664 -236 1050 446 -410 -415 353 554 -620 -428 644 680 -678 -495 420 605 -362
4375c62l11R43K60r78j97J054J26r58k47N97R15j058m61Q02O01q61p45R47O39
$$ -362 -673 270 530 -448 -645 409 535 -423 -670 -73 842 -216 -677 125 726 -135 -880 67 706
4394G06o75q60O47Q97q41p13P41Q62l36q53K18P12j55j058K35J120m01j034O44
$$ 706 31 -829 -182 715 -126 -839 -98 764 428 -425 -207 505 350 -708 -473 647 246 -788 -144
4413a44P77j89j076K30J276k63j350M12O93M6j047l8J058K55r97l70R17N67j204
$$ -144 633 444 -632 -402 874 611 -739 -327 366 412 -635 -673 385 640 -357 -727 190 757 -447
4432d47j89J044L47r69l65O83L68m47j026J349L65r89n74J023N47p66o34Q32L94
$$ -447 -636 408 755 -214 -579 104 472 25 -1001 348 713 -276 -850 173 720 -46 -680 152 546
4451E46o29o47O18J218p92q25K91R27j38j213J32J077j60r25M01O76lj133J8Q83
$$ 546 -83 -730 -112 1106 314 -511 -220 707 569 -644 -512 565 405 -520 -119 557 554 -579 -561 322
4471C22L1p73r0P35L41q81n35J363Mq04l73Q56O22j090j29R41L5o58p36R85P84
$$ 322 353 -420 -510 225 566 -315 -850 513 517 -287 -660 196 818 -272 -401 540 575 -83 -819 166 950
4492I50j095o34M22R25n17q41O30Q25o46n65K75J077o03p97L23P15n8j255Q11
$$ 950 -145 -779 -357 568 51 -790 -160 665 19 -546 -271 806 203 -594 -271 444 386 -869 -58
4511e8O06q2j041J64R01l71k77j04P23l2q08k1Q73j50n77j21P23M21j047K0Q30
$$ -58 548 466 -575 -411 490 119 -158 -262 461 429 -379 -400 473 323 -254 -375 348 769 -278 -258 572
4532E72J46r62n63R82L94n16o19O46O40o50o67N58P34p20l20M71M27m35j018P14
$$ 572 718 -244 -807 175 569 53 -566 80 720 70 -597 -39 695 -25 -345 126 553 118 -900 -186
4552a86Q74n29q00N07R20l59j103L83R50k54q99L48N41K0q46j31R92K88r59j21
$$ -186 688 159 -641 -134 786 427 -676 -293 657 403 -496 -148 393 413 -433 -564 428 716 -243 -364
4572c64M44N06o43l69P71K31r44l38Q00M38p71j52O77L31p46p37R38L94l21p90
$$ -364 80 586 -57 -426 345 576 -368 -706 94 532 -239 -391 286 617 -129 -866 72 466 145 -645
4592f45P73L14l85q24L91J087o75p11M10Q54l28q20L04R49n16p75N63O70l89q88
$$ -645 128 442 57 -767 -376 711 36 -675 -265 589 261 -559 -255 694 178 -597 -34 636 247 -641
4612f41k9J021J72j006J14O49J80p14l04P64O0l30n32Q07L76p39m89P31P01q49
$$ -641 -670 351 523 -483 -369 280 460 -254 -558 206 266 -64 -596 211 587 -152 -641 90 791 -58
4632e8o55P96N69o78m71K55Q47l87r08P78P04n92r16Q24L96m72p33L93J048n09
$$ -58 -713 83 652 -26 -497 -242 605 218 -690 88 792 200 -716 108 504 32 -701 -308 740 231
4652B31q07K43Q73l34r57M34P11K9q66M66N74l42j083J47R67J47q58J70Q12k33
$$ 231 -576 -333 540 206 -751 -317 394 423 -443 23 597 255 -828 -681 286 433 -425 -255 557 324
4672C24n63k19O75N83r82l43Q58P2p82lJ059k02n32n08N64L18k64p42O31O99q66
$$ 324 -239 -458 217 800 -182 -525 333 405 -377 -380 679 477 -55 -563 1 319 55 -687 -56 643 -223
4693b23l20O11N45o69k62j92R38j90q49M27J046o75r50M42Q87j99r59K07Q84l09
$$ -223 -543 68 613 -56 -318 -510 428 238 -611 -184 862 187 -763 -321 566 367 -592 -385 499 190
4713A90n54l6Q01J90r61L6O39L1p16M0O15L53j005n9O91J69p99j87Q34M01r50
$$ 190 -364 -400 401 591 -370 -334 305 336 -380 -340 275 628 -377 -436 255 424 -375 -562 272 673 -277
4734b77j09L74P28q79n75R24K32m19n80N46M45l18n19K41P82l52q16M91O29k37
$$ -277 -386 -12 716 -163 -738 186 418 -1 -581 -35 410 92 -427 -186 596 244 -572 -81 548 311
4754C11j037O46O23k48o50q4R36k29p49J62P68Oq43R4O12J98m81m22N17N09q97
$$ 311 -726 -80 543 295 -355 -439 497 268 -481 -319 449 455 -388 -294 318 516 35 -387 130 639 -258
4775b58k65P28O88r64m59Q03L53p77m11O92L86n11n54O67L32j56q03L44O83o09
$$ -258 -523 205 893 -71 -530 273 626 -151 -562 130 516 5 -549 118 450 294 -509 -165 518 -91
4795i1m07M04N14k70r27P71O69l36r48J98Q66j95o43mQ98j05r25q7J375l88p50
$$ -91 -498 -94 420 150 -777 -6 663 327 -621 -423 443 248 -395 -399 499 394 -531 -618 757 369 -381
4816c81j8M94J62p59L0R23J23p60k54P74L0n50l08M99R28j121l64L70P30n92n52
$$ -381 -399 95 257 -502 -472 451 574 -186 -440 334 364 -186 -494 5 933 -188 -552 -182 548 -44 -596
4837e96O39L54j98p41L90M98k42o38O89M57m70o83J17J069m68n75J79P28k36p65
$$ -596 43 397 199 -542 -152 346 104 -534 155 612 142 -541 -424 645 177 -398 -219 509 273 -492
4857d92J28P62K7p90mP34p8q72o5Q19K95r27N9O03K39n12m01Q89L58o80q02Q64
$$ -492 -364 398 425 -365 -369 365 287 -585 -650 169 464 -463 -404 199 438 -74 -475 414 772 92 -710 154
4879A54L69r86q3O50L40n09n03N71J78l13m52N40P81q30n87O68M30m87o22N75
$$ 154 523 -463 -546 104 444 -65 -568 3 181 -132 -584 -44 737 -93 -680 -12 418 -69 -691 -116
4899a16O55l23p55K87P09k83l36P5N11n6r72N5J010k26n43l31J122j11q19J27
$$ -116 539 216 -539 -252 457 174 -162 -87 424 368 -604 -549 461 235 -308 -639 483 372 -447 -320
4919c20O77J49q80j15N49M64p22l82P74M66q27j15L71K25m58l70Q98j7m56m04
$$ -320 357 506 -374 -489 60 524 -198 -580 194 660 -167 -282 89 314 -144 -514 384 367 -89 -493
4939d93O49L08o57m10N26N37k62m99K9O97j51p04L20N63k14o07J66M58j5o27J75
$$ -493 156 464 -193 -603 -77 460 198 -301 -272 425 274 -430 -110 453 239 -368 -202 256 241 -386 -211
4960b11O78l53n39j70Q59L5q39J61O42j08m20n6R61m98M8r53M81Q80p45L30M4
$$ -211 467 114 -425 -595 264 299 -540 -379 263 155 -265 -321 640 142 190 -763 -282 598 -147 183 227
4981B27K04j43o49O01M59r98m91Q64K73n49k5J20O33o88k33N92L47j15q01L90
$$ 227 431 288 -361 240 699 -299 -790 74 347 -202 -227 -107 526 -162 -395 197 544 429 -372 18
5001A8N27l70n04K33P45m37n92J49O74M7j087M94P35n4p01j63O25r3n71k60P90
$$ 18 545 175 -329 -96 649 212 -380 -231 443 490 -597 -103 632 578 -123 -286 339 246 -325 -585 205
5022B05L41p13j79N22M02o22m27N86L21n76n50P72N99p46m80M64N12n23l14M01
$$ 205 546 -167 -346 176 578 -44 -471 115 436 -140 -690 82 681 -65 -545 -81 431 -92 -406 -5
5042eO08o83l26N37N29n83l99K85L35o0p89M08L89J62r89L13O45l40k69m42J156
$$ -5 603 -80 -406 131 660 77 -322 -37 298 238 -551 -143 246 408 -581 -268 377 37 -232 -674 482
5063D82j7r26o6N05N16q60%O53K36p47M1Q4M06n95l6O95p0l85k98M62J69l70l41
$$ 482 465 -461 -527 -22 494 -366 -366 287 523 -224 -183 -99 307 -288 -324 371 301 -84 -382 80 249 -121 -462
5086d62N18M54o95j16N82Q4m42m12N00N09o11l30N38J37L1q46L44P76k08q64K19
$$ -462 56 510 -185 -301 281 365 -77 -489 11 520 -91 -421 117 254 285 -561 -217 559 351 -513 -294
5107b94P93l60l02j33O01K13j022L91N41N7o36l45Q16K05q78p8O43R2n62l54O92
$$ -294 499 139 -163 -296 305 518 -504 -113 428 485 -151 -496 320 525 -353 -431 212 304 -258 -612 80
5128H0J2l22m17O72N26o79l53M68M05l68n47N81L88m41m16M45N11l85n80K55K88
$$ 80 92 -230 -647 25 551 -128 -481 -13 392 24 -523 58 446 5 -411 34 545 160 -420 -165 123
5149A23J00m10O94k25j17j18o4q5Q9n24P98M07m03m10n0N29O00j329J49J636k63
$$ 123 223 -187 507 282 165 47 -17 -102 -13 -537 261 668 265 -145 -195 334 934 -395 -246 1390 1127
5170A127j664m6J269q4j1j153J051n35n11J30M26L58j62n36O57J95l24o26O68
$$ 1127 -537 -583 686 602 591 -562 489 -46 -557 -427 -1 357 195 -341 316 511 187 -439 229
5189B29O46j322o2J102k21k92k24N44K71n92l01L8J46k34k19N91L37Q4o79l99
$$ 229 875 -447 -509 593 372 80 -144 400 671 79 -222 -184 -38 -272 -491 100 437 521 -158 -557
5209e57O68M35o43L03J76o6q99K63Q15O6n67R7K80R1m97m90P72J98n02n20R09
$$ -557 111 546 -97 206 382 316 -583 -320 495 561 -6 91 371 462 -35 -525 247 445 -57 -577 332
5230C32J68n93n07N10L60m16m81O11O60m56o70O09K96l30n13L69L93j71o06M57
$$ 332 500 -93 -600 -90 270 -146 -627 -16 644 188 -482 127 423 93 -420 -51 342 171 -435 22
5250B2N20n07n35M11M59j80n94K26N30k87l27J5Q22N4r39n6R03J41o83j48P47
$$ 22 542 35 -500 -89 370 190 -404 -178 352 65 -262 -247 575 629 -310 -366 537 678 -5 -153 594
5271E94k70m11m60R74q6n69j05N45K08o57j16M62M01o62n57P43L79p14j69L87
$$ 594 324 -87 -547 427 341 -228 -333 212 420 -237 -353 109 510 -152 -709 34 413 -301 -470 -83
5291h3M96m79r7p2O01j72n81K40O13l45n18L01N55k66n84k57J077k20p80N1R56
$$ -83 413 -66 -163 -235 366 194 -387 -147 466 121 -397 -96 459 193 -391 -648 429 209 -571 -520 436
5312D36j8n80k82O48o0m76L2Q00j45p55Q4O93K75j008J54P81o11k90o6M91m41
$$ 436 418 -162 -444 204 144 -332 -300 500 355 -400 -316 377 652 -356 -202 579 -32 -322 -388 103 -338
5333c38K75m86M14R70j516J41P06N37m00j273J496j1J44j021J57R78P0j297K41
$$ -338 -63 -549 -135 835 -681 -540 166 703 303 -970 526 515 659 -362 -205 773 843 -454 -213
5352b13P07R9p02l74J978r01q90J9Q32l83k92L5J66J20j77k06L02J5j61p93R44
$$ -213 494 593 -109 -483 1495 594 -296 -277 555 172 -120 -85 81 201 24 -182 120 135 -26 -819 125
5373A25L18l03q87O48J50j000R74M37Pk11l61J99O73r46p09J127J58l8j329N43
$$ 125 443 140 -747 -99 51 -949 25 462 469 258 -103 96 769 -177 -886 241 399 361 -968 -425
5393d25J018p95N0k3N70m51j036N16Q63l24o12J79J062n34r37k47P88P89m07m4
$$ -425 593 -202 -152 -175 395 -56 -1092 -576 287 -37 -649 -470 592 58 -879 -1126 -338 451 44 0
5413@o82P39L12j368J295k53L3K09O01J18p41j153J038J053r01k36K60r38P64
$$ 0 -682 57 369 -999 296 43 76 285 886 1004 263 -890 148 1201 300 64 324 -614 150
5432A50l5l83J058j059o91N09P97m33j150J423l2K98l24n33M4L24k5R7J08k92
$$ 150 115 -268 790 -269 -960 -451 346 -87 -1237 186 154 452 128 -405 -361 -37 -62 35 143 -149
5452a49J99p82J039L26o36r39J153L56j617M19J723O3j343n51J351l71o41M33
$$ -149 50 -732 307 633 -3 -942 211 567 -1050 -631 1092 1155 -188 -739 612 241 -400 33
5470C3L30q8q82L11J92R50j228L17o6r6L64n28J31M34p3l06N63m67j67Q0J33K82
$$ 33 363 275 -607 -296 -104 846 -382 -65 -131 -227 137 -391 -260 174 101 -205 358 -109 -276 -196 -63 219
5492B19M3q33N01K28M2n93L98K17L3q56R9J151r61J94N5O06q51K09m22O17K86
$$ 219 262 -571 -70 158 200 -393 5 222 255 -601 -502 649 -312 -118 -63 543 -308 -99 -521 96 382
5513C82q63RM43Q19j235k25O52nl20Q9O62m01l25m91Q96P12j324O0M02L67k76
$$ 382 -481 -472 -29 790 -445 -670 -18 -23 -343 -254 408 7 -318 -809 87 799 -525 -465 -63 304 28
5534B8k53O17J78m39m42j48O20K17j005M26N12l12n13K97N44k80l61K0N14J19
$$ 28 -225 392 570 131 -311 -459 161 378 -627 -201 311 -1 -514 -217 327 47 -314 -294 220 339
5554C39q70M07J78K86l04k89O29M1q11J27N86K7p38k4N48L70p51N5N59K4n06k31
$$ 339 -531 -124 54 340 36 -253 376 417 -394 -267 319 346 -392 -416 132 502 -249 -194 365 389 -117 -348
5576c48K70K61k16k68K44M05k97o97Q89K57m75k14L42J33q5o24N61K45j44o29
$$ -348 -78 183 -33 -301 -57 348 51 -646 243 500 25 -189 153 286 201 -423 138 383 239 -390
5596c90L65k62L6P5k83R58m73k8l59P71k45n96j13J037r54P0K74J788j170q71
$$ -390 -25 -287 -251 -176 -459 499 26 -2 -361 410 165 -431 -544 493 -461 -391 -117 1671 501 -370
5616c70o7K44Q20r82O83L50n57m48K33k53Q15o30m59J095J43p55r7M52K81p06
$$ -370 -437 -193 627 -355 328 678 121 -327 -94 -347 468 -162 -621 474 617 -138 -235 217 498 -208
5636b08j77P15K88p96l20O11J26k87j24k8Q22o49j62Q1O30j83q27J45P35l17k13
$$ -208 -385 330 618 -178 -498 113 239 -48 -172 -200 622 -27 -189 -108 522 339 -488 -343 392 75 -138
5657a38k06P23k51l21J08M35j56m87k96N96J83o49M57LJ45k70j49N36m4o19n6
$$ -138 -344 379 128 -193 -85 350 194 -293 -589 7 190 -459 -2 1 146 -124 -273 263 219 -400 -456
5678d56O14L94o31r9L30L57l96o63P02K70m26j81L70M1j64n11L25M48k70l11J44
$$ -456 158 552 -79 -178 152 509 113 -550 152 422 -4 -185 185 226 62 -449 -124 324 54 -257 -113
5699a13N66j42p70L49M53k84k71P5N48l09j56j20N89n7n46j80O79j34m83j1Q05
$$ -113 453 311 -459 -110 343 59 -212 -137 411 102 -54 -174 415 358 -188 -368 311 177 -306 -317 488
5720D88l9n92p0K27L55p54K43J26J73m7l53N05N4l37l04L48L55l59k22J34L33
$$ 488 449 -143 -213 14 369 -385 -142 -16 157 110 -243 262 316 -21 -325 23 378 19 -203 -69 264
5741B64k56m26J16R03m02o44L58K40k30l36N70J24p4j30j52L18k52k64J40O42
$$ 264 8 -418 -302 601 199 -445 -87 153 -77 -413 157 281 207 77 -75 243 -9 -273 -133 509
5761E09n00m17J31M57%l08M5J71k5m50K43K06L30n36l23M64J93j28m07N25J94
$$ 509 9 -408 -277 180 180 -128 -83 88 63 -387 -144 62 392 -144 -467 -3 190 62 -345 180 374
5782C74p99J14N93J12k99k70J51K89j18n58L72K11J53p42L85R6k0l0l2K63j39
$$ 374 -425 -311 282 394 95 -175 -24 265 147 -411 -39 172 325 -417 -32 64 44 14 -18 245 106
5803A06m96K39N72J6n60j5L16p2R5n73N41P4r32L42K68L39j60m87N69k21K8p30
$$ 106 -390 -151 421 437 -123 -138 178 106 201 -372 169 243 -689 -347 -79 260 100 -387 182 -39 -11 -741
5825g41P56J52j55k79N67Q1p57P95J48p2j78m45o83J168L76n74k99L09L04n00
$$ -741 15 167 12 -267 300 381 -376 419 567 495 317 -128 -811 357 733 159 -140 169 473 -27
5845b7J41J023j137n63Q16j2r9m69L70L75j82p02L63K60J25n51p8L17J93l61j41
$$ -27 114 1137 0 -563 253 241 142 -327 43 418 236 -466 -103 157 282 -269 -347 -30 163 -198 -339
5866c39K98J65n91M14K51K74m78j05N2N01o78M0L85J6n88L98p05J504j597p8J056
$$ -339 -41 124 -467 -53 198 472 -6 -111 -59 442 -236 -196 189 205 -383 15 -690 814 -783 -861 195
5887A95K89n82K84l98L97j212J522Mp0k87l96O58l49r64N04L29N31k65k84m24
$$ 195 484 -98 186 -212 185 -1027 495 499 429 142 -254 404 55 -909 -405 -76 455 190 -94 -518
5907e18O60k04j48Q0J29O22p94k23L94P24q55P95N83k20j722J111J33K5j340N35
$$ -518 142 -62 -210 -130 -1 621 -173 -396 -2 722 -133 662 1245 1025 -697 414 547 572 -768 -233
5927b33j79J457j316K71k73P89n12q95M96K74j72l24R87Lp8j486J590P7p39J84
$$ -233 -412 1045 -271 0 -273 516 4 -891 -395 -121 -293 -617 370 373 295 -1191 399 476 -263 -79
5947g9o2N92o56L4j12N84m62J25j54L79J89n18Q5K55k4m16J32K21k7l36J13N74
$$ -79 -141 451 -205 -171 -283 301 -161 -36 -190 189 378 -140 -55 200 176 -240 -108 113 86 -250 -137 437
5969D37n15n32P75n12M82K32o5p3o1J10r49M94K98J04j402J272j16J39j56M55
$$ 437 -78 -610 165 -347 135 367 302 229 168 278 -671 -177 121 225 -1177 95 -21 118 -38 417
5989D17K10j352P32j77N53q85K07P62n82R5r0k20R95o10l98Q4M72k73kr7N54j57
$$ 417 627 -725 7 -170 383 -502 -295 467 -115 -20 -110 -330 665 55 -343 -259 213 -60 -62 -159 395 238
6011B38n26q9O68J2l89m24M90R3m43M31nJ74j96R1L13J19n39l23N27j24m2k66
$$ 238 -288 -377 291 303 -86 -510 -20 73 -370 61 56 230 34 125 438 557 18 -305 222 98 56 -210
6033b10L43J38l13n80P20K87m67k62K84K86j01l48J05K04l19N3L68pr5m7j60N22
$$ -210 133 271 -42 -622 98 385 -82 -344 -60 226 125 -223 -118 86 -233 -180 188 181 86 39 -121 401
6055D01m78k70N1Q26l50m34K15K1Q7l42J17M36r9l61k4L53Q3m62K36K33j04k47
$$ 401 -77 -347 -296 530 180 -254 -39 -18 69 -273 -156 280 181 -180 -204 149 232 -230 6 239 135 -112
6077a12j04N03m07L14k31K69J04j92p26P04M2K19o41J90K77k29k28J61M54m36
$$ -112 -216 287 -120 194 -37 232 336 144 -582 122 164 383 -258 -68 209 -20 -248 -87 367 -69
6097f9n41N07L31k6l33P2M63k00k73O5M34l84j02l22K96J85m75N68Q8j92k14j15
$$ -69 -610 -103 228 202 -131 -59 404 204 -69 -4 430 46 -56 -378 -82 103 -372 196 284 92 -122 -237
6119b37L99P2m53j73N76o4k26K18R4J17l57k06K71K16l51J3J35J27m27N2N1N61
$$ -237 162 234 -219 -392 184 120 -106 112 206 323 -34 -240 31 247 -104 -91 44 171 -256 -204 -153 408
6141D08m28j27L55N8k95j91J23N10j00n22J75L92m88M0K60q6j2m42L14L91k40
$$ 408 -20 -147 208 266 -29 -220 -97 413 313 -209 -34 358 -130 -90 170 84 72 -370 -56 335 95
6162I5j86J00K99l5l75k5M37j38n40J03M86k55k63K41K91R2o54J0L13J45k95j31
$$ 95 -91 9 308 273 -102 -127 310 172 -368 -265 221 -34 -297 -56 235 327 -327 -317 -4 141 -154 -285
6184b85M04l8j88j46K26K34l71j06L97O9k39l21L12J87O8l39k2M99j76n82J38
$$ -285 119 81 -107 -253 -27 207 -164 -270 127 196 -43 -364 -52 135 203 -136 -158 341 165 -417 -279
6205b79K94j73k18M27J10j68l70L26M99j23m67J99J30P9n48l9M43M1k41o4J08
$$ -279 15 -158 -376 51 161 -7 -377 -51 448 325 -142 57 187 266 -282 -321 122 163 -78 -142 -34
6226c4L27j68q6K57m8l98pM98j8l65Q4j45L12j73k84K44N61o34j97l69J231j174
$$ -34 293 125 39 296 248 -150 -157 341 323 -42 42 -103 209 36 -248 -4 557 -77 -274 -643 588 -586
6248e86J80OK35j021J015R30r16o4k03M84k75k40N70J7p47J002l38n60O24K13
$$ -586 -406 -400 -165 -1186 -171 759 -157 -221 -424 60 -215 -455 115 132 -615 387 49 -511 113 326
6268C26m90M18j37J35q27P01J08p3k50o6K87J21k42n69O55L16p12J68r9K12k12
$$ 326 -164 254 117 252 -575 126 234 161 -89 -155 132 253 11 -558 97 413 -299 -131 -230 -18 -230
6289b30J79L82J04m79q9K28J04k91j69K74L59n84Q1Q9L44k32m17K06K20j60n1
$$ -230 -51 331 435 -44 -133 95 199 -92 -261 13 372 -212 -131 -42 302 70 -347 -141 79 -81 -132
6310a32m7M69J35m70K9J65m2k36j61N87j95l67p3O68n7m41J05o0M67l49k66K78
$$ -132 -179 290 425 -45 -16 149 107 -129 -290 297 102 -265 -338 330 273 -168 -63 -123 344 -5 -271 7
6332Gk0ql33N02j08N5l11J93L94k87l23M98Q7j75j79K4L07m90o2J41N18l47j62
$$ 7 -13 -21 -354 148 40 95 -216 -23 371 84 -239 259 346 171 -8 16 323 -167 -229 -88 430 83 -79
6355g9j55Q91n22l96K47J73m2j17k16L12l6j21O6J45J34m42P6M56k41k10MJ69
$$ -79 -234 657 135 -261 -14 159 117 0 -216 96 60 -61 5 150 284 -158 -82 374 133 -77 -73 96
6377I6J43l52j08L03J71m27M1J81R6j78j1K58j71j6j82J43K95k68M7N9K48j43
$$ 96 239 -113 -221 82 253 -174 -133 48 144 -34 -45 213 42 26 -156 -13 282 14 61 120 368 225
6399B25l93J61K91n06o2L76K00k79j86L9J09J03m99L78J86K39o03J26N54m91k12
$$ 225 -168 -7 284 -222 -284 92 292 13 -173 -134 -25 78 -421 -43 143 382 -221 -95 459 -32 -244
6420b44J27K89J29m68r1L50J60l48j43K41q4M6k22N27O3n47n0J63J69o5k82N05
$$ -244 -117 172 301 -167 -258 92 252 -96 -239 2 -82 -36 -258 269 332 -215 -265 -102 67 2 -280 225
6442B25j14l16j59N53K04l73j13K34J59l99J22M5K94n43j34J35M12j32l06K43
$$ 225 111 -205 -364 189 393 20 -93 141 300 -99 23 68 362 -181 -315 -180 232 100 -206 37
6462C7MK16n38L21K28k41k46j29M05o7l19J95L78L92p34O89m91n5k32M94l99K47
$$ 37 41 257 -281 40 268 27 -219 -348 57 -10 -329 -134 244 636 -98 591 100 45 -187 307 -92 155
6484A55l50n96J212k69M5m46N42K35N6j122J388j601J120o97L52K58L9p91oQ91
$$ 155 -195 -791 421 152 197 -249 293 528 584 -538 850 -751 369 -328 24 282 321 -470 -476 415
6504D15l3m26O43J92k82l79m82O22J23m78K50j67K34l51k01Q93l25m72q1M74M4
$$ 415 382 -44 599 791 509 130 -352 270 393 -85 165 -2 232 -119 -320 573 248 -224 -305 169 213
6525B13l34p1M88j56m62M14P9m8k55k73N01k8k2k29J62M17o13K3L18K18k62j20
$$ 213 -121 -192 296 140 -322 92 171 123 -132 -405 96 68 46 -183 -21 396 -217 -194 124 342 80 -40
6547d0J76K92k28p36M11N73l21m09N50j1j15l18J86N5q6j58K32J62k71l47K61
$$ -40 136 428 200 -536 -125 448 127 -282 268 257 142 -176 10 65 -21 -179 53 215 -56 -403 -142
6568a42L40j02k25MK14R7o06K82J20L54l74k12L40M31o34M2K43K83m60j79L83
$$ -142 198 96 -129 -125 89 186 -420 -138 -18 336 -38 -250 90 521 -113 -71 172 455 -5 -184 199
6589A99M1l08o0L16o2n61j81L34j6k6j72N30M67r70n70P23R17l4j131Q47J52j3
$$ 199 240 -68 -128 188 126 -435 -616 -282 -298 -324 -496 34 501 -469 -1039 -316 601 567 -564 283 435 422
6611D22j299L84Q86p08l3LN15O59j055j86M31j06l53M60L72o7m14O10q66J288
$$ 422 -877 -493 393 -315 -348 -345 170 829 -226 -412 19 -87 -440 20 392 325 -89 521 -345 943
6631I43j084q2N10k03l55p6N33q2m18L49K96j74j04p8k59P1K76m15Q1L63K27p41
$$ 943 -141 -223 287 84 -271 -347 186 104 -314 35 331 157 53 -25 -284 -213 63 -352 -271 92 319 -422
6653d22M87J75k77k74K97J60J47n16p9L07J53m46L25J85m13J32QK47n3j73o1M20
$$ -422 65 240 -37 -311 -14 146 293 -223 -302 5 158 -288 37 222 -191 -59 -51 196 143 -30 -91 329
6675C29j84N0n6j06P5J13m97N01p5k39J21K8M34m75k02K74M5k43m2j0K89k28k06
$$ 329 145 195 139 33 108 221 -276 225 150 -89 32 60 494 19 -183 91 136 -107 -149 -159 130 -98 -304
6698c04M67N1j51j79K20J23j72j91j05N42q9n89K40L44k08k61J49K10K1k31k78
$$ -304 163 214 63 -116 104 227 55 -136 -241 301 212 -377 -137 207 -1 -262 -113 97 118 -113 -391
6719c91P00j0o83M43Q0Qn37J70O16k72l60k62N69K42m43k52N09m13K31j87O29
$$ -391 309 299 -384 59 139 147 -390 -220 396 124 -236 -498 71 313 -130 -382 127 -286 -55 -242 387
6740C87k33M90j496J050j89n6o3M44j23n6l6L35m64k35M00M45n12J32J55k47n65
$$ 387 154 644 -852 198 9 -47 -110 334 211 155 119 454 -10 -245 155 600 88 220 375 128 -437
6761d37L29l35j09M52j75O58j329L13J372p82O49q01P17k9j102J701l13j633P30
$$ -437 -108 -443 -552 -100 -275 383 -946 -633 739 -43 606 -195 522 493 -609 1092 779 -854 -124
6780a24j029J102n92M85N56j2j389L01N44J59J53l84j81N04mk52M79m27K50j86
$$ -124 -1153 -51 -643 -158 398 386 -1003 -702 -158 1 154 -230 -411 93 89 -163 316 -111 139 -47
6800d7p8K65J59l3m44k34M24l43j68O44O80j276K71L05J28m96K8j76K92N0L81
$$ -47 -125 140 299 266 -178 -412 12 -331 -499 145 825 -451 -180 125 253 -243 -215 -391 -99 -49 332
6821C32j83l79j12M10k5J34q78r5O51L51j73L35m53Q33j314L06L35J14p06L09
$$ 332 149 -230 -342 68 43 177 -701 -796 -145 206 33 368 -85 748 -566 -260 75 189 -517 -208
6841b08k4m54K22R4K83l40L61l08N37M4n08Q47q79Q32j19l25j74M36l44m69P05
$$ -208 -232 -686 -464 -370 -87 -427 -66 -374 163 207 -301 546 -333 499 380 55 -119 317 -27 -496 209
6862B09m02M97n47j88R04P0r35N29L4Q9m21K44K25k87Q5m10L96j09Jk31Q20m71
$$ 209 -193 304 -243 -431 473 543 -392 137 171 260 -161 83 308 21 106 -304 92 -17 -16 -247 573 102
6884A02j84N0J07j1n7k29K64n2q5j73J85L45k73k52J46M38m65k79M57L5O0j77
$$ 102 -82 -32 75 64 7 -222 42 -10 -95 -268 -83 262 -11 -263 -117 321 -144 -423 34 69 129 -48
6906d8l49N67j9k30J85J59k78k51M9K10L24k69m1Q8q6K6r4L77p0m36k49N75j54
$$ -48 -397 170 151 -79 106 265 -13 -264 -215 -5 319 50 9 97 11 37 -57 320 250 -186 -435 140 -14
6929a4k80K17J51J00k73J25K61k20l19j78P09j22j22j09J1L12l26k3J06j55K01
$$ -14 -294 -77 74 174 -99 26 287 67 -252 -430 279 157 35 -74 -63 249 -77 -100 6 -149 52
6950E2k90M49o2j35k58J26N89m01l21J15O55m88LJ91j42k7l37J61J94r5M4L7N3
$$ 52 -238 211 149 14 -244 -118 471 70 -251 -136 519 31 34 225 83 56 -281 -120 74 -21 23 60 113
6973A13K22o15K76K7nj06j74L28j16j04l0M37l71J89j87L00j28Km51L95R5L5j98
$$ 113 335 -280 -4 23 18 -88 -262 66 -50 -154 -184 253 -118 71 -116 184 56 58 -393 2 97 132 -66
6996f6M5K92k12L7Jrn8p4O7K98k90l48K16L13j2m48J74K23j98k19J96J49j39Q6
$$ -66 -21 271 59 96 97 88 30 -44 23 321 31 -317 -101 212 200 -248 -74 149 -49 -268 -72 77 -62 24
7020B4m58N86m7j43J1J42k39mn7K23J32j68J28K00L7l91j24K38J67o2k22oL91
$$ 24 -434 152 105 -38 -27 115 -124 -128 -185 38 170 2 130 330 367 -24 -148 90 257 195 -27 -33 358
7043C58o30p4J09N09l13m0J05L58m75q0J40qK7o1k77O66j64l06J37J78R4q20O27
$$ 358 -272 -346 -237 272 -41 -81 24 382 -93 -173 -33 -41 -14 -75 -352 314 150 -156 -19 159 253 -567 60
7066F0Rl6j85n81P95N69l17j9OJ74j275J621q24l8p04J375j34j370J076q44Q24
$$ 60 69 33 -152 -733 62 631 314 295 301 475 -800 821 -3 -41 -745 630 496 -874 202 -642 182
7087A82N24j279L90N05P7n74J67j74j27M99p28N03K49j33k79N6L84p9j02k29K19
$$ 182 706 -573 -183 322 399 -175 -8 -182 -309 190 -538 -35 214 81 -198 -142 242 163 61 -168 51
7108E1r0n5k7K85J86l65j53K64j94j40J72L60k18m00K66K89j64k4l78J22M41k51
$$ 51 -39 -94 -121 164 350 -15 -168 96 -98 -238 -66 294 76 -324 -58 231 67 43 -335 -213 228 -23
7130b3k78J21J17J2r7K65N2m87Q9o96Q64r89M96k99P70p03P40m86O00P27o19n6
$$ -23 -301 -180 -63 -51 -148 117 169 -318 -229 -925 -61 -1050 -554 -853 -83 -786 -46 -532 68 795 176 120
7152A20L8K24r02J063j45r38J30M24j96k4j1n5P78n54k60k25M33o07M75k9Q45
$$ 120 158 382 -520 543 398 -540 -410 14 -182 -206 -217 -272 506 -48 -308 -533 -100 -707 -232 -261 584
7173E84q50k89J170j02p58rR3RO2j50J46o1m6K22k12j18N28l47o45R06J15o97
$$ 584 -266 -555 615 513 -245 -254 -161 -152 -90 -240 -94 -155 -201 21 -191 -309 219 -128 -773 133 248 -449
7195d49K95j1M88j56l26K08J46j13j93J52O2r5j87K64J89k53m06L40J64Rk5l30
$$ -449 -154 -165 323 167 -159 49 195 82 -111 41 103 8 -179 85 274 21 -385 -45 119 128 103 -227
7217b27L17j95m8m9M39l01jj74L09J26l03M0N0m5o4L2N00j95k03l02N18o2l28
$$ -227 90 -105 -153 -202 237 -64 -65 -239 70 196 -107 -67 -17 -62 -126 -94 406 211 8 -294 224 162 -166
7240a66j8K01J87m82N4K9O49n41k70N55J80j02l46K59l8j19l63J86K98j6l07L1
$$ -166 -184 17 204 -278 -224 -195 454 -87 -357 198 378 276 -70 189 151 32 -331 -145 153 137 -170 -139
7262a39M06p9m82L71L10k69n3l09L63J03n27K50K19Q3k83j08Q7r3m6M50n65Q02
$$ -139 267 188 -294 77 387 118 65 -244 119 222 -305 -55 164 247 -36 -144 -57 -150 -196 254 -311 491
7284D91o13q4M50j97O3n0J2N9k41j12L17n9O1l99M38m6R5l43J5K25j49r0J26K33
$$ 491 -122 -206 244 47 110 60 72 131 -110 -222 95 36 97 -302 136 90 185 -158 -143 82 -67 -157 -31 202
7308B02k39J1J11O5j03j55K26l13J71M0q0NJ02k43L0L16j53l28J16K14J95k97
$$ 202 -37 -26 85 150 47 -108 118 -195 -24 16 -64 -59 43 -200 -170 146 -7 -335 -219 -5 190 -107
7330a07k12M31J62j74m23M45j6q4j05M1L60l29m26L18K01k73k37O98K04l79l22
$$ -107 -319 112 274 100 -323 122 106 22 -83 -42 318 -11 -437 -119 82 -191 -428 270 474 95 -227
7351b27J38J76J63n11M49j62qj31J09L85j69p0k88K18j49j60J32K55l02L0K97
$$ -227 -89 87 250 -261 188 26 18 -113 -4 381 212 142 -146 72 -77 -237 -105 150 -152 -122 175
7372A75j89j28L1O3L53j01m81m3L22N1K12n24K36o3K80j68o0kk31j14N26J08k07
$$ 175 -14 -142 -111 -48 305 204 -277 -320 2 53 265 -259 -23 -86 194 26 -34 -36 -267 -381 145 253 46
7395D6k91L32j3j24R0l4J49L4j81J73r8J1m14K38K58j52m3k4L45k48k53j49P23
$$ 46 -245 87 74 -50 40 6 155 189 8 181 83 94 -320 -82 176 24 -19 -43 302 54 -199 -348 375
7418C75l50J69j39J86j67m31M31N0o93O10k25M81k63M6K07l19m08l3o55O88J111
$$ 375 25 194 55 241 74 -357 74 124 -569 41 -184 297 34 80 287 -32 -440 -473 -1128 -440 671
7439F71q34j67K83K07j101O40P88J52j280P23k11J74m24j00N19L43o4m31j98k38
$$ 671 -163 -330 -47 160 -941 -301 487 639 -641 82 -129 45 -379 -479 40 383 319 -112 -310 -548
7459e48M74L07n3p38Q75J56r46L96m1l27J35N0J83K60o63L95m22N12k08M09p1
$$ -548 -74 233 180 -558 317 473 -473 -77 -118 -445 -310 -260 -77 183 -480 -85 -507 5 -203 206 135
7480A35n0m71J79Q12m05p28o3N41j12N66p17J53J9K33k27jK00j069Q23N34j87
$$ 135 85 -386 -207 605 200 -528 -591 -50 -162 404 -313 -160 -141 92 -135 -136 64 -1005 -182 352 165
7501A65J55j14n8n35l51O66n37M95j468K112m70J59L74p42k12k14P39l28J07l25
$$ 165 320 206 148 -387 -738 -72 -609 -114 -1582 530 60 219 593 -149 -361 -575 164 -164 -57 -382
7521c82L35%L32K82m97m7Q8M97q26N04p53j48R16m26K29j45L26k58J19q96M51
$$ -382 -47 -47 285 567 70 23 111 608 -218 286 -467 -615 301 -125 104 -41 285 27 146 -750 -299
7542b99L76KR8n9n70M64K90J11k55m12J81K58r8P2K09m31j02J10M02l14k11J40
$$ -299 77 79 177 118 -452 12 302 413 158 -254 -73 185 87 159 368 -63 -165 -55 347 33 -178 -38
7564c8K31j75j01n3K57k92K68l61L80k21N6J06K92k67k26K7K67m14O31k34k61
$$ -38 193 18 -83 -136 121 -171 97 -264 116 -105 -49 57 349 82 -144 -117 150 -264 367 133 -128
7585a28J53j56L9J18K8p9J17j70J21P1j40r8L87k87j30R0K89l67J77m2R9K1n0
$$ -128 25 -131 -92 26 54 -25 92 -78 43 114 -26 -124 263 -24 -154 -64 225 -142 35 -7 92 113 63
7608F3l9r6K32j38j37K00k18L40j12J50J3m01j6K31k71L15m27K54O8k30L05j31
$$ 63 24 -72 160 22 -115 85 -133 207 95 245 258 -143 -159 72 -199 116 -311 -57 11 -219 86 -45
7630d5O0n9J72M3J99n59j63K08K34O7k74J36o5j67L3Q32n15l18k75P2M69N4l29
$$ -45 15 -44 128 171 370 -189 -352 -144 90 157 -117 19 -46 -213 -180 652 137 -181 -456 -384 85 139 -190
7653a90J51K45m48K50M00k81m26N23m82K42K36J35l63J135n39q82N50Ok98kk74
$$ -190 -39 206 -242 8 408 127 -299 224 -258 -16 220 355 -8 1127 588 -294 256 262 -36 -38 -312
7674c12K33K68m04Q0j4L93j73k89L21J87n34L81k3j1K00k33n89N93l04l27N23
$$ -312 -79 189 -215 -135 -149 244 71 -218 103 290 -244 137 114 103 303 70 -519 74 -230 -557 -34
7695c4K56L65r44N06k04ql03P28K29j83j69q77J813j165l34Q01J15n21l38L00
$$ -34 222 587 -357 149 -55 -63 -366 362 591 408 239 -638 1175 10 -324 477 592 71 -267 33
7715C3m74j20J87R80r62L04J16J58J52j564Q44J070m97p14R83L6J44o58K85N0
$$ 33 -441 -561 -374 606 -356 -52 64 222 374 -1190 -346 724 227 -487 496 532 676 18 303 353
7735C53m73O63j119J129q48J178l5p7m87L9M19j227J267K77l33k92k66R1m82L04
$$ 353 -120 543 -576 553 -295 883 848 771 284 323 742 -485 782 1059 726 434 168 259 -223 81
7755H1N73j49q96P4P08m71R4M45o9r67M16P66k31Po48N3K22q4K1k47M53l32J01
$$ 81 654 505 -391 -317 391 -80 14 459 390 -577 -161 605 374 381 -267 -214 8 -76 -55 -302 151 -181 -80
7778h0o21Q77J74j69p37N45n17R54k70K36q7k25k31M8K96K27N0n23J08O80o30
$$ -80 -701 176 350 181 -556 -11 -528 426 156 392 305 80 -151 -103 193 420 470 -53 55 735 105
7799A05k98L92n24L39m56O27Jl20k12l02O15J59j45J6j46K79M52o57L12j44m45
$$ 105 -193 199 -325 14 -442 185 186 -134 -346 -648 -33 126 -19 -3 -149 130 582 -75 237 93 -352
7820c52L00j9K22j02Q4O0K9k54j21K26L14k44l61P27n93K71J453o63m75o37n56
$$ -352 -52 -71 151 49 133 193 222 -32 -153 73 387 143 -218 509 -84 187 1640 977 502 -135 -691
7841f91N84J030p16l09J34l02N54m3l60O6n4j35L80j10k34j72L31O28p42K07J37
$$ -691 -107 923 207 -102 32 -270 284 241 -119 -53 -107 -242 138 28 -206 -378 -47 581 -161 46 183
7862A83J06k01m62m1N29j08J48Q7m39N31p10N06L71n8q28n1N75k70l11O33n9j9
$$ 183 289 88 -374 -415 114 6 154 241 -198 333 -377 129 500 442 -386 -437 138 -132 -443 190 131 112
7884A12j66r8Q44o28O7m6j80j20O3K73l56q0L73l69L51l62K7L46m33N50K83m15
$$ 112 -54 -152 692 64 131 85 -95 -215 -152 121 -235 -315 58 -311 40 -322 -295 51 -382 168 451 36
7906C6M35m7p17O77J73o15j72j74q9j88J167k58q03J047o86m17R72l98O19n85
$$ 36 471 424 -293 384 557 -58 -230 -404 -493 -681 486 228 -575 472 -214 -631 341 -57 562 -23
7926b3M45n10o19Q30k06k33O54J21m71j59M11j280P28Q61n35n73J227k47j78N2
$$ -23 422 -88 -707 123 -83 -316 338 459 -12 -171 240 -1040 -312 549 14 -559 668 421 243 295
7946B95o02N34J58n17K47N09l80J42j94m64O79K18o41k4Q90j255k38M81M00J70
$$ 295 -307 227 385 -132 115 624 244 386 192 -272 407 625 -16 -40 850 -405 -643 -162 238 408
7966D08J8N08j210n87l06O8J398k7k94J49J56n53r3L63n9k47M13R99j026J08q09
$$ 408 426 934 -276 -863 -1169 -1101 297 270 -24 125 281 -272 -365 -2 -61 -308 105 1104 78 186 -623
7987f23O23r7O56o52r7J4L03l64j84R02j12o36Q5j44M52j73k00P5P8O5m17K77
$$ -623 0 -97 559 -93 -190 -176 127 -237 -421 481 369 -267 -182 -326 126 -47 -247 -172 -94 -29 -446 -169
8009a69K19L95J28l80N05j34j61l07k24P6p73J374q22O43m84m30M21O58m74n32
$$ -169 50 445 573 193 698 564 403 96 -128 -52 -825 549 -273 370 -114 -544 -123 535 61 -471
8029d71K77J4L68K42q61L75q5l85N30L88Pj57l77N47k94o04M07k2M37m25L22k12
$$ -471 -194 -180 188 430 -431 -56 -141 -526 4 392 399 242 -135 412 118 -486 -79 -101 336 -89 233 21
8051B1Q6n00M37k76M98j04j53J7J4j61j9K46k20L25m06J33k23M18l73P3L80k47
$$ 21 107 -393 44 -232 266 162 9 26 40 -121 -140 106 -114 211 -195 -62 -285 133 -240 -167 213 -34
8073c4j86M65m50J10L84m28N48m77q6K50j92K83k20J30o3J24j05j09j28K65m6
$$ -34 -220 245 -205 -95 289 -139 409 -68 -154 96 -96 187 -33 97 34 158 53 -56 -184 81 35
8094C5k08L13J02l51M9O2p1K69l01l29M35j52q2N80J67p60M39J4K82r26J11Q43
$$ 35 -173 140 242 -109 -60 2 -69 200 -101 -430 5 -147 -229 351 518 -242 197 211 493 -433 -322 521
8116E21k97j15K32J21o26M06j02j06L54p01N27l96L88j08J49k97k10J94p48P25
$$ 521 224 109 341 462 -164 242 140 34 388 -313 214 -182 206 98 247 -50 -260 -66 -814 -89
8136h9N2K82M9m94M66R9n04K43K7j66J63j67K97n46j09M88k05R84j323k34O57
$$ -89 -37 245 294 -200 266 365 -139 104 131 -35 128 -39 258 -288 -397 91 -114 870 -453 -687 -30
8157c0o1j84N87K02N8l14J22l80M9J10m60j97O07P0l19O59k80K05k62o47K06M47
$$ -30 -91 -275 312 514 572 258 380 0 49 159 -301 -498 109 179 -140 519 239 444 182 -465 -259 188
8179A88J53m25n33N58n58O05J41l39K91j48O5N9
$$ 188 341 -84 -617 -59 -617 -12 129 -210 81 -67 -2 57
8191E7
$$ Imaginary data points
##PAGE= N=2
##DATA TABLE= (X++(I..I)), XYDATA
0@%%%%%%%%%%%%%%%%%Qj6J6j6J6j9K7l2L2m0M8n6O4p2Q3r1J04j20J36j52J71j91
$$ 0 0 0 0 0 0 0 0 0 0 0 0 0 0 0 0 0 0 8 -8 8 -8 8 -11 16 -16 16 -24 24 -32 32 -40 43 -48 56 -64 72 -80 91 -100
39a00K13k37K63k94L26l58L96m40M86n35N89o49P12p84Q67r58J060j176J310j464
$$ -100 113 -124 139 -155 171 -187 209 -231 255 -280 309 -340 372 -412 455 -503 557 -619 691 -773
59g73J643j858K121k449K871l442M260n534P805j3070N0959L249r8927K4184P4856
$$ -773 870 -988 1133 -1316 1555 -1887 2373 -3161 4644 -8426 42533 45782 -53145 -28961 45895
74D5895j1648q4830J4067Q0290l101q4366J490Q0782P223q3943j3345P8227J9303
$$ 45895 34247 -50583 -36516 43774 40673 -43693 -42203 38579 45802 -38141 -51486 26741 46044
87D6044p7368k1583P6279L1617p0912l2230O7110L6189o6576m0122O1497M3438
$$ 46044 -31324 -52907 23372 54989 -15923 -48153 18957 55146 -11430 -51552 9945 53383
99E3383o0223m7650N6902N4038n0991n5878M3841N3548m4467n8945M0786O3291
$$ 53383 -6840 -54490 2412 56450 5459 -50419 -6578 46970 2503 -56442 -15656 47635
111D7635l2554o1471L1228O4303k7128o7628K1102O7456j6139o6499J3519O8804
$$ 47635 15081 -46390 -15162 49141 22013 -45615 -24513 42943 26804 -39695 -26176 42628
123D2628p436o8098J756O5091k124o8275m248O8268J0206o4818j3270O3682J6827
$$ 42628 35192 -32906 -31150 33941 31817 -36458 -40706 27562 37768 -27050 -40320 23362 40189
136D0189o2598k0531O0563K4671n8186k7587N6586L2688n1962l3275N0532L5789
$$ 40189 -22409 -42940 17623 42294 -15892 -43479 13107 45795 -6167 -39442 11090 46879
148D6879n0266m1668M4014M2896m1648m4862L8903M7884l4324m8624L1144M8653
$$ 46879 -3387 -45055 -1041 41855 207 -44655 -5752 42132 7808 -40816 -9672 38981
160C8981k9903n3144K5641N5271j8738n1890J9626N4920j5836n8589R261N5881
$$ 38981 9078 -44066 -18425 36846 18108 -33782 -14156 40764 24928 -33661 -24400 31481
172C1481o080n5503L544N6342j13n6125l477N4650N700n6859j1246N5144J5082
$$ 31481 25401 -30102 -26558 29784 29671 -26454 -29931 24719 30419 -26440 -37686 17458 32540
185C2540n0757j6262N1742K0290n0294k3305M8093K6504m6007k9414M3804L1488
$$ 32540 -18217 -34479 17263 37553 -12741 -36046 12047 38551 -7456 -36870 6934 38422
197C8422m1417l3560M0373L6341l8335m0849L2060L9177l0247m0354K9929M3938
$$ 38422 -2995 -36555 3818 40159 1824 -39025 -6965 32212 1965 -38389 -8460 35478
209C5478k5139m4160K2831M5548k0608m7605J5959M7850j1508m5416J1224M8141
$$ 35478 10339 -33821 -10990 34558 13950 -33655 -17696 30154 18646 -26770 -15546 32595
221C2595p799n0569K050M6514j612m7265p45M8722N172m7137q882M6297J0906
$$ 32595 24796 -25773 -23723 22791 21179 -26086 -26831 21891 27063 -20074 -28956 17341 28247
234B8247m5738j4503M4229J7413m2026j7483M2750K2039m0904k4870L8337K6069
$$ 28247 -17491 -31994 12235 29648 -12378 -29861 12889 34928 -5976 -30846 7491 33560
246C3560l7228k9494L4309L0692l2821l2125L1156L4976k9183l6503K4995L6351
$$ 33560 -3668 -33162 1147 31839 -982 -33107 -1951 33025 3842 -32661 -7666 28685
258B8685k3852l7791K2353M1021j6619l9626J5357M0337j3988m2514R722M1455
$$ 28685 4833 -32958 -10605 30416 13797 -25829 -10472 29865 15877 -26637 -16915 24540
270B4540o682m0809N586M2241k588m3093k093M0177K814m0820n258M1268R566
$$ 24540 17858 -22951 -17365 24876 22288 -20805 -22898 17279 20093 -20727 -25985 15283 24849
283B4849l8875j0356L8440J2422l7879j5633L6413J8041l4486j9253L4159K1996
$$ 24849 -14026 -24382 14058 26480 -11399 -27032 9381 27422 -7064 -26317 7842 29838
295B9838l2611k4140L0568K4573l0226k7934K7129K8366k4250l0052K4477L1805
$$ 29838 -2773 -26913 3655 28228 -1998 -29932 -2803 25563 1313 -28739 -4262 27543
307B7543k1241l2874J8614L3275j7214l4599J5365L6531j0802l5332J0537L5264
$$ 27543 6302 -26572 -7958 25317 8103 -26496 -11131 25400 14598 -20734 -10197 25067
319B5067r071l7854L997L6517l108l5537J923L6722J106l6664m093L4545N733
$$ 25067 15996 -21858 -17861 18656 15548 -19989 -18066 18656 19762 -16902 -20995 13550 19283
332A9283l5112p429L4575J1397l2230j1187L2338J3172l1897j6229K9685J7422
$$ 19283 -15829 -23258 11317 22714 -9516 -20703 11635 24807 -7090 -23319 6366 23788
344B3788k8687j8675K7035K0973k6083k2343K4180K3042k3147k5634K0866K6243
$$ 23788 -4899 -23574 3461 24434 -1649 -23992 188 23230 83 -25551 -4685 21558
356B1558j9334k6147J8851K9254j5561k9179J3513K9035j2459l0997J0366L1438
$$ 21558 2224 -23923 -5072 24182 8621 -20558 -7045 21990 9531 -21466 -11100 20338
368B0338p442l0461O458L1444n574l3534J434L1334l63l0363r39L2004M149l0773
$$ 20338 12896 -17565 -11107 20337 14763 -18771 -17337 13997 13634 -16729 -17668 14336 18485 -12288
382a2288n917K9991O555k9957q760K9736J1931k7597j2148K7009J3144k6389j5935
$$ -12288 -18205 11786 18341 -11616 -20376 9360 21291 -6306 -18454 8555 21699 -4690 -20625
395b0625K4207J6429k3883j8189K2657J9362k0728k0267J9859K1281j8281k2708
$$ -20625 3582 20011 -3872 -22061 596 19958 -770 -21037 -1178 20103 1822 -20886
407b0886J6313K3781j4748k3703J4077K5722j1554k5560R911K5693r980k7514
$$ -20886 -4573 19208 4460 -19243 -5166 20556 9002 -16558 -6647 19046 9066 -18448
419a8448O430K7322m527k6017M167K6614k486k8315k51K6833J475k6719j923K7354
$$ -18448 -12018 15304 10777 -15240 -11073 15541 13055 -15260 -15511 11322 12797 -13922 -15845 11509
433A1509N544k5664o124K5224P021k5811r563K4749J1016k3023j1466K2437J2447
$$ 11509 17053 -8611 -14735 10489 17510 -8301 -17864 6885 17901 -5122 -16588 5849 18296
446A8296k2211j4891K0315J5685j9662j6771J8254J7699j6073j8134J6744J9337
$$ 18296 -3915 -18806 1509 17194 -2468 -19239 -985 16714 641 -17493 -749 18588
458A8588j5054k0721J2995K0999j1634k0965J0437K2421r182k2265P654K2227
$$ 18588 3534 -17187 -4192 16807 5173 -15792 -5355 17066 7884 -14381 -6727 15500
470A5500p499k3684M366K3072k870k2425L073K3920r50k4033j776K3219K121k2495
$$ 15500 8001 -15683 -11317 11755 8885 -13540 -10467 13453 12503 -11530 -13306 9913 12034 -10461
484a0461k862K3399N368k2129o343K1806P074k2231r674K0429J0212j9480j0577
$$ -10461 -13323 10076 15444 -6685 -13028 8778 15852 -6379 -16053 4376 14588 -4892 -15469
497a5469J9617J2000j9266j3569J7372J4586j6379j5073J5609J5720j3709j6409
$$ -15469 4148 16148 -3118 -16687 685 15271 -1108 -16181 -572 15148 1439 -14970
509a4970J3912J7801j1997j8601J0361J7957j0130j9049Q788K0031p296j9869
$$ -14970 -1058 16743 4746 -13855 -3494 14463 4333 -14716 -5928 14103 6807 -13062
521a3062N655K0062n057k0712K925K0209k206j9228J741K1334K57k0326k079J9459
$$ -13062 -7407 12655 7598 -13114 -10189 10020 7814 -11414 -9673 11661 11918 -8408 -10487 8972
535H972K373j9941l307K0129N432j9242o411J8518O637j9271q573J7658R208j6884
$$ 8972 11345 -8596 -11903 8226 13658 -5584 -11995 6523 13160 -6111 -14684 2974 12182 -4702
549d702r716J6888J1729j5427j2249J4371J2725j4077j3644J3525J5117j2150
$$ -4702 -14418 2470 14199 -1228 -13477 894 13619 -458 -14102 -577 14540 2390
561B390j5332J1408J5855j0209j6586Q703J5951q686j7497P088J8315n178j7279
$$ 2390 -12942 -1534 14321 4112 -12474 -3771 12180 3494 -14003 -6915 11400 6222 -11057
574a1057M580J7647m075j8394K731J8019j265j7551Q60J8309J350j7941j884J6874
$$ -11057 -6477 11170 7095 -11299 -8568 9451 8186 -9365 -8505 9804 11154 -6787 -8671 8203
588H203K003j8012m099J7523N741j6444n927J6079N992j6253p858J5443R014j4514
$$ 8203 10206 -7806 -11905 5618 11359 -5085 -11012 5067 11059 -5194 -13052 2391 11405 -3109
602c109r286J4455J0446j2892j0774J2660J1668j2773j2917J1404J3415j0145
$$ -3109 -12395 2060 12506 -386 -11160 1500 13168 395 -12522 -1118 12297 2152
614B152j3790R496J4338r073j5186P917J5124p254j6239O125J5875l846j5044
$$ 2152 -11638 -2142 12196 3123 -12063 -4146 10978 3724 -12515 -6390 9485 5639 -9405
627i405M244J6331l409j7298J492J6462o22j5801J90J6517R75j5975k319J5396
$$ -9405 -5161 11170 7761 -9537 -8045 8417 7795 -8006 -7816 8701 9676 -6299 -8618 6778
641F778K211j6033m453J5468N250j4023n047J4591N951j4242p783J3384Q815j2748
$$ 6778 8989 -7044 -11497 3971 9221 -4802 -9849 4742 10693 -3549 -11332 2052 10867 -1881
655a881q553J2440R794j1756j0035J1084J0514j1004j2148R852J1841q727j2749
$$ -1881 -10434 2006 11800 44 -9991 1093 11607 603 -11545 -1693 10148 1421 -11328
668a1328Q775J3108p784j3592O659J4113o005j4330N182J4523l869j4067L642
$$ -11328 -2553 10555 2771 -10821 -4162 9951 3946 -10384 -5202 9321 5452 -8615 -4973
681d973J5302k662j5389P35J4506p40j4601K1J5300J125j4753k601J4206K603
$$ -4973 10329 7667 -7722 -6987 7519 6779 -7822 -7801 7499 8624 -6129 -8730 5476 8079
695H079j4880l500J3998M997j3068m780J3926O121j2864q106J2207P723j1582
$$ 8079 -6801 -10301 3697 8694 -4374 -9154 4772 10893 -1971 -10077 2130 9853 -1729
708a729q303J1370R566j0931r850R943R731r392j0803Q446J1201q017j1918P699
$$ -1729 -10032 1338 10904 -27 -9877 66 9797 405 -10398 -1952 9249 1232 -10686 -2987
722b987J2861o416j2741O155J2711n285j3280M176J3426l198j3347L002J3909
$$ -2987 9874 3458 -9283 -3128 9583 4298 -8982 -4806 8620 5422 -7925 -4923 8986
735H986j745j4613M54J3491n93j3832p06J4531J992j3632j958J2951L260j3804
$$ 8986 7241 -7372 -6918 6573 5980 -7852 -8558 5973 7965 -5667 -7625 5326 8586 -5218
749e218l603J3488M636j2646m634J2031O603j2151p349J1413P417j1485p517J0152
$$ -5218 -8821 4667 9303 -3343 -7977 4054 10657 -1494 -8843 2570 9987 -1498 -9015 1137
763A137R096j0171r465Q163J1134r184j1459R086R738n754j1496O673J1217m400
$$ 1137 10233 62 -9403 -1240 9894 710 -10749 -1663 8075 2321 -9175 -2502 8715 4315
777D315j1051M481J1905n101j2590K803J2416j768j4070K658J3275j085j3058
$$ 4315 -6736 -2255 9650 4549 -8041 -5238 7178 5410 -8660 -6002 7273 6188 -6870
790f870Q52J1746M44j2701k624J3689L140j2336l014J3165L849j3338m075J1517
$$ -6870 -6018 5728 6172 -6529 -9153 4536 7676 -4660 -7674 5491 9340 -3998 -8073 3444
804C444N236j0667o308R926Q170j1272o496R384O771r609q345Q805R882q835q864
$$ 3444 8680 -1987 -8295 1631 9801 -1471 -7967 1417 8188 -1421 -9766 -961 8921 86 -8778
819h778P561J0040p227j0517O879J1063o415j1056N457J1130l839j1595M083J1674
$$ -8778 -1217 8823 1596 -8921 -2042 9021 2606 -8450 -2993 8137 4298 -7297 -3214 8460
833H460l355j2943K162J1931j395j2281J002J2642N40j2571q85J2173P78j2259
$$ 8460 5105 -7838 -5676 6255 4860 -7421 -6419 6223 6763 -5808 -6693 5480 6258 -6001
847f001k058J2779L572j1634l556J1662M057j1729n553J0721N770j0363o321J0621
$$ -6001 -8059 4720 8292 -3342 -6898 4764 8821 -2908 -8461 2260 8030 -2333 -8654 1967
861A967P069r975p754R037P848q953q764Q386R585p129r669P252J0102o560j0228
$$ 1967 9036 -939 -8693 344 8192 -761 -9525 -1139 8446 1317 -8352 -1100 9002 2442 -7786
876g786N599J0692m996j1506M319J1233l285j1236K764J1619k507j2121J311J1356
$$ -7786 -2187 8505 3509 -7997 -3678 7555 4270 -6966 -4202 7417 4910 -7211 -5900 5456
890E456m67j1516q9J2118J249j1033k142J1445K007j1605l211J1585M040j0390
$$ 5456 4989 -6527 -6616 5502 6751 -4282 -6424 5021 7028 -4577 -7788 3797 7837 -2553
904b553m259J0684M465j0860n895R410O308r359p086R597P791q611p906Q108Q320
$$ -2553 -6812 3872 8337 -2523 -8418 992 7300 -2059 -9145 452 8243 -368 -8274 -166 8154
919H154p667r145P084J0092o465r602N736J0416n427j0399M318J0672m274j0893
$$ 8154 487 -8658 -1574 8518 2053 -7549 -1813 8603 3176 -7223 -2905 7767 3493 -7400
933g400K772J1154k447j1149K199J1099j043j1484p7J1240M36j0903j132J1743
$$ -7400 -4628 6526 4079 -7070 -4871 6228 5185 -6299 -6376 4864 5300 -5603 -6735 5008
947E008J987j0635k276J0508K781j0945m326J0540M804r718n153J0020N560r779
$$ 5008 6995 -3640 -5916 4592 7373 -3572 -7898 2642 7446 -2272 -7425 2595 8155 -1624
961a624o849Q741O621p954p609Q403Q133p269q348O907Q905o321r419O084R271
$$ -1624 -8473 268 6889 -1065 -8674 -271 7862 593 -7755 -848 8057 1736 -7683 -1599 7672
976G672m962j0020M888J0366m349j0538L048J0691l109j0650J991J0840j376j0833
$$ 7672 2710 -7310 -2422 7944 3595 -6943 -3895 6796 3687 -6963 -4972 5868 4492 -6341
990f341J201J0889J65j0731j117J0635J087j0521j783J0798L285j0020l497R449
$$ -6341 -5140 5749 5914 -4817 -5934 4701 5788 -4733 -6516 4282 7567 -2453 -5950 3499
1004C499M034j0294m628R015N365r211n383Q719O577q171p075P274P097p124p717
$$ 3499 7533 -2761 -7389 1626 6991 -2220 -7603 1116 7693 -478 -7553 -279 6818 -306 -8023
1019h023P448Q448n917q651N439Q824n256r411M565R524m060r770L165J0079k446
$$ -8023 -575 7873 1956 -6695 -1256 7568 2312 -7099 -2534 6990 2930 -6840 -3675 6404 3958
1034C958r836J588J0236j812j0567P78J0577J07j0214j00J0291J336r835j718
$$ 3958 -5878 -4290 5946 4134 -6433 -5655 4922 5029 -5185 -5285 5006 6342 -3493 -5211
1048e211R833K073j0622l072R938M141r353m056Q873M674r495n545Q491N892p819
$$ -5211 4622 6695 -3927 -6999 2939 7080 -2273 -6329 2544 7218 -2277 -7822 669 6561 -1258
1063a258o225P847P062o979p487O626P573o218q188N513R020n133q204M421Q439
$$ -1258 -7483 364 7426 447 -7040 -414 7159 941 -7247 -1734 7286 2153 -6051 -1630 6809
1078F809l940r355L124R394k915r661K131J0039j702r442R17J0012n40r984m63
$$ 6809 2869 -6486 -3362 6032 3117 -6544 -4413 5626 3924 -5518 -4601 5411 4871 -5113 -5576
1093e576R824J160r336j307R438K386r434l086R263L353r644l990Q378M887q132
$$ -5576 4248 5408 -3928 -5235 4203 6589 -2845 -5931 3332 6685 -2959 -6949 1429 6316 -1816
1108a816m555P975N287p891o523P213O475o603o409O814P649o178p672N282P869
$$ -1816 -6371 1604 6891 -1000 -7523 -310 6165 -438 -6847 -33 7616 1438 -6234 -952 6917
1123F917n172q133M175Q583l789q601L127Q833k697r124J999Q996j435r507R22
$$ 6917 1745 -6388 -2213 6370 2581 -6020 -2893 5940 3243 -5881 -3882 5114 3679 -5828 -4906
1138d906R723k56r204j0R253P85r265j356Q770J976q723k554R151L174q585m026
$$ -4906 4817 4561 -4643 -4653 4600 5385 -3880 -5236 3534 5510 -3213 -5767 3384 6558 -2027 -6053
1154f053Q036L728q094m924Q026N297p171n212P171O253o955o747N742O968o035
$$ -6053 1983 5711 -2383 -7307 719 6016 -1155 -6367 804 7057 102 -6645 -903 6065 30
1169C0o867O110Q001m879q104M288P759m054q651L316Q485k734q668K520Q835
$$ 30 -6837 -727 7274 2395 -5709 -1421 6338 2284 -6367 -3051 5434 2700 -5968 -3448 5387
1184E387j563q915N82Q863k58r039K8Q955J339q971r55Q424K112q465k858P908
$$ 5387 3824 -5091 -4509 4354 4096 -4943 -4915 4040 5379 -3592 -4547 3877 5989 -2476 -5334 2574
1200B574K889q574l310Q435M128p647m245P113M706p615n500P209N805n934o033
$$ 2574 5463 -3111 -6421 2014 6142 -1505 -5750 1363 6069 -1546 -7046 163 5968 34 -5999
1215e999O010O756n567p002M893O965m738p538M265Q188l353q345L094Q000l356
$$ -5999 11 6767 1200 -5802 -909 6056 1318 -6220 -1955 6233 2880 -5465 -2371 5629 2273
1230B273q367K385Q723j762q528J167Q870m34q649j90Q949L58q814j044Q596K040
$$ 2273 -6094 -3709 5014 3252 -5276 -4109 4761 4327 -4322 -4512 4437 4795 -4019 -5063 3533 5573
1246E573q534j724Q012K377p970l178P139L652p712m004P042N124o443n139O698
$$ 5573 -2961 -4685 3327 5704 -2266 -5444 1695 5347 -2365 -6369 673 5797 -646 -5785 913
1261I13N084o339n900N613O204m700o426N286O709m549p485L980P414l880p810
$$ 913 5997 -342 -6242 -629 5575 875 -5551 -265 6444 1895 -5590 -1610 5804 1924 -5886
1276e886L255P807k402q214K251Q113j781q403J426Q157o21q294O35Q335K24q146
$$ -5886 -2631 5176 2774 -5440 -3189 4924 3143 -5260 -3834 4323 3702 -4592 -3957 4378 4602 -3544
1292c544j078Q468J523q056k528Q023K182p708k837P920L252p522l934P034M031
$$ -3544 -4622 3846 5369 -2687 -5215 2808 4990 -2718 -5555 2365 5617 -1905 -5839 1195 5226
1307E226o857m552O394N353n528n576N914N783n239o543M746O232m497o206M238
$$ 5226 -1631 -6183 211 5564 36 -5540 374 6157 918 -5625 -879 5353 856 -5350 -1112
1322a112P267l710p661K915P075k786p432J972Q023j363p789J196P577n54p775
$$ -1112 6155 2445 -5216 -2301 4774 1988 -5444 -3472 4551 3188 -4601 -3405 4172 3618 -4157
1337d157L31P649K68p808p50Q143J390p769j652P558K113p507l188P136L196p231
$$ -4157 -3826 3823 4091 -3717 -4467 3676 5066 -2703 -4355 3203 5316 -2191 -5379 1757 4953 -2278
1353b278l693P238M531o568m567N995M944o516m907N449O049n044n707M723O514
$$ -2278 -5971 1267 5798 -770 -5337 658 5602 -914 -5821 -372 5677 633 -5074 -351 6163
1368F163m319o931L604O622l770o762L706O703k285p461K100O547j656p229J136
$$ 6163 1844 -5087 -1483 5139 1369 -5393 -1687 5016 2731 -4730 -2630 3917 2261 -4968 -3832
1383c832P753k60p633N19P879R0p579j123P306J258p210j764P105K276p159k405
$$ -3832 3921 3661 -3972 -3453 4426 4516 -3063 -4186 3120 4378 -2832 -4596 2509 4785 -2374 -4779
1399d779O760L228o979l818O516L647o281l893O348M641n328m863N216N198n425
$$ -4779 1981 5209 -1770 -5588 928 4575 -1706 -5599 749 5390 62 -4801 415 5613 188
1414A88n531M602O114m107o152M270O493l735o828K625O071k501o706K740O765
$$ 188 -5343 -741 5373 1266 -4886 -616 5877 2142 -4686 -2061 4010 1509 -5197 -2457 4308
1429D308j605o835R40P206n71p339J55P194L54p125m59P449Q55o782j734O710
$$ 4308 2703 -4132 -3192 4014 3443 -3896 -3741 3453 3807 -3318 -3777 3672 4527 -2255 -3989 2721
1445B721J742o815k825P158K574o538l280O492L805o280m002N889L845n620m242
$$ 2721 4463 -2352 -5177 1981 4555 -1983 -5263 1229 5034 -1246 -5248 641 4486 -1134 -5376
1460e376N461N203m359n398M337N704m328n950L400N901l105o073L250O131k826
$$ -5376 85 5288 929 -4469 -132 5572 1244 -4706 -1306 4595 1490 -4583 -1333 4798 1972
1475A972o477J990O389j965o667J543P146m21o947L04O928j69p067l55O889R07
$$ 1972 -4505 -2515 3874 1909 -4758 -3215 3931 3510 -3437 -3133 3795 3626 -3441 -3796 3093 4000
1491D000o783j133O719J958o607k355O329K162o110l264O211L257n741l520N719
$$ 4000 -2783 -3916 2803 4761 -1846 -4201 2128 4290 -1820 -5084 1127 4384 -1357 -4877 842
1506H42L647m985m336M988M561m764m956M536N477m037m998L601N378l712o211
$$ 842 4489 -496 -4832 156 4717 -47 -5003 -467 5010 973 -4025 -424 4954 1242 -4969
1521d969K672O134k426n923K749O202k123o378J487O299q55p065Q36O888J56o585
$$ -4969 -2297 3837 1411 -4512 -1763 4439 2316 -4062 -2575 3724 2869 -4196 -3360 3528 3684 -2901
1537b901J65O236M84o671j347O723J445o191k367O369K000n704l004O065L060
$$ -2901 -2736 3500 3984 -2687 -4034 2689 4134 -2057 -4424 1945 3945 -1759 -4763 1302 4362
1552D362n859l398N196L786m962l546M923M389m591m535M147M753m250m907L424
$$ 4362 -1497 -4895 301 4087 -875 -4421 502 4891 300 -4235 -88 4665 415 -4492 -1068
1567a068N476l107n093K904N352k779o172J908N829j873n549J770O181q82n992
$$ -1068 4408 1301 -3792 -888 4464 1685 -4487 -2579 3250 1377 -4172 -2402 3779 2897 -3095
1582c095O18O012R6o687K49N775N51n749j340P003R33o353j131N109P93n121j419
$$ -3095 -2477 3535 3631 -3056 -2807 2968 3519 -2230 -3570 3433 4366 -1987 -3118 1991 2784 -2337 -3756
1599c756N070K107m702k736N357K965n372k709M323L772m441m309M129N663m217
$$ -3756 1314 3421 -1281 -4017 1340 4305 -1067 -3776 547 4319 -122 -4431 -302 5361 1144
1614A144m992L218M812k856n341K609M870k061n253K355N770j776o194J405N026
$$ 1144 -3848 -630 4182 1326 -4015 -1406 3464 1403 -3850 -1495 4275 2499 -3695 -2290 2736
1629B736p68n737J496N851k03n925m72N724O82n860q28N942J051n908j260N382
$$ 2736 1968 -3769 -2273 3578 3375 -2550 -3022 2702 3384 -2476 -3304 2638 3689 -2219 -3479 1903
1645A903J940n412k499N152K537n159k839N432K970m653l564M882L727m646l745
$$ 1903 3843 -1569 -4068 1084 3621 -1538 -4377 1055 4025 -628 -4192 690 4417 -229 -3974
1660c974M004M390m059m419L268N393l230m946L133M249k894n193K338N093j234
$$ -3974 30 4420 361 -4058 -790 4603 1373 -3573 -440 3809 915 -4278 -1940 3153 1919
1675A919o083K534N429j844n670J166N348n27n132O35N296K10n264q58N901N45
$$ 1919 -4164 -1630 3799 1955 -3715 -2549 2799 2272 -2860 -2225 3071 3281 -1983 -2841 3060 3605
1691C605o006j87L721K564n647j969N904K335n733j715M145L095n426k588M036
$$ 3605 -2401 -2588 1133 3697 -1950 -3919 1985 4320 -1413 -3128 1017 4112 -1314 -3902 134
1706A34L713l901l639M219M340m030m350L611M118l647m286K509N126l078m647
$$ 134 3847 -54 -3693 526 4866 836 -3514 97 4215 568 -3718 -1209 3917 839 -3808
1721c808K931L628j475m442J218N208j084m931P07N409l09n174j81M629N21o041
$$ -3808 -877 2751 1276 -3166 -1948 3260 2176 -2755 -2048 3361 3052 -2122 -2303 2326 2847 -3194
1737c194m10N334J590m871p93M430J286n246k122M943J908m233k196M932K457
$$ -3194 -3604 1730 3320 -1551 -2344 2086 3372 -1874 -3996 947 2855 -1378 -3574 1358 3815
1752C815m490l168M609L479m515l274L813L732l119n018L864M186l336m056K688
$$ 3815 -675 -3843 766 4245 -270 -3544 269 4001 882 -4136 -272 3914 578 -3478 -790
1767g90M304k973m558K507N089k077m755J945M733j616m686O73M975j002m634
$$ -790 3514 541 -4017 -1510 3579 1502 -3253 -1308 3425 1809 -2877 -2204 2771 1769 -2865
1782b865N47N524j16n262m16N075J37n082m72M865J348n155j535N004J875m961
$$ -2865 -2318 3206 3090 -2172 -2588 2487 2624 -2458 -2930 1935 3283 -1872 -3407 1597 3472 -1489
1798a489j865M057K492m378k400M726K300l622l109L808L013l013l815L016L702
$$ -1489 -3354 703 3195 -1183 -3583 1143 3443 -179 -3288 520 3533 520 -3295 -279 3423
1813C423l810l562L212L730k529l293K297M141k898l876J205M747j044m442J141
$$ 3423 -387 -3949 -737 2993 464 -2829 -532 3609 711 -3165 -1960 2787 1743 -2699 -1558
1828a558M788p67m971P36M627p37m524j3N114J69m763n34M246P84m952j037M739
$$ -1558 3230 2463 -2508 -1772 2855 2118 -2406 -2419 2695 2864 -1899 -2433 1813 2597 -2355 -3392 1347
1845A347J521m524j484M348K106m331k257L996K594l737k753L652L421l855l313
$$ 1347 2868 -1656 -3140 1208 3314 -1017 -3274 722 3316 -421 -3174 478 3899 44 -3269
1860c269L308L683l459l766L247L311k491l914K392L970k002l993J770M157j762
$$ -3269 39 3722 263 -3503 -256 3055 564 -3350 -958 3012 1010 -2983 -1213 2944 1182
1875A182m294J260M401q16m117P66M756n88m635k97M496j30m493J92M269R92n079
$$ 1182 -3112 -1852 2549 1733 -2384 -1618 3138 2550 -2085 -2382 2114 1984 -2509 -2317 1952 2944 -2135
1892b135k07L963R83m545j466M623J551l965j934M188K352m211k277L701K646
$$ -2135 -2342 1621 2604 -1941 -3407 1216 2767 -1198 -3132 1056 3408 -803 -3080 621 3267
1907C267l448k930L368L026l139l207L097L211k832l707K260L829k248l962K275
$$ 3267 -181 -3111 257 3283 144 -3063 34 3245 413 -3294 -1034 2795 547 -3415 -1140
1922a140M063j495l925J343M115j232m327J022L928n16m392R77M367l99m305p02
$$ -1140 2923 1428 -2497 -1154 2961 1729 -2598 -1576 2352 1836 -2556 -1579 2788 2389 -1916 -2618
1938b618M226M83m595r5M326Q93m169j018M126J145m010j888M098K203l797j890
$$ -2618 1608 2091 -2504 -2599 1727 2620 -1549 -2567 1559 2704 -1306 -3194 904 3107 -690 -2580
1954b580L452K493l294k968L203K886l366l090L042L439k892l389K411L691k364
$$ -2580 872 3365 71 -2897 306 3192 -174 -3264 -222 3217 325 -3064 -653 3038 674
1969F74l599J634L874j722l768J615L814j049l842J133M321j268m166L22M416
$$ 674 -2925 -1291 2583 861 -2907 -1292 2522 1473 -2369 -1236 3085 1817 -2349 -2027 2389
1984B389n30l969m6M491j3m037o98M073N19m109j041M079J527l794j139L487J997
$$ 2389 1859 -2110 -2156 2335 2322 -1715 -2413 1660 2179 -1930 -2971 1108 2635 -1159 -2298 1189 3186
2001C186l810k309L630K084l435k121L282K862l468k886K733K953k594l182K506
$$ 3186 -624 -2933 697 2781 -654 -2775 507 3369 -99 -2985 -252 2701 107 -3075 -569
2016e69L328k338l240K209L349j812l837J787L649j478l686J171M120j111l707
$$ -569 2759 421 -2819 -610 2739 927 -2910 -1123 2526 1048 -2638 -1467 2653 1542 -2165
2031b165Q91L853o09m221J02L959j85l867j26M205O76m250o48L573R15l484j311
$$ -2165 -1274 2579 1970 -2251 -2149 1810 1625 -2242 -2368 1837 2513 -1737 -2385 1188 2103 -1381 -2692
2048b692L626J869l959j306L451K149l333k611L185K042k520k991L504K412k978
$$ -2692 934 2803 -1156 -2462 989 3138 -195 -2806 379 2421 -99 -3090 414 2826 -152
2063a52k796K654K902k262l277K166L281j801l469J981L828j698l418J014L644
$$ -152 -2948 -294 2608 346 -2931 -765 2516 715 -2754 -773 3055 1357 -2061 -1047 2597
2078B597j236l786Q70L924o96m034Q99L350J19l648p34L819M60m069j35L984R36
$$ 2597 1361 -2425 -1555 2369 1673 -2361 -1462 1888 2007 -1641 -2375 1444 1904 -2165 -2300 1684 2620
2095B620m012p63L308P77l275j120L696J456l354j779L217J961l183k189K465
$$ 2620 -1392 -2155 1153 1930 -1345 -2465 1231 2687 -667 -2446 771 2732 -451 -2640 -175
2110a75K371k376k568K397L036k354l168K313L095k020k855J415L434j595l364
$$ -175 2196 -180 -2748 -351 2685 331 -2837 -524 2571 551 -2304 -889 2545 950 -2414
2125b414J699L436j367l596J145L655r70l942O66L679m67l232r8L548L67l906
$$ -2414 -715 2721 1354 -2242 -1097 2558 1588 -2354 -1688 1991 1524 -1708 -1806 1742 2109 -1797
2141a797l26L506O26l523q84L778J041l382j014L380J126l569j341K680K218l166
$$ -1797 -2123 1383 2009 -1514 -2398 1380 2421 -961 -1975 1405 2531 -1038 -2379 301 2519 -647
2157f47j746K927K256k947k435K592K596k819k141J943K868j719l483K168L276
$$ -647 -2393 534 2790 -157 -2592 0 2596 -223 -2364 -421 2447 728 -2755 -587 2689
2172B689k002l007J351L423j248l380J163L290r13l484O08L431n71l484K1L770
$$ 2689 687 -2320 -969 2454 1206 -2174 -1011 2279 1366 -2118 -1510 1921 1350 -2134 -2113 1657
2188A657k65l207j68L682O38l704o07L529M36l161r20L220J335l093j186K657
$$ 1657 1392 -1815 -1983 1699 2337 -1367 -1974 1555 1991 -1170 -2090 1130 2465 -628 -1814 843
2204H43J605l206j980L109K044l180j657K552K254k430k485K295K492k105k498
$$ 843 2448 -758 -2738 371 2415 -765 -2422 130 2384 -46 -2531 -236 2256 151 -2347
2219b347J954K590j628k715J721K872j227l461J111L265j307k833P02L213m54
$$ -2347 -393 2197 569 -2146 -425 2447 1220 -2241 -1130 2135 828 -2005 -1303 1910 1456
2234A456l299K53L327l67l281m2L396K40l413r1L047J362l672r35L000R62k908
$$ 1456 -1843 -1590 1737 1370 -1911 -1953 1443 1683 -1730 -1821 1226 2588 -1084 -2019 981 1943 -965
2251i65j355L118J547k970j702K596K005k677j966K412K294k768j760K394K244
$$ -965 -2320 798 2345 -625 -2327 269 2274 -403 -2369 43 2337 -431 -2191 203 2447
2266B447k125k435K020K334j692k788J743K729j640k439J090K625n91l080M48
$$ 2447 322 -2113 -93 2241 549 -2239 -496 2233 593 -1846 -756 1869 1278 -1802 -1354
2281a354L128o21l220N29L196k84l136J63L332K8l234m24L225M67l010m33K930
$$ -1354 1774 1153 -2067 -1538 1658 1374 -1762 -1599 1733 1761 -1473 -1897 1328 1795 -1215 -1648 1282
2298A282J193l261q98K819Q69k947j398K772J709k479j595K326J787k271k282
$$ 1282 2475 -786 -1684 1135 2004 -943 -2341 431 2140 -339 -1934 392 2179 -92 -2374
2313b374K211K381k342k212K327K398j757k669J857K631j596k915J218K716q76
$$ -2374 -163 2218 -124 -2336 -9 2389 632 -2037 -180 2451 855 -2060 -842 1874 998
2328I98k929J115K744o70l065M87L033l69l069J90K902K14k883k29L318K93l388
$$ 998 -1931 -816 1928 1258 -1807 -1320 1713 1344 -1725 -1535 1367 1581 -1302 -1531 1787 2080 -1308
2345a308o66K921R84l057j060L286R78k659j416K611J283k559j765K478J966k485
$$ -1308 -1974 947 1931 -1126 -2186 1100 2078 -581 -1997 614 1897 -662 -2427 51 2017 -468
2361d68j647K406J983k063k420J660K643k000k109J705K652j629k479J403K679
$$ -468 -2115 291 2274 211 -2209 -549 2094 94 -2015 -310 2342 713 -1766 -363 2316
2376B316j494l136J017L089r25k545K98L095n62k712L68K837k21k761k13K844
$$ 2316 822 -2314 -1297 1792 867 -1678 -1380 1715 1153 -1559 -1191 1646 1425 -1336 -1549 1295
2392A295N26l267l4L072N15k841p09K382J058k780j285K734J364k594j504K252
$$ 1295 1821 -1446 -1480 1592 2107 -734 -1443 939 1997 -783 -2068 666 2030 -564 -2068 184
2408A84J811k551j855K231J951j799j911J748K383j879k236J523K451j581k526
$$ 184 1995 -556 -2411 -180 1771 -28 -1939 -191 2192 313 -1923 -400 2051 470 -2056
2423b056J708K272j118k683J325K503j130k759Q73K828q21k615N13K790n08k363
$$ -2056 -348 1924 806 -1877 -552 1951 821 -1938 -1065 1763 942 -1673 -1160 1630 1122 -1241
2439a241M4K806P9k955k93K851K22k528q08K823J028k724r28K327R52k570j245
$$ -1241 -1197 1609 1688 -1267 -1560 1291 1513 -1015 -1823 1000 2028 -696 -1624 703 1655 -915 -2160
2456b160K472J492k324j336K065J691j899j898J704K291k071j836J835K003j433
$$ -2160 312 1804 -520 -1856 209 1900 1 -1897 -193 2098 27 -1809 26 2029 596
2471E96k397J529J808j153k382J168K825j194k720R92K263n40k347L57K503k69
$$ 596 -1801 -272 1536 383 -1999 -831 1994 800 -1920 -928 1335 795 -1552 -1195 1308 1039
2487A039k451L72K394n0k398m7K555K87k816n84K605O56k267j124K700Q40k514
$$ 1039 -1412 -1040 1354 1304 -1094 -1141 1414 1701 -1115 -1699 906 1562 -705 -1829 871 1711 -803
2504h03j068K322J316k407j234K273J289k209j310J982J958k151j815J712K195
$$ -803 -1871 451 1767 -640 -1874 399 1688 -521 -1831 151 2109 -42 -1857 -145 2050
2519B050j897j990J999J774j467k064Q49K366j179k518J143K383m87k754R04K564
$$ 2050 153 -1837 162 1936 469 -1595 -746 1620 441 -2077 -934 1449 962 -1792 -888 1676
2535A676k88k937M09K687l57k414k03K552L32k498n17K787O96l015r86K485J039
$$ 1676 1388 -1549 -1140 1547 1190 -1224 -1427 1125 1457 -1041 -1558 1229 1925 -1090 -2076 409 1448
2552A448k377p61J995J232j802j446K171J334k310j361K006J457j574j408J303
$$ 1448 -929 -1690 305 1537 -265 -1711 460 1794 -516 -1877 129 1586 12 -1396 -93
2567i3J818j397j922J192K135j413k067J292J879q54k140N82K241l24k774O75
$$ -93 1725 328 -1594 -402 1733 320 -1747 -455 1424 570 -1570 -988 1253 929 -1845 -1170
2583a170K452k22k182J84K276j64k456J15L043m59k834N6K148O22k232q51K904
$$ -1170 1282 1060 -1122 -938 1338 1174 -1282 -1167 1876 1417 -1417 -1361 787 1409 -823 -1674 1230
2600A230L70k498n80J906J006k159j051K039J659j926j499J821J650j883j929
$$ 1230 1600 -898 -1478 428 1434 -725 -1776 263 1922 -4 -1503 318 1968 85 -1844
2615a844J748J743j353j657J318J664j136k087Q36K293j097k125Q23K258p33k047
$$ -1844 -96 1647 294 -1363 -45 1619 483 -1604 -768 1525 428 -1697 -874 1384 651 -1396
2631a396M36K738q17k591J14K883l25k114K22K147N6k320r6K445j69k239m01J956
$$ -1396 -960 1778 961 -1630 -1516 1367 1042 -1072 -850 1297 1353 -967 -1063 1382 1213 -1026 -1427 529
2649E29J140k565r49K655R53k399j143K370Q97k074j241J990J360j525j473J823
$$ 529 1669 -896 -1845 810 1763 -636 -1779 591 1488 -586 -1827 163 1523 -2 -1475 348
2665C48J417j470j921J367J830j196k089J421J994j198k120J052K108j006k344
$$ 348 1765 295 -1626 -259 1571 375 -1714 -293 1701 503 -1617 -565 1543 537 -1807
2680a807Q95K408n24j996L40K132j02k862M77K299r2k083k70K081N45k518k24
$$ -1807 -912 1496 972 -1024 -684 1448 1346 -1516 -1039 1260 1168 -915 -1185 896 1441 -1077 -1301
2697a301K146M89k054j042K372P50k275p15K012J253k132j292K174J131j696j661
$$ -1301 845 1334 -720 -1762 610 1360 -915 -1630 382 1635 -497 -1789 385 1516 -180 -1841
2713a841J899J808j757j456J289J860j552j834J177J867j204j806R97K190q43
$$ -1841 58 1866 109 -1347 -58 1802 250 -1584 -407 1460 256 -1550 -553 1637 794
2728G94k270Q80J802p82j930N02K437k78k261Q0K287O4k485K70K031O2k084n78
$$ 794 -1476 -596 1206 424 -1506 -1004 1433 1155 -1106 -1026 1261 1325 -1160 -890 1141 1203 -881 -1459
2746a459K397M47k273n55K162N79k045o33K069R99k080j271K090J380j730j615
$$ -1459 938 1385 -888 -1443 719 1298 -747 -1380 689 1688 -392 -1663 427 1807 77 -1538
2762a538J600J731j685j909J666J742j113k062J624J615j621j715Q54K180j098
$$ -1538 62 1793 108 -1801 -135 1607 494 -1568 56 1671 50 -1665 -811 1369 271
2777B71j815Q78K219n90k303N98K051l99k427J37K580L45k564K02K050Mk431j32
$$ 271 -1544 -666 1553 963 -1340 -742 1309 910 -1517 -1380 1200 1545 -1019 -817 1233 1237 -1194 -1326
2795a326K480K40k306p37K076R82k210o41K033Q29j988q16J682J281j979j239
$$ -1326 1154 1394 -912 -1649 427 1409 -801 -1442 591 1420 -568 -1384 298 1579 -400 -1639
2811a639J693J723j574j727J476J645j353j858J255J860j182j773J043K155j088
$$ -1639 54 1777 203 -1524 -48 1597 244 -1614 -359 1501 319 -1454 -411 1744 656
2826F56k115O62K020p91j830M17K667o91j953K75J953k29j939q2K142j43k155
$$ 656 -1459 -797 1223 432 -1398 -981 1686 995 -958 -683 1270 1041 -898 -980 1162 1019 -1136
2843a136J55J910L69k168l84J831R72k298p44J973J027k083j149K370J198k264
$$ -1136 -981 929 1298 -870 -1254 577 1549 -749 -1493 480 1507 -576 -1725 645 1843 -421
2859d21q38J665R94j490j416J337J663j310j921J423J936j381j729Q98J923r00
$$ -421 -1259 406 1400 -90 -1506 -169 1494 184 -1737 -314 1622 241 -1488 -590 1333 433
2875D33j881N94K617j015k351R99J778l03k345O40K125q6k205k72K484K57k312
$$ 433 -1448 -854 1763 748 -1603 -604 1174 871 -1474 -834 1291 1205 -1000 -1272 1212 1469 -843
2892h43n93K310J41j832o33K088R25k112q72J790J095j890r29J718J340j907j247
$$ -843 -1436 874 1015 -817 -1450 638 1563 -549 -1421 369 1464 -426 -1355 363 1703 -204 -1451
2909a451J578J530j714j348J470J462j474j691J286J987j408j505Q90J587l34
$$ -1451 127 1657 -57 -1405 65 1527 53 -1638 -352 1635 227 -1278 -388 1199 865
2924H65k416Q20K092j041j783P08K048k95k305P95J981l68j989j93K107K98k191
$$ 865 -1551 -731 1361 320 -1463 -755 1293 998 -1307 -512 1469 1101 -888 -1081 1026 1324 -867
2941h67k78J826N95j996j077K535N60j852q99K353P32k018j055J886Q93j643j269
$$ -867 -1145 681 1276 -720 -1797 738 1298 -554 -1453 900 1632 -386 -1441 445 1338 -305 -1574
2958a574J623J253j207j601J684J265j083k178J704J554j118k255J176J998K98
$$ -1574 49 1302 95 -1506 178 1443 360 -1818 -114 1440 322 -1933 -757 1241 1539
2973A539k992J377J969m94l303Q79K454q73j744P37K124q82j450l49K288l39k010
$$ 1539 -1453 -76 1893 1399 -1904 -1025 1429 556 -1188 -451 1673 791 -659 -1008 1280 941 -1069
2990a069l85K433k51r74r99L046j248j861L07J966j31q31j182J828N92j101r17
$$ -1069 -1454 979 728 -246 -1245 1801 553 -1308 -1001 965 834 3 -1179 649 1241 140 -777
3007g77J160J075j399j669K421J096j969p87K00K627j571j376J377J008o08k909
$$ -777 383 1458 59 -1610 811 1907 -62 -849 -649 1978 407 -969 408 1416 808 -2101
3023b101J942J512q74j944L31K899j30k253l45K048L50j883m41K270k10j630q79
$$ -2101 -159 1353 479 -1465 -1134 1765 1635 -618 -963 1085 1435 -448 -889 1381 1171 -459 -1338
3040a338J738R35k156n22K023J81j579q60K142Q88j785j401K257O90j541j202
$$ -1338 400 1335 -821 -1343 680 861 -718 -1578 564 1452 -333 -1734 523 1213 -328 -1530
3056a530J619J365j597j308J501J404j283j578J293J752j568j757J570J361j016
$$ -1530 89 1454 -143 -1451 50 1454 171 -1407 -114 1638 70 -1687 -117 1244 228
3071B28j366M99K011p70j736J68J972j46k095N79K036k57k330J21K090k05j864
$$ 228 -1138 -639 1372 602 -1134 -966 1006 860 -1235 -656 1380 1123 -1207 -1086 1004 799 -1065
3088a065l87K389L08j897n83K090M80k123p31K116O43j565j021J833R15j721j221
$$ -1065 -1452 937 1245 -652 -1235 855 1335 -788 -1519 597 1240 -325 -1346 487 1402 -319 -1540
3105a540J657J047j323j202J396J610j444j481J022J606j105j854J037J750j121
$$ -1540 117 1164 -159 -1361 35 1645 201 -1280 -258 1348 243 -1611 -574 1176 55
3120E5j519P86J961o23j966O10K110n56j979J94K116l72j978K14K258n7j936n42
$$ 55 -1464 -678 1283 660 -1306 -696 1414 858 -1121 -927 1189 817 -1161 -947 1311 1254 -682 -1224
3138a224K107M4j628p77K049L01j439o86K173N93j994j256K014J103j819r01J471
$$ -1224 883 927 -701 -1478 571 872 -567 -1253 920 1513 -481 -1737 277 1380 -439 -1340 131
3155A31J176j239j568J451J624j733j283J387J249r75j836J228J790r13j720N02
$$ 131 1307 68 -1500 -49 1575 -158 -1441 -54 1195 220 -1616 -388 1402 489 -1231 -729
3171g29J915m46k150P46J750l42j852L10K163n70j806j08K082l39j483n50K398
$$ -729 1186 740 -1410 -664 1086 744 -1108 -798 1365 795 -1011 -1119 963 624 -859 -1409 989
3188I89L88j965q73K097M05j811o18J881R51j628r11J495R68j706o81J425R57
$$ 989 1377 -588 -1461 636 1041 -770 -1388 493 1444 -184 -1095 400 1368 -338 -1019 406 1363
3205A363j307j441J305J646j387j152P00J655j105j402O28J579q54j709Q80J813
$$ 1363 56 -1385 -80 1566 179 -973 -273 1382 277 -1125 -497 1082 228 -1481 -601 1212
3221A212o61j482L36J675j92k054M96J919m90j782N8K115J66k224l8J557L55j764
$$ 1212 551 -931 -595 1080 888 -1166 -670 1249 759 -1023 -965 1150 1316 -908 -946 611 966 -798
3239g98o50J877P12j794l43J460O68j764o68J636Q35j587p39J454J408j723j217
$$ -798 -1448 429 1141 -653 -996 464 1132 -632 -1300 336 1171 -416 -1155 299 1707 -16 -1233
3256a233J389J284j397j245J175J066r07j479J134J371j011j390N79J735p67j608
$$ -1233 156 1440 43 -1202 -27 1039 132 -1347 -213 1158 147 -1243 -664 1071 304 -1304
3272a304Q77J568k38j957L58J953k47j951O6J646P6j711k00J738K61j809l42J544
$$ -1304 -427 1141 903 -1054 -696 1257 1010 -941 -875 771 847 -864 -1064 674 935 -874 -1216 328
3290C28M23j096n04J363P97j670o77J567Q58j410r91P32J407j290j069J500R97
$$ 328 751 -345 -849 514 1311 -359 -1036 531 1389 -21 -1012 -280 1127 -163 -1232 268 1265
3307A265r13j668J164J397j288j207J257J142p80j804J006J497l76j738M14J532
$$ 1265 352 -1316 -152 1245 -43 -1250 7 1149 369 -1435 -429 1068 692 -1046 -632 900
3323I00k42j778L93J881j71j867J6J672L04k120o8J556N68j757m41J669Q22j783
$$ 900 658 -1120 -727 1154 983 -884 -868 804 1108 -1012 -1080 476 1044 -713 -1154 515 1337 -446
3341d46j034K010L15j409m19J551O98j398q77J113J180j563p59J157J105j238
$$ -446 -1480 530 845 -564 -983 568 1266 -132 -1009 104 1284 -279 -1038 119 1224 -14
3357a4j474J480J255j022j550J012J562j028j374Q57J288m39j777Q99J350n19
$$ -14 -1488 -8 1247 225 -1325 -313 1249 221 -1153 -296 992 553 -1224 -325 1025 506
3373E06j282q2J833k60j745M59J429r7j281l89J784J65k035mJ434J61j897N01
$$ 506 -776 -858 975 715 -1030 -571 858 761 -520 -909 875 1040 -995 -999 435 596 -1301 -800
3391h00J295J75n99j063J430K60j318m53J236J378k180N9M42Q70l05j839J862
$$ -800 495 670 71 -992 438 698 -620 -1073 163 1541 -639 -580 -138 732 427 -1412 450
3408D50L12m15k145K258J258k002K64q06K020k38k226J528P15p51j189K74J110
$$ 450 762 347 -1798 460 1718 -284 -20 -826 1194 956 -1270 258 973 222 -967 -693 417
3425D17N0l20p49J804j38j366k48J042Q39j890O70J277m68j281r36J436Q99j607
$$ 417 467 147 -602 1202 1064 -302 -550 492 1331 -559 111 1388 920 -361 -1297 139 1038 -569
3443e69l42K076k70j028j357J597J302j072j130J160L34o32p08J371j74m71r02
$$ -569 -911 1165 895 -133 -1490 107 1409 337 -793 367 701 69 -639 732 558 87 -815
3460h15R79J423j547j185J035J041p79j415Q48J604o70j577L90J748L3j717j52
$$ -815 164 1587 40 -1145 -110 931 152 -1263 -415 1189 519 -1058 -668 1080 1113 -604 -756
3477g56J371L34j979J96J603M37k119L28J480M88j811n00J098J171j003j200J163
$$ -756 615 949 -1030 -834 769 1206 -913 -585 895 1383 -428 -928 170 1341 338 -862 301
3494C01R49j598r08J850L86j260j348J332J329n28j792R00J946q45k750K322M12
$$ 301 1250 -348 -1256 594 980 -280 -1628 -296 1033 505 -1287 -387 1559 714 -2036 286 698
3511F98n60p31J4Q36P23j908K35J305j48j386L17J657o46o56l94J162N00j848
$$ 698 138 -593 -579 257 980 -928 -693 612 464 -922 -605 1052 406 -250 -644 518 1018 -830
3529h30j04K162o15j539n6J447L79j265k22J104M53j358n66J220K90q41o98J275
$$ -830 -934 1228 613 -926 -982 465 844 -421 -643 461 914 -444 -1010 210 500 -341 -1039 236
3547B36Q61j040m64N92Q28j137j018J159J260j115j226R58R46q83r26Q44J194
$$ 236 1097 57 -407 185 1013 -124 -1142 17 1277 162 -1064 -106 840 -43 -969 -125 1069
3564A069q22r85M82J124m34j523O38J336k50j198K08J141K31j653j07J461j86
$$ 1069 247 -738 -256 868 434 -1089 -451 885 635 -563 -355 786 1017 -636 -743 718 532
3581E32j642L05J137L42r74n26J434M55j368n95J202Q00j344o62J169Q35j180
$$ 532 -1110 -805 332 674 -300 -826 608 1063 -305 -900 302 1102 -242 -904 265 1100 -80
3598h0p82J018Q41j319q91J078J230j299p24Q70J268j024j325O09J412m93j399
$$ -80 -862 156 997 -322 -1213 -135 1095 -204 -928 -58 1210 186 -1139 -530 882 389 -1010
3615a010M57J485m71j527O76J088m03r71K70R86j20j338J80J410m22r74o4J411
$$ -1010 -553 932 461 -1066 -390 698 295 -676 -406 580 460 -878 -698 712 290 -684 -748 663
3633F63k91o64p88J285Q34j482l97J232M42q93p27Q56J064j319o35J057R51j443
$$ 663 372 -292 -1080 205 1039 -443 -840 392 834 -59 -786 70 1134 -185 -820 237 1188 -255
3651b55m89R33O52q23j192J150R47p27j069P63J119o53j103K99J213n14j005L21
$$ -255 -744 189 841 18 -1174 -24 923 196 -873 -110 1009 356 -747 -448 765 251 -754 -433
3669d33J094j04j064J03P80m2j015L13Q75P3j051k02J224L40j408m45J511J78
$$ -433 661 557 -507 -404 376 334 -681 -368 507 580 -471 -673 551 891 -517 -962 549 727
3687G27j209l48J075L46p13o35J123Q06j380m27P61L97m79j123J067P11p48q48
$$ 727 -482 -830 245 591 -122 -757 366 1172 -208 -635 126 523 44 -1079 -12 699 -49 -897
3705h97R96O77q16p15M58J232o37j060N70Q45k92r15M5J061n8q40j8J267k96j277
$$ -897 99 776 -40 -755 -297 935 298 -762 -192 653 361 -554 -509 552 494 -346 -364 903 607 -670
3725f70L27R08o4j045R8Q26M4q32l87J435J14j372j75J055M05r60o00J089P92
$$ -670 -343 565 501 -544 -446 380 424 -408 -795 640 754 -618 -793 262 667 -293 -893 196 988
3744I88j185l84P54O65p24r34O95P90q03r02R01J185r16q65O82O94n45r66Q02
$$ 988 -197 -581 173 838 114 -820 -125 665 -138 -1040 -139 1046 130 -735 -53 641 96 -870 -68
3763f8P15m00p83K97Q59k8j339L54J276l08j245L10Q87J05j373K19J064J82j340
$$ -68 647 247 -536 -239 620 592 -747 -393 883 575 -670 -360 527 632 -741 -522 542 724 -616
3782f16j59J067N13j336k45J385L44j213k92J047M14j283l08Q00O34r86n22M83
$$ -616 -775 292 805 -531 -776 609 953 -260 -552 495 909 -374 -682 118 752 -234 -756 -273
3800b73J157q57q69Q36O49m61r54P46Q71l88r23K09Q40l47q07J6R53l8j230M49
$$ -273 884 27 -842 -6 643 182 -772 -26 845 457 -466 -257 583 236 -571 -555 398 360 -870 -421
3820d21J302j8j595L00Q23n5r02J7J203r0j070j06J061l5r05k05J151N97j385
$$ -421 881 863 -732 -432 391 336 -566 -549 654 564 -506 -612 449 414 -491 -696 455 1052 -333
3839c33o21J321M74j055o86J205N54q98p11Q63M20o13o40R20O83r99m78K84J148
$$ -333 -954 367 841 -214 -900 305 859 -39 -750 113 533 -80 -720 200 883 -116 -594 -310 838
3858H38q23q10L45J268m60p21l92J389o8j422N17J327o82j144L22L33J249j507
$$ 838 15 -795 -450 818 358 -363 -755 634 566 -856 -339 988 306 -838 -516 -183 1066 -441
3876d41j224K054K92p46j8L00j87r49R64M25k4q45L3M36N12j127n86J693L83j224
$$ -441 -1665 389 681 -65 -83 217 30 -919 45 470 446 -399 -366 70 582 -545 -1131 562 945 -279
3896b79k8J72P41m86r97N30J115q32o18N58J254j640n80J449O78q90j227O95J431
$$ -279 -307 -135 606 120 -877 -347 768 -64 -682 -124 1130 -510 -1090 359 1037 147 -1080 -385 1046
3915A046n83r89Q04P71j061m96l1N91L9n88o5Q42L8q39P1J127k63o62o24J266
$$ 1046 463 -526 278 1049 -12 -508 -539 52 91 -497 -562 280 318 -521 -450 677 414 -248 -872 394
3935C94K28o18o79J046L16j097n23J136M50q01m08O94O86j023m72P15O95o96q62
$$ 394 622 4 -675 371 687 -410 -933 203 653 -148 -556 138 824 -199 -671 44 739 43 -819
3954h19O17Q41m02j120O64Q66n43o56N89Q13o86p10L34J259o01j058J67P38L70
$$ -819 -202 639 237 -883 -219 647 104 -552 37 850 164 -546 -212 1047 446 -612 -445 293 663
3973F63j299O2J013J63j219N3Q20K80r42l98J428J85j275m11J382J34r56l68Q26
$$ 663 -636 -574 439 602 -617 -564 256 536 -406 -804 624 809 -466 -877 505 639 -317 -685 141
3992A41P51j225n64Q93N92q16n05N11Q72r25n52P40Q90l96j237O72R89l37j113
$$ 141 892 -333 -897 -4 588 -228 -733 -222 650 -275 -827 -87 803 407 -830 -158 831 494 -619
4011f19M15O83k70j101N89J028m74q81J78Q38J56j133K04R63k05p10k19R56j98
$$ -619 -204 479 209 -892 -303 725 251 -630 -452 386 542 -591 -387 576 371 -339 -558 398 200
4030B00n05m86J380J03r68l62R66M16j184j07O23P12p27o96Q02Q43j063o79O93
$$ 200 -305 -791 589 692 -276 -638 328 744 -440 -547 76 788 61 -635 167 1010 -53 -732 -39
4049c9O50o82q70Q02R02q33p47O54J085q76r72N38R69k69j046K54J032l67o62
$$ -39 611 -71 -941 -139 763 -70 -817 -163 922 46 -926 -388 581 312 -734 -480 552 185 -477
4068d77J50P19J25j100j9J068q2r72j32J308j7r69l9P73J93q66j75Q80L42q70
$$ -477 -327 392 517 -583 -602 466 384 -588 -720 588 571 -398 -437 336 529 -337 -512 368 710 -160
4088a60l89R04M13p65n79P81O39j066p15P75P80o38m87N36O40m67j153O01J138
$$ -160 -549 355 768 3 -576 205 844 -222 -937 -162 618 -20 -507 29 669 202 -951 -350 788
4107G88l70j009M65P15k68o61M6J174n95j126O62P52k48q51K19Q47k24p23J1R03
$$ 788 418 -591 -126 589 321 -340 -294 880 285 -841 -179 573 325 -526 -307 540 316 -407 -396 507
4127E07K3p37m97J240K07r87l43Q00M10j032l60R73L58r29j88O96N62j062l54
$$ 507 530 -207 -704 536 743 -244 -587 213 623 -409 -769 204 562 -367 -555 141 703 -359 -713
4146g13P42N94o61n67K59J118p03o12O64O35o19r56O89Q46m73p07p6J404n47j042
$$ -713 29 623 -38 -605 -346 772 69 -543 121 756 137 -819 -130 716 243 -464 -540 864 317 -725
4166g25L46J129k66j386N17P05K20j327K95R79j63o84k94R63K48q73j21Q58L15
$$ -725 -379 750 484 -902 -385 320 540 -787 -492 487 324 -360 -654 309 557 -316 -437 421 736
4185G36q23p59J076L38p80n60Q92N73q00m83O39N57p28p12Q31M96p53m28N98R04
$$ 736 -87 -846 230 568 -212 -772 120 693 -107 -590 49 606 -122 -834 -3 493 -260 -688 -90 814
4205H14q89o08O12P77m21j024N47P08q0j026L94O84p5j013J50R10o9j150R7J105
$$ 814 -75 -683 -71 706 285 -739 -192 516 436 -590 -196 488 413 -600 -450 460 391 -759 -662 443
4225D43M9j008k6J147qr41l11J056J07p25n58J094N16j156m56J106L80j139l19
$$ 443 492 -516 -542 605 597 -344 -655 401 508 -217 -775 319 835 -321 -777 329 709 -430 -749
4244g49Q50M88r46j23L05J002r68m07N81O12o01n86J22J051l37q98M05P08j09
$$ -749 101 589 -357 -480 -175 827 -141 -548 33 645 44 -542 -420 631 294 -604 -199 509 400
4263D00j288M66R51j94j000J15J113k11r34J35J356m79r39O8J060K03j176r6R73
$$ 400 -888 -422 529 335 -665 -550 563 352 -582 -447 909 430 -509 -441 619 822 -354 -450 523
4282E23J58r69j40R50K48j080m81R56K58n74n77Q26M61q70n90O74J069q37n05
$$ 523 681 -288 -428 522 770 -310 -791 165 423 -151 -728 98 559 -311 -901 -227 842 5 -500
4301e00N57N85o33m75K50P40l05j075M57J230o52o76j3J012q5j334M23J036j49
$$ -500 57 642 9 -466 -216 524 219 -856 -399 831 179 -497 -510 502 417 -917 -494 542 393
4320C93j154Q0R55L64j391J15J045L81r64m14P85L18q35l24J043L18p64o81R05
$$ 393 -761 -681 274 638 -753 -638 407 788 -176 -590 195 513 -322 -646 397 715 -49 -730 175
4339A75J91p11o58J037K53o18n61P67O67l88r33N78J153q03q46O05P33o45q10
$$ 175 366 -345 -1003 34 287 -331 -892 -125 542 154 -779 -201 952 149 -697 -92 641 -4 -814
4358h14N19P37k57p19J33Q81k64o92J34Q45m4r54R4O53L33j330L2J357p9q57k34
$$ -814 -295 442 185 -534 -401 480 216 -476 -342 503 459 -495 -401 252 585 -745 -713 644 565 -292 -526
4379e26J100r3q28j38P36K57p24m93O97Q45r95n38O35O25q65n24J107M33o26r71
$$ -526 574 481 -347 -485 251 508 -216 -709 -12 833 -162 -700 -65 560 -305 -829 278 711 85 -886
4399h86Q47O17m53n33M43O72l81r23M73O54m43n89N6J104o3r25j44R92j56j091
$$ -886 -39 578 125 -408 35 707 326 -597 -124 530 87 -502 -446 658 595 -330 -474 518 362 -729
4419g29K84P77K03n96k51R17j40r09q4R72J92j085Q0O18M36o71p47P92N47j066
$$ -729 -445 332 535 -61 -312 605 465 -444 -528 444 636 -449 -369 249 685 14 -733 59 606 -460
4439d60m05J072M60n11r41R70N37p84p16Q29O33n16r73Q87N82l27q68M65O68k35
$$ -460 -865 207 667 156 -785 185 722 -62 -778 51 684 168 -805 82 664 337 -531 -66 602 367
4459C67q28K36O33j70q66K71J064k31r32O6P68j10r26K42R08K39j260j12R49M05
$$ 367 -461 -225 408 238 -628 -357 707 476 -456 -390 378 268 -658 -416 492 731 -529 -641 308 713
4479G13q87n67J058N12r85o57J096O02q57n72N44P06j088l46N62J051n37r37N96
$$ 713 -174 -741 317 829 -156 -813 283 885 28 -544 0 706 -382 -728 -166 885 348 -589 7
4498GP45n61p29L31Q71l29j155Q22O00l66q69L63R81j16j155K24O89R6p25l53
$$ 7 752 191 -538 -207 664 335 -820 2 602 236 -633 -270 711 595 -560 -336 353 449 -276 -629
4518f29R97L43j225L3R64p1q35j65R77J94q81l64R57M56r88m50Q15L70m83r26
$$ -629 368 711 -514 -481 483 412 -423 -588 389 583 -298 -662 295 751 -237 -687 128 498 15 -911
4538i11J010M62l98q12O88N14m12o30M95P24m51r46Q06P52o67p42J82Q77n07m70
$$ -911 99 561 163 -649 39 553 141 -489 6 730 279 -667 139 891 224 -518 -336 541 34 -436
4558d36Q9R12k49n38k42Q89j49q58j16J216J15j125j52J265J26j209k20J181K09
$$ -436 -347 565 316 -222 -464 425 276 -582 -698 518 633 -492 -644 621 747 -462 -682 499 708
4577G08j009r8Q51r5l32n45P51L21n49p26N12O97o57m53P40N28n27n81L26Q83
$$ 708 -301 -399 452 357 25 -520 231 552 3 -723 -211 486 -171 -624 116 644 117 -464 -138 745
4597G45q05n37O72P26o98p04M08Q05k17j223K24J153m56o59K18J243m88r61L33
$$ 745 -60 -597 75 801 103 -601 -193 612 395 -828 -604 549 93 -566 -348 895 407 -554 -221
4616b21P24l7r50k67R62M44q11n83J128J75p58m04N29Q33j048l91M13J026j062
$$ -221 503 466 -484 -751 211 655 -156 -739 389 564 -194 -598 -69 764 -284 -675 -262 764 -298
4635b98m79J191L84o55q60O02P27m55p29N89O11l96r99P77M52l50p37N35O08j72
$$ -298 -777 414 798 143 -717 -115 612 157 -572 17 628 232 -767 10 462 112 -625 -90 518 346
4655C46p82K84Q39l36o80J07Q04k62q15J78N17L03r85K22O24l4m43n96Q41M51
$$ 346 -436 -152 687 351 -329 -222 582 320 -495 -317 200 503 -482 -260 364 330 -113 -709 132 583
4675E83p64m78O21N14n59m54P39M6m37n06P26N49p92o37J068J70l80l56O8R34
$$ 583 -181 -659 -38 476 -83 -537 202 248 -189 -695 31 580 -212 -849 219 389 9 -347 -279 655
4695F55n60o59M39P90n61m43L02O09m13p92M60P10k99n69P9J017k97r12K10P03
$$ 655 95 -564 -125 665 104 -339 -37 572 159 -633 -173 537 238 -331 -252 765 468 -444 -234 469
4715D69M9p36k78O41L39n67k23O84J93p55l25P58K74o47m61Q61M63q97m34N47
$$ 469 518 -218 -496 145 484 -83 -306 378 571 -184 -509 249 523 -124 -585 276 739 -158 -592 -45
4735d5N64p35j51K52N16l75n85P74L34n07r11P38N55n46m72P22L39r9q46L64L89
$$ -45 519 -216 -367 -115 401 26 -559 215 549 42 -869 -131 424 -122 -594 128 467 368 -478 -114 275
4756B75j23m89n4Q87k04q46J39O82K35q56%O60p1o25k47Q78O0o42j30Q54L24p86
$$ 275 152 -337 -391 496 292 -554 -415 267 502 -354 -354 306 235 -390 -637 241 301 -341 -471 383 707 -79
$$ [...]
8191G9
##END NTUPLES=NMR FID
##END=
