##TITLE=1H_DE-PH_Asp
 200.13MHz,D2O,
 8 sc
 
 28.8.2025
##JCAMPDX= 6.0         $$ Bruker NMR JCAMP-DX V2.0
##DATA TYPE= NMR FID
##DATA CLASS= NTUPLES
##ORIGIN= UXNMR, Bruker Analytische Messtechnik GmbH
##OWNER= pz
$$ XWIN-NMR		Version 3.5
$$ Thu Aug 28 13:37:56 2025 Russian Standard Time (UT+4h)  she@DPX200
##.OBSERVE FREQUENCY= 200.1313
##.OBSERVE NUCLEUS= ^1H
##.DELAY= (6, 6)
##.ACQUISITION MODE= SIMULTANEOUS
##.ACQUISITION SCHEME= undefined
##.AVERAGES= 8
##.DIGITISER RES= 18
##SPECTROMETER/DATA SYSTEM= spect
##.PULSE SEQUENCE= zg30
##.SOLVENT NAME= D2O
##.SHIFT REFERENCE= (INTERNAL, D2O, 0, 14.3821)
##AUDIT TRAIL= $$ (NUMBER, WHEN, WHO, WHERE, WHAT)
$$ ##TITLE= Audit trail, XWIN-NMR		Version 3.5
$$ ##JCAMPDX= 5.01
$$ ##ORIGIN= Bruker BioSpin GmbH
$$ ##OWNER= she
$$ F:/spectra/data/she/nmr/H-C/1/audita.txt
$$ ##AUDIT TRAIL=  $$ (NUMBER, WHEN, WHO, WHERE, WHAT)
(   1,<2025-08-28 13:36:31.85 +0400>,<she>,<DPX200>,
      <created by zg, POWCHK disabled, PULCHK disabled
       configuration hash MD5:
       00 E9 B6 7A A2 85 ED C7 34 08 36 98 17 FE 4E 26
       data hash MD5: 16K
       B1 74 AB CE 5F FD 19 2A 1B 48 32 DA 92 A6 15 1A>)
$$ ##END=
$$ 
$$ hash MD5
$$ D2 0D C1 42 63 4D FB 06 0B BB 75 BF 38 80 4F DD
##$RELAX= 
##$RELAX= 
##$RELAX= 
##$RELAX= 
##$RELAX= 
##$RELAX= 
$$ Bruker specific parameters
$$ --------------------------
##$DU= <F:/spectra>
##$EXPNO= 1
##$NAME= <H-C>
##$PROCNO= 1
##$TYPE= <nmr>
##$USER= <she>
##$AMP= (0..31)
100 100 100 100 100 100 100 100 100 100 100 100 100 100 100 100 100 100 
100 100 100 100 100 100 100 100 100 100 100 100 100 100 
##$AQSEQ= 0
##$AQ_mod= 1
##$AUNM= <au_zg>
##$AUTOPOS= <>
##$BF1= 200.13
##$BF2= 200.13
##$BF3= 200.13
##$BF4= 200.13
##$BF5= 200.13
##$BF6= 200.13
##$BF7= 200.13
##$BF8= 200.13
##$BYTORDA= 1
##$CFDGTYP= 0
##$CFRGTYP= 5
##$CHEMSTR= <none>
##$CNST= (0..31)
1 1 145 1 1 1 1 1 1 1 1 1 1 1 1 1 1 1 1 1 1 1 1 1 1 1 1 1 1 1 1 1 
##$CPDPRG= <>
##$CPDPRG1= <>
##$CPDPRG2= <>
##$CPDPRG3= <>
##$CPDPRG4= <mlev>
##$CPDPRG5= <mlev>
##$CPDPRG6= <mlev>
##$CPDPRG7= <mlev>
##$CPDPRG8= <mlev>
##$CPDPRGB= <>
##$CPDPRGT= <>
##$D= (0..31)
0 0.7 0 0 0 0 0 0 0 0 0 0.03 0 0 0 0 0 0 0 0 0 0 0 0 0 0 0 0 0 0 0 0 
##$DATE= 1756373791
##$DBL= (0..7)
120 120 120 120 120 120 120 120 
##$DBP= (0..7)
150 150 150 150 150 150 150 150 
##$DBP07= 0
##$DBPNAM0= <>
##$DBPNAM1= <>
##$DBPNAM2= <>
##$DBPNAM3= <>
##$DBPNAM4= <>
##$DBPNAM5= <>
##$DBPNAM6= <>
##$DBPNAM7= <>
##$DBPOAL= (0..7)
0.5 0.5 0.5 0.5 0.5 0.5 0.5 0.5 
##$DBPOFFS= (0..7)
0 0 0 0 0 0 0 0 
##$DE= 6
##$DECBNUC= <off>
##$DECIM= 32
##$DECNUC= <off>
##$DECSTAT= 4
##$DIGMOD= 1
##$DIGTYP= 9
##$DL= (0..7)
0 120 120 120 120 120 120 120 
##$DP= (0..7)
150 150 150 150 150 150 150 150 
##$DP07= 0
##$DPNAME0= <>
##$DPNAME1= <>
##$DPNAME2= <>
##$DPNAME3= <>
##$DPNAME4= <>
##$DPNAME5= <>
##$DPNAME6= <>
##$DPNAME7= <>
##$DPOAL= (0..7)
0.5 0.5 0.5 0.5 0.5 0.5 0.5 0.5 
##$DPOFFS= (0..7)
0 0 0 0 0 0 0 0 
##$DQDMODE= 0
##$DR= 18
##$DS= 0
##$DSLIST= <SSSSSSSSSSSSSSS>
##$DSPFIRM= 0
$$ [...]
##$SUBNAM0= <"">
##$SUBNAM1= <"">
##$SUBNAM2= <"">
##$SUBNAM3= <"">
##$SUBNAM4= <"">
##$SUBNAM5= <"">
##$SUBNAM6= <"">
##$SUBNAM7= <"">
##$SUBNAM8= <"">
##$SUBNAM9= <"">
##$SW= 18.0517328524113
##$SWIBOX= (0..15)
0 0 2 0 0 0 0 0 0 0 0 0 0 0 0 0 
##$SW_h= 3612.71676300578
##$TD= 16384
##$TD0= 1
##$TE= 0
##$TE2= 300
##$TE3= 300
##$TEG= 300
##$TL= (0..7)
0 120 120 120 120 120 120 120 
##$TP= (0..7)
150 150 150 150 150 150 150 150 
##$TP07= 0
##$TPNAME0= <>
##$TPNAME1= <>
##$TPNAME2= <>
##$TPNAME3= <>
##$TPNAME4= <>
##$TPNAME5= <>
##$TPNAME6= <>
##$TPNAME7= <>
##$TPOAL= (0..7)
0.5 0.5 0.5 0.5 0.5 0.5 0.5 0.5 
##$TPOFFS= (0..7)
0 0 0 0 0 0 0 0 
##$TUNHIN= 0
##$TUNHOUT= 0
##$TUNXOUT= 0
##$USERA1= <user>
##$USERA2= <user>
##$USERA3= <user>
##$USERA4= <user>
##$USERA5= <user>
##$V9= 5
##$VALIST= <valist>
##$VCLIST= <CCCCCCCCCCCCCCC>
##$VD= 0
##$VDLIST= <DDDDDDDDDDDDDDD>
##$VPLIST= <PPPPPPPPPPPPPPP>
##$VTLIST= <TTTTTTTTTTTTTTT>
##$WBST= 1024
##$WBSW= 4
##$XGAIN= (0..3)
0 0 0 0 
##$XL= 0
##$YL= 0
##$YMAX_a= 104873
##$YMIN_a= -155207
##$ZGOPTNS= <>
##$ZL1= 120
##$ZL2= 120
##$ZL3= 120
##$ZL4= 120
##$ABSF1= 10
##$ABSF2= 0
##$ABSG= 5
##$ABSL= 3
##$ALPHA= 0
##$AQORDER= 0
##$ASSFAC= 0
##$ASSFACI= 0
##$ASSFACX= 0
##$ASSWID= 0
##$AUNMP= <proc_1d>
##$AZFE= 0.1
##$AZFW= 0.1
##$BCFW= 1
##$BC_mod= 2
##$BYTORDP= 1
##$COROFFS= 0
##$CY= -3
##$DATMOD= 1
##$DC= 2
##$DFILT= <>
##$DTYPP= 0
##$F1P= 0
##$F2P= 0
##$FCOR= 0.5
##$FTSIZE= 0
##$FT_mod= 4
##$GAMMA= 1
##$GB= 0.15
##$INTBC= 1
##$INTSCL= 1
##$ISEN= 128
##$LB= 0.25
##$LEV0= 0
##$LPBIN= 0
##$MAXI= 10000
##$MC2= 0
##$MEAN= 0
##$ME_mod= 0
##$MI= 1.114404
##$NCOEF= 0
##$NC_proc= 0
##$NLEV= 6
##$NOISF1= 3.799351
##$NOISF2= 2.8
##$NSP= 1
##$NTH_PI= 0
##$NZP= 0
##$OFFSET= 14.38212
##$PC= 1
##$PHC0= -1558.425
##$PHC1= 4.592278
##$PH_mod= 1
##$PKNL= yes
##$PPARMOD= 0
##$PSCAL= 0
##$PSIGN= 0
##$REVERSE= no
##$SF= 200.129724274929
##$SI= 16384
##$SIGF1= 3
##$SIGF2= 2
##$SINO= 400
##$SIOLD= 16384
##$SREGLST= <1H.CDCl3>
##$SSB= 0
##$STSI= 0
##$STSR= 0
##$SW_p= 3205.1282051282
##$SYMM= 0
##$S_DEV= 0
##$TDeff= 0
##$TDoff= 0
##$TI= <>
##$TILT= no
##$TM1= 0
##$TM2= 0
##$TOPLEV= 0
##$USERP1= <user>
##$USERP2= <user>
##$USERP3= <user>
##$USERP4= <user>
##$USERP5= <user>
##$WDW= 1
##$XDIM= 8192
##$YMAX_p= 0
##$YMIN_p= 0
$$ End of Bruker specific parameters
$$ ---------------------------------
##NTUPLES= NMR FID
##VAR_NAME=  TIME,          FID/REAL,        FID/IMAG
##SYMBOL=    X,             R,               I
##VAR_TYPE=  INDEPENDENT,   DEPENDENT,       DEPENDENT
##VAR_FORM=  AFFN,          ASDF,            ASDF
##VAR_DIM=   8192,          8192,            8192
##UNITS=     SECONDS,       ARBITRARY UNITS, ARBITRARY UNITS
##FACTOR=    0.0002768,     1,               1
##FIRST=     0,             0,               0
##LAST=      2.2672688,     0,               0
##MIN=       0,             -155207,         0
##MAX=       2.2672688,     104873,          0
$$ Real data points
##PAGE= N=1
##DATA TABLE= (X++(R..R)), XYDATA
$$ [...]
1849E87L9j69o03k48j34j23L07K34N73J49J08j4n13n21m66J99P8J99Q67N9j06
$$ 587 626 457 -146 -394 -528 -651 -344 -110 463 612 720 706 193 -328 -794 -595 -517 -318 549 608 502
1870E02J5n75m40j63j41M88Q7O17k5L08k27k34l68j78J9j60M57J48K85K54j64
$$ 502 517 -58 -498 -661 -802 -314 -227 390 365 673 446 212 -156 -334 -315 -475 -18 130 415 669 505
1891E05j60k41n77j4J2J33O86L0L42l97p7j07m07j13l15M00L10L76k6P0k61k0
$$ 505 345 104 -473 -487 -475 -342 344 374 716 319 242 135 -272 -385 -700 -300 10 386 360 430 169 149
1913A49m00l83k25O19K80L45O8k5K32n84j38m08J67p6M45L64L09j76k35j56o12
$$ 149 -251 -634 -859 -240 40 385 453 428 660 76 -62 -470 -303 -379 66 430 739 563 328 172 -440
1934d40o3K59j09L82K77M31j10l53r0j58l81k65Q0O31N4L01L24n23R4l75k00k85
$$ -440 -503 -244 -353 29 306 737 627 274 184 26 -355 -620 -540 91 145 446 770 247 341 -34 -234 -519
1956e19j2M67K47N39k92K27m63l79m32N5lJ88N54K35K17o1O5p81Jm46K29M02K43
$$ -519 -531 -64 183 722 430 657 194 -185 -617 -562 -565 -377 177 412 629 568 633 -148 -147 -593 -364 38 281
1979B81P9J53K61n34o1m08l6j59J04K32K89K84J5j80k44j25k40j68p1N63Q7N64
$$ 281 360 513 774 240 179 -229 -265 -424 -320 -88 201 485 500 320 76 -49 -289 -457 -528 35 122 686
2001F86k59J99l76o04J61k82j11M67K92J01L41l19L2l27j90l2j55J84Q3K09M88
$$ 686 427 626 250 -354 -193 -475 -586 -119 173 274 615 296 328 1 -189 -221 -376 -192 -109 100 588
2022E88o4j29l39k21k95l04N17L16M80j39K13l54n18l55K10k9J73N72o0L7M55
$$ 588 524 395 56 -165 -460 -764 -247 69 549 410 623 269 -249 -604 -394 -423 -250 322 262 299 754
2043G54k79m19k39m84K16J68M34L07j53L18m9o95p9K3m97N61j32O51r7L2J63m62
$$ 754 475 56 -183 -667 -451 -283 151 458 305 623 574 -121 -200 -177 -674 -113 -245 406 309 341 504 42
2065D2k08l22Q7j8K3O70n5J90jk66o09o8r8L99K45J63J25L82j16l70m98j59K37
$$ 42 -166 -488 -401 -419 -396 274 219 409 408 142 -467 -535 -633 -234 11 174 299 681 565 195 -303 -462 -225
2088b25q9M2J41M52J01R9l71k89P9k26k87K93N16J76j92J58j90r2j46l72r1M34
$$ -225 -314 -272 -131 321 422 521 150 -139 -60 -286 -573 -280 236 412 220 378 188 96 -50 -422 -513 -79
2110g9N9L42J6R9j23l31k8k35mJ76k0L77K20k10j96J45n90j8j11M49j90L54J2
$$ -79 -20 322 338 437 314 -17 -45 -280 -284 -108 -128 249 469 259 63 208 -382 -400 -511 -62 -252 102 114
2133A14J96N7l59k59k58J0K49M5K30K43L27M1l61j49k88%m9K01M0K70j4J36m23
$$ 114 310 367 8 -251 -509 -499 -250 -205 25 268 595 636 275 126 -162 -162 -211 -10 30 300 286 422 -1
2156aK6k77n5M1j15N82j91L35q2Pl50m71J64kJ80J92J58L70K5l01r2j98j11L7
$$ -1 25 -252 -307 -266 -381 201 10 345 263 270 -80 -551 -387 -389 -209 -17 141 511 536 235 143 -55 -166 -129
2180a29r2j19M49M57k62J54n55k68J86j33p7M58j09J5N98l90q7l16L5k53K83K97
$$ -129 -221 -340 109 566 304 458 -97 -365 -179 -312 -389 69 -40 -25 573 183 96 -220 -185 -438 -155 142
2202A42j07L84r9p3r4k77k03J39m41M52J41M73j90O7ok89k15l18K41J79K47j25
$$ 142 35 419 320 247 153 -124 -327 -188 -629 -177 -36 437 247 314 308 19 -196 -514 -273 -94 153 28
2224B8lL63l49l5k51jl16L90R7K05K52p7j51k42R7l09J29l24L17L70q0K19Pl70
$$ 28 25 388 39 4 -247 -248 -564 -174 -77 128 380 303 152 -90 7 -302 -173 -497 -180 190 110 329 336 -34
2248c4O0k02o9Q5M7L18k29K40k02l19L22j90n56J77N35J90J7J02o1j14J79p12
$$ -34 26 -176 -245 -160 -113 205 -24 216 14 -305 17 -173 -729 -552 -17 173 190 292 231 117 296 -416
2270d16JK28k23M00K05K31n6k08k53M8l25R3O0J73K10K43j07j00l39jk91J40K80
$$ -416 -415 -187 -410 -10 195 426 370 162 -91 -43 -368 -275 -215 -42 168 411 304 204 -135 -136 -427 -287 -7
2293gP5n6M75m04K19k78k87M4j1K86k24M40k27p8M34n8l76J00j69J5K50J08k45
$$ -7 68 12 487 83 302 24 -263 -219 -230 56 -168 272 45 -33 401 343 -33 67 -102 -87 163 271 26
2316B6J58J86l92j99K83k99J39J15o3L12N8K30k26l08k36K5Q3ol5K23J87j68j96
$$ 26 184 370 -22 -221 62 -237 -98 17 -46 266 324 554 328 20 -216 -191 -108 -114 -149 74 261 93 -103
2339a03l5K15m5r2n31O67K05r0L5Jl18O4j33j0n6M1K40R5O6q6j45L4j01k74K62
$$ -103 -138 77 32 -60 -591 76 281 191 226 227 -91 -27 -160 -170 -226 -185 55 150 216 130 -15 19 -82 -356 -94
2364i4J38K09l36L43n9J04l36K2k51j55J27K82R0L64j95j04k60Q4k82O8K01J31
$$ -94 44 253 -83 260 201 305 -31 -9 -260 -415 -288 -6 84 448 253 149 -111 -27 -309 -241 -40 91
2386I1J06k96N08l51j71r1j59N8L64R6q1m5K11k69p7o0%RN2L7K37J07J6mm80j6
$$ 91 197 -99 409 58 -113 -204 -363 -305 59 155 74 29 240 -29 -106 -166 -166 -157 -105 -68 169 276 292 288 -192 -208
2412b08n8n4J53O6R4K40k4N6j93q2k10k48J33K57K67rO3k68J30j0l41J40j78K86
$$ -208 -266 -320 -167 -101 -7 233 209 265 72 -10 -220 -468 -335 -78 189 180 243 -25 105 95 -246 -106 -284 2
2436BP4l83M14O8j43m7J8r5N1J42k96M59j54J29j76N0J2m08L05k80J51j53J79
$$ 2 76 -307 107 175 32 -15 3 -92 -41 101 -195 264 110 239 63 113 125 -283 22 -258 -107 -260 -81
2459h1L71l46K74j17k38M4l7Jj5K72K36j96j14n1m16K63Q6RK19k0J00M7j67m1
$$ -81 290 -56 218 101 -137 -93 -130 -129 -144 128 364 168 54 3 -413 -150 -64 -55 164 144 244 291 124 83
2483H3j74j04K77k25n7L15J95o9j80j05K88l77J83j44J27K59J6l46J54q4o8j80
$$ 83 -91 -195 82 -143 -200 115 310 241 61 -44 244 -133 50 -94 33 292 308 -38 116 32 -36 -216
2505b16L6j15J10L30q2J36P7l82MRj27M23l95J11Q7K2l1J05o8J85l36o2j66K37
$$ -216 -180 -295 -185 145 63 199 276 -106 -102 -93 -220 203 -192 -81 6 28 -3 102 34 219 -117 -179 -345 -108
2529a08J11J09q8j50K02n6r0k1J2LL46j67j01J33k75K20l84K12O3oJ14r8J79j76
$$ -108 3 112 24 -126 76 20 -70 -91 -79 -76 270 103 2 135 -140 80 -304 -92 -29 -35 79 -19 160 -16
2553a6J3m7J61k06J1J82l0l2J93Q8k21r9k12j54J47J61j01J01L71n0k93k3J45
$$ -16 -3 -50 111 -95 -84 98 68 36 229 317 96 -3 -215 -369 -222 -61 -162 -61 310 260 -33 -56 89
2576H9l20J99r6K68l46J81j66K76R7r0o1k20J94l5q0J9P3M00j53l13l88J35K73
$$ 89 -231 -32 -128 140 -206 -25 -191 85 182 92 31 -189 5 -30 -110 -91 -18 382 229 -84 -472 -337 -64
2599f4kL76k81R7k58J14l2j00K00l13K79j85N42m12J56K88l05m00J81r8P3J68
$$ -64 -66 310 29 126 -132 -18 -50 -150 50 -263 16 -169 373 -39 117 405 100 -300 -119 -217 -144 24
2621B4K5P5k00J79Q8k56m4M7J13J06o0J13o8j63K24k86M7k31J87J81m8J33k35
$$ 24 49 124 -76 103 191 -65 -109 -62 51 157 97 210 142 -21 203 -83 -36 -267 -80 101 53 186 -49
2644d9J53P9m77mL89k49J46l1J18J03R9j37M6k87o5J37O6j16P9k32O30k14k36
$$ -49 104 183 -294 -298 91 -158 -12 -43 75 178 277 140 186 -101 -166 -29 37 -79 0 -232 398 184 -52
2667e2P5K7k85J62J16J03j33P9k94L58j60j28P1p6J11N7J87l91J38J93k40j57
$$ -52 23 50 -235 -73 43 146 13 92 -202 156 -4 -132 -61 -137 -26 31 218 -173 -35 158 -82 -239
2689b39K31n2lK21P7l71K08k78M7L19l07J0J9M17l97K14L1j27J15j60M6j17J15
$$ -239 -8 -60 -63 158 235 -136 72 -206 -159 160 -147 -137 -118 299 -98 116 147 20 135 -25 21 -96 19
2712A9j38L01J09n65L8L07j67j03K21k99L54J48J1k76O8J75j92j08n1J19J8m1
$$ 19 -119 182 291 -274 -236 71 -96 -199 22 -277 77 225 236 -40 28 203 11 -97 -148 -29 -11 -52
2734e2J94j3L6K10m96J66p7P5k64K55J57l23R6k5J81m2k81O6rL13k69r1L37m17
$$ -52 142 129 165 375 -121 45 -32 43 -221 34 191 -132 -36 -61 120 78 -203 -137 -146 167 -102 -193 144 -273
2758b73J83q3J03J01l1M03k94j11K6K3j82j17J90m5J93k6L8qn7o0J08j50j45K09
$$ -273 -90 -173 -70 31 0 403 109 -2 24 47 -135 -252 -62 -107 86 60 98 90 33 -27 81 -69 -214 -5
2782eN6ql18N18l71O%K51l59k2L96k11K1m9k7J54K5j07M7J4L7j36K59l17Q1K32
$$ -5 51 43 -275 243 -128 -122 -122 129 -230 -252 144 -67 -46 -95 -122 32 57 -50 -3 11 48 -88 171 -146 -65 167
2808A67J39k30ql37J99J5j19P3K19k94L99j01p5k54K84m45L61r9r8J53j46J23
$$ 167 306 76 68 -269 -70 -55 -174 -101 118 -176 223 122 47 -207 77 -368 -7 -106 -204 -51 -197 -74
2830g4K9K52l84N8QQ8L17q2p5k23J28J68j96K4j14J29k00J50J37R6k31M4j32J19
$$ -74 -45 207 -177 -119 -111 -23 294 212 137 -86 42 210 14 38 -76 53 -147 3 140 236 5 49 -83 36
2854C6l70K79J96j0K93r5l22J45k55K9k63K20L90k42J04k94K51k55L7J61m7r9
$$ 36 -334 -55 141 131 424 329 7 152 -103 -74 -337 -117 273 31 135 -159 92 -163 -126 35 -12 -111
2876a11J43nK48l12k75L88p9k0j44K33p8q4j58p6N41p2j40j3j84K56M9J40j12
$$ -111 32 27 275 -37 -312 76 -3 -23 -167 66 -12 -96 -254 -330 211 139 -1 -14 -198 58 107 247 135
2899A35j08O6j7k65L45r4LL9j42k03L70P8k06j44J65N4l14K33j83L12j62J79n3
$$ 135 27 93 76 -189 156 62 65 104 -38 -241 129 207 1 -143 22 76 -238 -5 -188 124 -38 141 88
2922H8O9n51K53j02K64k01J50K67j11k96k5M85k78k76M09j10K1l39K55K17r2J41
$$ 88 157 -394 -141 -243 21 -180 -30 237 126 -170 -195 290 12 -264 145 35 56 -283 -28 189 97 238
2944B38m42J8p6k6N72l24J89j84K42j28R4j20j25K43j43j56J91M6j77p8J89m5
$$ 238 -204 -186 -262 -288 284 -40 149 -35 207 79 173 53 -72 171 28 -128 63 109 -68 -146 43 -2
2966bj61j17J42J43qO1J72l33qo8j8K44k4K08o8j17J47j75K75k77m04M51j79L80
$$ -2 -163 -280 -138 5 -3 58 230 -103 -111 -179 -197 47 23 231 163 46 193 18 293 16 -388 63 -116 264
2990B64j97q2Q3j08L1j45rN6J50oP7L9p5J02j56P3k77J64j76kJ92J60m4m9r9J71
$$ 264 67 -15 68 -40 -9 -154 -163 -107 43 37 114 153 78 180 24 97 -180 -16 -192 -194 -2 158 114 65 -34 137
3016A37l21K33j11q0K70j61M4L06k35l30L80O7k43K23j75K3r9K02q2%o6L7k52
$$ 137 -184 49 -62 -142 128 -33 11 317 82 -248 132 199 -44 179 4 27 -72 130 48 48 -18 19 -233
3039b33K0K71j86J64k0J21Rj58j56j63L0L23M3l0J65k63K27q1L8j59Qn8M05J01
$$ -233 -213 58 -128 36 16 137 146 -12 -168 -331 -301 22 65 35 200 -63 164 83 121 -38 -30 -88 317 418
3063D18n52K60k04K64j73l2m8o3K70n7j24M2N4k5o9R5k33P5K33J08j55j83K90
$$ 418 -134 126 -78 186 13 -19 -67 -130 140 83 -41 1 55 30 -39 56 -177 -102 131 239 84 -99 191
3086A91L2l49Oj86L5M34k17J81j05K27j42k27j06J88k64N18q1R0p7k38J60O6j25
$$ 191 223 -126 -120 -306 -271 163 -54 127 22 249 107 -120 -226 -38 -302 216 135 225 148 -90 70 136 11
3109A1L5k02K62K5L56l20k49M68k40j55j00K5j28K18J09P3LO0m23J15Lo1M2q0
$$ 11 46 -156 106 131 487 167 -82 386 146 -9 -109 -84 -212 6 115 188 191 251 -172 -57 -54 -115 -73 -153
3133a53l0L43K94k51m49jM22l41K26k4J67m4l23Q5q4R3nj10J25K1M8K59J5P1l72
$$ -153 -183 160 454 203 -246 -247 175 -166 60 36 203 159 -164 -79 -163 -70 -75 -185 -60 -39 9 268 283 354 -18
3158a8Q6j31o2j05N4k4J46J40J74j45q1j55q4k9L92k14N3Q6J08j52N1l4l12J90
$$ -18 68 -63 -125 -230 -176 -200 -54 86 260 115 34 -121 -205 -234 158 -56 -3 83 191 39 90 56 -256 -66
3182f6R7J1om3J29Q9j95j70j12L74k07J11O4K35j6l94L38l86l50L38j62M25j65
$$ -66 31 42 36 -7 122 211 16 -154 -266 108 -99 12 76 311 295 -99 239 -147 -497 -159 -321 104 -61
3205f1K57K1k70O7Qk33L7J24kP0J98Mk38m7No7L6j1o9J69J72J15j57l96M7j73
$$ -61 196 217 -53 14 22 -211 -174 -50 -52 18 216 220 -18 -65 -60 -127 -91 -102 -171 -2 170 285 128 -268 -221 -394
3231c94K03L0j99M62k7J30o1M9k19m71L53k02Q1L76r0J3J27q1p1J44m5n32L79
$$ -394 -191 -161 -360 102 75 205 144 193 -26 -497 -144 -346 -265 111 21 34 161 80 9 153 108 -424 -45
3254d5j60J52K45K61j89l21r5l8J5Q4K98n78N10l1J58m2q2k86Q5M7RM1j2L06k02
$$ -45 -205 -53 192 453 264 -57 -152 -190 -175 -91 207 -371 139 108 266 224 142 -144 -59 -12 -3 38 26 332 130
3279A30K7j53k10q1NJ98J61k55O64k24k46L6l54r3J5L00j39L95J60n9k87L8k33
$$ 130 157 4 -206 -287 -282 -84 77 -178 486 262 16 52 -302 -395 -380 -80 -219 176 336 277 -10 28 -205
3302b05J74j23o8J06K68J16k48Q9M7j60k10R5l86L44J99J61m9J97m6m31N1k78
$$ -205 -31 -154 -222 -116 152 268 20 109 156 -4 -214 -119 -505 -161 38 199 150 347 301 -130 -79 -357
3324c57M37j65J17J36k23K83q7k26Nj04K53n3n1J70K8p1j3k09O6j13lJ2K06l4
$$ -357 80 -85 32 168 -55 228 141 -85 -80 -184 69 16 -35 135 163 92 79 -130 -64 -177 -180 -168 38 4
3348DL75n97L14R6l38R3k02P9oL57k59L21j93j17k84P6J28K05j00j00J25K90k03
$$ 4 379 -218 96 192 -146 -53 -255 -176 -182 175 -84 237 44 -73 -357 -281 -153 52 -48 -148 -23 267 64
3371F4j3m78L03k75M27J16P2J19j06M5k35k33J5%R1J91j09L75k64J37l57q1jn
$$ 64 51 -427 -124 -399 28 144 216 335 229 274 39 -194 -179 -179 -88 103 -6 369 105 242 -115 -196 -197 -202
3395b02j37L50j40L73j84P1K53j96k92j1j33N9K39j10J09q1K78l27k21Q0K05k08
$$ -202 -339 11 -129 244 60 131 384 188 -104 -115 -248 -189 50 -60 49 -32 246 -81 -302 -222 -17 -225
3417b25L53k4J17J6k90j59L20l44j25K43K21n6m5j5j47N1J4j5O9L1p2J58j25K15
$$ -225 128 104 221 237 -53 -212 108 -236 -361 -118 103 47 2 -13 -160 -109 -95 -110 -41 -10 -82 76 -49 166
3441A66k56K36k7p2L2j04r4N2L22k70N8M6J3l84j29K32L72R8k01K2K7J49j47l71
$$ 166 -90 146 119 47 79 -25 -119 -67 255 -15 43 89 102 -282 -411 -179 193 291 90 112 139 288 141 -230
3465b30R4J56j74M37k86L81n2m39N3J17m16N21m83L28M4K26j08k34J4j7k48L60
$$ -230 -136 20 -154 283 -3 378 326 -113 -60 57 -359 162 -321 7 51 277 169 -65 -51 -68 -316 44
3487D4j13k4K44J80L6j13k78k47J62K2K9n0K97K91j52k02m2k19j71J13K48k04
$$ 44 -69 -93 151 331 367 254 -24 -271 -109 -87 -58 -108 189 480 328 126 84 -135 -306 -193 55 -149
3509a49K27J60Q8k62L9J1m44J95M2j72K84L33j84j05l1N9n43K84J15j04K8L21
$$ -149 78 238 326 64 103 114 -330 -135 -93 -265 19 352 168 63 32 91 -452 -168 -53 -157 -129 192
3531A92p7K2l0Lj47Q8l67K73P5R3K8k45J80j64J1j90k26K19L66n5p8L83l08L6
$$ 192 115 137 107 110 -37 51 -316 -43 32 125 153 -92 88 -76 -65 -255 -481 -262 104 49 -29 354 46 82
3555H2j7l66P4L4J63Q9J5L0M31o60J10j56l27J23J80L18n6Q8K25o6n87J59l25
$$ 82 65 -301 -227 -193 -30 59 74 104 535 -125 -15 -171 -498 -375 -195 123 67 155 380 314 -273 -114 -439
3578d39O10k34jL89R5j32j95j04J43l12k3K67k87L69K1K50l87j36R6K5l46K78
$$ -439 171 -63 -64 325 420 288 93 -11 132 -180 -203 64 -223 146 167 417 30 -106 -10 15 -331 -53
3600e3j27J81L84Lm28j3J33K4k61M0j44J80N02k10j41j93n7P0j77J78L3K38J02
$$ -53 -180 1 385 388 -40 -53 80 104 -157 -117 -261 -81 421 211 70 -123 -180 -110 -287 -109 -76 162 264
3623B64j37L4j47j67o7j73M35p1J41K69l49K67l67o9j88J77R5P1L81k70l5K19
$$ 264 127 161 14 -153 -220 -393 42 -29 112 381 32 299 -68 -137 -325 -148 -53 18 399 129 94 313
3645C13l16q1N2j75K04l53M50J7J95M6k36j41o0J33o7k53M65j05K00k24K42k34
$$ 313 -3 -84 -32 -207 -3 -356 94 111 306 352 116 -25 -85 48 -19 -272 193 88 288 64 306 72
3667G2k48J43k73K60j27M23Ll02N2q6j96K12l8p4j53K91P4J75Nm10O2k7j85M68
$$ 72 -176 -33 -306 -46 -173 250 253 -49 3 -83 -279 -67 -105 -179 -332 -41 33 208 213 -197 -135 -162 -347 121
3691A21j42L3J98r7K11l51M8m56M09J2r2j27K66J98J00n50K51k10O2n8J01p9O07
$$ 121 -21 12 210 113 324 -27 21 -435 -26 -14 -106 -233 33 231 331 -219 32 -178 -116 -174 -73 -152 455
3714D55j79P6k95J46j35j85pj59K00J3K73n8M1m56K11q9q4K60k03L85q7j74J43
$$ 455 276 352 57 203 68 -117 -124 -283 -83 -70 203 145 186 -270 -59 -148 -232 28 -175 210 123 -51 92
3737I2l2j89Q1J25k42K38Nq1M0L71m70j75J99J46r1j03L22N4o7l88K99j24R1k04
$$ 92 60 -129 -48 77 -165 73 78 -3 37 408 -62 -237 -38 108 17 -86 236 290 223 -165 134 10 101 -103
3761a03J0K73r8j01L20m27J27M9k23J23j27K8k64M39J01r8J83j55k09P7O3l7j64
$$ -103 -93 180 82 -19 301 -126 1 50 -173 -50 -177 -149 -413 26 127 29 212 57 -152 -75 -12 -49 -213
3784b13L59J20j00n2j15j04j19P0J26K41k31N0R1j12PJ63n94J85J71R4q0K58k38
$$ -213 146 266 166 114 -1 -105 -224 -154 -28 213 -18 32 123 11 18 181 -413 -228 -57 37 -43 215 -23
3807b3Q6r2k61J79R1j52K04J8m3KJ39j50om4j51K57j12J63m4J09k37L4O4J4j8
$$ -23 63 -29 -290 -111 -20 -172 32 50 7 9 148 -2 -8 -52 -203 54 -58 105 61 170 -67 -33 31 45 27
3832B7l01M1L72q2K03k25nj01r6J22mK33k87NM98k58j30J79k13j36M4Q3M4Q0j3
$$ 27 -274 -233 139 57 260 35 30 -71 -167 -45 -49 184 -103 -98 400 142 12 191 -22 -158 -114 -31 13 93 80
3857H0J05m9j79L07m88J08j71L33Q0J1K96l79K14k50j25J88o81M14J90L03j40
$$ 80 185 136 -43 264 -224 -116 -287 46 126 137 433 54 268 18 -107 81 -600 -186 4 307 167
3878A67N3j42j2j89K28j47o9K80j79L90m4k43p8q5m00L71J30P9l6M4O2l38P8j0
$$ 167 220 78 66 -123 105 -42 -111 169 -10 380 336 93 15 -70 -470 -99 31 110 74 118 180 -158 -80 -90
3902i0J08k07L45r7J82j23Q4m07J85n0k7k42M31n1n1O2j41J76j3j40K02l53L31
$$ -90 18 -189 156 59 241 118 202 -205 -20 -70 -97 -339 92 41 -10 52 -89 87 74 -66 136 -217 114
3925A14oq3j14L17j99J9q5L4r9J44j62Q5K62k93J65p2N5k58K92l64N00l87K70
$$ 114 108 25 -89 228 29 48 -37 -3 -102 42 -120 -35 227 -66 99 27 82 -176 116 -248 252 -135 135
3948A35j32jk11p5L5J80j6L14l93K33j05Q6O6l62J69k27N3N1K98n3n9o0J57qp0
$$ 135 3 2 -209 -284 -249 -69 -85 229 -164 69 -36 50 116 -246 -77 -304 -251 -200 98 45 -14 -74 83 75 5
3973Ej33j5l6K02J70J03q7j40k27J18K9j06L4n2K06K29j50J41m28K10k45J98J45
$$ 5 -128 -143 -179 23 193 296 209 69 -158 -40 -11 -117 -83 -135 71 300 150 291 -137 73 -172 26 171
3996A71k95J31l8Q6L5K56j21j02n4j50N2m3K75j82J0J10l84J4N4j51J79L88k8
$$ 171 -124 7 -31 55 90 346 225 123 69 -81 -29 -72 203 21 31 141 -243 -229 -175 -326 -147 241 213
4019B13P9k54q5j53J20j84N7L36j30r6M47n65K58J5Q3l39J83N3J55R0j98O4l28
$$ 213 292 38 -47 -200 -80 -264 -207 129 -1 -97 350 -215 43 58 141 -198 -15 38 193 283 85 149 -179
4042a79K29l41L88j22k18K86j01J96k8N4J84n52M39l20J79l4J62p7r4j02K35k78
$$ -179 50 -291 97 -25 -243 43 -58 138 110 164 348 -204 235 -85 94 60 222 145 51 -51 184 -94
4064i4J5j68J58J1J31L7j83J95J48l46n4K0L28j11k76K64J81J05l87M5j61K8J87
$$ -94 -79 -247 -89 -78 53 90 -93 102 250 -96 -150 -130 198 87 -189 75 256 361 -26 19 -142 -114 73
4087G3k35K78l9M4P9N0k19l5K7l12L8L55L5l00M70N7l25n2m9k9J41P1K5o6k1r5
$$ 73 -162 116 77 121 200 250 31 -4 23 -289 -251 104 139 -161 309 366 41 -11 -60 -89 52 123 148 82 61 -34
4113c4k70L27R7j58N9M0R9P0K8l61N3k45L25Q6j66P0n2M59k99r4J77l54K67l51
$$ -34 -304 23 120 -38 21 61 160 230 258 -103 -50 -295 30 116 -50 20 -32 427 128 34 211 -143 124 -227
4137b27J0mK56J03n4l3r7J82q5m4k79L17Qk85Q7K65K4L4j59l1J23j46K9P6J01
$$ -227 -217 -221 35 138 84 51 -46 136 51 7 -272 45 53 -232 -145 120 144 178 19 -12 111 -35 -6 70 171
4162A71j05or3j85J94J19j63L0K84j47j21j6M6L40l32J63k11J50j45J83k66K04
$$ 171 66 60 -33 -218 -24 95 -68 -38 246 99 -22 -38 8 348 16 179 -32 118 -27 156 -110 94
4184I4o0j08j41J15N9j45m5K84N4j30K08j49j76K34j76m3n6K14N6P4l7j55L9n7
$$ 94 34 -74 -215 -100 -41 -186 -231 53 107 -23 185 36 -140 94 -82 -125 -181 33 89 163 126 -29 10 -47
4208d7k86M29j9R9kj57L33o70N00o9j95K14qO3j13Q5o8j39k38K34o4J43j31J08
$$ -47 -333 96 77 176 174 17 350 -320 180 111 -84 130 122 185 72 157 89 -50 -288 -54 -118 25 -106 2
4232Bj09K15nJ20k86J70m01L99j9j05n7K7N83o23l0J11k87K98r6m8K78P1o4k42
$$ 2 -107 108 103 223 -63 107 -294 105 86 -19 -76 -49 534 -89 -119 -8 -295 3 -93 -141 137 208 144 -98
4256i8K52J31j21j37M1j81j96K60K14j57o9J64m07L42j69J57L3k5k5l7n5n2j94
$$ -98 154 285 164 27 68 -113 -309 -49 165 8 -61 103 -304 38 -131 26 59 34 9 -28 -83 -135 -329
4279c29L14j17J86j68j24L62k42L61k20m3P4k29K83k98K51p5R5j29o7j7J28j16
$$ -329 -15 -132 54 -114 -238 124 -118 243 23 -20 54 -175 108 -190 61 -14 81 -48 -115 -132 -4 -120
4301a20J52j19L10j5j26q4j95J90p4N9k35Q5J33j20J80Q3k44m7K86j85j73K99
$$ -120 32 -87 223 208 82 -2 -197 -7 -81 -22 -257 -172 -39 -159 21 104 -140 -187 99 -86 -259 40
4323D0R7O0L4j42m2k92L47j6p6n8j87M33nJ94n29J37jL9k4k53J13J74J53j04j15
$$ 40 137 197 231 89 47 -245 102 86 10 -48 -235 198 193 387 -142 -5 -6 33 9 -244 -131 43 196 92 -23
4348b3J88j2l38J5J60L48l62j0L08l16QK3j01R7o7j47K51P4Q0n0r7M2l9J36k89
$$ -23 165 153 -185 -170 -10 338 -24 -34 274 -42 -34 -11 -112 -15 -82 -229 22 96 176 126 29 71 32 168 -121
4373a21P4L8O9k05Rk8o0L3K08Pj02j77L28j45K54K0j67Q9m83L92r4QL05q8k66
$$ -121 -47 -9 60 -145 -136 -164 -224 -191 17 24 -78 -255 73 -72 182 202 35 124 -359 33 -61 -53 252 164 -102
4398a02j24K50M7j42R9j2J41K12m38J49n9j18O4M5k76J63J54jp8L72k12o4Jk86
$$ -102 -226 24 71 -71 28 16 157 369 -69 80 21 -97 -33 12 -264 -101 53 52 -26 346 134 70 71 -215
4422b15M8k9M77j21p1N2j90k9K0RP8k15J20k40N34k6k22J1N7j99K34q8k15L86
$$ -215 -167 -196 281 160 89 141 -49 -78 -58 -49 29 -186 -66 -306 228 202 -20 -9 48 -151 83 -5 -220 166
4446A66k43K94n26L33L4j42K7m9nJ74N8j29K10k94J70k28J40o3K97k23M8n4K38
$$ 166 -77 217 -309 24 58 -84 -57 -106 -111 63 121 -8 202 -92 78 -150 -10 -73 224 1 49 -5 233
4469B33j24j34N6Q3n53L70M2j2R6N7kl0l6l05J91q4K65l84M08l61K52N3q0O0j49
$$ 233 109 -25 31 114 -439 -69 -27 -39 57 114 112 82 46 -259 -68 -152 113 -271 137 -224 28 81 1 61 -88
4494h8K15m5Kk46J26J0M2n4m7J02M1j6j6O0K27k91J09k67J10j91M39j94J38k13
$$ -88 127 82 84 -162 -36 -26 16 -38 -85 17 58 42 26 86 313 22 131 -136 -26 -217 222 28 166 -47
4518d7J3Q2J80l31j10K51l33J39M29k57r7K9J2p5MJ30j84J80L0M2O2r8M0k81L45
$$ -47 -34 48 228 -103 -213 38 -295 -156 273 16 -81 -52 -40 -115 -111 19 -165 15 45 87 149 51 91 -190 155
4543A55k04k32J84K00K7k33j0Q3j83J70J74k93K8J21N8l4J79k19J47k35J99J08
$$ 155 -49 -281 -97 103 130 -103 -113 -30 -213 -43 131 -162 -134 -13 45 11 190 -29 118 -117 82 190
4565A90m56M11j16j26K17qj10k56K97jj2j83m7P2K13m5j40L04J20n38J93p4Kq0
$$ 190 -266 145 29 -97 120 112 2 -254 43 42 30 -153 -200 -128 85 40 -100 204 324 -214 -21 -95 -93 -173
4589a73%M01j57j45J01J57l20k9L10J60k70J07O7Oj20j91Pk38M05j30j39N4L03
$$ -173 -173 228 71 -74 27 184 -136 -165 145 305 35 142 209 215 95 -96 -89 -327 78 -52 -191 -137 166
4612A66j00k71M7K12k42K43M3l64M73k98R0j36J51K4J67k85K06mj27J0k13J87
$$ 166 66 -205 -158 54 -188 55 98 -266 207 -91 -1 -137 14 38 205 -80 126 122 -5 5 -208 -21
4634b1k26K70j77J03K22k21k48K71K10l50M2R4o6q2K07k14K81k39K49j23M7M3
$$ -21 -247 23 -154 -51 171 -50 -298 -27 183 -167 -125 -31 -97 -179 28 -186 95 -144 105 -18 29 72
4656G2j56K6L4J8K1m3Q7k32J26k08m3J27J95j30K74j50J20k1j26K19n70L67K13
$$ 72 -84 -58 -24 -6 15 -28 59 -173 -47 -255 -298 -171 24 -106 168 18 138 117 -9 210 -360 7 220
4679B20j78J14P6l29J39M5j50J92k9r2p3j20J09K07m9k01K70k67L40n17L02q4
$$ 220 42 156 232 -97 42 87 -63 129 100 8 -65 -185 -76 131 82 -119 151 -116 224 -293 9 -75
4701g5l0J73j42K28o0j96K52o6k08J36L4k9K13m98K56m4o5N4j22K85p6j15L8J13
$$ -75 -105 68 -74 154 94 -102 150 84 -124 12 46 17 230 -268 -12 -56 -121 -67 -189 96 20 -95 -57 56
4725E6J44k73Q6j99K38Oj66J37L3o6J13p7J6J53jk09o1J16J95mk5m27K57j7J16
$$ 56 200 -73 13 -186 52 58 -108 29 62 -4 109 32 48 201 200 -9 -70 46 241 237 212 -215 42 25 141
4750A41j71J67m6m8R2m8p5J79j85J09k49K69j64j24P1J19j56NJ7R8o3l0J16J09
$$ 141 -30 137 91 43 135 87 12 191 6 115 -134 135 -29 -153 -82 37 -119 -114 -97 1 -62 -92 24 133
4774A33j34j44J71M3q7pm0K04%j38K42n17L66Q1k02J02j05J9Q1J42o3j11k3j27
$$ 133 -1 -145 26 69 -18 -25 -65 139 139 1 243 -274 92 173 -29 73 -32 -13 68 210 147 36 13 -114
4798a14j35J40J15j0J05pj6Oj28K2M1k5k30L48m0o5K1J64O8p2m82K90K9j71j12
$$ -114 -249 -109 6 -4 101 94 78 84 -44 -22 19 -6 -236 112 72 7 28 192 260 188 -294 -4 25 -146 -258
4823b58K95k94J53K30m5l4j34K10j85J59j33N8L0P5l85J49l1Q1j19N7J12J35q2
$$ -258 37 -257 -104 126 81 47 -87 123 -62 97 -36 22 52 127 -258 -109 -140 -59 -178 -121 -9 126 44
4846D4k24L83m31K52n1Q2R8R1r8j95L74l5l52J8R4k29L16J09p5k54J09N9r6j5
$$ 44 -180 203 -228 24 -27 55 153 244 146 -49 325 290 -62 -44 50 -179 137 246 171 -83 26 85 -11 -26
4870b6J8Q7j76Q9J00j55J20l14K61J75r1l01N12k52j05L17j48l2O2k98PJ25J03
$$ -26 -8 79 -97 -8 92 -63 57 -257 4 179 88 -213 299 47 -58 259 111 79 141 -157 -150 -25 78
4893G8k08L32j98R6J9r6J00n2j66K71l64J48P7n4J13r7J5o3J06k89o4K94k07K48
$$ 78 -130 202 4 100 119 23 123 71 -95 176 -188 -40 37 -17 96 -1 14 -49 57 -232 -296 -2 -209 39
4917C9o6k9j1q7L51J79m40jj19K51jk1Ok07K10J31l54O21n17kj1r1J57k40L12
$$ 39 -27 -56 -67 -154 197 376 -64 -65 -184 67 66 45 51 -156 54 185 -169 452 -65 -67 -78 -169 -12 -252 60
4942F0j7N6j04P6r5L10m19MK37k61J49o5L9P2%L5j14J27k39J73J93k96l0j42K28
$$ 60 43 99 -5 71 -24 286 -133 -129 108 -153 -4 -69 -30 42 42 77 -37 90 -149 24 217 -79 -109 -251 -23
4967b3J38j09qj08K54j32n7R2J2k7mJ55j51j63J86j02l51N78lj44j58J81M7j00
$$ -23 115 6 -2 -110 144 12 -45 47 59 32 28 183 32 -131 55 -47 -398 180 177 33 -125 56 103 3
4991Cr5K3J41r2j84L52k66K45Q6j15m66M26n0kj09J21p3Q1J04m8r2p0k1j22K97
$$ 3 -92 -69 72 -20 -204 148 -118 127 213 98 -368 58 8 6 -103 18 -55 26 130 82 -10 -80 -101 -223 74
5016G4k2j73J18n3rJ48j21O7r2J17l49K39m8J44j13J12j19J62k88L24k22j2M41
$$ 74 52 -121 -3 -56 -65 83 -38 29 -63 54 -295 -56 -104 40 -73 39 -80 82 -206 118 -104 -116 325
5039C25l26N0j7m7R1k36K56RJo3q4j14J27j61Q7J89q6k4k4n1J21k0j07J58K16
$$ 325 -1 49 32 -15 76 -160 96 105 106 43 -41 -155 -28 -189 -102 87 1 -23 -47 -98 23 3 -104 54 270
5064B70m76L37l56O50l15k37k05K79K43k54J14k13R5J89k37K13q5k23K68rj19
$$ 270 -206 131 -225 425 110 -127 -332 -53 190 -64 50 -163 -68 121 -116 97 12 -211 57 48 -71
5085g1Q0%J19N9j0j17J61j51j01n9L24l76J42q5Q4N2k81L90j02M3l26L55j21P
$$ -71 9 9 128 187 177 60 221 70 -31 -90 234 -142 0 -85 -1 51 -230 160 58 101 -225 130 9 16
5109A6J18k25K69k14q9l5J54r8L4j88J61L59k54K60m49K06M5M2k81J7m8Q6R6R2
$$ 16 134 -91 178 -36 -125 -160 -6 -104 -70 -258 -97 262 8 268 -181 25 70 112 -169 -152 -200 -114 -18 74
5133G4rj9n2l6J97j57K8k08M75j36Pk71J46q1j7q5M01k52N1K66L0j97r4j01k39
$$ 74 65 46 -6 -42 155 -2 26 -182 293 157 164 -107 39 -42 -59 -144 257 5 56 322 352 155 61 -40 -279
5158b79K42J51r6N9k90M62m12J45JN8j2p2n4K89j40m3K52n4j98n1N7k2J5n3K7
$$ -279 -37 114 18 77 -213 249 -163 -18 -17 41 29 -43 -97 192 52 9 261 207 9 -42 15 -7 8 -45 -18
5183a8j97N10p7m7j24j79K43k36J52MO6J82m4l40K40r8p5k07K69K45j65j25J16
$$ -18 -215 295 218 171 47 -132 111 -125 27 31 97 279 235 -105 135 37 -38 -245 24 269 104 -21 95
5206I5j69J18J58l1k13n2j28M36l7l89L97j03k32K58j85K09l27J12J91O0l5k04
$$ 95 -74 44 202 171 -42 -94 -222 214 177 -212 185 82 -150 108 -77 132 -195 -83 108 168 133 -71
5228g1O9o9O0O9J77m68M77l03J73l15Q4j17K38O8q0J02n5rM7l25K41q9o1q5J90
$$ -71 -2 -71 -11 58 235 -233 244 -59 114 -201 -117 -234 4 72 -8 94 39 30 77 -248 -7 -96 -157 -242 -52
5253e2L9o0O4NJ20k06l43L39r0J70R6J17K1j12k70M43k50KQ8k16j47K25j98L7
$$ -52 -13 -73 -9 -4 116 -90 -433 -94 -184 -14 82 199 220 108 -162 281 31 33 121 -95 -242 -17 -215 -178
5277a78K89M6k9q4r5L1j26J10L5NM2j71L47l41m3J44K38l07J77k22P0L4j82K05
$$ -178 111 157 128 44 -51 -20 -146 -36 -1 4 46 -125 222 -119 -162 -18 220 -87 90 -132 -62 -28 -210 -5
5301eq0k25J64L74k97j5N35o20J12J10K00j94j25M00k45m1l15L81k48J29J54k07
$$ -5 -85 -310 -146 228 -69 -84 451 -169 -57 53 253 59 -66 334 89 48 -267 114 -134 -5 149 -58
5323e8J19J88l10j09K58k54j92K66l19L47N4K13N0J4l05J4K69l28j45N1J45R1
$$ -58 61 249 -61 -170 88 -166 -358 -92 -411 -64 -10 203 253 267 -38 -24 245 -83 -228 -177 -32 59
5345E9O1j22m2K29l5k35kj1o3J57m1J75m3o5J80l18O6N2m1m4J77k32J7Q7K23k06
$$ 59 120 -2 -44 185 150 -85 -87 -98 -161 -4 -45 130 87 22 202 -116 -50 2 -39 -83 94 -138 -121 -34 189 -17
5371a7l5J51l74R2n4L03j6r0O8O2j91l5L47K2l44M3L1j2P5j18K7m6J9J28K00l16
$$ -17 -52 99 -275 -183 -237 66 50 -40 28 90 -101 -136 211 233 -111 -68 -37 -49 26 -92 -65 -111 -92 36 236 -80
5397h0K89k99N3J16J4l0N0L6l60J47k4M04j42m26L55j72J14J6k86K82j78J95M1
$$ -80 209 -90 -37 79 93 63 113 149 -211 -64 -88 316 174 -252 103 -69 45 61 -225 57 -121 74 115
5420A15j89k3Q5p3R6K02j16K84k28q8L30j16k36P2J8j12n9L9P5k09J71j64m9J45
$$ 115 -74 -97 -12 -85 11 213 97 381 153 65 395 279 43 115 133 21 -38 1 76 -133 38 -126 -175 -30
5444c0J29p0j9K0k11k0J66O2k01K32j42k14J93J19o9QJ4P3j20K13k41J79R9L0
$$ -30 99 29 10 30 -181 -201 -35 27 -174 58 -84 -298 -105 14 -55 -47 -33 40 -80 133 -108 71 170 200
5468B00m0l27M43k80l3n7K9j4J13o0j3O9o1p9j34L21j77q0L18n8Ml05K89j32p6
$$ 200 160 -167 276 -4 -37 -94 -65 -79 34 -26 -39 30 -31 -110 -244 77 -100 -180 138 80 84 -221 68 -64 -140
5493a40L65k14j3P8j79P4J46j76L2K9L6l08K59J06LN9k09K71j73k21K86J15j53
$$ -140 225 11 -2 76 -103 -29 117 -59 -27 2 38 -270 -11 95 98 157 -52 219 46 -175 111 226 73
5516G3q1n4J84j7K21m71L09k33m1K14k60n1J90J55j93O5j16k5N3j77L64o4j10
$$ 73 -8 -62 122 105 326 -145 164 -69 -110 104 -156 -207 -17 138 -55 10 -106 -131 -78 -255 109 45 -65
5539f5R6k20K54j26l0M2K20j33k20K19r6M2o0Q9j43j9K43M1j02r9J31j20lM49
$$ -65 31 -189 65 -61 -91 -49 171 38 -182 37 -59 -17 -77 12 -131 -150 93 134 32 -67 64 -56 -59 390
5563C90m49Rj35L12j64J55J18J1j49j65N2q1q1J75p8J96k19K27N7jj97K04l71
$$ 390 -59 -50 -185 127 -37 118 236 247 98 -67 -15 -96 -177 -2 -80 116 -103 124 181 180 -17 187 -184
5586a84J63j42j03L33k90L85rl20N8K98j72J21m4Q2l24J94K55k73P6j24M2L6j24
$$ -184 -21 -163 -266 67 -223 162 153 -167 -109 189 17 138 94 176 -148 46 301 28 104 -20 22 58 -66
5609f6M7J00j17Q5r9l62N81k33l1J08j1l9J80k74J35n6J08j53Q4N5k52K28J12
$$ -66 -19 81 -36 49 -50 -412 169 -64 -95 13 2 -37 143 -131 4 -52 56 -97 -13 42 -210 18 130
5632A30r4k15l6K33Qj53K76j62K6n2k5K0N3k27L65m8n5k47K59P3l24M11k51j25
$$ 130 36 -179 -215 18 26 -127 149 -13 13 -39 -64 -44 9 -218 147 99 44 -203 56 129 -195 216 -35 -160
5656a60l0L1K15j66J10r3Q1r2j70K39k07M57r5K6j54J82l53K80j72J19J5J2j9
$$ -160 -190 -159 56 -110 0 -93 -12 -104 -274 -35 -242 215 120 146 -8 174 -179 101 -71 48 63 75 56
5679E6O5p8j27J72pj13q1L8j38K51j88j58K33K83j39j22J74k33R5J17j44q0O9
$$ 56 121 43 -84 88 81 -32 -113 -75 -213 38 -150 -308 -75 208 69 -53 121 -112 -17 100 -44 -124 -55
5702e5j62K57j97K71N1k04J40k32K69R8l15J21j8J10k35M5N9k03L82m9n6j18N6
$$ -55 -217 40 -157 114 165 -39 101 -131 138 236 -79 42 24 134 -101 -56 3 -200 182 133 77 -41 15
5725A5JJ74k58k4L12l19J27K3k67M0l7L89k81K28k41LP7pR3q7k38J10L70k19o3
$$ 15 16 190 -68 -92 220 -99 28 51 -216 -176 -213 176 -105 123 -118 -115 -38 -45 48 -39 -277 -167 203 -16 -79
5750g9K3K48p9o1M6j16n6k8J12q5J08m4K46k04k59J95J01o7q1K88l03N1kJ1l4
$$ -79 -56 192 113 52 98 -18 -74 -102 10 -75 33 -11 235 31 -228 -33 68 1 -80 208 -95 -44 -46 -35 -69
5775f9%j25L40j07n7l8O6Nr5j9K34k2k35K43j30J32j48L69k51K51l82p2J41o2
$$ -69 -69 -194 146 39 -18 -56 10 15 -80 -99 135 113 -122 121 -9 123 -25 344 93 344 -38 -110 31 -31
5799c1K4K00j78m6M02k85k16R6R1k2J8j14K97l61M25k97K7p4P0k5r7K9r0R0O6
$$ -31 -7 193 15 -31 371 86 -130 -34 57 35 53 -61 236 -125 300 3 30 -44 26 1 -96 -67 -157 -67 -1
5824aJ40l42J00K16Q0k93J25J5r3J68p9K2j68K29q9k87N01m02J37J06RR7k00J72
$$ -1 139 -203 -103 113 193 -100 25 40 -53 115 36 58 -110 119 30 -257 244 -158 -21 85 94 191 -9 163
5848A63m7K7l53O6j8L17m58L30J48o6R1o21K27L00M8p7k31N5L0P6k3J7l6o7J50
$$ 163 116 143 -210 -144 -162 155 -303 27 175 109 200 -421 -194 106 154 77 -154 -99 -69 7 -16 1 -35 -102 48
5873D8J98j90k64jo9K52l7K48j81K00k35J2J53j72j9k3J7J58n8k22K06JK0k19
$$ 48 246 56 -208 -209 -278 -26 -63 185 4 204 -31 -19 134 -38 -57 -80 -63 95 37 -185 21 22 42 -177
5897a77J51n4J42k78L89n6m8J89k98l5N7L93m24O4J13j66j46J92N6j08O9Q6m12
$$ -177 -26 -80 62 -216 173 117 69 258 -40 -75 -18 375 -49 15 128 -38 -184 8 64 -44 25 111 -301
5920c01K60K67j09k47L41k75J26L2J39k70J0J45j32K09m23M22l70K27j59j3K8
$$ -301 -41 226 117 -130 211 -64 62 94 233 -37 -27 118 -14 195 -228 194 -176 51 -108 -121 -93
5941i3J70j06M6m3K3L38l08j3J89k23r2k56K53K27k01j3R1K97m71J04K20j11M6
$$ -93 77 -29 17 -26 -3 335 27 14 203 -20 -112 -368 -115 112 -89 -102 -11 286 -185 -81 139 28 74
5964G4n4L6l9Q9R4l24OJ80p1j41K48j8J52j47j20j61N41m42J97n4J64l95K97N5
$$ 74 20 56 17 106 200 -124 -118 62 -9 -150 98 80 232 85 -35 -196 345 -97 100 46 210 -185 112 167
5988A67k21K7J3Qk27L29j51J11pj22Q1J96k77P3k48M27j20j37M2J35m9o3k22J10
$$ 167 -54 -27 -14 -6 -233 96 -55 56 49 -73 8 204 -73 0 -248 179 59 -78 -36 99 50 -13 -235 -125
6012a25p9K2K91p9o3j28J75j25L67j81Mj52n2M06m33J69J18k26M0K6J05k3P3P1
$$ -125 -204 -182 109 30 -33 -161 14 -111 256 75 79 -73 -125 281 -152 17 135 -91 -51 -25 80 57 130 201
6036B01k40O3j8J3j57J83l7K15p7j14J90m53K90j25J00j70J55O4k17L12j8p3q3
$$ 201 -39 24 6 19 -138 45 8 223 146 32 222 -231 59 -66 34 -136 19 83 -134 178 160 87 4
6059Dr5J87j2k08k79K76M29l90J75p1l9ML3pj71J66k05K50j58R5k08J28Q1J6l6
$$ 4 -91 96 84 -124 -403 -127 302 -88 87 16 -23 -19 14 7 -164 2 -203 47 -111 -16 -224 -96 -15 1 -35
6084c5k19K06R3j17K82j18Q2k61J66Q7l41k5K59M4k42K14O5o2J53k02K00k54l17
$$ -35 -254 -48 45 -72 210 92 174 -87 79 166 -175 -200 59 103 -139 75 140 78 231 29 229 -25 -342
6107c42O39k08k2j30L11k12j77K54k94K75j41q2M2J22j1J12j4l42Q9o8L13j21
$$ -342 297 89 67 -63 248 36 -141 113 -181 94 -47 -129 -87 35 24 136 122 -220 -131 -199 114 -7
6129gk2K38j10j61j62M06m3j62n7Q3N0m7k57K55K28n33K78j83j8K54p9N6J87k59
$$ -7 -29 209 99 -62 -224 182 139 -23 -80 3 53 6 -251 4 232 -301 -23 -206 -224 30 -49 7 194 -65
6153f5K0R0l35J66J95k68J77K76j67k21L03J20k12r5P4l18K51K24l79J18k61M43
$$ -65 -45 45 -290 -124 71 -197 -20 256 89 -132 171 291 79 -16 58 -260 -9 215 -164 -46 -307 136
6175A36l18L93m73J92J40l25M93j41o3l7Q2j49j9j34L87k84K32j57J98m01O0J53
$$ 136 -182 211 -262 -70 70 -255 238 97 34 -3 79 -70 -89 -223 164 -120 112 -45 153 -248 -188 -35
6197c5n3J17k83K66O3k71M18l10M46m74K26M1m05K12K95k55J89n5j37K43m09J90
$$ -35 -88 29 -254 12 75 -196 222 -88 358 -116 110 151 -254 -42 253 -2 187 132 -5 238 -171 19
6219A9J5J7K6J93j65j24N9j98p8J02n7L00o31O18n0q5j64M67l51K00j4j44J15
$$ 19 34 51 77 270 105 -19 40 -158 -236 -134 -191 109 -522 96 46 -39 -203 264 -87 113 99 -45 70
6242G0LJ55r3j34j8J6L5j65J9J29k24J63Jr8J10n5k9j47N53k59K23j08J07l89
$$ 70 73 228 135 1 -17 -1 34 -131 -112 17 -207 -44 -43 -141 -31 -86 -115 -262 291 32 255 147 254 -135
6266a35K4n4R9k05o9L42K10l16K2L19N1k63L9j52J47j40J23N5P8p3j4j13K5o3
$$ -135 -111 -165 -66 -271 -340 2 212 -104 -82 237 288 25 64 -88 59 -81 42 97 175 102 88 -25 0 -63
6290f3P9n6q7J54p9Q8J36k40m9Q5K19J7l30L90j13k03j9r3n7J22L19q6j16K15
$$ -63 16 -40 -127 27 -52 36 172 -68 -117 -32 187 204 -126 264 151 -52 -71 -164 -221 -99 220 134 18 233
6314B33m16L76q9l05K57k56K93j71J86N1j40P5j22N7j81J03k4j58L61j41K6mR1
$$ 233 -183 193 104 -201 56 -200 93 -78 108 159 19 94 -28 29 -152 -49 -73 -231 130 -11 15 11 102
6337A02j04j08j31K69J18P1l14L56n27R3K9N8K55j94j91J35K15j58J07l11L05
$$ 102 -2 -110 -241 28 146 217 -97 259 -268 -175 -146 -88 167 -27 -218 -83 132 -26 81 -230 75
6358G5m1j14J79q7o9oM51r5k68n3Q4j50J45J8k14N05l66J22k4m29M41j13r1K7
$$ 75 34 -80 99 12 -57 -63 388 293 25 -28 56 -94 51 69 -145 360 -6 116 92 -337 104 -9 -100 -73
6382g3K52j21j37k5j1J95JLk32P9r6L46k07M67l21j94r4K42j51M6J26N0j7j91
$$ -73 179 58 -79 -104 -115 80 81 84 -148 -69 -165 181 -26 441 120 -74 -168 74 -77 -31 95 145 128 -63
6406f3R3O8J86j85k1n2j2o4k06L14J58J25k35k49J50jk07Q1R5m6M07k52j59R5
$$ -63 30 98 284 99 78 26 14 -50 -256 58 216 341 106 -143 7 6 -201 -120 -25 -71 336 84 -75 20
6430B0k15K07j3K9K61k88J59j79J79l13K02j83j6L88l41K21k4r2P5j27j1l5j32
$$ 20 -195 12 -1 28 289 1 160 -19 160 -153 49 -134 -150 238 -103 118 94 2 77 -50 -61 -96 -228
6453b28L85l01J93J00j41K11r0j40L2Q6j9j33jJ62r8m9K29k81k3q3K86l2p0o8
$$ -228 157 -144 49 149 8 219 129 -11 21 107 88 -45 -46 116 18 -31 198 -83 -106 -189 97 65 -5 -73
6477g3N4J21j79lJ21j18nJ37k16K14Jj50K1K96k03OMr3L62j56j84l9O8J5j35K91
$$ -73 -19 102 -77 -80 41 -77 -82 55 -161 53 54 -96 -75 221 18 24 28 -65 297 141 -43 -82 -14 1 -134 157
6503A57j60r1J42J70j77J16j84K6j10J27k01J35K84q6K06l51q6Q6j03l6J74j25
$$ 157 -3 -94 48 218 41 157 -27 -1 -111 16 -185 -50 234 148 354 3 -83 3 -100 -136 38 -87
6525h7Q1KN7k11q1L4N7J81l01K78R9mJ51l77J89j61J93l69L65k38K24J88l23J60
$$ -87 -6 -4 53 -158 -239 -205 -148 33 -268 10 109 105 256 -121 68 -93 100 -269 96 -142 82 270 -53 107
6549A07j87o0j47J50Q6q6J90j59J43j1j28J44m10L24r6K59K47n84K25J3J24k31
$$ 107 -80 -140 -287 -137 -51 -137 53 -106 37 26 -102 42 -368 -44 -140 119 366 -218 7 20 144 -87
6571h7J97J5j40Mo0J0J0R6J14Ql67J43j36L9M45j82J87j51j51N6m5j52J87l9r5
$$ -87 110 125 -15 -11 -71 -61 -51 45 159 167 -200 -57 -193 -154 291 109 296 145 -6 50 5 -147 40 1 -94
6596i4j31K68O4q9j03M1p3K5K02M8k95M30q8k26J38l05n8L17k39O2J13k03K04
$$ -94 -225 43 107 18 -85 -44 -117 -92 110 158 -137 293 205 -21 117 -188 -246 71 -168 -106 7 -196 8
6619HM28l92j94N6K80p4l42J18L72nl98K62J86j69k21Q0N7%K78l25j25N6r4L9
$$ 8 436 44 -150 -94 186 112 -230 -112 260 255 -143 119 305 136 -85 -5 52 52 330 5 -120 -64 -158 -119
6643a19J3jp4J50j44r3L56k14J4J0n2K86q8q1l8l9K82r4L5j3l03K48J86j68O4
$$ -119 -106 -107 -181 -31 -175 -268 88 -126 -112 -102 -154 132 44 -37 -75 -114 168 74 109 96 -207 41 227 59 123
6668A23k55k6j7J62p3P2l6m3jJ12J71m14K94J30l86K80k32p1K72Km6K6k8K10o1
$$ 123 -132 -158 -175 -13 -86 -14 -50 -93 -94 18 189 -225 69 199 -187 93 -139 -210 62 64 18 44 16 226 165
6693A65j23P2j35J47l34L44k38o2J30l29N95m46OM72n12K3L06L6o0J4k38L02j18
$$ 165 42 114 -21 126 -208 136 -102 -164 -34 -363 232 -214 -208 264 -248 -225 81 117 57 71 -167 135 17
6716A7j92J8L25M1k64j18J46k24K34K8k7J40jL2Lr9mM2k26J85j23R9Jj23L26j49
$$ 17 -175 -157 168 209 -55 -173 -27 -251 -17 11 -16 124 123 155 158 59 55 97 -129 56 -67 32 33 -90 236 87
6742H7o1l9n1R0p3L9Rk5k23K41M4n8J76N5k79M5K59r5l25L20k05p6J31K3J1JL
$$ 87 26 -13 -64 26 -47 -8 1 -24 -247 -6 38 -20 156 211 -68 -23 236 141 -184 136 -69 -145 -14 9 20 21 24
6769B4Q4P6j98J34pn3r0k1R4j34J09J18n9j18J04M4R0l8l93L9L88l67K56J7Q3
$$ 24 108 184 -14 120 113 60 -30 -51 43 -91 18 136 77 -41 63 107 197 159 -234 -195 193 -174 82 99 182
6794A82k40n9N6K84j68p7j51J64J01k64J43p3N7J63k49K25R1j87j02J63Jk49K95
$$ 182 -58 -117 -61 223 55 -22 -173 -9 92 -172 -29 -102 -45 118 -131 94 185 -2 -104 59 60 -189 106
6817A06k98J24j18R9j6M4PK02n9q6j45K88k33J48j4j0q2L15j54O2k44n7n2K13
$$ 106 -192 -68 -186 -87 -103 -59 -52 150 91 5 -140 148 -85 63 49 39 -43 272 118 180 -64 -121 -173 40
6841D0P9k64J96N7Pj23P0j01P3j85K12K8k59K10l37M6L78k37K7L68o96O92j75
$$ 40 119 -145 51 108 115 -8 62 -39 34 -151 61 89 -170 40 -297 -251 127 -110 -83 285 -411 281 106
6864A06J7k50J47j06r3L96j56N9j64j26R5r1R3J09j13r4M1N1M1K27Rk82JJ65m8
$$ 106 123 -127 20 -86 -179 217 61 120 -44 -170 -75 -166 -73 36 -77 -171 -130 -79 -38 189 198 -84 -83 82 34
6889C4m6N2k25J04j7m3p1J86m8J49Qp2P9M5j65qJ09Q7k6r5m5J33m7k30K52j4j34
$$ 34 -12 40 -185 -81 -98 -141 -212 -26 -74 75 83 11 90 135 -30 -38 71 158 132 37 -8 125 78 -152 100 86 -48
6916d8NJ27j13j16K84R7J4j80n7M5J6j0l63K67K75j67N3K36m93J0Q7r0J38j19
$$ -48 -43 84 -29 -145 139 236 250 70 13 58 74 64 -299 -32 243 76 129 365 -128 -118 -31 -121 17 -102
6940a02J18k82K05J28O7r5R8p7J98l89K8L35j53J37k19Q9P7j58j2K3j84O3l13
$$ -102 16 -266 -61 67 134 39 137 60 258 -131 -103 232 79 216 -3 86 163 5 -7 16 -168 -105 -418
6963d18L94K53p9M5k87K01J37n54L52k4J11k46k1j9K82k14N0n6o5r4P8M21j49
$$ -418 -24 229 150 195 -92 109 246 -308 44 20 131 -115 -136 -155 127 -87 -37 -93 -158 -252 -174 247 98
6986I8j31J19R6j24k80J82pO6j50K59o0J3K63m84K71j43n4K8prJ02L74l11l6M0
$$ 98 -33 86 182 58 -222 -40 -47 19 -131 128 68 81 344 -140 131 -12 -66 -38 -45 -54 48 422 111 75 115
7011A15J03j28q4P9J08j49j48K15J41n5k70J41N1j6l31J80O3l1Q6m09L66j48J01
$$ 115 218 90 6 85 193 44 -104 111 252 197 -73 68 119 103 -228 -48 15 -16 70 -339 27 -121 -20
7034b0j13J04j71J54o4J84k2j41J33j40j03J25J01K7J19k33p3K12K63n86L02J1
$$ -20 -133 -29 -200 -46 -110 74 52 -89 44 -96 -199 -74 27 54 173 -60 -133 79 342 -244 58 69
7056F9kJ35k11o9P3M9j16M2j60M41j55o9J11n39O79l05p2n7L07l1P5j27k58J97
$$ 69 67 202 -9 -78 -5 44 -72 -30 -190 251 96 27 138 -401 278 -27 -99 -156 151 120 195 68 -190 7
7080GJ7J51r1%j71K71j86k4JP9o1J53q5kp9K0j21K28l2k22J72j31J00l6J64j39
$$ 7 24 175 84 84 -87 184 -2 -26 -25 54 -7 146 61 59 -20 0 -121 107 75 -147 25 -106 -6 -42 122 -17
7106a7j06J91j26K2K5P1n2J82r8j86K4n0N5J66k15l7MK93j36J62m7k49J66R5r9
$$ -17 -123 68 -58 -36 -11 60 8 190 92 -94 -70 -120 -65 101 -114 -151 -147 146 10 172 125 -124 42 137 38
7131C8R9k24J32J43l19J62L6l5j11n4N8K18k13r7K04K1p6K83l56L61k96k90M33
$$ 38 137 -87 45 188 -131 31 67 32 -79 -133 -75 143 -70 -167 37 58 -18 265 -91 270 -26 -316 117
7154A17k19K0KK08k20m8P0J2L2Q3K13l18L43j46l56K98k50k3J69r7J1J45k58R8
$$ 117 -102 -82 -80 128 -92 -140 -70 -58 -26 57 270 -48 295 149 -207 91 -159 -182 -13 -110 -99 46 -212 -114
7178a14J49l23K50j31P0o0r0K63M8jj78K00j36q7K46J4l00J79j48J67r6J01j37
$$ -114 35 -288 -38 -169 -99 -159 -249 14 62 61 -117 83 -53 -140 106 120 -180 -1 -149 18 -78 23 -114
7201a14J29m4PL06k54J66k39j16L98j28J22k20k13L11l15K72o2J39j05J09k81
$$ -114 15 -29 -22 284 30 196 -43 -159 239 111 233 13 -200 111 -204 68 6 145 40 149 -132
7222a32k1J44J13K6k13j17L61j51q8l2Q7j11j9J84j19J80k3L8r6J30j45L01k30
$$ -132 -153 -9 104 130 -83 -200 161 10 -78 -110 -23 -134 -153 31 -88 92 69 107 11 141 -4 297 67
7245F7J10O7k36j86J87j87K94l54K72j02K4Q9J01M7l65J36o4J64J21j52j52j7
$$ 67 177 244 8 -178 9 -178 116 -238 34 -68 -44 45 146 193 -172 -36 -100 64 185 33 -119 -136
7267a36J73l6M16n63K15L1o0q5J28r0R8j41j18M77n06J34J33J16j31M6N9l66J15
$$ -136 37 1 417 -146 69 100 40 -45 83 -7 91 -50 -168 309 -197 -63 70 186 55 101 160 -206 -91
7290i1L38Ql49J57m9J12k39K61J08k27j07JJ56p9k4J84J97k82j76K16n4J28m09
$$ -91 247 255 -94 63 14 126 -113 148 256 29 -78 -77 79 0 -24 160 357 75 -101 115 61 189 -220
7313b20J00M65m48m2J77J64k02O0o6J67r2M3N8J14p28K34J22j25K32k3K12m23
$$ -220 -120 345 -103 -145 32 196 -6 54 -12 155 63 106 164 278 -450 -216 -94 -219 13 -10 202 -221
7335b21M09j70J22j76L7j55J81J19l5j01oK30m05q9K42L88l38Q3j52l0N4j67Q0
$$ -221 188 18 140 -36 1 -154 27 146 111 10 4 234 -171 -260 -18 370 32 115 -37 -67 -13 -180 -100
7358a00J14J07j98r6M19k18l7L5j8k7J37K5K25j89l28L79m48R9j06L43K80l83
$$ -100 14 121 -77 -173 246 28 -9 26 8 -19 118 143 368 179 -149 230 -218 -119 -225 118 398 15
7380A5R4l46K44j82M07k87j61K79J55l67j6J98j07R6L1J02k83R4O0o8k9j0j37
$$ 15 109 -237 7 -175 232 -55 -216 63 218 -149 -165 33 -74 22 53 155 -128 -34 26 -42 -71 -81 -218
7403b18K93j73L56k85K6L0k14L9J39K1K75m36K3oQ2j83L00J30N2k89L3RJ03j22
$$ -218 75 -98 258 -27 -1 29 -185 -146 -7 14 289 -147 -124 -130 -48 -231 69 199 251 -38 -5 4 107 -15
7427a5j4L3r0R6j87K98L13n58K21P1j33K35n33M26j43o0K7r5K32j02K47k27J41
$$ -15 -29 4 -86 10 -177 121 434 -124 97 168 35 270 -263 163 20 -40 -13 -108 124 22 269 42 183
7450A83n87M39K0j79J42j3j44J82l11J40L31l4O7l79N1J66M1J04k01j7J20Q2k9
$$ 183 -404 35 55 -124 18 5 -139 43 -268 -128 203 169 236 -143 -92 74 115 219 18 1 121 203 174
7473A74j20p4M0M3q2j06L24j17k36J87j3J85k33M7j01L66n22M84l20K07J61m78
$$ 174 54 -20 20 63 -19 -125 199 82 -154 33 20 205 -28 19 -82 284 -238 246 -74 133 294 -184
7495a84J55j56J51k12K25M7K35l05J02o9O9l12K58k3J75k77J47l04L32n9K5j72
$$ -184 -29 -185 -34 -246 -21 26 261 -44 58 -11 58 -254 4 -19 156 -121 26 -278 54 -5 20 -152
7517a52J83r2o4j0QL18m04K23o4j19Q1k2N00p6j26o0J62l78R5j02L32k82K00j09
$$ -152 31 -61 -125 -135 -127 191 -213 10 -54 -173 -92 -114 386 310 184 124 286 -92 3 -99 233 -49 151 42
7541D2J16r7J24Q2j8j75jj7M3K85n48K77k71M3k5J43K74l26J05k06j86L73j5R7
$$ 42 158 61 185 267 249 74 73 56 99 384 -164 113 -158 -115 -140 3 277 -49 56 -150 -336 37 22 119
7565A19l1L7j27J07k41j0J54J46k67M33l08k18K60Jr3K8k0qK43j69p9K45k38j65
$$ 119 88 125 -2 105 -136 -146 8 154 -113 320 12 -206 54 55 -38 -10 -30 -38 205 36 -43 202 -36 -201
7589b01O8l3J41k7J31j08j34M4L35l39J41K69k29m4O9j44J5Q8l0PJ75k03N4J2
$$ -201 -133 -166 -25 -52 79 -29 -163 -119 216 -123 18 287 58 14 83 -61 -46 42 12 19 194 -9 45 57
7613E7K53k78j95L92l61R9J75j04m4L59k26j50J62Mn8j48J50J79l95j12J98M4
$$ 57 310 32 -163 229 -132 -33 142 38 -6 353 127 -23 139 143 85 -63 87 266 -129 -241 -43 1
7635Aj3j60J70N4Q1mn19N25j78P5q2p7M34k78J84j5M4k25k09J42J87k2j97J59
$$ 1 -12 -172 -2 52 133 129 -390 135 -43 32 -50 -127 307 29 213 198 242 17 -192 -50 137 115 -82 77
7659G7l22R7j28N41J7o25L31J36L5k39J57q5M2n3r1R2j78J98j18L31j63J34l48
$$ 77 -245 -148 -276 265 282 -343 -12 124 159 -80 77 -8 34 -19 -110 -18 -196 2 -116 215 52 186 -162
7682a62J73j17N0q8R1j37J59J60M0j76j78L84n7J3k55J7M4L13l75K90l84K95j6
$$ -162 11 -106 -56 -144 -53 -190 -31 129 169 -7 -185 199 142 155 -100 -83 -39 274 -101 189 -195 100 84
7705H4j46J21j90N12l43p8j6jk0J33m2K81k55Ol9n0L14j74n7r7Q7j0Ppj66L69
$$ 84 -62 59 -131 381 38 -40 -56 -57 -77 56 14 295 40 46 7 -43 271 97 40 -57 30 20 27 20 -146 223
7731B23m8m42L18j84J43O0j32j63K48o3K69j24j42K9J37o6l0k19nO7K19n5j15
$$ 223 175 -267 51 -133 10 70 -62 -225 23 -40 229 105 -37 -8 129 63 33 -186 -191 -124 95 40 -75
7754g5N7L9K63l94L02j91k44K70P6J31o9j4k56P3Q7J6Q0P8N2m04J89R0j63m2K0
$$ -75 -18 21 284 -110 192 1 -243 27 103 234 165 151 -105 -32 55 71 151 229 281 -123 66 156 -7 -49 -29
7779b9j59L46l68J43nPK31Nk34k78M08K91m37J24j12N5K89j65j64j6R8L4J33j14
$$ -29 -188 158 -210 -67 -72 -65 166 171 -63 -341 67 358 -79 45 -67 -12 277 112 -52 -68 30 64 197 83
7803H3r0J49k30Q7J48k79K72l3k28j13K85nK2nk5j78p6L4K43q1r3j24L70j65j09
$$ 83 -7 142 -88 -1 147 -132 140 107 -121 -234 51 46 68 63 38 -140 -216 -182 61 -20 -113 -237 133 -32 -141
7828a41K49n4O6k58J93r3J48L2l09K73p3L0l37J20J98J43lk6k13K38l03M75l66
$$ -141 108 54 120 -138 55 -38 110 142 -167 106 33 63 -274 -154 44 187 184 158 -55 183 -120 355 -11
7851a1m7j17M64l93P9p0k2J18k4R9m59K27J63J35k86K95k56J39j42j67L07K4j26
$$ -11 -58 -175 289 -104 -25 -95 -117 1 -23 76 -383 -156 7 142 -144 151 -105 34 -108 -275 32 56 -70
7874g0L04k98O7p6J41k06L85n30L63l23L02j67J33J10k57l7J07P8j82J74j94K30
$$ -70 234 -64 3 -73 68 -138 247 -283 80 -243 59 -108 25 135 -122 -159 -52 26 -156 18 -176 54
7896E4n1n5M6M65p65J06M9K70Rj66n6J73l06J78K8J08l12M38R1m04K39q7j39J7
$$ 54 3 -52 -6 459 -306 -200 -151 119 128 -38 -94 79 -227 -49 -21 87 -225 213 304 -100 139 52 -87 -70
7920g0J44k77L19k97K94n07L41J24o0j7j66J98J07m7j7K85m45m1K67N0l38M4N6
$$ -70 74 -203 116 -181 113 -394 -53 71 11 -6 -172 26 133 86 69 354 -91 -132 135 185 -153 -109 -53
7943e3J99k23j59J98J34j39q2K70l41K74J94k48L0m06K09j24K83O8k15j7J52P2
$$ -53 146 -77 -236 -38 96 -43 -125 145 -196 78 272 24 54 -352 -143 -267 16 84 -131 -148 4 76
7965G6p2P2j9q1J36p2j46L24m95N51k77Q5J5J95J1k65J07j10O0k72j1K65M6j23
$$ 76 4 76 57 -24 112 40 -106 218 -277 274 -3 82 97 292 303 38 145 35 95 -177 -188 77 123 0
7989@j66L78k17m8j69J06L00j49k13L14j39M9J6J9j68K06j79M7Ok37K09q4m65
$$ 0 -166 212 -5 -53 -222 -116 184 35 -178 136 -3 46 62 81 -87 119 -60 -13 -7 -244 -35 -119 -584
8012e84M56K24j86oj9J83j24Q8k47M12j45j84K01j20M0M3J20l50L98k81n7J08
$$ -584 -128 96 -90 -96 -115 68 -56 32 -215 197 52 -132 69 -51 -11 32 152 -198 200 -81 -138 -30
8034c0MR8Rj83l7K68j89m6K50L4K3k14r1Q5k73K58k5j42K70J3k71J61M3K45j35
$$ -30 -26 72 81 -102 -139 129 -60 -106 144 178 201 -13 -104 -19 -292 -34 -59 -201 69 82 -189 -28 15 260 125
8059A25j30L7j35J62J06j49J8j03r2P2k21M44n11J4K06P5R2o1r5K83k60L84l56
$$ 125 -5 32 -103 59 165 16 34 -69 -161 -89 -310 134 -377 -363 -157 -82 10 -51 -146 137 -123 261 -95
8082i5J86j66K9q4J74j10K36r7j96K01q3j1K30j47j11m1o6J88j61J80j38J61o6
$$ -95 91 -75 -46 -130 44 -66 170 73 -123 78 -5 -16 214 67 -44 -85 -151 37 -124 56 -82 79 13
8105A3n7r8K98j65R9m9n7J67k03M7j89L00O4k80J48l76N10J28k02M8j52o3P1j26
$$ 13 -44 -142 156 -9 90 41 -16 151 -52 -5 -194 106 170 -110 38 -338 172 300 98 146 -6 -69 2 -124
8129a24N3L16q3j37K6J05l61L74j95k90L48o3M6q0J40p7j79J24O0j31JR1Q7j23
$$ -124 -71 245 162 25 51 156 -205 169 -26 -316 32 -31 15 -65 75 -2 -181 -57 3 -128 -127 -36 51 -72
8153g2J63p9m8m1J05j62J77r5O3p8J4K46N4j78j67L75j73j38l8j08J55J63j57
$$ -72 91 12 -36 -77 28 -134 43 -52 11 -67 -53 193 247 69 -98 277 104 -34 -72 -180 -25 138 -19
8176a9kK39n06K69j53J81j40J6J31J86j58r1J1o2N0
$$ -19 -21 218 -288 -19 -172 9 -131 -115 16 202 44 -47 -36 -98 -48
8191d8
$$ Imaginary data points
##PAGE= N=2
##DATA TABLE= (X++(I..I)), XYDATA
0@%%%%%%%%%%%%%%Qj6J6j6J6k4L2l8M6n3O1p2Q7j00J14j31J49j68J91k18K47k78
$$ 0 0 0 0 0 0 0 0 0 0 0 0 0 0 0 8 -8 8 -8 8 -16 16 -22 24 -29 32 -40 47 -53 61 -70 79 -89 102 -116 131 -147
36a47L12l50L91m36M86n41O02o67P39q18R00r91J094j206J328j461J609j776J962
$$ -147 165 -185 206 -230 256 -285 317 -350 389 -429 471 -520 574 -632 696 -765 844 -932 1030
55A030k170K405k674K987l354L787m313M972n816O945q547J1014j5347K5195r2548
$$ 1030 -1140 1265 -1409 1578 -1776 2011 -2302 2670 -3146 3799 -4748 6266 -9081 16114 -76434
70g6434J1894J40031k0682j4199K5568K9243o7812q3561m3286J3155L1981O1560
$$ -76434 -64540 75491 54809 40610 66178 95421 27609 -55952 -99238 -86083 -54102 7458
82G458M9913J4216j1899K902k4706p7332p2073J5135O0385L3653J3590M6436M2642
$$ 7458 57371 71587 59688 62590 37884 -39448 -111521 -96386 -36001 -2348 11242 57678 100320
95A00320k2579p1925m9295j2558m186j402K8646N8080N2207R572l4772m8765l2187
$$ 100320 77741 5816 -43479 -56037 -60223 -61625 -32979 25101 77308 86880 52108 3343 -28844
108b8844j7111j9211j1673L0581O9965N5864k46l6789k9994j6650k4896l4614
$$ -28844 -45955 -65166 -76839 -46258 23707 79571 79325 42536 12542 -4108 -29004 -63618
120f3618j3859L4993O8884M6922p119l3528j5735q056l7437n1360n013N3873N7879
$$ -63618 -77477 -42484 26400 73322 66203 32675 16940 8884 -28553 -79913 -84926 -31053 26826
133B6826K0178j021L375m810l3522m8186k9389O474L2506L6938K4838J1527O496
$$ 26826 47004 45983 49358 44548 11026 -37160 -66549 -60075 -27569 9369 34207 45734 52230
146E2230p166l6061n0825k5348J4427K7249J7826K1013L3849K1271j9938m7240
$$ 52230 45064 9003 -41822 -67170 -52743 -25494 -7668 13345 47194 68465 48527 1287
158A287l5362q044L115L576J4425L4591L7967J1276k4095l8345k5502r918p240
$$ 1287 -34075 -42119 -39004 -35428 -21003 13588 51555 62831 38736 391 -25111 -35029 -42269
171d2269m765J7276M2581L8643N839k3400k4654j5345j6867k1417o735K5350M2592
$$ -42269 -47034 -29758 12823 51466 57305 33905 9251 -6094 -22961 -44378 -51113 -25763 16829
184A6829K7230o41j3082j1561j6654k9001k6605Q61L0026L4713J8217N279K039
$$ 16829 44059 43418 30336 18775 2121 -26880 -53485 -52624 -22598 12115 30332 35611 37650
197C7650n317k3987l5054k2145N617K4684K3564J4885J2150R850o112k9472l6331
$$ 37650 32333 8346 -26708 -48853 -43236 -18552 5012 19897 32047 41897 35785 6313 -30018
210c0018j6703Q068J6720J4294J7760K4335J4619j2730l1199k6819j1036q32N200
$$ -30018 -46721 -38653 -21933 -7639 10121 34456 49075 36345 5146 -21673 -32709 -33541 -28341
223b8341J4055K4270K5438J0262j3555k6847k2470j1041o668j481J4477L0948
$$ -28341 -14286 9984 35422 45684 32129 5282 -17188 -28229 -34897 -36378 -21901 9047
235I047K7461N387j3132j6307j5677j8587j5152n81J8998K8050K1176N022p509
$$ 9047 36508 41895 28763 12456 -3221 -21808 -36960 -37541 -18543 9507 30683 35705 28196
248B8196j2138j6274k1692j9167O53K1782K6152J5221P479K739p415k1898k5094
$$ 28196 16058 -216 -21908 -41075 -40422 -18640 7512 22733 30212 32951 25536 3638 -21456
261b1456j4362K287J4769J9816J7817J0373K867p188j9992k6632j5259M119J3878
$$ -21456 -35818 -33531 -18762 1054 18871 29244 32111 24923 4931 -21701 -36960 -32841 -18963
274a8963J3799J5774J9038Q412j1549k3036j8890j0832l369N486J6302J9531J6086
$$ -18963 -5164 10610 29648 38060 26511 3475 -15415 -26247 -29616 -24130 -7828 11703 27789
287B7789N442q171j9046k0392j1950l410L573J2695K1872J9636N135r524j3776
$$ 27789 33231 25060 6014 -14378 -26328 -29738 -26165 -13470 8402 28038 33173 23649 9873
300I873j5656j4897r105L070J4809J9387J5323N998n027j2434j6176j4763r819
$$ 9873 -5783 -20680 -29785 -26715 -11906 7481 22804 28802 23775 11341 -4835 -19598 -29417
313b9417J163J4176J9100J4853O513j127r248j6058j6763r588J217J0453J5740
$$ -29417 -28254 -14078 5022 19875 26388 25261 16013 -45 -16808 -26396 -25179 -14726 1014
326A014J5271Q301o33q526j3992j6344j1491K30J0378J4289J3498J0178L325o613
$$ 1014 16285 24586 23953 15427 1435 -14909 -26400 -26170 -15792 -1503 11995 22173 25498 18885
340A8885j4873j5764j0060j303O183J2453J4097J1186K707n639j2050j5145j1539
$$ 18885 4012 -11752 -21812 -23115 -16932 -4479 9618 20804 23511 17872 5822 -9323 -20862
353b0862l539O726J1023J2646J1617O541l668j2665j4678r739l674K066Q783J3189
$$ -20862 -24401 -17675 -6652 5994 17611 24152 20484 7819 -6859 -16598 -20272 -18206 -9423 3766
367C766J3081N317l585j0204j2548j0736o112J696Q032J2556J2861P471j912r413
$$ 3766 16847 22164 18579 8375 -4173 -14909 -21021 -19325 -11293 1263 14124 21595 19683 10270
381A0270j1495r551p210j754O541J3361J3051N768j416o060r324j1778r584j729
$$ 10270 -1225 -10776 -17986 -19740 -13199 162 13213 18981 17565 11505 2181 -9597 -19181 -20910
395b0910P133J2131J1517O834J350l964q969j1958j0374k477O116J1118R580O455
$$ -20910 -13777 -1646 9871 16705 18055 14091 5122 -6836 -17210 -19687 -13571 -2453 7127 13582
409A3582L639j423r079j3537j0416j789N316Q222Q875Q863O585j099j0088j2945
$$ 13582 17221 15798 6719 -6818 -17234 -19023 -13707 -5485 3390 12253 18838 17739 7651 -5294
423e294q335k605K720N757Q778J0901O512j575r560j1296p693l061n61M211J0058
$$ -5294 -13629 -16234 -13514 -7757 1021 11922 18434 16859 7299 -3997 -11690 -14751 -15312 -11101 -1043
438a043J2523P125k738q059q145o949o180l382N105J1104J1257N021j679n389
$$ -1043 11480 18605 15867 7808 -337 -7286 -13466 -16848 -11743 -639 10618 15639 13960 8571
452H571o684q288q068l611N448J1864R966M093m4j832n709j0180j0341k067O076
$$ 8571 1887 -6401 -14469 -18080 -12632 -768 9198 13291 13247 11415 5706 -4474 -14815 -16882 -10806
467a0806R445O857M987L202l04p070j1364r284j334N159O900N663O666O565Q9
$$ -10806 -1361 5496 10483 13685 13381 6311 -5053 -14337 -15671 -10512 -3612 2051 8717 15282 15371
482A5371q791j1337o414q17J116L020Q342R363N499k340o930q759o717k496N80
$$ 15371 6580 -4757 -11171 -11988 -10872 -7852 490 9853 15352 13012 6082 -2677 -9394 -11890 -11310
497a1310K529O359J1075P408k990q914m883k853o003n581L951J1505R269J794
$$ -11310 -8781 -2422 8653 16061 13071 4157 -726 -3579 -9582 -15163 -11212 293 9562 11356
511A1356j537k044m975p591o579k089K920Q243R576M099j337k278k751o369r762
$$ 11356 9819 7775 2800 -4791 -11370 -13459 -10539 -2296 7280 11379 10042 7764 5013 -1356 -11118
526a1118l891N941Q639M537K632L970Q51o213r749o096m68K743L532N647O366
$$ -11118 -15009 -9068 -429 4108 6740 10710 11561 5348 -4401 -10497 -10965 -8222 -4690 957 7323
541G323M801m28o849p880m602j480J93K276N800P896N232j062o548p346l496j232
$$ 7323 12124 11696 4847 -3033 -7635 -9115 -8922 -6646 -846 7050 12282 11220 4672 -2674 -6170 -7402
557g402j925K38O546J0200N398l386o486l058k198n230m625K400Q375P828L078
$$ -7402 -9327 -9089 -2543 7657 13055 9669 3183 125 -2073 -7303 -11928 -9528 -1153 6675 9753
572I753j115k615m151m459n240l022J406O696Q055L703p44j411k144n869p322
$$ 9753 8638 6023 1872 -2587 -7827 -10849 -9443 -2747 5308 9011 8267 6856 4712 -1157 -8479
587h479k873L860N778L779L200M151N53n339p823m729l39J349K061M322N946M539
$$ -8479 -11352 -7492 -1714 2065 5265 9416 9969 4630 -3193 -7922 -8261 -6912 -4851 -529 5417 9956
603I956L96n353p211m284q73P14R66L396P115N837m99o164n861k485j255k166
$$ 9956 10352 4999 -2212 -6496 -7369 -6655 -5689 -2293 4822 10659 10160 3996 -1865 -4350 -5605 -7771
619g771l26N823P814L956j367l610l616l228m158k420J289N298O532L632l67k267
$$ -7771 -8097 -2274 5540 9496 8129 4519 903 -2325 -6483 -8903 -7614 -2316 4216 7848 7481 5214
635E214k699m101m949l086K055N760M940K374J647K35k625o467n679j350K604
$$ 5214 2515 -1586 -6535 -9621 -7566 -1806 3134 5508 7155 7390 4765 -1702 -7381 -8731 -6127
650f127L809L407L112L219R30l737o188n223n83J649K392K417M215M725P18l931
$$ -6127 -2318 1089 4201 7420 8350 4613 -1575 -6798 -7381 -5732 -3340 -923 3292 8017 8735 4804
666D804o393l357r55j05N18L363N870M509k27m206m129k778k633j389R45M046
$$ 4804 -1589 -4946 -5901 -6006 -5488 -2125 3745 8254 8027 3821 -308 -3086 -5719 -7108 -6163 -2117
682b117N796L845j49k801l177k946l515k774J064N025N161K443R7o03k059m351
$$ -2117 3679 7524 7375 4574 1397 -1549 -5064 -7838 -6774 -1749 3412 5855 5952 5349 3290 -1061
698a061m548k172J625L996M168K628J195K34j930m318n155k121K003L438K348
$$ -1061 -5609 -7781 -6156 -2160 2008 4636 5831 6065 4135 -183 -5338 -7459 -5456 -2018 330
713C30K716L095Q97k825m699m107j660L88K392K909L568L202R01k484m764l780
$$ 330 3046 6141 7038 4213 -486 -4593 -6253 -5865 -3473 -564 3004 6206 7107 4623 -141 -3921
729c921r89m74P55K560M844L608M08k836l539k397k660j646R37L295M519L379
$$ -3921 -4910 -5384 -4629 -2069 2775 6383 6791 3955 416 -1981 -4641 -6287 -5350 -2055 2464 5843
745E843L44j908k630k798l026k238N46L730M319K636K89k28j562l570m444j581
$$ 5843 6187 4279 1649 -1149 -4175 -6413 -5867 -2137 2182 4818 5107 4879 3317 -253 -4697 -6278
761f278O93L124L549K355J531O47j973l722l928k357J114K480K548K808K367J170
$$ -6278 -5585 -2461 1088 3443 4974 5621 3648 -74 -4002 -6359 -5245 -2765 -217 2591 4958 6128
777F128k139l900l714j697J25J700K451L217L385N69j832l624l640j794k66P45
$$ 6128 3989 89 -3625 -5322 -5197 -3497 -1046 2171 5556 6125 4293 669 -2971 -4765 -5031 -4286
793d286K515L697K814J217k039k758k808k429j268N16K580L814K865P42q33k281
$$ -4286 -1771 1926 4740 5957 3918 1160 -1648 -4077 -5345 -4829 -2249 1565 4430 5172 4339 2058
809B058k893k908j676J84K700L656K394J546m96j912l073k949j367l44K447L136
$$ 2058 -835 -3743 -5419 -5235 -2535 1121 3515 5061 4565 2653 -420 -3369 -4736 -5080 -2633 503
825E03K719J478j48j393k943l382j952J27J860K771K677K223Q06j656l014l211
$$ 503 3222 4700 4552 3159 216 -3166 -5118 -4991 -3131 -360 2317 4540 5346 3690 676 -2535
841b535k079k91J485K397K826K606N65r47k865k996k484l24Q71K233K832K612
$$ -2535 -4614 -4905 -3420 -1023 1803 4409 4974 4027 1162 -1834 -4318 -4642 -3771 -1538 1294 3906
857C906Q70q84k473k695k182j094K93K183K776K938J186q45j858k992k268j507
$$ 3906 4776 3892 1419 -1276 -3458 -4552 -4259 -2076 700 3638 4824 3979 2121 -871 -3139 -4646
873d646L09K121K728K494J705n08j634k498k787j601o5J634K795K485J514L12
$$ -4646 -4337 -2216 512 3006 4711 4203 2569 71 -2716 -4317 -4382 -2748 47 2532 4046 4358
889D358j535k383k596k071o08J926K402K752J534J87p43k180k860k317j84J211
$$ 4358 2823 440 -2156 -4227 -4835 -2909 -507 2245 3779 3966 3223 1043 -1817 -4134 -4318 -3107
905c107K005K479J945J320o37k774k613k341o42J119J703K306K165J251l63j984
$$ -3107 -1102 1377 3322 4642 4005 1231 -1382 -3723 -4365 -3246 -1543 763 2928 4179 3816 1832
921A832k791k195q29O10J534K107K251J892m75k128k215k231j262M15J133K313
$$ 1832 -959 -3154 -3983 -3373 -1839 268 2519 4411 3936 1808 -407 -2638 -3900 -3485 -2352 -39
937c9K409J717k43j711k277j721j659p04J382K544K445J663j24j014j958k053
$$ -39 2370 4087 3844 2133 -144 -1865 -3524 -4228 -2846 -302 2143 3806 3682 2668 710 -1343
953a343k105p12J224K436K028J678J41n34j570k530k102n20Q84K091K215J531
$$ -1343 -3448 -4160 -2936 -500 1528 3206 3347 2813 1243 -1287 -3389 -3909 -3025 -934 1281 2812
969B812Q35j92j833l212j970k67J183J203K169J762J369n51j721k419j851q67
$$ 2812 3647 3455 1622 -1590 -3560 -3827 -2644 -1441 728 2490 3859 3308 1587 -832 -2683 -3550
985c550N96J122J784K270J277J52k130k206j498q30k26Q02J739L244J214n63j509
$$ -3550 -2954 -1832 -48 2222 3499 3651 1521 -685 -2183 -3013 -3239 -2437 -698 2546 3760 3197 1688
1002A688j441j544j847l03Q50K464K035J404n0j009j716j781j589n25N83K260
$$ 1688 247 -1297 -3144 -3447 -2597 -133 1902 3306 3256 2247 531 -1250 -2839 -3364 -2781 -521
1018e21K223J135k2m49j149k138k066p47J331J806J366J105J208k74j448k274
$$ -521 1702 2837 2815 2366 1217 -921 -2987 -3734 -2403 -597 769 1874 3082 2808 1360 -914
1034i14j776k79K61J362J751J318J442K6j213k673j531m81J97R95J110K072J580
$$ -914 -2690 -2969 -2708 -1346 405 1723 3165 3191 1978 -695 -2226 -2707 -2510 -1515 -405 1667 3247
1051C247k03j289k396j121p84m5N08J721K181J030l0j060j548j612q65p84Q59
$$ 3247 3044 1755 -641 -1762 -2546 -2591 -2083 -362 1819 2849 2819 1759 211 -1401 -2266 -3050 -2191
1068b191J857J816J615m17r16j098j871j398q77P68K181J741J091M14l96j370
$$ -2191 -334 1482 3097 2680 1764 666 -1205 -2603 -3480 -2712 -531 1210 2301 2715 2319 949
1084I49j608k204j90J150J274J507R34O75j0q49k357j550l82Q62M74J587J061
$$ 949 -659 -2863 -3053 -1903 -629 878 1812 2487 2477 1628 -729 -2279 -2661 -1799 -1325 262 1323
1101A323J200L79j571k107j413n2q6O84J351J794J348J75j480j618j425m28l64
$$ 1323 2523 2902 1331 -776 -2189 -2241 -2327 -1643 -292 1502 2850 3025 1545 -73 -1498 -1926 -2290
1118b290O05J324J608J518n35r28j409o53q72r22L67J735J681P78K25p56q08j419
$$ -2290 -1685 -361 1247 2765 2230 1302 -107 -760 -1632 -2554 -2187 -452 1229 2007 2232 1476 668 -751
1136g51j147p63O22J501J511N67L21K49j009j783j386o38Q08J413R42N17J151
$$ -751 -1898 -2661 -2039 -538 973 1540 1861 2110 1101 -682 -2068 -2706 -1898 -485 457 974 2125
1153B125m6j158j401j220l16L63Q68P96J279P60M77j300j575j135k35N0M20R18
$$ 2125 2079 921 -480 -1700 -2016 -1653 -785 11 1290 2050 2527 1227 -348 -1483 -1718 -1668 -1248 -330
1171c30J395J191l8j022j448r88L6m56K49Q96J774P38j99q50q16o68r15m56K05
$$ -330 1065 2256 2218 1196 -252 -1240 -1204 -1660 -1411 -515 1259 1997 1798 948 132 -536 -1451 -1907 -1702
1190a702J253J472P35K13m65r70p89j191o43J29J346J102R96L25m53l46j253j475
$$ -1702 -449 1023 1758 1971 1506 536 -253 -1444 -2087 -1958 -612 490 1486 1811 1358 1012 -241 -1716
1208a716j53M43J104P68O76M57k1k95j341j136m84L32N89R60P94O06M1q59j002
$$ -1716 -1869 -1426 -322 446 1122 1579 1558 1263 -78 -1214 -1698 -1366 -777 183 977 1583 1624 765 -237
1227b37j030r1Q2L18N85J265Q88K56j077q80r39p14q5K85J024R67J337m00o49
$$ -237 -1267 -1358 -1276 -958 -373 892 1780 2036 959 79 -860 -1574 -1659 -1374 -350 617 1954 1554 905
1246I05q71l55p87m33j23J631R94K62J13j33o40r79o67n65L05J092P58M52L26
$$ 905 34 -321 -1108 -1541 -1664 -33 961 1223 1336 1203 563 -416 -1083 -1648 -1343 -251 507 959 1285
1265A285k14k38q27j013o45L89R89P08M21L15M34q33q70r19l44J05P52L21N49
$$ 1285 1071 833 6 -1007 -1652 -1263 -274 434 855 1170 1604 771 -99 -1018 -1362 -1257 -505 -184 365
1284C65R07J49p85n70j179J18r7J83O54Q10P94K62n57j182n21k46l83K53N43J046
$$ 365 1272 1421 636 66 -1113 -995 -1092 -909 -255 555 1349 1611 1054 -128 -649 -895 -1278 -1025 -482 564
1304E64P23J37o19p98k45r41n2N8O33J069M03J83j47o71k89p07o09J97O82O76
$$ 564 1287 1424 805 7 -238 -1179 -1231 -1173 -540 529 932 1115 968 297 8 -699 -1308 -1111 -429 247
1324B47O01J44Q6j07q51q46n37K38N97O04M62M42k9J16r78p09m06k35L71N83Q71
$$ 247 848 992 1078 971 120 -726 -1263 -1025 -428 176 638 1080 1051 1167 189 -520 -926 -1161 -790 -207 664
1345F64L10Kk65r53l86l25J0K70L65P34O02q9j11l98p65n08L4j84N57O19O97J99
$$ 664 974 976 711 -242 -628 -953 -943 -673 -308 426 1028 939 828 430 -335 -843 -809 -993 -436 183 880 1079
1367A079k27o75k49o01l06j95O28P31M53J30j2l17k93n16o89J92J54Q21O66K10
$$ 1079 852 177 -72 -673 -979 -1174 -546 185 638 768 756 439 146 -370 -1059 -867 -713 108 774 984
1387I84j56r8p23o25p2j44L94M42K3P98L3j61n89l79m05j74M08J90N59M55K3L41
$$ 984 828 730 7 -618 -690 -834 -440 2 25 823 856 695 106 -273 -678 -852 -444 -254 305 760 783 1124
1409A124j013o34l10j27N94N9N19L75K69m35j4n99o15K03j79O53O6M75L51N4j97
$$ 1124 111 -523 -833 -960 -366 -307 212 587 856 421 407 -192 -807 -604 -783 -130 -64 411 762 816 619
1430F19o26k41l44m3L33L00O75N9k92k84P9m95j61j6P2L44N16J4L27k49o21q5
$$ 619 -7 -248 -592 -635 -302 -2 673 732 440 156 235 -260 -421 -437 -365 -21 495 509 836 587 -34 -119
1452a19m34j89K75L19M51L30O8j0k59p21n5m14K44L33K89K21Q7J50j30o42k8k88
$$ -119 -553 -742 -467 -148 303 633 701 691 432 -289 -344 -758 -514 -181 108 329 416 566 436 -206 -234 -522
1474e22k73N35L13J84N02j40j61l17m93j02k47j1J91J008J76K97n33k07n03l08
$$ -522 -795 -260 53 237 739 599 438 121 -372 -474 -721 -732 -541 467 643 940 407 200 -303 -611
1494f11j10J68M89L44M14j98rm75n9n10p8J28L03L11M13O8k2j71n00j53k83j84
$$ -611 -721 -553 -64 280 694 496 487 12 -47 -557 -635 -507 -204 107 520 588 566 395 -105 -258 -541 -725
1516g25P05J50J61L89J01m13k70l96m74J28K89L00L05K52M38l65k42m83j64k17
$$ -725 -20 130 291 680 781 368 98 -298 -772 -644 -355 -55 250 502 940 575 333 -150 -314 -531
1536e31K78J9N33L39j36j35r7n23J0o77K52L95N69L38k11j3N3m14j60p20L78K87
$$ -531 -253 -234 299 638 502 367 270 -253 -243 -920 -668 -273 296 634 423 410 463 49 -111 -831 -453 -166
1558a66J67L64J14m2j58k04l45k23k66N60L15m6K52L63k43k86n48j38J69p6O42
$$ -166 1 365 479 437 279 75 -270 -493 -759 -199 116 70 322 685 442 156 -392 -530 -361 -437 205
1579B05qM19K6n6o0m96m48j72K83R0M89m4M16P2m12k27m36j25r0K11K37O61R0
$$ 205 197 616 642 586 526 30 -418 -590 -307 -217 272 228 644 716 304 77 -359 -484 -574 -363 -126 535 625
1602F25j06j32l72n55p6j44J84N21L05L09%l91n8m81k06k23L83M93J31L44k6j14
$$ 625 519 387 15 -540 -616 -760 -576 -55 250 559 559 168 110 -371 -577 -800 -417 76 207 551 525 411
1624D11k58o96L1j13J20L58L31J62J70k72L04p93l50l18O69M48l10N50N0L91n21
$$ 411 153 -543 -512 -625 -505 -147 184 346 516 244 548 -245 -595 -913 -244 204 -106 444 494 885 364
1645C64m38k88j76p9N15j11M33O06j92j17m37n46j0l1K69J41J23M43L39n32m82
$$ 364 -74 -362 -538 -617 -102 -213 220 826 634 517 80 -466 -476 -507 -238 -97 26 469 808 276 -206
1666b06j82l46J7L31K51L92L15J34l05j73l20o57J16K21K84N08K85l84L92m35
$$ -206 -388 -734 -717 -386 -135 257 572 706 401 228 -92 -749 -633 -412 -128 380 665 281 673 238
1686B38m39Km87j1M98O11J05K67j50m91l21j44j83j48M41M51J07J84J17n83k35
$$ 238 -201 -199 -686 -697 -199 412 517 784 634 143 -178 -322 -505 -653 -212 239 346 530 647 64 -171
1707a71j81j94q7K55M37Q9O06O0o46j13l83m31Q3J85N70L24J72K71l73n03m19
$$ -171 -352 -546 -633 -378 59 148 754 814 168 55 -328 -759 -676 -491 79 403 575 846 473 -30 -449
1728d49j82K45J88P8K93M38r9J40n98k80k17RRJ78O03K76p1O5j35q15j44k75K76
$$ -449 -631 -386 -198 -120 173 611 512 652 54 -226 -443 -434 -425 -247 356 632 561 626 491 -324 -468 -743 -467
1751d67L11M06K42K44j19j69n85m01l28Q1N89M21L60J60k34n6n63k38l73mM40
$$ -467 -156 250 492 736 617 448 -137 -538 -866 -785 -196 225 585 745 511 455 -108 -346 -719 -723 -283
1772b83J91M38M25K16m18n04p15l3N7J66J41N10N28l7J74o25p57m8m14M97K22
$$ -283 -92 346 771 987 569 65 -650 -683 -626 -460 -319 191 719 682 856 231 -526 -574 -988 -491 -269
1793b69L79M04J07j56j87k80p42k6J31L56M19M68M0p5k64m67m9n20k83Q66L45
$$ -269 110 514 621 465 278 -2 -744 -770 -639 -283 136 604 644 569 305 -162 -211 -731 -1014 -148 197
1814A97N65mk52L9o46k05o0j07K58J40L49J84N7k77k63o10j75J55K72J16M87O50
$$ 197 762 758 506 545 -101 -306 -366 -473 -215 -75 274 458 515 238 -25 -635 -810 -655 -383 -267 220 870
1836H70m04L24q22l36j84j41L85L17K57K34J71j47n99m09o5k61L31m8P62L71j44
$$ 870 466 790 -32 -368 -552 -693 -308 9 266 500 671 524 -75 -484 -549 -810 -479 -527 235 606 462
1857D62P9m14n89Q3l16K26L40J44O28j04J64m56l80m09j8n4L38O23J20J14L23
$$ 462 541 127 -462 -379 -695 -469 -129 15 643 539 703 247 -133 -542 -560 -614 -276 347 467 581 904
1878I04m52m99m57j00L8K76M37K24L86l15J98m92l79m08j76N36M58J20L2L92k60
$$ 904 452 -47 -504 -604 -566 -290 147 371 757 442 640 148 -231 -639 -815 -279 179 299 331 723 463
1899D63j94n06L9o02L87K04O11j2M31m71k55l84r5l23L91Q9L62K76K09j7l35l90
$$ 463 269 -237 -198 -800 -413 -209 402 390 821 350 95 -289 -384 -707 -316 -227 135 411 620 603 268 -122
1921a22l68j85L00L7M82P46m44m2l36j9p70M27k21K32M04N47r9qm76J36p39l13
$$ -122 -490 -675 -375 -338 144 890 446 404 68 49 -721 -294 -515 -283 121 668 569 561 85 221 -518 -831
1943h31M06J62K21N58PM5k84k28k50p21M37j38Q98J9M35k30j76j14m17m01o8K73
$$ -831 -425 -263 -42 516 523 568 284 56 -194 -915 -478 -616 282 301 736 506 330 216 -201 -602 -670 -397
1965c97L52J7P15k11N2m71l79l30J25R2L09K85J43K12K1m40l49l25LR0K38K04
$$ -397 -45 -28 687 476 528 57 -322 -652 -527 -435 -126 159 302 514 535 95 -254 -579 -576 -486 -248 -44
1987d4M11J57lk41n54j52l36M18q0O07L10K09m18Nm52q4r2m40M92L89J79L09j47
$$ -44 367 524 521 280 -274 -426 -762 -344 -424 183 493 702 284 289 -163 -247 -339 -779 -287 102 281 590 443
2010D43k18j81l17k72kJ05N67J27J3J41j10j66m76l49K43J9M59M35j83L65K4m26
$$ 443 225 44 -273 -545 -547 -442 125 252 265 406 296 130 -346 -695 -452 -433 26 461 278 643 667 241
2032B41j69n65j56K97l5O60RL00j10l26l44m06J58j23M78N22q9K70l17m1l27k1
$$ 241 72 -493 -649 -352 -387 273 282 582 472 146 -198 -604 -446 -569 -91 431 342 612 295 254 -73 -94
2054i4n34J81L89J80K92j12L03j71n67p0k34R5K55K0L83K34rj94k51o21j13K44
$$ -94 -628 -447 -58 122 414 302 605 434 -133 -203 -437 -342 -87 -67 316 550 541 347 96 -525 -638 -394
2076c94OM13K4L15J37l24k47j35p1q6k2L95L91j68M44n18o8l42j48k98J11R4P17
$$ -394 -388 25 49 364 501 177 -70 -205 -276 -362 -384 11 402 234 678 160 92 -250 -398 -696 -585 -491 226
2099B26J06Q5K51n32n0k42m40L04J36K74j05L09Q3m10j00Ok71j16M28J33L72K74
$$ 226 332 417 668 136 86 -156 -596 -292 -156 118 13 322 405 -5 -105 -99 -370 -486 -58 75 447 721
2121G21j03n17l4l44k10N1M3K54K34K90j06l0k0j97k91k09k2M60R6L70q6k93K25
$$ 721 618 101 67 -277 -487 -436 -393 -139 95 385 279 249 229 32 -259 -468 -490 -30 66 436 350 57 282
2144B82m51k0k43K25J58K03L98j09j11l57J22n15K22k33J85L86O8K34j87j76j28
$$ 282 -169 -189 -432 -207 -49 154 552 443 332 -25 97 -418 -196 -429 -244 142 210 444 257 81 -47
2165d7l33m15N83n8N22q0J40J5k74k02k04j3J38J07K88m6L25j3k55n0l57J18k1
$$ -47 -380 -795 -212 -270 252 172 312 327 53 -149 -353 -366 -228 -121 167 121 446 433 178 128 -229 -111 -132
2188a32K11NO0J55L82n46M8m91K35l65K32n3M63n5N2K32m67n3l32n3N7O71j32
$$ -132 79 84 144 299 681 135 183 -308 -73 -438 -206 -259 204 149 201 433 -34 -87 -419 -472 -415 256 124
2211A24P5L5j01j6k12l46K00K6R5N00m25O57l42j75k31k59P9J23N8K63m7L34j61
$$ 124 199 234 133 117 -95 -441 -241 -215 -120 380 -45 612 270 95 -136 -395 -316 -193 -135 128 81 415 254
2234B54mk17l90j20K96j13J05L76K22n0m6j57l05k48m1L38K6J04J72K58m50m8
$$ 254 250 33 -357 -477 -181 -294 -189 187 409 359 313 156 -149 -397 -438 -100 -74 30 202 460 10 -38
2256c8l26J82j43L48j37J52K98j25j97k4k55J96k70J37p3J88M86k88K10j57l47
$$ -38 -364 -182 -325 23 -114 38 336 211 14 -10 -265 -69 -339 -202 -275 -87 399 111 321 164 -183
2277a83j69PJ94Q9J92J86J0j24R8m50J47l60J9J68L00j48M92l6l19k69K8L7j71
$$ -183 -352 -345 -151 -62 130 316 326 202 300 -150 -3 -363 -344 -176 124 -24 468 432 113 -156 -128 -91 -262
2300b62K07J7L05r8Jo0o6p0p1k52M26j97K88L7j35J22j49n4m01J28rJ0K60M16
$$ -262 -55 -38 267 169 170 110 44 -26 -97 -349 77 -120 168 205 70 192 43 -11 -412 -284 -293 -283 -23 393
2324C93J6j79k94J10l30J65j19K50Q1p0L70J0k75L3m23k25K81k21N16J68j89m
$$ 393 409 230 -64 46 -284 -119 -238 12 93 23 393 403 128 161 -262 -487 -206 -427 89 257 68 64
2346F4P4l19l6J9R1j81Q0M54j76J42k22l19K17j31K12o5O5M0M70l21N7j82k24
$$ 64 138 -181 -217 -198 -107 -288 -208 246 70 212 -10 -329 -112 -243 -31 -96 -31 9 479 158 215 33 -191
2369a91j72L74o9k8J17J43k3K5K6k25k11J41J05L7J7n4lJ76K5o4l86j29q2J94
$$ -191 -363 11 -58 -86 31 174 151 176 202 -23 -234 -93 12 49 66 12 9 185 210 146 -240 -369 -451 -257
2393b57J18M23k44K81l18j13J27j24j92P4q3N62j59J20r0P8m5l29L3l8R7p4L76
$$ -257 -139 284 40 321 3 -110 17 -107 -299 -225 -308 254 95 215 125 203 158 -171 -138 -176 -79 -153 223
2416B23k56M01l48P8l24PK8K06Q9mJ46j59n9j39l1J64k2r4J11K22k36K57L69q64
$$ 223 -33 368 20 98 -226 -219 -191 15 104 100 246 87 28 -111 -142 22 0 -94 17 239 3 260 629 -235
2440b35N2p4L62k78K57N7J58j66J45m62k3J82o7o1l4J9J93K56k78K84k73L7j91
$$ -235 -183 -257 105 -173 84 141 299 133 278 -184 -207 -25 -92 -153 -187 -168 25 281 3 287 14 51 -140
2463a40k25L99N7L2J21j52r4n0J76l86J87O0J12J23J1l9k79Q0m30J67Q0P5K12
$$ -140 -365 34 91 123 244 92 -2 -52 124 -262 -75 -15 97 220 231 192 -87 -7 -437 -270 -190 -115 97
2486I7r7L04k22j35jl8L40n01J55N0J07K10k85M3L1j01l3j6j47M71k30k8J40k8
$$ 97 0 304 82 -53 -54 -92 248 -253 -98 -48 59 269 -16 27 58 -43 -76 -92 -239 232 2 -26 114 86
2510H6K49m17O7j43J27lj42J53l8R1j95J68Om8m9J23J37oJ35m14K30r9j28K06
$$ 86 335 -82 -15 -158 -31 -34 -176 -23 -61 30 -165 3 9 -39 -88 35 172 166 301 -113 117 18 -110 96
2534I6mj3J2o8J00j93L43o81J50K66m9j13K40j55K33j10J98M0n33k12M78j40J01
$$ 96 92 79 91 23 123 -70 273 -408 -258 8 -41 -154 86 -69 164 54 252 292 -241 -453 25 -115 -14
2557a4P1K26j65k93J46l5j6n6j61N86k33k1J20j59k0mL1l35L63j37K39j34J73
$$ -14 57 283 118 -175 -29 -64 -80 -136 -297 289 56 35 155 -4 -24 -28 3 -332 31 -106 133 -1 172
2580A72j47K2L2l86J53M3n6J75R0M04l03j66jk16L40k87J82j43M23k04JQ4k27
$$ 172 25 47 79 -307 -154 -111 -167 8 98 502 199 33 32 -184 156 -131 51 -92 331 127 128 212 -15
2603a5RO2k86J49j71O08l51J31r4j10J54j99q3K55j11J25k70J05L08l60J25n6
$$ -15 -6 56 -230 -81 -252 356 5 136 42 -68 86 -113 -196 59 -52 73 -197 -92 216 -144 -19 -75
2625g5j99K07P8K59l37J34j49K71j31j16l5j20K69j79N2P0Q1L1K0Qk95K4RQ7J97
$$ -75 -274 -67 11 270 -67 67 -82 189 58 -58 -93 -213 56 -123 -71 -1 80 111 131 139 -156 -132 -123 -36 161
2650A61j83K59k28m0n1K00k35Q8K70j66L0K2j12J20j86j0j24J90J15q0P0j74m4
$$ 161 -22 237 9 -31 -82 118 -117 -29 241 75 105 127 15 135 -51 -61 -185 5 120 40 110 -64 -108
2673a08j15J28n9L65k39jJ13o1m6K25j24o4k39q2K11l7J42K26p8j88J1J61k81
$$ -108 -223 -95 -154 211 -28 -29 84 23 -23 202 78 14 -225 -307 -96 -133 9 235 157 -31 -20 141 -140
2696a40K44pj05j07K63j38J8j9k40L72k96j28OJ49J98k11K66J93n40L21k1O6n08
$$ -140 104 97 -8 -115 148 10 28 9 -231 141 -155 -283 -277 -128 70 -141 125 318 -222 99 78 144 -364
2719c64L54J6P6j0J45k60n6m0J64k20R9JP2J42j42P1O9q4k36J13M35j04o9l3R1
$$ -364 -10 6 82 72 217 -43 -99 -139 25 -195 -96 -95 -23 119 -23 48 117 33 -203 -90 345 241 172 139 230
2744B30l55K52k8l03J61j65L11l20m8K90J70j11r3j93K35l6j28R7r1J54j19j2
$$ 230 -125 127 99 -204 -43 -208 103 -217 -265 25 195 84 -9 -202 33 -3 -131 -34 -125 29 -90 -102
2766a02j99J72M1j1J80n4J38m1R3m76M30o3l89O9J81m6J2J09j28R3O2k50M9K68
$$ -102 -301 -129 -88 -99 81 27 165 124 217 -259 171 108 -281 -212 -31 -77 -65 44 -84 9 71 -179 -130 138
2790A38k11R7L1j4j66K42r2r2m5J60p9o5K75j74j78M75l97R6j45J32M2J3j11k6
$$ 138 -73 24 55 41 -125 117 25 -67 -112 48 -31 -96 179 5 -173 302 -95 1 -144 -12 30 43 -68 -94
2814i4j7J21l4n0L9J4k41K97o7K36k8k1L5r5j16j38k54K36J97L18l85K77P5k18
$$ -94 -111 10 -24 -74 -35 -21 -262 35 -32 204 176 155 190 95 -21 -159 -413 -177 20 338 -47 230 305 87
2838H7r4k65J34J47o8K99k47K37j65J7k98qJ99j02J01k50K63O5j41K89j88l05
$$ 87 -7 -272 -138 9 -59 240 -7 230 65 82 -216 -224 -25 -127 -26 -276 -13 52 -89 200 12 -293
2860b93L00k05J98P0j5k36J19N5j41j9Q6R3l86L50j24J67K1o2L14m07J27O4n4
$$ -293 7 -198 0 70 55 -181 -62 -7 -148 -167 -81 12 -374 -24 -148 19 40 -22 292 -115 12 76 22
2883B2j21L57l25L44k00Q3l61L27l50K21j34P4m1L26q4j10N4r0n3k27K07K39L8
$$ 22 -99 258 -67 277 77 160 -201 126 -224 -3 -137 -63 -104 222 138 28 82 -8 -61 -288 -81 158 196
2906A96k65m8J95m6n1j5r5o6k34M63k70N08k49L72n31J72l36K41P8j88N09l56
$$ 196 -69 -117 78 32 -19 -34 -129 -195 -429 34 -236 272 23 395 -136 36 -300 -59 19 -169 340 -16
2928a6PK03n3j04m2m10N30p7J6L0j39j77O16o00N23l30J87k80J93J82r3j43J8
$$ -16 -9 194 141 37 -5 -415 115 38 54 84 -55 -232 384 -216 307 -23 164 -116 77 259 166 23 41
2951D1J24m16O0L14j86N8k7K49N8l06J85j59J7j89J31RJ14p4j31M79l58j29j74
$$ 41 165 -251 -191 123 -63 -5 -32 217 275 -31 154 -5 12 -177 -46 -37 77 3 -128 351 -7 -136 -310
2974c10r8J98p8M18N6k23R2n9L8l30J40L5J34l8J2RP3K2j72J3J4N2j33J11j0J13
$$ -310 -408 -210 -288 130 186 -37 55 -4 34 -296 -156 -121 13 -25 -13 -4 69 91 -81 -68 -54 -2 -135 -24 -34 79
3000G9J1j11Q3m8k45j37K68J98j28J30L7J23m07K14k33m6%K78q2J49r0R6k61J80
$$ 79 90 -21 62 14 -231 -368 -100 98 -30 100 137 260 -147 67 -166 -212 -212 66 -16 133 43 139 -122 58
3024E8k12K89k39P3J42P4M5k19J3j10j92K15k35J13L32K7j44J81k27Q0K65k91
$$ 58 -154 135 -104 -31 111 185 230 11 24 -86 -278 -63 -298 -185 147 174 30 211 -16 64 329 38
3046C8p0j33j39L49K45j54N7k97R6q9K9j49K68j36J28p7L2OL3m5j51o9L29Q0l82
$$ 38 -32 -165 -304 45 290 136 193 -104 -8 -97 -68 -217 51 -85 43 -34 -2 4 37 -8 -159 -228 101 181 -201
3071b01K51K05O7l28N3K9J59l88J83R6J16r4nj87Qk38K97N8n4J11lj39J10j35
$$ -201 50 255 322 -6 47 76 235 -153 30 126 242 148 143 -44 -36 -274 23 81 27 138 135 -4 106 -29
3095b9k39J20r5J00K71l18J82n6%k3j47Q6j62J14J18L9N36j35k48j26N8j31r9
$$ -29 -268 -148 -243 -143 128 -190 -8 -64 -64 -87 -234 -148 -310 -196 -78 -39 497 362 114 -12 46 -85 -184
3118a84j16m7M40J77l0j01j1l0l80J18J23k80N52k11J22m5J10k18r0k26L26O2
$$ -184 -300 -347 93 270 240 139 128 98 -282 -164 -41 -321 231 20 142 97 207 -11 -101 -327 -1 61
3140F1k49M02j00j51K58m54RK28m06L18J60J6r5K45j75J7j83M8o0m6j38M56j77
$$ 61 -188 214 114 -37 221 -233 -224 4 -402 -84 76 92 -3 242 67 84 -99 -51 -111 -157 -295 161 -16
3163a6J29O1j34l32M14j95j48J41K03J97K1l93r2J01N2r7N8O0r5K46J85J06k22
$$ -16 113 174 40 -292 122 -73 -221 -80 123 320 341 -52 -144 -43 9 -88 -30 30 -65 181 366 472 250
3186B50k39l47L16j71Q8n1L79p8k48L32k66M0l82J65m8N1K57M6J69k96l33L04
$$ 250 11 -336 -20 -191 -103 -154 225 147 -101 231 -35 5 -377 -212 -260 -209 48 94 263 -33 -366 -62
3208f2m2j32O3J04J33K10K6k29j96J95k17j01n1N34k73J49J42l98J56k12j26L25
$$ -62 -104 -236 -173 -69 64 274 300 71 -125 70 -147 -248 -299 235 -38 111 253 -145 11 -201 -327 -2
3230bo7J19j64L45O6j53n9m5Q0l85K46K4K60j94N6N4k04Lr6m0j96J54j24M14o1
$$ -2 -69 50 -114 231 297 144 85 40 120 -265 -19 5 265 71 127 181 -23 -20 -116 -156 -352 -198 -322 92 31
3255C1J82l43J53j68j04J10o3J71J84K1J64k69J41m35j51R4n7O23j43O0rj6j55
$$ 31 213 -130 23 -145 -249 -139 -202 -31 153 174 338 69 210 -225 -376 -282 -339 284 141 201 192 176 21
3278B1r6k15m8K34Q0K21J04Qk62J09k78K03p3j03J83j84L06o6L81m34o0p8L8m
$$ 21 -75 -290 -338 -104 -24 197 301 309 47 156 -122 81 8 -95 88 -96 210 144 525 91 31 -47 -9 -13
3302a3p9L14j1j75K41j28m15J25k36R2K42R0Q5p8J69j19j34l70K27p6L19l5J08
$$ -13 -92 222 211 36 277 149 -266 -141 -377 -285 -43 47 132 54 223 104 -30 -400 -173 -249 70 35 143
3325A43J10O2j1l21j93R8n7J54NL01k7l04K88k71K26m58J34q3J29K31j00J51q5
$$ 143 253 315 304 -17 -210 -112 -169 -15 -10 291 264 -40 248 -23 203 -255 -121 -204 -75 156 56 207 122
3348A22l11J73k79N9J50J32R3k45N23k05k60j9j85Q4m0J10J98k21K39Ln9m7l02
$$ 122 -189 -16 -295 -236 -86 46 139 -106 417 212 -48 -67 -252 -168 -208 -98 100 -121 118 121 62 15 -287
3371b87o8K24O8K22j05J45R2q1q8Or7k30M1J08K09M20m7l51k77k9j87O4r4R5L26
$$ -287 -355 -131 -63 159 54 199 291 210 122 128 31 -199 -158 -50 159 579 532 181 -96 -125 -312 -248 -342 -247 79
3396G9j91J81J33o1k15k48K21k17J66M38o3k26K22j75l88M22k54J69L1J32m8L1
$$ 79 -112 69 202 141 -74 -322 -101 -318 -152 286 223 -3 219 44 -344 78 -176 -7 24 156 108 139
3418A39L79m88j79J5k16J3K20p2M15n5J23k73k7k01J75k16K52J36R8K53k51j26
$$ 139 518 30 -149 -134 -350 -337 -117 -189 226 171 294 21 -6 -207 -32 -248 4 140 238 491 240 114
3440A14j64p0M3k51K28Q9K68J8K2o8j32n2l45K04j32J33O4L11k61M3k7J78k81
$$ 114 -50 -120 -77 -328 -100 -11 257 275 297 229 97 45 -300 -96 -228 -95 -31 280 19 62 35 213 -68
3463f8p8R7j28J91J21K9L5m11J63j34l27K69L60j32L30k00ml62Q2K7mL09j66K9
$$ -68 -146 -49 -177 14 135 164 199 -212 -49 -183 -510 -241 119 -13 317 117 113 -249 -167 -140 -144 165 -1 28
3487B8Q4J4J59n77K07j78K2K20m0M5J08O9L9j43J63n12L2l1J04L76J40k23K63
$$ 28 112 126 285 -292 -85 -263 -241 -21 -61 -16 92 161 200 57 220 -292 -260 -291 -187 189 329 106 369
3510C69m5l73o0l93L81J3R8L3M32l74n3j31j69M33l20OO6j41M45n5n9k17p0L32
$$ 369 324 -49 -109 -502 -121 -108 -10 23 455 81 28 -103 -272 161 -159 -153 -87 -228 217 162 103 -114 -184 148
3534A48m91K88o8J34N8k5nJ35l27k87K34J23k95N46L0P2k07N5k42K78n09L53Q3
$$ 148 -343 -55 -123 11 69 44 39 174 -153 -440 -206 -83 -378 168 198 270 63 118 -124 154 -355 -2 81
3557H1N7R8j87m5k8M9j98j20J57J45K60l47o7L49j50m4k20j40K47o6J82j36K30
$$ 81 138 236 49 4 -24 25 -173 -293 -136 9 269 -78 -145 204 54 10 -210 -350 -103 -169 13 -123 107
3580A07O1lL1k92O9l78PL73J00MJ99j54k30J14l46J9J17K65L0M2J07l23J38j69
$$ 107 168 165 196 -96 -27 -405 -398 -25 75 79 278 124 -106 8 -338 -319 -202 63 93 135 242 -81 57 -112
3604a12j43j48LN26J65j34N1k71K0P0k11K91m92J76K51k40M06n8l92J42k4m40
$$ -112 -255 -403 -400 126 291 157 208 -63 -43 27 -184 107 -385 -209 42 -198 208 150 -242 -100 -124 -564
3626e64K70J18K38L68j85j51rJ63m37j47J67J13K35j41L2M3p6K1J7j97n0k28L87
$$ -564 -294 -176 62 430 245 94 85 248 -189 -336 -169 -56 179 38 70 113 37 58 75 -122 -172 -400 -13
3649a3o0J91L00j89J16m24j81j40J56J44J55n8J33k18J34k68mq4J85j07K35jK04
$$ -13 -73 118 418 229 345 -79 -260 -400 -244 -100 55 -3 130 -88 46 -222 -226 -310 -125 -232 3 2 206
3672B06J9j87k10j49K83l93N52j87K28q3J36Lj76N3m05L59j78N43j81k8p8n1j1
$$ 206 225 38 -172 -321 -38 -431 121 -66 162 79 215 218 42 95 -310 49 -129 414 233 205 127 76 65
3695F5j80k43M6j6K85J91M5N0j03j32l7J22j48J86k30Q4L35k4l72K11l98P2K48
$$ 65 -115 -358 -312 -328 -43 148 193 243 140 8 -29 93 -55 131 -99 -15 320 296 -76 135 -263 -191 57
3718E7j20j53J64R5Rj00J62k46M1R2j68JK89OK57l83p2L4J28j55k15K88k48M35
$$ 57 -63 -216 -52 43 52 -48 114 -132 -91 1 -167 -166 123 129 386 3 -69 -35 93 -62 -277 11 -237 198
3742A98K9k26P8J23o00M57j95J28J09J34J71q6k76k18m9R8jL6J54L54m69L11j11
$$ 198 227 1 79 202 -398 59 -136 -8 101 235 406 320 44 -174 -223 -125 -126 -90 64 418 -51 260 149
3765A49r5j01K2k16J73J43oj6N8j42l00K03n7NR9L10l45L89m3m1j28j82j55J87
$$ 149 54 -47 -25 -241 -68 75 69 53 111 -31 -331 -128 -185 -180 -81 229 -116 273 230 189 61 -121 -276 -89
3789h9k53L18J02l9J14J51j94k11p9N1j49K49j35J99m4K69q7k77j49M1J26j40
$$ -89 -342 -24 78 39 153 304 110 -101 -180 -129 -278 -29 -164 35 -9 260 173 -104 -253 -212 -86 -226
3811b26L03K9R6K55l89J84k28j96K95n3k18K03M2J38j20Jl26J30n4j81M07j27
$$ -226 77 106 202 457 68 252 24 -172 123 70 -148 55 97 235 115 116 -210 -80 -134 -315 92 -35
3833c5J46J23j01k00K51m65j56N80m45K50J69J3J24l69j20N7J70n0j67L98j22
$$ -35 111 234 133 -67 184 -281 -437 143 -302 -52 117 130 254 -115 -235 -178 -8 -58 -225 173 51
3854E1J50J0j54j33Q8J61l15J57R7K21j72k6p2j17o6k7L0K15j23J63j27J16kN5
$$ 51 201 211 57 -76 12 173 -142 15 112 333 161 135 63 -54 -120 -147 -117 98 -25 138 11 127 125 180
3878A80l71L16l62j54O37l7J4l92M25l68k02K48J6J82j22J3j13K30j12p2j07l3
$$ 180 -191 125 -237 -391 246 209 223 -169 256 -112 -314 -66 -50 132 10 23 -90 140 28 -44 -151 -184
3900a84p1L27k71J90K0N9K59l83K30l19Nk42M28M1P9P6j61r1p0J43j20j28O3J56
$$ -184 -255 72 -199 -9 11 70 329 -54 176 -143 -138 -380 48 89 168 244 83 -8 -78 65 -55 -183 -120 36
3924C6K32Jj81K34m29Q5J0m47L97k29L05pQ8k6r4k81k75L81k59L21N26N9m70L60
$$ 36 268 269 88 322 -107 -22 -12 -459 -62 -291 14 7 95 69 -25 -306 -581 -200 -459 -138 388 447 -23 337
3948C37m71J58n6K0j17j47J57L07j47p7ON3k87J11J38J1K7J55n4Q2p1l87K21j12
$$ 337 -134 24 -32 -12 -129 -276 -119 188 41 -36 -30 23 -264 -153 -15 -4 23 178 124 206 135 -252 -31 -143
3972a43K31L6m56K55m8P0l0K59j51k20J41k04K50J97j00J67n15l1m2N12l01k5
$$ -143 88 124 -332 -77 -125 -55 -85 174 23 -197 -56 -260 -10 187 87 254 -261 -292 -334 178 -123 -148
3994a48K23k35J43Q8p7J75k00j45P0J31J61j74j7j66J98q8J04l54K41J55K05o08
$$ -148 75 -160 -17 71 -6 169 -31 -176 -106 25 186 12 -5 -171 27 -61 43 -311 -70 85 290 -318
4016c18N82j53M6o8k63N2%q6P9K64k14k8L70j26j04l15J00K74J48j57no4K90j24
$$ -318 264 111 157 89 -174 -122 -122 -208 -129 135 -79 -107 263 137 33 -282 -182 92 240 83 78 14 304 180
4040A80m4k73j34P2J93M0J48k47K25j53l00L22k32J21K67p5l4J51l4k38J80j00
$$ 180 136 -137 -271 -199 -6 34 182 -65 160 7 -293 29 -203 -82 185 110 76 227 193 -45 135 35
4062C5k71J44J30p3J01K68l03r0K32k23M4k10O5J51J27J50l03J30j15q7o6m1n5
$$ 35 -236 -92 38 -35 66 334 31 -59 173 -50 -6 -216 -151 0 127 277 -26 104 -11 -98 -164 -205 -260
4085b60L23L43j07k94K39k55l07jJ69OJ39J22o2K19k82J10K42l24n0k7J90j11
$$ -260 63 406 299 5 244 -11 -318 -319 -150 -144 -5 117 55 274 -8 102 344 20 -30 -57 133 22
4107B2J63j09m4j23K22k76M3N4k70P4J13L58qJ66j70j69R9j28k11J83r5N6j53
$$ 22 185 76 32 -91 131 -145 -102 -48 -318 -244 -131 227 219 385 215 46 145 17 -194 -11 -106 -50 -203
4130b03K30j8r9K84N3k36qk3Kr1K12k49K05k77J65n2J35j28J69J93o8k85P4J29
$$ -203 27 9 -90 194 247 11 3 -20 -18 -109 103 -146 59 -218 -53 -105 30 -98 71 264 196 -89 -15 114
4154A14m11J27J22O7k8N7J88l04j07lO4J27M5M5LO5k3j95J29j94L08m73K54Q4
$$ 114 -297 -170 -48 19 -9 48 236 -68 -175 -178 -114 13 58 103 106 171 148 -47 82 -112 196 -277 -23 61
4178F1j05Q1k8K34l35J81k61J58l1j8L31l8j23Q2j41p6j39N0l29L54K17j96K85
$$ 61 -44 37 9 243 -92 89 -172 -14 -45 -63 268 230 107 189 48 -28 -167 -117 -446 -92 125 -71 214
4201B14k67K01j41n1q2J08k16J46L20J3o3m4R5m34p1L62j10j25M24l53L54k91
$$ 214 -53 148 7 -44 -126 -18 -234 -88 232 245 182 138 233 -201 -272 90 -20 -145 279 -74 280 -11
4223a1J38k42j64J83j07J57J35M5k66M66n00P4k85J82M4q3R9J15J7j53K74J67
$$ -11 127 -115 -279 -96 -203 -46 89 134 -132 334 -166 -92 -377 -195 -151 -234 -135 -20 -3 -156 118 285
4245B85j82k43k41M20n8N5k22R2R2q3j16n4K44P2j10L33l35J1J52k59J96k08Q3
$$ 285 103 -140 -381 39 -19 36 -186 -94 -2 -85 -201 -255 -11 61 -49 284 -51 -40 112 -147 49 -159 -76
4268g6j1p2J01L27o4Rj57m33K74q9K30k90K44J36qq6r0J29J68j58l36K00K88k19
$$ -76 -87 -159 -58 269 205 214 57 -376 -102 -191 39 -251 -7 129 121 35 -55 74 242 84 -252 -52 236 17
4292A7J23Q2l37m6K43n3m9J52J78m2l96J01l7Pj92j6K51j63J44K22p2j06k8j25
$$ 17 140 222 -115 -161 82 29 -20 132 310 268 -128 -27 -64 -57 -249 -265 -14 -177 -33 189 117 11 -17 -142
4316a42j0K58l29L45J82q5k66N17j95k96j11M06k17k14K40J05j89J27n5R5q2j74
$$ -142 -152 106 -223 122 304 219 -47 470 275 -21 -132 274 57 -157 83 188 -1 126 71 166 84 -90
4338i0j05J42M0K3l3J02l00J04O6Q8j30q9K28K0%j38K47j48K48n69L06q7j40L03
$$ -90 -195 -53 -13 10 -23 79 -221 -117 -51 37 -93 -182 46 66 66 -72 175 27 275 -294 12 -75 -215 88
4362H8l3K4m4J19l20K68M8m69J45J86j62O4K21l48K71j38J29j10j56J99R3J67
$$ 88 55 79 35 154 -166 102 150 -319 -174 12 -150 -86 135 -213 58 -80 49 -61 -217 -18 75 242
4384B42m00L55k30J48k46m3Q6O0J17j89K79o2oM1l60J83J54m25L35l08M37L5n2
$$ 242 -158 197 -33 115 -131 -174 -88 -28 89 -100 179 117 111 152 -208 -25 129 -296 39 -269 168 203 151
4407A51k41K23N0l86J14OK28Op3p8k58K61k84L52j73J30J26q0P3k3j66J41L0R3
$$ 151 -90 133 183 -203 -89 -83 145 151 78 0 -258 3 -281 71 -102 28 154 74 147 124 -42 99 129 222
4431B22l34L00k57K94l54Q3k7J36l1j77j32M10j01o6m1J39o4J61R4k12J83m24
$$ 222 -112 188 -69 225 -129 -46 -73 63 32 -145 -277 133 32 -34 -75 64 0 161 255 43 226 -198
4453a98L82l67L59k76K1LM2j06M7J42L7Q7j72l13N92l06r9Q1J43j4j46r2L53j61
$$ -198 184 -183 176 -100 -79 -76 -34 -140 -93 49 86 173 1 -312 280 -26 -125 -44 99 85 -61 -153 200 39
4477C9P6mk71k08N47k81K54j69L27l04J07k01p5J70j63N34l10j64K55k14k4k1
$$ 39 115 111 -160 -368 179 -102 152 -17 310 6 113 -88 -163 7 -156 378 68 -96 159 -55 -79 -100
4499a00j50M9Ml5K23JN2J82j60j94Q7k58K19j10J26K09j60O6K73j12k01Mj17J15
$$ -100 -250 -201 -197 -232 -9 -8 44 226 66 -128 -41 -299 -80 -190 -64 145 -15 51 324 212 11 15 -102 13
4523A3j22L19k70k21K15K27m7l03K68j04r7K49n2j3k6j79J77j08j07J99n3k44
$$ 13 -109 210 -60 -281 -66 161 114 -189 79 -25 -122 127 75 62 36 -143 34 -74 -181 18 -35 -279
4545b79N11j5k16m7Kn1J56l9k3jR7k9N2j00O6J11k57J16L6mnL16N8n22R8n6R4
$$ -279 232 217 1 -46 -44 -95 61 22 -1 -2 95 66 118 18 84 195 -62 54 90 86 81 397 455 -67 31 -25 69
4572F9j56j21K31jRl7J20k93M9J23N7j37L6N1j38K80j40Q3m33M67k81J07K02r3
$$ 69 -87 -208 23 22 31 -6 114 -179 -130 -7 50 -87 -51 0 -138 142 2 85 -348 119 -162 -55 147 54
4596E4K66k62jj56J99r3k90L17Rr3L04r7j80l17K31J91l00L08j47pJ4K02O8k38
$$ 54 320 58 57 -99 100 7 -283 34 43 -50 254 157 -23 -340 -109 82 -218 90 -57 -64 -50 152 220 -18
4620a8J66kj37K9Q8k17J88j77J79r9J74j23k28K05j85O5R6P8J53k31j26J13j02
$$ -18 148 146 9 38 126 -91 97 -80 99 0 174 51 -177 28 -157 -92 4 82 235 4 -122 -9 -111
4643a11j16J2K34J32k68J59J29k86J85k66J07q4J8J51Q1j75J84J48k04L9j99j7
$$ -111 -227 -215 19 151 -117 42 171 -115 70 -196 -89 -173 -155 -4 77 -98 86 234 30 69 -130 -147
4665a47q3J45J51o8J35%P8l54L37l11M9n6K20m0j1p3R4k69o4K20K02j85J53j08
$$ -147 -230 -85 66 -2 133 133 211 -143 194 -117 -68 -124 96 56 45 -28 66 -203 -267 -47 155 -30 123 15
4689A5k67M15k42j52q3J31J40J81m31M76k59P1k3j31O2M26l38nM5O3J91k87j13
$$ 15 -252 163 -79 -231 -314 -183 -43 138 -293 183 -76 -5 -28 -159 -97 329 -9 -14 31 94 285 -2 -115
4712a15k01N08k65J14j98K50j67R5j2l9k18L83j89K43l83R7J20j11j12K45K85
$$ -115 -316 192 -73 41 -157 93 -74 21 9 -30 -248 135 -54 189 -194 -97 23 -88 -200 45 330
4733C30l78n1K5oJ45k6j94M15j82o8o2N9p0P2N5r7O9k6ol2k2O5K18j87n1K6o4
$$ 330 -48 -99 -74 -80 65 39 -155 260 78 10 -52 7 -63 9 64 -33 36 10 4 -28 -50 15 233 46 -5 21 -43
4760d3M5K3MJ30M4q5m43L40L11k73j09N5R5k99K05J9j49J90j28q2J48j9J5J15
$$ -43 2 25 29 159 203 118 -325 15 326 53 -56 -1 94 -205 0 19 -130 60 -68 -150 -2 -21 -6 109
4784A09o7j88J80o0k77L06j88J68M85o20J88j08J12N4P5m28L18n20K31M01k77
$$ 109 42 -146 34 -26 -303 3 -185 -17 468 -152 36 -72 40 94 169 -259 59 -461 -230 171 -106
4805a06n8J83k41K1J78j42K91Q5k12j60K25k01L00l35K41n6J9n1K6l6L4L1l0j97
$$ -106 -164 19 -222 -201 -23 -165 126 211 -1 -161 64 -137 163 -172 69 13 32 -19 7 -29 5 36 6 -191
4829a91K27k92J76L88q9j37k7l02L49j20k0L5r4K15j19j55K33J11k48Q8k13K38
$$ -191 36 -256 -80 308 219 82 55 -247 102 -18 -38 -3 -97 118 -1 -156 77 188 -60 28 -185 53
4851E3l02K25l25L75k1J7Q7j19J83N2J0m5j59k66L65L4O6q3l9l64R8K99L5J35
$$ 53 -249 -24 -349 26 5 22 109 -10 173 225 235 190 31 -235 130 164 230 147 108 -256 -158 141 176 311
4875C11l95j74J83P3r7j25L14K4O3q1k1M5j89J93r5n2R7j59j04m4N03k86o0J13
$$ 311 -84 -258 -75 -2 -99 -224 90 114 177 96 75 120 -69 124 29 -23 74 -85 -189 -233 270 -16 -76 37
4899C7n8J19j37P3j02N2m6J23k53J93n5o0J01j0K09j94Q7J43l04k98M11K08j64
$$ 37 -21 98 -39 34 -68 -16 -62 61 -192 1 -54 -114 -13 -23 186 -8 79 222 -82 -380 31 239 75
4922G5r7j56K7K66J03k92k7l6J17Q4M3N7l07K45O5j53P3j09N8N8m5J22K6j03O5
$$ 75 -22 -178 -151 115 218 -74 -101 -137 -20 64 107 164 -143 102 167 14 87 -22 36 94 49 171 197 94 159
4947A59l30L63o8j06%j6L6k9m1J13qk56J77p6J44R6m33M18k69QK34J48k34m6o0
$$ 159 -171 192 124 18 18 2 38 9 -32 81 73 -183 -6 -82 62 158 -275 143 -126 -118 116 264 30 -16 -76
4972g6Q7m2J54l3j35L76%k00k68J25m2J98l18L1K29K22l65K49k24J42k37J55k21
$$ -76 11 -31 123 90 -45 331 331 131 -137 -12 -54 144 -174 -143 86 308 -57 192 -32 110 -127 28 -193
4995a93R2K42j52J61J8j76K54j90k92K39N4j47K33L9j32K3M2j78J64j62j90K83
$$ -193 -101 141 -11 150 168 -8 246 56 -236 3 57 -90 143 182 50 73 115 -63 101 -61 -251 32
5017C2N9k65M6R4n0K16l18M92j97j89M42m06J70J7j02k22k0L98k47J36rj20K29
$$ 32 91 -174 -128 -34 -84 132 -186 306 109 -80 362 -44 126 143 41 -181 -201 197 -50 86 77 -43 186
5040A86l25J41J7P7nJ4J28k05kJ56l27K41k83J55k40M16q0N2l42K97J27m25K28
$$ 186 -139 2 19 96 91 105 233 28 26 182 -145 96 -187 -32 -272 144 64 116 -226 71 198 -227 1
5063AK63k41Jn1J57J91k05K5L1r8J46k77n9Q2J70p7K13j95J52l73Q1R1M9O7P6
$$ 1 264 23 24 -27 130 321 116 141 172 74 220 -57 -116 -34 136 59 272 77 229 -144 -63 28 77 144 220
5088B20m09J44M74k44l23K82j28j27J59o9n2j27P4o9O3m0J14j29K45r8j17L8j54
$$ 220 -189 -45 429 185 -138 144 16 -111 48 -21 -73 -200 -126 -195 -132 -172 -58 -187 58 -40 -157 -119 -273
5111b73J25r3L60k16K70j14j8k31K52R1k63O6j34L49k06R0j84J20n3o2N7j11K50
$$ -273 -148 -241 119 -97 173 59 41 -190 62 153 -110 -44 -178 171 -35 55 -129 -9 -62 -124 -67 -178 72
5134G2k14L15N3j94Jn2P3L7j14m9r5j64K07K27k4J97l44J90J84n79K72j49J99
$$ 72 -142 173 226 32 33 -19 54 91 -23 -72 -167 -331 -124 103 79 276 -68 122 306 -273 -1 -150 49
5157D9M4j0j00L54j73j65m1J70k43K64k22J67j04k07M29j73j81OJ35J69k35O6
$$ 49 93 83 -17 337 164 -1 -42 128 -115 149 -73 94 -10 -217 212 39 -142 -136 -1 168 -67 -1
5179aK41j06Rl91J95j20P3L3J7N4p0J35Lo6lr8K25j07j42Q3J53J70l47N7j05J27
$$ -1 240 134 143 -248 -53 -173 -100 -67 -50 4 -66 69 72 6 3 -95 130 23 -119 -36 117 287 -60 -3 -108 19
5205A9j98L31l54K71Lj08J76p3m4N8k08k6L76l19M1L3K31l32m4Q2Q9j43J31j94
$$ 19 -179 152 -202 69 72 -36 140 67 23 81 -127 -153 223 -96 -55 -22 209 -123 -167 -85 4 -139 -8 -202
5229b02O0KJ39J75k15L80l39j67J73q1K04j0J07j05J6lj26k70K56p5l23O53j24
$$ -202 -142 -140 -1 174 -41 339 0 -167 6 -75 129 119 226 121 137 134 8 -262 -6 -81 -404 249 125
5252A25l1Pk21J79m3j57r5J01R7K24j94k08L73j35j04O0J58J19m34Q8L3J25j59
$$ 125 94 101 -120 59 16 -141 -236 -135 -38 186 -8 -216 157 22 -82 -22 136 255 -179 -91 -58 67 -92
5275i2K17j56k02j13M78j04qR6l16J26L77l73o6M2K89j67N4L01m59J85j4j95j78
$$ -92 125 -31 -233 -346 132 28 20 116 -200 -74 303 -70 -136 -94 195 28 82 383 -76 109 95 -100 -278
5298b78K38M2J35R5j38k9j54o7M2K84P0k01k24M11k56J27L0l09J56Q4J59n48M96
$$ -278 -40 2 137 232 94 65 -89 -156 -114 170 240 39 -185 226 -30 97 127 -182 -26 58 217 -331 165
5321A65o3k07L30J46m30K8J3k19J43J95j66k00K72j3j14K25j99l72K49P9K23K8
$$ 165 102 -105 225 371 -59 -31 -18 -237 -94 101 -65 -265 7 -6 -120 105 -94 -466 -217 -138 85 113
5343A13j12M0jJ85j81n3m4l2J68n9Q4j54L92r2j35j49Oq4J62o3rJ01R9j12j88
$$ 113 1 41 40 225 44 -9 -53 -85 83 24 108 -46 346 254 119 -30 -24 -108 54 -9 -18 83 182 70 -118
5368a18j5J11j13L1L16m62N08k68j51N3L05k96P8J44k73k0N29n6p8j34Q4j81K23
$$ -118 -133 -22 -135 -104 212 -250 258 -10 -161 -108 197 -99 -21 123 -150 -170 359 303 225 91 175 -6 217
5391B17k35M5j59k43L76Q1Qo2k9k90K87j1J82l71P4L45k63L2J06q1L0j9L34n13
$$ 217 -18 27 -132 -375 1 82 90 28 -1 -291 -4 -15 167 -204 -130 215 -48 -16 90 9 39 20 354 -159
5415a59J91j43J3K10k16J80L2j60J17J2q3J06P5j91J01N7n9P1j36j39L05k06M8
$$ -159 32 -111 -98 112 -104 76 108 -52 65 77 -6 100 175 -16 85 142 83 154 18 -121 184 -22 26
5438B6K6J26j38J3q4j2j34J25j45J42K5J00j40j58K51N7p9K61j98k13J82j63P8
$$ 26 52 178 40 53 -31 -43 -177 -52 -197 -55 -30 70 -70 -228 23 80 1 262 64 -149 33 -130 -52
5461e2j66L01M5q5j54J73P4O7k65J04N9j16N2k85K59l2n9j0P8L6j8rj05m9Q2j13
$$ -52 -218 83 128 43 -111 62 136 203 -62 42 101 -15 37 -248 11 -21 -80 -90 -12 24 6 -3 -108 -157 -75 -188
5487a88J27Q6Q7j30o3K61k05M3q2J44j69J85k25J89j72L91l95K38J77j09J07k79
$$ -188 -61 25 112 -18 -81 180 -25 18 -64 80 -89 96 -129 60 -112 279 -116 122 299 190 297 18
5509A8n6rN7P1P3k45J60PO3m7k23L74k07k81K55K50l09M6q6l6N26m98J55j05Q9
$$ 18 -38 -47 10 81 154 -91 69 76 139 92 -131 243 36 -245 10 260 -49 -3 -89 -125 401 -97 58 -47 42
5534D2k71L85j30k07J72K76q5j89j08n2L36n1j28k22L57l45J55J81q7k19l7J55
$$ 42 -229 156 26 -181 -9 267 182 -7 -115 -167 169 118 -10 -232 125 -220 -65 116 29 -190 -227 -72
5556g2K15j39k77R2l7O4L51k31l7J21p6m2KP4j56L4k09M89o3n9J60Q8l18K00n3
$$ -72 143 4 -273 -181 -218 -154 197 -34 -71 50 -26 -68 -66 8 -148 -114 -323 166 103 44 204 292 -26 174 121
5581A21m1j55J29k1J63k87K52j65J72O3k77J92l90K22J1J8Qp4P0K31l07k62L27
$$ 121 80 -75 54 33 196 -91 161 -4 168 231 -46 146 -244 -22 -11 7 15 -59 11 242 -65 -327 0
5604@j3K47j66J6m38L57k8J38q8j63J38O9m5j84K86l3k05K6M14n50j10L20k44
$$ 0 -13 234 68 84 -354 3 -25 113 25 -138 0 69 24 -160 126 93 -112 -86 328 -222 -332 -12 -256
5627b56J59J02R1pj60l5L9K29k08O0jO4n9J08Q8l82K20j84K0M9j89N10m03L23
$$ -256 -97 5 96 89 -71 -106 -67 162 -46 14 13 77 18 126 214 -168 52 -132 -112 -63 -252 258 -145 178
5651A78m67O6R9j66K15O6j4R0K87k61q8r7P9J08k23K11p3J14J60j52j22Q9l19
$$ 178 -289 -223 -124 -290 -75 -9 -23 67 354 93 5 -92 -13 95 -128 83 10 124 284 132 10 99 -220
5674b20Q7L15k41l5O3K11Q3l09j09J91r4J63P3j59k36K53J1nN5j57o8K35j11j3
$$ -220 -133 182 -59 -94 -31 180 263 -46 -155 36 -58 105 178 19 -217 36 47 42 97 -60 -128 107 -4 -17
5698a7K02j53J51l91J28q2J83k45K39p4nJ45k31j64K01K21J06j79j23J81p6K3
$$ -17 185 32 183 -208 -80 -162 21 -224 15 -59 -64 81 -150 -314 -113 108 214 35 -88 93 17 40
5720D0J24r1NM5k51O3k33K52K73l52J55j25R3j05M6K25m51K6M39j99o7k8l6L64
$$ 40 164 73 78 123 -128 -65 -298 -46 227 -125 30 -95 -2 -107 -61 164 -287 -261 178 -21 -88 -116 -152 212
5744B12n10M24o3l86L26k51L01j32J02l0j64J21k2q8o0Q5K60j90j63K30pK84n94
$$ 212 -298 126 63 -323 3 -248 53 -79 23 -7 -171 -50 -72 -160 -220 -135 125 -65 -228 2 -5 279 -315
5767c15N6N9J6K01p6J67J36k8m04K52j19P4j3K07k46L22k62n3J68k37L51n51R9
$$ -315 -259 -200 -184 17 -59 108 244 216 -188 64 -55 19 6 213 -33 289 27 -26 142 -95 256 -295 -196
5790a96Q0J10k7O8n4P5km29L9L54K30j63j42L31j21k76K66j79J57j40J01o0J90
$$ -196 -116 -6 -33 35 -19 56 54 -375 -336 18 248 85 -57 274 153 -123 143 -36 121 -19 82 22 212
5813B12j3l40L20n40K33P9J4J59J4m6n1J73k26k6j71M21j79k25n9L70J95l03j30
$$ 212 199 -141 179 -361 -128 -49 -35 124 138 92 41 214 -12 -38 -209 212 33 -192 -251 119 314 11 -119
5836a19N6J8K89m11M8L81l77K61q3k5j13K41n1p6q4K5n6p0oK85k26J04l31M20
$$ -119 -63 -45 244 -167 -119 262 -115 146 63 38 -75 166 115 39 -45 -20 -76 -146 -152 133 -93 11 -320 100
5860A00n4j34n2J10J57l16J07q7J56J11q7J74j0k65J30J10l61j45L90M5p7k80
$$ 100 46 -88 -140 -30 127 -189 -82 -169 -13 98 11 185 175 -90 40 150 -211 -356 34 79 2 -278
5882b78M21N5p8j05J29m37L06J50j05j61p7L36m6j45K03k41Q8K9J38k77n0K15
$$ -278 143 198 120 15 144 -293 13 163 58 -103 -180 156 110 -35 168 -73 15 44 182 -95 -145 70
5904G0O5p4k24J33N3O9j78L59j95j71K20J27l04k77M42r9j41Q4K2J95r0j28r7
$$ 70 135 61 -163 -30 23 92 -86 273 78 -93 127 254 -50 -327 115 16 -125 -41 -19 176 86 -42 -139
$$ [...]
8191d6
##END NTUPLES=NMR FID
##END=
