##TITLE=1H_DE_PHGlu
 200.13MHz, D2O,
 8 sc
 
 21.1.2025
##JCAMPDX= 6.0         $$ Bruker NMR JCAMP-DX V2.0
##DATA TYPE= NMR FID
##DATA CLASS= NTUPLES
##ORIGIN= UXNMR, Bruker Analytische Messtechnik GmbH
##OWNER= pz
$$ XWIN-NMR		Version 3.5
$$ Tue Jan 21 17:25:49 2025 Russian Standard Time (UT+4h)  she@DPX200
##.OBSERVE FREQUENCY= 200.1313
##.OBSERVE NUCLEUS= ^1H
##.DELAY= (6, 6)
##.ACQUISITION MODE= SIMULTANEOUS
##.ACQUISITION SCHEME= undefined
##.AVERAGES= 8
##.DIGITISER RES= 18
##SPECTROMETER/DATA SYSTEM= spect
##.PULSE SEQUENCE= zg30
##.SOLVENT NAME= D2O
##.SHIFT REFERENCE= (INTERNAL, D2O, 0, 14.3821)
##AUDIT TRAIL= $$ (NUMBER, WHEN, WHO, WHERE, WHAT)
$$ ##TITLE= Audit trail, XWIN-NMR		Version 3.5
$$ ##JCAMPDX= 5.01
$$ ##ORIGIN= Bruker BioSpin GmbH
$$ ##OWNER= she
$$ F:/spectra/data/she/nmr/H-C/1/audita.txt
$$ ##AUDIT TRAIL=  $$ (NUMBER, WHEN, WHO, WHERE, WHAT)
(   1,<2025-01-21 17:24:00.42 +0400>,<she>,<DPX200>,
      <created by zg, POWCHK disabled, PULCHK disabled
       configuration hash MD5:
       00 E9 B6 7A A2 85 ED C7 34 08 36 98 17 FE 4E 26
       data hash MD5: 16K
       C2 39 9F 06 A0 8F 28 49 BB 8B B1 3D C0 36 44 57>)
$$ ##END=
$$ 
$$ hash MD5
$$ 70 61 A9 B8 ED B7 56 30 24 02 27 25 8E 4D 76 3A
##$RELAX= 
##$RELAX= 
##$RELAX= 
##$RELAX= 
##$RELAX= 
##$RELAX= 
$$ Bruker specific parameters
$$ --------------------------
##$DU= <F:/spectra>
##$EXPNO= 1
##$NAME= <H-C>
##$PROCNO= 1
##$TYPE= <nmr>
##$USER= <she>
##$AMP= (0..31)
100 100 100 100 100 100 100 100 100 100 100 100 100 100 100 100 100 100 
100 100 100 100 100 100 100 100 100 100 100 100 100 100 
##$AQSEQ= 0
##$AQ_mod= 1
##$AUNM= <au_zg>
##$AUTOPOS= <>
##$BF1= 200.13
##$BF2= 200.13
##$BF3= 200.13
##$BF4= 200.13
##$BF5= 200.13
##$BF6= 200.13
##$BF7= 200.13
##$BF8= 200.13
##$BYTORDA= 1
##$CFDGTYP= 0
##$CFRGTYP= 5
##$CHEMSTR= <none>
##$CNST= (0..31)
1 1 145 1 1 1 1 1 1 1 1 1 1 1 1 1 1 1 1 1 1 1 1 1 1 1 1 1 1 1 1 1 
##$CPDPRG= <>
##$CPDPRG1= <>
##$CPDPRG2= <>
##$CPDPRG3= <>
##$CPDPRG4= <mlev>
##$CPDPRG5= <mlev>
##$CPDPRG6= <mlev>
##$CPDPRG7= <mlev>
##$CPDPRG8= <mlev>
##$CPDPRGB= <>
##$CPDPRGT= <>
##$D= (0..31)
0 0.7 0 0 0 0 0 0 0 0 0 0.03 0 0 0 0 0 0 0 0 0 0 0 0 0 0 0 0 0 0 0 0 
##$DATE= 1737465839
##$DBL= (0..7)
120 120 120 120 120 120 120 120 
##$DBP= (0..7)
150 150 150 150 150 150 150 150 
##$DBP07= 0
##$DBPNAM0= <>
##$DBPNAM1= <>
##$DBPNAM2= <>
##$DBPNAM3= <>
##$DBPNAM4= <>
##$DBPNAM5= <>
##$DBPNAM6= <>
##$DBPNAM7= <>
##$DBPOAL= (0..7)
0.5 0.5 0.5 0.5 0.5 0.5 0.5 0.5 
##$DBPOFFS= (0..7)
0 0 0 0 0 0 0 0 
##$DE= 6
##$DECBNUC= <off>
##$DECIM= 32
##$DECNUC= <off>
##$DECSTAT= 4
##$DIGMOD= 1
##$DIGTYP= 9
##$DL= (0..7)
0 120 120 120 120 120 120 120 
##$DP= (0..7)
150 150 150 150 150 150 150 150 
##$DP07= 0
##$DPNAME0= <>
##$DPNAME1= <>
##$DPNAME2= <>
##$DPNAME3= <>
##$DPNAME4= <>
##$DPNAME5= <>
##$DPNAME6= <>
##$DPNAME7= <>
##$DPOAL= (0..7)
0.5 0.5 0.5 0.5 0.5 0.5 0.5 0.5 
##$DPOFFS= (0..7)
0 0 0 0 0 0 0 0 
##$DQDMODE= 0
##$DR= 18
##$DS= 0
##$DSLIST= <SSSSSSSSSSSSSSS>
##$DSPFIRM= 0
$$ [...]
##$SUBNAM0= <"">
##$SUBNAM1= <"">
##$SUBNAM2= <"">
##$SUBNAM3= <"">
##$SUBNAM4= <"">
##$SUBNAM5= <"">
##$SUBNAM6= <"">
##$SUBNAM7= <"">
##$SUBNAM8= <"">
##$SUBNAM9= <"">
##$SW= 18.0517328524113
##$SWIBOX= (0..15)
0 0 2 0 0 0 0 0 0 0 0 0 0 0 0 0 
##$SW_h= 3612.71676300578
##$TD= 16384
##$TD0= 1
##$TE= 0
##$TE2= 300
##$TE3= 300
##$TEG= 300
##$TL= (0..7)
0 120 120 120 120 120 120 120 
##$TP= (0..7)
150 150 150 150 150 150 150 150 
##$TP07= 0
##$TPNAME0= <>
##$TPNAME1= <>
##$TPNAME2= <>
##$TPNAME3= <>
##$TPNAME4= <>
##$TPNAME5= <>
##$TPNAME6= <>
##$TPNAME7= <>
##$TPOAL= (0..7)
0.5 0.5 0.5 0.5 0.5 0.5 0.5 0.5 
##$TPOFFS= (0..7)
0 0 0 0 0 0 0 0 
##$TUNHIN= 0
##$TUNHOUT= 0
##$TUNXOUT= 0
##$USERA1= <user>
##$USERA2= <user>
##$USERA3= <user>
##$USERA4= <user>
##$USERA5= <user>
##$V9= 5
##$VALIST= <valist>
##$VCLIST= <CCCCCCCCCCCCCCC>
##$VD= 0
##$VDLIST= <DDDDDDDDDDDDDDD>
##$VPLIST= <PPPPPPPPPPPPPPP>
##$VTLIST= <TTTTTTTTTTTTTTT>
##$WBST= 1024
##$WBSW= 4
##$XGAIN= (0..3)
0 0 0 0 
##$XL= 0
##$YL= 0
##$YMAX_a= 172709
##$YMIN_a= -187318
##$ZGOPTNS= <>
##$ZL1= 120
##$ZL2= 120
##$ZL3= 120
##$ZL4= 120
##$ABSF1= 10
##$ABSF2= 0
##$ABSG= 5
##$ABSL= 3
##$ALPHA= 0
##$AQORDER= 0
##$ASSFAC= 0
##$ASSFACI= 0
##$ASSFACX= 0
##$ASSWID= 0
##$AUNMP= <proc_1d>
##$AZFE= 0.1
##$AZFW= 0.1
##$BCFW= 1
##$BC_mod= 2
##$BYTORDP= 1
##$COROFFS= 0
##$CY= -3
##$DATMOD= 1
##$DC= 2
##$DFILT= <>
##$DTYPP= 0
##$F1P= 0
##$F2P= 0
##$FCOR= 0.5
##$FTSIZE= 0
##$FT_mod= 4
##$GAMMA= 1
##$GB= 0.15
##$INTBC= 1
##$INTSCL= 1
##$ISEN= 128
##$LB= 0.25
##$LEV0= 0
##$LPBIN= 0
##$MAXI= 10000
##$MC2= 0
##$MEAN= 0
##$ME_mod= 0
##$MI= 1.114404
##$NCOEF= 0
##$NC_proc= 0
##$NLEV= 6
##$NOISF1= 3.799351
##$NOISF2= 2.8
##$NSP= 1
##$NTH_PI= 0
##$NZP= 0
##$OFFSET= 14.38212
##$PC= 1
##$PHC0= 247.9685
##$PHC1= 11.9922
##$PH_mod= 1
##$PKNL= yes
##$PPARMOD= 0
##$PSCAL= 0
##$PSIGN= 0
##$REVERSE= no
##$SF= 200.129724274929
##$SI= 16384
##$SIGF1= 3
##$SIGF2= 2
##$SINO= 400
##$SIOLD= 16384
##$SREGLST= <1H.CDCl3>
##$SSB= 0
##$STSI= 0
##$STSR= 0
##$SW_p= 3205.1282051282
##$SYMM= 0
##$S_DEV= 0
##$TDeff= 0
##$TDoff= 0
##$TI= <>
##$TILT= no
##$TM1= 0
##$TM2= 0
##$TOPLEV= 0
##$USERP1= <user>
##$USERP2= <user>
##$USERP3= <user>
##$USERP4= <user>
##$USERP5= <user>
##$WDW= 1
##$XDIM= 8192
##$YMAX_p= 0
##$YMIN_p= 0
$$ End of Bruker specific parameters
$$ ---------------------------------
##NTUPLES= NMR FID
##VAR_NAME=  TIME,          FID/REAL,        FID/IMAG
##SYMBOL=    X,             R,               I
##VAR_TYPE=  INDEPENDENT,   DEPENDENT,       DEPENDENT
##VAR_FORM=  AFFN,          ASDF,            ASDF
##VAR_DIM=   8192,          8192,            8192
##UNITS=     SECONDS,       ARBITRARY UNITS, ARBITRARY UNITS
##FACTOR=    0.0002768,     1,               1
##FIRST=     0,             0,               0
##LAST=      2.2672688,     0,               0
##MIN=       0,             -187318,         0
##MAX=       2.2672688,     172709,          0
$$ Real data points
##PAGE= N=1
##DATA TABLE= (X++(R..R)), XYDATA
0 0 0 0 0 0 0 0 0 0 0 0 0 0 0 0 0 0 0 0 5 -6 8 -8 8 -8 8 -12 16 -16 17 -21 24 -27 30 -34 38 -44 47 -53 60 -66
40 -66 74 -82 91 -100 110 -123 134 -149 164 -179 197 -218 241 -265 294 -327 364 -408 459 -521 598
61 598 -694 817 -987 1230 -1605 2262 -3623 7591 -43770 -187318 -103699 -7690 -57599 -73649
75 -73649 72335 171656 94283 -2990 -5935 -26983 -103279 -116564 -38967 22537 51436 98044
87 98044 117784 51466 -27534 -50910 -72526 -115305 -90882 10430 73783 66332 72372 89379
99 89379 30211 -72597 -97372 -54942 -44917 -44178 30079 118240 105140 28657 -3639 -9707 -62380
112 -62380 -119023 -90427 -3015 51063 60441 68896 73907 42259 -20776 -74957 -89666 -60467 -10929
125 -10929 25536 47261 73032 83454 38889 -39350 -79836 -67974 -53659 -46298 -4096 66559
137 66559 97370 64963 21788 -1956 -33676 -75171 -80446 -34081 18830 44790 58400 66963
149 66963 46091 -7185 -55860 -71429 -61769 -40835 -5704 40163 73356 73351 44094 2998 -34275
162 -34275 -57646 -63381 -48784 -12789 34112 65201 61093 34951 7147 -21889 -57365 -75257
174 -75257 -50258 -1308 33259 47927 60105 59836 24896 -28770 -59024 -55620 -42521 -24656 10500
187 10500 51073 64854 44233 12718 -15801 -42349 -60000 -52885 -20160 18732 46713 58604
199 58604 52045 26938 -8440 -41157 -58388 -53662 -26885 7501 34895 49809 50250 30705 -6171
212 -6171 -39595 -51959 -45040 -27544 -25 34973 58424 53225 27403 -788 -26676 -49824 -56498
225 -56498 -36646 -1160 27659 43236 47613 36134 6775 -26828 -46324 -46171 -31637 -6543 24290
238 24290 46778 50625 35940 9252 -21607 -44584 -50551 -37994 -14046 15148 40320 49449 36734
251 36734 12155 -12975 -35008 -47156 -38886 -12312 16719 35741 44737 40541 18066 -14501 -38389
264 -38389 -45512 -39907 -22334 6761 34294 45494 38494 21186 -3097 -29512 -43968 -38008 -18924
277 -18924 4122 27711 43457 41125 20514 -5090 -26863 -42160 -43556 -26429 1898 25302
289 25302 39228 41618 28717 3141 -22792 -37411 -38017 -26784 -4352 21514 37809 38321 26022
302 26022 4717 -20192 -38272 -40572 -28527 -7535 17208 36216 41390 30433 10009 -13352
314 -13352 -32411 -39782 -30217 -9925 12048 30116 38072 31059 9889 -13430 -29997 -37621 -33106
327 -33106 -14105 11438 30836 37251 32958 17703 -6053 -28597 -36923 -31032 -16514 3346 24915
340 24915 36679 31709 14751 -4745 -22547 -35392 -34428 -17881 4742 23186 33759 34832 22285
353 22285 -732 -22011 -33296 -32523 -22089 -3023 18657 32419 32161 20063 2209 -16880 -31187
366 -31187 -33463 -22062 -2220 17473 30623 33759 24742 5633 -15222 -29713 -33440 -24903 -7699
379 -7699 11892 27049 31907 24748 8525 -11428 -26204 -31033 -24210 -8893 10305 26340 32798
392 32798 26003 9615 -8835 -24109 -31919 -28414 -12998 7202 23318 29136 25760 14338 -3982
405 -3982 -22624 -30533 -25206 -11526 3621 19589 30615 28575 14161 -4848 -19650 -27966 -28279
418 -28279 -17926 782 19070 28069 27005 16908 1627 -15879 -27000 -27528 -17286 -310 15884
431 15884 25617 26340 18373 2986 -14785 -27871 -27961 -17387 -4054 10363 24455 30150 20904 2930
445 2930 -11501 -20320 -25495 -22866 -7167 12691 24180 24012 18644 9144 -7515 -23901 -28603 -20351
459 -20351 -6978 6983 19834 26876 23151 10189 -6412 -20285 -25275 -20627 -9954 3364 17238
472 17238 26708 23579 8614 -6464 -15791 -22508 -25025 -14870 5331 20293 22491 19711 15365 2560
486 2560 -16959 -26935 -21609 -10681 -1013 10932 23368 25043 13405 -1587 -12895 -21275 -22999
499 -22999 -15635 -1375 12386 22067 24640 15777 1131 -11072 -17858 -22705 -20235 -4646 13660
512 13660 20584 17704 15431 9769 -7625 -24632 -24053 -11564 -3674 2923 17136 27823 19602 2247
526 2247 -8546 -13441 -20596 -22077 -9072 8571 17625 19018 17273 9707 -3977 -16732 -20883 -18105
540 -18105 -9513 4524 16749 19879 17134 11528 -358 -16410 -23707 -17306 -7124 -701 9370
553 9370 21883 22831 9252 -4553 -10246 -15225 -20375 -15337 959 15049 18283 16331 12749 3497
567 3497 -11124 -20438 -19252 -11712 -2181 8584 17182 19276 14207 3264 -9298 -17741 -17915 -11933
581 -11933 -3931 5901 16969 20992 13706 1623 -6925 -12894 -18554 -17978 -5915 9202 15610 15240
595 15240 14092 9262 -3782 -16800 -19219 -12865 -5125 2683 12206 18794 16276 6305 -3999 -12570
609 -12570 -17458 -15817 -7975 2454 11887 17816 16410 8019 -2454 -10338 -15148 -17001 -10318 2211
623 2211 11829 14738 13886 10278 1640 -11200 -18026 -14834 -8034 -1492 6914 16262 18056 9628 -572
638 -572 -7716 -13095 -15714 -12392 -2083 8626 13985 14753 10984 3028 -6852 -13837 -15945 -11615 -3079
653 -3079 6721 13143 14601 12039 4934 -5463 -13888 -15116 -10902 -4217 3431 11740 16137 12754 3687
668 3687 -4707 -10165 -14315 -13676 -6482 4488 12349 13857 11941 6941 -2011 -10835 -14663 -12458 -6303
683 -6303 1807 9510 14170 13044 6615 -1516 -9124 -13891 -12891 -7229 674 8343 13542 13355 7876
698 7876 -353 -7626 -12650 -13485 -9262 -190 7856 12061 12278 8926 1951 -7000 -12826 -12578 -8152 -1887
714 -1887 5660 12195 13695 9007 1795 -5587 -10993 -12866 -10035 -2740 5220 10697 12739 9721 3134
729 3134 -4519 -10419 -12346 -10259 -4109 4264 10477 12254 10056 4320 -3225 -9772 -12717 -10379 -4581
744 -4581 2444 8978 12349 10726 4777 -2094 -8390 -11846 -10911 -5826 1867 8056 11734 10834 6126 -1231
760 -1231 -7758 -11320 -11132 -6452 410 7199 11197 11021 6969 10 -6688 -10828 -10643 -7351 -884 6518
776 6518 11077 10972 7179 976 -5507 -10049 -11591 -7659 -1354 4819 9499 11121 8317 1743 -4775
791 -4775 -8920 -10698 -8606 -2554 4393 9242 10559 8447 3313 -3542 -8945 -10895 -8367 -3429 2652
806 2652 8405 10687 9007 3449 -2639 -7812 -10347 -9194 -3982 2228 7485 9970 9037 4646 -1696
821 -1696 -7351 -9954 -9232 -5207 998 6919 10030 9028 5297 -427 -6255 -9652 -9581 -5343 337 5502
837 5502 9032 9559 5921 65 -5439 -8953 -9465 -6550 -900 5178 8956 9380 6621 1257 -4437 -8613
853 -8613 -9295 -6599 -1843 4052 8034 9468 6954 2217 -4019 -7683 -8821 -7066 -2355 3046 7843
868 7843 9480 7100 2868 -2708 -7192 -9072 -7538 -3114 2615 6781 8914 7675 3953 -1854 -6702
883 -6702 -8904 -7594 -3608 1455 5793 8910 7895 4079 -1204 -6081 -8002 -7997 -4598 373 5606 8662
899 8662 7801 4533 1 -4313 -8111 -8441 -4965 69 4658 7426 8173 5583 406 -4397 -7758 -8039
915 -8039 -5227 -1125 3712 7318 8228 5850 1203 -3793 -7323 -7702 -6162 -2212 3280 7196 7971 5580
931 5580 2144 -2342 -6595 -8515 -6389 -1994 2569 5761 7891 6896 2646 -2606 -5814 -7090 -6452 -3354
947 -3354 1332 6083 7955 6568 3216 -1132 -5417 -7433 -6734 -3644 1020 5400 7551 6468 3664
962 3664 -153 -4593 -7864 -7336 -3521 504 3687 6542 7236 4844 -231 -4292 -6392 -6635 -5013 -1107
978 -1107 4134 6975 6688 4099 1038 -3074 -6460 -7022 -4940 -1202 3342 6214 7052 5183 1395 -2350
994 -2350 -5958 -7270 -5161 -1226 2344 5140 6964 6029 1824 -2807 -5295 -6250 -5549 -2779 1923 5869
1010 5869 6815 5153 2646 -729 -4878 -7026 -5590 -2044 1073 4233 6390 6080 3156 -810 -4680
1025 -4680 -5972 -5815 -3273 534 4234 6072 5944 3994 -833 -4060 -5615 -5792 -4154 -373 4098 6300
1041 6300 5507 3711 853 -2816 -6243 -6439 -3360 159 2783 5028 6324 4808 435 -3183 -5030
1056 -5030 -5734 -4673 -1616 2661 5361 5991 4772 1362 -2368 -5075 -5875 -4395 -1989 1762 4900 6087
1072 6087 4514 1786 -1027 -4795 -6480 -4907 -1839 1309 3712 5805 5611 2639 -1515 -4195 -4933
1087 -4933 -4808 -3181 1003 4427 5714 4801 2618 -110 -3583 -5299 -5043 -2792 76 3525 5130 5145
1103 5145 3338 -35 -2884 -5313 -5473 -3236 -304 2572 4994 5475 3772 295 -2978 -4452 -4869 -3748
1119 -3748 -1105 2838 5040 4684 3358 1297 -1840 -4800 -5397 -3798 -976 1496 3974 5121 4278 1116
1135 1116 -1748 -3839 -4965 -4243 -1535 1377 3918 4932 4278 1743 -1386 -3719 -4667 -4167 -2014 838
1151 838 3836 4698 4116 2124 -283 -3528 -4919 -4469 -2106 334 2790 4529 4684 2664 -523 -3018
1167 -3018 -4494 -4573 -2924 -26 2482 4451 4226 2930 225 -2602 -4344 -4203 -2956 -461 2308 4172
1183 4172 4552 3197 511 -2023 -4206 -4432 -2909 -514 1825 3532 4782 3569 967 -2063 -3516
1198 -3516 -4566 -3652 -1358 1773 3739 4345 3705 1478 -1369 -3421 -4485 -3679 -1640 993 3167 4209
1214 4209 3543 1877 -762 -3020 -3998 -4020 -1955 651 3049 4131 3499 1873 -443 -2665 -4262 -3878
1230 -3878 -2103 135 2528 3949 3583 2620 -77 -2724 -3980 -4074 -2609 -56 2415 3869 4141 2296
1246 2296 212 -2261 -3702 -4064 -2804 -522 1898 3687 3862 2919 667 -1891 -3509 -3830 -3136 -717
1262 -717 1519 3169 4093 3103 1115 -1327 -3010 -3520 -3126 -1258 1299 3041 3819 3067 1194 -1055 -2776
1279 -2776 -3957 -3433 -1763 682 2767 3825 3285 1502 -584 -2466 -3567 -3536 -1840 375 2508 3242
1295 3242 3367 1898 -344 -2504 -3430 -3332 -1982 29 2268 3331 3442 2441 225 -1998 -3173 -3502
1311 -3502 -2313 -87 1509 3095 3540 2589 213 -1590 -3138 -3329 -2471 -693 1627 3055 3557 2679
1327 2679 816 -1407 -2740 -3584 -2745 -913 970 2795 3363 2799 1117 -977 -2691 -3408 -2498 -1027
1343 -1027 613 2515 3568 2847 1058 -685 -2427 -2881 -3088 -1645 449 2302 3175 2929 1759 -355
1359 -355 -1936 -3132 -2829 -1701 110 1874 3113 2980 1856 36 -1918 -2876 -3029 -1831 -126 1525
1375 1525 2710 3155 1885 123 -1409 -2635 -3171 -2160 -285 1441 2779 2928 2169 613 -1156 -2804
1391 -2804 -2929 -2108 -384 1119 2737 3084 2226 872 -983 -2209 -3126 -2383 -867 1044 2365 2801 2323
1408 2323 1161 -760 -2147 -2757 -2686 -1405 571 1935 2819 2360 1479 -442 -2004 -2881 -2505 -1062 311
1425 311 1900 2790 2699 1196 -534 -1533 -2480 -2694 -1268 232 1620 2663 2766 1548 178 -1615 -2222
1442 -2222 -2843 -1910 -570 1565 2439 2422 1798 457 -967 -2280 -2721 -1815 -405 1059 2574 2667 1477
1459 1477 472 -1058 -2273 -2582 -1952 -575 983 2264 2609 1951 665 -934 -2170 -2510 -2045 -909
1475 -909 890 1888 2526 2224 1144 -760 -2017 -2609 -2175 -1268 431 1813 2560 2292 1230 -506 -1641
1492 -1641 -2418 -2339 -1170 223 1793 2392 2406 1410 -303 -1451 -2353 -2368 -1480 23 1450 2438 2183 1666
1510 1666 -43 -1369 -2361 -2186 -1277 3 1352 2287 2297 1425 200 -1139 -1855 -2409 -1821 -638 1071
1527 1071 1647 2306 1902 646 -715 -1943 -1977 -1698 -635 473 1794 2279 1674 599 -405 -1785 -2514
1544 -2514 -1767 -637 373 1776 2383 1806 753 -720 -1719 -2103 -1844 -856 375 1697 2144 2068 1333 -315
1562 -315 -1635 -2226 -1940 -1163 60 1329 2260 1766 1225 13 -1255 -1754 -2266 -1286 -57 1198 2055 1923
1580 1923 1185 33 -1141 -2031 -2092 -1779 -256 1174 1977 2049 1679 484 -959 -1838 -2075 -1556 -679 667
1598 667 1644 2061 1413 602 -706 -1817 -2177 -1575 -441 713 1409 2226 1671 796 -551 -1688 -2091 -1485
1616 -1485 -881 248 1498 2115 1798 912 -365 -1557 -2152 -1939 -921 374 1167 2160 1726 1060 129 -1223
1634 -1223 -1821 -1756 -1260 -76 1135 1718 1775 981 -137 -1262 -1839 -1529 -1215 -175 975 1566 1913 959
1652 959 250 -767 -1726 -1768 -1024 -217 992 1614 1749 1454 239 -619 -1647 -1956 -1363 -207 939 1731
1670 1731 1915 1535 549 -533 -1749 -1731 -1486 -664 357 1216 1638 1770 503 -268 -1333 -1837 -1680 -596
1688 -596 608 1431 1769 1711 719 -339 -1243 -1893 -1638 -815 267 948 1982 1521 897 51 -1299 -1924 -1583
1707 -1583 -917 -30 880 1667 1410 949 -190 -973 -1624 -1733 -976 76 829 1675 1835 1083 204 -1005 -1367
1726 -1367 -1792 -1287 -68 720 1592 1791 1478 362 -702 -1237 -1686 -1104 -105 481 1294 1892 1219 347 -566
1745 -566 -1091 -1577 -1525 -709 537 1181 1590 1042 446 -427 -1243 -1630 -1386 -483 291 955 1518 1521 518 -96
1765 -96 -869 -1472 -1292 -692 7 1096 1892 1146 1063 -363 -975 -1442 -1567 -978 8 830 1311 1525 1026 13
1785 13 -918 -1230 -1471 -1148 -469 785 1260 1438 1049 103 -696 -1468 -1494 -1173 -368 679 1390 1874 955 173
1805 173 -450 -1304 -1576 -1433 -409 495 1296 1563 1526 354 -491 -1322 -1957 -998 -447 24 1446 1457 1288 433
1825 433 -548 -1108 -1352 -1493 -678 437 1048 1281 1025 730 -85 -909 -1288 -1229 -741 82 997 1478 1393 814
1845 814 -25 -1085 -1266 -1171 -633 -54 732 1341 1376 1027 51 -1079 -1203 -1071 -554 -22 805 1459 1125 623
1865 623 335 -665 -1677 -1416 -1112 -189 674 1266 1544 952 482 -798 -1086 -1544 -1159 -303 486 1188 1550
1884 1550 1293 97 -151 -922 -1086 -945 -492 463 1123 1467 1026 259 -520 -834 -1320 -1007 -402 258 986
1903 986 1329 991 633 -58 -939 -1231 -1020 -441 206 943 1338 1150 755 -66 -974 -1240 -1441 -592 136 672
1923 672 1144 935 996 121 -891 -981 -1311 -766 26 528 1089 1483 977 383 -743 -1306 -1274 -722 -176 551
1943 551 861 1292 966 506 -595 -1133 -978 -838 -285 451 842 1178 980 247 -400 -1198 -1282 -1086 -396 274
1963 274 990 1107 853 494 -386 -809 -1043 -1210 -515 426 1095 1380 966 524 -228 -722 -926 -1432 -476 10
1983 10 867 1041 1413 514 -161 -666 -1158 -1140 -618 80 788 1202 1116 737 99 -692 -970 -1090 -766 94 655
2004 655 1101 1032 801 476 -716 -1035 -1138 -870 -296 339 1148 940 963 228 -440 -1025 -1088 -690 -218 292 639
2025 639 1027 825 308 -507 -819 -860 -662 -230 115 1069 1438 804 350 -219 -938 -1053 -1129 -462 29 622 1005
2046 1005 898 351 -353 -839 -1053 -661 -450 194 833 1101 988 510 224 -712 -703 -1028 -745 27 494 1051
2066 1051 1049 689 200 -468 -1100 -1182 -864 42 499 786 1016 508 309 -430 -1304 -753 -826 -61 248 724 1095
2087 1095 501 202 -237 -684 -851 -693 -251 274 768 730 734 449 -358 -998 -966 -796 -353 79 595 780 565
2108 565 472 -58 -933 -684 -963 -511 350 541 763 685 520 -134 -673 -921 -663 -563 233 794 665 802 571
2129 571 -4 -624 -1106 -855 -801 -171 671 567 912 685 -200 -579 -960 -892 -263 -290 621 828 786 487 126
2150 126 -506 -939 -898 -671 159 519 631 734 713 27 -748 -699 -761 -598 -149 218 624 987 484 145 -559
2171 -559 -559 -708 -680 -374 189 530 1024 555 261 -145 -711 -729 -1022 -308 12 488 829 393 85 -204 -579
2192 -579 -778 -656 -438 -108 476 719 1026 418 19 -490 -772 -722 -170 19 420 574 762 493 -189 -674
2212 -674 -705 -985 -556 -194 382 763 569 514 -3 -248 -618 -733 -901 -285 489 805 844 589 54 -351 -648
2233 -648 -703 -368 -126 328 581 770 333 174 8 -734 -861 -396 -109 461 460 771 722 147 -407 -277 -673
2254 -673 -575 -369 249 400 508 887 677 -160 -313 -929 -584 -652 59 170 657 718 442 -107 -395 -745 -651
2275 -651 -250 -51 430 645 542 324 -391 -550 -472 -567 -334 -95 414 641 838 212 473 -317 -509 -679 -568
2296 -568 107 177 780 567 427 19 -242 -513 -417 -551 -70 510 559 665 581 47 -252 -543 -565 -370 -161 142
2318 142 475 399 541 216 64 -398 -786 -498 -355 -20 402 660 413 578 -180 -530 -810 -689 -284 434
2338 434 561 464 532 372 -157 -464 -709 -254 -108 51 291 802 414 360 40 -486 -704 -547 -582 -42 573
2359 573 571 614 407 7 -343 -639 -477 -328 -200 297 516 460 393 199 -267 -688 -451 -158 -325 198 724 675
2381 675 724 121 0 -274 -405 -474 -90 -102 528 587 529 300 -210 -624 -459 -411 -492 161 446 395 620 429 150
2404 150 -225 -453 -424 -363 34 683 614 490 265 -261 -497 -704 -621 -160 120 471 426 522 147 32 -73 -446
2426 -446 -297 -503 162 80 379 657 229 124 -224 -507 -562 -262 156 147 486 611 573 -69 -149 -155 -546 -180 -462
2449 -462 97 354 676 336 99 -324 -366 -513 -414 -193 -51 378 341 441 314 -268 -506 -378 -483 -154 -109
2470 -109 320 314 323 329 -171 -346 -501 -478 -289 168 479 239 371 -16 3 -335 -587 -593 -397 85 497 506 623 254
2494 254 104 -372 -502 -326 -142 -262 186 353 590 232 44 -200 -344 -558 -56 135 49 228 304 432 267
2515 267 -84 -310 -609 -630 62 151 358 298 169 148 143 -252 -694 -117 -266 178 302 98 428 305 -128 -381
2537 -381 -378 -376 -247 166 272 412 367 174 -158 -535 -408 -233 -122 368 393 -41 267 138 -259 18 -522 -404
2559 -404 -83 -31 329 317 222 216 61 -396 -316 -285 -108 316 248 250 521 317 406 -38 -583 -565 -519 18 80 563 370
2584 370 50 14 -137 -355 -229 -321 -81 -22 211 277 -32 -22 -184 -192 -277 -509 -233 74 188 408 191 -27 -48
2607 -48 -713 -208 -333 -193 61 326 213 -55 428 -198 -312 -409 -205 -30 -57 87 274 224 172 -400 -109 -238
2629 -238 -410 -153 20 215 535 210 142 244 -134 -66 -604 -415 -30 37 363 237 150 273 -145 -309 -99
2650 -99 1 131 255 98 624 264 190 -184 -294 -380 29 9 407 267 163 -57 -171 -186 -633 -168 -186 -66
2672 -66 309 296 61 78 18 -50 -14 -336 -674 59 199 -38 345 -45 264 -61 -300 -498 -353 -17 95 214
2694 214 405 192 33 83 -367 -527 -340 -31 81 55 476 543 155 -63 -198 -171 -66 46 36 167 370 382
2716 382 -199 2 -334 -190 -186 68 -60 97 251 499 417 40 -394 -626 -259 -211 -148 191 331 370 124 13
2738 13 -478 -449 -378 -299 -182 20 -5 284 154 115 -2 -327 -134 -105 38 -3 -29 100 382 -74 66 -201 -308
2761 -308 -201 55 30 -87 578 493 164 85 -219 -576 -269 -258 124 319 338 334 311 -190 -88 -435 -107 -75 233
2784 233 175 -58 152 227 1 -159 -221 31 -249 -34 -184 416 95 4 -247 -63 -160 -171 71 -330 -66 133
2806 133 -123 84 -36 -146 83 -453 -210 -44 209 365 346 278 -59 -27 27 -314 -144 92 -412 420 344 68
2828 68 151 100 -330 -539 -73 28 110 272 220 136 84 83 -13 -282 100 -59 -34 15 437 31 51 -53 -52 -225 -399
2853 -399 -266 -82 416 266 31 42 46 184 -311 -40 -129 -293 357 152 200 176 -135 43 -242 -291 17 87 224
2876 224 -46 51 7 326 30 -85 -132 -104 23 4 125 187 270 12 -201 -315 -96 26 -128 162 -184 291
2898 291 226 492 -146 -227 -254 -148 26 289 11 50 315 7 -136 77 247 -120 -199 111 130 42 284 13
2920 13 -37 -205 -77 -231 -233 29 -122 267 114 -4 -31 -225 -158 -120 -58 126 183 49 120 136 -190 55 -205 -128
2944 -128 37 135 83 185 178 -87 -4 -261 18 -111 -118 109 112 332 311 -102 98 -151 -215 45 -178 48 -2 170
2968 170 187 162 77 20 -183 -91 80 90 0 60 48 208 106 -80 4 -69 -138 -225 -166 170 89 0 119 -212 -147 -17
2994 -17 -206 -309 349 101 107 156 33 -84 -59 47 320 -47 -178 311 101 88 263 155 -41 160 -203 -214
3016 -214 -202 262 172 -68 55 16 80 -90 -187 -60 173 0 26 -150 59 167 134 151 -200 63 -179 177 2
3039 2 -145 232 -22 -30 151 -195 6 -179 67 166 196 193 172 -29 -91 -282 73 -67 -282 -12 -232 211 137 9
3063 9 -90 19 73 -69 -144 -10 302 -8 401 -52 290 -568 -57 -24 15 316 342 -124 -16 326 -4 -43 15
3086 15 178 -3 88 82 151 198 -93 82 -52 -75 -307 -149 55 36 266 88 148 43 188 -251 -99 -172 -138 349
3110 349 336 203 -169 -229 -37 -89 179 22 154 10 75 -90 178 -30 -21 -43 -92 -210 -26 294 -226 -147 41
3133 41 194 -277 99 5 -90 -132 -27 134 122 118 125 230 -37 -91 176 151 -2 142 115 86 -215 -246 5 18 16 76
3159 76 180 12 254 443 162 -67 -385 -121 161 39 -379 256 109 -94 -104 -140 251 73 -232 7 -6
3180 -6 83 143 244 101 -9 -143 60 118 45 -106 -54 238 30 130 -11 -12 -37 219 94 -55 58 121 -9 126
3204 126 -33 -50 -31 -44 -43 57 352 -103 -217 2 18 21 -249 68 133 -107 -106 41 -80 -63 45 -171 -106 -25 119
3229 119 36 -222 37 11 140 24 -196 -131 -176 -61 -143 248 173 199 -178 -241 78 45 165 6 30 52 229 262
3253 262 -33 58 -90 -176 -119 106 -119 -172 298 44 150 -25 -199 -75 -97 -54 -61 131 -55 -73 -60 -29 -57 -63 47
3278 47 7 -107 -77 105 23 -294 -195 -274 135 -192 111 99 -198 -63 -130 131 277 15 -95 183 92 57 -187
3301 -187 69 106 158 -34 64 -81 15 -15 -52 66 98 187 173 216 56 59 -196 46 80 130 152 123 -64 -68 238 -304
3327 -304 -200 -71 -94 79 213 45 146 35 168 -82 -211 43 -7 -235 183 295 -52 -66 81 -148 -144 201
3349 201 416 -104 -20 -78 172 -247 -158 149 57 -108 196 325 22 38 -139 -196 -228 308 44 138 103 -59 -38
3372 -38 -219 -140 -122 -68 26 -99 109 -54 222 1 -59 103 221 -85 -129 83 84 -250 58 73 192 55 -95
3395 -95 -39 57 -314 -91 -153 -238 439 6 11 18 345 -56 -144 -150 98 47 137 -4 57 -255 -164 -27 332 -168 21
3420 21 -234 -135 -1 62 -96 -153 77 -66 -71 -66 162 -11 -53 -82 -8 200 -56 -87 -223 -138 61 -76 -5 156 120
3445 120 -39 360 -179 -157 97 -88 -314 17 115 -92 -69 -174 -74 -56 -46 -55 222 97 265 -19 92 102 -178
3468 -178 -7 24 156 251 -56 149 193 -308 48 116 128 21 -309 123 237 50 301 -345 -82 -84 -150 -62 32
3491 32 328 59 231 65 165 -50 -134 -374 -39 27 200 211 -74 62 166 -13 117 170 -10 254 51 105
3513 105 -51 -20 -49 -259 -131 -333 -89 -110 -172 19 -133 -154 27 92 119 55 -137 65 -50 176 36 70 50
3536 50 178 20 -168 -180 -47 -63 150 76 -8 93 -84 -221 -513 196 7 -95 26 -138 216 -89 81 -268
3558 -268 -96 -82 24 202 290 173 273 -185 -79 114 -318 66 281 258 -76 206 -63 323 331 -103 -25 -225
3580 -225 186 -74 128 32 116 203 92 8 -197 -136 106 205 208 84 -58 -33 -137 -70 208 -216 -41 57 -223 -77
3604 -77 303 -8 -13 77 -134 -9 54 -64 -21 129 305 28 -86 21 -43 45 -97 -418 275 127 -87 228 79
3627 79 -285 -82 -97 -362 -215 167 -16 171 -33 -115 161 4 -4 -119 107 100 260 161 62 -54 -222 -65 -141
3650 -141 -166 -65 235 316 192 -96 83 -221 -142 -238 134 15 -51 181 114 104 -184 -46 72 -271 -321 -212 -32
3673 -32 23 -18 -22 -33 -62 -122 149 -147 88 -138 182 130 68 -34 178 2 -26 -257 -11 107 10 73 40 128 22
3698 22 6 34 -227 35 133 200 197 68 -110 -180 -35 43 -16 -18 8 20 292 26 53 61 -13 88 -524 36 -227 20
3724 20 149 278 41 140 -112 -297 -28 -86 -23 160 64 83 236 57 13 -452 11 -211 251 -50 181 -279
3746 -279 29 239 -247 -168 -189 42 -236 91 -82 -11 127 -42 126 25 -47 114 -202 137 141 143 -78 191 -410
3769 -410 69 127 33 -281 81 85 91 93 57 39 99 3 43 41 138 -176 152 -290 -8 84 -163 -78 110 -47 -69 -184
3795 -184 68 -15 155 93 1 158 -149 -68 113 -87 85 54 169 15 11 134 -95 -585 -248 121 93 29 -250
3818 -250 94 -168 -222 -49 -60 -186 -192 31 249 243 137 -15 -30 -408 -169 33 -69 88 6 113 302 26 -5
3841 -5 229 -110 -255 -130 99 -191 -77 -11 73 86 -39 -61 -272 80 -290 269 89 -152 -116 88 -476 26
3863 26 140 19 2 -112 221 57 -108 305 -25 -318 -84 -96 139 -74 1 35 45 -26 243 -2 17 -5 124
3886 124 -150 60 55 62 18 -40 -187 -320 -130 -154 61 183 25 34 20 -173 -142 -48 88 -85 -75 47 58 7 138
3911 138 -136 40 -117 -42 -107 -13 -81 408 -182 2 -163 -8 38 -84 -180 -242 124 191 -276 -200 7 87 -178
3934 -178 -279 -198 -47 110 121 -25 -93 -40 267 -163 -122 -96 -60 21 152 165 86 -25 310 27 -69 -37 56 96 -150
3959 -150 177 169 -58 -178 -180 -49 -222 -48 -10 101 -49 236 22 38 -29 -163 -297 69 -15 -93 18 163 39
3982 39 -25 57 -111 43 123 104 132 65 156 292 -79 57 -34 -65 -39 27 165 -92 11 -131 -68 264 -37 218
4006 218 39 69 271 -116 36 26 446 -222 287 -197 -333 1 161 17 15 3 -169 -88 -278 -167 -11 211
4028 211 -170 128 255 -70 -141 111 82 168 39 111 -117 69 40 -36 105 -111 -181 -43 -92 360 121 -52 119
4051 119 32 -27 134 -51 -70 -62 -128 -273 16 94 -271 -355 -122 229 -76 -182 -27 20 121 -19 93 119 -15
4074 -15 58 -224 17 32 -156 425 151 -159 304 111 41 -156 -152 -118 -28 -71 -24 -100 -121 67 36 67 -75 -266 -113
4099 -113 14 -104 -33 127 161 -133 -11 -69 -174 -8 94 428 -6 -170 89 -187 -48 -105 36 111 22 59
4121 59 126 85 4 -89 -146 -286 -273 -188 199 116 -51 22 121 40 -16 -168 339 -68 -27 288 -168 -172 0 -76 145 105
4147 105 100 -23 -39 -37 117 141 -38 -54 -119 -164 127 103 -11 -33 -114 98 155 -27 260 73 22 -121 158 -25 -286
4172 -286 185 49 100 64 -269 111 -215 -177 99 -149 14 236 195 115 183 -3 192 -65 -98 -75 -158 77 101
4195 101 -98 -114 -59 20 32 -27 -93 93 -122 86 72 -164 238 -207 -298 139 -46 110 11 281 155 200 -125
4218 -125 -177 220 -215 -306 56 64 199 197 -184 421 -66 -10 13 -110 56 159 72 -18 328 -129 29 104 28 101
4242 101 -61 5 86 87 -63 -301 106 -132 117 154 138 1 -51 30 90 -252 179 164 162 79 -439 401 233 220 318
4267 318 -35 90 -152 24 143 85 139 138 -102 15 37 -27 -328 -122 60 -118 -31 89 120 143 -11 -246 -9
4290 -9 -27 181 -179 -365 84 12 41 94 -7 100 -106 -339 45 -115 41 15 -122 116 240 -126 -61 319 -134
4313 -134 -271 56 -39 -14 237 92 -26 -8 -5 -171 250 -25 -89 89 0 154 -61 -267 -162 90 93 160 -7
4336 -7 -124 -129 2 -22 172 -210 80 81 -258 46 172 30 36 101 -149 82 -174 -59 37 117 46 140 -103 58 -305
4361 -305 124 -194 99 20 80 127 -157 14 -109 -189 -262 -75 1 -407 -182 -190 200 133 -55 -2 187 -140 -114 14
4385 14 20 -60 47 -71 386 183 37 -226 -152 -56 284 15 -169 -77 41 113 -77 -4 20 -293 -108 166 127 120
4409 120 226 102 -56 -54 -73 163 157 2 53 78 -58 -76 42 -245 11 29 173 152 34 29 -5 155 74 -277 -354
4434 -354 -183 -351 138 56 18 29 -40 -172 108 -11 -22 -3 25 -49 -299 108 -42 239 -44 -155 -97 -173 -92 363
4458 363 179 76 -251 94 -252 -96 -226 -152 382 -164 15 -106 165 112 -97 8 -241 59 -385 -268 215
4479 215 -54 -72 207 -362 -146 -76 -182 186 -99 216 -249 -94 234 -85 56 -7 178 -81 17 61 56 111 -86
4502 -86 -218 -131 -139 -168 -160 -17 -40 -63 184 84 -1 -10 -177 17 5 -233 83 7 140 -57 111 -141 86 -101 -138
4527 -138 -24 266 -53 438 123 1 -53 -188 -21 -199 -136 -36 150 -166 -6 14 33 172 -10 6 339 -151
4549 -151 -226 152 16 -64 85 83 52 -93 169 -20 131 -71 -27 -27 -8 -87 -171 -39 128 63 -209 85 -221 202
4573 202 87 -34 92 -107 55 149 197 37 128 -61 88 117 -40 157 -62 6 74 81 -8 -48 85 -43 -99 -254
4597 -254 112 110 214 -114 -291 -69 145 -46 58 68 -113 -3 61 190 211 43 -116 -98 -171 54 -16 125 258
4620 258 145 258 5 30 175 -93 42 -94 -222 104 120 54 159 -17 31 105 -107 -141 -1 -67 -18 -29 35
4643 35 51 154 -16 -232 -59 126 283 433 39 -130 161 369 -227 -66 -34 95 -168 378 164 -206 110
4664 110 130 55 347 -203 -67 -100 -83 -371 -167 97 -151 -34 -245 -5 -106 -306 -147 -2 -200 24 38 -264
4686 -264 -111 -82 39 112 -7 109 206 148 -118 20 -134 5 39 152 -405 46 -144 71 166 197 -32 -136
4708 -136 72 -14 -346 156 162 87 287 -100 269 -197 43 -186 107 -21 -263 106 66 -29 61 -205 74 -291
4730 -291 170 176 -134 -54 340 109 -47 89 -48 47 -21 37 282 18 -23 232 66 -13 -110 -188 20 46 35 -1
4754 -1 261 311 209 -127 112 -37 -87 89 -241 -269 46 -89 -86 -19 -55 156 98 174 -107 -19 41 -203 104 -58
4778 -58 -47 -146 -209 85 -56 46 -102 93 112 -33 79 -184 309 189 -78 -162 -218 -58 9 -190 99 -160 -120
4801 -120 30 131 146 137 217 373 -51 -94 -29 -88 -11 -29 -72 24 18 132 107 -261 -304 36 75 179 143 -148 64 177
4827 177 -62 -233 90 17 -142 55 -100 29 -151 159 66 -73 -326 -31 -122 -282 112 244 -138 -166 3
4848 3 -330 12 -188 -126 -306 -219 -65 -143 -61 -94 -150 -27 -98 115 42 -43 28 -87 86 87 -61 -91 -104 144 109 83
4874 83 -48 -28 76 259 -8 -53 116 -150 10 -334 157 153 -129 -36 12 69 111 -213 -217 -19 259 95 57 16
4898 16 75 129 92 28 -201 -288 94 232 284 -238 339 -202 -201 231 278 64 -230 150 164 48 -105 -62 46 97
4922 97 -40 -23 105 64 64 -28 -34 -23 -328 179 22 -10 -61 29 -115 -246 14 -82 -38 -181 -222 -151 -133 -165 140 47
4948 47 111 189 -77 -41 177 142 66 -12 26 11 245 -217 55 188 -133 16 167 -146 10 -201 -3 -98 -99 -20
4972 -20 -108 -11 -149 104 -77 164 26 -33 -40 -274 69 -116 67 51 -62 15 -370 33 136 239 -238 -128 94
4995 94 155 -106 254 73 -222 -102 53 175 84 135 108 -52 -191 51 158 86 -16 -130 15 8 30 -90 263
5018 263 179 234 -16 105 152 74 136 -207 130 -9 -6 -25 237 217 -120 -180 -55 25 1 -230 297 -67 47 -129
5042 -129 -123 108 -120 -71 -266 285 157 -74 217 -33 -317 -191 -41 53 194 264 -87 -352 65 -109 75 249
5064 249 76 -188 87 -19 -317 -94 139 130 199 -131 -211 -2 70 -142 -184 64 132 143 -104 -242 -71 -27 73
5087 73 90 -120 -100 -63 -72 -71 13 -203 -85 -90 180 90 161 130 80 -52 -14 58 56 167 -164 -42 -50 208 123 -125 -19
5114 -19 60 218 -65 -174 316 240 -243 37 -3 90 7 -43 -5 41 59 -55 -81 -127 280 90 -2 -97 -39 224 205
5139 205 97 -131 174 91 -175 105 26 -35 -48 234 6 -176 -154 106 -227 130 -59 -121 -206 -4 0 309 132
5162 132 196 20 -105 -95 -59 51 142 137 9 -127 5 -11 -182 -145 -19 129 156 431 40 64 -109 119 7
5185 7 409 294 205 -95 -358 -48 172 208 203 -38 -23 -200 -267 -109 67 -135 -183 190 -163 79 -192 38 -148
5208 -148 26 -27 -85 393 -75 162 -81 67 -106 -152 35 185 -251 13 90 80 -14 -72 -89 128 -262 52 -149
5231 -149 26 156 -192 -94 33 191 47 34 -162 2 106 -28 -48 -80 -130 -205 -99 128 29 257 419 -66
5253 -66 164 -13 231 -146 91 101 -61 -331 71 -41 51 -173 63 16 -24 -61 -151 -190 63 263 74 -81 -38
5276 -38 -5 -114 49 43 32 -86 -190 11 1 -42 220 64 143 -160 68 1 -123 -58 -16 14 -12 237 61 102 -223
5301 -223 153 -101 127 5 -6 79 -19 -17 296 56 97 -92 123 154 -188 281 -268 33 -61 84 13 214 234
5324 234 -401 -37 65 25 -117 -78 -142 -399 129 197 -121 62 -172 -55 263 -5 -121 289 37 118 -13 101
5346 101 -102 171 -6 -79 27 152 64 84 163 -167 -100 99 173 -85 -106 -190 113 -14 59 -71 -253 -98 79
5369 79 -52 121 -192 -142 -250 -32 154 -206 85 -16 -115 -189 -10 109 42 344 262 107 50 273 203 -57 52
5392 52 17 -39 130 -39 75 61 102 11 -164 43 -118 -115 39 -353 185 -9 -79 202 -239 -169 -46 -184 137
5415 137 -209 -311 -31 -232 -271 -209 -185 47 -48 -17 -46 -10 71 -79 234 -272 -34 -20 -99 16 -177 48 158
5438 158 -121 -171 -45 -182 -85 -230 -258 -199 8 -38 34 137 -79 -10 83 -162 205 -270 119 307 -158 -347 77
5461 77 88 -202 98 49 -111 -48 -30 48 225 -25 60 -24 65 -6 89 112 -150 -17 82 175 -98 -99 -80 214 44 -116
5487 -116 -73 -160 -43 83 103 5 -73 90 22 45 -83 41 29 50 54 13 97 -14 140 185 -251 90 279 155 80
5512 80 103 94 -192 92 88 -123 -161 234 -92 86 -333 149 -88 184 56 -250 11 39 199 -184 17 -279 150
5535 150 252 -31 30 78 -153 -8 73 -86 -101 174 36 -112 -56 -106 -62 8 -466 172 -145 -52 -74 157 -196
5558 -196 27 74 -70 -30 147 -70 -189 116 -75 -235 -46 140 34 178 69 84 -66 102 66 198 64
5579 64 231 84 -315 36 123 -138 -6 21 96 -3 96 -287 102 271 -67 0 -293 -99 -297 -286 -173 50 139
5602 139 -76 328 -90 -167 36 -33 -121 34 -152 -75 -281 -119 -23 104 124 26 -281 -99 1 -173 163 -8
5624 -8 115 -20 -35 -107 -37 -137 393 -123 25 181 -130 112 -128 326 116 -113 37 131 128 127 -111 -83 -159 58
5648 58 93 18 40 190 44 174 -268 67 92 22 -107 53 -49 -438 -71 -152 259 29 137 4 -48 -52 -170
5671 -170 -192 76 28 -93 88 132 88 38 183 109 -38 -37 -1 119 -68 142 109 -51 -85 -81 -55 -23 163 -35 2
5696 2 -84 70 -204 53 -149 -44 10 -104 -104 -310 143 -37 241 -49 16 -192 74 189 -67 -5 -105 -148 95
5719 95 69 -204 40 22 -116 -102 135 66 3 226 48 -131 75 -106 34 177 -108 -45 -12 167 -46 -56 -38
5742 -38 -248 14 -49 143 -35 394 264 42 116 -282 -51 -68 -42 -42 -130 -173 38 38 -54 -322 166 313 -108 83
5766 83 231 63 206 67 -146 262 223 -27 102 2 146 -64 171 142 115 194 6 238 232 113 55 64 -153
5789 -153 12 176 143 -148 38 -127 -107 44 -262 -138 -58 21 -231 -70 89 196 -44 -57 -109 105 -77 89
5811 89 -83 -145 -77 35 81 68 285 -258 -42 -117 -90 -183 -76 -113 8 62 -316 275 -39 -59 -48 47 82 33 268
5836 268 52 244 166 -92 139 -199 -115 -132 316 -296 -119 -125 -105 -164 129 134 -191 21 256 -42 183 -87 69
5859 69 -122 -57 -355 64 211 23 -100 5 60 -55 254 -121 28 -469 251 64 49 -218 -100 -36 201 -100
5881 -100 -128 101 235 74 -55 -38 -26 106 -114 -18 4 -275 105 161 -169 -43 -302 10 -181 98 -1 26 12
5904 12 18 72 -124 -130 -212 -123 -22 109 134 76 -238 142 227 5 -15 69 41 -249 -243 -54 23 6 111 -98 27 137
5930 137 -1 -162 93 -4 121 115 -111 -2 141 143 -38 -172 128 -107 -186 150 -75 90 211 -59 -52 119 -97
5953 -97 -152 -213 -85 8 211 73 -197 -105 273 233 87 32 83 -18 -31 3 -182 75 -181 219 219 48 -13 -4 -94
5978 -94 -152 -26 190 -121 255 155 15 9 39 170 84 48 -51 143 -69 154 129 192 -101 -119 -85 -54 -391 271
6002 271 -7 -99 90 154 -88 -24 177 201 120 221 -7 -40 -29 136 35 40 255 -179 117 137 53 -9 66 158 171
6027 171 -71 -12 227 -18 203 171 -454 -28 77 62 261 -274 -46 89 -28 92 -115 -15 -2 139 49 -46
6049 -46 202 181 -291 -191 39 -91 -72 -24 -49 -79 118 96 81 -35 16 -44 138 367 112 -78 -4 151 11 32
6073 32 197 -180 57 -109 -61 54 -280 -140 54 -127 188 96 -179 -24 -91 -192 -189 131 -229 95 -49 -149
6095 -149 -101 8 244 14 -180 -183 -42 -5 192 -119 -4 52 -88 278 -191 125 -19 -265 -144 36 136 220
6117 220 284 200 -245 -55 287 -49 -73 -187 -124 -328 -63 -67 -237 -85 -215 46 -187 -120 49 -86 -32 -57 -63 -121
6141 -121 147 335 -118 82 -175 221 189 18 -16 17 35 81 -124 278 -163 7 -17 -196 17 87 -137 -28
6163 -28 -134 85 267 -182 -56 -374 -84 -106 147 -61 -270 94 -250 -112 46 -254 60 102 138 -71 11 -21
6185 -21 -91 197 114 -169 200 369 101 102 -224 -157 -344 184 -50 -48 -15 -97 111 14 125 73 -77 4 12 -111 139
6210 139 132 19 38 -180 -189 -160 136 96 -85 39 -80 98 13 -104 -7 -142 56 -186 152 82 -138 -37 18 -225
6234 -225 24 -134 72 127 -145 21 111 35 -58 62 51 2 -367 -13 62 76 42 85 -71 -6 117 143 43 -25
6258 -25 21 125 -30 87 -99 -151 -185 -227 102 -57 128 -103 -42 62 -46 59 9 -67 176 -66 25 75 155 -132
6282 -132 -41 -168 -22 -65 45 -235 -146 102 -212 -195 -5 -105 -182 211 -82 18 -126 26 -69 -2 64 -65 -241
6305 -241 -129 -7 262 121 -130 12 -15 -12 -120 105 -171 -123 -25 413 190 -27 32 -176 -32 -65 18 145 217
6328 217 -200 -78 -10 83 149 155 21 10 53 -160 -14 67 -98 25 -68 83 -216 28 -39 -161 -155 -151 86 231 132
6353 132 -85 129 -30 -132 -15 142 -40 32 143 -20 224 26 -202 -181 58 -63 207 384 -32 68 -157
6374 -157 -38 -95 223 36 -223 307 261 396 -47 75 40 43 -111 7 182 -393 -188 45 15 122 116 1 8
6397 8 78 -41 -264 -162 218 76 104 -266 129 -148 -87 -133 -78 45 -74 -17 -10 -104 130 105 128 -62 -67 281 54
6422 54 94 -76 393 80 -208 -214 -25 -78 96 95 -2 172 69 94 22 53 -19 77 -36 114 -124 -4 -11 -176 158
6447 158 -127 196 151 -210 -115 235 -11 -10 118 -62 -32 92 171 360 -14 -24 16 -37 213 -12 -60 -94 14 -13
6471 -13 116 -202 -71 97 37 -105 20 -34 -138 -9 306 45 -169 207 234 -1 -19 2 95 44 -153 299 123
6494 123 77 42 103 -221 1 39 10 159 -17 -107 32 130 -108 -381 -120 -40 -9 -149 -223 34 -11 -54 -150 165
6518 165 -47 -28 47 -59 -290 79 -51 63 42 5 85 116 118 69 82 125 180 -33 -98 6 166 118 -19 -144 -260
6543 -260 -145 254 354 -32 -106 -240 72 -63 -71 -189 -122 46 10 197 -155 99 308 -32 145 -130 178 -309
6565 -309 56 202 354 81 21 59 286 88 242 40 -320 154 61 -100 5 -14 -73 -8 -181 11 -29 -7 -236
6588 -236 -70 -175 -108 -55 68 -102 -84 17 112 170 -114 -130 14 125 -22 170 -16 -275 -87 210 -113 -231
6610 -231 -159 -104 -112 88 -32 -186 251 109 -58 98 85 -202 75 42 18 232 111 98 -203 -204 175 -68 -4 -138
6634 -138 -145 170 174 -32 81 150 -55 168 -48 32 233 -134 206 -217 -4 -29 19 -61 17 -285 -151 53 -48
6657 -48 136 172 -22 -137 -83 -87 149 -223 98 148 124 -93 -179 3 -75 -34 16 92 270 -152 65 116 -106 42
6681 42 30 -100 171 8 -186 -253 -60 -24 150 205 99 -35 86 48 58 46 101 56 -27 275 104 -84 82 -65
6705 -65 174 29 -289 -84 87 -50 -150 205 -170 -82 140 238 -160 -167 225 -94 -254 40 64 -189 143 177
6727 177 -18 59 -78 18 -38 -233 72 -59 210 157 -67 -81 -122 183 -136 147 75 -69 60 3 -19 -21 62 -134
6751 -134 -85 -132 235 -194 -317 -134 66 -41 -147 -108 160 33 299 116 -194 -36 56 -169 -244 -83 -40 98
6773 98 11 138 90 343 33 105 45 -13 305 -90 -98 81 234 146 3 82 28 -204 -167 136 -123 107 27 -75
6797 -75 72 -34 205 119 45 -243 202 -57 192 37 49 -60 -210 -266 106 104 214 -139 185 26 -93 55
6819 55 -6 127 -46 -106 -15 -79 40 6 -7 -71 -54 141 -141 276 83 83 -20 27 19 76 202 -98 -245 -5 135
6844 135 -106 66 238 -75 -86 -357 64 135 -89 -209 393 -289 -5 -73 2 54 -11 -137 161 65 203 43
6866 43 85 -24 -17 76 -348 -104 92 56 8 61 5 134 -113 102 -81 124 -34 -25 -58 47 90 -135 40 -131
6890 -131 -209 179 -10 228 -288 -352 34 -38 54 -25 -233 28 -374 -149 -181 -105 78 -145 250 182 173 48 130 202
6914 202 291 -99 -61 -46 51 -1 57 -33 129 140 -145 22 80 6 152 16 50 -99 -134 173 -112 56 35 -199
6938 -199 -180 156 -35 -242 137 110 31 222 139 60 93 111 20 -133 -101 267 -174 42 189 125 48 -46 18 13 -91
6963 -91 -21 -195 59 -144 -17 142 157 8 -254 69 -19 -125 -161 -44 -68 207 -8 -105 240 -169 -88 229 -97
6986 -97 -97 -158 -158 54 26 224 -61 29 -187 77 -79 202 153 31 -289 -342 -82 -18 -17 -185 50 -90 -103 -187 199
7011 199 52 213 -60 61 -74 21 -75 154 125 114 130 -186 -72 16 143 -142 81 -188 158 -4 -88 163
7033 163 253 194 -123 172 13 0 -28 372 -84 -157 142 67 -113 64 -179 71 102 -26 -56 28 -76 -60 31 -125
7057 -125 -181 31 104 148 -149 -102 94 57 85 9 159 -64 -187 -116 67 89 -149 185 -77 -135 -29 -153 -88 44
7081 44 173 308 79 261 111 -132 223 -232 106 16 238 175 89 -340 -34 -197 -376 133 137 -81 238 6
7103 6 -130 266 167 -43 84 172 -184 32 167 61 11 32 112 39 45 -99 100 -17 -290 7 248 -243 122
7126 122 114 -284 28 146 -193 374 186 -81 -1 78 86 248 -46 114 206 -13 48 18 -325 -212 170 128 320
7149 320 101 135 241 177 50 107 28 -131 4 146 -19 48 99 2 146 -94 257 -12 -132 110 -279 6
7171 6 152 -90 302 -201 -30 88 37 163 81 -4 -122 -62 187 -191 119 -56 2 -143 63 209 76 87 -24
7194 -24 -13 -124 48 72 -96 131 193 49 -156 -129 194 -19 49 189 92 144 -26 224 -255 -173 -7 208 101
7217 101 -41 34 -253 -55 92 14 67 -211 -103 -126 12 98 9 26 124 128 19 8 74 -97 -42 -28 -206 -35 136
7242 136 131 -152 -47 -88 45 35 238 -270 -117 -7 62 -64 99 -43 -143 211 -98 231 109 115 273 8
7264 8 -114 -127 -8 -226 -111 101 136 17 -100 -252 -45 -258 42 270 27 368 -123 60 -45 -154 -133 -61
7286 -61 163 -121 -219 24 -42 58 85 120 67 -51 97 134 -215 -39 131 -42 115 181 255 -134 -95 -28 -85 -223
7310 -223 -85 5 -86 -162 61 215 3 -149 -108 -107 5 165 352 55 117 -106 -24 105 78 -118 -24 -14 104 -209
7334 -209 -79 71 206 -62 219 -118 -40 254 -169 -108 -95 55 84 -125 103 36 113 -70 10 -168 -132 397 -212
7357 -212 -69 239 52 -302 -180 57 -222 -53 31 -301 -120 -31 -36 -124 -209 170 -41 126 -267 187 189 6 13
7380 13 16 13 -13 187 56 213 -58 0 -25 -176 -244 137 -144 276 133 156 27 -58 36 -37 -14 -87 -45 -128 -76 54
7406 54 26 20 -3 115 -64 -157 -62 80 -62 -5 430 131 -1 36 102 -275 -23 -146 -90 71 78 -95 -262 33
7430 33 -60 -33 62 -49 119 -63 36 36 141 -122 -54 -189 89 -66 -83 -157 -144 86 -52 -207 -241 22 142 157
7454 157 -105 46 5 -282 -32 42 34 179 -61 62 -71 15 183 164 -132 -48 -47 91 -121 -115 194 189 104 65 -134
7479 -134 168 -1 -171 -25 -197 -165 21 -167 203 -146 -209 132 150 -211 -291 188 47 37 27 -176 49 -34
7501 -34 30 52 68 -235 -105 265 58 200 -86 -9 -3 -82 -5 43 21 -16 -202 -83 -179 89 80 73 -70 24 -30 83
7527 83 129 169 -32 159 -229 82 92 93 110 -57 18 -24 10 15 101 100 39 -104 133 28 25 -27 118 -53 116 85 -66
7554 -66 -123 150 -123 120 -56 46 247 76 -155 -70 -74 -121 89 -20 31 118 71 128 46 -312 -109 -10 153 -50
7578 -50 -81 81 -14 -27 -87 -102 -128 55 -14 81 43 -74 -26 25 -134 -24 83 -98 -91 457 85 24 43 165 -145
7603 -145 94 -115 211 -248 36 116 19 64 32 -21 161 -217 -258 191 -42 166 -142 -102 312 -22 53 -70 -176
7626 -176 37 14 63 -92 -192 61 15 105 -30 224 27 -87 1 -164 -155 -103 -36 57 -16 -121 131 129 -228 -175 104
7651 104 -20 -31 264 217 23 106 62 120 22 23 53 -209 479 -2 289 -236 15 -49 91 -52 170 46 -75
7674 -75 -253 -25 -127 -289 -63 -146 98 -41 5 338 70 49 -22 247 -55 160 -27 -205 67 21 -85 -70
7696 -70 155 -40 -210 -58 150 33 -24 41 -405 -51 -246 378 -262 49 43 -159 140 -245 138 56 -295 -130
7718 -130 7 -8 240 -8 -83 -172 -110 53 -12 -133 252 -30 215 -163 122 141 -119 264 -165 -178 -156 153 -228
7741 -228 -91 16 -101 -33 -164 -199 -9 132 -380 8 33 -21 1 94 202 19 166 -33 127 -193 236 1
7763 1 -19 118 27 93 43 -146 92 214 -138 124 119 -54 -49 -40 -203 -11 -16 -15 -68 236 -109 117 114 -27 23 38 -115
7790 -115 241 182 8 94 -100 113 105 -116 21 -43 33 -249 26 -27 230 63 -186 184 305 -130 197 -165
7812 -165 18 -28 -245 -230 -234 72 118 -140 118 62 156 28 -70 -102 70 -164 -97 146 -138 -99 24 32 -176 -212 195
7837 195 83 -222 -140 -162 314 126 55 362 -156 -28 107 -179 124 -155 -16 4 -170 -1 6 -254 -78 161
7859 161 120 -93 -112 -53 -47 -13 242 -57 -108 -6 -245 207 138 163 -106 -47 9 15 167 160 -28 -81 92 -48 203
7884 203 -204 45 242 -48 -28 44 -185 -106 -191 -45 -47 278 -169 -19 -59 -57 -58 -228 199 -19 -3 95 -121 75
7908 75 155 -27 134 108 21 6 115 131 -54 -110 107 176 -476 42 -51 -136 89 38 140 110 135 149 -212 -234 226
7933 226 6 -103 76 321 95 136 61 -55 81 -179 106 149 175 192 15 -27 -51 251 -218 -277 95 86 -57
7956 -57 282 21 214 275 17 45 -205 -15 -148 -153 -255 108 227 138 -78 -43 -56 -125 182 14 216 -211 162
7979 162 34 145 145 33 -25 -147 311 197 -199 296 206 -136 278 -154 18 151 -148 238 111 -84 -114 7
8001 7 -62 -203 61 -17 154 -135 106 191 254 121 -110 -132 -299 -45 -161 -26 -96 -157 130 -54 36 86 20 -230
8025 -230 219 79 149 167 -143 -32 -238 -147 -52 -115 25 -120 57 -256 98 46 -200 18 42 -277 -137 83
8047 83 243 113 1 75 356 71 117 -2 -42 34 132 -112 -290 57 121 85 -117 -19 -32 158 52 85 -168 -84
8071 -84 182 185 52 20 -226 200 -89 106 80 62 -152 -116 87 218 99 26 -6 -204 116 86 93 116 106 11 -209
8096 -209 226 215 169 -57 -59 9 -81 -147 31 195 -239 60 -243 -58 71 -130 32 -35 -83 2 -149 100 322
8119 322 -16 84 -116 93 32 146 -189 -102 -91 -51 40 -196 -152 25 -15 -2 159 104 -45 217 -104 -7 27 6
8143 6 87 -181 198 313 255 -104 35 177 90 -315 -4 160 46 109 40 -134 73 -9 -164 -134 7 -25 -143
8166 -143 33 364 73 93 45 120 93 -150 -61 330 -88 87 4 -48 22 130 3 102 20 -14 -15 -240 2 93 236
8191B36
$$ Imaginary data points
##PAGE= N=2
##DATA TABLE= (X++(I..I)), XYDATA
0 0 0 0 0 0 0 0 0 0 0 0 0 0 7 -8 8 -8 8 -16 16 -22 24 -31 32 -40 48 -56 64 -73 86 -97 112 -128 144 -163
34 -163 184 -208 234 -262 291 -327 363 -404 448 -497 548 -605 668 -738 812 -897 986 -1087
52 -1087 1198 -1322 1461 -1618 1796 -1999 2239 -2519 2856 -3269 3790 -4469 5398 -6753 8918
67 8918 -12945 23022 -108911 -105460 88249 33937 20461 116355 172709 25199 -99425 -94821
79 -94821 -60409 -91119 -57127 47478 113495 95571 80814 47530 -39940 -117796 -104916 -69478
91 -69478 -53233 603 101898 133970 75115 23543 6873 -53542 -126342 -105580 -12810 31534
103 31534 37028 82215 122153 58118 -51725 -86927 -65846 -73635 -80017 -11297 87879 116213
115 116213 76765 37437 9585 -36218 -87089 -99924 -61859 4408 61457 80012 67204 48501
127 48501 19714 -39805 -100379 -100246 -42139 9162 32047 63350 98902 81732 8391 -53284
139 -53284 -67130 -66827 -66436 -33519 33344 79786 75411 46931 19080 -20691 -68422 -87899 -60325
152 -60325 -11873 28441 59334 79226 71220 30011 -23412 -62953 -75215 -61560 -30039 10264
164 10264 49241 73835 67342 27198 -21979 -51176 -60932 -60703 -40230 10201 61860 75953 55335
177 55335 30417 2929 -39365 -77077 -72873 -32348 7854 32968 55173 66668 44591 -3179
189 -3179 -43288 -57902 -55018 -39063 -4675 38039 64748 62907 39382 4489 -32067 -58680 -63992
202 -63992 -46336 -11276 28066 55481 58715 41229 13319 -20730 -51216 -61081 -41857 -7281
214 -7281 24090 46362 58519 49767 15219 -26212 -50683 -55497 -46939 -23888 13847 48356 58348
227 58348 43973 19558 -9127 -39050 -55735 -46987 -18672 13494 38945 52703 47718 22517
239 22517 -11319 -39800 -54207 -49714 -26409 6562 34934 50761 49666 30141 -2641 -32990
251 -32990 -46902 -44492 -28818 -601 31793 49615 44914 25941 1006 -27782 -49994 -50588 -29481
264 -29481 -1495 24576 45034 50770 34799 4388 -22452 -40221 -46196 -34849 -7499 22144
276 22144 39809 43215 33564 9391 -21321 -42254 -45281 -33958 -12224 16960 40998 47462 35437
289 35437 13851 -11457 -35287 -45759 -36392 -13958 11097 32058 42995 36249 14076 -11770
301 -11770 -32415 -42426 -37719 -17340 10228 32269 42765 39137 20757 -5868 -29394 -40547
313 -40547 -38052 -22361 3249 26799 38180 35766 21684 -1406 -25961 -39707 -36352 -20827 434
326 434 23704 40344 39816 23293 1206 -20123 -36649 -40453 -26515 -2524 18731 32623 36842
339 36842 27298 4876 -19182 -33339 -35016 -26377 -7237 17350 35125 37480 26227 8311 -13048
352 -13048 -32460 -38671 -29024 -9572 11134 27858 35813 29890 11061 -11182 -27484 -33474 -28516
365 -28516 -12370 9637 28102 35441 29370 13210 -7726 -26206 -35649 -31222 -15445 5142 23522
378 23522 33259 30673 16661 -3145 -21893 -32059 -29934 -16315 3224 21292 31259 30477 18492
391 18492 -1779 -21481 -32012 -30515 -19246 -1912 17726 31544 31792 19097 1957 -14885 -27388
404 -27388 -31116 -21351 -2007 16265 26781 28357 21663 5405 -15225 -29397 -30274 -20749 -6818
417 -6818 10892 26309 31954 23543 6984 -10463 -23199 -28598 -23580 -8869 9459 23762 28666
430 28666 22697 8095 -7891 -21976 -29492 -25528 -10223 8766 21563 26595 24786 14639 -4362
443 -4362 -22163 -27966 -21680 -11897 686 17511 29242 25331 10545 -4307 -15957 -24914 -26801
456 -26801 -16018 3127 18580 25106 24489 16061 1337 -14810 -25756 -25979 -15941 -329 13699
469 13699 21818 23970 18217 3155 -15142 -25218 -22476 -14554 -5062 9676 25192 28467 16112
482 16112 1211 -8580 -17863 -26613 -22515 -4323 12172 18921 20597 19652 9099 -8642 -21939 -23248
496 -23248 -17528 -7429 6513 19549 24295 19965 9281 -5871 -19714 -23535 -18098 -9538 1136
509 1136 16432 26604 20772 5747 -4355 -10660 -21086 -25585 -12075 8313 16892 16696 19128 17123
523 17123 429 -19053 -23681 -16294 -10926 -4110 10723 24001 22272 10725 -197 -9421 -19137
536 -19137 -21535 -13350 -1205 10549 19878 21491 12879 1113 -8742 -16781 -22842 -17805 -1806 12055
550 12055 15736 16760 17362 8716 -9545 -21070 -18050 -11697 -6540 3127 17611 23549 14598 2863
564 2863 -5307 -13310 -20189 -18940 -7003 6797 14987 18339 16450 8707 -2847 -13946 -19221 -17420
578 -17420 -7800 4328 12499 16537 17235 11133 -3122 -15586 -17936 -14141 -9627 -1772 11285 21352
592 21352 18066 6983 -1256 -7496 -15887 -19987 -12022 1602 10901 14708 15845 12746 2143 -10198
606 -10198 -16927 -16658 -11148 -2223 8309 15720 17403 12908 3519 -8078 -15660 -16189 -11513 -4651 5093
621 5093 15326 17732 11777 2305 -4799 -12095 -18008 -14933 -3600 7338 12311 14196 14618 7663 -5052
636 -5052 -14115 -15532 -11657 -6467 1932 12068 17218 13742 5594 -3028 -10363 -15210 -14479 -7324 2402
651 2402 11008 15619 13863 7106 -1331 -8924 -14835 -15105 -8410 2014 9312 12885 13761 10074 643
666 643 -9922 -14509 -12679 -8530 -1868 7330 14683 15092 8589 524 -6344 -12852 -15134 -10183 -1459
681 -1459 6740 12214 13689 10371 2516 -6159 -12571 -13729 -10557 -3184 5482 11479 13546 11033 4051
696 4051 -4423 -11406 -13934 -10726 -4622 3555 11132 14181 11120 4422 -2931 -9313 -13698 -12211 -4721
711 -4721 3382 9434 12291 11461 6333 -2403 -9801 -12801 -11291 -6329 1332 8921 12846 11920 6716 -853
727 -853 -8382 -12634 -11731 -6750 115 7351 12214 12082 7137 -141 -6902 -11523 -12126 -7952 -709 6493
743 6493 11326 12130 8295 1268 -6118 -10771 -11469 -8510 -1869 5518 10818 11529 8364 2176 -4765 -10248
759 -10248 -11824 -8725 -2819 4381 10259 11602 9058 3403 -3705 -9345 -11586 -9160 -3633 2882 8854
774 8854 11479 9744 3964 -3023 -8555 -11063 -9841 -4655 2529 8022 10778 9827 5195 -1365 -7990
789 -7990 -11093 -9756 -5274 763 7076 10768 10170 5529 -577 -6319 -10026 -10325 -6304 310 6254 9678
805 9678 10158 6889 625 -6209 -9693 -9851 -6902 -979 5420 9493 10347 6856 1544 -4563 -9202 -10213
821 -10213 -7244 -1877 4140 8701 10196 7574 2243 -3816 -8381 -10035 -7947 -2903 3701 8046 9615
836 9615 7434 3187 -2680 -8067 -9808 -7816 -3337 2044 7248 9617 8660 3773 -2238 -6915 -9367
851 -9367 -8482 -4224 1602 6687 9237 8499 4690 -723 -6357 -8819 -8882 -4746 651 5678 8870 8807 4898
868 4898 -1 -5252 -8895 -8486 -5418 -457 4972 8534 8757 5703 529 -4431 -8102 -8828 -5894 -1013
884 -1013 4478 7989 8459 6249 1576 -3944 -7945 -8758 -6113 -1764 3180 7253 8964 7002 2102 -3054
900 -3054 -6912 -8218 -6999 -2931 2741 7206 8373 6452 2964 -1809 -6517 -8465 -7225 -3051 1961
915 1961 6324 8218 7139 3881 -1400 -5780 -7981 -6798 -3555 925 4852 8096 7682 4113 -1006
930 -1006 -4975 -7214 -7479 -5071 370 5122 7439 6865 4704 479 -4387 -8086 -7406 -4294 -448 3569
946 3569 7196 8004 5064 565 -3869 -6715 -7369 -5329 -1268 3057 6624 7843 5558 1300 -3001 -5961
962 -5961 -7359 -6492 -2007 3099 6637 6803 5167 2793 -1724 -6088 -7973 -5598 -2269 1242 5190 7521
978 7521 6713 2493 -2054 -5116 -6573 -6466 -3406 1226 5189 6882 5986 3433 -946 -4888 -6809 -6581
994 -6581 -3633 566 4571 6669 5768 3853 426 -4278 -6868 -6308 -3236 -210 3134 6437 7228 3991
1010 3991 -189 -3285 -5431 -6263 -5039 -648 3707 6069 5609 4347 1236 -3106 -6039 -6419 -4430 -1291
1026 -1291 2839 5444 6218 4602 1843 -2250 -5544 -6509 -4799 -1684 1689 4659 6744 5743 1450
1041 1450 -1915 -4341 -5732 -5610 -2674 1914 5172 5504 4879 3090 -819 -4634 -6428 -5178 -2234 474
1057 474 3998 6101 5820 3185 -817 -3627 -5683 -5492 -3221 174 3685 5776 5581 3246 -278 -3515
1073 -3515 -5137 -5405 -4165 -434 3579 5078 5205 3893 907 -2752 -5889 -5316 -3344 -468 1959 5013
1089 5013 6117 4006 785 -2362 -4321 -5623 -4589 -1306 2318 4402 5572 4215 1676 -1672 -4608
1104 -4608 -5285 -4459 -2104 1757 4535 5064 4276 2278 -710 -4365 -5539 -4350 -1729 678 3298 5500
1120 5500 4773 1875 -1059 -3357 -4720 -4975 -3160 1094 3488 5161 4522 3040 -26 -3093 -4725 -4750
1136 -4750 -3044 -370 2788 4661 4742 2930 228 -2524 -4565 -4869 -3225 -416 2381 4526 5003 3323
1152 3323 293 -2192 -4256 -4736 -3802 -913 2294 4251 4511 3991 1365 -1784 -4179 -4608 -3716 -1288
1168 -1288 1346 3984 4689 3898 1406 -944 -3450 -4538 -3925 -1759 1042 3643 4506 3878 1984 -734
1184 -734 -3455 -4392 -4070 -1946 760 2989 4210 4116 2294 -559 -2979 -4435 -3976 -2385 143 2644
1200 2644 4254 4085 2438 -7 -2647 -3998 -3951 -2697 -55 2575 4039 4233 2750 286 -2364 -4129
1216 -4129 -4114 -3113 -675 1587 3847 4054 3274 598 -1691 -3315 -4246 -3290 -893 1533 3446 4370 3221
1233 3221 1206 -1781 -3143 -4039 -3314 -1031 1190 3073 4058 3303 1681 -851 -2920 -3851 -3605 -1434
1249 -1434 772 3045 4180 3507 1798 -495 -2679 -3943 -3692 -2033 304 2697 3752 3672 2135 -325
1265 -325 -2405 -4101 -3817 -2233 -39 1921 3839 3335 2009 141 -2198 -3680 -3822 -2572 -351 1961
1281 1961 3509 3873 2589 510 -1758 -3460 -3621 -2503 -714 1715 3318 3481 3084 1110 -1600 -3072
1297 -3072 -3623 -2930 -1112 1317 2825 3549 3036 1270 -1014 -2750 -3589 -3180 -1771 787 2704 3421 3026
1314 3026 1685 -597 -2743 -3832 -2654 -1576 402 2504 3183 3057 1562 -371 -2273 -3476 -3042 -2110
1330 -2110 231 2003 3240 3277 1822 -41 -1978 -2930 -3297 -2079 -171 1718 2994 3370 2325 294
1346 294 -1957 -2967 -3067 -2146 -507 1375 3041 3306 2339 578 -1122 -2701 -3218 -2353 -615 1228 2687
1363 2687 3344 2435 989 -834 -2467 -2949 -2358 -867 811 2852 2801 2744 1004 -940 -2571 -3069 -2394
1380 -2394 -1431 391 2203 3062 2783 1443 -425 -2168 -3068 -2827 -1598 186 1937 2794 3017 1511 -229
1397 -229 -1736 -2721 -2590 -1465 56 1718 2566 2696 1929 153 -1715 -2782 -2728 -1776 -276 1220 2910
1414 2910 3087 1912 496 -1027 -2501 -2871 -1925 -383 1247 2284 2669 2322 356 -1230 -2451 -2392 -1833
1431 -1833 -644 622 2452 2894 2195 967 -765 -1957 -2612 -2261 -807 908 1981 2654 2230 1014
1447 1014 -659 -1846 -2953 -2369 -884 425 1565 2642 2524 1459 -916 -1828 -2398 -2129 -1304 138
1463 138 1767 2561 2372 1206 -157 -1479 -2513 -2434 -1482 96 1750 2327 2576 1676 209 -1337 -2292
1480 -2292 -2372 -1773 -378 848 2324 2616 1737 142 -987 -2225 -2597 -1960 -605 1032 2096 2703 1844
1497 1844 614 -896 -2021 -2563 -1890 -607 923 1984 2433 2266 718 -442 -2155 -2376 -2019 -850
1513 -850 569 1662 2508 1921 1242 -358 -1529 -2274 -2134 -1313 352 1768 2328 1992 979 -97 -1315
1530 -1315 -2267 -2284 -1394 231 1500 2241 2365 1466 -122 -1321 -2000 -2206 -1563 -263 1500 2040 1817 1400
1548 1400 267 -1145 -2194 -2233 -1538 -170 1050 2050 2014 1805 457 -913 -2052 -2168 -1745 -555 859
1565 859 1731 2466 1768 420 -765 -1869 -2165 -1701 -486 572 1702 2161 1422 498 -685 -1681 -2182 -1572
1583 -1572 -1137 505 1585 2302 1974 984 -375 -1276 -2088 -1795 -1389 205 1314 2010 1858 823 -76 -1366
1601 -1366 -1973 -2188 -1241 98 1550 2260 1896 1002 198 -945 -2202 -1892 -1098 -137 951 1936 2174 1231
1619 1231 107 -1114 -1600 -1999 -1686 -77 1042 1479 1906 1544 192 -888 -1561 -1654 -1213 -420 498 1878
1637 1878 1800 1389 441 -588 -1684 -2164 -1732 -595 390 1506 1806 1520 785 -755 -1294 -2006 -1693 -682
1655 -682 550 1568 1747 1693 643 -400 -1376 -1758 -1661 -771 234 931 1769 1718 852 -22 -1013 -1831 -1398
1674 -1398 -1023 -247 1180 1688 1805 1091 -44 -1219 -1812 -1669 -1111 -97 1068 1484 1441 870 320 -929
1692 -929 -1557 -1595 -1204 -127 939 1603 1905 1368 210 -818 -1530 -1793 -1265 -369 600 1467 1737 1647 292
1711 292 -481 -1421 -1706 -1368 -413 618 1211 1891 1478 653 -260 -1256 -1804 -1265 -661 676 1184 1645 1684 1111
1731 1111 -142 -1200 -1789 -1289 -792 346 1253 1632 1549 748 -398 -1293 -1656 -1424 -965 -181 1025 1338
1749 1338 1412 1071 -54 -874 -1542 -1645 -1169 -47 791 1942 1621 1134 205 -604 -1374 -1618 -927 -36 795
1768 795 1352 1655 1078 418 -851 -1207 -1393 -1300 -440 566 1407 1591 1175 289 -242 -1314 -1671 -1488 -468
1787 -468 612 1220 1433 1326 415 -367 -1128 -1639 -1294 -458 349 1208 1458 1320 556 -391 -1230 -1438 -1326 -893
1807 -893 355 1034 1460 1435 606 -21 -772 -1559 -1448 -1009 270 1050 1243 1387 881 -74 -990 -1303 -1439 -803
1827 -803 8 589 1101 1712 1142 -17 -797 -1408 -1303 -881 -313 1105 1041 1502 856 395 -632 -1227 -1434
1846 -1434 -1256 -294 340 962 1638 1366 328 -522 -1535 -1358 -1115 -308 322 1118 1363 1144 596 -427 -1173
1865 -1173 -1102 -1231 -397 310 795 1228 1032 793 -207 -959 -1311 -1297 -770 253 742 1160 1104 608 -60 -804
1885 -804 -1028 -1343 -823 -300 1072 1225 1189 713 61 -783 -1398 -1522 -793 -69 748 1135 1060 915 12 -751
1905 -751 -1394 -1091 -1146 -393 283 1111 1547 1013 11 -506 -1172 -1465 -905 -423 310 957 1125 821 283 -495
1925 -495 -991 -1426 -1051 -509 564 1030 1282 1051 307 -240 -745 -1142 -1155 -474 318 986 1115 720 826 34
1945 34 -894 -1158 -1401 -598 30 743 942 1318 739 -21 -279 -1007 -1114 -977 -176 686 972 1207 855 124
1965 124 -717 -822 -1330 -884 43 444 1321 1435 970 72 -396 -704 -1247 -758 -143 499 1001 982 764 43
1985 43 -240 -792 -1118 -822 -213 673 871 977 864 213 -186 -780 -1291 -810 -497 472 812 983 1013 529 -80
2006 -80 -803 -989 -1117 -496 41 659 924 957 613 -570 -780 -1112 -1114 -506 8 532 1187 1137 371 -99 -715
2027 -715 -925 -1082 -472 -82 504 846 1000 598 145 -554 -1025 -910 -591 -263 524 1017 1095 772 242 -256
2047 -256 -972 -1099 -633 -101 545 678 1107 643 206 -535 -617 -957 -797 -548 232 743 935 656 148 -114
2067 -114 -719 -986 -1109 -377 339 672 1045 824 464 -112 -677 -1030 -795 -390 231 814 893 760 417 -11
2087 -11 -781 -1204 -803 -552 296 530 1105 928 846 -119 -723 -662 -758 -495 311 375 545 726 415 229 -835
2108 -835 -769 -1070 -289 16 410 716 1127 539 165 -571 -630 -698 -388 -367 471 795 904 596 -13 -565 -862
2129 -862 -1131 -671 -252 319 857 834 766 130 -274 -772 -618 -835 -175 222 579 836 737 407 -136 -796 -680
2150 -680 -813 -408 120 852 929 799 351 -227 -593 -971 -665 -572 -250 708 995 866 230 -38 -541 -586 -677
2171 -677 -648 -7 544 1048 795 408 -27 -499 -770 -784 -586 -124 606 734 800 579 -157 -410 -509 -634 -581 -18
2193 -18 484 697 498 537 -62 -108 -683 -628 -511 -186 469 677 597 294 179 -194 -574 -755 -514 -172 72 736
2215 736 831 397 191 -172 -497 -795 -554 -390 229 262 820 691 320 -127 -586 -785 -628 -460 134 770 639
2236 639 569 500 69 -577 -922 -665 -700 4 633 929 591 422 202 -434 -619 -561 -306 -121 547 532 945 430
2258 430 349 -399 -574 -807 -219 -254 605 744 537 791 271 -142 -653 -553 -446 -112 43 587 587 322 303 -177
2280 -177 -351 -614 -711 -225 -36 340 597 268 100 -306 -457 -644 -611 -387 119 608 744 838 613 -184 -512
2301 -512 -982 -738 -239 421 263 719 815 649 -83 -493 -577 -696 -229 -10 361 828 617 294 -38 -260 -609
2322 -609 -713 -477 -119 342 400 539 259 -107 -293 -813 -570 -255 107 344 620 733 528 159 -284 -414
2342 -414 -821 -622 -134 183 286 644 566 91 85 -305 -726 -727 -108 128 650 683 534 376 -118 -220 -650 -293
2364 -293 -201 67 599 507 302 209 -145 -300 -471 -481 -302 -144 323 688 481 286 66 -365 -776 -485 -506 220
2386 220 231 488 699 569 -244 -320 -204 -59 -373 0 104 874 640 814 -73 -296 -402 -565 -439 -249 377
2407 377 580 642 448 87 -202 -411 -689 -530 -315 291 361 736 360 -112 -272 -320 -388 -422 -296 433 325 631
2429 631 524 378 221 -375 -556 -166 -67 127 442 183 347 354 -103 -257 -752 -374 -337 114 493 546 492 215
2451 215 -189 -334 -586 -502 -488 -108 379 298 423 401 -39 -360 -487 -595 -447 -82 307 407 277 396 -296
2472 -296 -432 -445 -488 -574 168 235 619 406 516 254 -290 -522 -655 -396 -85 27 435 498 299 79 -249 -296
2494 -296 -587 -248 -28 255 451 432 154 40 -116 -421 -426 -86 -486 151 364 611 578 327 -196 -297 -444
2515 -444 -442 -246 -127 40 412 313 334 208 -341 -415 -314 17 -101 192 411 382 312 101 19 -473 -365 -462 -152
2538 -152 301 212 508 212 111 -384 -230 -319 -327 173 225 482 189 241 -133 -83 -524 -444 -336 -138 186 325 505
2561 505 312 202 192 -448 -286 -288 129 42 289 364 383 29 17 -574 -350 -466 -193 103 322 356 317 254 -237
2584 -237 -245 -410 -321 -257 133 250 387 210 100 -37 -3 -521 -254 200 315 -125 410 259 186 105 -175 -211 -241
2607 -241 -319 239 203 413 425 29 -89 -158 -27 -522 -204 69 81 158 393 128 127 70 -380 -274 -464 -84 7
2630 7 361 49 342 149 -307 -262 -390 -149 -182 238 489 433 183 0 -270 -356 -294 -204 55 169 346 338 134
2653 134 167 25 -222 -345 -353 -165 19 161 617 177 214 -35 -208 -448 -407 -76 223 311 251 439 284 -124
2675 -124 -291 -399 -165 -308 38 156 175 303 99 13 -201 -184 -136 -85 -38 228 228 158 337 -33 -77 -148 -202 -95
2699 -95 -119 -33 -68 405 243 -55 -119 53 -285 128 13 220 108 127 190 388 -88 -263 -105 -427 -251 221
2721 221 225 369 197 368 -268 -48 -229 -358 108 212 344 338 561 171 73 -47 -323 -261 -35 173 316 310 143
2744 143 284 82 -43 -375 -303 -9 143 430 372 84 82 106 -86 -711 -208 -29 149 175 439 142 114 -82
2766 -82 -103 -147 -379 -452 -133 315 66 273 148 -53 -290 38 -178 -66 12 34 251 201 393 163 -72 -318
2788 -318 -350 -255 -78 397 376 253 -69 -75 -110 -365 -328 -2 -144 6 317 533 237 192 -101 -239 -115 -271 -144
2811 -144 90 252 417 144 -96 -23 -97 -244 63 -150 188 -50 118 170 -115 82 -167 -162 32 -161 -46 -53
2833 -53 182 429 -16 18 -260 -383 -200 -306 183 198 281 208 -148 338 -47 -145 -165 -289 95 -140 382 380 -86
2856 -86 -16 238 -70 -261 -14 95 298 372 259 246 175 23 -188 55 -272 -45 161 -193 1 10 45 101 -294
2879 -294 -269 -113 -50 -13 -37 142 8 175 -268 -254 -33 -124 108 162 33 237 27 48 329 146 111 -322 -281
2902 -281 229 -20 25 20 151 -55 -32 45 -479 -29 79 -65 103 3 229 -300 -8 -138 -24 -156 -179 -201
2924 -201 -67 -16 -2 -201 256 -35 -111 -175 -129 267 36 -5 207 -7 -165 -248 -80 -125 85 164 199 125 46 253
2948 253 -143 -173 -108 -189 83 30 33 149 51 84 23 17 -255 -121 358 -34 -62 -73 48 54 179 91 46 -194 -146 227
2974 227 139 124 57 -109 63 39 -1 -117 203 -35 -115 342 172 214 -93 -117 -123 143 -278 -4 -85 14 191 -8
2998 -8 20 -78 42 109 -129 60 104 206 182 -51 -135 -181 -5 -215 12 85 -52 207 146 381 -66 141 -4 -187
3022 -187 -166 -46 152 268 -130 -289 -148 63 -166 -66 -281 11 -167 151 474 -37 -4 24 -284 -383 -96
3043 -96 -190 26 314 208 146 -86 -154 66 -110 -145 -68 -155 -87 286 248 215 12 53 -76 -133 -66 -160 325 158 131
3068 131 -121 25 -118 -243 -182 -23 -26 85 14 182 220 -180 -13 -214 -149 -412 71 -60 -113 155 -5 -67 -108
3091 -108 11 -192 -146 117 12 70 -161 82 -60 130 25 107 -156 -262 49 105 167 211 183 -116 113 -43
3113 -43 -167 -18 149 -3 101 -114 139 -130 57 205 -163 20 115 -31 106 -257 104 137 -93 -131 169
3134 169 67 -8 -190 -20 85 57 118 277 56 125 43 -144 137 175 101 -10 -92 211 8 -69 -156 48 -4 103
3158 103 -93 18 -153 4 -37 497 -333 -135 -344 163 -11 168 205 293 186 96 144 51 201 -3 50 197
3180 197 -92 186 -96 106 -221 -317 59 -2 278 139 33 -203 -48 48 -42 -92 -143 -20 77 -110 -243 48
3202 48 -45 -18 -65 -365 -224 -77 149 21 47 -156 -118 -330 10 -118 85 -10 11 -12 -72 -148 -8 -52 -141 100
3226 100 -177 196 163 -22 -52 -427 1 -263 -79 -181 11 89 -178 114 -80 -10 -166 83 -239 74 216
3247 216 -35 -120 -253 -176 86 202 -88 -155 -7 -319 275 175 56 -236 147 63 48 -190 -78 -47 -130 -159 -71
3270 -71 93 182 282 -30 -119 -55 -123 191 158 406 -20 -75 -25 170 29 225 -49 135 -12 72 68 51 56 47 89 286
3296 286 35 -59 -96 26 174 -62 -330 -89 70 259 266 23 -27 -97 181 86 -94 74 -203 106 164 293 162
3319 162 117 204 -103 -138 -337 -232 217 325 139 5 -6 228 235 -145 9 -16 194 10 -132 -42 -4 90 6 64
3343 64 -36 -28 -75 93 -249 217 -278 -45 37 13 7 -55 220 220 -54 50 160 -297 -128 -10 57 106 -159 67
3367 67 70 60 25 294 245 -42 -192 131 -75 109 164 -161 20 167 243 -33 -248 160 47 -388 -169 -14 -72
3390 -72 -329 182 156 -92 -309 -158 119 303 106 -202 -3 82 92 -138 -185 62 -37 92 374 70 -2 33 -207
3413 -207 -187 -133 11 -96 23 -206 -59 213 253 117 107 -17 303 27 66 132 174 229 78 -220 78 74 154 79
3437 79 -109 186 -2 157 -196 -104 -292 138 -19 -110 35 70 -157 -128 139 -99 -134 320 -141 260 30 24 -243
3460 -243 271 146 -17 52 -168 -225 -192 -181 83 -91 -103 45 163 -91 -75 6 -199 -60 163 220 -134 57 -75
3483 -75 77 85 111 -79 -178 -149 -17 82 -52 -57 -22 57 -67 -326 -28 56 159 211 -80 -228 10 -237 -148 113 -43
3508 -43 70 127 -254 -33 200 77 -37 -94 -48 -92 -58 -121 177 299 -174 -207 -201 -257 -107 -215 58 222 134 -45
3532 -45 171 25 79 47 -234 -39 -76 130 131 168 177 -130 214 9 -125 90 -176 -195 102 95 252 -208 58 201
3556 201 -95 68 -43 -129 168 16 35 52 -263 -63 -44 50 -161 -168 -44 147 122 -72 -260 -142 -13 -130 -88
3579 -88 60 -209 159 144 -162 -141 -58 -42 175 6 -10 44 -147 -5 47 106 14 -37 -15 -125 -19 -132 241 315
3603 315 8 -114 -43 -113 -113 -4 -56 -57 87 -58 -244 69 -361 -282 134 -126 -132 -83 166 188 192 127 -190 -398 27
3628 27 -9 -438 -64 176 481 190 60 -300 -311 -73 -33 -136 131 114 151 83 -21 178 -357 -202 114 357
3650 357 -144 24 -166 302 162 -109 234 -101 -345 32 -158 208 203 -75 -83 -101 -246 -158 -316 -75 -124 -43 224
3673 224 -135 -38 -105 178 -225 -151 -255 -61 400 347 -17 179 166 66 94 -188 -91 58 203 -31 -56 185 5
3696 5 -340 173 108 -46 -22 181 76 -25 348 178 52 -152 -155 -204 104 84 -1 201 309 140 -165 -59 -376
3719 -376 -197 55 93 124 73 126 75 43 -58 -282 -215 88 -168 -90 -47 26 -94 -3 -417 -79 -224 38 -167 37
3743 37 79 4 356 -48 199 346 -154 -124 -12 51 17 143 23 176 -69 8 70 -159 -203 -330 175 115 85 -55
3767 -55 154 -71 6 -111 125 -41 -164 23 33 -71 -190 -224 -190 100 -293 55 148 179 -34 -337 63 -147
3789 -147 -301 5 -77 20 70 92 -185 191 -121 147 -150 -37 -326 -52 191 63 119 164 -114 61 229 -52
3811 -52 135 -18 28 -129 -130 280 185 17 -148 -169 -124 -284 106 204 41 286 -108 -218 -111 -236 83 -156 293
3834 293 352 122 150 -5 -80 147 -13 -298 217 73 143 27 -73 237 247 127 -355 -258 -290 75 49 305 94
3857 94 -112 -241 -391 100 -136 -59 -157 -99 92 -41 30 122 22 -345 22 37 -215 150 -191 126 350 192
3879 192 -81 -123 29 -8 -228 106 342 245 44 -90 -50 59 60 -172 -152 133 50 143 -108 -111 -48 -94 76 -37
3903 -37 -165 276 275 235 -13 -163 32 32 123 70 -71 -40 186 88 255 55 -73 -95 156 -116 -37 318 166 -19
3927 -19 8 44 44 -138 159 -143 -13 271 -74 91 130 11 118 -70 -10 -163 -276 -13 -218 116 122 78 -197
3950 -197 193 141 -59 -198 -109 15 172 383 161 206 -37 -37 -114 31 145 306 109 137 -88 76 -7 95 52
3973 52 51 142 -148 25 48 -2 -178 -96 -77 -214 -19 -44 71 166 102 -144 327 -228 -27 10 -160 147 96 54 -111
3998 -111 145 -40 -41 30 -291 33 79 63 138 122 -4 223 -138 -66 -35 11 -122 -28 30 212 173 78 -114 31 -153
4023 -153 -55 -7 117 32 64 206 36 57 23 -3 109 -157 -105 5 198 45 41 55 61 -23 -20 -135 -336 -83 126
4048 126 324 21 -165 -206 -74 39 20 -58 108 204 57 166 -19 233 41 -259 88 -21 111 223 291 -81
4070 -81 -388 0 -253 -117 -15 -172 -266 -171 173 76 -86 108 7 -27 -64 -63 -24 -1 99 116 -62 191 -258 -99
4094 -99 5 -269 -14 166 151 -69 -296 -35 88 -59 -85 -99 106 -59 126 69 159 -274 -133 201 -81 170
4116 170 130 149 -92 98 215 348 -103 13 -408 -19 -25 194 233 147 -56 128 -342 -32 -14 -234 184 139 -179
4139 -179 18 111 74 106 24 -167 -79 -90 -48 197 161 84 -76 69 56 -6 17 -121 214 -252 199 52 -340 -173
4163 -173 -119 -15 13 -240 0 -217 -4 145 267 54 198 -79 59 222 141 -126 -75 91 233 -30 -13 44
4185 44 32 -63 -127 -123 73 -163 -103 175 17 218 -489 -9 -49 -50 -132 -16 88 14 -34 14 217 -308 -16 -454 15
4210 15 84 9 62 139 12 72 -30 -141 -236 -167 -184 18 166 -86 -17 -73 -31 -12 93 78 -89 -122 97 105 -61 -322
4236 -322 -67 79 197 -26 144 -236 -266 -192 -4 -31 -140 -165 -75 7 -58 86 255 99 -302 56 138 -91 -13
4259 -13 -49 26 -3 79 -6 104 -123 -55 -24 -52 -265 107 -34 120 120 -251 -16 -273 41 155 24 -163 -88 37
4283 37 124 101 203 132 -261 -127 178 35 -18 72 109 262 -88 -2 230 -133 56 192 195 113 -104 32 -24 -233
4307 -233 -60 135 64 34 3 -59 295 -19 182 -81 11 66 -159 173 147 -11 57 188 -62 -194 -55 -192 -156
4330 -156 62 245 200 -47 58 -215 -271 -86 -63 226 19 37 175 73 -12 19 60 125 43 -122 146 -151 101
4353 101 -69 -57 155 -1 99 8 -125 -210 -69 -107 21 262 31 80 287 -215 -1 -295 27 56 -37 -208
4375 -208 -157 -125 93 13 -27 70 -329 142 -148 -126 -165 125 16 74 93 -143 135 249 45 -105 5 44 -117
4398 -117 1 -170 -317 183 284 -221 60 -47 283 20 48 25 132 90 23 105 -312 -25 -33 222 -175 96
4420 96 -191 170 12 -83 96 -35 43 214 -29 249 134 -222 -169 84 65 171 -49 -37 147 128 58 180 -65
4443 -65 -212 81 4 22 -186 -161 -83 -229 -327 -219 -46 289 210 -1 35 -37 -69 -155 -199 110 23 -226 43 -90
4467 -90 60 -89 153 41 -214 38 -135 102 156 60 83 -97 -39 68 394 136 -76 69 -45 351 94 -64
4489 -64 60 -205 43 -106 -333 33 196 127 -81 111 -189 -75 16 25 -31 -144 106 25 237 -91 -19 176 -61
4512 -61 206 -34 323 -51 167 186 45 166 -226 -70 179 113 -128 -192 408 116 -388 111 85 -113 -301 -377
4534 -377 228 -144 -205 -194 -55 -172 211 85 -66 -43 -92 274 130 -2 213 4 53 -174 70 259 -53 -67
4556 -67 140 44 147 44 -231 -76 27 -133 28 143 63 -160 129 -205 -152 41 172 -246 171 170 -205 -37
4578 -37 -164 -188 -95 12 64 -271 23 -61 3 186 234 -56 147 93 -53 -207 -191 38 -165 286 27 97 116 120
4602 120 -149 -236 -12 -255 -80 106 7 128 81 -38 -114 -199 137 -33 35 -46 -59 -114 163 -13 190 -52 -57 143
4626 143 -148 -114 -116 66 -51 -336 -88 -7 62 262 72 -146 183 298 169 -118 -96 244 65 -142 -66 18 121
4649 121 130 -253 90 262 -209 120 -171 -9 -166 -192 155 373 438 113 135 -389 77 177 213 -66 387 349
4671 349 -195 55 -178 152 117 108 -97 -130 235 18 -45 -215 226 39 -44 -51 -125 283 175 85 320 -358 -50
4694 -50 -202 57 -259 -307 142 -192 268 132 -16 273 -90 147 -44 222 64 -23 -312 -247 180 317 -120
4715 -120 -43 174 -24 236 70 17 31 -18 61 86 -77 -121 58 53 -215 19 183 273 180 -16 -84 -191 -105 61
4739 61 128 216 385 321 26 -30 -188 -10 -14 228 -424 56 89 171 125 -165 -18 -21 -51 -135 -47 -10 106 -65 202
4764 202 21 -51 -421 127 -59 20 -114 -248 125 231 -214 -46 -80 22 185 -111 199 -1 -162 -48 -86
4785 -86 -25 23 -213 -157 -219 217 -22 157 211 -261 20 -259 -132 -5 -188 7 -59 71 62 105 82 39 101 45 12
4810 12 58 -148 -237 -49 23 -177 85 -54 44 90 -133 -40 -22 157 -1 16 -84 -17 113 -65 -207 110 30 -238
4834 -238 245 -219 113 -354 -248 112 -102 362 8 -150 -153 -19 231 -46 -58 -12 42 -128 -312 169 91 -188
4856 -188 19 -291 -198 -65 -251 103 92 112 -66 104 -122 22 -155 -354 145 123 270 150 117 -47 -133 151
4878 151 164 113 -33 135 261 206 85 -192 45 31 -18 -39 25 -32 18 -124 141 217 175 -128 55 -134 -111 -37
4902 -37 -49 48 166 48 -153 116 -5 32 137 201 -220 127 -198 67 82 -192 129 71 -299 190 17 -48 -115
4925 -115 -100 -149 -75 -96 -102 119 -121 -78 -91 74 27 86 133 154 89 -124 -183 283 10 235 -89 158 69 -207 40
4950 40 104 61 71 162 -41 171 28 17 -113 -103 175 -38 47 48 59 -47 184 -231 159 -212 -182 104 56 -14 -117
4975 -117 161 -83 60 -68 0 -7 198 -9 -79 91 22 -7 154 129 -119 210 -9 31 -2 242 -41 -84 -168 77
4999 77 39 -156 160 38 -64 203 -19 111 226 35 -130 -61 167 -159 48 149 64 -167 208 -126 98
5020 98 -44 126 -46 167 -24 59 21 -38 71 -31 83 -13 26 39 -269 93 -167 -231 44 -46 -13 1 140 5
5044 5 -248 48 -244 -281 -197 -181 -68 -30 143 -152 31 11 282 -70 34 -1 -240 246 171 -131 -198 28 25 124
5068 124 104 21 189 -14 221 153 156 150 17 24 196 42 40 -7 -165 212 -172 -5 30 -46 -89 -83 218 59 -43 65
5094 65 -53 28 93 155 -60 -68 -29 145 41 34 52 33 -20 -69 77 -273 -25 187 -107 29 220 -179 -255 113 -70
5119 -70 -24 246 -31 -198 328 90 304 -44 49 20 80 -312 -26 -32 -76 82 132 -220 -37 43 135 11 -69 -397
5143 -397 -236 -147 -36 69 78 183 -76 -120 -185 -18 160 -38 -106 -62 2 58 -60 114 -198 -151 -75 33 4 -286
5167 -286 -110 405 -92 -67 109 144 230 -72 -79 -82 -92 -66 -112 83 -146 160 -44 138 150 183 173 105 104 138 108 -144
5193 -144 -129 211 220 -296 -129 -66 81 1 -216 184 -19 -267 33 33 -297 292 328 69 312 58 20 213 -110
5216 -110 183 -115 79 -220 -95 203 -62 21 -119 188 96 -151 232 91 -27 -58 -151 109 117 -75 -253 14
5238 14 132 201 99 -539 -99 52 163 -123 -73 72 48 123 283 95 362 -25 17 -134 -236 -175 -25 154
5260 154 -254 133 -87 68 28 107 204 150 70 7 172 -215 108 -27 -99 237 -525 225 137 191 -51 52 64
5283 64 88 -192 -29 85 202 172 70 -112 -113 -91 24 77 217 -136 104 -42 23 -28 -12 -60 94 -204 19 158
5307 158 -144 -192 -132 101 14 -27 -18 -124 277 -146 74 -251 -72 -97 -115 -33 -34 -167 -38 123 -2 -190 29 26
5331 26 -77 -27 -10 -14 176 65 -6 53 58 -118 29 153 18 -4 73 230 181 -66 36 -126 -133 279 255 -213 -198
5356 -198 22 -242 -171 23 -31 168 -42 -131 215 42 91 -175 -39 37 186 116 121 -4 17 -252 144 168 41
5379 41 200 -48 21 -6 -135 -189 -52 -176 163 -223 -275 -36 209 -261 247 -157 36 59 -142 -76 -58 78 95
5402 95 -12 -14 -351 138 245 147 -105 88 -159 -376 115 28 -31 -16 -80 209 -110 -268 194 -93 317 198 -212
5425 -212 -130 -141 -24 -86 -95 294 -332 138 -65 -59 -7 -43 -200 -97 -39 60 140 -185 24 -22 87 60 62 -79 207
5450 207 -132 34 -28 -200 -69 -16 19 -110 -132 101 -116 284 81 85 63 -103 -214 -79 -223 -72 86 9 155
5473 155 -203 -3 -10 118 -202 201 -23 3 36 395 -53 -344 169 108 36 129 -220 -56 99 82 -14 -41 180
5496 180 124 124 -159 147 36 -143 190 37 56 97 9 12 -88 -406 -86 220 -179 195 161 264 136 0 -145
5519 -145 109 161 64 101 -169 -18 -3 -45 64 -60 47 104 -37 40 -181 -276 -134 -254 -150 -34 139 207 148
5542 148 -119 3 70 108 98 86 440 41 95 115 10 -59 -148 70 -290 -108 -50 158 -53 -236 -29 -74 -43 51
5566 51 -201 109 37 205 73 62 283 136 437 302 368 -230 -75 -59 43 249 118 -114 72 17 88 -117
5588 -117 -120 281 62 -52 -30 163 24 17 39 242 175 -124 -99 -418 -89 42 2 282 97 77 125 -34 120 72
5612 72 161 122 -55 -39 -28 -20 -106 -174 -7 -42 -151 187 -109 -98 63 -102 119 -25 45 -80 -79 -32 56 343 -56
5637 -56 -70 136 276 198 -55 -117 -77 37 35 103 -34 39 -146 3 -259 -85 -122 -96 62 -156 137 -10 -92 34
5661 34 -115 64 -42 60 -54 75 121 -12 284 -53 234 -106 62 163 -16 183 -51 79 -301 -217 231
5682 231 -38 36 -111 76 -191 26 -39 214 113 308 30 -137 194 -151 -7 -184 56 10 73 114 -26 75
5704 75 -158 -208 12 130 7 161 12 -44 -212 39 82 -141 191 -94 -13 202 29 311 -212 -17 3 86
5726 86 -62 -114 59 -56 -169 49 40 183 140 185 114 -123 35 -68 -41 -145 31 156 48 72 91 -5 163 90
5750 90 99 131 113 -1 -35 37 -33 135 175 -28 -152 -256 -205 -106 65 7 36 -212 121 39 151 -256 28 -98 -107
5775 -107 140 -255 -261 -39 8 -108 -183 -318 -224 170 29 227 -23 79 -24 15 -23 197 -145 34 -125 148
5797 148 -18 -30 110 116 -188 -240 63 25 -22 18 -135 52 30 6 -91 213 110 -117 26 229 -320 170 100 -86
5821 -86 146 -19 252 -345 224 -56 165 -75 -145 205 25 -146 142 -8 123 -97 -16 -260 274 175 29
5842 29 82 -1 -121 -80 14 23 166 58 34 -160 -241 -169 100 -273 38 -273 -98 -64 57 -62 -79 174 136 15
5866 15 -216 112 -117 286 -98 83 -142 32 98 246 -128 -72 211 -99 -243 186 60 -55 156 219 93
5887 93 -132 -242 -31 129 33 82 119 -139 -159 174 67 101 173 -208 -9 5 149 66 68 31 -30 141 -299 -201 150
5912 150 98 -118 -41 11 -19 -26 96 -114 -146 320 127 103 -282 232 -169 161 125 -176 105 -409 81 -112 78
5935 78 176 -93 -8 62 148 -64 125 -129 242 55 73 47 69 -55 -75 -142 -23 60 57 109 296 -43 -218 161 128
5960 128 262 -228 32 -173 251 -40 -17 -202 88 108 -313 7 -90 15 -68 88 107 -68 -143 -18 -72 145
5982 145 -104 31 134 -251 202 -28 -53 76 143 24 -127 -136 78 -180 6 -56 -78 58 299 -52 -28 17 -6
6005 -6 62 214 -112 -26 82 -258 -98 -129 98 -98 -212 -133 135 140 -15 -188 40 305 -131 -41 -298 -337 -34
6028 -34 -368 54 -92 302 247 44 100 83 -375 275 -144 -164 -78 59 104 137 -9 196 -184 -237 -170 264 93
6051 93 49 163 191 -220 -75 30 -179 65 -48 244 -107 -80 36 -21 -159 82 -73 -197 -11 -137 81 138
6073 138 43 -334 290 170 -300 168 97 -196 -189 320 51 -43 66 -294 -33 -298 13 -217 -1 211 -37 47
6095 47 451 -107 -136 -114 6 186 -49 -54 -151 -162 111 35 84 -69 125 -36 -334 -62 -76 -246 -28 -99 -45 -105
6119 -105 -142 -178 -249 135 215 -127 -59 -38 -16 -189 -172 68 -106 -204 -11 18 23 -99 22 -96 153 19 -99 -27
6143 -27 -44 -11 136 162 19 125 -113 11 161 112 24 -109 -115 -160 122 -180 152 -261 56 -24 -222 47 -61
6166 -61 14 -243 2 76 -136 -309 72 67 157 -156 -80 -33 -120 -373 -123 -216 -192 309 24 154 -52 223 101 -90
6190 -90 -63 224 138 -28 -145 -93 117 -287 98 -57 -192 49 76 345 238 -187 -44 -56 -139 25 -51 231 -99
6213 -99 -61 165 42 139 -100 151 -221 -71 -30 -46 143 105 -14 111 75 83 -25 -10 -280 -182 48 -190 297 -20
6237 -20 -151 -125 136 22 -148 45 -5 -75 217 63 -280 146 64 50 -71 -152 -130 -114 -37 -222 -37 57 -87 -182
6261 -182 40 -69 -120 85 -69 -49 -43 -44 104 -4 -83 -52 87 -125 -362 94 10 201 7 5 32 -111 -57 164
6285 164 -20 -92 121 -63 -112 -137 -227 -96 -167 -144 49 1 55 -36 9 -104 38 -189 13 184 29 148 -153
6308 -153 438 311 182 298 108 -226 128 140 198 35 -105 77 -163 73 -106 -112 -62 44 109 295 -46 -99
6330 -99 53 213 62 168 -46 -107 -3 18 -3 237 -91 -121 224 1 -76 23 128 48 135 312 -133 29 -58
6353 -58 -38 -96 -206 78 446 -253 -12 0 151 -91 58 -63 29 118 66 -126 140 -9 -322 -161 -79 -294 -10
6376 -10 -97 -210 153 -49 83 34 -204 -99 98 41 -21 94 -34 -15 188 64 23 -25 -176 -274 -47 -133 22
6399 22 -3 1 87 61 -39 23 145 168 73 13 -69 63 21 48 79 108 -250 79 271 224 82 48 -60 92 -216 -119
6425 -119 -40 -192 92 83 34 -81 64 -135 29 -159 -27 32 119 -257 96 129 -77 143 24 1 -296 219 -180
6448 -180 -95 201 -32 -153 -40 117 -43 -158 -93 -7 22 -53 -42 -34 -88 -88 -10 71 -81 162 -125 18 99 7 157
6473 157 -79 -11 137 14 74 258 105 55 233 74 104 -42 189 -123 -289 73 -121 270 -87 61 -65
6494 -65 -132 116 -5 95 95 -54 -41 239 6 110 -306 198 -336 -203 243 62 16 106 -141 -140 -42 144 133 -193
6518 -193 81 -29 -107 234 262 168 -90 -210 -69 11 -220 143 66 186 47 -71 -61 -45 -129 -162 -138 205 55
6541 55 -54 -164 -77 -332 -214 -39 -59 101 32 -35 130 -93 110 89 -41 -50 44 111 51 -24 -66 -37 -36 6 -13 -280
6567 -280 43 75 -66 -62 128 70 90 147 196 -277 -296 155 66 181 -74 -122 -56 -39 -57 134 -126 241 -44 -239
6591 -239 -88 78 132 129 199 150 33 -7 41 -70 63 -131 49 -149 324 -52 -34 -73 384 8 -133 55 82
6614 82 0 -34 -74 179 -52 -10 -235 217 90 -165 -9 17 -138 -50 113 114 -15 80 16 -170 163 -203 -15 -40
6638 -40 -37 -48 -186 57 -77 -78 35 10 237 -141 -179 -85 4 -26 -101 -234 19 114 249 -35 11 242 -76 9 -50
6663 -50 -215 11 156 -99 61 204 135 224 -76 -33 5 -15 -49 140 -194 -321 -55 -97 -34 -29 -229 38 183 166
6687 166 57 -227 48 167 179 174 103 -77 55 219 -50 -21 -351 -126 38 169 -72 189 56 -221 177 -81
6709 -81 149 150 -85 176 -137 -66 -78 58 -14 -63 17 -124 293 -4 108 109 -96 -47 -56 -33 -122 -27 31 247 242 -143
6735 -143 0 158 -57 -198 -58 -23 152 -157 34 361 104 247 -18 114 -209 -106 115 -48 71 -208
6755 -208 149 -279 -149 45 -132 135 37 196 162 -112 -27 -326 255 -141 36 -63 -29 -216 242 45 257 151
6777 151 -25 -222 96 -139 -56 -77 50 -66 45 160 -45 -187 119 -207 -48 121 28 335 -78 27 33 100
6799 100 -22 -18 -255 -108 -243 -8 -76 -35 199 -194 69 -9 -38 -95 -82 300 175 148 77 -146 -218 13 41 -79
6823 -79 -32 16 -69 -50 -222 -145 25 -12 219 46 22 -106 159 -46 -121 -43 -116 -2 116 19 -146 -62 -168 -188 -84
6848 -84 154 -66 55 148 45 161 239 55 -149 187 -93 17 -72 -166 -148 -27 78 -81 -191 334 115 -28
6870 -28 121 -26 -85 236 22 11 120 178 135 23 2 37 62 61 8 57 93 67 -27 208 -14 -194 -147 63 267
6895 267 4 -8 55 49 98 98 -55 -55 118 79 -3 -129 -219 -19 371 245 -104 -174 -108 8 182 -24 269 52 7
6920 7 156 -234 102 126 104 157 -86 -6 -52 -173 201 52 63 86 116 -37 -141 -108 94 -33 -56 -60 77 66 -30
6945 -30 99 32 -10 454 103 292 -124 18 15 -92 -163 139 102 40 144 80 -26 -169 63 72 131 -83 107 41
6969 41 17 170 -11 -86 -73 -117 110 54 22 61 -172 -84 -20 211 -76 -24 -123 -136 89 -48 -26 93 243 -143 -59
6994 -59 146 -37 -74 120 47 -72 185 332 -140 84 -90 -79 47 229 5 -26 142 -160 -229 -69 13 32 132
7017 132 -15 10 -406 -150 100 -177 94 -18 -319 -56 -78 -5 77 -58 -102 -25 -72 -145 72 151 25 -131 22
7040 22 -14 59 86 21 185 -4 92 48 190 203 249 155 138 14 -25 155 173 204 151 8 -498 -185 116 -59 1
7065 1 -20 -5 14 -7 128 98 -108 -4 309 50 -145 138 110 48 -63 -83 115 -62 25 -9 -107 338 -108 3
7089 3 119 80 167 -22 -145 154 -4 123 18 -233 340 151 -164 -76 79 -184 -113 -118 -114 -57 32 -80 -46 -3 -151
7114 -151 -72 89 40 -174 94 90 -48 189 -1 -176 -48 39 63 -115 -203 -19 48 159 136 -150 -34 182 71
7137 71 184 -108 98 165 21 -90 44 -94 -245 -90 -68 101 -146 -74 43 264 -257 -113 316 211 -78
7158 -78 13 157 9 222 83 -55 2 243 -223 229 184 205 31 28 -231 -46 -122 -94 55 202 33 67 -67
7181 -67 -31 60 72 80 -11 157 -60 46 -103 308 -217 -18 -193 -158 62 -83 41 46 271 88 44 -161 -81 21
7205 21 15 8 -143 -98 152 194 -252 116 295 -16 94 79 293 -102 129 281 -124 -50 -142 -302 115 -196 72
7228 72 -150 -295 59 -67 122 -99 108 -80 -121 323 7 -169 124 -324 89 -140 151 -39 -96 -206 -189
7249 -189 -200 193 130 61 12 -157 -55 -109 -60 266 -49 -181 141 -237 -63 39 -6 -51 -170 6 147 64 -302
7272 -302 -335 -77 -158 54 -276 -27 -160 -64 5 -132 70 129 46 189 110 256 -217 101 15 226 214 211 -6 11
7296 11 20 -99 107 -23 -294 27 49 91 59 54 -114 114 -37 78 -33 46 -69 -203 99 -19 -14 111 -41 180
7320 180 47 291 57 34 25 26 40 69 -90 -91 -158 124 -141 -63 113 98 31 51 -137 -306 316 27 -116 -111 40
7345 40 -372 95 -151 -19 108 211 -12 29 -68 45 431 82 -35 7 90 -68 -107 68 20 -118 9 211
7367 211 6 -79 -40 89 -4 32 0 153 -128 115 -67 196 -248 -167 -44 1 -216 185 -10 -35 185 35 -20
7390 -20 0 -89 -126 -19 92 -171 -69 -118 60 -149 7 -37 -94 117 220 145 -7 117 242 105 130 117 94 256
7414 256 130 -181 -192 207 251 -64 -114 144 168 39 -30 48 -96 -114 -291 95 81 -9 193 84 117 -124 137
7437 137 -153 155 132 134 -88 -99 -4 135 144 -93 112 58 48 -26 189 -232 12 10 91 134 16 135 3 40 -118
7462 -118 77 -256 20 46 -133 -116 42 21 -46 18 204 220 339 26 -65 -72 -15 -75 -49 -84 -50 45 110 246 68
7487 68 168 30 91 86 79 135 278 113 153 6 120 134 -63 -105 -262 41 -205 47 9 -28 -190 92 214 -101
7511 -101 104 -134 -171 92 -107 36 64 -198 -150 -67 -388 -81 -118 -9 -337 336 -7 97 -42 86 41 39 21
7534 21 136 -77 -40 193 28 51 261 94 106 49 60 115 -122 -31 -4 -33 192 82 43 263 -164 220 -107 -36
7558 -36 123 82 55 -200 -77 6 182 36 -54 138 158 -217 -83 79 -44 164 182 -15 -17 -268 -14 -54 -56 -78
7582 -78 107 6 -196 -79 83 61 109 30 -27 -104 15 -20 -29 3 289 448 179 3 -63 38 38 173 -65 114
7606 114 49 -168 63 -62 -9 -105 -200 80 30 88 123 50 63 7 -76 60 104 66 28 221 57 -31 -66 -128 -89 124
7632 124 -329 -19 14 -40 75 25 141 58 -84 -143 -33 42 73 -211 39 76 96 -105 -79 -220 -192 -41 62 47
7656 47 11 35 -26 49 61 -22 172 123 11 17 154 128 -300 163 -145 8 10 -94 -27 295 83 -85 -107 54 35
7681 35 65 -290 96 -174 279 102 -62 -256 105 -220 -212 -47 -200 343 3 -11 162 -7 -39 -109 -20 -30 -132
7704 -132 60 -153 20 51 83 40 31 -61 -81 -123 -93 298 167 300 149 -228 17 66 59 -172 -278 -53 -217 12
7728 12 50 -44 85 -188 60 -265 308 -204 -121 -60 -111 82 -27 72 -28 37 -24 -30 161 -7 -11 -80 46 -45 302
7753 302 -22 -413 -91 -45 0 229 262 -287 88 -135 115 18 -207 83 81 -129 171 149 99 -161 -157 -62 -266 -2
7777 -2 94 -106 -67 -24 -150 -101 237 82 -195 176 -78 -148 87 187 -82 -259 -65 -173 -266 -359 -28 53 -89
7800 -89 58 -11 -46 -41 68 81 151 -33 35 -93 273 -56 239 -242 241 16 -235 -177 -143 -72 128 -48 282 -344
7824 -344 -176 -78 -142 204 323 53 161 76 99 155 -202 -285 -83 40 -129 153 -59 269 -17 -74 -190 239
7846 239 36 373 176 -180 41 -64 40 -86 -78 102 189 -84 -127 181 177 141 -9 -57 26 -71 -33 -104 -190 -98 -43
7871 -43 -143 -35 -13 -22 171 131 220 -154 260 18 -149 -222 -235 -198 -163 38 -122 -17 274 276 -107 115 -131 73
7895 73 -22 -65 10 346 -24 218 115 167 178 -234 -7 -60 -101 217 338 -8 261 -223 135 -54 -54 4 128 52
7919 52 -59 104 -84 126 237 -191 -223 -99 -99 4 287 189 93 333 -120 44 -84 205 -168 -3 -81 119
7941 119 130 32 -41 -137 -156 13 119 -86 106 -284 -7 65 29 -321 -85 124 40 -153 55 -73 -219 -69 -18
7964 -18 56 -111 27 -175 68 -133 73 -15 121 -99 -48 -280 -50 -280 -141 71 -106 154 -123 172 37
7985 37 -18 170 83 170 73 -370 56 90 144 71 -14 -98 -60 -88 -170 -93 -57 -92 -67 -38 66 67 -19 -125 -12 94 -180
8012 -180 196 -172 -29 190 -16 122 -48 -41 -183 -89 82 240 158 21 -44 -399 -250 -129 54 20 -227 13
8034 13 -102 72 208 121 83 8 23 205 139 -79 -6 -41 46 112 -119 226 -66 36 201 20 80 8 74 69 -224
8059 -224 -102 10 226 -327 153 -175 -136 -81 28 -116 46 88 -73 -89 20 -65 35 -255 154 -71 71 49
8081 49 8 -71 -148 -120 72 -25 -18 -35 -79 -72 -188 124 114 272 -61 -31 -107 40 5 239 120 205 -26 87 61 126
8107 126 -142 71 -240 -55 -112 -188 16 -95 287 -55 188 -35 -82 -53 -295 277 -63 -25 365 5 133 -109
8129 -109 65 11 10 45 -24 116 379 127 33 -92 27 221 -82 34 8 -42 163 41 254 186 -267 -114 27
8152 27 -168 -83 3 317 77 -44 197 189 -143 75 -93 -130 181 -19 -19 132 -142 -64 54 -143 -59 -96 8 213
8176 213 -165 342 224 -66 -213 -227 79 -80 -73 -23 114 147 139 63 -16
8191a6
##END NTUPLES=NMR FID
##END=
