##TITLE=1H_DE-MeCArb
 DMSO-d6
 8 sc, 
 5.7.2024
##JCAMPDX= 6.0         $$ Bruker NMR JCAMP-DX V2.0
##DATA TYPE= NMR FID
##DATA CLASS= NTUPLES
##ORIGIN= UXNMR, Bruker Analytische Messtechnik GmbH
##OWNER= root
$$ XWIN-NMR		Version 3.5
$$ Fri Jul  5 16:29:25 2024 Russian Standard Time (UT+4h)  she@DPX200
##.OBSERVE FREQUENCY= 200.1314
##.OBSERVE NUCLEUS= ^1H
##.DELAY= (6, 6)
##.ACQUISITION MODE= SIMULTANEOUS
##.ACQUISITION SCHEME= undefined
##.AVERAGES= 8
##.DIGITISER RES= 18
##SPECTROMETER/DATA SYSTEM= spect
##.PULSE SEQUENCE= zg30
##.SOLVENT NAME= DMSO
##.SHIFT REFERENCE= (INTERNAL, DMSO, 0, 15.7039)
##AUDIT TRAIL= $$ (NUMBER, WHEN, WHO, WHERE, WHAT)
$$ ##TITLE= Audit trail, XWIN-NMR		Version 3.5
$$ ##JCAMPDX= 5.01
$$ ##ORIGIN= Bruker BioSpin GmbH
$$ ##OWNER= she
$$ F:/spectra/data/she/nmr/H-F/1/audita.txt
$$ ##AUDIT TRAIL=  $$ (NUMBER, WHEN, WHO, WHERE, WHAT)
(   1,<2024-07-05 16:27:50.68 +0400>,<she>,<DPX200>,
      <created by zg, POWCHK disabled, PULCHK disabled
       configuration hash MD5:
       00 E9 B6 7A A2 85 ED C7 34 08 36 98 17 FE 4E 26
       data hash MD5: 16K
       35 BD 2E 98 21 87 7A AF ED F7 2C 54 5A 04 78 A0>)
$$ ##END=
$$ 
$$ hash MD5
$$ 27 3B 5D C2 98 16 67 54 79 1A EA 58 B9 EA 96 A8
##$RELAX= 
##$RELAX= 
##$RELAX= 
##$RELAX= 
##$RELAX= 
##$RELAX= 
$$ Bruker specific parameters
$$ --------------------------
##$DU= <F:/spectra>
##$EXPNO= 1
##$NAME= <H-F>
##$PROCNO= 1
##$TYPE= <nmr>
##$USER= <she>
##$AMP= (0..31)
100 100 100 100 100 100 100 100 100 100 100 100 100 100 100 100 100 100 
100 100 100 100 100 100 100 100 100 100 100 100 100 100 
##$AQSEQ= 0
##$AQ_mod= 1
##$AUNM= <au_zg>
##$AUTOPOS= <>
##$BF1= 200.13
##$BF2= 200.13
##$BF3= 200.13
##$BF4= 200.13
##$BF5= 200.13
##$BF6= 200.13
##$BF7= 200.13
##$BF8= 200.13
##$BYTORDA= 1
##$CFDGTYP= 0
##$CFRGTYP= 5
##$CHEMSTR= <none>
##$CNST= (0..31)
1 1 145 1 1 1 1 1 1 1 1 1 1 1 1 1 1 1 1 1 1 1 1 1 1 1 1 1 1 1 1 1 
##$CPDPRG= <>
##$CPDPRG1= <>
##$CPDPRG2= <>
##$CPDPRG3= <>
##$CPDPRG4= <mlev>
##$CPDPRG5= <mlev>
##$CPDPRG6= <mlev>
##$CPDPRG7= <mlev>
##$CPDPRG8= <mlev>
##$CPDPRGB= <>
##$CPDPRGT= <>
##$D= (0..31)
0 1.2 0 0 0 0 0 0 0 0.06 0 0.03 0 0 0 0 0.0002 0 0 0 0 0 0 0 0 0 0 0 0 
0 0 0 
##$DATE= 1720182470
##$DBL= (0..7)
120 120 120 120 120 120 120 120 
##$DBP= (0..7)
150 150 150 150 150 150 150 150 
##$DBP07= 0
##$DBPNAM0= <>
##$DBPNAM1= <>
##$DBPNAM2= <>
##$DBPNAM3= <>
##$DBPNAM4= <>
##$DBPNAM5= <>
##$DBPNAM6= <>
##$DBPNAM7= <>
##$DBPOAL= (0..7)
0.5 0.5 0.5 0.5 0.5 0.5 0.5 0.5 
##$DBPOFFS= (0..7)
0 0 0 0 0 0 0 0 
##$DE= 6
##$DECBNUC= <off>
##$DECIM= 24
##$DECNUC= <off>
##$DECSTAT= 4
##$DIGMOD= 1
##$DIGTYP= 9
##$DL= (0..7)
0 120 120 120 120 120 120 120 
##$DP= (0..7)
150 150 150 150 150 150 150 150 
##$DP07= 0
##$DPNAME0= <>
##$DPNAME1= <>
##$DPNAME2= <>
##$DPNAME3= <>
##$DPNAME4= <>
##$DPNAME5= <>
##$DPNAME6= <>
##$DPNAME7= <>
##$DPOAL= (0..7)
0.5 0.5 0.5 0.5 0.5 0.5 0.5 0.5 
##$DPOFFS= (0..7)
0 0 0 0 0 0 0 0 
##$DQDMODE= 0
##$DR= 18
##$DS= 0
##$DSLIST= <SSSSSSSSSSSSSSS>
$$ [...]
##$SUBNAM2= <"">
##$SUBNAM3= <"">
##$SUBNAM4= <"">
##$SUBNAM5= <"">
##$SUBNAM6= <"">
##$SUBNAM7= <"">
##$SUBNAM8= <"">
##$SUBNAM9= <"">
##$SW= 24.0689651099613
##$SWIBOX= (0..15)
0 0 2 0 0 0 0 0 0 0 0 0 0 0 0 0 
##$SW_h= 4816.95568400771
##$TD= 16384
##$TD0= 1
##$TE= 0
##$TE2= 300
##$TE3= 300
##$TEG= 300
##$TL= (0..7)
0 120 120 120 120 120 120 120 
##$TP= (0..7)
150 150 150 150 150 150 150 150 
##$TP07= 0
##$TPNAME0= <>
##$TPNAME1= <>
##$TPNAME2= <>
##$TPNAME3= <>
##$TPNAME4= <>
##$TPNAME5= <>
##$TPNAME6= <>
##$TPNAME7= <>
##$TPOAL= (0..7)
0.5 0.5 0.5 0.5 0.5 0.5 0.5 0.5 
##$TPOFFS= (0..7)
0 0 0 0 0 0 0 0 
##$TUNHIN= 0
##$TUNHOUT= 0
##$TUNXOUT= 0
##$USERA1= <user>
##$USERA2= <user>
##$USERA3= <user>
##$USERA4= <user>
##$USERA5= <user>
##$V9= 5
##$VALIST= <valist>
##$VCLIST= <CCCCCCCCCCCCCCC>
##$VD= 0
##$VDLIST= <DDDDDDDDDDDDDDD>
##$VPLIST= <PPPPPPPPPPPPPPP>
##$VTLIST= <TTTTTTTTTTTTTTT>
##$WBST= 1024
##$WBSW= 4
##$XGAIN= (0..3)
0 0 0 0 
##$XL= 0
##$YL= 0
##$YMAX_a= 68539
##$YMIN_a= -106131
##$ZGOPTNS= <>
##$ZL1= 120
##$ZL2= 120
##$ZL3= 120
##$ZL4= 120
##$ABSF1= 10
##$ABSF2= 0
##$ABSG= 5
##$ABSL= 3
##$ALPHA= 0
##$AQORDER= 0
##$ASSFAC= 0
##$ASSFACI= 0
##$ASSFACX= 0
##$ASSWID= 0
##$AUNMP= <proc_1d>
##$AZFE= 0.1
##$AZFW= 0.1
##$BCFW= 1
##$BC_mod= 2
##$BYTORDP= 1
##$COROFFS= 0
##$CY= 11.3945322036743
##$DATMOD= 1
##$DC= 2
##$DFILT= <>
##$DTYPP= 0
##$F1P= 15.6554695791079
##$F2P= 12.8336369535428
##$FCOR= 0.5
##$FTSIZE= 0
##$FT_mod= 4
##$GAMMA= 1
##$GB= 0.15
##$INTBC= 1
##$INTSCL= 1
##$ISEN= 128
##$LB= 0.24
##$LEV0= 0
##$LPBIN= 0
##$MAXI= 10000
##$MC2= 0
##$MEAN= 0
##$ME_mod= 0
##$MI= 1.114404
##$NCOEF= 0
##$NC_proc= 0
##$NLEV= 6
##$NOISF1= 3.799351
##$NOISF2= 2.8
##$NSP= 1
##$NTH_PI= 0
##$NZP= 0
##$OFFSET= 15.70392
##$PC= 1
##$PHC0= -25531.59
##$PHC1= 14.38748
##$PH_mod= 1
##$PKNL= yes
##$PPARMOD= 0
##$PSCAL= 0
##$PSIGN= 0
##$REVERSE= no
##$SF= 200.130013532006
##$SI= 16384
##$SIGF1= 3
##$SIGF2= 2
##$SINO= 400
##$SIOLD= 16384
##$SREGLST= <1H.CDCl3>
##$SSB= 0
##$STSI= 0
##$STSR= 0
##$SW_p= 3612.71676300578
##$SYMM= 0
##$S_DEV= 0
##$TDeff= 0
##$TDoff= 0
##$TI= <>
##$TILT= no
##$TM1= 0
##$TM2= 0
##$TOPLEV= 0
##$USERP1= <user>
##$USERP2= <user>
##$USERP3= <user>
##$USERP4= <user>
##$USERP5= <user>
##$WDW= 1
##$XDIM= 8192
##$YMAX_p= 0
##$YMIN_p= 0
$$ End of Bruker specific parameters
$$ ---------------------------------
##NTUPLES= NMR FID
##VAR_NAME=  TIME,          FID/REAL,        FID/IMAG
##SYMBOL=    X,             R,               I
##VAR_TYPE=  INDEPENDENT,   DEPENDENT,       DEPENDENT
##VAR_FORM=  AFFN,          ASDF,            ASDF
##VAR_DIM=   8192,          8192,            8192
##UNITS=     SECONDS,       ARBITRARY UNITS, ARBITRARY UNITS
##FACTOR=    0.0002076,     1,               1
##FIRST=     0,             0,               0
##LAST=      1.7004516,     0,               0
##MIN=       0,             -106131,         0
##MAX=       1.7004516,     68539,           0
$$ Real data points
##PAGE= N=1
##DATA TABLE= (X++(R..R)), XYDATA
$$ [...]
$$ plain form
1895 -403 -242 -418 330 498 914 585 421 433 -186 -79 66 -264 -928 -1035 -866 -398 -86 377 312 163 388
1916 388 609 1034 413 421 -67 -886 -691 -542 -483 -314 -210 -607 -241 286 467 677 582 730 194 112 -63 140
1938 140 -131 -492 -660 -595 -603 -133 286 108 319 606 549 672 544 475 -92 -400 -218 -564 -262 -129 -605 -596
1960 -596 -343 82 605 725 623 481 532 420 271 326 -424 -358 -791 -830 -387 -272 215 -399 -94 222 322
1981 322 493 691 273 136 8 -192 -128 -221 -519 -572 -714 -427 71 408 606 279 365 398 521 630 402 -154
2003 -154 -419 -769 -418 -339 -407 -252 -73 -89 -249 305 721 698 444 255 106 -46 -107 27 -670 -745 -750 -303 -107
2026 -107 238 -7 241 124 206 431 222 462 71 -393 -383 -557 -509 -439 -271 -317 -205 159 364 927 533 607
2048 607 80 166 22 294 51 -346 -712 -489 -172 -65 168 197 249 339 496 819 567 256 231 -104 -444 -90
$$ packed form
1895d03J61j76P48J68M16l29j64J2o19J07J45l30o64j07J69M68L12M63o5j49K25
1916C88K21M25o21Qm88q19J95J49N9J69J04l97L66N27J81K10r5J48n36q2j75K03
1938A40k71l61j68O5qM70M19j78K11K87n7J23j28o9n67l08J82l46L02J33m76R
1960e96K53M25N23J20j02j42N1j12j49N5p50O6m33l9M43J15M87o14L05L16J00
1981C22J71J98m18j37j28k00O4r3k98n3j42K87M98L37J98l27Q6L3J23J09k28n56
2003a54k65l50L51P9o8J55J79j6j60N54M16k3k54j89j49j52o1J34o97p5nM47J96
2026a07L45k45K48j17Q2K25k09K40l91m64J0j74M8P0J68m6J12L64K05N63l94P4
2048F07n27Q6j44K72k43l97l66K23L17J07K33K9N2R0J57L23k52l11k5l35l40L54
$$ plain form
2070 -90 -72 80 -509 -529 -132 -117 436 526 674 176 -7 107 140 150 99 -195 -320 -679 -601 -12 -160 -435 68
2093 68 243 365 478 532 437 95 -403 -122 -104 8 -180 -452 -555 -482 -220 130 570 357 -35 266 512 469
2115 469 363 35 -186 -541 -404 -313 -468 -424 -338 -297 -232 283 672 1013 482 40 -145 25 -53 -8 -121 -652
2137 -652 -749 -367 -109 21 84 192 212 209 298 661 393 -53 -400 -378 -254 -259 -347 -312 -331 -360 17 430 499 642 555
2162 555 435 244 -71 414 98 -330 -744 -534 -446 -592 -307 175 234 -46 221 425 604 182 359 140 81
2183 81 -450 -330 -273 -481 -588 -44 55 78 392 477 590 113 257 194 263 18 -214 -84 -976 -677 -285 58
2205 58 6 -254 -22 339 344 417 484 470 53 -446 113 -163 -316 -610 -637 -119 -248 177 608 195 4 298 342
2228 342 185 368 204 -25 -440 -477 -31 -393 -194 -278 175 -282 105 661 834 393 -118 137 -78 122 -203
$$ packed form
2070i0J8J52n89k0L97J5N53R0J48m98j83J14L3J0n1k94j25l59P8N89j48k75N03
2093F8J75J22J13N4r5l42m98K81J8J12j88k72j03P3K62L50M40k13l92L01K46m3
2115D69j06l28k21l55J37R1j55M4Q6M1O5N15L89L41n31m42j85J70p8M5j13n31
2137f52r7L82K58J30O3J08K0lQ9L63k68m46l47K2J24nq8L5j9k9L77M13O9J43q7
2162E55j20j91l15M85l16m28m14K10Q8j46K85M82N9k80K67K04J79m22J77k19n9
2183H1n31J20N7k08j07N44R9K3L14Q5J13m77J44o3O9k45k32J30q92K99L92L43
2205E8n2k60K32L61NP3O7j4m17m99N59k76j53k94k7N18j29M25M31m13j91K94M4
2228C42j57J83j64k29m15l7M46l62J99q4M53m57L87N56J73m41n11K55k15K00l25
$$ plain form
2249 -203 -174 -426 -757 -521 130 -34 -145 82 363 151 205 613 503 216 -128 -199 -248 -226 -432 -272 -206 -358
2271 -358 -342 340 598 140 480 492 273 79 141 208 36 -582 -231 -401 -367 -146 109 94 7 106 479 690 202
2294 202 148 42 51 -475 -116 -195 -207 -489 -245 -96 53 19 667 687 81 260 349 596 101 -134 -104 -349 -797
2317 -797 -372 217 -116 -389 -143 352 316 52 338 436 -73 -237 170 -244 -408 -154 81 -148 -327 -73 643
2338 643 95 -25 450 426 325 264 372 176 -520 -690 -76 268 -367 -378 96 -53 -97 129 760 611 -224
2359 -224 320 251 -293 -258 -58 145 -178 -215 74 73 7 123 233 322 267 281 987 394 -292 -102 -26 -448 -617
2382 -617 -118 -89 -135 -500 292 477 267 140 343 261 102 -12 208 -101 -228 -459 -236 -85 -491 -22 234
2403 234 18 -38 325 426 266 303 313 4 -327 -400 156 111 -423 -581 -147 66 -29 327 642 155 302 295 589
$$ packed form
2249b03K9k52l31K36O51j64j11K27K81k12N4M08j10k87l44p1m9K2k06J60O6j52
2271c58J6O82K58m58L40J2k19j94O2O7j72o18L51j70L4K21K55j5q7R9L73K11m88
2294B02n4j06Rn26L59p9j2k82K44J49J49l4O48K0o06J79Q9K47m95k35L0k45m48
2317g97M25N89l33k73K46M95l6k64K86R8n09j64M07m14j64K54K35k29j79K54P16
2338F43n48j20M75k4j01o1J08j96o96j70O14L44o35j1M74j49m4K26O31j49q35
2359b24N44o9n44L5K00K03l23l7K89jo6J16J10Q9n5J4P06n93o86J90P6m22j69
2382f17M99K9m6l65P92J85k10j27K03q2j59j14K20l09j27k31K23J51m06M69K56
2403B34k16n6L63J01j60L7J0l09l31p3N56m5n34j58M34K13r5L56L15m87J47pK94
$$ plain form
2426 589 144 -390 -223 -173 -456 -333 -49 46 -226 -12 446 -54 295 358 556 75 -514 12 -156 -98 -604
2447 -604 62 -286 -286 -271 411 471 133 4 394 313 169 250 353 -36 -121 -51 118 -431 -96 91 -14 -116 -24
2470 -24 562 606 160 30 189 193 -187 -243 104 -401 -532 -266 51 -143 75 215 437 61 92 477 606 -151
2492 -151 -152 -24 -327 -402 -143 64 -126 -311 -168 340 139 60 -39 456 -88 -367 164 -35 -401 -420 -124 -8
2514 -8 -416 -83 523 32 -27 243 333 387 -61 -48 43 -141 -504 38 -134 -468 -139 123 64 -40 306 679 39
2537 39 -26 182 386 -55 -441 28 -68 -117 -469 125 222 -330 -227 270 188 100 104 294 307 -154 -26 108 -187
2560 -187 -217 -131 23 -196 -257 71 727 2 102 340 -34 -389 117 257 72 -732 -304 -32 -140 -186 -97 135
2582 135 11 19 593 360 104 -49 99 72 -314 -126 -15 -228 -995 -476 359 27 25 124 264 141 119 403
$$ packed form
2426E89m45n34J67N0k83J23K84R5k72K14M58n00L49O3J98m81n89N26j68N8n06
2447f04O66l48%J5O82O0l38j29L90q1j44Q1J03l89q5P0J69n49L35J87j05j02R2
2470b4N86M4m46j30J59Ml80n6L47n05j31K66L17j94K18J40K22l76L1L85J29p57
2492a51jJ28l03p5K59K07j90j85J43N08k01p9r9M95n44k79N31j99l66j9K96J16
2514hm08L33O06m91n9K70R0N4m48J3R1j84l63N42j72l34L29K62n9j04L46L73o40
2537C9o5K08K04m41l86M69r6m9l52N94R7n52J03M97q2q8MJ90J3m61J28J34k95
2560a87l0Q6J54k19o1L28O56p25J00K38l74l55N06J40j85q04M28K72j08m6Q9K32
2582A35j24QN74k33k56j53J48k7l86J88J11k13p67N19Q35l32kR9J40j23k2K84
$$ plain form
2604 403 556 -106 -184 -143 -215 -533 -326 196 227 -218 36 361 600 247 -21 315 72 -476 106 -8 -37 -514
2626 -514 -164 290 -378 -166 306 273 61 95 497 284 -49 139 -150 158 -388 -295 96 -279 -331 87 541
2647 541 44 -146 654 134 282 345 331 -55 -455 -279 -151 -349 -503 156 254 130 -128 -120 299 2 229 52
2669 52 167 -356 -41 41 -92 -154 -266 13 -59 43 157 504 156 104 116 495 -49 300 -66 -151 -62 -272 -40
2692 -40 115 -258 71 186 -54 -64 455 701 77 -249 176 92 -383 -330 -53 198 -552 -237 273 189 -43 176
2714 176 577 51 69 86 388 8 -543 -304 -141 -268 -408 137 121 -201 -421 355 382 241 -106 320 103
2735 103 -279 60 204 -352 -331 -321 -93 -84 -28 98 372 -7 70 278 308 42 227 47 41 -286 16 90 -264
2758 -264 -276 -3 195 154 -17 274 282 -33 48 85 186 -124 -226 -38 -227 -459 -236 91 229 -231 -29 314
$$ packed form
2604D03J53o62p8M1p2l18K07N22L1m45K54L25K39l53k68L36k43n48N82j14k9m77
2626e14L50M54o68K12M72l3k12L4M02k13l33J88k89L08n46R3L91l75n2M18M54
2647E41m97j90Q00n20J48O3j4l86m00J76J28j98j54O59R8j24k58QM19k97K27j77
2669E2J15n23L15Q2j33o2j12K79p2J02J14L47l48n2J2L79n44L49l66q5Q9k10K32
2692d0J55l73L29J15k40j0N19K46o24l26M25q4m75N3K77K51p50L15N10q4k32K19
2714A76M01n26J8J7L02l80n51K39J63j27j40N45j6l22k20P76K7j41l47M26k17
2735A03l82L39J44n56K1J0K28RN6J26K74l79P7K08L0k66J85j80ol27L02P4l54
2758b64j2K73J98m1j71K91Ql15Q1L7J01l10j02J88j89k32K23L27J38m60K02L43
$$ plain form
2780 314 158 -9 -96 251 -288 -512 -177 -63 -252 -451 -2 -256 -359 58 278 170 -23 3 256 116 -44
2801 -44 -116 221 -89 -166 12 -131 -256 60 -94 393 -171 -281 361 179 -141 -35 65 78 -436 -365 -67 -138
2823 -138 -265 -248 106 -36 -143 185 171 -6 198 275 216 -178 -137 70 -498 -241 210 30 -173 -110 -20 262
2845 262 -38 161 332 386 -241 -221 92 -138 -175 -373 12 -164 2 -140 137 -129 111 413 252 248 -331 126
2867 126 155 -434 -193 -209 112 -65 -56 -70 -19 191 205 357 -4 -240 38 180 -267 -249 26 -227 -222 -312 -164 66
2891 66 -148 182 156 229 80 308 323 74 -47 -195 91 -141 -124 -167 94 -70 -12 168 40 107 -137 31 -41
2914 -41 76 2 -278 -156 -291 -308 58 -1 84 135 114 86 4 145 25 -150 -172 199 -25 -62 84 -181 27 -225
2938 -225 -123 217 61 -13 -17 357 376 -46 135 214 -203 -287 -219 135 8 -132 -119 -34 126 159 -8 61 198 32
$$ packed form
2780C14j56j67q7L47n39k24L35J14j89j99M49k54j03M17K20j08j93K6K53j40j60
2801d4p2L37l10p7J78j43j25L16j54M87n64j10O42j82l20J06J00J3n14P1K98p1
2823a38j27J7L54j42j07L28j4j77K04P7n9l94M1K07n68K57M51j80k03O3R0K82
2845B62l00J99J71N4o27K0L13k30l7j98L85j76J66j42K77k66K40L02j61mn79M57
2867A26K9n89K41j6L21j77Rj4N1K10J4J52l61k36K78J42m47J8K75k53Nr0J48K30
2891F6k14L30k6P3j49K28J5k49j21j48K86k32J7m3K61j64N8J80j28O7k44J68p2
2914d1J17p4k80J22j35j7L66n9Q5N1k1k8q2J41j20j75k2L71k24l7J46k65K08k52
2938b25J02L40j56p4mL74J9m22J81P9m17q4O8L54j27j40J3Q5J60L3j67O9J37j66
$$ plain form
2962 32 -292 -52 55 -152 190 -96 -157 -86 -236 -131 -99 3 84 -205 90 380 73 131 92 -319 -431 -207
2984 -207 118 -236 -133 -46 146 60 86 168 419 155 93 -54 21 112 -130 -273 167 -160 -182 148 372 2 -340
3007 -340 -74 -37 273 299 211 -71 -128 -36 -73 -78 -348 -230 -47 15 3 158 334 289 68 266 274 -99 -166 205 -32
3032 -32 -140 -85 -66 93 142 -120 -191 -91 -3 149 329 104 -44 -96 -47 -309 -121 254 196 -198 44 204 4
3055 4 102 203 229 -66 127 -206 94 -30 -267 61 -8 -93 -138 158 32 126 -54 100 -3 29 5 -129 -84 139
3079 139 199 104 35 -41 -154 -80 -158 -224 169 -115 62 22 146 -108 86 -81 59 27 -222 -18 -70 -258 26
3102 26 36 -166 132 -160 288 182 68 -81 16 -46 216 212 -65 -427 -410 -225 -151 -37 -48 130 -33 -62 351
3125 351 130 157 -235 -78 -107 -118 -128 -66 -70 107 -42 370 371 -102 -39 29 110 86 -161 -105 -79 -262 -31 -148 214
$$ packed form
2962C2l24K40J07k07L42k86o1P1j50J05L2J02Q1k89K95K90l07N8l9m11j12K24
2984b07L25l54J03Q7J92q6K6Q2K51k64o2j47P5R1k42j43M40l27k2L30K24l70l42
3007c40K66L7L10K6q8k82n7R2l7nk70J18J83O2j2J55J76m5k21J98Ql73o7L71k37
3032c2j08N5J9J59M9k62p1J00Q8J52J80k25j48n2M9k62J88L75n8l94K42J60k00
3055DR8J01K6k95J93l33L00j24k37L28o9q5m5K96j26R4j80J54j03L2k4j34M5K23
3079A39O0r5o9p6j13P4p8o6L93k84J77m0J24k54J94j67J40l2k49K04n2j88K84
3102B6J0k02K98k92M48j06j14j49R7o2K62mk77l62J7J85P4J14j1J78j63k9M13
3125C51k21K7l92J57k9j1j0O2mJ77j49M12Jm73O3O8Q1k4k47N6K6j83K31j17L62
$$ plain form
3150 214 36 64 33 187 43 36 -15 125 -141 -271 150 101 -167 -72 175 34 -58 -229 -133 143 279 204 -229
3173 -229 -106 128 165 -150 67 -164 -20 -243 -171 181 -72 -91 -159 90 150 -21 107 3 -23 -128 -159 47
3195 47 67 8 -70 59 121 -172 76 112 194 132 221 179 -256 -159 -111 -255 -577 74 27 7 -2 -68 -11 87 -99 322
3221 322 233 -38 -230 59 214 -6 -133 -214 -228 202 -47 71 274 192 129 19 111 141 244 268 64 -201 48
3244 48 -140 9 -226 123 55 -142 36 362 339 335 -183 105 -48 -189 328 -65 60 -190 -168 -184 58 6 214
3267 214 119 84 -63 48 -31 -51 257 -14 15 -30 -352 -230 -17 -145 10 90 139 219 -110 0 -64 -319 157
3290 157 259 -27 -169 -72 30 -61 -53 172 -41 17 254 -195 -21 -76 -100 147 -28 115 12 -121 -234 -133
3312 -133 -273 28 -179 62 185 -146 185 -170 264 149 263 -109 57 -171 -128 -186 -78 -226 -21 4 -139
$$ packed form
3150B14j78K8l1J54j44pn1J40k66j30M21m9k68R5K47j41r2j71R6K76J36p5m33
3173b29J23K34L7l15K17k31J44k23P2L52k53j9o8K49O0j71J28j04k6j05l1K06
3195D7K0n9p8J29O2k93K48L6Q2o2Q9m2m35R7M8j44l22O51m7k0ro6N7R8j86M21
3221C22q9k71j92K89J55k20j27q1j4M30k49J18K03q2o3j10R2L0J03K4k04k65K49
3244D8j88J49k35L49o8j97J78L26k3mn18K88j53j41N17l93J25k50K2j6K42n2K08
3267B14r5l5j47J11p9k0L08k71K9m5l22J22K13j28J55Q0M9Q0l29J10o4k55M76
3290A57J02k86j42R7J02r1QK25k13N8K37m49J74n5k4K47j75J43j03j33j13J01
3312a33j40L01k07K41J23l31L31l55M34j15J14l72J66k28M3n8J08j48K05K5j43
$$ plain form
3333 -139 148 190 -86 236 67 -132 -165 -64 -140 -167 68 169 -277 -97 -208 206 72 37 -84 -96 -36 10 129
3356 129 -14 -135 149 -159 49 6 298 -29 19 -22 -22 157 201 226 -53 148 65 107 -67 -248 -201 317 -83
3379 -83 -56 28 298 165 53 8 -17 -165 -48 -182 -145 40 -93 151 -23 -188 -56 -117 129 -30 274 -120
3401 -120 -59 180 42 143 -165 337 38 -226 -6 -81 -61 -96 -41 142 45 246 169 81 -16 28 -142 2 13 -105
3425 -105 -223 -143 -23 -175 -72 10 316 40 283 315 60 -321 90 84 -169 -31 -157 -128 -56 -32 105 -56 33
3448 33 198 27 -120 -45 -102 99 -86 -179 -272 -95 -267 175 -135 -48 -180 -52 69 48 21 97 52 190 31
3471 31 -122 -7 85 -19 -62 -61 -81 56 -296 190 208 4 216 112 10 123 106 -121 143 7 246 -187 110
3494 110 143 -65 113 106 -12 -188 -10 -40 145 169 423 115 81 -69 -93 -63 -64 -151 -125 126 55 -115 293 -163
$$ packed form
3333a39K87M2k76L22j69j99l3J01p6k7K35J01m46J80j11M14j34l5j21j2O0M6J19
3356A29j43j21K84l08K08m3K92l27M8m1%J79M4K5k79K01q3M2j74j81M7N18m00
3379h3K7Q4K70j33j12m5k5j48J17j34L7J85j33K44j74j65J32o1K46j59L04l94
3401a20O1K39j38J01l08N02k99k64K20p5K0l5N5J83r7K01p7q8r7M4j70J44J1j18
3425a05j18Q0J20j52J03Q2L06k76K43L2k55l81M11ok53J38j26K9P2K4J37j61Q9
3448C3J65j71j47P5n7K01j85r3r3J77j72M42l10Q7j32J28J21k1k7P6m5J38j59
3471C1j53J15R2j04m3Jk0J37l52M86J8k04K12j04j02J13j7k27K64j36K39m33K97
3494A10L3k08J78pj18j76J78l0J85K4K54l08l4j50k4L0jq7K6K51p1j70M08m56
$$ plain form
3518 -163 106 -105 42 -70 128 241 -116 212 -365 -79 148 -10 -21 -35 111 -108 -83 -194 156 -268 0
3539 0 145 124 -12 -231 -136 392 119 -91 189 145 -5 47 182 115 166 4 -70 186 -34 45 225 -51 -64 46
3563 46 348 -124 -144 46 46 27 -26 -206 -113 236 -214 234 -157 5 -207 -114 -14 72 367 -49 -4 -97 86 -40
3587 -40 -106 235 -22 64 -67 -134 -249 36 -47 -20 120 -141 -312 -95 6 -136 21 -364 158 2 144 6
3609 6 -176 -94 -196 255 95 -126 131 -233 180 147 27 -198 23 173 -131 -29 175 250 -61 110 224 59
3631 59 30 330 84 -261 195 -121 -172 32 -258 146 70 191 -78 -43 216 201 -155 -222 26 76 -169 182 114
3654 114 56 -181 -138 71 75 25 -234 203 137 149 125 82 104 149 -87 -60 242 152 -60 -66 -239 120 -196 -210 -18
3679 -18 -92 44 73 -35 -122 179 11 -118 -165 67 -28 118 -13 0 70 -33 174 -48 91 130 108 -97 -239
$$ packed form
3518a63K69k11J47j12J98J13l57L28n77K86K27j58j1j4J46k19K5j11L50m24K68
3539@J45k1j36k19R5N28k73k10K80m4j50N2J35o7N1j62p4K56k20P9J80k76j3J10
3563D6L02m72k0J90%j9n3j80R3L49m50M48l91J62k12R3J00Q6K95m16M5r3J83j26
3587d0o6L41k57Q6j31o7j15K85q3K7J40k61j71K17J01j42J57l85N22j56J42j38
3609Fj82Q2j02M51j60k21K57l64M13l3j20k25K21J50l04J02K04P5l11J71J14j65
3631E9k9L00k46l45M56l16n1K04k90M04p6J21k69L5K59j5l56o7K48N0k45L51o8
3654A14n8k37M3K09Mn0k59M37o6J2k4m3K2M5k36K7L02r0k12oj73L59l16j4J92
3679a8p4J36K9j08q7L01j68j29m7K32r5J46j31J3P0j03K07k22J39L9k2k05j42
$$ plain form
3702 -239 -142 140 -6 -298 241 11 404 -112 32 227 153 185 183 362 308 -25 -229 -143 -46 21 -24 -161 -94 107
3726 107 295 96 168 55 -326 -224 -54 53 32 -251 -39 -23 -345 -17 182 161 126 -24 -132 -105 128 -132
3748 -132 -8 24 -93 -63 -45 -225 -118 -115 -35 -19 71 108 86 38 188 21 -43 147 71 -23 -158 150 96 38 31 -103
3774 -103 340 -109 -128 -217 147 95 51 -51 -148 -235 2 256 -2 -256 70 -24 -90 -204 -51 164 147 71 -123
3797 -123 154 139 115 37 -121 46 -110 43 13 -281 20 -17 153 -273 154 -115 -18 35 -9 -219 -59 94 -15
3820 -15 143 52 -110 132 -75 -59 14 35 251 -32 24 28 -60 16 -23 98 30 -30 -232 62 -167 85 221 7
3844 7 23 130 -3 357 -124 247 15 -265 273 106 -87 91 214 -98 307 54 151 -89 322 147 -30
3865 -30 -91 67 79 53 151 -65 95 -187 187 44 170 170 -339 104 358 27 125 -24 -199 11 -217 -121 -16
$$ packed form
3702b39R7K82j46k92N39k30L93n16J44J95p4L2kJ79n4l33k04Q6R7O7m5j37O7K01
3726A07J88j99P2j13l81J02J70J07k1k83K12J6l22L28J99k1l5j50j08K7K33k60
3748a32J24L2j17L0J8j80J07LQ0J6R0L7k2m8J50j67o4J90p6r4j35L08n4n8pj34
3774a03M43m49j9q9L64n2m4j02r7q7K37K54k58k54L26r4o6j14J53K15j7p6j94
3797a23K77j5k4p8j58J67j56J53l0k94L01l7J70m26M27k69R7N3m4k10J60J53j09
3820a5J58r1j62K42k07J6P3K1K16k83N6Mq8P6l9J21o8o0k02K94k29K52J36k14
3844GJ6J07j33L60m81L71k32k80N38j67j93J78J23l12M05k53R7k40M11j75j77
3865c0o1J58J2k6R8k16J60k82L74j43J26%n09M43K54l31R8j49j75K10k28R6J05
$$ plain form
3888 -16 7 -255 -228 57 239 -1 62 -217 -155 -198 -102 -124 -49 121 -19 26 -260 -180 -27 240 -103 22 88 -68
3912 -68 15 173 -112 -206 124 -215 -100 27 139 -163 -71 348 -152 9 108 -146 -261 -65 -99 -211 -82 -235
3934 -235 64 -138 150 -114 -136 -37 88 159 -192 183 -73 -166 -32 -305 -66 247 -63 -326 -82 54 135 -67
3956 -67 240 151 199 129 -398 340 88 107 -178 57 -35 54 59 -191 202 152 149 121 169 -27 -72 80 -197 177 108
3981 108 46 91 -52 -9 -5 112 255 63 104 -13 71 -118 -249 -336 110 -278 -189 54 114 242 -27 -156 -252 159
4005 159 59 95 -62 118 -36 21 106 -28 97 104 3 41 -10 -21 -21 -53 83 56 -233 203 -18 76 13 -25 -36
4030 -36 -49 43 82 -298 -85 38 -93 -29 207 99 -63 90 -128 -11 -181 -55 -14 -53 175 -193 49 -230
4052 -230 53 -25 -41 14 175 -94 45 -21 190 169 105 -61 48 90 -153 -126 177 -76 -157 -179 11 -155 -256
$$ packed form
3888a6K3k62K7K85J82k40O3k79O2m3R6k2P5J70j40M5k86Q0J53K67l43J25O6j56
3912f8Q3J58k85r4L30l39J15J27J12l02R2M19n00J61R9k54j15J96l4j12J29j53
3934b35K99k02K88k64k2R9J25P1l51L75k56r3J34k73K39L13l10k63K44J36Q1k02
3956f7L07q9M8p0n27P38k52J9k85K35r2Q9Nk50L93n0lk8M8j96m5J52k77L74o9
3981A08o2M5j43M3MJ17J43j92M1j17Q4j89j31q7M46l88Q9K43O0J28k69j29r6M11
4005A59j00L6j57J80j54N7Q5j34J25Pj01L8n1j1%l2J36k7k89M36k21R4o3l8j1
4030c6j3R2L9l80K13J23j31O4K36j08j62J53k18J17j70J26M1l9K28l68K42k79
4052b30K83p8j6N5J61k69J39o6K11k1o4j66J09M2k43K7L03k53q1k2J90j66j01
$$ plain form
4075 -256 -76 55 10 -82 126 10 -23 -200 -55 74 -27 -436 16 -112 80 259 -349 -227 160 174 16
4096 16 105 65 191 -49 188 137 34 163 292 -124 -61 190 -195 94 -274 139 186 -52 5 99 -164 -122 96
4119 96 178 241 -189 120 49 -346 -103 -66 -55 -176 -118 -281 199 -255 233 22 53 107 -111 -182 121 -50 -15 7
4143 7 61 -29 3 -121 -37 -242 -102 81 -279 -47 29 -183 -217 33 -84 -103 -56 101 -71 -22 -107 -23 -124 305
4167 305 107 189 -55 21 -280 65 188 -128 -61 251 201 129 -11 -57 122 -305 -265 -121 -45 205 -74 -73 19 -98
4191 -98 24 216 115 251 116 -496 -72 206 163 125 -6 61 60 62 119 -94 -4 206 -85 122 -144 70 14 30
4215 30 -38 -174 -126 46 -147 212 192 -343 -50 108 114 -7 98 -34 114 -164 -97 288 4 241 263 -49 242
4238 242 -171 -118 27 61 69 93 -53 -113 -207 61 -136 -10 182 -291 92 -17 -64 91 7 87 125 37 87 46 -79
$$ packed form
4075b56J80J31m5r2K08j16l3j77J45J29j01m09M52j28J92J79o08J22L87J4j58
4096A6Q9m0J26k40K37n1j03J29J29m16O3K51l85K89l68M13M7k38N7R4k63M2K18
4119I6Q2O3m30L09p1l95K43L7J1j21N8j63M80m54M88k11L1N4k18p1L03j71L5K2
4143GN4r0L2j24Q4k05J40J83l60K32P6k12l4K50j17j9M7J57j72M9q5Q4j01M29
4167C05j98Q2k44P6l01L45J23l16O7L12n0p2j40m6J79m27M0J44P6K50k79JR2j17
4191i8J22J92j01J36j35o12M24K78m3l8j31O7jKN7k13R0K10k91K07k66K14n6J6
4215C0o8j36M8J72j93L59k0n35K93J58Oj21J05j32J48k78O7L85k84K37K2l12K91
4238B42m13N3J45L4QK4j46o0r4K68j97J26J92m73L83j09m7J55q4Q0L8q8N0m1j25
$$ plain form
4263 -79 -111 -150 110 -94 -73 215 -178 -52 41 272 -29 192 167 -51 185 25 2 -5 56 67 -235 157 149 90 62
4288 62 104 133 -178 -134 -212 -148 55 -96 170 195 -26 -20 43 17 38 -27 -55 63 -118 40 76 -167 -100 -151 -23 73
4314 73 100 -27 -99 52 -145 -118 -46 3 -13 24 36 166 -237 114 -11 -56 -116 -75 -314 -159 76 -9 84 -99 -21
4339 -21 -16 18 -174 -22 36 -40 -29 -25 -178 276 157 230 196 -90 7 -100 20 -5 -252 -103 42 3 -70 84 -178
4364 -178 -30 -259 102 191 127 -134 217 39 -151 170 -99 176 51 242 238 -163 -216 118 -74 191 119 143
4386 143 190 -436 10 -42 -9 -23 -150 50 140 -82 2 57 18 -132 -8 -27 -5 -149 13 -171 243 -105 43
4409 43 132 68 70 113 291 -93 -65 -367 58 -60 -63 -150 -178 27 23 -116 27 -15 237 -47 234 -174 271 -25 -312
4434 -312 95 261 79 -107 312 -136 -119 208 -25 -112 -144 92 32 25 -53 75 280 -35 373 234 -25 -113 156
$$ packed form
4263g9l2l9K60k04K1K88l93J26R3K31l01K21k5k18K36j60k3pO1J1l02L92qn9k8
4288F2M2K9l11M4p8O4K03j51K66K5k21OO3k6K1o5k8J18j81J58L6k43O7n1J28R6
4314G3K7j27p2J51j97K7P2M9j6L7J2J30m03L51j25m5o0M1k39J55K35q5R3j83P8
4339b1NL4j92J52N8p6J1Mj53M54j19P3l4k86R7j07J20k5k47J49J45l9p3J54k62
4364a78J48k29L61Q9o4k61L51j78j90L21k69K75j25J91mm01n3L34j92K65p2K4
4386A43M7o26M46n2L3j4j27K00R0k22Q4N5l9j50J24j9K2j44J62j84M14l48J48
4409D3Q9o4KM3J78l84K8l02M25j18lq7k8K05mj39J43m2K52k84K81m08M45k96k87
4434c12M07J66j82j86M19m48J7L27k33q7l2K36o0pp8J28K05l15M08j39k59q8K69
$$ plain form
4457 156 -103 -156 -113 -18 -222 33 6 -114 -217 155 -12 -209 145 96 -16 54 -387 96 6 100 79 -96 -388
4480 -388 135 -48 -54 39 -221 74 -20 -74 -1 -51 -61 -129 -411 179 115 127 125 60 58 29 56 64 157 195 52 -212 15
4507 15 23 -68 -180 85 -84 -74 -82 -149 84 96 -143 -88 -19 -14 -79 -200 232 -328 20 212 16 -118 -69 -177 -169 99
4533 99 -296 -29 180 -67 148 -287 16 9 -83 49 32 251 -41 8 -109 -47 -218 -146 -125 -156 196 -18 -116 -95
4557 -95 -83 198 75 284 109 -34 3 -52 -82 -26 118 149 -94 -49 -60 -107 -295 12 184 -130 -48 189 75 -224
4581 -224 -122 177 52 -31 -271 108 -23 105 -139 -2 -140 -189 -33 -179 81 62 -4 115 84 -90 -59 157
4603 157 -33 -140 13 -271 -29 19 -82 -51 -89 122 65 -134 -150 -23 97 -112 -139 72 -9 -147 48 5 47
4626 47 -80 -39 98 273 10 -58 -54 -158 137 239 -146 -242 131 198 -137 171 -29 -241 -157 138 148 106 -31
$$ packed form
4457A56k59n3M3R5k04K55k7j20j03L72j67j97L54m9j12P0m41M83r0R4k1j75k92
4480c88N23j83oR3k60K95r4n4P3n0j0o8k82N90o4J2ko5kk9K7QR3L8j43k64K27
4507A5Qr1j12K65j69J0qo7K33J2k39N5O9No5j21M32n60L48J92j96j34M9j08QK68
4533I9l95K67K09k47K15m35L03pr2J32j7K19k92M9j17O2j71P2K1l1L52k14r8K1
4557i5J2K81j23K09j75j43L7n5l0N6J44L1k43M5j1m7j88L07J72l14Q2K37j14k99
4581b24J02K99j25q3k40L79j31J28k44J37j38m9J56j46K60j9o6J19l1j74L1K16
4603A57j90j07J53k84K42M8j01L1l8K11n7j99j6J27J20k09k7K11q1j38J95m3M2
4626D7j27M1J37J75k63o8Mj04K95J02l85r6L73O7l35L08k00k12Q4K95J0m2j37
$$ plain form
4649 -31 121 -210 -103 183 -174 181 -79 -191 -129 -210 90 89 -116 -60 -28 -14 3 -37 -100 -286 -112 -103 -116 302 -238
4674 -238 77 -145 111 -37 -119 -79 54 12 197 -267 128 100 -343 242 -5 -240 218 200 171 -252 147 -185
4696 -185 -9 -120 -274 -154 -208 -161 17 -207 33 71 -92 -119 -75 -38 187 37 -207 -138 85 265 91 -37
4718 -37 -74 104 61 -8 149 -205 285 56 195 -54 120 -77 -275 -13 17 4 -41 -149 73 -197 54 -23 72
4741 72 74 -2 150 -336 52 -233 78 -165 -149 205 -14 149 44 -98 -159 -7 -11 -75 62 7 -69 273 -52 -215
4765 -215 52 40 -180 -81 133 -23 58 -10 233 77 -143 -58 -91 -359 -9 265 -23 26 17 65 67 63 151 161 94 143
4791 143 -11 -330 -84 237 9 166 159 -43 16 -162 -142 -29 -149 -8 -201 -99 -108 138 -278 98 -8 -145
4813 -145 -22 25 -236 -14 -140 76 -34 24 39 45 -5 38 114 -31 -137 -156 -147 -49 361 -23 -99 113 163 -90 -3
$$ packed form
4649c1J52l31J07K86l57L55k60j12O2q1L00jk05N6L2J4J7m0o3j86J74Rj3M18n40
4674b38L15k22K56j48q2M0J33m2J85m64L95k8m43N85k47k35M58j8k9m23L99l32
4696a85J76j11j54J20n4M7J78k24K40L8j63k7M4L7K25j50k44O9K23J80j74j28
4718c7l7J78m3o9J57l54M90k29J39k49J74j97j98K62L0j3m5j08K22k70K51p7R5
4741G2Kp6J52m86L88k85L11k43J6L54k19J63j05j42o1J52mo4J37n5p6L42l25j63
4765b15K67j2k20R9K14j56Q1o8K43j56k20Q5l3k68L50K74k88M9rM8KmQ8J0o7M9
4791A43j54l19K46L21k28J57pk02N9j78K0J13j20J41j93J02rK46m16L76j06j37
4813a45J23M7k61K22j26K16j10N8J5On0M3P6j45j06j9RR8M10l84p6K12N0k53Q7
$$ plain form
4838 -3 4 19 -66 -271 -43 -109 8 -199 -172 40 331 19 126 46 53 -68 170 4 39 -275 156 -84 -105 -170 -10
4863 -10 177 -153 20 66 179 0 -91 92 87 167 -262 164 53 35 -55 -280 -164 -177 -249 -4 98 129 -26 198
4887 198 77 42 -168 -75 -113 73 38 31 308 66 40 104 -179 177 145 63 -19 -16 162 128 40 253 -370 -108 -4
4912 -4 -88 13 -123 20 381 -176 -120 122 270 -47 -104 205 -165 190 189 -17 -206 -186 -46 85 113 61 -6 128
4936 128 25 106 -54 284 83 -56 84 -193 -149 48 -37 275 11 136 -156 -83 150 -241 -229 174 79 57
4958 57 89 -90 10 -252 209 -75 -82 -93 100 6 -185 34 11 -126 -61 -123 87 84 60 -107 28 -95 -26 -30 -227
4983 -227 208 -17 -91 166 114 106 -119 27 127 -36 81 -69 -72 -50 196 89 -127 -91 -148 -238 136 331 2
5006 2 -148 195 4 69 -38 -73 -49 -117 78 -18 40 299 -275 -117 -30 -225 72 157 -161 -172 -135 -222 202 -24
$$ packed form
4838cPJ5q5k05K28o6J17k07K7K12K91l12J07q0Pj21K38j66L5l14M31k40k1o5J60
4863a0J87l30J73M6J13j79r1J83nQ0m29M26j11j8r0k25J16j3p2K45J02L1j55K24
4887A98j21l5k10R3l8J86l5pK77k42k6O4k83L56l2q2q2LJ78l4q8K13o23K62J04
4912dq4J01j36J43L61n57N6K42J48l17n7L09l70L55jk06j89K0J40J31K8n2o7J34
4936A28j03Q1j60L38k01j39J40k77M4J97q5L12k64J25k92P3K33l91J2M03r5k2
4958E7L2j79J00k62M61k84pj1J93r4j91K19k3j37O5o2K10lk4j67J35j23O9mj97
4983b27M35k25p4K57n2qk25J46J00j63J17j50lK2K46j07k16L6n7r0L74J95l29
5006Bj50L43j91O5j07l5K4o8J95r6N8K59n74J58Q7j95K97Q5l18j1L7q7M24k26
$$ plain form
5030 -24 196 73 17 65 135 57 -110 -186 165 -68 122 238 228 -37 -70 -51 -45 -171 58 35 -90 -46 37 -50 -33
5055 -33 -206 -89 -30 58 -136 18 63 244 7 -64 306 -218 -222 52 -65 -184 70 26 69 -157 9 107 100 144
5079 144 -249 -145 -158 -82 -204 -177 -20 -46 356 -50 -126 13 -83 -226 -111 163 8 -35 -101 5 34 63 -63
5102 -63 160 -22 -103 122 -227 -55 -248 -1 228 -120 211 198 13 238 -298 198 28 27 -231 -81 43 113
5124 113 8 -93 -175 -55 76 -34 -170 -57 109 -127 -21 -88 -352 -15 10 -85 -23 -1 -41 -40 33 37 -125 -82
5148 -82 -10 77 74 0 -139 189 8 -23 245 169 127 -154 118 -62 -11 157 89 102 111 317 377 -240 8 -93 -17
5173 -17 -268 -92 52 -215 -109 -214 108 -178 7 71 138 128 -147 45 129 -49 -130 -252 -182 351 -42 -68 7
5196 7 -61 32 345 100 63 -112 -72 162 4 134 -209 35 -27 316 -240 -72 99 45 159 -94 422 102 -34
$$ packed form
5030b4K20j23n6M8P0p8j67p6L51k33J90J16j0k65l3J9Oj26K29k3j25M4Q3q7J7
5055c3j73J17N9Q8j94J54M5J81k37p1L70n24mK74j17j19K54m4M3k26J66R8pM4
5079A44l93J04j3P6j22K7J57k6M02m06p6J39r6j43J15K74j55m3o6J06K9K9j26
5102f3K23j82q1K25l49J72j93K47K29l48L31j3j85K25n36M96j70jk58J50J24P0
5124A13j05j01q2J20J31j10j36J13J66k36J06o7k64L37K5r5O2K2m0JP3Mj62M3
5148h2P2Q7lp4j39L28j81l1K68p6m2k81K72j80N1J68o8J3RK06O0o17K48j01P6
5173a7k51J76J44k67J06j05L22k86J85O4O7j0k75J92Q4j78q1j22P0N33l93k6P5
5196Go8R3L13k45l7j75M0K34j58J30l43K44o2L43n56J68J71n4J14k53N16l20j36
$$ plain form
5219 -34 -127 108 -1 -113 -97 256 -65 64 -209 -207 160 116 -127 -274 58 -197 439 -150 62 -257 -102 -132
5241 -132 64 -92 22 -51 38 -24 85 30 219 -28 108 91 -51 -123 -102 134 146 207 178 46 -231 -65 -268
5264 -268 61 268 56 -171 -48 -208 131 118 -131 314 -28 -66 20 131 126 -64 -124 100 21 -89 105 -33
5286 -33 -186 -13 86 -135 353 -191 -376 165 -167 -266 26 -25 -12 -188 -75 67 167 -137 -142 233 -44 160
5308 160 -114 30 -201 -245 63 -141 -26 -107 -70 242 -187 136 -56 -101 133 -6 -192 62 53 -140 -193 96
5330 96 -128 -31 125 -40 112 -234 -231 -360 -120 -98 33 109 -25 -75 50 86 31 40 180 -2 132 -104 -56 -143
5354 -143 -208 -117 -142 -106 18 -23 63 -51 72 163 -11 112 98 -130 90 -66 145 -206 -167 -168 197 50 72 -152
5378 -152 -72 135 -213 220 116 -49 -9 -152 135 154 -183 -107 -27 84 -130 -24 -103 219 222 158 -139 -137 26 20
$$ packed form
5219c4r3K35j09j12J6L53l21J29k73KL67m4k43j47L32k55O36n89K12l19J55l0
5241a32J96j56J14p3Q9o2J09n5J89k47J36j7j42p2K1K36J2O1k9j32k77J66k03
5264b68L29K07k12k27J23j60L39j3k49M45l42l8Q6J11nj90o0K24p9j10J94j38
5286c3j53J73R9k21M88n44j85N41l32r9K92n1J3j76J13J42J00l04nL75k77K04
5308A60k74J44k31m4L08k04J15q1L7L12m29L23j92m5K34j39j86K54rj93n3K89
5330I6k24R7J56j65J52l46Lj29K40K2J31P6j34n0J25L6n5RJ40j82J34k36M8q7
5354a43o5R1k5L6J24m1Q6j14J23R1j74J23j4k28K20j56K11l51L9jL65j47K2k24
5378a52Q0K07l48M33j04j65M0j43K87J9l37P6Q0J11k14J06p9L22Lo4k97KJ63o
$$ plain form
5402 20 -151 -105 -209 -44 39 229 -203 -181 -30 416 56 -166 -81 77 -77 203 -76 -125 -152 -146 164 91 -83
5425 -83 77 45 3 -360 174 86 6 61 146 -45 322 195 25 -74 100 -46 -246 202 222 -26 -40 37 -27 34
5449 34 -45 70 -60 265 30 -215 -247 3 -85 58 98 -139 26 22 24 -166 200 -31 -218 201 182 41 -195
5472 -195 67 -69 -118 -22 -90 70 -57 -94 -33 -58 286 -100 288 83 112 110 103 50 12 223 91 3 78 -22 -111
5497 -111 -76 -253 247 -75 4 -46 -1 -186 32 -205 -203 -344 8 235 72 6 48 135 -20 -103 -170 -256 -241 205
5521 205 -66 73 31 129 -162 73 103 156 -221 -248 -13 164 56 -116 221 -208 249 16 -91 -197 -158 46
5543 46 -261 275 -36 -155 96 213 -123 -154 -17 -89 -117 -81 -73 218 304 122 -59 -25 292 -81 -246 109 -108
5566 -108 180 -202 54 -166 -22 -151 -39 8 220 -28 -58 69 14 -68 111 -276 -411 -315 110 48 125 59 37
$$ packed form
5402B0j71M6j04J65Q3J90m32K2J51M46l60k22Q5J58j54K80k79m9k7OL10p3j74
5425h3J60l2m2l63N34q8q0N5Q5j91L67j27j70r9J74j46k00M48K0k48j4P7o4O1
5449C4p9J15j30L25k35k45l2K50q8J43M0k37J65mKj90L66k31j87M19j9j41k36
5472a95K62j36m9R6o8J60j27l7O1k5L44l86L88k05K9kpn3l8K11j32q8P5j00q9
5497a11L5j77N00l22P9n0M5j85K18k37Kj41L52K27j63o6M2Q7j55q3o7q6J5M46
5521B05k71J39m2R8k91K35L0N3l77k7K35J77j08j72L37m29M57k33j07j06L9K04
5543D6l07N36l11j19K51J17l36l1J37p2k8L6QK91Q6j82j81L4L17l73j65L55k17
5566a08K88l82K56k20J44j29J12M7K12k48l0J27n5q2J79l87j35R6M25o2P7o6k2
$$ plain form
5589 37 85 211 -195 165 -41 49 47 -71 -62 -282 217 -124 -33 -54 -318 -234 -77 67 12 -318 -175 54 -159 -126
5613 -126 85 -25 0 108 59 -190 -143 -60 -125 -228 181 170 59 -36 -61 -86 -9 35 291 166 107 250 -27 -130
5637 -130 -207 -108 2 -119 -257 -82 -82 -68 45 -137 6 -208 107 -67 191 -68 -19 102 175 57 -70 9 80
5660 80 59 207 111 172 -84 -267 48 -29 125 73 65 112 -43 51 87 -403 -48 -70 -127 181 161 129 22 -239 -36
5685 -36 -59 -64 -213 -169 74 -65 -1 -22 -47 61 -299 23 40 -124 64 -84 -76 -164 -357 -82 27 33 107 84 48 131
5711 131 124 -173 -173 -289 -75 83 118 -164 208 -15 9 83 -211 -76 142 145 8 104 141 31 147 215 211 103 -102
5736 -102 -19 -77 75 147 15 223 89 94 12 82 -182 -5 -2 -29 16 26 -9 63 -44 194 -128 62 112 -131 40
5761 40 205 -88 -15 60 20 77 -287 116 36 181 -231 -45 -24 156 111 58 15 -116 -40 97 109 -82 -16 88
$$ packed form
5589C7M8J26m06L60k06R0kj18Rk20M99l41R1k1k64Q4J57J44n5l30J43K29k13L3
5613a26K11j10K5J08m9k49M7Q3o5j03M09j1j11r5k5k5P7M4K56j25n9J43k77j03
5637a30p7R9J10j21j38J75%J4J13j82J43k14L15j74K58k59M9J21P3j18j27P9P1
5660H0k1J48r6O1k56j83L15p7J54n2qM7j55R4L6m90L55k2n7L08k0l2j07k61K03
5685c6k3nj49M4K43j39O4k1k5J08l60L22J7j64J88j48Qq8j93K75J09OP4k3l6Q3
5711A31pk97%j16K14J58L5k82L72k23K4P4k94J35K18Lj37R6L7j10J16O8mj08k05
5736a02Q3n8J52P2j32K08j34Nq2P0k64J77Lk7M5J0l5P2j07K38l22J90N0k43J71
5761D0J65k93P3P5m0N7l64M03q0J45m12J86K1J80m5n3m3j31P6J37J2j91O6J04
$$ plain form
5785 88 -55 315 16 26 -101 52 49 69 95 -85 352 -57 -232 -7 53 -96 101 83 -82 -142 71 116 -151
5808 -151 179 -68 -8 336 43 136 -86 -117 179 35 -45 40 -1 16 -84 105 -231 122 -89 154 -51 7 48
5831 48 -102 255 -297 178 -115 -73 -103 355 61 -64 96 16 -47 47 133 110 149 88 195 -27 11 87 -32 -21
5855 -21 6 -83 -109 -190 -200 271 -115 -327 -324 -28 183 4 25 71 -5 239 -28 124 198 64 56 -183 153 201 71
5880 71 76 -96 -121 312 213 63 182 89 75 26 -111 -15 175 96 -58 193 -50 69 62 77 -168 -120 -49 148 -94
5905 -94 102 -248 -42 75 -164 86 -177 16 -108 -13 -112 -102 33 103 0 -190 -90 -232 240 -59 -15 62
5927 62 -43 199 -29 -12 199 -185 13 33 -131 -150 -13 241 40 -188 -170 57 -7 181 -135 -47 -52 -93 -35 105
5951 105 -153 -80 -75 -106 41 -99 -324 53 -10 186 -125 78 23 -18 107 206 -13 -163 -18 159 -133 95 -150
$$ packed form
5785H8j43L70k99J0j27J53lK0K6j80M37m09j75K25O0j49J97j8j65o0K13M5k67
5808a51L30k47O0L44k93R3k22l1K96j44q0Q5m1J7j00J89l36L53k11K43k05N8M1
5831D8j50L57n52M75k93M2l0M58k94j25J60q0o3R4Q6k3L9o1J07k22L8P6j19J1
5855b1K7q9k6q1j0M71l86k12LK96K11j79K1M6p6K44k67J52P4j34qk39L36M8j30
5880G1Nj72k5M33r9j50J19r3j4m9j37R6J90p9j54K51k43J19pJ5k45M8P1J97k42
5905i4J96l50K06J17k39K50k63J93j24R5r9J0J35P0j03j90J00j42M72k99M4P7
5927F2j05K42k28J7K11l84J98K0j64j9J37K54k01k28J8K27o4J88l16Q8nm1N8J40
5951A05k58P3Nl1J47j40k25L77o3J96l11K03n5m1J25R9k19j50J45J77k92K28k45
$$ plain form
5974 -150 228 2 -57 -71 45 -44 -56 -3 55 162 72 -157 -281 311 206 17 -34 -92 -73 231 33 -191 319
5997 319 55 58 162 98 104 -58 50 -62 4 -36 61 -84 377 46 -4 18 -58 -1 182 -178 -101 -28 -265 -43 311
6022 311 -81 30 185 33 3 -72 63 -131 -87 109 236 -76 -58 209 -4 139 -209 170 -118 -182 155 199
6044 199 -224 3 207 239 -121 -52 169 73 -57 -47 -86 -188 -342 -224 -233 240 -71 -286 12 -17 -73 -161 -145 21
6068 21 -36 48 154 80 -78 -91 82 -169 -79 74 168 -89 -116 98 116 -207 55 153 -55 -107 84 178 191 130 65
6093 65 189 130 -17 105 -23 -44 85 101 118 91 21 -172 283 -91 66 -102 196 -31 -164 141 129 -189 -7
6116 -7 99 -76 36 102 -49 -228 -9 -261 -64 64 76 163 258 51 -51 137 -58 273 156 10 81 -48
6138 -48 44 -29 62 432 152 149 121 55 -5 48 23 135 -64 77 46 -32 -168 -30 115 105 -37 170 -75 137 -258
$$ packed form
5974a50L78k26n9j4J16q9j2N3N8J07r0k29j24N92j05j89n1n8J9L04j98k24N10
5997C19k64LJ04o4Oj62J08j12O6m0R7j45M61l31n0K2p6N7J83l60P7P3k37K22L54
6022C11l92J11J55j52l0p5J35j94M4J96J27l12J8K67k13J43l48L79k88o4L37M4
6044A99m23K27K04L2l60O9K21r6j30J0l9j02j54J18rM73l11k15K98k9n6q8J6J66
6068B1n7Q4J06p4j58j3J73k51R0J53R4k57k7K14J8l23K62R8k08n2J91R4J3o1o5
6093F5J24n9j47J22j28k1J29J6J7k7p0j93M55l74J57j68K98k27j33L05j2l18J82
6116gJ06j75J12O6j51j79K19k52J97J28J2Q7R5k07j02J88j95L31j17j46P1j29
6138d8R2p3R1L70k80lk8o6o0N3k5J12j99J41l1p8j36J38J45j0j42K07k45K12l95
$$ plain form
6163 -258 -30 3 39 -93 217 36 27 -165 84 -253 34 215 -372 -84 70 248 261 -169 -88 294 19 -204
6185 -204 -63 222 -50 -35 1 223 169 16 -136 181 -166 -25 -74 -57 -89 179 14 -234 -206 104 242 -247
6207 -247 0 49 0 122 -9 36 -201 -5 12 39 -31 7 -71 64 28 -100 -234 -142 -136 -241 -26 94 70 194
6231 194 -113 158 -241 92 265 -18 -187 -257 34 -253 -58 -112 27 -9 303 162 -8 292 -7 138 -261
6252 -261 -123 38 -47 -256 -110 -60 -171 113 -232 -26 24 62 111 -112 -135 -184 9 -253 -105 -190 -105 122 -228
6275 -228 69 69 -122 4 27 134 103 54 295 -91 188 -246 -21 -32 145 -120 -23 31 -122 -60 18 99 245 -227
6299 -227 -22 105 -131 -122 -84 11 -3 45 -71 -159 -63 179 50 312 -206 189 17 7 71 174 -208 -129 -71 216
6323 216 109 -128 -153 98 235 -70 34 -63 -69 -126 -103 103 -28 -24 -127 91 -91 62 -43 -185 -1 51 333
$$ packed form
6163b58K28L3L6j32L10j81rj92K49l37K87J81n87K88J54J78J3m30Q1L82k75k23
6185b04J41K85k72J5L6K22n4j53j52L17l47J41m9J7l2K68j65k48K8L10J38m89
6207b47K47M9m9J22j31M5k37J96J7K7p0L8p8J35l6j28j34R2Oj05K15J20k4J24
6231A94l07K71l99L33J73k83j69p0K91k87J95n4J39l6L12j41j70L00k99J45l99
6252b61J38J61q5k09J46N0j11K84l45K06N0L8M9k23k3m9J93k62J48q5Q5K27l50
6275b28K97%j91J26K3J07l1m9K41l86K79m34K25j1J77k65R7N4j53O2P8Q1J46m72
6299b27K05J27k36RL8R5j4M8j16q8R6K42j29K62n18L95j72j0O4J03l82P9N8K87
6323B16j07k37k5K51J37l05J04r7on7K3K06j31Mj03K18j82J53j05j42J84N2K82
$$ plain form
6346 333 81 -74 69 -80 50 -35 -118 148 75 -93 -133 159 -42 59 255 -45 202 -15 -158 19 87 196
6368 196 216 155 50 -61 -63 27 -43 -142 -36 -263 -20 270 -40 -32 -121 33 8 50 -276 -106 -89 24 130 -101
6392 -101 -27 -203 127 -177 51 270 -133 89 8 -64 -65 -141 266 157 -73 -112 76 47 211 -35 -130 -24 -270
6415 -270 -47 -76 -75 -66 109 53 -199 -145 128 -94 4 -190 -141 189 -82 294 -11 -154 231 122 243 41 392
6438 392 145 -5 190 -200 43 -104 -135 -101 -29 107 -140 68 188 278 81 -59 -55 -67 66 -93 -295 -89
6460 -89 19 -192 56 -253 -12 -90 141 -81 -125 -168 -178 -36 26 101 -138 -107 -237 -84 146 117 -18 87 -341
6483 -341 -98 -137 142 91 31 15 -81 -82 -21 38 86 49 -62 -255 193 81 -130 -29 206 -191 -149 144 108 210
6507 210 86 -84 -85 -222 17 187 -103 -92 -7 -37 56 -206 -165 30 -318 48 129 44 -69 -33 -141 -96 17 126
$$ packed form
6346C33k52j55J43j49J30q5q3K66p3j68m0K92k01J01J96l00K47k17j43J77O8J09
6368A96K0o1j05j11kR0p0r9J06k27K43K90l10Qq9J54k5M2l26J70J7J13J06k31
6392a01P4j76L30l04K28K19m03K22q1p2jp6M07j09k30l9J88k9J64k46r5J06k46
6415b70K23k9JRJ75n6k52N4K73k22R8j94M9L30k71L76l05j43L85j09J21k02L51
6438C92k47j50J95l90K43j47l1L4P2J36k47K08J20R0j97j40Mj2J33j59k02K06
6460h9J08k11K48l09K41p8K31k22m4m3j0J42O2P5k39L1j30J53K30k9j35J05m28
6483c41K43l9K79n1o0j6r6jO1N9M8l7j11j93M48j12k11J01K35l97M2K93l6J02
6507B10j24j70jj37K39J70k90J1Q5l0R3k62M1J95l48L66Q1q5j13L6j08M5J13J09
$$ plain form
6531 126 -76 -9 346 12 149 253 18 232 -17 29 -4 -176 100 201 104 -266 -6 59 288 -174 -51 -104
6553 -104 0 -13 24 158 162 -17 -27 73 -132 290 -209 101 -29 -142 304 293 -42 193 94 10 71 -242 54
6576 54 169 27 0 -174 -128 -191 -133 -180 58 84 46 -77 159 -143 -51 264 -308 -96 7 136 -80 23 151
6599 151 25 -148 -47 72 33 80 142 -6 -49 145 71 19 260 19 -51 -36 0 29 213 -38 224 -97 266
6622 266 -90 -119 -64 -116 -93 148 153 -243 80 -39 184 47 98 13 100 30 41 196 -138 -75 6 38 -78 46 -63
6647 -63 -29 279 65 372 -107 6 -210 -61 -144 -88 192 -1 79 216 -59 -139 280 -39 101 -116 -59 26 -43
6670 -43 -98 115 -84 73 -5 -63 -44 15 -329 117 224 -194 -109 -60 67 -98 118 8 279 300 68 -140 -182
6693 -182 -103 -3 -50 28 25 -76 201 60 15 -36 -2 -173 348 131 -51 -158 18 276 222 -159 -201 273 -183
$$ packed form
6531A26k02O7L55l34J37J04k35K14k49M6l3j72K76J01r7l70K60O5K29m62J23n3
6553a04J04j3L7J34Mj79j0J00k05M22m99L10j30j13M46j1l35K35r9q4O1l13K96
6576E4J15j42k7j74M6o3N8m7K38K6l8j23K36l02R2L15n72K12J03J29k16J03J28
6599A51j26j73J01J19l9M7O2j48m3J94p4n2K41k41p0J5L6K9J84k51K62l21L63
6622B66l56k9N5n2K3K41Nl96L23j19K23j37N1q5Q7p0J1J55l34O3Q1L2j16J24j09
6647f3L4L08k14L07m79J13k16J49q3N6K80j93Q0J37k75q0M19l19J40k17N7Q5o9
6670d3n5K13j99J57p8n8J9N9l44M46J07m18Q5M9J27j65K16j10K71K1k32k08m2
6693a82P9J00m7P8lj01K77j41m5n1L4j71N21k17j82j07J76K58n4l81m2M74m56
$$ plain form
6716 -183 -53 350 92 -14 21 -96 107 79 -196 -347 -128 -171 -36 126 -156 -14 -42 53 236 73 79 86 -93
6739 -93 -108 -79 -43 -23 -131 28 43 102 47 -163 179 -61 242 -87 -53 -168 164 -258 -39 -228 -154 1 -292
6762 -292 4 269 -159 174 -144 -78 -153 15 -249 6 258 30 -331 264 152 150 38 72 164 -44 36 46 30
6785 30 -28 66 37 -256 290 105 -77 8 6 7 140 -14 114 183 -84 192 184 -87 44 12 -177 -358 44 -103
6809 -103 -63 -27 -232 130 -35 -395 23 86 -113 168 166 83 24 248 103 -33 -188 -95 -90 -75 26 -170 -134 33
6833 33 65 -266 5 269 -150 118 -26 -40 -256 -36 35 42 151 -163 -107 -64 180 30 94 -11 171 172 -306 -251
6857 -251 126 -290 -86 -19 53 0 -25 249 -28 -135 -302 103 107 30 97 89 112 307 -20 -326 202 -34 138 82
6881 82 -264 71 -149 -64 254 75 -120 -115 -44 -189 193 -223 49 412 -397 214 -112 -164 -6 -68 -101 3 -3
$$ packed form
6716a83J30M03k58j06L5j17K03k8k75j51K19m3J35J62k82J42k8R5J83j63OPj79
6739i3j5K9L6K0j08J59J5N9n5k10L42k40L03l29L4j15L32m22K19j89P4J55k93
6762b92K96K65m28L33l18O6p5J68k64K55K52k28l61N95j12kj12L4R2k08Q0J0j6
6785C0n8R4k9k93N46j85j82Q5kJJ33j54J28O9k67K76qk71J31l2j89j81M02j47
6809a03M0L6k05L62j65l60M18O3j99K81kq3n9K24j45j36j55R3NJ5J01j96L6J67
6833C3L2l31K71K64m19K68j44j4k16K20P1PJ09l14N6M3K44j50O4j05J82Jm78N5
6857b51L77m16K04O7P2n3k5K74k77j07j67M05Mp7O7qK3J95l27l06N28k36J72n6
6881H2l46L35k20Q5L18j79j95NP1j45L82m16K72L63q09O11l26n2J58o2l3J04o
$$ plain form
6904 -3 -2 -53 -63 121 -170 -47 106 -85 -49 -12 -36 -88 87 53 -73 -81 37 43 38 -64 283 48 166 150 -28 -24 -218
6931 -218 58 -104 -136 -54 239 -261 4 -76 84 47 -96 0 83 -117 245 87 11 -51 -196 104 173 50 -198
6954 -198 -39 -271 -135 -281 -27 13 -30 98 177 5 -146 -133 -36 -66 40 -62 261 63 -76 76 -42 -55
6976 -55 19 83 -62 -82 -28 146 142 36 -20 39 -7 -42 214 128 57 132 -48 19 8 29 -86 -267 60 -201 -255 -183
7002 -183 -9 -237 -71 -43 -1 1 -46 139 -14 20 47 24 -103 16 -168 158 122 253 93 100 -10 358 -180 -137
7026 -137 122 -5 144 -74 -14 -157 17 57 155 -22 -69 -68 -14 -27 -6 37 -151 -7 -28 81 55 -231 50 -81
7050 -81 -171 138 121 -233 -34 -262 204 -35 -31 -80 269 -164 -34 -6 -53 194 -202 49 -127 -150 84 13 -223
7073 -223 -12 -175 9 252 -94 45 67 -302 200 14 -100 -47 -189 226 -76 -145 113 13 147 100 -188
$$ packed form
6904cJn1j0J84k91J23J53j91L6L7k4n2J75l4j26qJ18Onj02L47k35J18j6j78Mj94
6931b18K76j62l2Q2K93n00K65q0J60l7j43R6Q3k00L62j58p6o2j45L00O9j23k48
6954a98J59k32J36j46K54M0m3J28P9j72j51J3R7l0J06j02L23j98j39J52j18j3
6976e5P4O4j45k0N4J74mj06n6N9m6l5K56q6p1P5j80O7j1K1j15j81L27k61n4P2
7002a83J74k28J66K8M2Km7J85j53L4K7k3j27J19j84L26l6J31j60Pj10L68n38M3
7026a37K59j27J49k18O0j43J74M0R8j77m7JN4j3K1M3j88J44k1J09k6k86K81j31
7050h1r0L09j7l54J99k28M66k39Mm9L49m33J30K8m7K47l96K51j76k3K34p1k36
7073b23K11j63J84K43l46J39K2l69N02j86j14N3j42M15l02o9K58j00J34m7k88
$$ plain form
7094 -188 -25 140 -61 -151 58 128 -80 -409 -86 249 -57 73 147 -179 -10 -18 42 168 82 -283 -86 38
7116 38 -130 70 1 -69 -125 110 61 17 -85 -68 162 29 -112 279 116 -219 165 -5 -193 177 -169 100
7138 100 -54 80 299 -156 -3 -85 -55 -270 312 -69 166 -281 -157 -184 40 288 -40 6 -109 375 136
7159 136 280 -64 -29 99 -12 237 -62 49 -58 92 3 115 -3 -249 43 -13 -55 -148 130 -97 -5 -177
7181 -177 62 -113 183 -104 228 -102 -361 228 -142 168 -8 -265 -7 -21 -99 59 148 -102 -148 -86 75 -167
7203 -167 131 -226 -102 -233 -328 -100 -147 11 277 96 -160 71 -86 113 39 -53 -214 -466 -181 -45 -159
7224 -159 -17 151 -242 -50 -46 -95 111 82 28 47 -20 -5 223 180 -96 114 -30 230 -130 -107 1 -84 -63 -147
7248 -147 225 -144 -202 -156 -100 58 -161 19 111 -121 -59 15 115 203 49 159 262 44 202 -66 -165 223 65
$$ packed form
7094a88J63J65k01r0K09P0k08l29L23L35l06J30P4l26J69qO0J26q6l65J97J24
7116C8j68K00o9p0n6K35m9m4j02J7K30j33j41L91j63l35L84j70j88L70l46K69
7138A00j54J34K19m55J53q2L0k15N82l81K35m47J24k7K24K48l28M6j15M84k39
7159A36J44l44L5J28j11K49k99J11j07J50q9J12j18k46K92n6m2r3K78k27R2j72
7181a77K39j75K96k87L32l30k59N89l70L10j76k57K58j4p8J58Q9k50m6O2J61k42
7203a67K98l57J24j31r5K28m7J58K66j81k56K31j57J99p4r2j61k52K85J36j14
7224a59J42J68l93J92Mm9K06k9n4J9o7J5K28m3k76K10j44K60l60K3J08q5K1q4
7248a47L72l69n8M6N6J58k19J80R2k32O2P4J00Q8j54J10J03k18J58k68r9L88j58
$$ plain form
7271 65 200 -37 19 -41 -228 116 109 49 22 111 -143 -59 62 -33 181 82 -223 102 188 -200 -80 -4 7 59 104
7296 104 44 -56 378 43 -208 123 92 54 -175 -9 -144 -246 -277 36 106 -170 -33 79 -76 -225 -164 -285
7318 -285 93 -107 98 -44 -228 -6 135 175 -57 -180 -44 -270 10 40 77 28 -102 15 111 171 120 -65
7340 -65 7 -144 -152 116 3 65 -155 -129 -14 -10 142 -197 -92 222 -65 -44 101 19 -25 -98 -140 -5 49 26 -65
7365 -65 -33 129 -50 -4 -19 136 -133 158 140 -112 -53 -166 -27 -141 -122 98 -5 -147 -120 -23 -161 -160 -269 -96
7389 -96 -288 -27 -131 14 64 -19 20 -28 -115 -233 -51 127 -148 22 347 103 351 45 121 -99 -5 -59 212
7412 212 97 175 191 -228 -5 71 74 -235 -294 14 191 124 -336 32 113 -142 108 -135 -159 1 -173 -58 201
7435 201 -46 -184 -17 -205 -2 396 51 -53 145 127 158 -334 -250 147 -19 175 -188 -86 -57 12 12 -119
$$ packed form
7271F5J35k37N6o0j87L44po0k7Q9k54Q4J21r5K14r9l05L25Q6l88J20P6J1N2M5
7296A04o0j00M34l35k51L31l1l8k29J66j35j02l1L13P0k76J37J12j55j49O1j21
7318b85L78k00K05j42j84K22J41M0k32j23J36k26K80L0L7m9j30J17R6O0n1j85
7340f5P2j51qK68j13O2k20K6J15MJ52l39J05L14k87K1J45q2m4p3m2J35N4k3r1
7365f5L2J62j79M6j5J55k69K91j8k52N9j13J39j14J9K20j03j42K7R7j38Jj09J73
7389i6j92K61j04J45N0q3L9m8q7j18J82J78k75J70L25k44K48l06P6k20R4n4K71
7412B12j15P8J6m19K23P6Ll09n9L08J77o7m60L68Q1k55K50k43k4J60j74J15K59
7435B01k47j38J67j88K03L98l45j04J98j8L1m92Q4L97j66J94l63J02K9O9%j31
$$ plain form
7457 -119 -134 -38 81 -274 -3 160 111 56 -124 -19 28 -156 5 406 32 -237 59 25 -72 123 50 -157 180
7480 180 -151 -16 135 221 -12 -167 68 340 31 10 -72 -255 156 56 418 -85 123 -88 67 164 153 30
7502 30 1 136 23 248 134 216 153 -45 -20 79 -71 248 -67 118 102 -119 187 274 64 108 -132 71 128
7525 128 144 -32 71 239 -95 -45 -113 -227 -28 151 28 93 -126 -66 152 -169 -188 327 49 108 -156 92
7547 92 -97 -1 -114 6 -124 -65 94 49 -1 -247 -58 -96 -143 -18 196 124 -120 127 9 47 -63 -256 -117
7570 -117 20 -22 165 -99 29 -262 157 -63 6 184 150 134 -208 -345 205 -114 213 56 106 -188 -64 57
7592 57 55 -213 -112 -173 205 -175 -235 -151 22 -105 -133 104 -92 73 -168 -130 -39 64 -63 -51 91 352 21
7615 21 -6 -112 181 -197 -78 16 -151 49 -222 -50 386 13 84 223 90 26 112 -163 205 -82 -19 23 58
$$ packed form
7457a19j5R6J19l55K71J63m9n5j80J05M7j84J61M01l74k69K96l4r7J95p3k07L37
7480A80l31J35J51Q6k33j55K35K72l09k1q2j83M11j00L62n03K08k11J55R7j1j23
7502C0k9J35j13K25j14Q2o3j98K5R9j50L19l15J85j6k21L06Q7k10M4k40K03N7
7525A28J6j76J03J68l34N0o8j14J99J79j23O5k19O0K18l21j9N15k78N9k64K48
7547I2j89R6j13J20j30N9J59m5n0k46J89l8m7J25K14p2k44K47j18L8j10j93J39
7570a17J37m2J87k64J28k91M19k20O9J78l4j6l42j37N50l19L27j57N0k94J24J21
7592E7kk68J01o1L78l80o0Q4J73j27k8K37j96J65k41L8R1J03j27J2J42K61l31
7615B1k7j06K93l78J19R4j67K00k71J72M36l73P1J39j33o4Q6k75L68k87O3M2L5
$$ plain form
7638 58 -160 291 197 -219 11 -36 113 -14 121 -244 -50 88 -283 48 35 12 103 57 -71 61 42 -116 41
7661 41 -68 144 -34 -18 12 52 -4 -66 233 -207 160 0 164 -28 69 -250 -114 -188 -269 156 -333 72 264
7684 264 42 -119 187 170 -1 204 147 -1 -8 -2 -22 -170 269 66 223 130 -34 -44 -213 13 -53 39 172 -29
7708 -29 -53 -267 -43 -29 219 105 -47 206 -89 165 58 201 288 193 217 -38 -216 -114 -390 -19 70 -17 -39
7731 -39 40 -48 -137 -210 -41 123 -117 0 -58 -65 1 48 -112 -270 -15 -29 -43 112 106 -63 -27 -195 17 -86 -24
7756 -24 119 102 -19 -151 -128 107 74 -49 -8 154 83 -179 91 93 -134 35 39 95 48 15 -69 -15 187 -38 -232
7781 -232 66 58 -92 -49 -82 35 99 -89 44 96 -248 -221 86 -28 -124 -38 -134 -146 161 -52 34 131 131 128 -90 -217
7807 -217 124 -35 75 16 -102 -102 -65 -10 90 115 -87 -89 109 -21 56 -276 -117 117 -22 208 67 13 -41 -42
$$ packed form
7638E8k18M51r4m16K30m7J49j27J35l65J94J38l71L31j3k3R1m6j28J32j9j58J57
7661D1j09K12j78J6L0M0n6o2K99m40L67j60J64j92R7l19J36p4q1M25m89M05J92
7684B64k22j61L06j7j71K05n7j48pOk0j48M39k03J57r3j64j0j69K26o6R2J33k01
7708b9k4k14K24J4K48j14j52K53k95K54j07J43Q7r5K4k55j78J02k76L71Q9q7k2
7731c9P9q8q9p3J69J64k40J17n8pO6M7j60j58K55j4j4J55oj69L6j68K12j03O2
7756b4J43j7j21j32K3K35l3j23M1J62p1k62K70Kk27J69MN6m7l3q4N4K02k25j94
7781b32K98qj50M3l3J17O4j88J33N2l44K7L07j14r6Q6r6j2L07k13Q6R7%lk18j27
7807b17L41j59J10n9j18%L7N5J00K5k02kJ98j30P7l32J59K34j39K30j41n4n4j
$$ plain form
7831 -42 114 -200 265 -44 -100 27 11 -56 161 -219 -96 199 -43 252 121 313 -36 -143 43 74 85 143
7853 143 -116 -6 -179 38 -82 -161 -11 50 2 -7 -71 99 335 -238 -105 478 149 -21 55 48 -247 195 193 -52
7877 -52 327 -47 -39 177 2 158 28 7 156 233 124 28 9 9 177 219 -201 -105 138 -311 -16 148 110 276
7901 276 -101 -59 -31 -208 -63 -58 -106 -2 -8 -315 -194 -66 -26 -197 85 160 281 53 253 153 1 -208 99
7924 99 95 62 -160 -64 90 -318 9 34 62 -29 116 -44 36 162 -20 -1 -28 43 117 163 34 15 -44 111 82 137
7950 137 -376 -40 384 20 66 -68 71 -89 -86 170 -43 -31 -91 157 76 -128 -3 105 129 -126 -155 117 -143
7973 -143 -18 -139 32 200 96 38 -303 79 -104 68 110 266 -313 104 95 -3 134 191 16 -33 -162 -99 -254
7996 -254 -144 -118 -40 -129 77 -25 -73 62 58 -167 116 114 33 -142 124 -213 187 20 -230 -68 -28 -93 -147 -43
$$ packed form
7831d2J56l14M65l09n6J27j6o7K17l80J23K95k42K95j31J92l49j07J86L1J1N8
7853A43k59J10j73K17j20p9J50O1m8ro4J70K36n73J33N83l29j70P6pk95M42kk45
7877e2L79l74QK16j75J56j30k1J49P7j09r6j9%J68M2m20R6K43m49K95J64l8J66
7901B76l77M2K8j77J45Nm8J04ol07J21J28M0j71K82P5J21k28K00j00j52k09L07
7924I9ml3k22R6J54m08L27K5K8r1J45j60Q0J26j82J9k7P1P4M6j29j9n9J55k9N5
7950A37n13L36M24l64M6j34J39j60LK56k13J2o0K48q1k04J25J08K4k55k9K72k60
7973a43J25j21J71J68j04n8l41L82j83J72M2J56n79M17rr8J37N7j75m9j29O3j55
7996b54J10K6P8q9K06j02m8J35mk25K83kq1j75K66l37M00j67k50J62M0o5n4J04
$$ plain form
8020 -43 56 42 -178 -95 13 74 -42 -82 -134 85 -228 130 -59 -81 -83 140 182 259 0 -83 222 -98 -119 206 126
8045 126 38 15 -12 170 -50 -204 -117 178 270 -131 13 -146 343 -1 -30 153 -217 34 11 -81 15 58 62 -66
8069 -66 159 -37 -164 29 17 79 -95 -32 -15 20 -118 -181 -203 -182 52 238 -219 64 -160 150 -174 66 -268
8092 -268 -94 -137 109 -96 33 76 -17 -8 -81 193 59 -89 237 339 -4 164 -88 -45 -86 266 90 265 65
8115 65 -147 -93 -217 -105 48 73 217 40 18 131 -14 -9 18 113 98 -163 3 -22 336 2 201 125 83 -35
8139 -35 64 57 -54 -275 23 -69 -205 90 64 -120 -234 105 189 -81 -111 -366 69 -29 180 -61 -247 -72 310
8162 310 128 329 -68 -57 -250 242 8 44 -35 144 -141 166 46 -37 69 114 30 90 -192 25 88 -33 45
8185 45 40 -12 -42 336 -32 131
$$ packed form
8020d3R9j4k20Q3J08O1j16m0n2K19l13L58j89k2kK23M2P7k59q3L05l20k1L25q0
8045A26q8k3k7J82k20j54Q7K95R2m01J44j59M89l44k9J83l70K51k3r2R6M3Mj28
8069f6K25j96j27J93j2O2j74O3J7L5j38o3k2K1K34J86m57K83k24L10l24K40l34
8092b68J74m3K46k05J29M3r3Rp3K74j34j48L26J02l43J68k52M3m1L52j76J75k00
8115F5k12N4j24J12J53K5J44j77k2J13j45NK7R5j5k61J66k5L58l34J99p6m2j18
8139c5R9pj11k21K98r2j36K95k6j84j14L39Q4k70l0k55M35r8K09k41j86J75L82
8162C10j82K01l97J1j93M92k34L6p9J79k85L07j20q3J06M5q4O0k82K17O3j21P8
8185D5nn2l0L78l68J63
8191A31
$$ Imaginary data points
##PAGE= N=2
##DATA TABLE= (X++(I..I)), XYDATA
$$ plain form
0 0 0 0 0 0 0 0 0 0 0 0 0 7 -7 7 -7 7 -14 14 -14 21 -21 27 -28 35 -41 45 -50 58 -66 76 -85 96 -107 119 -133
35 -133 147 -165 182 -203 225 -250 277 -306 341 -376 418 -463 515 -576 645 -726 825 -945 1093
54 1093 -1286 1550 -1926 2520 -3597 6181 -25140 -3982 48795 30502 29676 32799 29091 22816 45772
69 45772 49807 10298 -32713 -29189 -19074 -31669 -39854 -17065 -7060 -20984 -14400 21328 37857
82 37857 28569 27774 30670 5588 -19654 -7742 11684 -11377 -47335 -46458 -23264 -10715 3912
95 3912 27680 27541 4396 9877 46235 55031 21455 -4928 -9389 -20960 -36056 -27389 -14929 -30094
109 -30094 -44481 -22513 7973 12330 14815 36725 44498 20402 5367 18500 21488 -603 -15877
122 -15877 -19041 -33199 -44954 -20775 13400 9833 -12582 -5700 20551 29727 27751 30017 16573
$$ packed form
0@%%%%%%%%%%%Pj4J4j4J4k1K8k8L5m2M8n5O3p6Q6r5J08j24J42j61J81k03K26k52
35a33K80l12L47l85M28m75N27n83O47p17P94q81R78j091J221j371J551j770K038
54A093k379K836l476M446o117R778l1321K1158N2777j8293q26L123l708o275K2956
69D5772M035l9509m3011L524J0115j2595q185K2789J0005j3924O584L5728J6529
82C7857r288p95K896k5082k5242J1912J9426k3061l5958Q77K3194J2549J4627
95C912K3768j39k3145N481L6358Q796l3576k6383m461j1571j5096Q667J2460j5165
109c0094j4387K1968L0486M357K485K1910P773k4096j5035J3133K988k2091j5274
122a5877l164j4158j1755K4179L4175l567k2415O882K6251R176j976K266j3444
$$ plain form
135 16573 -17085 -28115 -6322 1226 -22276 -35438 -22432 -12665 -10782 8272 33062 29755 13267
148 13267 17561 29015 17774 2260 5475 947 -28231 -46318 -29125 -9779 -11598 -13055 -1803
161 -1803 778 -402 20929 46774 36764 4211 -6061 4486 3116 -8117 -9420 -14221 -31664
174 -31664 -33256 -5372 15435 8040 2932 15110 19737 10156 11482 22523 11342 -14834 -23070
187 -23070 -16499 -19290 -22858 -8573 2422 -9413 -15232 8015 32612 30548 19291 16957 8462
200 8462 -5595 -2438 9813 -2488 -31413 -36592 -18318 -7862 -7053 2869 11577 3999 1125 18967
214 18967 31655 18091 2609 2021 -2634 -17621 -18969 -4538 -3741 -17893 -18465 -2692 5527 8491
228 8491 20359 26969 10586 -5388 2691 15071 5019 -12394 -17404 -20222 -25141 -15587 5245
$$ packed form
135A6573l3658j1030K1793P548k3502j3162J3006R767J883J9054K4790l307j6488
148A3267M294J1454j1241j5514L215m528k9178j8087J7193J9346j819j457J1252
161a803K581j180K1331K5845j0010l2553j0272J0547j370j1233j303m801j7443
174c1664j592K7884K0807p395n108J2178M627r581J326J1041j1181k6176q236
187b3070O571k791l568J4285J0995j1835n819K3247K4597k064j1257k334q495
200H462j4057L157J2251j2301k8925n179J8274J0456Q09R922Q708p578k874J7842
214A8967J2688j3564j5482n88m655j4987j348J4431P97j4152n72J5773Q219K964
228H491J1868O610j6383j5974Q079J2380j0052j7413n010k818m919R554K0832
$$ plain form
241 5245 7865 -5597 -4674 13834 22885 18151 18012 17577 1896 -13610 -8334 -531 -9408 -19944 -15299
256 -15299 -10998 -14670 -6717 14345 21825 9026 3053 11022 13258 7081 7323 5723 -11712 -27414
270 -27414 -17888 -732 -1323 -8624 -5173 1443 1677 8870 23949 23346 4586 -5067 1160 1731 -7595
285 -7595 -9816 -6998 -15268 -23374 -12036 5586 8450 4784 9865 13396 7255 6603 17538 16486 -2704
300 -2704 -16592 -12846 -9569 -11800 -7906 -1970 -8007 -14257 -1392 18046 19787 10251 8315 7798 365
315 365 -2376 4585 2794 -13380 -21918 -13439 -5262 -4699 687 9677 6868 -752 5839 18664 16950
330 16950 5359 423 -2902 -12403 -14847 -4332 -153 -10901 -17388 -6994 4145 7030 11884 17729
344 17729 10859 -923 1811 11908 7687 -5480 -11344 -10962 -15428 -14271 -1853 5536 -1113 -5667
$$ packed form
241E245K620j3462R23J8508R051m734j39m35j5681j5506N276P803q877j0536M645
256a5299M301l672P953K1062P480j2799n973P969K236o177K42j600j7435j5702
270b7414R526J7156n91p301L451O616K34P193J5079o03j8760r653O227N71r326
285g595k221K818q270q106J1338J7622K864l666N081L531o141o52J0935j052j9190
300b704j3888L746L277k231L894N936o037o250J2865J9438J741r536j936n17p433
315C65k741O961j791j6174q538Q479Q177N63N386Q990k809p620O591J2825j714
330A6950j1591m936l325r501k444J0515M179j0748o487J0394J1139K885M854N845
344A7729o870j1782K734J0097m221j3167n864L82m466J157J2418P389o649m554
$$ plain form
358 -5667 3712 12083 11417 11649 13988 5323 -8561 -9089 -813 -1458 -9939 -11726 -9152 -9988 -5931 7943
374 7943 16602 8944 900 5089 10360 7485 4423 3616 -5196 -17687 -15819 -4244 -753 -5780 -5153
389 -5153 -103 763 3245 13945 19049 9479 -1649 -1062 1428 -2280 -4987 -3470 -8501 -17075 -13376
404 -13376 512 7484 4134 4231 7142 5230 4375 10713 13213 2242 -10426 -10670 -6232 -6979 -6509 -2408
420 -2408 -3425 -8593 -4183 8765 14601 9997 6399 5835 1356 -2258 1662 3915 -5006 -14994 -13272
435 -13272 -6410 -3679 -703 5414 5365 -526 1253 11324 14444 7123 860 -1943 -6874 -9905 -4783
450 -4783 152 -5086 -12128 -8502 251 4572 7320 11346 9269 868 -503 5733 7372 -182 -6578
465 -6578 -8448 -10756 -10948 -3755 3716 1759 -3897 -592 6818 9164 9159 10182 5771 -3892 -7623 -2171
$$ packed form
358e667R379Q371o66K32K339q665j3884n28Q276o45q481j787K574q36M057J3874
374G943Q659p658q044M189N271k875l062q07q812j2491J868J1575L491n027O27
389e153N050Q66K482J0700N104r570j1128N87K490l708k707J517n031q574L699
404a3376J3888O972l350R7K911j912q55O338K500j0971j2668k44M438p47M70M101
420b408j017n168M410J2948N836m604l598n64m479l614L920K253q921r988J722
435a3272O862K731K976O117m9n891J779J0071L120p321o263k803m931l031N122
450d783M935n238p042L626Q753M321K748M026k077q401j371O236J639p554o396
465f578j870k308j92P193P471j957n656L305P410K346nJ023m411r663l731N452
$$ plain form
481 -2171 300 -4783 -8353 -7724 -7342 -5729 2597 10527 8487 1670 2008 6451 6483 4256 3551 -1342 -9922
498 -9922 -12562 -5882 -183 -2176 -3715 -1578 -96 949 7619 13127 9519 704 -2128 -119 -231
513 -231 -2314 -2367 -4858 -10841 -11247 -2518 4674 4573 2795 3841 3606 3232 6472 9907 4550 -4946 -8572
530 -8572 -6111 -4714 -4336 -2374 -2003 -5449 -5080 2971 9737 9177 5419 3922 1560 -1227 354 3190
546 3190 -882 -8544 -10847 -6698 -2776 15 3176 3714 277 -207 5874 10927 7541 1819 -1862 -4219
562 -4219 -6509 -4595 -769 -2332 -7259 -7359 -1775 2776 5384 7711 7551 2845 -448 2225 5268 2545
578 2545 -2993 -6259 -8338 -8711 -4510 1460 2442 -1467 -2415 2429 6370 7865 7875 4749 -1382 -5434
594 -5434 -2688 522 -1676 -5460 -6711 -5831 -4011 587 6280 7063 3052 1152 3079 4786 3709 2617
$$ packed form
481b171K471n083l570O29L82J613Q326P930k040o817L38M443L2k227p05m893q580
498i922k640O680N699j993j539K137J482J045O670N508l608q815k832K009j12
513b31k083n3k491n983m06Q729P192j01j778J046k35l74L240L435n357r496l626
530h572K461J397L78J962L71l446L69Q051O766n60l758j497k362k787J581K836
546C190m072p662k303M149L922K791L161N38l437m84O081N053l386n722l681k357
562d219k290J914L826j563m927j00N584M551K608K327j60m706l293K673L043k723
578B545n538l266k079l73M201N970R82l909r48M844L941J495J0l126o131m052
594e434K746L210k198l784j251Q80J820M598N693P83m011j900J927J707j077j092
$$ plain form
610 2617 -59 -5583 -9445 -6819 -1497 -175 -1437 -1656 -1067 331 4770 9806 9011 2529 -2005 -1553
626 -1553 -18 -347 -1316 -3685 -7579 -8523 -3740 2315 3869 2365 2302 2670 2722 3916 5967 4821 -1169
643 -1169 -5450 -5783 -4314 -3350 -1166 -725 -3230 -4302 -220 6014 8396 5941 2971 201 -1174 137
659 137 2107 532 -5672 -8785 -7012 -2821 560 2030 2293 856 409 3608 7154 6410 3022 24
675 24 -2753 -4057 -4426 -1917 -1357 -3430 -5095 -3497 52 3350 6299 6402 2890 -629 348 3450 3681
692 3681 -229 -4630 -7091 -6574 -3333 1024 2053 -757 -1812 683 5016 6422 5379 3687 184
707 184 -2837 -2751 -1411 -1687 -3435 -4585 -4564 -4103 -1142 3081 5843 4657 1839 1276 2281 3840 4113
724 4113 1742 -3654 -7347 -6118 -2066 455 -404 -2761 -2618 -391 3522 6963 6477 2636 -411 -853
$$ packed form
610B617k676n524l862K626N322J322j262k19N89J398M439N036p95o482m534M52
626a553J535l29r69k369l894r44M783O055J554j504o3L68N2J194K051j146n990
643a169m281l33J469R64K184M41k505j072M082O234K382k455k970k770j375J311
659A37J970j575o204l113J773M191L381J470K63j437m47L199L546p44l388k998
675B4k777j304l69K509N60k073j665J598L549L298K949J03l512l519R77L102K31
692C681l910m401k461N17L241M357J029k810j055K495M333J406j043j692l503
707A84l021Q6J340k76j748j150K1M61K961M223K762j186k818n63J005J559K73
724D113k371n396l693J229M052K521q59k357J43K227L913L441m86l841l047m42
$$ plain form
740 -853 56 -263 -1235 -2774 -4298 -5192 -3968 -536 2460 3248 3160 2153 1363 2421 4154 4813 1310 -3556
758 -3556 -5988 -5026 -2628 -447 -1064 -3462 -4455 -1121 3840 7042 5417 2257 640 494 1725 1961
774 1961 6 -3018 -5625 -5214 -3047 -1301 438 1388 1552 916 1371 3465 4848 4278 1853 -1687 -4066
791 -4066 -4033 -1504 189 -1580 -4427 -4420 -1381 3121 5935 4952 1963 -142 1117 3065 3186 93 -3523
808 -3523 -5729 -5291 -3145 -1354 -281 -424 -476 644 2326 3947 5011 4482 2534 -687 -2737 -2162 -590
825 -590 -633 -2503 -4797 -4997 -2268 1968 5005 3811 1001 -153 1636 3762 4006 1092 -2967 -5023
841 -5023 -4543 -1825 -864 -1132 -2085 -1765 -58 2185 4129 4510 3749 1978 161 -846 -761 -405 -1155 -2921
859 -2921 -5093 -5215 -2545 1251 3037 2801 701 342 2318 4860 5052 2199 -2253 -4329 -3598 -1665
$$ packed form
740h53R09l19r72j539j524q94J224L432K996P88q8j007p90J058J733O59l503m866
758c556k432R62K398K181o17k398r93L334M961L202j625l160j617j46J231K36
774A961j955l024k607M11K167J746J739R50J64o36M55K094J383n70k425l540k379
791d066L3K529J693j769k847PL039M502K814r83k989k105J259J948J21l093l616
808c523k206M38K146J791J073j43n2J120J682J621J064n29j948l221k050N75J572
825e90m3j870k294k00K729M236L037j194k810j154J789K126K44k914m059k056
841e023M80K718R61k68r53L20J707K243J944L81p61j771j817j007Q5L56p50j766
859b921k172j22K670L796J786k36k100l59J976K542J92k853m452k076P31J933
$$ plain form
875 -1665 -859 -1964 -3028 -2967 -1057 2080 3983 4080 2965 1758 921 520 432 236 -1105 -3176 -4659 -4295
893 -4295 -2364 258 1806 1596 305 278 2546 5163 5007 2360 -1474 -3430 -2697 -1068 -571 -2360 -4085
910 -4085 -4079 -1619 1959 3438 3422 2181 1613 1714 2304 1976 787 -907 -3024 -4044 -3728 -2160 -398 725
928 725 455 -587 219 2663 4743 4849 2293 -790 -2277 -1628 -490 -267 -2405 -4346 -4564 -2054 1555
945 1555 2977 2603 1579 1038 2298 3299 2947 1201 -1143 -2725 -3587 -3000 -2041 -1247 -876 -1307 -994 344
963 344 2475 4326 4239 2493 42 -1002 -329 722 100 -2260 -4406 -4581 -2054 850 2203 1667 586
980 586 617 2326 3846 3508 1499 -821 -2422 -2997 -2070 -1605 -1462 -1746 -1931 -1615 420 2546 3795 3764
998 3764 2269 620 126 904 916 -42 -2284 -4245 -4732 -2255 -147 1210 725 -202 475 2598 4149
$$ packed form
875a665Q06j105j064O1J910L137J903R7j115j207q37m01q8j96j341k071j483L64
893d295J931K622J548k10j291k7K268K617j56k647l834j956P33J629M97j789j725
910d085OK460L578J479j6j241n68J01N90l28j189j694k117j020L16J568J762J123
928G25k70j042Q06K444K080J06k556l083j487O49J138K23k138j941k18K510L609
945A555J422l74j024n41J260J001l52j746k344j582q62N87R59P94L71m31L13J338
963C44K131J851q7j746k451j044O73J051o22k360k146j75K527K904J353n36j081
980E86L1J709J520l38k009k320j601n75R27M65J43k84j85L16K035K126J249l1
998C764j495j649m94P78J2r58k242j961m87K477K108J357m85r27O77K123J551
$$ plain form
1015 4149 4015 2080 -294 -2125 -1955 -1164 -1189 -1702 -2642 -2811 -1772 136 2056 3046 2891 1680 1197 893
1033 893 1271 1621 -240 -1846 -3926 -3705 -2465 -315 244 -358 -782 20 2125 3904 4074 2423 1
1050 1 -1161 -1183 -256 -688 -2073 -2967 -3396 -2232 -111 1559 2208 1997 1290 1207 1824 2311 2031 272 -1892
1069 -1892 -3281 -3191 -1580 -587 -556 -1218 -1341 -251 1898 3685 3563 1931 113 -498 -157 370 -7 -1964
1087 -1964 -3183 -3679 -2166 -374 1213 1362 1026 680 1446 2378 2895 2083 237 -1357 -2457 -2338 -1437
1104 -1437 -1022 -1247 -2168 -1895 -624 1647 3272 3373 1719 781 404 982 1059 405 -1788 -3586 -3737 -2126
1122 -2126 -446 340 532 18 107 1419 2564 3195 2217 688 -750 -1862 -1253 -871 -1218 -1900 -2511 -2283
1140 -2283 -632 1331 2508 2615 1382 449 604 1774 1658 365 -1310 -2520 -2952 -2307 -627 91 -375
$$ packed form
1015D149j34j935k374j831J70P91k5n13r40j69J039J908J920R90j55j211m83l04
1033H93L78L50j861j606k080K21J240K150N59o02m24Q02K105J779J70j651k422
1050Aj162k2R27m32j385q94m29J164K121J670O49k11p07q3O17M87k80j759k164
1069a892j389R0J611R93L1o62j23J090K149J787j22j632j818o11L41N27l77j957
1087a964j219m96J513J792J587J49l36l46P66R32N17q12j846j594j100J19R01
1104a437M15k25r21K73J271K271J625J01j654r38l77N78P7o54k193j798j51J611
1122b126J680P86J92n14Q9J312J145O31r78j529j438j112O09L82l47o82o11K28
1140b283J651J963J177J07j233r33J55J170j16j293j675j210m32O45J680P18m66
$$ plain form
1157 -375 -628 85 1525 2894 3107 2354 771 -535 -472 -439 -359 -1261 -2006 -2883 -2199 -872 1039 1989 1633
1176 1633 1063 906 1530 2039 1861 976 -1078 -2654 -2526 -1721 -723 -857 -1179 -1403 -427 878 2467 3029
1194 3029 2150 731 -186 166 546 58 -1171 -2200 -2980 -2303 -1047 747 1074 832 824 997 1639 2586 2241
1213 2241 1097 -781 -1870 -1555 -1222 -643 -1020 -1594 -2025 -895 878 2326 2368 1865 948 509 438 1024
1231 1024 573 -831 -2358 -2870 -2333 -807 -293 266 205 -190 667 1860 2886 2368 1063 -300 -830 -1241
1249 -1241 -661 -801 -1705 -1807 -2186 -1204 408 1789 2131 1693 611 744 1486 1530 885 -773 -1921 -2335
1267 -2335 -1795 -1083 -134 -146 -764 -837 527 1861 2785 2193 1498 0 -558 -299 87 -638 -1584 -2353 -2064
1286 -2064 -965 224 1292 1816 751 815 1206 1660 1641 1095 -432 -1554 -1985 -1696 -780 -816 -843 -1191 -861
$$ packed form
1157c75k53P13J440J369K13p53j583j306O3L3Q0r02p45q77O84J327J911R50l56
1176A633n70j57O24N09j78q85k054j576J28Q05R98j34l22k24R76J305J589N62
1194C029q79j419r17L52L80m88j229j029p80O77J256J794L27k42qJ73O42R47l45
1213B241j144j878j089L15L33N79l77n74m31J130J773J448M2n03r17m39p1N86
1231A024m51j404j527n12N37J526N14N59o1l95Q57J193J026n18j305j363n30m11
1249a241N80j40r04j02l79R82J612J381L42m38j082J33P42M4o45j658j148m14
1267b335N40P12R49j2o18p3J364J334R24n92o95j498n58K59L86p25r46p69K89
1286b064J099J189J068N24j065O4L91M54j9n46j527j122m31K89R16l6k7l48L30
$$ plain form
1305 -861 394 1916 2548 2425 1125 179 389 41 -46 -337 -1502 -2595 -2576 -1151 356 546 631 501 859
1324 859 1212 2291 2249 1534 -197 -1200 -1390 -1286 -948 -1115 -1059 -1506 -1062 396 1620 2119 1775 1245 664
1343 664 520 584 838 -363 -1669 -2386 -2196 -1379 -367 50 136 43 218 1453 2191 2254 1410 -97 -872 -1001
1363 -1001 -776 -791 -887 -1819 -1921 -1063 267 1009 1753 1381 759 626 957 1541 979 -279 -1215 -2187 -1878 -1443
1383 -1443 -585 -303 -513 -482 193 1337 2108 2166 1502 135 -348 -556 -324 -720 -1086 -1833 -2117 -1461 10
1402 10 930 1304 739 614 874 1516 1730 978 20 -907 -1671 -1474 -972 -794 -711 -894 -858 7 1159 2094 2198
1423 2198 1278 594 44 378 275 28 -794 -2032 -2253 -1530 -94 599 575 457 597 1090 1811 1945 1412
1442 1412 329 -807 -970 -1049 -845 -1112 -848 -1285 -1001 -135 860 1709 1593 1210 703 539 352 447 186 -937
$$ packed form
1305h61J255J522O32j23j300r46K10l48q7k91j165j093J9J425J507J90Q5j30L58
1324H59L53J079m2p15j731j003j90J04L38j67N6m47M44J458J224M99l44n30n81
1343F64j44O4K54j201j306p17J90Q17J012M17Q6r3J75J235P38O3q44j507p75j29
1363a001K25j5r6r32j02Q58J330P42P44l72o22j33L31N84n62j258r36r72L09M35
1383a443Q58K82k10L1O75J144P71N8o64j367m83k08K32l96l66p47k84O56J471
1402A0R20L74n65j25K60O42K14p52r58r27p64J97N02J78Q3j83L6Q65J152R35J04
1423B198r20o84n50L34j03k47q22j238k21P23J436O93k4j18J40M93P21J34n33
1442A412j083j136j63p9K04k67K64m37K84Q66R95Q49j16l83n07j64j87R5k61j123
$$ plain form
1462 -937 -2153 -1933 -1176 -445 -106 369 276 176 875 2137 1876 1170 329 -535 -648 -836 -533 -1131 -1340 -1619
1482 -1619 -907 -420 490 1241 1426 1143 708 649 1206 1022 316 -841 -1722 -1825 -1204 -405 -126 -296 -562 -45
1502 -45 888 1962 2048 1281 343 -70 19 159 -328 -1286 -1642 -1566 -1104 -368 494 1038 907 921 824 1185 1116 1095
1524 1095 287 -359 -1415 -1593 -997 -370 -423 -715 -637 -248 866 1731 1972 1082 302 24 220 116 106 -675
1544 -675 -1391 -1784 -1042 -318 227 385 469 590 828 1270 1219 1099 602 -308 -1028 -1063 -931 -612 -517 -1066 -936
1565 -936 -435 643 1344 1612 1146 474 294 755 654 281 -796 -1592 -1459 -1277 -433 29 45 -132 299 957
1585 957 999 1250 1137 606 -72 -409 -627 -471 -545 -1103 -1250 -989 -476 207 929 1317 903 445 405 887 1043
1606 1043 475 -389 -1584 -1210 -1338 -411 -452 -434 -600 51 901 1022 1569 1090 426 173 -129 -92 -191 -602 -998
$$ packed form
1462i37j216K20P57P31L39M75r3j00O99J262k61p06q41q64j13j88L03n98k09k79
1482a619P12M87R10P51J85k83m35n9N57j84p06j157q81j03O21P99K79j70k66N17
1502d5R33J074Q6p67r38m13Q9J40m87r58l56P6M62P36Q62N44j31J4r7L61o9k1
1524A095q08o46j056j78N96O27n3k92P8L89J114Q65K41q90p80k78J96j04j0p81
1544f75p16l93P42P24N45J58Q4J21K38M42n1j20m97r10p20l5J32L19R5n49J30
1565i36N01J078P01K68m66o72j80M61j01l73j077p96J33J82Q44M62J6j77M31O58
1585I57M2K51j13n31o78l37k18J56p4n58j47K61N13O83P22L88m14m58m0M82J56
1606A043n68q64j195L74j28R27m1J8j66O51Q50J21N47m79o64k53l02L7r9m11l96
$$ plain form
1627 -998 -1399 -1104 -790 189 972 1014 463 487 789 850 960 385 -214 -1220 -1173 -1108 -245 -275 -703 -852 -235 565
1649 565 1238 1230 1056 396 268 199 88 -240 -548 -1352 -1205 -1196 -882 431 314 220 439 456 967 1112 1010 710
1671 710 -281 -584 -985 -535 -403 -537 -892 -1101 -409 374 1259 1143 513 318 223 505 524 1 -300 -1085 -1161
1692 -1161 -1010 -581 -399 46 153 247 392 759 1083 1381 410 31 -594 -820 -502 -379 -592 -913 -1280 -736
1712 -736 305 1080 842 736 215 403 618 1000 395 -152 -731 -984 -1026 -548 -231 -235 69 41 367 645 1072
1733 1072 812 581 126 -211 -157 -280 -103 -940 -1226 -1191 -768 10 634 620 240 40 688 890 697 577 -438
1754 -438 -614 -933 -415 -382 -503 -533 -453 -118 347 541 1125 918 609 373 -99 -279 75 50 -317 -1148 -973
1775 -973 -781 107 415 299 135 353 733 1160 1130 543 161 -566 -531 -360 -360 -669 -713 -480 -366 206 873 1016
$$ packed form
1627i98m01K95L14R79P83M2n51K4L02O1J10n75n99j006M7O5Q63l0m28j49O17Q00
1649E65O73qj74o60j28o9j11l28l08q04J47RL14J313j17r4K19J7N11J45j02l00
1671G10r91l03m01M50J32j34l55k09O92P83Q85j16o30j95r5K82J9n23l01p85p6
1692a161J51M29J82M45J07R4J45L67L24K98r71l79o25k26L18J23k13l21l67N44
1712g36J041P75k38j06n21J88K15L82o05n47n79k53m2M78L17mL04k8L26K78M27
1733A072k60k31m55l37N4j23J77q37k86L5M23P78O24j4l80k00O48K02j93j20j015
1754d38j76l19N18L3j21l0Q0L35M65J94N84k07l09k36m72j80L54k5l67q31J75
1775i73J92Q88L08j16j64K18L80M27l0n87l82p27L5J71%l09m4K33J14N72O67J43
$$ plain form
1797 1016 861 759 465 127 314 299 -225 -548 -1090 -1025 -996 -561 -45 97 -85 232 862 1148 1192 605 45
1818 45 -418 -466 -242 -231 -310 -800 -1078 -363 -75 516 485 667 735 337 193 414 261 -186 -542 -1087 -1068 -527
1840 -527 -227 -125 -42 56 187 564 1107 791 650 298 -261 -323 -276 -339 -444 -1070 -967 -775 44 282 497 254
1862 254 299 475 502 720 680 33 -330 -787 -645 -628 -629 -122 -213 -229 20 676 709 782 519 384 122 210 -57 -394
1886 -394 -482 -913 -981 -711 -10 483 173 211 188 600 994 839 534 -63 -257 -473 -484 -384 -492 -745 -626 -259
1908 -259 -144 669 740 604 653 193 97 422 494 -117 -608 -1039 -800 -497 -203 -286 228 60 135 454 819 808
1930 808 652 101 -312 -174 -230 -394 -553 -736 -848 -410 9 230 484 803 543 152 280 608 475 -98
1950 -98 -518 -760 -754 -705 -291 53 -261 -222 229 578 963 982 628 488 -62 -44 -125 -97 -211 -682 -657 -523 -207
$$ packed form
1797A016j55j02k94l38J87j5n24l23n42O5K9M35N16J42j82L17O30K86M4n87n60
1818D5m63m8K24J1p9m90k78P15K88N91l1J82O8l98j44K21j53m47l56n45J9N41
1840e27L00J02Q3R8J31L77N43l16j41l52n59o2M7o3j05o26J03J92Q19K38K15k43
1862B54M5J76K7K18m0o47l63m57J42J7jN07r1j6K49O56L3P3k63j35k62Q8k67l37
1886c94q8m31o8K70P01M93l10L8k3M12L94j55l05n97j94k16j1J00j08k53J19L67
1908b59J15Q13P1j36M9m60r6L25P2o11m91m31K39L03K94q3N14j68P5L19L65j1
1930H08j56n51m13J38n6j64j59j83j12M38M19K21K54L19k60l91J28L28j33n73
1950i8m20k42OM9M14L44l14L9M51L49L85J9l54j40n50J8q1K8j14m71K5J34L16
$$ plain form
1973 -207 154 702 538 96 271 599 473 409 105 -140 -305 -793 -421 -321 -429 -251 -381 -128 251 786
1993 786 822 436 409 206 -56 -87 -82 -325 -565 -704 -602 -94 372 205 241 334 381 441 387 719 290 -346 -425 -174
2017 -174 -116 -253 -236 -495 4 -275 475 648 798 271 343 282 -26 228 120 -384 -674 -635 -752 -302 -372 -25
2039 -25 -77 25 389 325 698 379 54 -53 -373 -318 -271 -160 -454 -870 -643 43 161 243 659 783 395 232
2061 232 389 660 24 -570 -814 -517 -557 -369 91 -22 -203 -173 701 629 817 490 436 -60 -174 -127 134 -230
2083 -230 -490 -796 -385 -238 15 252 467 241 129 285 439 278 146 11 -356 -482 -652 -60 -245 -375
2103 -375 -333 15 62 495 761 564 3 -13 38 2 -152 -43 -467 -564 -684 -248 146 60 381 543 219 502
2125 502 588 440 552 -93 -223 -401 -117 -333 -439 -60 -479 -517 134 598 585 577 218 142 164 68 238 -35 -558
$$ packed form
1973b07L61N48j64m42J75L28j26o4l04k45j65m88L72J00j08J78j30K53L79N35
1993G86L6l86k7k03k62l1Nk43k40j39J02N08M66j67L6R3M7O0n4L32m29o36p9K51
2017a74N8j37J7k59M99k79P50J73J50n27P2o1l08K54j08n04k90L9j17M50p0L47
2039b5n2J02L64o4L73l19l25j07l20N5M7J11k94m16K27O86J18Q2M16J24l88j63
2061B32J57K71o36n94k44K97m0J88M60j13j81L0Q74p2J88l27n4m96j14M7K61l64
2083b30k60l06M11J47K53K37K15k26j12J56J54j61j32j35l67j26j70N92j85j30
2103c75M2L48M7M33K66j97n61j6N1l6j54J09m24r7j20M36L94q6L21J62l24K83
2125E02Q6j48J12o45j30j78K84k16j06L79m19l8O51M64j3ql59p6K2r6J70k73n23
$$ plain form
2148 -558 -471 -298 -279 -202 42 60 157 -47 381 811 785 520 -69 -221 -544 -581 -95 36 -758 -568 -232 -105
2170 -105 190 171 600 426 211 285 526 319 -132 -229 -298 -532 -353 -74 -20 -51 -215 229 576 355 390 672
2192 672 -48 -288 -197 -52 -221 -286 -765 -468 -209 -369 121 732 110 -91 408 562 485 347 164 -151 -519
2213 -519 -476 42 -129 -419 -138 288 363 296 543 581 70 -242 248 50 -6 -304 -337 -328 -660 -477 77 365 -46
2236 -46 144 158 93 180 676 523 -39 -410 -552 70 -281 -341 -161 -408 -135 -330 380 322 95 275 530 184
2258 184 78 43 -17 -496 -851 -380 -279 -261 -101 -65 420 -40 299 720 550 323 -107 -1 20 -197 -232 -176
2280 -176 -575 -465 84 241 271 250 303 422 180 21 289 -25 -98 -218 -207 -245 -322 -441 175 -72 -425 18
2302 18 413 215 244 522 394 208 -236 -110 60 -441 -462 -429 -424 -559 147 395 64 3 622 626 275 279 196 -117
$$ packed form
2148e58Q7J73J9P7K44J8R7k04M28M30k6k65n89j52l23l7M86J31p94J90L36J27
2170a05K95j9M29j74k15P4K41k07m51r7o9k34J79K79N4l1j64M44L47k21L5K82
2192F72p20k40R1J45j69o5m79K97K59j60M90O11o22k01M99J54p7j38j83l15l68
2213e19M3N18j71k90K81M26P5o7K47L8n11l12M90j98n6k98l3Rl32J83N54K88m11
2236d6J90J4o5Q7M96j53n62l71j42O22l51o0J80k47K73j95P10n8k27J80K55l46
2258A84j06l5o0m79l55M71J01J8J60L6M85m60L39M21j70k27m30J06K1k17l5N6
2280a76l99J10N49J57L0k1N3J19k42j59K68l14p3j20J1l8p7j19O16k47l53M43
2302A8L95j98K9K78j28j86m44J26J70n01k1L3Nj35P06K48l31o1O19Ml51Mq3l13
$$ plain form
2326 -117 -780 -615 -159 107 -382 -294 67 200 -155 459 447 391 51 -66 149 103 -124 28 26 -506 -605 -370
2348 -370 223 -44 -107 540 242 92 380 793 -124 -362 -189 62 -79 -726 124 -203 -276 -229 496 372 316
2369 316 425 445 358 -161 105 183 -276 -322 -435 -202 -286 -328 180 395 -37 -4 541 672 210 13 -16 -45 -152
2392 -152 -357 -237 -317 -516 -419 -157 84 279 204 646 96 44 367 338 -45 -226 -206 -207 -722 -275 43 122 -371
2415 -371 -36 524 465 276 203 399 14 -467 330 98 -304 -432 -313 -350 -334 -140 262 219 -326 125 20 494
2437 494 -132 76 202 -405 -723 -151 181 -218 -570 -98 224 16 83 679 526 -171 -168 320 -50 -260 -187
2458 -187 -391 -314 -421 -342 397 -116 -175 184 295 173 232 279 277 -176 35 -135 -173 -448 -170 163 48 -80 51
2481 51 662 658 141 -216 402 -68 -59 217 -183 -609 -368 -82 218 -77 -132 383 328 161 98 705 127 -98 138
$$ packed form
2326a17o63J65M56K66m89Q8L61J33l55O14j2n6l40j17K15m6k27J52kn32r9K35
2348c70N93k67o3O47k98j50K88M13r17k38J73K51j41o47Q50l27p3M7P25j24n6
2369C16J09K0q7n19K66P8m59m6j13K33q4m2N08K15m32L3N45J31m62j97k9k9j07
2392a52k05J20q0j99R7K62K41J95p5M42n50n2L23k9l83j81K0jn15M47L18P9m93
2415c71L35N60n9j89p3J96l85m81P97k32m02j28J19l7J6J94M02m3n45M51j05M74
2437D94o26K08J26o07l18N72L32l99l52M72L22k08O7N96j53o97LM88l70k10P3
2458a87k04P7j07P9P39n13n9L59J11j22N9M7km53K11j70l8k75K78L33j15j28J31
2481E1O11mn17l57O18m70RK76m00m26K41K86L00k95n5N15n5j67o3O07n78k25K36
$$ plain form
2504 138 28 -53 -430 137 -89 -144 -539 -43 203 -102 250 314 314 -212 167 387 -152 -306 -355 56 -406 -301
2526 -301 17 191 -70 -116 142 288 270 427 582 458 -115 -30 134 -146 -573 -15 -310 -221 -314 221 306 146
2548 146 261 182 286 106 -21 -80 -151 -577 -276 112 -148 -212 -260 44 -173 154 393 343 -76 6 255 84
2570 84 -49 -341 -108 -230 -305 -218 235 -6 31 53 228 174 230 327 538 -24 -483 146 -90 -303 -421 -56 -277
2593 -277 -213 197 323 243 66 243 354 132 -180 43 234 -450 -326 -8 -211 -274 -108 207 151 -37 274
2614 274 262 207 233 54 -302 -317 -668 -122 166 -134 -326 -350 158 77 25 700 230 0 13 166 -30 -45 -319
2637 -319 100 -60 -167 -288 162 132 61 -60 178 177 151 48 117 -156 -309 -394 104 -437 -106 -177 -186 -307 38
2660 38 407 -25 -9 485 275 115 -145 278 15 -531 -343 96 84 -109 0 249 332 -23 522 579 295 -327
$$ packed form
2504A38j10q1l77N67k26n5l95M96K46l05L52O4%n26L79K20n39j54m9M11m62J05
2526c01L18J74k61m6K58J46j8J57J55j24n73Q5J64k80m27N58k95Q9r3N35Q5j60
2548A46J15p9J04j80j27n9p1m26L01L88k60o4m8L04k17L27K39n0m19Q2K49j71
2570H4j33k92K33j22p5Q7M53k41L7K2J75n4N6R7K11n62m59O29k36k13j18L65k21
2593b77O4M10J26q0j77J77J11k22l12K23J91o84J24L18k03o3J66L15n6j88L11
2614B74j2n5K6j79l56j5l51N46K88l00j92k4N08q1n2O75m70k30J3J53j96j5k74
2637c19M19j60j07j21M50l0p1j21K38jk6j03O9k73j53q5M98n41L31p1rj21L45
2660C8L69m32J6M94k10j60k60M23k63n46J88M39j2j93J09K49Q3l55N45N7k84o22
$$ plain form
2682 -327 20 274 -192 -366 170 -31 -444 -355 153 410 -266 -200 299 526 181 53 216 101 -219 -82 241
2703 241 -212 -226 -39 -5 -161 -144 443 598 143 -37 86 -52 -366 -258 -126 -176 -311 -313 104 51 -50 -13 -18
2726 -18 -122 244 353 211 -169 -252 64 -295 -376 -117 -43 -137 -465 -227 445 112 51 403 27 183 -56 289
2748 289 142 -218 -451 -74 -242 -156 -171 272 83 206 -58 269 -45 -32 195 71 116 -299 137 -260 -201 -578
2770 -578 -65 36 -71 27 199 306 111 17 511 228 -261 28 242 -446 -480 -147 138 -119 -36 15 114 -260
2792 -260 163 418 158 -35 135 193 -252 -312 -234 24 -139 -341 32 368 -41 110 320 89 -54 221 155
2813 155 21 -266 -138 36 -209 -357 -148 83 64 42 205 227 -19 177 153 117 -95 -148 -52 -2 -135 -33 71
2836 71 -173 -65 63 230 30 51 178 376 53 236 179 -160 -317 -50 -178 80 47 -169 260 320 -58 340
$$ packed form
2682c27L47K54m66j74N36k01m13Q9N08K57o76O6M99K27l45j28J63j15l20J37L23
2703B41m53j4J87L4j56J7N87J55m55j80J23j38l14J08J32n0j35kM17n3j01L7n
2726a8j04L66J09j42l80q3L16l59q1K59P4r4l28K38O72l33o1L52l76J56k39L45
2748B89j47l60k33L77j68Q6j5M43j89J23k64L27l14J3K27j24M5m15M36l97N9l77
2770e78N13J01j07R8J72J07j95r4M94k83m89K89K14o88l4L33K85k57Q3N1R9l74
2792b60M23K55k60j93J70N8m45o0P8K58j63k02L73L36m09J51K10k31j43K75o6
2813A55j34k87J28J74k45j48K09K31j9k2J63K2k46J96k4l6k12n3R6N0j33J02J04
2836G1k44J08J28J67k00K1J27J98l23J83n7l39j57K67j28K58l3k16M29O0l78L98
$$ plain form
2858 340 347 132 193 104 45 112 -325 -158 48 -319 -76 -37 -6 -149 -121 370 151 196 207 196 -42 -306 -233 24
2882 24 -239 -85 -42 92 -252 -208 52 88 -53 -155 62 286 -69 -45 103 281 -269 -200 164 122 64 74 242
2905 242 112 -269 446 106 117 -309 -42 59 -69 -46 -335 -67 -256 -126 60 175 -81 237 -60 49 97
2926 97 240 238 -192 -99 -140 -87 -392 -105 35 47 -224 20 158 47 -171 -19 130 -134 -98 -100 48 -415 -195
2949 -195 -89 95 38 -34 180 28 -153 1 257 274 75 25 14 -165 -11 56 282 -252 -39 -210 176 145
2971 145 -105 135 266 98 122 49 62 -155 38 -133 39 54 -158 150 51 66 -31 434 -21 17 132 -64 -1
2994 -1 -248 118 -98 -101 140 81 -277 -26 470 73 62 28 239 159 123 -131 54 -288 -209 -149 176 -89 31 184
3018 184 252 177 213 -67 425 -84 -108 69 81 -235 -146 42 -23 -131 44 18 95 -79 72 173 76 21 74 342
$$ packed form
2858C40Pk15O1q9n9O7m37J67K06l67K43L9L1j43K8M91k19M5J1j1k38k64P3K57
2882B4k63J54M3J34l44M4K60L6j41j02K17K24l55K4J48J78n50O9L64m2n8J0J68
2905B42j30l81P15l40J1m26K67J01j28K3k89K68j89J30J86J15k56L18k97J09M8
2926I7J43km30R3m1N3l05K87J40J2k71K44J38j11k18J52J49k64L6kJ48m63K20
2949a95J06J84n7p2K14j52j81J54K56J7j99n0j1j79J54O7K26n34K13j71L86l1
2971A45k50K40J31j68K4p3J3k17J93j71J72J5k12L08r9J5r7M65m55L8J15j96O3
2994ak47L66k16lK41n9l58K51M96l97j1l4K11q0l6k54J85l42P9O0L25k65J20J53
3018A84O8p5L6k80M92n09k4J77J2l16Q9J88o5j08J75k6P7j74J51J01r7n5N3K68
$$ plain form
3042 342 70 -90 -252 -9 -265 60 124 -157 -52 246 240 49 107 0 211 -30 234 15 68 144 -344 -160
3064 -160 -139 -36 209 221 -1 55 -19 69 199 115 -93 -129 287 -154 55 162 133 124 184 106 -45 233 306 208 -215
3089 -215 109 33 177 14 43 -43 -146 -214 -142 151 -282 26 220 160 110 100 161 -104 -185 -25 121 136 47 -253
3113 -253 313 43 9 271 166 106 166 -4 275 -41 -22 96 -262 -50 -185 -197 164 40 -47 -88 11 40 -61
3136 -61 211 207 -92 -285 -83 72 -320 -157 130 188 -105 262 -123 -193 348 -37 85 -195 114 123 -195 -455
3158 -455 -119 -361 -103 -92 -24 83 -87 116 22 170 249 184 -124 76 -68 -3 168 -2 19 -159 -72 145 -18
3181 -18 62 69 75 -115 234 266 200 102 155 52 -142 -131 120 -63 6 -93 57 272 256 66 151 248 -119 -40 -199 33
3207 33 -193 39 121 -140 85 121 -23 -59 66 226 27 174 -63 221 -94 -77 -19 66 99 -285 5 -99 49
$$ packed form
3042C42k72j60j62K43k56L25O4k81J05K98oj91N8j07K11k41K64k19N3P6m88J84
3064a60K1J03K45J2k22N6p4Q8J30q4k08l6M16m41K09J07k9rO0p8j51K78P3r8m23
3089b15L24p6J44j63K9q6j03o8P2K93m33L08J94o0n0j0O1k65q1J60J46J5q9l00
3113b53N66k70l4K62j05o0O0j70K79l16J9J18l58K12j35j2L61j24q7m1R9K9j01
3136f1K72mk99j93K02J55l92J63K87N8k93L67l85p0N41l85J22k80L09Rl18k60
3158d55L36k42K58J1O8J07j70K03r4J48P9o5l08K00j44O5J71j70K1j78Q7K17j63
3181a8Q0POj90L49L2o6r8N3j03j94J1K51j83O9r9J50K15j6j90Q5R7l67P9j59K32
3207C3k26K32Q2k61K25L6j44l6J25J60j99J47k37K84l15J7N8Q5L3l84K90j04J48
$$ plain form
3230 49 -183 -3 10 42 -10 296 48 158 -225 150 194 -70 266 154 80 109 256 120 -36 48 109 388 -108
3253 -108 81 -23 -38 -176 -156 -234 -377 -59 -278 -4 -112 -147 25 249 131 171 97 -26 -42 -165 -23 123
3275 123 16 -95 -203 145 16 -101 41 -22 82 89 19 252 -145 -20 -348 -224 -155 7 32 -390 -110 65
3297 65 304 256 -68 -30 44 -119 -57 -41 74 -146 -134 44 169 52 68 195 -110 -124 71 382 180 -317 153
3320 153 112 -10 -86 -143 -224 -135 133 4 -300 187 -18 57 38 -39 212 -95 87 -146 -147 -310 -7 -166 -202 -252
3344 -252 67 81 -120 -19 131 142 -192 -15 188 103 -70 -70 -104 -111 -19 -29 -118 -153 107 130 17 -163 -20 -34 -181
3369 -181 -36 -98 -83 -19 -101 -167 -174 -83 145 11 309 29 -113 112 251 160 98 3 146 152 -221 -285 187 -16 -166
3394 -166 106 126 97 41 4 111 -68 -96 -181 -360 -192 -114 69 -106 -16 63 213 -88 131 32 19 37 29 -226 -89
$$ packed form
3230D9k32J80J3L2n2L06k48J10l83L75M4k64L36j12p4K9J47j36j56Q4O1K79m96
3253a08J89j04j5j38K0p8j43L18k19K74j08l5J72K24j18M0p4j23j6j23J42J46
3275A23j07j11j08L48j29j17J42o3J04Pp0K33l97J25l28J24O9J62K5m22K80J75
3297F5K39m8l24L8P4j63O2J6J15k20J2J78J25j17J6J27l05j4J95L11k02m97M70
3320A53m1j22p6n7q1Q9K68j29l04M87k05P5j9p7K51l07J82k33jj63L03j59l6n0
3344b52L19J4k01J01J50J1l34J77K03q5j73%l4pR2j0q9l5K60K3j13j80J43j4j47
3369a81J45o2J5O4q2o6pR1K28j34K98k80j42K25J39r1o2r5J43Ol73o4M72k03j50
3394a66K72K0k9n6l7J07j79k8q5j79J68P8J83j75R0P9J50l01K19r9j3J8qk55J37
$$ plain form
3419 -89 26 74 49 -67 138 -56 27 38 275 131 -24 277 214 -147 -159 200 26 112 -78 80 -223 120 115
3442 115 163 217 214 -27 40 -212 -270 3 -149 -130 -110 190 -85 -297 93 130 -17 60 -18 122 39 -69 108 -105
3466 -105 -157 -36 -110 205 182 -161 -91 -87 151 -206 -275 42 -84 -213 67 72 -202 245 -217 -168 -189 -415 -228 -126
3490 -126 228 -120 42 52 91 157 42 -61 -23 114 301 -242 73 -44 -134 -93 277 -241 153 13 344 230
3512 230 -57 230 33 176 -25 -163 -131 -83 -12 3 205 225 -111 -20 -136 -44 60 135 41 64 -99 61 220
3535 220 124 -163 377 -73 -265 69 -71 -9 207 -65 5 124 54 -207 75 -153 60 190 74 -23 84 27
3557 27 -30 -74 -46 -35 300 1 18 133 -296 119 82 -95 -49 14 -255 -41 -139 -82 -64 197 62 -97 82 -66
3581 -66 -205 177 135 -117 -213 -30 99 15 -137 109 11 28 34 62 0 -79 114 122 180 -2 -65 159 124 -4 -116
$$ packed form
3419h9J15M8k5j16K05j94Q3J1K37j44j55L01o3l61j2L59j74Q6j90J58l03L43n
3442A15M8N4lk41O7k52n8K73j52J9K0L00k75k12L90L7j47P7p8J40q3j08J77k13
3466a05n2J21p4L15k3l43P0MK38l57o9L17j26j29K80Nk74M47m62M9k1k26J87J02
3490a26L54l48J62J0L9O6j15j03L8J37J87n43L15j17r0M1L70n18L94j40L31j14
3512B30k87K87j97J43k01j38L2M8P1J5K02K0l36R1j16R2J04P5r4K3j63J60J59
3535B20r6k87N40m50j92L34j40O2K16k72P0J19p0k61K82k28K13J30j16r7J07n7
3557B7n7m4K8J1L35k99J7J15m29M15l7j77M6O3k69K14r8N7J8K61j35j59J79j48
3581f6j39L82m2k52r6J83J29q4j52K46r8J7OK8o2p9J93QN8j82o3K24l5j28j12
$$ plain form
3606 -116 246 171 59 -30 -70 192 142 -100 284 -76 8 201 75 119 -111 138 131 87 64 48 37 146 299 234
3630 234 -39 82 -125 -80 151 -109 -106 3 168 -142 -333 303 177 139 212 9 -116 25 -92 1 94 -94
3652 -94 -104 3 -31 -270 40 -198 109 -1 -39 -53 72 38 -231 286 -243 -29 -47 -24 170 11 -128 35 -185
3675 -185 -223 32 -47 -152 -46 99 -35 -228 -163 -87 -90 -150 199 155 19 153 160 152 183 -78 -6 86 137 70 -1 30
3701 30 168 -130 -98 322 -280 -61 -174 -14 -48 -67 -105 -158 236 -108 53 -65 -262 -101 221 319 174 124 -80
3724 -80 -161 85 173 124 200 34 226 -113 -225 -287 98 111 40 -107 -6 34 238 165 -118 46 -1 159 76 155
3748 155 -116 -73 -22 193 146 144 53 298 -93 360 205 -75 101 151 70 201 83 -64 -202 63 185 192 -66
3771 -66 133 -20 -56 -104 161 -124 111 -115 -48 -112 -213 115 -245 351 -49 -133 -10 12 -11 116 114 27 42 148
$$ packed form
3606a16L62p5j12q9m0K62n0k42L84l60Q4J93j26M4k30K49pm4k3j6j1J09J53o5
3630B34k73J21k07M5K31k60LJ09J65l10j91O36j26l8P3k03j25J41j17R3R3j88
3652i4j0J07l4k39L10k38L07j10l8j4J25l4k69N17n29K14j8K3J94j59j39J63k20
3675a85l8K55p9j05J06J45j34j93O5P6lo0L49m4j36J34PqL1k61P2R2N1o7p1L1
3701C0J38k98L2M20o02K19j13J60l4j9l8n3L94l44J61j18j97J61L22R8j45n0k04
3724h0q1K46Q8m9P6j66J92l39j12o2L85J3p1j47J01M0K04p3k83J64m7J60q3P9
3748A55k71M3N1K15m7kr1K45l91M53j55k80J76N0q1J31j18j47j38K65J22Pk58
3771f6J99j53l6m8K65k85K35k26O7o4j01L28l60N96m00q4J23K2k3J27kq7J5J06
$$ plain form
3795 148 83 -377 42 202 112 -75 -113 361 -168 62 -140 -83 203 64 110 265 -204 8 96 -50 214 173
3817 173 68 -34 72 20 128 373 -27 69 21 51 0 -403 156 -141 73 -36 -129 -66 112 101 11 -116 18
3840 18 -130 -87 128 287 -243 -36 -80 -107 -37 -149 -160 131 10 -117 345 -58 -30 -80 40 50 35 -90 326
3863 326 60 138 -72 140 19 19 155 -196 -184 -83 -98 -178 106 211 85 46 -62 -152 -259 116 69 -164 190
3886 190 149 60 5 10 -35 111 -6 -49 120 74 39 34 -34 -173 124 -133 204 114 -103 293 90 -29 128 -51
3910 -51 -17 -4 -53 -69 133 43 84 195 -21 2 -118 20 -344 -111 295 -53 172 -65 109 21 51 1 138 229
3934 229 -155 144 243 109 225 188 3 209 -25 123 244 -92 40 -146 -115 27 -109 130 -20 31 36 205
3956 205 53 25 -250 -213 -188 -65 3 32 9 -166 89 -50 -220 -13 -209 53 -128 12 -16 -319 228 193 -59
$$ packed form
3795A48o5m60M19J60r0j87l8M74n29K30k02N7K86j39M6J55m69K12Q8j46K64m1
3817A73j05j02J06n2J08K45m00R6m8L0n1m03N59k97K14j09r3O3J78j1r0j27J34
3840A8j48M3K15J59n30K07m4k7P0j12j1K91j21j27M62m03K8n0J20J0j5j25M16
3863C26k66P8k10K12j21%J36l51J2J01j5q0K84J05j26l9j08r0j07L75m7k33L54
3886A90m1q9n5Nm5J46j17m3J69m6l5no8j39K97k57L37r0k17L96k03j19J57j79
3910e1L4J3m9j6K02r0M1J11k16K3j20J38l64K33M06l48K25k37J74q8L0n0J37R1
3934B29l84K99R9j34J16l7j85K06k34J48J21l36J32j86L1J42j36K39j50N1NJ69
3956B05j52k8k75L7K5J23O8K9k3j75K55j39j70K07j96K62j81J40k8l03N47l5k52
$$ plain form
3979 -59 53 -64 -64 101 30 84 -218 -6 223 47 -219 115 -98 90 12 196 8 -118 164 -23 60 51 -132
4002 -132 -62 142 -91 -80 -178 -46 59 -274 -136 -1 350 -46 6 132 -16 57 255 -59 -118 -182 41 -167
4024 -167 -195 -126 -122 4 38 121 94 207 -182 -20 303 49 -49 174 384 -117 113 -98 -94 -150 -1 -118 4 -35
4048 -35 -229 56 -60 67 -79 124 -62 -224 240 -225 -72 52 -107 173 56 2 -198 24 253 -95 58
4069 58 73 -63 -85 46 -23 114 -87 -33 12 -190 -11 38 -108 -144 89 -209 234 -172 12 187 94 26 -80
4092 -80 16 -189 116 -170 -85 -14 157 65 -67 -13 200 -18 -68 -1 -147 169 141 -46 127 -132 213 -94 118
4115 118 -182 119 -187 176 -24 316 216 -18 -17 85 -150 -53 -2 -46 134 35 -263 -186 -33 195 153 265 -151
4138 -151 335 -121 -292 234 -118 -262 -36 -155 -338 67 -44 -72 -77 69 123 152 -162 49 -195 -144 46 -19
$$ packed form
3979e9J12j17%J65p1N4l02K12K29j76k66L34k13J88p8J84j88j26K82j87Q3rj83
4002a32P0K04k33J1r8J32J05l33J38J35L51l96N2J26j48P3J98l14n9o4K23k08
4024a67k8O9MJ26L4Q3k7J13l89J62L23k54r8K23K10n01K30k11Mn6J49j17J22l9
4048c5j94K85j16J27j46K03j86j62M64m65J53J24j59K80j17n4k00K22K29l48J53
4069E8J5j36k2J31o9J37k01N4M5k02J79M9j46l6K33k98M43m06J84J75r3o8j06
4092h0R6k05L05k86Q5P1J71r2j32N4K13k18n0O7j46L16k8j87J73k59L45l07K12
4115A18l00L01l06L63k00L40j00k34JJ02k35R7N1m4J80r9k98P7J53K28m2J12m16
4138a51M86m56j71N26l52j44K26j19j83M05j11k8nJ46N4K9l14K11k44N1J90o5
$$ plain form
4160 -19 57 -201 -167 -195 -31 27 117 149 29 198 -29 -36 -100 213 9 -97 24 425 -114 -43 1 55 122 27 123
4185 123 70 143 23 -50 79 54 -206 129 217 -162 9 76 262 -94 -26 -46 -19 -133 55 -114 -227 51 -36
4208 -36 90 -143 -57 70 -73 219 -51 143 -71 51 -3 86 12 64 -11 27 62 -176 -177 -274 95 -20 -24 -64 153
4233 153 -349 -178 63 -1 -96 71 26 52 -401 -35 -105 -53 -198 -163 -143 -221 341 48 117 -215 -229 199 53 -149
4257 -149 69 26 -252 2 -64 -67 233 -94 -6 -12 10 -8 -31 -89 -216 -71 -12 -44 79 -49 159 123 21 66 -141
4282 -141 63 149 -90 151 -30 -236 -195 101 -98 -60 144 144 80 -14 252 -43 163 13 -9 -30 0 199 86
4305 86 -41 209 -1 43 -193 -5 -182 74 278 190 303 59 97 10 -99 -143 -94 -221 33 119 25 -30 41 -111
4329 -111 103 -105 45 -2 -3 -71 66 110 -32 179 -167 106 -129 76 -216 4 -206 215 49 -36 -71 -277
$$ packed form
4160a9P6k58L4k8J64N8R0L2j20J69k27po4L13k04j06J21M01n39P1M4N4O7r5R6
4185A23n3P3j20p3J29k5k60L35Q8l79J71O7J86l56O8k0K7j14J88j69j13K78q7
4208c6J26k33Q6J27j43K92k70J94k14J22n4Q9p4N2p5L8L5k38jr7L69j15mm0K17
4233A53n02J71K41o4r5J67m5K6m53L66p0N2j45L5K0p8N62k93O9l32j4M28j46k02
4257a49K18m3k78K54o6lL00l27Q8oK2j8k3n8j27J45N9l2J23j28K08l6j02M5k07
4282a41K04Q6k39K41j81k06M1K96j99L8K04%o4r4K66k95K06j50k2k1L0J99j13
4305H6j27K50k10M4k36J88j77K56K04q8J13k44L8q7j09m4M9j27K54Q6r4n5P1j52
4329a11K14k08J50m7jo8J37M4j42K11l46K73k35K05k92K20k10M21j66q5l5k06
$$ plain form
4351 -277 -106 -51 -70 192 -12 -22 31 -99 142 -102 -168 -327 130 -64 35 -85 -100 -134 -42 -241 66 -18 117
4374 117 139 -9 80 114 -184 338 21 -54 -79 43 212 -126 -178 99 156 27 279 173 -14 77 246 84 -59
4397 -59 119 37 -190 21 -123 -230 59 17 -87 -176 -389 -160 -32 -52 262 206 -156 -125 -88 -221 13 -8 -256
4420 -256 -78 163 -9 105 -84 15 -69 -153 222 -258 283 113 -267 -217 53 391 231 108 -91 4 157 -313
4442 -313 295 -98 14 198 -114 218 46 -205 17 -72 -219 -144 -95 -107 -88 157 111 17 -407 -213 -180 -74 147
4465 147 -188 -35 32 42 -250 -248 -14 63 -34 -20 126 -188 234 71 158 68 17 137 -332 20 27 9 225 -140
4489 -140 -107 7 -71 105 66 -69 135 -63 25 158 10 -94 -18 46 -136 187 17 -181 27 -83 -96 -113 8
4512 8 -200 -101 130 182 72 124 -104 -62 177 420 -76 -70 -79 11 162 116 -182 -69 122 41 141 -162 -8 -21 178
$$ packed form
4351b77J71N5j9K62k04j0N3j30K41k44o6j59M57j94R9j20j5l4R2j99L07q4J35
4374A17K2j48Q9L4k98N22l17p5k5J22J69l38n2K77N7j29K52j06j87R1J69j62j43
4397e9J78q2k27K11j44j07K89m2j04q9k13K29J28k0L14n6l62L1L7j33K34k1k48
4420b56J78K41j72J14j89R9q4q4L75m80N41j70l80N0K70L38j60j23j99R5J53m70
4442c13O08l93J12J84l12L32j72k51K22q9j47P5M9j2J9K45m6r4m24J94L3J06K21
4465A47l35J53O7J0k92KK34P7r7J4J46l14M22j63Q7r0n1J20m69L52Pj8K16l65
4489a40L3J14p8J76l9j35K04j98Q8J33j48j04P6O4j82L23j70j98K08j10j3j7J21
4512Hk08R9K31N2j10N2k28M2K39K43m96OrR0J51m6k98J13J91q1J00l03J54j3J99
$$ plain form
4537 178 286 48 89 137 160 9 -51 -248 -204 -136 25 -148 -166 -11 -47 -50 42 70 141 -134 203 94 64 108 57
4562 57 -87 1 -37 36 90 -145 -313 -26 -26 21 16 -159 106 95 130 23 -16 -58 -281 -218 -251 -5 -94 249 -10 72
4588 72 31 -182 -33 -265 -148 -6 -1 -177 -163 62 121 -248 -55 40 56 41 -127 49 212 124 85 -35 82 -77
4612 -77 -175 121 -176 48 112 -90 36 -56 274 -94 186 -66 -65 -75 -107 159 71 217 -277 -155 128 -48 -64
4635 -64 -39 -169 26 -34 -186 69 -32 -120 46 62 20 -77 177 -63 -98 -150 -129 -30 93 9 238 -132 -201 156
4659 156 -79 -40 -23 -95 -66 8 254 -168 2 -141 83 71 -28 -237 31 -206 -49 198 -49 -198 -21 50 246
4682 246 -110 -201 81 76 -76 205 -81 -19 -229 -82 180 -27 -118 -7 288 101 -48 17 44 173 -262 -150
4704 -150 301 -26 1 250 144 103 -62 -290 191 -169 24 22 48 82 98 209 -166 239 172 314 -71 -55 -21
$$ packed form
4537A78J08k38M1M8K3j51o0j97M4O8J61j73j8J55l6lR2K8P1k75L37j09l0M4n1
4562E7j44Q8l8P3N4k35j68K87%M7nj75K65j1L5j07l9m2k23O3l3K46q9L43k59Q2
4588G2m1k13J49k32J17J42Nj76J4K25N9l69J93R5J6j5j68J76J63q8l9j20J17j59
4612g7r8K96k97K24O4k02J26r2L30l68K80k52Jj0l2K66q8J46m94J22K83j76j6
4635f4K5j30J95o0j52K55j01q8J66J6m2r7K54k40l5n2K1R9J23q4K29l70o9L57
4659A56k35L9J7p2K9P4K46m22J70j43K24j2r9k09K68k37J57K47k47j49J77P1J96
4682B46l56r1K82nj52K81k86O2k10J47K62k07r1J11K95j87j49O5K7J29m35J12
4704a50M51l27K7K49j06m1j65k28M81l60J93kK6L4J6J11l75M05o7J42l85J6L4
$$ plain form
4727 -21 9 42 16 -75 -237 -28 -23 181 113 -53 53 -29 100 -309 150 -56 -166 -78 -144 -116 -178 93 -263 389
4751 389 149 278 22 10 101 -28 387 17 37 83 -279 54 141 -16 -6 -33 248 32 -105 2 -20 -82 200
4774 200 -212 130 5 134 -142 -90 191 -182 30 -109 -98 -209 -70 -227 -63 -186 -80 -72 -247 -159 -34 -177
4796 -177 -35 49 -190 -91 175 32 -33 95 -115 -86 -7 -177 27 -87 111 -139 -230 -134 29 -151 18 242
4818 242 96 109 65 -89 -95 123 19 -159 -122 -285 142 69 106 214 -167 -132 90 110 68 -106 -392 186 -40
4841 -40 -229 -11 -103 -216 -139 -146 -32 6 29 -17 -249 -68 -136 -78 -261 43 -60 89 120 -34 -31 -169 -56 112
4865 112 -45 129 -15 -100 -162 117 100 457 32 30 -291 119 -94 25 -3 -38 131 -34 69 -146 -58 -5 19
4888 19 -217 -221 -88 -177 -126 -50 110 62 168 -23 19 186 -123 -169 -125 237 -129 -76 -116 16 -17 -87 -20 -37 -165
$$ packed form
4727b1L0L3k6r1j62K09NK04o8j66J06q2J29m09M59k06j10Q8o6K8o2K71l56O52
4751C89k40J29k56j2R1j29M15l70K0M6l62L33Q7j57J0k7K81k16j37J07k2o2K82
4774B00m12L42j25J29k76N2K81l73K12j39J1j11J39j57J64j23J06Qj75Q8J25j43
4796a77J42Q4k39R9K66j43o5J28k10K9P9j70K04j14J98k50r1R6J63j80J69K24
4818B42j46J3m4j54oK18j04j78L7j63M27p3L7J08l81L5K22K0m2j74k86N78k26
4841d0j89K18r2j13P7pJ14L8K3m6k32J81o8N8j83L04j03J49L1j54Lj38J13J68
4865A12j57J74j44q5o2K79j7L57m25kl21M10k13J19k8l5J69j65J03k15Q8N3K4
4888A9k36mJ33q9N1P6J60m8J06j91M2J67l09m6M4L62l66N3m0J32l3p0O7j7j28
$$ plain form
4913 -165 -153 232 236 65 39 -27 70 -240 168 85 44 130 -107 -6 103 -183 -113 211 46 -5 -268 20 98 -149
4937 -149 -6 74 212 -41 -9 -23 188 299 148 -56 170 -284 83 11 -60 -1 -255 158 -296 -308 33 47 -8
4960 -8 113 75 80 98 -2 42 264 -62 -49 287 -30 -104 -134 -53 -234 306 221 125 -40 272 -103 94 -202 163
4984 163 281 -201 290 -245 8 110 104 -150 -63 2 144 202 -111 104 7 9 52 91 25 -167 55 -149 23 -105
5008 -105 -12 77 258 89 -112 -154 103 -68 3 -233 -55 80 -124 388 213 -167 6 188 -72 -99 18 -258
5030 -258 -18 170 41 54 32 -184 106 184 62 91 57 147 110 31 397 37 151 -9 88 -41 -141 146 2
5053 2 118 142 137 -54 -115 -123 82 -102 137 58 404 282 -108 184 61 111 -1 -2 10 -45 -109 3 -17 171 -136
5078 -136 -220 -196 10 59 54 88 134 19 -110 -70 65 96 112 441 -104 -58 -143 231 -69 137 -26 122 -27 -45
$$ packed form
4913a65J2L85Mj71k6o6R7l10M08q3m1Q6k37J01J09k86P0L24j65n1k63K88P8k47
4937a49J43Q0J38k53L2j4K11J11j51k04K26m54L67p2p1N9k54M13m54j2L41J4n5
4960hJ21l8NJ8j00M4K22l26J3L36l17p4l0Q1j81N40q5r6j65L12l75J97k96L65
4984A63J18m82M91n35K53J02ok54Q7O5J42N8l13K15r7KM3L9o6j92K22k04J72j28
5008a05R3Q9J81j69k01m2K57j71P1k36J78J35k04N12j75l80J73J82k60k7J17k76
5030b58K40J88j29J3k2k16K90P8j22K9l4R0l7p9L66l60J14j60R7j29j00K87j44
5053BJ16K4nj91o1qK05j84K39p9L46j22l90K92j23N0j12jJ2n5o4J12k0J88l07
5078a36q4K4K06M9nL4M6j15j29M0J35L1J6L29n45M6q5L74l00K06j63J48j49j8
$$ plain form
5102 -45 24 -41 78 245 -249 -172 48 96 -101 103 141 99 31 -21 -249 -56 -146 -61 28 160 -7 108 -247 -55
5126 -55 -55 -77 -68 82 -284 -8 -129 79 41 -195 119 57 50 -222 23 -12 80 -57 98 48 -77 183 -207 -199 -344
5151 -344 -37 159 58 61 51 140 169 16 -159 -13 72 -217 90 9 23 15 36 -195 -57 47 -24 90 69 -256
5175 -256 14 -9 -129 -50 -21 -151 81 -195 -76 -153 207 62 -77 12 -227 177 -162 102 -96 -154 -67 -62 59
5198 59 75 -8 105 77 118 118 -15 -66 -54 166 199 141 -101 273 -27 5 -56 79 33 -263 -94 -73 175 23 60
5223 60 73 306 -35 28 -139 437 6 45 -138 -75 -158 99 43 52 160 -61 -49 30 183 203 -102 -221 175 -290
5247 -290 44 -7 5 55 -237 -98 -57 100 15 46 -68 -220 170 -45 139 90 17 -51 -53 99 95 33 11 75 194
5272 194 220 -251 20 89 170 -94 -2 -112 41 -61 -111 -187 -10 240 -157 -63 117 -152 -1 66 -18 -191 108
$$ packed form
5102d5O9o5J19J67m94P7K20M8j97K04L8m2o8n2k28J93r0Q5Q9J32j67J15l55J92
5126e5%k2RJ50l66K76j21K08l8k36L14o2pk72K45l5R2j37J55n0j25K60l90Qj45
5151c44L07J96j01Lj0Q9K9j53j75J46Q5k89L07q1J4qK1k31J38J04p1J14k1l25
5175b56K70k3j20P9K9j30K32k76J19p7L60j45j39Q9k39M04l39K64j98n8Q7NJ21
5198E9J6q3J13k8M1%j33n1J2K20L3n8k42L74l00L2o1J35m6k96J69K1K48j52L7
5223F0J3K33l41O3j67N76m31L9j83O3q3K57n6RJ08k21J2P9J53K0l05j19L96m65
5247b90L34n1J2N0k92J39M1J57q5L1j14j52L90k15J84m9p3o8kJ52mo2k2O4J19
5272A94K6m71K71O9Q1k64R2j10J53j02n0p6J77K50l97R4J80k69J51O7q4j73K99
$$ plain form
5295 108 110 -129 174 7 -113 -123 -84 84 220 -40 10 15 187 243 79 -73 -41 198 109 141 -115 103 -281 70
5319 70 147 -159 -82 264 191 -80 -104 222 184 -436 62 174 57 -45 -38 16 71 -180 -3 78 93 -24 -22 107 -128
5344 -128 -97 -142 78 37 -170 69 142 -81 -206 82 13 29 80 136 128 71 114 83 -176 -190 99 78 -107 -149 63
5369 63 81 -63 -97 42 -81 -60 180 -13 7 -6 110 1 -44 -77 224 238 293 -292 31 77 97 -132 -60 92
5393 92 -32 46 -155 -61 -76 205 7 177 -64 -58 -186 -295 -26 85 -130 37 -263 33 -179 129 44 -46 221
5416 221 174 -153 71 35 -5 63 -19 -52 -83 275 -225 230 -37 188 4 85 140 223 -10 -165 193 -25 244
5439 244 67 -79 66 -82 1 -1 -171 -21 -139 129 71 -248 9 -244 44 74 -26 -116 -331 -21 110 106 195
5462 195 -36 -86 -245 -24 -170 -57 33 -209 162 178 -111 -76 -172 174 239 -201 -227 -38 -19 2 149 -53 -104
$$ packed form
5295A08Kk39L03j67j20j0L9J68J36k60N0NJ72N6j64j52L2K39q9L2k56K18l84L51
5319G0P7l06P7L46p3k71k4L26l8o20M98J12j17j02PN4N5k51J77Q1J5j17KJ29k35
5344a28L1m5K20m1k07K39P3k23j25K88o9J6N1N6qn7M3l1k59j4K89k1j85m2K12
5369F3J8j44l4J39j23K1K40j93K0j3J16j09m5l3L01J4N5n85L23M6K0k29P2J52
5393I2j24P8k01R4j5K81j98J70k41Oj28j09K69J11k15J67l00K96k12L08q5r0K67
5416B21m7l27K24l6m0O8q2l3l1L58n00M55k67K25j84Q1N5Q3k33j55L58k18K69
5439B44j77j46J45j48Q3kj70J50j18K68n8l19K57k53K88L0j00r0k15L10J31mQ9
5462A95k31n0j59K21j46J13R0k42L71J6k89L5r6L46O5m40k6J89J9K1J47k02n1
$$ plain form
5485 -104 173 68 1 44 -143 138 189 -174 -166 209 -18 -16 -140 102 -6 -128 -37 -348 -47 -97 -129 21 -45 116
5509 116 -114 53 -10 145 -158 9 -46 51 -59 173 -13 -17 -69 -215 -73 -217 131 190 -73 63 -194 -89
5531 -89 -59 -149 17 238 -36 -119 58 248 242 -138 -58 -10 -46 122 97 -85 65 -126 86 -223 -8 21 -320 -61
5555 -61 -88 -90 41 62 162 -217 96 12 267 187 -36 -45 135 29 24 196 -161 20 180 -88 -403 -68 93 162
5579 162 12 198 0 -31 -22 -126 -61 -50 167 14 290 -208 110 154 130 139 149 210 -33 -47 145 237 -220 83
5603 83 133 -73 79 -85 116 26 48 43 123 -142 50 -147 -48 -53 -59 14 26 145 -119 64 -56 171 20 81 -44
5628 -44 -119 -66 119 -194 -18 -99 -6 -16 4 66 -72 197 217 35 -168 -155 148 61 306 148 -124 -200 94 149
5652 149 -33 -267 101 75 71 -101 17 102 76 -5 17 211 -66 143 -56 -133 -150 -27 -60 -125 88 175 175 -107 92
$$ packed form
5485a04K77j05o7M3j87K81N1l63QL75k27Kj24K42j08j22R1l11L01n0l2J50o6J61
5509A16k30J67o3J55l03J67n5R7j10K32j86mn2j46J42j44L48N9k63J36k57J05
5531h9L0r0J66K21k74q3J77J90ol80Q0M8l6J68k5j82J50j91K12l09K15K9l41K59
5555f1k7kJ31K1J00l79L13q4K55q0k23rJ80j06nJ72l57J81J60k68l15L35J61O9
5579A62j50J86j98l1Rj04O5J1K17j53K76m98L18M4k4RJ0O1k43j4J92R2m57L03
5603H3N0k06J52j64K01r0K2nQ0k65J92j97R9noP3J2J19k64J83j20K27j51O1j25
5628d4p5N3J85l13J76q1R3j0K0O2j38K69K0j82k03J3L03q7K45j58k72p6K94N5
5652A49j82k34L68k6mj72J18Q5k6q1K2J94k77K09j99p7j7J23l3o5K13Q7%k82J99
$$ plain form
5677 92 -55 -165 -113 -6 375 -143 -133 87 17 -225 -126 129 240 -28 -114 106 133 -38 234 -22 265 -116
5699 -116 -79 -147 -153 101 -50 -134 -33 207 35 -5 -42 5 230 -36 114 -166 133 -57 -123 5 11 261 47 -68
5723 -68 93 -100 -28 -61 86 79 161 6 58 53 278 -186 5 -102 224 -18 170 45 -79 154 175 244 -204 171
5747 171 -65 -259 172 143 186 -341 177 65 -231 -34 44 -50 -90 -6 -197 118 -143 -98 30 19 -10 -60 1 130
5771 130 160 -155 120 80 -73 -117 -251 205 285 3 -121 21 -30 14 59 -43 38 -73 -73 61 24 33 171 -210
5795 -210 -88 398 198 -23 -57 -72 -9 -121 185 -124 83 -265 6 133 -7 -246 50 -32 322 331 21 247
5817 247 -48 -245 270 90 -66 -41 -97 182 19 33 122 -72 129 294 180 -26 148 -222 123 -176 273
5838 273 137 51 9 -321 -59 -137 -47 112 70 17 -279 -316 40 133 -46 -237 -66 245 1 -54 60 -71 -143
$$ packed form
5677I2j47j10N2J07L81n18J0K20p0k42R9K55J11k68q6K20K7j71K72k56K87l81
5699a16L7o8oK54j51q4J01K40j72m0l7M7K25k66J50k80K99j90o6J28OK50k14j15
5723f8J61j93P2l3J47pQ2j55N2nK25m64J91j07L26k42J88j25j24K33K1O9m48L75
5747A71k36j94M31k9M3n27N18j12k96J97P8r4m0Q4j91L15k61M5J28j1k9n0O1J29
5771A30L0l15K75m0j53m4j34M56Q0k82j24J42n1M4M5j02Q1j11%J34l7RJ38l81
5795b10J22M86k00k21l4j5O3j12L06l09K07l48K71J27j40k39K96q2L54Rl10K26
5817B47k95j97N15j80j56K5n6K79j63J4Q9j94K01J65j14k06J74l70L45k99M49
5838B73j36q6m2l30K62p8R0J59m2n3k96l7L56R3j79j91J71L11k44n5J14j31p2
$$ plain form
5861 -143 -196 29 110 249 -21 90 -307 35 -18 -98 -9 182 95 -126 51 119 152 -403 -198 -203 21 -10 54 -173
5885 -173 -138 249 69 127 140 -18 -32 15 -23 6 10 14 -193 179 -71 138 285 -211 -64 -181 201 -28 230 -74
5909 -74 49 -41 101 -9 -201 52 34 -12 298 -11 123 -208 -139 79 142 -277 13 163 -83 74 -62 138
5931 138 -72 157 28 65 -205 177 -230 236 -9 1 -66 -116 -58 230 -35 -276 -68 63 -242 -78 278 28
$$ packed form
5861a43n3K25Q1J39k70J11l97L42n3q0Q9J91q7k21J77O8L3n55K05nK24l1O4k27
5885a73L5L87j80N8J3j58j4M7l8K9MMk07L72k50K09J47m96J47j17L82k29K58l04
5909g4J23r0J42j10j92K53j8m6L10l09J34l31O9K18O3m19K90J50k46J57j36K00
5931A38k10K29j29L7k70L82m07M66k45J0o7n0N8K88k65k41K08J31l05J64L56k50
$$ [...]
8191g0
##END NTUPLES=NMR FID
##END=
