##TITLE=1H_DE-LeuOEt
 200.13MHz, D2O,
 8 sc
 
 7.5.2025
##JCAMPDX= 6.0         $$ Bruker NMR JCAMP-DX V2.0
##DATA TYPE= NMR FID
##DATA CLASS= NTUPLES
##ORIGIN= UXNMR, Bruker Analytische Messtechnik GmbH
##OWNER= pz
$$ XWIN-NMR		Version 3.5
$$ Wed May  7 13:48:37 2025 Russian Standard Time (UT+4h)  she@DPX200
##.OBSERVE FREQUENCY= 200.1313
##.OBSERVE NUCLEUS= ^1H
##.DELAY= (6, 6)
##.ACQUISITION MODE= SIMULTANEOUS
##.ACQUISITION SCHEME= undefined
##.AVERAGES= 8
##.DIGITISER RES= 18
##SPECTROMETER/DATA SYSTEM= spect
##.PULSE SEQUENCE= zg30
##.SOLVENT NAME= DMSO
##.SHIFT REFERENCE= (INTERNAL, DMSO, 0, 14.3821)
##AUDIT TRAIL= $$ (NUMBER, WHEN, WHO, WHERE, WHAT)
$$ ##TITLE= Audit trail, XWIN-NMR		Version 3.5
$$ ##JCAMPDX= 5.01
$$ ##ORIGIN= Bruker BioSpin GmbH
$$ ##OWNER= she
$$ F:/spectra/data/she/nmr/H-C/1/audita.txt
$$ ##AUDIT TRAIL=  $$ (NUMBER, WHEN, WHO, WHERE, WHAT)
(   1,<2025-05-07 13:47:27.95 +0400>,<she>,<DPX200>,
      <created by zg, POWCHK disabled, PULCHK disabled
       configuration hash MD5:
       00 E9 B6 7A A2 85 ED C7 34 08 36 98 17 FE 4E 26
       data hash MD5: 16K
       FD 2F A0 4F 69 57 FA 88 92 5F F1 88 69 7D 86 71>)
$$ ##END=
$$ 
$$ hash MD5
$$ C1 46 9A 47 26 B9 4B 29 63 27 E1 AD 31 7E 1E 91
##$RELAX= 
##$RELAX= 
##$RELAX= 
##$RELAX= 
##$RELAX= 
##$RELAX= 
$$ Bruker specific parameters
$$ --------------------------
##$DU= <F:/spectra>
##$EXPNO= 1
##$NAME= <H-C>
##$PROCNO= 1
##$TYPE= <nmr>
##$USER= <she>
##$AMP= (0..31)
100 100 100 100 100 100 100 100 100 100 100 100 100 100 100 100 100 100 
100 100 100 100 100 100 100 100 100 100 100 100 100 100 
##$AQSEQ= 0
##$AQ_mod= 1
##$AUNM= <au_zg>
##$AUTOPOS= <>
##$BF1= 200.13
##$BF2= 200.13
##$BF3= 200.13
##$BF4= 200.13
##$BF5= 200.13
##$BF6= 200.13
##$BF7= 200.13
##$BF8= 200.13
##$BYTORDA= 1
##$CFDGTYP= 0
##$CFRGTYP= 5
##$CHEMSTR= <none>
##$CNST= (0..31)
1 1 145 1 1 1 1 1 1 1 1 1 1 1 1 1 1 1 1 1 1 1 1 1 1 1 1 1 1 1 1 1 
##$CPDPRG= <>
##$CPDPRG1= <>
##$CPDPRG2= <>
##$CPDPRG3= <>
##$CPDPRG4= <mlev>
##$CPDPRG5= <mlev>
##$CPDPRG6= <mlev>
##$CPDPRG7= <mlev>
##$CPDPRG8= <mlev>
##$CPDPRGB= <>
##$CPDPRGT= <>
##$D= (0..31)
0 0.7 0 0 0 0 0 0 0 0 0 0.03 0 0 0 0 0 0 0 0 0 0 0 0 0 0 0 0 0 0 0 0 
##$DATE= 1746611247
##$DBL= (0..7)
120 120 120 120 120 120 120 120 
##$DBP= (0..7)
150 150 150 150 150 150 150 150 
##$DBP07= 0
##$DBPNAM0= <>
##$DBPNAM1= <>
##$DBPNAM2= <>
##$DBPNAM3= <>
##$DBPNAM4= <>
##$DBPNAM5= <>
##$DBPNAM6= <>
##$DBPNAM7= <>
##$DBPOAL= (0..7)
0.5 0.5 0.5 0.5 0.5 0.5 0.5 0.5 
##$DBPOFFS= (0..7)
0 0 0 0 0 0 0 0 
##$DE= 6
##$DECBNUC= <off>
##$DECIM= 32
##$DECNUC= <off>
##$DECSTAT= 4
##$DIGMOD= 1
##$DIGTYP= 9
##$DL= (0..7)
0 120 120 120 120 120 120 120 
##$DP= (0..7)
150 150 150 150 150 150 150 150 
##$DP07= 0
##$DPNAME0= <>
##$DPNAME1= <>
##$DPNAME2= <>
##$DPNAME3= <>
##$DPNAME4= <>
##$DPNAME5= <>
##$DPNAME6= <>
##$DPNAME7= <>
##$DPOAL= (0..7)
0.5 0.5 0.5 0.5 0.5 0.5 0.5 0.5 
##$DPOFFS= (0..7)
0 0 0 0 0 0 0 0 
##$DQDMODE= 0
##$DR= 18
##$DS= 0
##$DSLIST= <SSSSSSSSSSSSSSS>
$$ [...]
##$SUBNAM0= <"">
##$SUBNAM1= <"">
##$SUBNAM2= <"">
##$SUBNAM3= <"">
##$SUBNAM4= <"">
##$SUBNAM5= <"">
##$SUBNAM6= <"">
##$SUBNAM7= <"">
##$SUBNAM8= <"">
##$SUBNAM9= <"">
##$SW= 18.0517328524113
##$SWIBOX= (0..15)
0 0 2 0 0 0 0 0 0 0 0 0 0 0 0 0 
##$SW_h= 3612.71676300578
##$TD= 16384
##$TD0= 1
##$TE= 0
##$TE2= 300
##$TE3= 300
##$TEG= 300
##$TL= (0..7)
0 120 120 120 120 120 120 120 
##$TP= (0..7)
150 150 150 150 150 150 150 150 
##$TP07= 0
##$TPNAME0= <>
##$TPNAME1= <>
##$TPNAME2= <>
##$TPNAME3= <>
##$TPNAME4= <>
##$TPNAME5= <>
##$TPNAME6= <>
##$TPNAME7= <>
##$TPOAL= (0..7)
0.5 0.5 0.5 0.5 0.5 0.5 0.5 0.5 
##$TPOFFS= (0..7)
0 0 0 0 0 0 0 0 
##$TUNHIN= 0
##$TUNHOUT= 0
##$TUNXOUT= 0
##$USERA1= <user>
##$USERA2= <user>
##$USERA3= <user>
##$USERA4= <user>
##$USERA5= <user>
##$V9= 5
##$VALIST= <valist>
##$VCLIST= <CCCCCCCCCCCCCCC>
##$VD= 0
##$VDLIST= <DDDDDDDDDDDDDDD>
##$VPLIST= <PPPPPPPPPPPPPPP>
##$VTLIST= <TTTTTTTTTTTTTTT>
##$WBST= 1024
##$WBSW= 4
##$XGAIN= (0..3)
0 0 0 0 
##$XL= 0
##$YL= 0
##$YMAX_a= 132101
##$YMIN_a= -149429
##$ZGOPTNS= <>
##$ZL1= 120
##$ZL2= 120
##$ZL3= 120
##$ZL4= 120
##$ABSF1= 10
##$ABSF2= 0
##$ABSG= 5
##$ABSL= 3
##$ALPHA= 0
##$AQORDER= 0
##$ASSFAC= 0
##$ASSFACI= 0
##$ASSFACX= 0
##$ASSWID= 0
##$AUNMP= <proc_1d>
##$AZFE= 0.1
##$AZFW= 0.1
##$BCFW= 1
##$BC_mod= 2
##$BYTORDP= 1
##$COROFFS= 0
##$CY= -3
##$DATMOD= 1
##$DC= 2
##$DFILT= <>
##$DTYPP= 0
##$F1P= 0
##$F2P= 0
##$FCOR= 0.5
##$FTSIZE= 0
##$FT_mod= 4
##$GAMMA= 1
##$GB= 0.15
##$INTBC= 1
##$INTSCL= 1
##$ISEN= 128
##$LB= 0.25
##$LEV0= 0
##$LPBIN= 0
##$MAXI= 10000
##$MC2= 0
##$MEAN= 0
##$ME_mod= 0
##$MI= 1.114404
##$NCOEF= 0
##$NC_proc= 0
##$NLEV= 6
##$NOISF1= 3.799351
##$NOISF2= 2.8
##$NSP= 1
##$NTH_PI= 0
##$NZP= 0
##$OFFSET= 14.38212
##$PC= 1
##$PHC0= -1551.009
##$PHC1= 9.39221
##$PH_mod= 1
##$PKNL= yes
##$PPARMOD= 0
##$PSCAL= 0
##$PSIGN= 0
##$REVERSE= no
##$SF= 200.129724274929
##$SI= 16384
##$SIGF1= 3
##$SIGF2= 2
##$SINO= 400
##$SIOLD= 16384
##$SREGLST= <1H.CDCl3>
##$SSB= 0
##$STSI= 0
##$STSR= 0
##$SW_p= 3205.1282051282
##$SYMM= 0
##$S_DEV= 0
##$TDeff= 0
##$TDoff= 0
##$TI= <>
##$TILT= no
##$TM1= 0
##$TM2= 0
##$TOPLEV= 0
##$USERP1= <user>
##$USERP2= <user>
##$USERP3= <user>
##$USERP4= <user>
##$USERP5= <user>
##$WDW= 1
##$XDIM= 8192
##$YMAX_p= 0
##$YMIN_p= 0
$$ End of Bruker specific parameters
$$ ---------------------------------
##NTUPLES= NMR FID
##VAR_NAME=  TIME,          FID/REAL,        FID/IMAG
##SYMBOL=    X,             R,               I
##VAR_TYPE=  INDEPENDENT,   DEPENDENT,       DEPENDENT
##VAR_FORM=  AFFN,          ASDF,            ASDF
##VAR_DIM=   8192,          8192,            8192
##UNITS=     SECONDS,       ARBITRARY UNITS, ARBITRARY UNITS
##FACTOR=    0.0002768,     1,               1
##FIRST=     0,             0,               0
##LAST=      2.2672688,     0,               0
##MIN=       0,             -149429,         0
##MAX=       2.2672688,     132101,          0
$$ Real data points
##PAGE= N=1
##DATA TABLE= (X++(R..R)), XYDATA
0@%%%%%%%%%%%%%%%%%%Nj3J6j6J6j6J6k1K9l2L4l9M5n2N9o7P4q3R5j04J15j30
40f9J44j58J75j94K16k38K60k86L15l46L81m21M64n11N64o29P02p83Q83j001J144
61F12j324J557j871K315k990M120o314J2001n2522j05013J48941m611r3842J40713
75D1772Q1884j24459K698M9036r1503j7186O4940l6882K812O2923l8035n653P9263
88G1610m1342o2537N2841k7380q7697N6712O4177k7844L5980M5729n1929l7078
100h758j5179l9750K2378L6347j5865N2846N3596p9634k1004O5084p6839o7223
112i4001J04456O612q2594Q9030O3725r9888J2380O4975r6254l5908Q0030l9809
124b7246k9441J02667p06n7293O5942o207j05754K7698L6501p5964L2787R8869
$$ plain form
0 0 0 0 0 0 0 0 0 0 0 0 0 0 0 0 0 0 0 0 5 -8 8 -8 8 -8 8 -13 16 -16 18 -21 24 -28 31 -36 38 -45 50 -54 61 -69
40 -69 75 -83 92 -102 114 -124 136 -150 165 -181 200 -221 243 -268 296 -333 369 -414 469 -532 612
61 612 -712 845 -1026 1289 -1701 2419 -3895 8106 -44416 -149429 -488 -5099 -98941 41772
75 41772 123656 -803 1895 50931 -40572 -57758 7182 -29700 -26888 36035 -2000 -7653 71610
88 71610 30268 -32269 20572 -6808 -94505 -37793 26384 -1460 34520 80249 28320 -8758
100 -8758 -23937 -63687 -41309 -4962 -20827 32019 85615 5981 -15023 50061 -26778 -94001
112 -94001 10455 17067 -65527 23503 87228 -12660 -280 64695 -31559 -67467 12563 -27246
124 -27246 -56687 45980 45274 -12019 53923 47716 -58038 -30340 6161 -69803 -37016 61853
136F1853l7136j7694O1521m9644p4056L3291R7l0695N3720L5020k1318J8109j173
149C1895m4233M251J065l6137K3766K8206k9123K7714M7915l9707j1930L2360
161C6042n8985m3207N3629k278j9580P9401K1448o3587J7261L492q4388Q926O2196
174A0370l5447R192P8459l3323m5133N1065k0968o7815M0810K0012n4458L4930
186a2306N5895l5865M391M0018m8618l9120K5134j9631j5545N4274J8379j3304
198A3702K6813q467m8424J245m95k7847K4877L3198j2393J7185K4340l4522j4063
211d851J2474l5635j3978L8806l279m754M9132J87l8620J6248o538n3534J3418
224c0924L2138k3869J8398M9870k3193j9381K5451l0764m0178K7528L760k0001
$$ plain form
136 61853 24717 7023 68544 18900 -55156 -21865 -21768 -52463 1257 36277 14959 33068 31895
149 31895 -12338 -8087 -7022 -43159 -19393 8813 -20310 7404 55319 15612 3682 36042
161 36042 -22943 -66150 -12521 -14799 -34379 45022 66470 2883 20144 23636 -60752 -51826 10370
174 10370 -25077 -15885 62574 29251 -15882 35183 14215 -53600 -12790 7222 -47236 -12306
186 -12306 43589 7724 12115 52133 3515 -35605 -10471 -30102 -45647 8627 27006 13702
198 13702 40515 32048 -16376 -15131 -15626 -43473 -18596 14602 2209 19394 43734 9212 -4851
211 -4851 7623 -28012 -41990 -3184 -6463 -11217 37915 38102 -518 15730 9192 -44342 -30924
224 -30924 1214 -22655 -4257 45613 22420 3039 28490 -2274 -42452 -14924 -11164 -31165
236c1165M1446K7209k6599Q710J0064m6154j3798K1580j7080J394M3245K513j0951
249A0414K0001j2889l4024M967l123j9236K2915K2505o787J7243J3238k9167j2579
262f522M446k6358n574L1370L910K007K9405m587k6716L189j0410k8090J2490
275b1440J8186p217J9281K4617j7506q830P289k6718j9349J8601N28k360L0391
288A5473J2138j5063M984n156l0335m049R050q759J2669K7708k335j680J0116
301B4761j8673k2573M412n625p573K1865J6401k820J1298K807k2830j0322j142
314a0014j4383K614K1662N160N401J5215o827j8037j883j0330j5083J0446J2475
327c584K296J5323J1667j1623p635l846j8404q160J0831M221O507J9545M523q872
$$ plain form
236 -31165 10281 37490 10891 19601 29665 -16489 -30287 -8707 -25787 -24393 18852 21365 10414
249 10414 30415 17526 -16498 -11531 -14654 -33890 -10975 11530 4743 21986 35224 6057 -6522
262 -6522 -2076 -28434 -34008 -2638 1272 3279 32684 28097 1381 4570 -5840 -33930 -21440
275 -21440 -3254 -10471 8810 33427 15921 7091 14380 -12338 -31687 -13086 -12558 -14918 15473
288 15473 27611 12548 17532 12376 -17959 -22008 -12958 -21717 -9048 18660 16325 14645 24761
301 24761 6088 -16485 -12073 -17698 -25271 -3406 12995 10175 21473 24280 1450 -8872 -10014
314 -10014 -24397 -21783 -121 5039 10440 25655 18828 791 -1092 -11422 -26505 -16059 -3584
327 -3584 -1288 14035 25702 14079 6444 2598 -15806 -23966 -13135 -8914 -2407 17138 21661 12789
341A2789j814r438j8388j876M939P98J2829J5696Q12p87j020j5504j3665J72k372
356a6829J491J6745J2165J069K673k908j4962j0920l643k704N278J2165R148P242
370A6010K653p883r275p499j0385l330R172Q537O618J1937L827r435q154p627
384d834j1348k832P707P477R681J0377O18n754n632j0939j0844J226M810K933
398g354J0719J2768q42n096j719r828j4520j620O770K798Q006J5492L922q201
412A1295n110p128j3799m562P730O629O501J1674M023o241n692o577j0060l791
426a5108M895K826O654J1734L293l531j069o500j3791n832M241K094N922J4988
440A0816Q061n094o101n044j2459r854N089R720M409Q151J0754m219j1628k067
$$ plain form
341 12789 10975 1537 -16851 -18727 -13788 -12990 -161 15535 16347 15560 14540 -964 -14629 -14457 -16829
356 -16829 -15338 1407 13572 14641 17314 14406 -556 -11476 -15119 -17823 -12545 -380 8768 16010
370 16010 18663 10780 1505 -5994 -16379 -19709 -10537 -2000 4618 16555 20382 10947 2793 -4834
384 -4834 -16182 -19014 -11307 -3830 5851 16228 16846 11092 5460 -5479 -16323 -15097 -10287 -7354
398 -7354 3365 16133 15291 10195 8476 -1352 -15872 -17492 -10722 -7924 82 15574 19496 11295
412 11295 6185 -943 -14742 -19304 -11574 -4945 1556 13230 17253 11012 5320 -1257 -11317 -15108
426 -15108 -10213 -7387 -733 11001 14294 10763 9694 3194 -10597 -16429 -12188 -10094 -4172 10816
440 10816 18877 13783 7682 2638 -9821 -19675 -14586 -4866 -457 7694 18448 14229 2601 534
454E34n045j1623K762J0341N40M557J2808j204r320J361o435j6117K088R191k119
469g681Q274J8686l439j0423K370r491j8794M346J1292j489R128J6870m347j1240
483D062N11p881j3861L945Q963K20N893J1423j086p321n76l574j0496l354N282
498g850K566J985J1270Q779n693o255j178j1722j2965P454J1399N25J1154J3480
512B2949j0640j3359M07r240j1571J3390J2021m860Q844J0273j4548o743R138
525F061r901j2503J2587K970j0517J2869J6791r922m041P628j4976j8580P491
538a4043Q614j448J3691J4989o757j1379m089q564q770N415J1023M754L118N008
552A1562k235q131k770L62o070k670O466O28p13J1938O584r081j413Q97j7439
$$ plain form
454 534 -4511 -16134 -13372 -3031 -2491 2066 14874 13670 4350 5711 -724 -16841 -14753 -5562 -7681
469 -7681 593 19279 15840 5417 7787 -1704 -20498 -16152 -4860 -6349 2779 19649 15302 4062
483 4062 4573 -3308 -17169 -13224 -4261 -4041 1852 13275 12189 4868 4292 718 -9778 -13132 -7850
498 -7850 -5284 -3299 7971 16750 11057 4802 3624 -8098 -21063 -13609 -2210 -1685 9469 22949
512 22949 12309 -1050 -643 -9883 -21454 -8064 3957 -903 7941 18214 3666 -3077 6061
525 6061 -3840 -16343 -3756 -786 -11303 1566 18357 8435 4394 12022 -2954 -21534 -14043
538 -14043 -5429 -6877 6814 21803 15046 3667 -422 -8986 -17756 -12341 -1318 3436 6554 11562
552 11562 9327 1196 -1574 -1212 -7282 -9952 -3486 -2858 -3571 8367 14951 5870 4457 5354 -12085
567a2085q641J4467M611k561J8646Q455j9207n520M434j6622p178J9607N431n818
581a981J3332O023j6943k534M917j2010m893J2075J117k925J1653M861q253j68
595D271N56j1879o269N716K323J295J1459P847m610o352k908q758r371M449J0806
610a425L494M432R431m135j3819j980M54r642K798J3788j000k648J0490L34j2122
625a550K589K486j3859k088J0658k292J064J6412J563j1274J97m237j6140J067
639a5404J3194Q91M451J3158l234j3060j050k154r353K418J0602M08q0P085J215
654I087o234j737j86o523m887L126N071K359N759O816k932p685m172n169o162
669a3469M391Q820K980M720N736n995q393m96m638o202O405Q068j891M052Q764
$$ plain form
567 -12085 -20726 -6259 -1648 -4209 14437 22892 3685 -1835 2599 -14023 -21201 -1594 3837 -1981
581 -1981 11351 17374 431 -2103 2814 -9196 -14089 -2014 -897 -3822 7831 12692 4439 4271
595 4271 4827 -7052 -13321 -7605 -5282 -3987 7472 15319 10709 4357 1449 -7309 -16680 -12231 -1425
610 -1425 2069 6501 15932 11797 -2022 -4002 -3548 -13190 -10392 3396 2396 -252 10238 10572 -1550
625 -1550 1039 3525 -10334 -12422 -1764 -4056 -2992 13420 14983 3709 3906 -331 -16471 -15404
639 -15404 -2210 -1319 3132 16290 13056 -4 -1054 -3208 -12561 -10143 459 867 787 7872 9087
654 9087 2853 1116 930 -5593 -10480 -7354 -2283 76 5835 12651 9719 2034 -2138 -7307 -13469
669 -13469 -9078 -258 2722 7442 13178 7183 -1210 -1706 -6344 -12546 -6141 1927 36 4088 12852
684A2852o346q231K895l940r532M192Q103r32L755Q591k387p186j413m375o631
699a0585J512N828L049N968M465k089m368m009n344m758K424M576L411N159M223
714I462j475n256l573k557m723n03N078M250J788M173L076m967n319j732m175
729f453l811M358O155K190M360L586m522n855l270m084k610M989N060K421M556
744G070K140m467m423k209m334k523L655M066K596M186K637k557l862l531m537
759f093k054K058L614M238M982J675k205l775m119m491k055K289L592L780L925
774E361K774j239m389l904l171l121L65M579M337L079K159L01l862n090l054j571
790f446k98K911M623M054J693J39k764l942m613k591O50K448L727M007L541pl593
$$ plain form
684 12852 6506 -1725 1170 -2770 -12302 -8110 -7 -939 2816 11407 9020 1834 421 -3954 -10585
699 -10585 -9073 -3245 -196 5772 10237 8148 3780 -229 -5573 -10331 -7907 -3331 80 5239 9462
714 9462 7987 2731 -842 -3399 -8122 -8625 -3547 703 2491 6664 9740 4773 -546 -2278 -6453
729 -6453 -10264 -5906 249 2439 6799 10385 5863 8 -3262 -7346 -9956 -4967 93 2514 7070
744 7070 9210 4743 320 -1889 -6223 -8746 -5091 -1025 1571 5757 8394 5837 1975 -1556 -6093
759 -6093 -8147 -6089 -2475 1763 6745 8420 6215 2440 -1679 -6170 -8225 -5936 -2344 1436 5361
774 5361 8135 6896 2507 -1397 -4568 -7689 -7324 -2745 1592 4671 6830 7131 3269 -1821 -4875 -6446
790 -6446 -6744 -3833 790 4844 6537 6676 3912 -30 -4643 -7234 -6584 -4136 -409 3598 7139 7132 3539
807C539l619l689l105o09L436M027L623K436Q08k959l634l053l204r07K062L930
823i18L764L240O66j785l510m190l835j40K228L096M229L112L79j714k892m141
839b411l116n01J150K953M054L101J086q41l323m216k725j564P37L023M475L363
855E245J200q57l418m206k469j915J118L364L402K362K167l40l579k997k319l112
871f354K83L679L557K204K859J72l520l310l154k404j85L066L837L103K208k52
887E789k923l455k761k099L23K179K638L283K389M15k408k979k825k788r76K081
903d117M038K681K163J528k036m404k256j887k023J851M505K400J421K417j797
918D484m342k422j456k258J367M440K620J399K238j430m083k445j603k310J349
$$ plain form
807 3539 -80 -3769 -6874 -7483 -4047 -20 3603 6039 6847 3888 254 -2799 -6003 -6910 -4848 -918
823 -918 2846 6086 6752 4967 1457 -2733 -6568 -6708 -4480 -1384 2845 5957 6336 4622 1730 -2411
839 -2411 -5527 -6028 -4878 -1925 2129 5230 6316 5475 2152 -2064 -4789 -6353 -5616 -2593 1882 5245
855 5245 6445 5588 2170 -2036 -4505 -6420 -5302 -1938 1464 3826 5993 5653 2074 -923 -3242 -6354
871 -6354 -6071 -2392 1165 3369 6228 6400 2880 -430 -3584 -5988 -6173 -3107 730 3833 6041 5789
887 5789 2866 -589 -3350 -5449 -5126 -2947 -309 2974 5363 5778 3370 391 -2434 -5222 -6198 -4117
903 -4117 -79 2602 4765 6293 4257 -147 -2403 -4290 -6313 -4462 43 2443 3864 6281 4484
918 4484 142 -2280 -3736 -5994 -4627 -187 2433 3832 6070 4640 557 -1888 -3491 -5801 -4452
933d452L720K150J599K478o71l678j911j725l204M67L846K657J354L101K65m183
949A813l616j148k560m76M708L527Q04K151K69m239l581l8j810j100L357L539
965A600q1J972K289l139l667R4k520l039L235L991R44K526K860l406m902j221
981b464j942k372L454N040J037J141J836k958n024l91P5k400K111M267J64nL367
998D936j079m485k67l12m167NN102J589L87M190M8n848k313j95l866N28O227K784
1016C264l70K234r7n922k406J130k003j43M994J516j175K109J411l824j704M10
1032e76k868j900L414L078k68L083K577l864m502n0j971l071L914N526J04J034
1048C660K445l765n985O04L52k595K980N503j228q22L599k440m572J066K56l981
$$ plain form
933 -4452 -732 1418 3017 5495 4824 1146 -765 -2490 -5694 -5227 -1381 1276 2630 5731 5996 1813
949 1813 -1803 -2951 -5511 -5987 -1279 2248 3052 5203 5472 1233 -2348 -2386 -4196 -5296 -1939 1600
965 1600 1519 3491 5780 2641 -1026 -932 -3452 -6491 -3256 735 1679 4205 7065 3659 -1243 -2464
981 -2464 -4406 -6778 -3324 1716 2753 3894 5730 2772 -2252 -2643 -2568 -4968 -2857 1410 1574 1569 4936
998 4936 3857 -628 -895 -1207 -5374 -5369 -267 1322 1709 5899 5947 99 -2214 -2409 -6275 -5747 480 3264
1016 3264 2894 5128 5031 -891 -3297 -2167 -4170 -4313 681 2197 1022 3131 4542 718 -986 -576
1032 -576 -3444 -5344 -1930 1148 880 3963 6540 2676 -1826 -1876 -3847 -6918 -3004 2522 2626 3660
1048 3660 6105 2340 -3645 -3041 -2689 -5284 -2304 3199 1971 1149 4748 2308 -2264 -1198 -942 -4923
1064d923J944M463r25O56M396j526m513l7j419m626J894N321J138J306L179j747
1080D581n830j487n7k359J554N176J924j374J031L65m224j812J491j004j753K889
1096h89K747j367J804K839l122l514P55k382l018L798M598n26K165K591n036m779
1112c336J161j541k474N779L988j927O24K373m799k876K270q81k449K581K788
1127A281j215J947K318j804k680o80j652k043J639K842J659J658J299j521l570
1142e22k120m85r15R85L917K166p11R01P8m641j812K253j721j053M373J837j952
1159E78K020J890m558k067K059k725j690M107K292j006K610J217m642j718J55
1174a478k914J26M233J670J66K545o10l708j584k85j308K6L035J237M34J235l97
$$ plain form
1064 -4923 -2979 1484 559 1215 5611 4085 -428 -465 -1884 -6510 -4616 705 1843 3149 6328 4581
1080 4581 -1249 -2736 -2793 -5152 -3598 1578 3502 2128 3159 3524 -700 -2512 -1021 -2025 -3778 -889
1096 -889 1858 491 2295 5134 2012 -1502 -747 -3129 -6147 -2349 2249 1723 3888 6479 1443 -3336
1112 -3336 -2175 -3716 -6190 -411 3577 1650 2274 4647 -152 -3028 -758 -1639 -4088 -1507 1281
1127 1281 66 2013 4331 2527 -153 -833 -2485 -4528 -2889 -47 1612 3270 4569 3048 -522
1142 -522 -2642 -3127 -4042 -3057 860 3026 2315 3216 3294 -1347 -3159 -906 -2627 -3680 693 2530 578
1159 578 2598 4488 -70 -2137 -78 -2803 -4493 -386 1906 900 3510 4727 85 -1633 -1478
1174 -1478 -4392 -4266 -33 1637 1803 4348 3738 30 -1554 -1839 -3147 -3121 -86 1151 1585 2820 2423
1191B423j487j229j559o72l8K42K422K278L6L45L75l393k449L07q74K22M005J949
1209B903o87R06R5m614j120J009j778M93M157P14q07J924n40l482m99j37k331
1226c794J236L196R9J024K153j500k484m95j590j847K035J976O89J410J364j614
1242A858j363j207j766m07J063Q24J744K133l43p18l51k273k281Q59L83j34L176
1259A197J503j060N76m37k869j514N20q80J019K967O19K43J634j844k919l39o11
1276b195j525K405K572j04J390J043k548k121K02j441r26K212J256O53J761O14
1292C248j982r02j097k390O11J394J32K070K058p45j188m61k116j956J219N87
1308a518O07K387J239r18O5n25k765n61l7n56J278K685M48P0J074k068k307l32
$$ plain form
1191 2423 936 -293 -1852 -2524 -2562 -2320 102 2380 2416 2761 3136 -257 -2706 -2399 -3273 -3051 954 2903
1209 2903 2216 3122 3217 -1397 -2517 -1508 -3286 -2793 1364 2078 1271 3195 2655 -827 -1326 -1463 -3794
1226 -3794 -2558 638 737 1761 3914 2414 -70 -565 -2155 -4002 -1967 9 698 2108 3472 1858
1242 1858 495 -712 -2478 -2885 -1822 -998 746 2879 2536 1818 1467 -806 -3087 -2228 -1845 -1979 1197
1259 1197 2700 1640 2216 1779 -1090 -2604 -2084 -2964 -1945 1022 1641 1884 3518 1674 -1245 -1584 -2195
1276 -2195 -3720 -1315 1257 1153 2543 3586 1038 -1083 -881 -2322 -3248 -1036 220 873 2634 3248
1292 3248 1266 364 -733 -3123 -2512 -1118 -986 1084 3142 2397 1209 748 -1368 -3324 -2105 -1518
1308 -1518 -911 1476 2715 1797 1862 1337 -1428 -1989 -2026 -2582 -1304 1381 1829 1899 2973 905 -1402 -1734
1326a734l38q05K310J977J01O45K86j998j765J25j157k18K171Q65O95J910o43
1343B427j640j126r75j708Q68J706N4J865J770j053j393m88k055j147J258N52
1359a085R73J674R73n61m04j183k038m26L13n27J764K315L40r3L60k217k144L9
1377a927p1k19K446J463j24P29k19k212j002o2j168j09K432J070K23J368m24k080
1395A14p98p92j237Q00J908R24P97Q79q76j105r58j565m94R68O23R61J708J56
1413B013n17m05j347j463m48K90K43K067J378J56L19q54k329j237O53p24M67K790
1431A052P00m95P94l23k407q69K37p28j4K441N77M65J089l18k249j028n46j101
1449b723P78J872J427N11M62k01k317q53n47m51M97J736J224j87L37J67q93j938
$$ plain form
1326 -1734 -2072 -2877 -567 1410 1511 2156 2442 444 -1321 -1196 -2353 -2571 -400 465 1160 3070 2427
1343 2427 787 -339 -1314 -3022 -2154 -448 -394 1471 3241 2188 795 307 -1748 -2895 -1637 -1085
1359 -1085 -112 1562 2535 1974 1570 387 -1651 -2077 -1764 -2291 -527 1788 2128 2035 2395 178 -1966 -1927
1377 -1927 -1998 -2217 229 1692 1568 2297 2078 -134 -1136 -1198 -2366 -2475 -43 1027 1250 2618 2194 114
1395 114 -684 -1476 -2713 -1913 -5 919 1716 2595 1719 614 -344 -1909 -2403 -1435 -812 149 1857 2013
1413 2013 1496 1091 -256 -1719 -2167 -1877 -1634 433 1811 1967 2286 1432 -897 -2134 -1481 -2205 -1738 1052
1431 1052 1752 1257 2051 1728 -679 -1548 -1311 -2039 -2053 388 965 1430 2519 2201 -48 -1076 -1622 -2723
1449 -2723 -1945 -73 1354 1865 2327 2126 -191 -1044 -1591 -2042 -1545 191 1415 1228 1565 1732 839 -1099
1467a099l36j35n71J155K004K59M47O95j120k437Q1j95j241J241K738K74j84R43
1485B519j203l002P5k0n69J424J936N79m57P33q66k503RL67r41P58K112J64j25
1504I90J112k34k394n94J50j268J59K231J189P7P92J19k658j552M96n90j5K472
1522D82J450m85K34r1j973j588Q85j62o43J951J174n82K79J020j495j534M03n91
1540a266j226J312K028L46N98R47j569k707K43l98r66J902K576j95k89P04j372
1557F68k784N17Q15p02O49K098o0m85J165m05k102l22L81j445o3K610M37P1J510
1576B553n59k561j006L59j262N19K840R96l90M76l45k464j387J083m1j12J954
1593F53J061j064L28N25j453j069N43o58j133J699J741j65M40R80j470k544M51
$$ plain form
1467 -1099 -1435 -1570 -2141 -986 1018 1277 1724 2419 1299 -1138 -1057 -1252 -2493 -1252 1486 1760 1576 2519
1485 2519 1316 -1686 -1611 -1631 -2200 -776 1160 1739 1282 2015 1149 -1354 -1345 -978 -1919 -1161 951 1115 990
1504 990 2102 1868 -526 -1120 -970 -2238 -2079 152 1341 1418 2210 2329 -329 -1881 -1385 -1975 -1990 482
1522 482 1932 1447 1681 1590 -383 -1971 -1086 -1248 -1891 60 1234 652 931 1951 456 -1078 -675 -1266
1540 -1266 -2492 -1180 848 1194 1792 2739 1170 -1537 -1294 -1692 -2658 -756 1820 1625 1336 2040 668
1557 668 -2116 -1599 -784 -1486 -837 1261 1201 716 1881 1476 -626 -948 -567 -2012 -2075 535 972 1043 2553
1576 2553 1994 -567 -1573 -1214 -2476 -1957 883 1879 1489 1965 1620 -844 -2231 -1148 -1189 -1301 653
1593 653 1714 650 978 1503 50 -1019 -476 -1134 -2267 -568 1173 1008 1448 2428 958 -1586 -1135
1610a135l29j254J994K461k0m15J229k140k310N08L36j309J976K402o26m35R36
1627A869j287j975R12m92j058J104J800k38J98J160n16k000k19n42r51J146J476
1644C87Q03O49K39n64k236o90l38L41L13J733J266n20j92J7j687j271R28l30k96
1663a448J063J488n04N32Q31j516j732K68m49o22J878J849m87K73Q80k297j465
1680a458K46l58m4J578J507k37J51J52j457j054p0m3m60J339O99O04L30N6q84
1699E97j165p96n11L89O04J309J185N2m11l36j134j513K21L40j63J448J544l64
1717A296J55l91j775q25N92l61O2J793J088m33K17l10j471r63L57o77J99J815
1735C68O30j36J075o50j588n81j89r54O10J554R19L65L75n28j351p08q17Q1N73
$$ plain form
1610 -1135 -1464 -2718 -724 1737 1717 1302 2531 391 -1919 -1411 -1075 -2384 -408 1994 1368 933 1869
1627 1869 582 -1393 -481 -973 -2031 -927 873 635 833 1993 1477 -523 -742 -1284 -2235 -1089 387
1644 387 1190 1839 2078 1514 -722 -1412 -1750 -1409 -1096 637 1903 1383 1191 1208 -479 -1750 -822 -1152 -1448
1663 -1448 -385 1103 599 1131 1962 446 -1286 -1018 -1467 -2089 -211 1638 1151 1424 2304 7 -1458
1680 -1458 -1212 -1570 -1614 -36 1471 1234 1385 1537 80 -974 -1044 -1087 -1547 -208 491 1095 1425 1481 597
1699 597 -568 -1364 -1875 -1486 -882 427 1612 1664 1253 917 -217 -1730 -1509 -1169 -1332 116 1660 1296
1717 1296 1451 1060 -715 -1540 -948 -1309 -1247 546 1634 1201 1418 1108 -363 -1326 -969 -1646 -1447 368
1735 368 998 862 1937 1287 -301 -882 -1071 -2025 -1415 139 1058 1423 1798 1270 -81 -789 -1606 -1525 -952
1754i52P54Q18J218l45m32o38r84r92Q8O93j23J682P54k72r6p44q61r63K04k17
1774a408M74J812P49q53P66n18j721r15N84l84P44J237P79r5J07m64j657l73N9
1793a077k72P35J339J44N32K63j200o54q77n28N3R89O66P80M73mo76l75j096m51
1813a236J1K75M68J233O92k39p7r50r11q55M30R7Q46R07P13l21J16p20j389m22
1833a332m2P7J002J098L00M15k41j060j000m19k74L1J074R35M50M91j90j064p26
1852d75l99n11Q8R81P59N44M64k12q36k58j063m30J05O87N98J006M40n07l84p86
1872a89p93n53M98O94N26J239O5j98o49m49r26K8k32Q7Q15R59J73K13j6j370j183
1893a261k10M30n4J422Q66p6k0J49j277q35j90j35J49Q00P15M08L11j12o84r47
$$ plain form
1754 -952 -198 620 1838 1493 1061 423 -561 -1553 -1465 -772 -895 787 1541 1269 1173 429 -432 -1395 -1191 -1408
1774 -1408 -934 878 1627 774 1540 1022 -699 -1614 -1030 -1414 -670 567 1346 1251 1358 894 -763 -1136 -1077
1793 -1077 -1349 -614 725 869 1401 1664 464 -190 -1067 -1595 -1542 -553 113 893 1366 1362 686 311 -785 -1236
1813 -1236 -1225 -950 -482 751 1443 1204 1127 177 -734 -1589 -1159 -1062 -216 691 1404 1083 1199 479 -910 -1332
1833 -1332 -1374 -1297 -295 803 1103 1518 1277 217 -783 -1202 -1476 -1445 -371 564 1014 1505 1315 251 -475
1852 -475 -874 -1385 -1297 -316 443 987 1451 1239 403 145 -918 -1348 -1243 -556 42 1048 1488 981 597 -189
1872 -189 -982 -1535 -1037 -343 183 1422 1487 1289 640 191 -735 -707 -939 -852 -37 922 1095 1308 1292 -78 -1261
1893 -1261 -1471 -1041 -1095 327 1193 1117 1097 1246 -31 -866 -1056 -1191 -1042 -242 473 881 1192 1080 396 -551
1913e51l94m59L03P57P56P76J10k79n83j078p61j1L63N02J427O2Q4J11m97j159
1933e21o65J96R3K54J002N87J3J90j35j255j062L01j08J22J185P83O6Q8j75j098
1953a39j072J94m5K21J148Q18J91q0m88j011o91j02J59RJ148M24M3L61k54p97
1973C7n28n62L75L0L45J230L2q2J46m76j495l52O67r4M58R10Q44o07J0m12j113
1994f37o55M71K35J32J174M60p82M98m43j023l09R7n7j39J418L09J35J40k22j128
2014c26o41j98Q0K41J103J029n11K84l07r54j158L55N7L03R06P97k82l70K73p79
2034i8q93l5L83m14R60Q99j57J06N01j066j480N08pl56P88J367L28p14J77m67
2054C30j489j01M73j52R24J067J46q02J39n09p43j83O14m63L06J173J62m82L77
$$ plain form
1913 -551 -945 -1404 -1101 -344 412 1188 1298 1019 436 -642 -1403 -1414 -1051 -549 878 940 1024 1135 638 -521
1933 -521 -1186 -990 -897 -643 359 946 959 1149 1014 -241 -1303 -1002 -1110 -988 197 980 1046 1134 959 -139
1953 -139 -1211 -1017 -1062 -841 307 1125 1316 1236 748 -263 -954 -1056 -897 -888 260 684 727 1088 834 37
1973 37 -491 -1053 -678 -648 -303 927 959 877 1023 547 -948 -1300 -633 -727 -269 641 1485 878 888 476 -637
1994 -637 -1292 -821 -586 -454 720 1180 398 896 453 -570 -879 -782 -839 -978 440 749 884 1024 802 -326
2014 -326 -967 -1165 -1085 -844 259 1288 777 1061 754 -200 -1358 -1003 -946 -643 263 1060 778 408 681 -98
2034 -98 -991 -1026 -643 -1057 -97 802 645 751 1252 186 -1294 -786 -793 -1149 -361 1006 1334 620 797 330
2054 330 -1159 -1260 -787 -939 -15 1052 1198 396 535 26 -717 -900 -286 -749 -443 730 892 410 787
2073G87n3j543k12N37p02J86J510O21k42P1k49j426l52P9K28j72J313O70Q1l38
2093G94j57r75o07M40J56j91Q13O89k84k50L32p18p53L04j88l62O43J157r5K59
2113A007K0p46j352K02m8J58N90J160K2l81J64o80j294J93K74K49J32J239j80
2132G29j42K7l59q13l99L97k27J25J423L2k34L40l60j305m80N42M0M18P44O45
2152A143n20J44l65r74n38O03J10NO46O86l17N4j36r04o55K66M6j97R64N67p6
2173E52J38l5q40p47M04J5j1O02R94j97k2k43q15m97n8jJ96P32N95N0m25p6k30
2196H1p44m43M99O7M58M62L83j46l2k95q64m8r9P3L16J175r1J00P7r08o74k30
2218h83K35J8P33N03k9p8j52j00p69j40J11K90j17M82M40o7R2l54n03l79qJ48
$$ plain form
2073 787 734 -809 -1021 -484 -1186 -1000 510 1131 889 960 711 -715 -1067 -988 -760 -932 381 1051 1132 794
2093 794 637 -338 -945 -505 -349 -540 273 962 678 428 760 42 -711 -407 -595 -957 -314 843 748 1007
2113 1007 1027 281 -1071 -869 -917 -759 -169 991 1013 632 796 116 -1178 -985 -711 -462 -330 909 729
2132 729 587 614 255 -558 -957 -560 -787 -662 761 793 559 899 539 -766 -1246 -704 -664 -246 498 1143
2152 1143 623 767 402 -572 -1110 -507 -397 -392 254 940 623 677 541 -363 -1018 -752 -706 -903 61 628 552
2173 552 690 655 -185 -932 -528 -513 -524 78 1072 875 853 610 -205 -702 -760 -761 -565 167 762 812 387 311 81
2196 81 -663 -1106 -607 -540 -82 380 763 617 585 290 -574 -622 -721 -648 -332 843 752 852 929 21 -653 -883
2218 -883 -648 -630 103 606 577 499 347 247 -522 -662 -551 -261 -378 104 544 477 569 215 -288 -667 -675 -527
2240e27m9J003K56O8j50l10k45o46j96R7M39L77N11K95k06m79n39m52L5N8L42
2261c18K93Q61Ok20m58k49l26l46J14K91l2P70L69k6j64q32k17l26L7K16L76O58
2283D77J56m6j33l25l47m30j89J72N09O95L17k15L1m29p22j85j24L25L73J97K47
2304C54O51n52l1m45o51K41o5N83K47Q1J90j30j68k43j017M25j15L45L37N89L
2325F29j83k18l89j13m62N62O6L16K74L62j12m07m44n10l50L43J07L69O42J37
2345F19J46k27m87k27j65m72M37L20M78K49J02n20j21k89m63jL35j9P04L83l51
2366D31o0k56r17J47pL58k08R92k64M69l05l82j05l54j97L89p1M48M62j09qk86
2388A67j98n60J33j43L47M41N52j92k34j77l22O3n62L0N16K39N54k9j19q2l30
$$ plain form
2240 -527 -576 427 683 751 601 291 46 -600 -796 -699 -260 117 628 923 717 238 -301 -753 -718 -660 -318
2261 -318 -25 836 842 622 164 -85 -411 -757 -643 -352 -384 386 755 729 565 -267 -484 -810 -773 -557 -181 477
2283 477 633 587 454 129 -218 -648 -837 -665 -156 539 856 641 672 243 -479 -664 -788 -463 -90 107 354
2304 354 1005 453 422 -23 -674 -433 -498 85 332 413 603 473 305 62 -955 -530 -645 -300 37 626 629
2325 629 446 228 -161 -274 -736 -174 -108 208 482 844 732 325 -119 -629 -979 -636 -529 -160 482 619
2345 619 765 538 51 -176 -341 -813 -376 -56 422 671 773 253 132 -157 -620 -621 -286 -305 399 782 431
2366 431 371 115 -802 -655 -662 -304 -512 480 216 685 380 -2 -107 -461 -658 -269 -340 108 570 461 453 167
2388 167 -31 -591 -458 -601 -254 187 739 547 313 136 -186 -123 -685 -655 -139 100 654 625 506 424 94
2409I4n61J07J05m05P46J95K15R9j02m64l54k37N7K62m3O65L07m26j5n7n08l67
2431f87J27K83J06O48J22l5P6n05k69l23l01K48L66K18L56J66m05J6l31n46J58
2452e12o7O30L1O72j37j38n2l56o60q8K13R7M19L75L84l13L5m53p81K22K3K85
2474a71J60L39M30n96J01j56m32k62J08J89J47M81K80q4n7k67m90j83KL43k20
2495c38J065j53L8l05q3m75m20R6N11j39N11K72J45k58k45j82n64q0N30l77O09
2516A58M98k09k30j77J2q41L05J71l16O14N38J58n86K27l61n65j67J99K33L67
2536B8M71j70r0M23p53l86rK77k70J07Q94J3p5Pn7o78l91J86j3N40J81N95m84
2559C46j9j50n55k08K42K31o8N69N91o89p1k5j48n72K71jJ35N7Q99l78l25K34
$$ plain form
2409 94 -467 -360 -255 -660 86 281 496 595 493 29 -325 -562 -505 -243 -286 379 686 260 245 188 -320 -687
2431 -687 -560 -277 -171 477 599 564 640 135 -134 -457 -758 -510 -144 74 430 596 191 207 -124 -670 -512
2452 -512 -579 51 82 754 617 479 427 71 -589 -677 -464 -367 52 427 811 498 533 80 -701 -479 -456 -171
2474 -171 -11 328 758 162 263 107 -325 -587 -479 -290 -143 338 618 534 477 210 -280 -463 -461 -118 -338
2495 -338 727 574 612 307 224 -251 -671 -575 -64 -203 308 580 725 467 222 40 -524 -604 -74 -451 158
2516 158 656 447 217 40 52 -789 -484 -313 -629 -15 523 681 95 322 -39 -604 -771 -572 -339 28
2536 28 499 329 239 662 -91 -477 -486 -209 -479 -372 522 535 460 467 410 -268 -659 -473 -486 54 235 830 346
2559 346 327 177 -378 -586 -344 -113 -181 388 979 290 219 194 46 -526 -255 -256 -121 -64 835 457 132 366
2581C66j10j047L18k2L01J05N47OO1l06n57m93K09K0L16M00L31Q5l22j30j51m56
2603e29k12N38L8J90L12K58k29j10k10m43k0K59j37J3N40M43l48P8k95o46O1P5
2625c74K22j7N46K00k4n99J78m79l38M70Jn1O11K07j68k68J05m03l24J02J23J70
2647a10K29M90m7k65l5j58o35J15J62j58N22N17K0m34P7n54k75m0J8M76J7N27
2669D59J00m00j94o5j79j98J78j67M75N03J7K54l91k78o49N4l8M91M1K17M28j58
2691E00o8j69o21l82J18N82m2K41L11O3k09K0n88k24J70j38J00P87J07k84L03
2712E77o16m1n39J33k93K63L56P86Q7l21L3m74k86j45L44k18L77N85j26j3K31
2733G00p40l03m4K18j48KL62L69q5m0k76o88K34O8J58N6Q32J1j45j37m80r4m38
$$ plain form
2581 366 256 -791 -473 -495 -194 -89 458 464 525 219 -338 -831 -622 -602 -286 114 445 530 208 78 -73 -529
2603 -529 -741 -203 -165 25 337 595 366 256 46 -397 -417 -158 -295 -282 258 701 353 431 136 -510 -449 -374
2625 -374 -152 -169 377 577 553 -46 132 -347 -685 -215 -214 -265 346 553 385 117 222 -181 -505 -403 -280 -110
2647 -110 119 609 562 297 262 104 -531 -416 -254 -412 110 627 647 213 290 -264 -539 -579 -561 -85 -68 459
2669 459 559 159 -35 -100 -279 -477 -299 -466 9 512 529 783 392 114 -535 -481 -519 -28 13 230 658 500
2691 500 432 263 -358 -740 -622 -40 -82 159 470 533 324 344 -244 -468 -298 -436 -336 451 558 274 577
2712 577 -39 -80 -619 -486 -779 -516 -160 626 713 392 425 -49 -335 -480 -136 -354 23 608 482 469 700
2733 700 -40 -343 -387 -169 -317 -315 47 416 331 291 15 -673 -439 -371 -213 -157 675 686 541 404 -76 -170 -608
2756f08O5m2M35J99K85J40k89l11k32j84J73rK78J05P48j55r4m53k42k91jj05
2778e88N48L05K52j36M23n27l80l53k95M53N3O74O5j75J65n21k97jk86J24L50
2799a47K47M13n4R8l13k06l65k89j1J49N21M59Q6j30l05l14p8m71L87J23K32N35
2821E67K54l64n1j93k77n94j58L63N44J78L22Km8n00l28k5J32j26K33J90N18J19
2843G58l80k63p5o84K2l22P39L53K16M08m60l92o0l79r5m1L22L23N89l9k02k29
2865A09p3n62l05M46J27K62O35o6k51m7k20m22j98LJ2Q95L67M8m57p7l23k64j55
2888e16l4J57O16L80j60J92n09n6l21k91r1K50K15M68K41K64m33k09l57l27m0
2909e61K51J17N09J84J03J94o47m74j31j52K28q8Q10J47K76k71k98k99m10l49
$$ plain form
2756 -608 -543 -585 -150 49 334 474 185 -126 -358 -542 -369 -378 -100 5 753 598 504 51 -191 -482 -483 -588
2778 -588 -40 265 517 381 804 277 -103 -456 -751 -298 -245 429 494 319 484 -37 -334 -335 -621 -497 -147
2799 -147 100 513 459 557 244 38 -327 -616 -627 -478 43 502 588 458 153 -161 -239 -710 -323 -200 32 567
2821 567 821 457 406 213 -64 -658 -816 -453 91 269 591 593 545 45 -283 -308 -176 -302 -69 121 639 758
2843 758 378 115 40 -644 -622 -944 -205 148 364 772 312 -80 -140 -519 -614 -655 -333 -10 579 540 338 109
2865 109 36 -526 -831 -385 -258 4 639 573 322 275 55 -367 -565 -562 -550 345 712 760 303 226 -97 -361 -516
2888 -516 -550 -393 223 603 443 635 126 70 -251 -542 -633 -383 -168 300 541 805 372 163 -194 -521 -561
2909 -561 -310 -193 316 500 603 797 150 -324 -455 -607 -379 -467 343 490 766 495 197 -102 -512 -861
2929h61N10K04L75O61m14m4j36k00n77q3J04J37O57J92j35k0k1m48m82p2J54L91
2951a08J50N68k4K40n13k40o15k25L24L8N59L84R5M4l95j01n38l81L0P22jM39
2973D52K11k11J84n02l20p67M05L99j30P55L89k42k26j85o57k25J64K39j09Q93
2993E17J59P2k07k18n17m32q9L99J61K89O38j63L3n95k23m04K2J91J84L95M49
3014F61o8j72j57l84n06K47M1J44K79N67J2j20L1m22j050J02K03K35L05O42L08
3035H98p73O4j63m01o84Q69m9m5P87K55n42l78K21j59q63N19j5K49O42M51p4k37
3057E72j39j167J2n6M92L75L03L99k73l48k01n20m32K33M47J05N31L71j69k41
3077B94k13k46m95k36N90M0L86O18L5l17j68l79r71P5M54M49J61O97K52o65Rn08
$$ plain form
2929 -861 -351 -147 228 889 475 431 295 95 -482 -565 -461 -324 333 525 390 370 349 -99 -581 -653 -499 -108
2951 -108 42 610 586 826 313 73 -542 -767 -443 -405 154 538 633 677 282 181 -357 -738 -708 14 13 452
2973 452 663 452 636 134 -186 -953 -548 -149 -279 476 865 623 397 212 -445 -670 -506 -267 -376 517
2993 517 676 748 541 323 -194 -626 -715 -316 -155 134 772 609 642 47 -176 -580 -558 -367 -183 212 661
3014 661 593 421 264 -120 -626 -379 -338 -194 85 652 664 544 575 153 -897 -795 -592 -357 -52 590 898
3035 898 125 189 26 -375 -1059 -190 -239 -284 503 758 216 -162 59 -100 -963 -444 -459 -210 432 883 809 572
3057 572 433 -734 -722 -778 -286 89 392 791 518 170 -31 -551 -983 -750 -303 -198 333 704 535 294
3077 294 81 -165 -660 -896 -306 -266 120 738 773 456 288 -91 -1062 -987 -533 -84 77 774 1026 361 370 -138
3099a38r52K35M74K71J71O90k47m15mk22p26J49N24k55M41M55K66k27k10l69k70
3120c59o28M47J28Q4Q04N80m71n33J29p57n39N06L69L86K81K73k73j92%l55m88
3141f08J84R4L17L41M86l30j73j44m04n69K69J29J8O88O61M7m56m49m26n85J58
3162g52M84l4N27N91Q4p71p6j04o00J52J16J24L82N73j9j13n38l09k58j57N37
3183a61q1K04R66l76m28R3m3r97j93M25L44Q4J091j28k98j90m58m57k92N20K53
3204a22L06L12M58m56r3l84l22m52J11N15j18P11N15m17j33l51o51k28j55P06
3224b48K80N57K59l53K3l29p17j7O1K12M54L60N38k65n19m12l05m45p4N61K50
3245a29N07L09J37m97l97k23k95j45L76J38O31M05o7n77r5j49p94j24N95J34M36
$$ plain form
3099 -138 -1090 -855 -381 -110 61 751 504 89 85 -137 -863 -714 -190 -445 -4 451 717 490 280 -89 -359
3120 -359 -987 -540 -412 -328 476 1056 585 52 181 -576 -1115 -609 -240 146 427 700 427 235 235 -120 -608
3141 -608 -424 -330 -13 328 814 484 311 167 -237 -806 -537 -408 -390 298 959 1006 550 101 -325 -910 -752
3162 -752 -268 -302 225 816 900 129 53 -51 -651 -499 -383 -259 123 696 677 564 26 -283 -541 -698 -161
3183 -161 -242 -38 928 552 124 217 174 -823 -1016 -591 -247 -163 928 800 502 312 -146 -603 -895 -375 -122
3204 -122 184 496 954 498 405 21 -301 -753 -642 -127 -245 466 981 564 431 80 -571 -799 -954 -248
3224 -248 32 589 848 495 518 189 -528 -545 -484 -272 182 542 1080 815 296 -116 -421 -866 -940 -379 -129
3245 -129 378 687 824 327 -70 -293 -588 -733 -357 -219 412 817 750 173 78 -71 -865 -989 -394 -260 176
3266A76M86J90n12l79J46n65k90J32J36P02N32K06o05J9m79m54j53P3M90J5R92
3287H58j22k21l38m12m75l6J22L36L57L10L46P7o51n52J1k64K4K01N46M30K19
3308G66J57p04k89l62j46l1R0O61m3P46k50j88k35q63r3L6M55L05K14P04o3k58
3330F09m88n86j02j94L71L89O96K64k26j23n87m83j43k36N01K05L71L96k9o3k84
3351B58m78l96k16M05mQ29Q4K80M0o30o83k13J50j76L08M91N77J08l74o2m81o50
3373h33l7L57L23K71N52J1Q5n89k51n09k40L33O3O50M89J04k35q2n90j77p17M40
3395e82M07J10N36L40K90o13n59n60m34M23NO63M59K15R3k54m38m66n51O2M32
3416d22L81K60Q07m10K9m77m75k82k33M78K18O07j39N22k01q56q0k25m62M29L83
$$ plain form
3266 176 662 852 340 -39 107 -458 -748 -616 -480 222 754 960 355 374 -105 -559 -712 -639 -149 -134 858
3287 858 736 515 177 -235 -710 -746 -624 -288 69 379 725 802 151 -401 -390 -654 -630 -429 117 547 766
3308 766 923 219 -70 -432 -578 -609 -519 142 99 845 595 407 172 -691 -784 -748 -293 12 226 930 867 609
3330 609 121 -465 -567 -761 -390 -1 695 959 733 610 23 -460 -603 -839 -338 -133 238 634 605 542 258
3351 258 -220 -616 -832 -427 -431 398 482 762 802 172 -511 -724 -574 -750 -442 49 626 734 360 298 -183 -833
3373 -833 -870 -513 -190 81 633 644 729 140 -111 -620 -860 -527 -464 186 675 779 544 462 -128 -305 -1022 -582
3395 -582 -175 -65 471 811 1101 488 -71 -631 -1065 -642 -637 26 485 700 793 539 101 -365 -916 -854 -422
3416 -422 -41 219 1026 616 645 168 -307 -589 -822 -344 -126 481 342 864 663 -193 -273 -498 -960 -531 -148
3437a48L90J78K98l64l07k19n19M2J57M27L32L02K42k71n96j45k76k7m78R50K37
3458B05N71k15J83n07l05l06n40j55Q96N16J28O01k74l37p35j39n18O5P02L29
3478A65K51L78j41n26m62l40j09P2M87M29N9L01K98m55n15j88m78K30N7P34K22
3499D69K63J40m74m45l64k72m8L06M43K47M11L29p68k83p6k96k52K63K87L97K89
3520E66M21n51o23J34n29n50N99O83L45q8O12j64q13l68k50j43j2M23N89M32J59
3541H72l30n59n4m24k67J30M66K29L61M82j89n77o36N4j72r9N49J55M57L52K45
3562A045p47l41j87o65K35O51J1L63L47Q3n31m60r3k02L8L4P58q6L21Q9q7o75
3584i9j68m31l34P15K14J61J76N09k76m81l40m88J1K06L73L47J71N26n56m37k20
$$ plain form
3437 -148 242 420 718 354 47 -172 -691 -649 -492 -65 267 569 811 540 -56 -201 -477 -504 -982 -32 205
3458 205 776 561 744 237 -68 -374 -914 -1069 -173 343 471 1072 798 461 -274 -413 -931 -866 -164 165
3478 165 416 794 653 127 -335 -675 -784 -712 -225 204 263 564 862 407 -108 -296 -774 -544 -487 247 469
3499 469 732 872 398 -47 -411 -683 -731 -425 18 265 676 1005 237 -46 -122 -418 -670 -407 -120 277 566
3520 566 987 436 -187 -53 -582 -1132 -533 150 495 407 1019 855 42 -326 -576 -719 -731 -308 281 713 872
3541 872 542 -17 -71 -495 -762 -632 -166 63 424 906 717 140 -496 -442 -614 -713 -164 -9 448 800 1045
3562 1045 298 -43 -230 -895 -660 -9 2 365 712 795 264 -196 -289 -491 -453 -419 339 253 574 663 576 -99
3584 -99 -267 -698 -1032 -317 -103 58 234 743 467 -14 -354 -842 -831 -625 -252 95 266 792 236 -201 -421
3605d21l36M8J39M60N12L2M78l39o71j33m2l14lN44M04k18O08O4o27m71j53l48
3627g87J45O69Q3N30Q1Mn90l03k6l95k34Q71L37k79N98K21n01q98J78k45j20O34
3649b7J65J92J84J49k47o48J00p08l3O45L26J26K80J67j53n96k25n61J99L34L69
3670C8K95L09K0l54m19k55J51l25L17J3K32M53J11J29n92n12j24J5j57P81J00
3691B26L60M9J02p44l60k40J07j64O48L59Q0n8J19n29l47o3k86M8N53J49L33L55
3713F97K36r27l39j23l82J83M53N34j35K27m4j76m36k49N5P4p8O86J99J37j3k53
3735C26m25n09J71J76L7M91J03J17J56l25m59j40k51k5L53k5O05j37Q6J4l57l36
3757c54k68j97L78O49K82k3N88o78o47j26K14n32J00O44L73J93K36k93l53l41
$$ plain form
3605 -421 -757 -709 -570 -110 402 434 912 573 -98 -231 -273 -587 -590 -46 358 140 748 812 185 -286 -439 -787
3627 -787 -642 27 110 640 721 725 135 -168 -194 -589 -823 48 385 106 704 925 424 -474 -296 -541 -661 -27
3649 -27 138 330 514 663 416 -232 -132 -840 -873 -228 98 224 504 671 518 -78 -303 -864 -665 -331 38
3670 38 333 642 662 308 -111 -366 -215 -540 -223 -210 22 475 586 715 123 -389 -513 -498 -655 126 226
3691 226 586 635 737 -7 -367 -607 -500 -664 -16 343 423 365 484 -45 -392 -455 -741 -693 -140 9 342 697
3713 697 933 6 -333 -456 -838 -655 -202 332 197 424 380 204 -232 -481 -426 -352 -430 256 455 592 579 326
3735 326 -99 -608 -437 -261 -224 267 370 487 643 318 -141 -281 -532 -557 -204 -229 376 239 325 339 -18 -354
3757 -354 -622 -819 -441 208 490 467 1055 377 -270 -396 -182 -714 -614 30 403 596 832 539 186 -155
3777a55k30j93L71J63L34K46%l16k29J1n41k26K66N04L32K37k58J9k56l06k34
3798d61k88O07o6N90K61j60J20m69n79r6J37k23M21L75L26k18M73k95n26k52l14
3819f37J82N4M78L13K36lk25q57j48K29p7lM57L25J68l1l27k65l49j02k7K79L43
3842A3J51L33n9K4m13k98R2m65K48K39M07K43P7l17l42k05q5km6M37L33J51j55
3865C61j01k64m73K71L4k96M84K60J62M9j38j30j47o74K55q4J52M16K28M3n3k63
3887I2k85k49O7q0L07K98L72j67O3k46l14m46K76k04K97L7L25L51j35k20l71J67
3909f5l70jK3N47L09K16k01q8m06j14m29j33J91P33j6L52j14n5j88k66n52L02
3931c25j77N44Q1K81k7j83j61l0l52P3j21K91M46NM18j21n63l50P4j27N3J73N05
$$ plain form
3777 -155 -385 -578 -207 -44 290 536 536 220 -9 2 -539 -765 -499 5 337 574 316 335 79 -227 -461
3798 -461 -749 -142 -208 382 643 483 603 134 -445 -541 -404 -627 -206 169 495 277 750 455 -71 -323 -637
3819 -637 -455 -401 77 390 626 623 398 -459 -607 -378 -455 -458 -1 324 492 461 134 -131 -480 -582 -609 -330 13
3842 13 164 497 438 462 49 -249 -157 -622 -374 -135 272 515 592 275 -67 -272 -357 -359 -405 32 365 516 361
3865 361 260 -4 -477 -206 -172 -468 16 276 438 487 349 219 72 -602 -347 -431 -279 137 365 408 355 92
3887 92 -193 -442 -375 -455 -148 150 522 355 418 172 -142 -588 -312 -516 -219 -182 143 494 359 139 -232 -65
3909 -65 -435 -436 -413 134 443 659 458 370 -36 -150 -579 -712 -521 212 196 548 434 379 191 -75 -627 -325
3931 -325 -502 42 123 404 377 194 33 3 -349 -276 -397 -106 340 345 763 642 79 -271 -197 -324 -271 -98 407
3954D07m1k8N0k01n3p24J57o6M20K28K26k8J32n89qk33k5m9K77L73p6L08J29m55
3978A31k77o5j80L57k30L45K83q0M7j94m4m78n2M1O6N82J1K91k28n4n12Q3o8l98
4002f23N23J91J37R9Q0k68j54l34Lm8K30K39L44k30J59l0k11m33R9K9m1K16K80
4025B57O7J84l65j59k72j7K43n31N19K39L55j5l0l31n65O0j27P6L17R1O15p27
4047a16Q9R0n79J74O1K9K54K61K18j35Lj18m59J2j38q1P7J51O07k3K72n49m41
4070c41N8l8J37q7L00M20l30N31k72n03Jl50l3O9O87P6J81j97j66l05k17R3O28
4093C42o23L66J39j31L62k91l1l77k79K77p4N79J33j23J9k0l02l27K18K9j42J91
4115f5K43J01q0J66l21k54L0K5l93L34N90j04k65L56j27m90k46K65j34N8N35J87
$$ plain form
3954 407 366 338 388 187 134 -590 -433 -499 -79 149 375 347 479 -110 -118 -351 -376 -425 -148 225 149 457 586 131
3978 131 -146 -211 -391 -34 -264 81 364 284 331 137 93 -385 -437 -396 -330 252 263 554 326 272 -240 -157 -225 -623
4002 -623 -100 91 228 327 407 139 -15 -349 -346 -394 -164 75 419 189 348 318 107 -326 -227 -198 -239 -23 257
4025 257 324 508 143 -16 -288 -305 -62 -593 -74 165 520 505 475 144 -421 -361 -488 -412 -95 -4 611 -116
4047 -116 -27 63 -516 -342 -281 -252 2 263 481 346 349 231 -228 -216 -354 -435 -358 -207 400 377 649 100 -341
4070 -341 -283 -321 -184 -271 29 449 119 650 378 -125 -124 -474 -507 -438 249 325 506 309 143 -162 -379 -286 342
4093 342 -281 85 224 93 455 164 133 -244 -523 -246 -320 259 392 269 288 268 -34 -361 -143 -114 -256 -65
4115 -65 178 279 199 365 44 -210 -180 -155 -548 -214 376 272 7 363 236 -254 -500 -235 -369 -311 224 411
4137D11l48M63n61l36P3r8K15j2N49k75J38o1k02j99N5K40p18M09K79L02o9rj98
4160D8M2l80N1J82j06K75K00mj35J29k96j40P4qk43N33J74n17O39k17l52r9J65
4183A5l32M30p9r3M95k30j44P9j95j88k94L46L73Q4N8J07l77j99k51o4K05Q3O4
4206a07J18K54k3j03l24K1m14L24j97M92M9J33J05k8k53m3jm41K71J02o0O21l13
4229A83K24j61l71k68L58L3l83O90k64J01K8mj56k63j11K55MO8L48j05K35l11
4251A30j0o7m83J44M7L42R2M5K34l53o3j37j25K46j14M4P7K37l1k62J80l15r1
4274b33n3K3K85R1j83L57m09K08J8n85J1J89M24QQ0M6K7j33l51q1O8J09J10J78
4298B04k4K04j74j15rJ61k82n8J46O0L50k88k6P7o4m66J18k2K08L7L20N1l37L9
$$ plain form
4137 411 63 526 -35 -371 -298 -396 -181 -193 356 81 219 158 -44 -243 -188 52 -666 -257 22 324 255 246 48
4160 48 90 -290 -239 -57 -163 112 312 308 173 302 6 -134 -60 -68 -311 222 396 -121 518 301 -51 -150 15
4183 15 -317 113 34 -59 436 206 62 141 -54 -242 -536 -190 183 267 325 432 55 -144 -395 -459 -254 -171 -107
4206 -107 11 265 242 139 -185 -164 -578 -254 -451 41 90 223 328 300 47 4 3 -438 -167 -65 -125 496 183
4229 183 407 246 -125 -393 -35 -2 -385 305 41 142 170 166 10 -253 -364 -109 -105 -37 311 206 441 130
4251 130 120 53 -430 -286 -239 103 195 240 474 121 58 -79 -204 42 -72 -28 49 286 255 -7 173 -142 -233
4274 -233 -286 -263 22 113 -70 287 -122 86 104 -481 -470 -281 143 151 231 277 304 171 -180 -261 -193 -84 26 204
4298 204 180 384 210 95 86 247 -35 -93 53 113 463 175 149 226 162 -304 -186 -208 0 37 357 408 71 110
4322A10j16j31m24K00J80q4L55J29n1j73J2j23n0N4j50J08L76l4j44Q9j46J65
4344A52m59J00J82J47n8m4K83m7m9k99j24k12J69M01R7l04M79k54j34l89K27k09
4366c45K44J40j18J60J70j11l7l07l84L03J68J0K13L2k97J95J28p6m02J82q6J48
4388g0J43J84K98m29qP2k42l71J27K92k99N08K20k89j94R6m3k10J70k11K72j9
4410cj07M02k22J16k91l11M07q2J8P4K8R1OJ12n43P1k58K47k5L25o0J69k05OQ
4435b7kk43J53J45J30M6K6j11k73J77k20J75j18j16K16N5K81N3k49O7k87J74l47
4458b95q5N36P5kP1m41J30j80K0o1r5J40J66K11J54j95r0l67J1J47j23Q2L45m6
4482A08j09L64k41k70m4L2L7k9R5L04k8J4k28n5j85K5KJ04J54R9q3J03K52l03
$$ plain form
4322 110 -6 -137 -561 -361 -181 -265 90 219 168 -5 7 -116 -166 -112 -262 -154 222 188 44 133 -13 152
4344 152 -307 -207 -25 122 64 20 303 256 207 -92 -216 -428 -259 142 239 -65 414 160 26 -363 -136 -345
4366 -345 -101 39 -79 81 251 140 103 -204 -588 -285 -117 -107 106 138 -159 36 164 88 -314 -132 -218 -70
4388 -70 73 257 555 126 118 190 -52 -423 -296 -4 -303 205 425 136 -58 38 -5 -215 -45 -256 16 -3
4410 -3 -110 292 70 186 -105 -416 -9 -91 -73 1 29 120 126 238 -305 -234 -492 -245 -270 55 -5 164 -41 -35 -27
4435 -27 -29 -272 -119 26 156 202 228 117 -156 21 -199 -24 -142 -258 -42 13 294 347 98 165 -122 52 -295
4458 -295 -380 156 231 229 300 -141 -11 -191 -171 -232 -327 -187 -21 190 344 149 59 -308 -297 -150 -273 -191 154 108
4482 108 -1 363 122 -148 -192 -160 -123 -152 -57 247 219 233 5 -50 -235 -210 -208 -104 50 149 66 169 421 118
4506A18l20K07L8o4J63L87k87n7k8k51j22j93K67J45L20K1l28K24n4l9l17j94
4528c64L31j0j29L40K49j27j32l61J59p3O7j91J97M1K36n3k39M5j71p0M6Q7K66
4551A44J43k17K67k39j90J16j72j22J25k0K06N9J16l24K00l44M1j41L14j67N6
4572a49J93M12m49L5j86J5L8r5J14j10M85n4Ll5l09q2Q1RM8q8L11j77Op2J16k62
4598b02j21J76J03q3J12J20P7l80L19k38k10R6r6L65M1J1O6j17Q9l07k75M06j08
4621a56L34J88nl44J17j42j0l57K53J91p5L10J10k82j57l5N0k51J62j8K56K10
4643C49j66j55J39K21m64l23K30R2j11J70J77J23j70K5l32p6K57m39J51l7O72
4664C33j76K29p87J65J76l8R9l05J33M39J71j71q4l31k5k5K31k07L64q4n5j11
$$ plain form
4506 118 -202 5 43 -21 142 529 242 185 157 -94 -216 -409 -142 3 323 344 16 240 186 147 -170 -364
4528 -364 -33 -43 -172 168 417 290 158 -203 -44 -117 -50 -241 -44 -3 233 180 -59 -14 -185 -255 -209 -122 144
4551 144 287 70 337 98 -92 24 -148 -270 -145 -165 41 100 216 -108 92 -252 -211 -352 -38 -205 -149
4572 -149 44 456 7 42 -144 -129 -91 -186 -72 -182 303 249 252 217 -92 -174 -93 -84 -36 -124 187 10 16 -56 60 -202
4598 -202 -323 -147 -44 -127 -15 105 182 -198 121 -117 -327 -231 -327 38 79 90 156 39 128 -179 -454 -48 -156
4621 -156 178 366 361 17 134 -8 -18 -375 -122 69 -6 304 414 132 -25 -60 -10 -261 -99 -117 139 349
4643 349 183 28 167 388 -76 -399 -169 -77 -188 -18 159 282 112 137 -195 -271 -14 -453 -302 -339 333
4664 333 157 386 -401 -236 -60 -98 1 -304 -171 268 439 268 184 -147 -172 -197 34 -173 191 107 52 -59
4686e9J64j82J30R1k30l89M68L99l44j59J56M7k58j33M0J18K85l19J54L41k61
4707E9rk69K16l35N04k16J50m4J57k84L33m97j07K54P6M5K40l29Q4J20j91J14
4729G1l2j51m6J58j87L39m3r1j37J13j44m4K45q5K9k41L11J73p2n0l02j30M75
4752A59l44J44L3J72J73k60k05m2p9p2K67R7N4j4L18k86j89N1Q8k24K04l24J95
4775h4J63p6j43L43l30J08k33K78l04L45K47k9j56j16j22p3J19n8K41K7j01P9
4797A25K13k75o4j07r1lo3M11k63M2j11K65N2qo4k38n5j04P16N8k92Q1k48j02
4821a25p7J48k51J11K13K38o6m7J57j78l51J13oK25K2J83j58k43N53m51k84n5
4843c29K97j55K06QK22k82k3o0J66j89J70M0k39K53j27L65k94k34j13J13K96k2
$$ plain form
4686 -59 105 -77 53 144 -86 -475 -7 392 48 -111 45 92 -166 -299 -259 -141 144 -175 -21 320 59
4707 59 50 -219 -3 -338 166 -50 100 56 213 -71 262 -235 -342 -88 -12 33 273 -56 28 148 -43 71
4729 71 39 -112 -158 0 -187 152 109 18 -119 -6 -150 -194 51 -34 -5 -246 65 238 166 116 -186 -316 159
4752 159 -185 -41 -8 164 337 77 -128 -170 -249 -321 -54 43 97 83 401 115 -74 -23 65 -159 45 -279 -84
4775 -84 79 3 -140 203 -127 -19 -252 26 -278 67 314 285 129 13 -109 -182 -63 -121 120 147 46 125
4797 125 338 63 -1 -108 -199 -202 -265 146 -117 -75 -186 79 131 123 59 -179 -234 -338 378 436 144 225 -23 -125
4821 -125 -202 -54 -305 -194 19 257 191 144 301 123 -228 -115 -121 104 126 309 151 -92 461 10 -274 -329
4843 -329 -32 -187 19 27 249 -33 -56 -116 50 -139 31 71 -168 85 -42 323 29 -205 -318 -205 91 69
4865F9J20m7J65j72p1j09J72k26j02L71l34J45k6M3mj73J69j61K25J39j30J06
4887A69j33p0K67m74J58k00O6N4L58j42LK62j47p1k72J58J20m43M20q7k4R4J59
4910B25l64K03l11L16J13m31M15j98K23j73J68k20J8J50k35J1P4L12K05m86P9
4931I4l41p8n8M17nj2k6p3O6K86m17K87l97J22K90r1L4k0N1j28j50K09j90J97
4955F7j83K85j29Q0k34K38j65l61K09N4m4K24J73k2K85m27J44l66j1L48j65j47
4977a47L01j08J32n0Lj25p9j0O5q7K46L8J04m25n2K49k20l69L06M97k89M52o36
5000b04J28j6J07k10N0J47j89K50o5j10J02J28l70j02Q4LJ28K75k4q2J81m2j57
5023A2j42Q1Q5j53J92K96j14K05k53p0l57p6m5L04L1NR3L02j08n65J95j33n7L38
$$ plain form
4865 69 189 142 307 135 64 -45 127 -99 -201 170 -164 -19 -45 -2 -6 -179 -10 -171 54 193 63 169
4887 169 36 -34 233 -241 -83 -283 -217 -163 195 53 56 318 171 100 -172 -14 106 -337 83 -4 -28 66 225
4910 225 -139 64 -247 69 182 -249 166 -32 191 18 186 -34 -16 134 -101 -90 -16 296 501 15 94
4931 94 -247 -325 -383 34 29 17 -9 -82 -16 270 -147 140 -257 -135 155 64 98 78 129 1 -149 60 -130 67
4955 67 -116 169 40 120 -114 124 -41 -402 -193 -139 -183 41 214 192 477 50 194 -172 -183 165 0 -147
4977 -147 154 46 178 128 131 6 -73 -83 -18 -105 141 179 283 -142 -194 55 -165 -534 -228 269 -20 432 -204
5000 -204 -76 -92 15 -195 -145 2 -187 63 -2 -112 -10 118 -252 -354 -270 -267 -139 136 112 30 211 169 12
5023 12 -130 -49 36 -117 75 371 257 462 209 139 -218 -294 -339 -35 -4 1 94 396 288 -277 -82 -215 -272 66
5047F6K48j37o2j59M8k83J65k28O1L07rJ06O3r2j36L4J26j91p2J52J28O2N7n04
5071b50L95m63K31j83o3j55L68J30J89o5K8l4j84oj03j46L02J43L6L0l29K26K3
5094A20n19M13M1k42L29N0l58K85L3j44J3j27j4J11j01K91k93L13l35R8o2k45
5116c43L56q4k2K98m81O31oo39K1J29O1k03L62r7K07n76N07m5k0l37J30k04O72
5139C17m26L86k41Q1j74L03l87j5N17n21J94k9k3R5K03o68K97m8p0J72K30K05
5161C98l11N0k70nJ54k32J57j82M44M6j96K47k37k29r6L4J46R4J64K8j29m6k8
5184AR0K43l18j27j39M17J37k59Q6j18mk04J25Q9K5k0l0L71J34l05n29J30n5K84
5208B4R8j18L04k36K05l12J61j25j74J39L2j93K52J85r5j24K60m70k64J18K63
$$ plain form
5047 66 314 177 115 -44 4 -279 -114 -342 -281 26 17 123 186 94 -42 -8 118 -73 -145 7 135 197 254 -250
5071 -250 145 -318 -87 -270 -333 -488 -120 10 199 134 162 128 -56 -62 -165 -311 -9 134 170 200 -129 97 120
5094 120 -399 14 55 -187 142 192 -166 119 152 8 21 -106 -120 -9 -110 181 -112 201 -134 -36 -98 -343
5116 -343 13 -71 -93 205 -276 355 349 -290 -269 -140 -79 -282 80 -17 190 -386 121 76 56 -281 -151 -355 317
5139 317 -109 277 36 117 -57 246 -141 -156 361 -160 34 5 -18 77 280 -388 -91 -139 -209 -37 193 398
5161 398 87 137 -133 -138 16 -216 -59 -241 203 249 53 300 63 -166 -262 -228 -82 12 176 204 75 29 1
5184 1 91 334 16 -111 -250 167 304 45 131 13 9 -195 -70 19 44 24 -6 365 499 194 -335 -205 -260 24
5208 24 122 4 308 72 277 -35 126 1 -173 -34 -2 -195 57 242 147 23 283 -187 -451 -333 -70
5229g0J73K2J21k92J9Q0k6k0k57K57kJ50p2K55l46J89L3j94%j20r9J10N59k23
5253B47j02j10J00R6n94L65J33J64o2l77K62j32K09l01k47K49J31K6K74k74Q8
5274A45k00j43J31k4J63K6J19j60R2J35p2l85l8K8K47n5j35M06k58J04K27k56
5296I7l13J04J80j4j75J44J67M3j13j77J24k86J61l6jL55J32k32k26L0M0J7rk7
5320a5j32K34k48M4J16N2Ol66J95L5J53k80M37k11K1J9l18K36n2M0j45J17k6L6
5344e2N5k11J86m3k00oK53L29j42p8J71M9l29k00J27j72J54nL00j64J40j45L3
5367E0k51J02j31L43j46L21q0J13k34j48lL0q2N2J91p1L11l09m7j69r2J0J95j57
5391b02J70J27k97M07k8j25k10J24R1l05N04k40K71J00k82j51J5K7m7J21r8J79
$$ plain form
5229 -70 103 125 246 -46 -27 53 27 7 -250 7 5 155 83 338 -8 181 214 20 20 -100 -199 -89 470 247
5253 247 145 35 135 231 -363 2 135 299 237 -140 122 -10 199 -102 -349 -100 31 57 331 57 145
5274 145 -55 -198 -67 -91 72 98 217 57 149 284 212 -173 -211 -183 64 9 -126 280 22 126 353 97
5296 97 -216 -112 68 54 -121 23 190 233 120 -57 67 -219 -58 -94 -95 260 392 160 -66 -36 4 21 12 -15
5320 -15 -147 87 -161 -117 -1 51 57 -309 -114 -79 74 -206 231 20 41 60 -258 -22 -74 -34 -179 -62 -88 -52
5344 -52 3 -208 -22 -65 -265 -271 -18 311 169 91 262 311 -18 -218 -91 -263 -109 -114 186 22 162 17 50
5367 50 -201 -99 -230 113 -33 288 208 321 87 -61 -64 -34 -116 -64 127 56 367 58 11 -158 -250 -240 -45 -202
5391 -202 -32 95 -202 205 177 52 -158 -34 57 -248 256 16 287 387 105 -46 -31 -4 -51 70 -28 151
5413A51L39n02j1l82L70k59j17K72J38J6K5K4J20l15L4nK78j72J93k58J80j11
5435HJ44j40J16j98j16K32k21L22j2p6K2k26J46K38k67M5l1K4j98M24m7p3k12
5458i6J7K00j97K32l44K98J15k59j06J20O7n2k24L81q5N8k23O2K54l73R8L9J89
5481A71k00J04r6J72k5q2K0J59o74M42O7r0K96m4k61J46q5j76j50j08N54j91K96
5504B45k71L22n29n5M20j45k11K15L02l33k92L04K71k42O5j44L11q1K6k03m3n6
5526a24K16k0j70M4j9J72P4r2J74k50Q0j2J88l40K8j58K15j46K37j74J69j52j71
5549b31L0O2r4L29k72M05k65J97J42k65J35n25M85j4O1j51l1j21K71o1j23j39
5571a75J19j50J89K71j52J97k59p8r4J91j75J09J72j05j96K43J48o4j69p3k91
$$ plain form
5413 151 490 -12 -23 -405 -35 -294 -411 -139 -1 15 40 64 184 -131 -97 -102 176 4 197 -61 119 8
5435 8 152 12 128 -70 -186 46 -175 147 135 59 81 -145 1 239 -28 17 -14 10 -188 236 189 116 -96
5458 -96 -79 121 -76 156 -188 110 225 -34 -140 -20 47 -5 -229 152 67 125 -98 -36 218 -155 -57 -18 171
5481 171 -29 75 -21 151 126 44 64 223 -451 -9 58 -32 264 220 -41 105 20 -156 -306 -414 140 -51 245
5504 245 -26 296 -233 -288 132 -13 -224 -9 293 -40 -332 -28 243 1 66 -78 233 152 178 -25 -68 -124
5526 -124 92 72 -98 -54 -73 99 173 81 255 5 85 73 261 -79 -51 -209 6 -140 97 -77 92 -60 -231
5549 -231 -201 -139 -233 96 -176 229 -36 161 303 38 173 -352 133 119 180 29 -2 -123 148 87 -36 -175
5571 -175 -56 -206 -17 254 102 299 40 -38 -132 59 -116 -7 165 60 -136 107 255 191 22 -51 -342
5592c42K80J59l8j1j26Q8l2L13p07L67P8O3N6j73R6Pq6P2j22o9j58K51J8j34L15
5617A65J2k64J08j10J30K37k73l3R8j9k6k4J36r7lL3k16R1j57K42M2O7j30j3K31
5642B27j69j18J2K13k51M77o39j69N06K7j04J27Ok47L02k37J03L86m43j64J25
5663c0K59K9m78J09l4J53pL5R6j92J94j44k61M52j32J06O7J36q62O41j11l69M89
5686A46k07L50m00J33m4K7Rk35K23l9L5Q3K33k02m4k64J65J78l79K87j16M36j34
5709B41l39J66P4o7r3N7j43J29N6q1qk76O8kR2K24l5n4j8K62j78r9rm0n7m3K25
5736E2r0J04l1O1j19J33j91J8j86J3K52J4R7P4J32m17J19k86K22j60L40k63N8
5759e4J35J18j98Q8j03K05K2k22k3K8J9J86j37j99K11k46k0J11R7J20J00j74r8
$$ plain form
5592 -342 -62 97 59 48 -78 10 -22 291 -416 -49 29 92 148 -25 71 78 -8 64 -58 -127 -285 -34 -16 -150 165
5617 165 177 -87 21 -89 41 278 5 -28 70 51 25 1 137 40 37 70 -146 -55 -212 30 72 139 9 -4 227
5642 227 58 -60 -48 165 -86 391 -248 -417 89 116 12 139 145 -102 200 -37 66 452 9 -155 -30
5663 -30 229 258 -220 -111 -145 8 1 36 132 -60 134 -10 -271 181 49 155 222 358 -504 137 26 -343 146
5686 146 -61 289 -111 22 -22 5 14 -221 2 -37 -2 81 314 112 68 -196 -31 147 -232 55 -61 375 241
5709 241 -98 68 142 75 -18 39 -104 25 81 0 -8 -284 -216 -218 -126 98 63 9 -9 253 75 -24 -33 -73 -130 -173 52
5736 52 -38 66 35 96 -23 110 -81 -63 -249 -236 16 30 127 201 333 -84 35 -251 -29 -189 151 -112 -54
5759 -54 81 199 1 89 -14 191 213 -9 -32 -4 15 201 64 -135 76 -170 -190 -79 18 138 238 64 -34
5782c4Q1p0k34J66J08l37J77O0K72k50J8J16j21PQ8k59M01m47K13j40J54N3j16
5805i4r2J37K0j07K52l00P6L06j91o9J93m81L73n0j38K21L6j28L46k34%j55N3
5828b6L8K01k2o6k67L02j59l5j63q8O17l03N3Q4j32k52K37l39L71j84N7L02r2
5851A34j80K8j82J29j14MK4M7J57k71N02k74j28K17j15K58l06m2J08J34M7k2N0
5874B05l90K90j4j74m1K78J11j44n6O4o1L0k42L10j39M1M7m2p3k01J55Om4J22
5898C8nj00L21j99j21l03M40k1j84N8r2M48m22l7K23j52l5p2o8K40O3j79J89Q3
5922A13%j13k62K91J1L3m3l36J13r5K95p5nQ0q5P5J5N7L2k07J83k39M46r3k71
5947h0J52j62kl3n5K49K3q4k07J78J7j05j0m8R4n3P9J87J9l87O8K31q6k97M85
$$ plain form
5782 -34 47 -23 -257 -91 17 -320 -143 -83 189 -61 -43 73 -48 -41 47 -212 189 -258 -45 -185 -31 22 -94
5805 -94 -186 -49 -29 -136 116 -184 -108 198 7 -62 131 -350 23 -27 -165 56 92 -36 310 76 76 -79 -26
5828 -26 12 213 191 125 -142 160 1 -34 -197 -285 332 29 82 166 34 -218 19 -320 51 -133 -76 226 134
5851 134 -46 -18 -200 -71 -185 -181 -157 -110 47 -224 278 4 -124 93 -22 236 -70 -112 -4 130 177 155 205
5874 205 -185 105 91 -83 -124 154 265 121 65 129 68 98 -144 166 27 68 115 73 0 -201 -46 -40 -84 38
5898 38 33 -67 254 55 -66 -369 71 50 -134 -76 -168 280 -142 -179 44 -108 -143 -215 -283 -43 20 -159 30 113
5922 113 113 0 -262 29 40 73 30 -306 -193 -288 7 -68 -73 7 -78 -3 12 69 101 -106 77 -162 284 191 -80
5947 -80 72 -90 -92 -125 -180 69 92 8 -199 -21 -4 -109 -119 -167 -73 -126 -47 140 159 -228 -160 71 -15 -312 173
5972A73J96l94m2J97K95k60j82P0j56K14J30j92k08M00k23j81J47J2J31l22J54
5993d1Q4K9l04j63L26j8r0K32j32Q1M00l47k69M22k16l66L63j51L25J8j27j68
6015a12J93p9q5j68k7M18J06l80L01k78n3j04J99k07L40qj00J26j70p3M46j74
6037A11Oj33K9J58Ok98p1J73K89j14l62N1J25k80J14J35K56J31q5m56K59k53j36
6060c45L53k23J07K69j50J25J81p38J19J40J09M9j8M2R7k99K81o2j85J04n9k5
6082a28J95K99k17j3n4J12j88j43k50L12N9K2j20L96o1l16J58j92Q6o2K25j41
6104b1K07j7m44N73k47k37R6K54L6k49P8QL08r0m46o8K71j22L7j86J93J84o3J00
6128A55j87r4J34j40n9J53K13P8m61K55o2P3k94K47J67j01J20m6m2k86J47n7l12
$$ plain form
5972 173 369 -25 -67 130 425 165 -17 53 -103 111 241 49 -159 241 18 -163 -16 -4 127 -195 -41
5993 -41 43 72 -232 -395 -69 -87 -177 55 -77 4 404 57 -212 210 -6 -372 -9 -160 165 183 56 -112
6015 -112 81 2 -83 -251 -278 140 246 -134 167 -111 -164 -268 -69 -276 64 56 -44 82 -88 -161 285 111
6037 111 117 -16 13 171 177 -121 -192 -19 270 156 -206 -155 -30 -310 -196 -61 195 326 241 -215 44 -209 -345
6060 -345 8 -215 -108 161 11 136 317 -421 -302 -162 -53 -4 -22 20 117 -182 99 37 -148 -44 -103 -128
6082 -128 67 366 149 136 82 194 6 -137 -387 -75 -16 6 -114 282 221 -95 63 -129 -43 -105 120 -21
6104 -21 186 169 -275 298 51 -186 -90 164 200 -49 29 37 345 255 -191 -259 12 -110 -73 -259 -66 118 55 155
6128 155 -32 -126 8 -132 -191 -38 175 253 -208 47 -15 58 -236 11 178 77 197 151 109 -177 -30 -87 -399
6151c99J42J63oL64p6j62mk5J01l64n2M73j69J82P9j20j74K00J99l98l61L78J08
6174G9M0l8K83k98J06j74k80M14l9k21J37K35Jp2l46n1J17K08k28K00rL9k61O0
6198i8J00J08m95J76o6J2K25J12N4J1k91K29o0j98J21o9L90k45K34K8l27P5j52
6221a26L63l92M91j21q1m1RK2k42J05j38Q4J01J79l30N1J04m9l4k12M9Q6K74k18
6245f6M29k44k19J58j41K04l60O8mK6J48p8Q0N1k18P0l18M03j40J43L59n96M45
6268B00k46K09J54l22k59L45j24J3o8K22j08k09J25R3l16N4J28K99j18Q6K1l03
6290a24JK1N8m1K08j15K09l11J06J16k85kmp4K66m6J53pJ7j67lj0q3j45J47K04
6316H9K07j49M1Ll70R6M5j59J2M64p1r6m03M49j67j07K73j18Q0Pl13J75K01Q0
$$ plain form
6151 -399 -257 -94 -100 264 188 26 22 -3 98 -266 -318 155 -14 168 247 127 -47 153 352 -46 -407 -29 79
6174 79 119 81 364 66 172 -2 -282 132 93 -128 9 244 245 173 -173 -224 -107 101 -127 73 64 103 -158 -98
6198 -98 2 110 -385 -209 -275 -263 -38 74 128 139 -152 77 17 -181 -60 -129 261 16 250 278 -49 26 -126
6221 -126 237 -155 336 215 134 93 102 124 -118 -13 -151 -67 34 213 -117 -66 38 -11 -45 -257 -208 -122 152 -66
6245 -66 363 119 -100 58 -83 121 -239 -171 -175 -149 -1 -79 1 52 -166 -96 -414 -11 -151 -8 351 -245 200
6268 200 -46 163 317 -5 -264 81 -43 -30 -98 124 16 -193 -68 25 -291 -237 -109 190 72 158 179 -124
6290 -124 -123 -102 -44 -85 123 8 217 -94 12 128 -157 -159 -163 -237 29 -17 136 129 146 -21 -24 -34 -117 -262 -115 89
6316 89 296 147 188 191 -179 -83 -38 -197 -185 279 208 112 -291 158 -9 -116 157 39 119 126 -187 -12 189 269
6340B69k13j50L1J83l1%%J40j1J35m31j25J61j94P0O3L63j96L46k41j50j0k09
6363b00N7J09K05M3k1nj94L19j82k60j06K20j20K14K14n3j34m9k99K81n2j41J31
6386b3K26k02J22j58M9k36M10j59m0Qj2N3P2o8j38k36K91n5j43P1J66l2k2J26
6410G0r5J38k48n9K75k53K89l01M67j57j55O2j70J01L8k85M01M08l09l34M3o5
6432a39K84k70M12m61J95j41J39J50J28j84l69J34m7K70l90K29K53N1l38p6j16
6453b86K4J95m8M3L01o6K8m25L21l9l40L79l9j90J3K21j74J47K82j58m13M9J84
6476Ip8K5K41n6p4j54J14k94O6o3M93K6j67pn0j27K69k05J04r6L1O1k88J62N9
6501AN4k10KK73j50j3n5j3K17j87L61l33J08k75L60j00j39J18rR8j6k54L6j4r7
$$ plain form
6340 269 56 -94 -63 120 89 89 89 229 218 353 -78 -203 -42 -236 -166 -103 260 64 410 169 19 9 -200
6363 -200 -143 -34 171 214 193 188 -6 313 131 -129 -235 -15 -135 79 293 240 106 57 -242 39 -13 -154 -23
6386 -23 203 1 123 -35 14 -222 188 29 -11 -3 -15 38 110 42 -96 -332 -41 -96 -239 -168 -2 -34 -56 70
6410 70 -25 113 -135 -194 81 -172 117 -184 283 126 -29 33 -137 -36 2 -283 118 526 217 -117 -74 -139
6432 -139 145 -125 287 -174 21 -120 19 169 297 113 -256 -122 -169 101 -289 -60 193 244 -94 -170 -286
6453 -286 -262 -67 -115 -72 229 163 191 -234 87 48 -292 87 48 -142 -129 92 -82 65 347 189 -224 -175 9
6476 9 -69 -44 197 141 67 -87 27 -267 -201 -264 229 255 88 81 31 -96 173 -32 72 -24 7 68 -220 -58 1
6501 1 55 -155 -153 120 -30 -43 -98 -111 106 -81 280 -53 55 -220 140 40 -99 19 10 108 92 -162 -126 -140 -237
6526b37M15k81J69o4j40L03O0j61j36j03J61N7J69k3k87K12p1k10J39l68M07j15
6548a04K14K2n9QNM6k02j9k21L98qm0N0q0K2J27k0n38M00Pj20R6n1K80j35K1k71
6575a72K90J28j7m14K17J12J77m54L07l84K42J23l76M65k88Q4J44l16J13J14k21
6596a26j1K77P1l76J63J38M1k33p4J74N3l7j31Q8J98n1l4k82J45K1k16L21k33
6619a14J88r4J14r8L07m86j9J55p1J86k64J66K44L2j32o7l05K1K6J33J22L46k51
6642A39j04K24q1l93K67K08j9n19M77q5K09j42p4m23K82J19O5p8k37K11k5k34
6664b13R8JK97m02J71J56j5K4K03k68k55L21j55J26p2M3K34k19m8J92k21L0k05
6687a77K31j94R2j3J18o0O5J56p3j46j6k41J76L68M0l9j18l36p1K97m01M61j7
$$ plain form
6526 -237 178 -103 66 2 -138 165 225 64 -72 -175 -14 43 212 189 -98 114 43 -167 -28 -396 11 -104
6548 -104 110 132 73 81 86 132 -70 -89 -310 88 80 40 90 10 32 159 139 -399 1 8 -112 -16 -67 213 78 99 -172
6575 -172 118 246 229 -185 32 144 321 -133 174 -210 32 155 -221 244 -44 40 184 -132 -19 95 -126
6596 -126 -137 140 211 -165 -2 136 177 -56 -130 44 97 60 -71 17 215 164 130 -152 -7 14 -202 119 -114
6619 -114 74 -20 94 -4 303 -183 -202 -47 -118 68 -196 -30 214 246 114 47 -258 -237 -211 -78 44 390 139
6642 139 35 259 178 -215 52 260 241 -278 199 114 323 181 107 -316 -34 85 150 72 -165 46 21 -213
6664 -213 -115 -114 183 -219 -48 108 93 117 320 52 -203 118 -37 89 17 60 294 75 27 219 -2 28 -177
6687 -177 54 -140 -48 -61 57 -3 62 218 145 -1 -17 -258 -82 286 326 287 169 -167 -238 59 -342 119 102
6710A02J02K70n52J73p0l2j03J3J3R4R4J5k4n1q9l7r5R7j01J90J02L9K8p1J40
6735B47j67J1j89R2J13oK2j01J05k12M6K09m95K9P2M8J25Q2k9k17L23k52J24k34
6759b54M9L26L0j55J87j04j65L72l68K6P6j32J17k8K19rn6K2j72k98OM60k68o5
6783a84J38J47j14Q4k68K72N9K6m9K4j99J0k59J86j6O1N5j25l0J42J23N4k19R0
6807Hj05j30J78J1J01j7K7J06l69k1J03J63q2J48K20m38K39K2k15qP0m1m4L25
6831B51n8j78J5J80k01j97J01Q7l05L42J27j21q3q9L89j59l89L46j4j63L13m68
6853b74K34N2J64j20j65j6o9K71m3j12K77K2l41j92L61j54J28j13K30o5j93L09
6875A91l08L05j00j38J98j23q0O6K24l8k33J19jk77N8J83J21k21R0J54m89L69
$$ plain form
6710 102 204 474 -78 95 25 -7 -110 -97 -84 10 104 119 95 44 -45 -82 -177 -80 -181 9 111 150 178 107 247
6735 247 80 91 -98 -6 107 101 123 22 127 -85 -39 170 -325 -296 -224 -176 -51 31 2 -215 108 -144 -20 -254
6759 -254 -205 121 151 -4 183 79 -86 286 -82 -56 20 -112 5 -23 196 187 131 153 -19 -317 -311 149 -119 -184
6783 -184 -46 101 -13 71 -197 75 134 160 111 135 -64 -54 -313 -127 -143 -82 -27 -152 -182 -40 83 137 -82 8
6807 8 -97 -227 -49 -38 63 46 73 179 -190 -211 -108 55 -27 121 341 -97 142 164 -51 -59 11 -30 -74 251
6831 251 193 15 30 210 9 -188 -87 0 -305 37 164 43 -40 -129 260 101 -288 58 44 -119 194 -274
6853 -274 -40 12 176 56 -109 -125 -194 77 34 -78 199 221 -120 -312 49 -105 23 -90 140 75 -118 191
6875 191 -117 188 88 -50 148 25 -55 11 235 197 -36 83 82 -195 -137 46 167 -54 36 190 -299 70
6897G0O8k97nJ55kK55l3j8J41m29J02J26j50M0N1qK68j68O2j69l42L97l10On0
6922b40L31K7K05k0j22j33l87K65J91j23j2L99l13k98J32k35R4J13o4J31j00M47
6944B88k57O3MR4n8n2k58K83J75k69J95j2j00j02p6n0R7M6n2J28j36L03j7j85
6968E2j75J10K05k01nJ01j75R5K54k77j22K37j43PJ28j09P7j46O9J44j89M7j00
6991a16K32P2j62j88K33L4j39K94k43j79N58q82M50M10k44o8O9O0l54j05J58P
7013a03N8J50KK07l54J20P3j84k08J74oK3K94j5k64N1j64L71q7j87k44M13J12
7036B32k56K9L8j68j96L90j7J0J06Q1j95L23n67J95J52k17J66o6n7L48k51K4J06
7059B10k00o7r7J8Q8J43q1K7k95O03k04r8o0k42J32N56l98J78j36K7j98K12j48
$$ plain form
6897 70 138 -159 -164 -9 -11 244 211 193 334 -95 7 133 -17 23 74 66 334 166 228 59 -283 114 -196 -190 -240
6922 -240 91 118 323 303 181 48 -339 -74 117 -6 -18 381 68 -230 -98 -333 -239 -126 -190 -59 -159 288
6944 288 31 94 98 192 134 82 -176 107 282 13 208 196 96 -6 -82 -132 -35 11 -41 87 -49 254 237 52
6968 52 -123 -13 192 -9 -14 87 -88 7 261 -16 -138 99 -44 -37 91 -18 59 -87 -18 126 -63 -16 -116
6991 -116 116 188 26 -162 71 105 -34 260 17 -162 396 -486 -36 374 130 62 131 191 -163 -268 -110 -103
7013 -103 -45 105 107 314 -40 80 153 -31 -239 -65 -71 -48 246 231 -33 18 -146 225 138 -49 -293 120 232
7036 232 -24 5 43 -125 -321 69 52 62 168 249 54 377 -190 5 157 -60 106 40 -17 331 80 104 210
7059 210 10 -57 -154 -136 -48 95 14 41 -254 349 145 47 -13 -255 -123 433 35 213 77 104 -94 118 -30
7082c0K00%j08j1K17l98J13j31O5L03j94K02l71J05J88l8M2o4l84p9K74K23k22
7105i8L31j19l0j91k6J70M2l16K45lJ50L4m27M56k45k0K59l31N8J64O9j36P9j9
7129I6l52L99k35K59ol15J69M52n1n68L75r7j90j34M9J25KK8J23j44k02N24l03
7152Dl0K1K14l49J95j04J9K25l15j03n9K22Q7j37oM14k77m1j98j2K12o8R7J07
7176A18k85N77k51N8J00n77O12n68P9K48p2l5M2K44m47K18l05j51L30K25Kk2K04
7199C44m55L89j96Kj01n2o4K22j17K00j84j96p0J34J92r2J10p8k3K58j4j38J60
7222B31j77l84J38J54J32k1n7J94L0k34k22K99j24k1K12j49j51N95p24J68R8j40
7244a53J30k2O2M1j45M61n99K86k59L12n2k05L63k95K82n5o2o6o2J44j34M7k08
$$ plain form
7082 -30 170 170 62 51 268 -130 -17 -148 -83 220 26 228 -143 -38 150 112 154 90 -294 -373 -99 124 -98
7105 -98 233 114 84 -107 -133 37 79 -237 8 5 155 189 -238 218 -27 -47 212 -119 -61 103 172 36 115 96
7129 96 -256 143 -92 167 161 -154 15 467 416 -152 223 126 -64 -198 -149 -24 -22 6 129 -15 -217 307 4
7152 4 -26 -5 209 -140 55 -49 -30 195 -120 -223 -282 -60 27 -110 -116 298 21 -20 -218 -230 -18 -86 11 118
7176 118 -167 410 159 217 317 -260 352 -216 -137 111 39 4 46 290 -157 61 -244 -395 -65 160 162 140 344
7199 344 -111 278 82 84 -17 -69 -133 89 -28 172 -12 -208 -278 -144 48 -44 66 -12 -35 223 209 71 231
7222 231 54 -330 -192 -38 94 73 16 210 240 6 -216 83 -41 -62 150 1 -150 445 -279 -111 -13 -153
7244 -153 -23 -45 17 58 -87 374 -225 61 -198 114 62 -143 220 -75 207 152 90 24 -38 106 -28 19 -189
7267a89J33K84k26j07k67N97m37K92j04R9%L20o05J81R7Q5Lk35j29M5K96j2K7
7290A48r3j25j05J50k17J39J42R2J24j68p7J33l74J89o7p8K4K93M4l02K56O4k10
7313a8j83J37J4o0k08L52K4p3j3M59l92j41j41L17n8N0o6O1K1m5J03j19J38k6
7337A33j08N1K6j63Q3k27L88n16J29j11k4L29J09J47k88K35j53k55J85n8J22j45
7359a11J01p4O5j0k82J24J11R8j6j09K60j28o9K75k43k5L0o6n4K21q7L73k89k60
7383a65K28j03J23L8k25q5J16J82NL9k20K09J95l27j26n3L93j79k82L01j34j30
7405b00p5L94k04O1k91M01k19K74k51j32J86j67k1K89O2n38O68k69J7N5l8j73
7427a71L13r8k39j43O71N8l93J04l01L5K29j29J53j18l23L75l44L44j77L31k46
$$ plain form
7267 -189 -56 228 2 -105 -372 225 -212 80 -24 75 75 395 -210 -29 68 153 156 -79 -208 -163 133 121 148
7290 148 55 -70 -175 -25 -242 -103 39 131 255 87 10 143 -231 -42 -109 -187 -163 130 174 -128 128 192 -18
7313 -18 -201 -64 -50 -110 -318 34 58 -15 -28 431 39 -102 -243 74 16 66 0 61 82 37 140 21 159 133
7337 133 25 76 102 -61 22 -205 183 -333 -204 -315 -339 -10 99 246 -42 193 40 -215 -30 -88 34 -111
7359 -111 -10 -84 -19 -29 -311 -187 -76 22 6 -103 157 29 -40 235 -8 -33 -3 -69 -123 98 11 384 95 -165
7383 -165 63 -40 83 121 -104 -189 -73 109 114 153 -67 142 337 10 -116 -169 224 45 -237 64 -70 -200
7405 -200 -275 119 -85 -24 -315 86 -133 141 -110 -242 -56 -223 -244 45 107 -431 237 -32 -15 40 2 -171
7427 -171 142 44 -195 -338 333 391 -2 102 -199 -164 65 -64 89 -29 -352 23 -321 23 -154 177 -69
7448f9l4K77j64j07J64R2j99k0J0J4J69q5J11J01j48j2j11J60q5n0l9j42K05K1
7472E9J61k24K26n72KJ44J15J51j75K75r9J9l3J09k99m7M8K34j56K90l72j3L61
7495B04j72j66k8K6M7K38j6K20m73n4J39J71r2j16o6J83j30Q0O7j88j12M12l85
7518b11K20J84j0r3K9j56Q6p1K24l9k04N4J35j14K6k24J36L68l85O9L4j91K45
7541A12K9k56n7J23J57Q3k58j8K5L03p4o4l18J75K96l45j5J05n0Q5P1j72lo7N8
7566g5O5q8k2K60k04J6J19J53j27j87j18O5P4m9J10J02K31j5k44L4l1n0k84M90
7590B25j21k5j51K41n7MO3m85M62j69p8o8K34j9q9K8m36N55q9K2j73N1K20m46
7614c01J63K46J48k31pk01J45m7M32k50%l18L51p5j20K01P0j60j87j4K72n4K99
$$ plain form
7448 -69 -103 174 10 -97 67 159 -40 -60 -50 -36 133 48 159 260 112 100 -11 149 64 14 -25 -167 38 59
7472 59 220 -4 222 -350 -348 -204 -89 62 -113 162 63 82 49 158 -141 -188 -140 94 -62 228 -144 -157 204
7495 204 32 -134 -162 -136 -89 149 133 353 -120 -174 -35 136 44 -72 -138 45 -85 -5 62 -126 -238 174 -211
7518 -211 9 193 183 90 119 -37 49 -22 202 163 -41 13 148 34 60 -164 -28 340 -45 24 58 -133 112
7541 112 141 -115 -172 -49 108 191 -67 -85 -60 243 169 105 -213 -38 258 -87 -102 3 -47 38 109 -63 -66 -133 -75
7566 -75 -10 -98 -120 140 -64 -48 71 224 97 -90 -208 -143 -69 -118 -8 94 325 310 66 100 69 19 -265 225
7590 225 104 79 -72 169 112 116 179 -306 156 -13 -91 -159 75 56 -33 -5 -441 114 25 47 -126 -75 145 -301
7614 -301 -138 108 256 25 18 -183 -38 -85 347 97 97 -221 130 55 -65 136 206 46 -141 -155 117 63 362
7637C62j71k25J9l02O40k24J7M04l37j39j76K14j72k09N72j26N3k01J21j11m7
7658c8j15Q1J92j70NL02j80k93J79M4j5n2K03k04R2j71K99O9m70L20J24o7P0l96
7682a91K31J34j78n0o8K04j98r9J42rJ25N9l1k97O0M00L7l64L7j93N08k80LK64
7706B46o3k20M2P7q1K22m35L46j46K28k78L0O3j01k64L16j70O7K25j55opm2o4
7730a70L25j23N0k84J45K90l13J04M18o15K79m75M75J67l98L5J4R4l2j59L02k97
7752a68M32k14J1j78L45j42J42k42J19Q6q8l25J4M05k50j4N7k85L98j39j63M29
7774B30l42K07qJ06n1j23j11oJ30J38j43J6r3J76n08K41J65k60P3K15J28j25Q9
7797A44k16Q1N4O3k1j20o4p0K67J80l70j39M96l94k26M24o4j00k0K48j44o3R8
$$ plain form
7637 362 191 -34 -15 -317 323 99 116 520 183 44 -132 82 -90 -299 273 147 200 -1 120 9 -38
7658 -38 -153 -72 120 -50 -45 257 77 -216 -37 7 -8 -60 143 -61 31 -140 159 228 -242 78 202 135 205 -191
7682 -191 40 174 -4 -54 -122 82 -116 -215 -73 -82 43 102 71 -226 -166 234 271 -93 -56 -249 259 -21 -18 246
7706 246 183 -37 5 82 1 223 -212 134 -12 216 -62 -32 31 -70 -334 -18 -188 -121 104 -51 -57 -64 -106 -170
7730 -170 155 32 82 -202 -57 233 -80 24 442 -173 106 -369 106 273 -125 -90 -76 18 -14 -173 129 -168
7752 -168 264 50 61 -117 228 86 228 -14 105 191 103 -222 -208 197 -53 -67 -10 -295 103 -36 -199 230
7774 230 -112 95 87 193 142 19 -92 -98 32 170 27 43 -50 126 -382 -141 24 -236 -163 52 180 55 144
7797 144 -72 9 63 126 105 -15 -79 -149 118 298 -72 -211 285 -109 -335 89 25 -75 -95 153 9 -54 44
7820D4J8M2O0l57K69N8rO3k71Q1J09l38J7J83K97O4j75l02J07L9j26oK22j26R3
7845E6r2J84l13L90j47q7O7j47J18j86L72m37J49J38j66J27k28J44K66m15J42
7866f5K85m47J95j38K65j15j04O0J83j08L95o27P5K78k9j81k67M03J37j87n3J78
7888A33k53R0l54M66j70m9N8J88J10k48J12j22l30l8M02J88l68J40L57k74p7k55
7910b94K25k12O8L2NM89l81J41J1l17R9J32j07q6m1M30J58o5k70J4J08R1k01j07
7934g8J66M2k9p3N6O1k75j34J48J56k20J79R8j06J78J95l49J1p5OJ33l7j4K8p1
7959dJ6j8J80j5m8l44K82R3l8R7j20j74l96M45P9J81m9m3J37j47p9j22r4L20j71
7984c2R9m21J34K87J8J2m0j89K4l3K42j3p3k51M15k59J70j86K5K47m70L59N1o6
$$ plain form
7820 44 62 104 164 -193 76 134 125 188 -83 -2 107 -231 -214 -31 266 330 155 -147 -40 -1 -127 -133 89 -37 56
7845 56 -36 148 -165 225 78 -9 58 -89 29 -157 215 -222 -73 65 -101 26 -202 -58 208 -207 -65
7866 -65 220 -227 -32 -170 95 -20 -124 -64 119 11 406 -221 -146 132 103 -78 -345 58 195 8 -45 133
7888 133 -120 -30 -384 82 -88 -137 -79 109 219 -29 83 -39 -369 -407 -5 183 -185 -45 312 38 -39 -294
7910 -294 -69 -281 -213 -181 -176 313 -68 73 84 -233 -134 -2 -109 -195 -236 194 352 287 17 31 139 230 29 -78
7934 -78 88 130 101 28 84 145 -130 -264 -116 40 -180 -1 97 -9 169 364 15 26 -49 -43 90 53 39 67 -4
7959 -4 12 -6 174 159 111 -233 49 142 104 201 81 -93 -489 -44 35 216 167 124 261 114 35 -87 -181 139 -32
7984 -32 67 -354 -220 67 85 97 57 -132 -108 -141 101 88 15 -236 179 -80 90 -96 -71 176 -294 65 116 50
8008E0k17J88j8J03j75J07j86P0J06K07k6o8j06j43P5K48k18j6M14l94m6J29l23
8031b39J66k7J15p0O8o2R1K71l86L3Q7k47R6K78m82M43o8k21M7J76K09m00J56
8054C4J42j76P1Q5M4j8k15K19p4m1l37K33J18J70k23J98j38k39L18k96J75k32
8076a82K03j31K20J82n1k2r2j57n2O4K09j40N3j01l60L85k41L16Ko2j25J34P4
8099A26J66j5l42m4j8Q2j67J14J46J09j27l2J9rj5k35j10O28m98K58Q4k8k03q
8123a19K79j20N8k59M00p8k0j72J67k10o4p9K71j32J07J48k51r9M45j91k39L9
8145a19J53Q0L4J23r4K24m56K22j82j37l02L37N7L14l05N5r6Q1J86l36J20j30
8167a71K02L86l70L3P1p6k72rJ36K0j4P1P5j49P3J61l8j8j91k6k6L48l26O5
$$ plain form
8008 50 -167 21 3 106 -69 38 -148 -78 28 235 209 141 35 -108 -33 215 -3 -19 395 1 -45 84 -239
8031 -239 -73 -100 15 -55 13 -49 42 313 -73 -40 47 -200 -104 174 -308 135 67 -154 -107 69 278 -122 34
8054 34 176 0 71 156 200 182 -33 186 112 71 -266 -33 85 255 32 230 92 -147 171 -125 50 -182
8076 -182 21 -110 110 292 241 219 127 -30 -82 -18 191 51 104 3 -357 28 -213 103 105 43 -82 52 126
8099 126 292 277 -65 -109 -127 -45 -212 -98 48 157 30 -2 17 8 -7 -242 -352 276 -222 36 120 92 -111 -119
8123 -119 160 40 98 -161 239 161 141 -31 136 -74 -138 -217 54 -78 29 177 -74 -173 272 81 -158 -119
8145 -119 34 114 148 271 177 401 -55 167 -15 -152 -454 -117 -60 254 -51 4 -92 -11 175 -161 -41 -171
8167 -171 31 417 47 80 151 75 -197 -206 -70 -50 -64 7 82 -67 6 167 129 111 -80 -106 -132 216 -110 -45
8191d5
$$ Imaginary data points
##PAGE= N=2
##DATA TABLE= (X++(I..I)), XYDATA
0@%%%%%%%%%%%%Kj0J6j6J6j9K7l2M0m8N6o6P5r0J06j22J39j62J86k11K41k74L10
35A64l50L95m43M94n51O15o83P58q39R29j029J136j252J380j521J676j846K036
53A069k246K478k742L038l377L770m228M773n434O254p301Q698j0665J3655j8802
68a1060L0108j03371O3399J07550j34855J01381P8949j42936n7882Q8866o3571
79d3422k6394Q7880k192l0452O3422k4060l8696N6564k3296q5930M7959J7654
91i63o7773N4517R1317m1745j3739L0140o0931n3687J8826j060K8988N5233j1944
104B7179P841L4383p8528n1413P0011k9311o7989J03150M8146r2991M5637P6139
116I2254j06449l4376Q1309o2654n3144J00761M366n1390Q2492J4849r1375K8251
$$ plain form
0 0 0 0 0 0 0 0 0 0 0 0 0 0 2 -8 8 -8 8 -11 16 -16 24 -24 32 -34 41 -49 57 -65 74 -88 98 -113 128 -146 164
35 164 -186 209 -234 260 -291 324 -359 399 -440 489 -540 596 -656 724 -797 879 -967 1069
53 1069 -1177 1301 -1441 1597 -1780 1990 -2238 2535 -2899 3355 -3946 4752 -5913 7742 -11060
68 -11060 19048 -84323 -20924 86626 -48229 53152 132101 -10835 -68717 20149 -43422
79 -43422 -69816 18064 15872 -14580 48842 24782 -13914 42650 19354 -66576 -18617 -963
91 -963 -68736 -14219 77098 35353 21614 51754 -9177 -62864 -44038 -45098 -16110 39123 27179
104 27179 35020 69403 -9125 -60538 9473 -19838 -87827 15323 63469 -29522 16115 92254
116 92254 -14195 -48571 32738 -29916 -83060 17701 22067 -29323 53169 68018 -23357 4894
128D894J9698r8683J8075Q1567m7049P648R9233l8633o7243M4063k7670p7307
140h1407M6872M4994k6124L8846L8521m3644j3416M596m2163k99K6798j9071J7352
153h145M2169k4643J30L9748m1707l9717L3055k7578l9281O7419L1226l2300M5823
166D6199J9214q5043j2068L0169n5675P490Q6423j5794k3526O1476k6937p2654
178d0726L8900Q377o4683L6108N1919m5698J4002O1230l9714l1773L4577l5658
190a3139m5869M0987J5412j4759M7567K1470l8670o37m980m7846K977K8533j0550
203a9504K0509L9051j8352j0241J5505l4373k6002K2756j0664j0724M6358J1861
215B6180k0643K7767o86n3822K710J3872l7567J4670N2159j4287l509M0018k6779
$$ plain form
128 4894 24592 -74091 -56016 25551 -21498 -13850 85383 46750 -20493 23570 -4100 -81407
140 -81407 -34535 10459 -15665 23181 61702 18058 4642 9238 -32925 -33224 -6426 -25497 -8145
153 -8145 34024 9381 9511 49259 7552 -32165 890 -26688 -65969 1450 32676 376 46199
166 46199 65413 -19630 -31698 -1529 -57204 -49714 36709 20915 -2611 58865 31928 -40726
178 -40726 -1826 6551 -58132 -22024 29895 -15803 -1801 59429 19715 -12058 22519 -13139
190 -13139 -59008 -18021 -2609 -17368 30199 51669 12999 12362 7382 -40464 -37487 -8954 -19504
203 -19504 1005 40056 21704 11463 26968 -7405 -33407 -10651 -21315 -32039 14319 26180
215 26180 5537 33304 32618 -21204 -18494 -4622 -42189 -27519 24640 10353 6844 46862 20083
228B0083m2688K0412j0143l6357L5528K9427j9869K4468K6121m0275j5565J4019
240E161l4158j2948L9477L387m132L6220P88l1889M856p009l3742R365J8767q282
254a4139J9667K6908j5089m886O450l0634j8895J7203n939l57L6557R541j3766
267A2621J1829q384l5810m36O987j5076J7185L0068o447K532J5804k3768k3442
280a6337R153j2044j2917K8046J6096o676J8512O724k8113r189R44k1732J261
293b6272K5012K304O769K1904q347j9373J979j3890j9960J2443J2644k037J9424
306A2600J5794j3641n384j740k3256r810J1954J93O567K3955M627q996L386j1227
320E022k2729j29L719m564J5340J9623j373J969K968j8558j5067J007o719k75
$$ plain form
228 20083 -22605 -2193 -12336 -48693 -13165 16262 -3607 20861 46982 6707 -8858 5161
240 5161 -28997 -41945 -2468 919 -3213 33007 33795 1906 6762 -247 -33989 -24624 -5857 -14139
254 -14139 5528 32436 17347 12461 18911 -11723 -30618 -13415 -19354 -19711 16846 26387 12621
267 12621 24450 16066 -19744 -20180 -13193 -28269 -11084 18984 12537 15069 30873 7105 -16337
280 -16337 -7184 -19228 -32145 -4099 11997 5321 23833 30557 2444 -6745 -5801 -27533 -26272
293 -26272 -1260 1044 7813 29717 21370 1997 3976 -9914 -29874 -17431 -4787 -6824 12600
306 12600 28394 14753 9369 7629 -15627 -25437 -13483 -13290 -6723 17232 21859 12863 16249 5022
320 5022 -17707 -17836 -14117 -18681 -3341 16282 14909 16878 19846 1288 -13779 -12772 -19491 -19766
334a9766K0001J1012Q13R441k843j9791p470l505j0066N536J6734N865P404R376
348B2741q388j2591n065j1144q556R761R618M976J4174O773r453q054o591j3750
362a5549n596P716P521R038J1450L496l513o482j2145j0008j497J88N011J4433
376D063J0247K47J587m678j5321j0019j069j126N038J4509Q983L207J058p707
390I019j2435o590n044k614R077J1908M652N345N190q216j3177m385m775p115
404a9160O534J4769O301L300P139m806j5575q651k317m756L080J5392R393K117
418A2760K832l060j3351q423k478l170L536J1074O736L412N510k946j0994n752
432d314m439q089J681J2673P520M035Q223m2j3766j1368l178m742p74J2490J3986
$$ plain form
334 -19766 235 11247 12060 21501 18658 -1133 -8603 -12108 -22174 -16638 96 5961 13365 22741
348 22741 14353 1762 -3303 -14447 -23003 -13242 -3624 1352 15526 22299 12846 4792 -1799 -15549
362 -15549 -21145 -13429 -5908 3130 14580 18076 14563 8081 -4064 -14072 -15569 -15381 -10370 4063
376 4063 14310 14557 16144 11466 -3855 -13874 -14943 -16069 -11031 3478 12461 15668 16726 9019
390 9019 -3416 -10006 -15050 -17664 -8587 3321 7973 13318 18508 10292 -2885 -7270 -12045 -19160
404 -19160 -12626 2143 8444 11744 18883 14077 -1498 -10149 -12466 -17222 -14142 1250 10643 12760
418 12760 15592 12532 -819 -9242 -11720 -14890 -11354 -280 6456 9868 15378 12432 1438 -4314
432 -4314 -8753 -16842 -15161 -2488 5032 9067 17290 17248 3482 -7886 -11064 -15806 -16580 -4090 9896
447I896K400L30J737r294j4847j889K375l536O338J4714J538j856O047n241j5077
462f365j540K26q843N741J6964J363J253J1013q846j8775m10j204j0892R763J9517
477H965J67O18R204r892j8173m49N19p166Q618J5002P64l04N428n576j2086k282
493f643l05n111K042J0619N770L06N185K248j1328j0889m67l528m691J2893J6336
508A2437j042O90M368j4353j7601L541K014m405J5300J5136p833j912O421j4696
522a935j1249J0887j962j0519J4009J0443j0600N962J4204j3589j3417O401p601
535h966j3506J4559J7073j409M765P450j3914j7525j146O8p12J0799J3207J537
549A2280l598j551n056q901j512L527j493J56Q331L737k200N860K619j3048o904
$$ plain form
447 9896 12296 12626 14363 5069 -9778 -11667 -9292 -12828 -6490 8224 9762 7906 13953 8712 -6365
462 -6365 -7905 -7679 -16522 -10781 6183 7546 8799 19812 10966 -7809 -8219 -9423 -20315 -10552 8965
477 8965 9132 9750 18954 9062 -9111 -9560 -9041 -16207 -7589 7413 8177 7873 13301 7725 -4361 -6643
493 -6643 -6948 -12059 -10017 602 6372 6678 11863 14111 2783 -8106 -8573 -12101 -16792 -3899 12437
508 12437 11395 12085 16453 2100 -15501 -11960 -9946 -14351 949 16085 8252 6340 12761 -1935
522 -1935 -13184 -2297 -4259 -14778 -769 9674 -926 5036 19240 5651 -7766 -1365 -8966
535 -8966 -22472 -7913 9160 7751 12516 19966 6052 -11473 -12619 -12551 -13263 -2464 10743 12280
549 12280 8682 7131 2075 -6826 -8338 -4811 -6304 -6148 2183 5920 3720 9580 12199 -849 -7753
564g753L085q683l563J9656J0111o870P362L937k3203j0739J1024n347l972K1939
578F984R317j1969L870M021j8536o928J0621m501l514J4659M976o781O267K586
592A1072j2191m718K984p181k416J1215O794nO105K451j1099j0181j789k135j819
607a2913R473J3371J890l107J418o926j4603j036P659k445L142J4234j82q491
621A484M833J35j3743k21O866q333o71J4486J986l529R465j237j7027l281K429
636f358q338M698J8408K461l158N222o376j6576p25M772l354M932J2566K82m713
651C743K812j286q376l041J868k092j397O483P084J416M09J437o389j0307k542
666a0178J281M83P176J0634Q53k140m34p806r802J475K642j839P610J0004l659
$$ plain form
564 -7753 -4668 -13351 -16914 2742 12853 5983 13345 17282 -5921 -16660 -5636 -10983 -14955 6984
578 6984 16301 4332 8202 12223 -6313 -13241 -2620 -7121 -10635 4024 9000 2219 8486 11072
592 11072 -1119 -5837 -2853 -10034 -12450 -1235 5559 5554 11659 14110 3011 -7170 -8959 -11094 -12913
607 -12913 -3440 9931 11821 8714 10132 3206 -11397 -12433 -4774 -7219 -4077 10157 9975 1484
621 1484 6317 6452 -7291 -7512 -646 -8979 -9650 4836 6822 3293 12758 11521 -5506 -8787 -6358
636 -6358 -14696 -9998 8410 10871 7713 12935 6559 -10017 -10742 -5970 -9324 -4392 8174 8456 3743
651 3743 6555 5269 -3107 -6148 -4280 -6372 -7769 -1286 5798 7214 7623 9060 2671 -7636 -10178
666 -10178 -8897 -8414 -1238 9396 10249 8109 7675 -131 -9933 -8458 -5816 -7655 -45 9959 6300
681F300k364M501o976j1046L269K426n588O167J1278j310k119M737n528j0425
695f678o88R92j949N128Q420K035Q91J27n675p259k862q35L63O223O629K658K59
712G779k44n013p299k786P99N81K699O904M089j425o68m35o784n613O88O31L65
729e732O123P489m67r95j023o316o933lJ269J529O896N685m27j034j055o271n705
746f970O78p7J284N920N055O64l67r91n380n108j936K4K167N173M832K044K68
763G280j840n709m486j925q88K251N279M520K313L3j356m396n227k660N3J490
779e268L745N260L628o70k288k783m715l980m6K721K876M108L915Q23k508k973
795A845m075l849j351J740L612M775K956J102o72l571n393l055p32P53L207N227
$$ plain form
681 6300 3936 8437 1461 -9585 -6316 -3890 -9478 -3311 7967 6657 4538 9275 3747 -6678
695 -6678 -7366 -6374 -8323 -3195 5225 7260 8151 8278 2603 -4656 -7518 -8353 -7990 -1767 4862 7520 7779
712 7779 7535 2522 -4777 -7563 -6764 -6183 -3484 3420 7509 6084 5416 4981 -1803 -7416 -6728 -6097 -5732
729 -5732 391 7880 7413 6418 5395 -921 -7854 -7857 -6588 -5059 1837 7522 7095 6061 5006 -1265 -6970
746 -6970 -6292 -6369 -5085 835 5890 6554 6187 5196 -184 -5292 -7228 -7204 -5037 136 4968 7012 7280
763 7280 5440 -269 -4755 -6680 -7568 -5317 -38 4482 6795 6828 5472 1076 -4151 -6811 -6758 -5268
779 -5268 -1523 3737 7365 6695 4407 1624 -3091 -7071 -7117 -4396 -1520 2588 6503 7326 4818 1845
795 1845 -2230 -6079 -7430 -5690 -2078 2697 5653 6755 6083 2512 -2881 -5936 -6668 -5915 -2708 2519
811B519L151N93j006k169m689l886r82R09K741M117L639J999p28l119m260l525
827d696k046J66L517M050L732J462K18l309m405k825k302N54K835L588L161K496
843F196J11k830l153l426l229J03K407L458L706K958L4k449l830l724k515M3K304
860c836L197M290K487n20j556k802m611j936L73N50K447M948K742n81o74k421
876B097m766l098J06J109K781M217L218L27j415l128l837k273j134J291L191L355
892B041K335R05o78k553l639k894q19N99J942L988L388Q99j055j594l447m738
908e320m58J563J007L321M796Q53j930o34l103m819j242K192O71K784M851J309
924E841j927q49k903m292j401J572N11K869M463Q67r84k1k903m498j367R45L42
$$ plain form
811 2519 5670 6263 5257 3088 -1601 -5487 -6469 -5560 -2819 1298 4937 6936 6208 3089 -1171 -4696
827 -4696 -6742 -6576 -3059 991 4723 6185 6403 3094 -1311 -4136 -6438 -5884 -3049 539 3700 6196
843 6196 6307 3477 324 -3102 -6331 -6228 -3821 -363 3343 6301 6335 3886 56 -3668 -6183 -6140 -3836
860 -3836 -639 3651 6138 5618 4062 1260 -3351 -5287 -4914 -4364 -1917 3031 5773 5192 4518 2097
876 2097 -2669 -5767 -5661 -4552 -1771 2446 5664 5991 4576 1448 -2389 -4662 -5796 -4505 -1314 2041
892 2041 4376 5281 4603 2050 -1589 -4483 -5302 -4703 -2761 1227 4615 5514 4459 2865 -582 -5320
908 -5320 -5778 -4215 -3208 113 4909 5762 3832 3198 95 -4724 -5966 -3774 -3103 -319 4532 5841
924 5841 3914 3065 162 -4130 -5531 -3959 -3448 -579 3884 4751 3767 3746 843 -3655 -5022 -4077 -3735
941c735K140M598K240q38n12j766n553k607J366R25K137M756K810j401j776j349
957A435m585k527J832J678J71M076L183j867r72M65l780l992J223N87n67M155
973E15M767o35q18M9m653n261O59J946M97L942N348j127k655n70k773n043J200
990d612K947m9J834M474m87k702J066j474m907k54K191j557J144O119J390k115
1006C008Q83j557o640k250L371r7J769O534J618l677m78j513n619j171L764P67
1022a288O66M189J143k892m61M37m003k087K148j08o53M039L719j818k01O92m642
1039a120m728J262K005o75M431N575j927l070N08l701n213K201L730o73K211N101
1055E917k140l988J633j679m416J938K324k105J646N244j430j720K142j820n585
$$ plain form
941 -3735 -1595 3003 5243 4405 3893 2127 -3426 -6033 -4667 -3742 -1605 3151 5961 4560 2784 1435
957 1435 -3150 -5677 -3845 -2167 -1996 2080 5263 3396 2424 2889 -891 -4883 -3660 -3073 -3640 515
973 515 5282 4647 3829 3878 -775 -6036 -5377 -3431 -2934 1008 6356 5229 2574 2004 -769 -5812 -4612
990 -4612 -1665 -1714 120 4594 4107 1405 2471 997 -3910 -4164 -1973 -3530 -2386 3733 5123 3008
1006 3008 3891 2334 -4306 -6556 -3185 -3282 -1513 5021 6639 2962 2484 971 -4648 -5819 -2055 -1288
1022 -1288 -622 3567 4710 1818 1357 1794 -2209 -4296 -2148 -2256 -2909 1130 4849 3031 2830 3522 -1120
1039 -1120 -5848 -4586 -2581 -3256 1175 6750 4823 1753 2261 -1440 -6653 -4452 -722 -1395 816 5917
1055 5917 3777 -211 1422 -257 -4673 -2735 -411 -2516 -870 4374 2944 1224 3366 1546 -4039
1070d039Q1J660j741K674O090L82k196M23k847n689k30K949J079J467M554Q28
1086E445l717j221n00l188j073K727J306r82K532K684k079r45J741l238m063J332
1102c239R49j044M395N114k443j814R03n107m650L646J963o86M628L954m177k136
1118B56J410l694l042L471J427j753K961K917k313n41J469k546l278L52P16m67
1134b655K659L419K86q14r28k516k844r42J662J465J622L308J006k807j334p18
1150a31l188j407L234J415r17L388K109l460p49J891m223k789L524L67j521M680
1166B223K349k705J26J53m696k515K932O6L20M845J595k526j02r08m270q15J661
1183b267L64J336L177N21q38p49r19k141r04k61O43J261J292J891J268j450j122
$$ plain form
1070 -4039 -3958 -2298 -4039 -1365 4725 5107 2911 3334 487 -5202 -5432 -2483 -1404 63 4617 5445
1086 5445 1728 507 7 -3181 -4254 -1527 -221 -1203 1329 4013 1934 989 2730 -508 -4571 -3239
1102 -3239 -2290 -3334 1061 6175 3732 1918 2821 -2286 -6936 -3290 -1327 -2013 2615 6569 2392 256
1118 256 1666 -2028 -5070 -1599 -172 -1925 1036 3953 1640 1099 2568 22 -3256 -2904 -2188 -2655
1134 -2655 4 3423 3709 2895 1967 -549 -3393 -4335 -2673 -1208 414 3722 4728 1921 587 -131
1150 -131 -3319 -4726 -1492 -77 -994 2394 4503 1043 294 2185 -2038 -4827 -1303 -936 -2457 2223
1166 2223 4572 1867 1993 2146 -2550 -5065 -2133 -2067 -1747 3098 4693 2167 2065 1157 -3113 -3928 -2267
1183 -2267 -1903 -567 2610 3131 2293 1544 625 -1516 -2420 -2681 -2038 -777 515 2406 3674 2224 1102
1200A102j136k866j254K016J657K49L853P50l063p55k53l655q51L126M90J30L677
1217C217M34k837J61l30l633l36K283m33P43L621j25j147P93j946l535M56O50
1234a964m67K617K914n31n02K85k687k340L34k93Q28K125J564R68J11j330k201
1251e69m55j611p73K083J606J79K014J205k662j287P5k362q15K322P77M86K663
1268B876L24j967l55j342l156R36J462k45K069K835j167j148L27k689j845J171
1284a914M26KK579J672r15K96o85k654p58j40m47J046K414P42N73Q25j769k723
1302a430m8j060n11K290J723L62J075J92j935j091l30j694j15J779P04J081K142
1319C134n18j781m13j714k218J138J333K64K321J740j216r53k23k373j281R43
$$ plain form
1200 1102 -34 -2900 -4154 -2138 -481 -232 3621 4371 1308 553 300 -3355 -4206 -1080 -590 -460 3217
1217 3217 3651 814 975 645 -2988 -3324 -1041 -1474 -731 2890 2765 1618 2411 465 -3070 -2614 -1964
1234 -1964 -2431 186 3100 2569 2067 2352 -335 -2675 -2341 -2634 -1806 319 1883 2851 2962 1632 -569
1251 -569 -1024 -2635 -3408 -1325 281 460 2474 3679 1017 -270 -195 -2557 -3372 -1050 -273 213 2876
1268 2876 3200 1233 878 -464 -3620 -2684 -1222 -1467 602 3437 2270 1122 1449 -1240 -3085 -1914
1284 -1914 -1488 -1486 1093 2765 1850 2146 1461 -1193 -1951 -2091 -2538 -1492 922 1664 2237 3062 1293 -1430
1302 -1430 -1478 -2538 -3049 -759 964 1326 2401 2593 658 -433 -763 -2457 -2572 -793 -89 992 3134
1319 3134 2616 835 422 -1292 -3510 -2372 -1039 -775 1546 3286 2070 1117 894 -1479 -2760 -1817
1335a817N64K48K575P50o60M5m88k647p80L91l67J520K131P63K45J6k024k301
1353a836n3j71k95K076J434K21J058Jk200r96p78j086O31J591N68J411J493j061
1371B008j687j57j817j574J517J126L81J842J620j668o83o10k166o81J401J49
1387i99O25K224O05r02k38p75k512o43Q20J27J228K235L76k62n08j572j636l00
1405b107j1R29J283J064O65L06o03j228j141q48q17Q88J395P86J560O70j343j063
1423C85r22j725m90J838P61M31K167Q5j565o33n28j882k67J236N06O14J818M40
1441B269r06k08q69k235n40J013L12J155K315L80j048p06j337j661k77P73P79
1458g91J079J105R62r13o95o39j539o01L88J001M16R64J482k37j181k72j187j667
$$ plain form
1335 -1817 -1253 -1005 1570 2320 1660 1705 1217 -1430 -2210 -1819 -2186 -666 1465 2228 2473 2489 465 -1836
1353 -1836 -1889 -2060 -2355 -279 1155 1376 2434 2435 235 -761 -1539 -2625 -1994 -403 165 1576 3069 2008
1371 2008 321 164 -1653 -3227 -1710 -584 -203 1639 3259 1591 908 298 -1868 -2549 -1148 -999
1387 -999 -374 1850 2455 1553 1315 540 -1972 -2615 -1795 -1668 -440 1795 2171 1909 1401 -171 -1807 -2107
1405 -2107 -2118 -1189 94 1158 1823 2129 1526 298 -843 -1691 -2508 -1620 -225 561 2121 2791 1448 385
1423 385 -537 -2262 -2752 -914 -153 278 2445 2530 965 332 -196 -2078 -2345 -1109 -603 11 1829 2269
1441 2269 1363 1155 286 -1949 -2489 -1476 -1164 -9 2306 2686 1638 932 -405 -2066 -2343 -1570 -791
1458 -791 288 1393 2355 1442 747 108 -1431 -2032 -1644 -643 -227 737 2219 1982 801 529 -658 -2325
1476b325K38J335K63R01K347n91j562k89r97k099L45J875L17J008J946n39j851
1493C22l62l04j961M8K142k67K93K088l1j011j78l75k162m11J212j6M32K440P18
1512B617j221m51m87k576n03J341O48M25K283N66j338j250m47j192j171J636J191
1529G1m19J525J213j420j104R13j427j548N98N11J73J391K254q57j015Q6j745
1546h00k346Q67J410O07J263J997r03j950Q2j084j665P67K104n42N06J833o24
1563A522j803O84j54k137JJ508o28M58K670M16j755K16n73k755m63J602N85P18
1581A12K406L85j918n21q00j939k27J658Q28J71J401O83j626o64L62j326p59N92
1599a182O79L5J120J514n23j304L85j468k133Q54J341R2J171K592j228j924L54
$$ plain form
1476 -2325 -2087 -752 -489 412 2759 2168 606 317 -680 -2779 -2434 -559 -242 766 2712 2173 322
1493 322 -40 -344 -2305 -2257 -115 -382 -89 1999 1968 957 779 404 -1758 -2169 -957 -973 -541 1899 2617
1512 2617 1396 945 458 -2118 -2621 -1280 -632 -207 2076 2642 1304 54 -393 -1585 -2756 -1120 71
1529 71 -348 1177 2390 970 -134 779 -648 -2196 -1598 -1087 -914 477 2731 1874 859 945 -800
1546 -800 -3146 -2279 -869 -262 1001 2998 2095 145 227 -857 -2522 -1755 349 -193 313 2146 1522
1563 1522 -281 403 249 -1888 -1887 -379 -1007 -549 2121 2537 782 998 425 -2330 -2793 -1191 -606 112
1581 112 2518 2903 985 464 -336 -2275 -2502 -844 -16 155 1556 2239 613 -51 311 -1015 -1774 -1182
1599 -1182 -503 -468 652 2166 1643 339 724 -744 -2877 -2023 -682 -590 581 3173 1945 21 375
1616C75j339k012R37K166n84J301K145j580j679O42r12j953J190J363n58O52J979
1633B133n93j149O42j050j932m7Q34N48P68J956K62j145p31j247j446Q0J316N90
1651b11Q78R12P52j434j028j75p31j065J419J153o07J054J536j339q90L64j332
1668g44j325O89R73n2J389J652j181q73k69j375j461J044J419m3J929P30j317
1685A185o74l56j471p19P71P73L95J070J049n62p66k89j164q40j6Q61L54Q10J367
1704A778K04o63j232n84j115n32J313J299J53R21N48j231j060Qj365q13J610J024
1722B63k50J596K89j226r60K61j388n75J302N10J63J642M2j248O0l32j771k82
1740a904O76K76Q08J849J78q33m27o87j052n80K66P26Q80J193J0J88r45q65p42
$$ plain form
1616 375 -964 -2976 -2039 127 -457 844 2989 1409 -270 372 -540 -2493 -1303 60 -498 154 2133
1633 2133 1540 391 1033 -17 -1949 -1996 -1162 -614 154 2110 2372 1227 496 -751 -2197 -2117 -801 -211
1651 -211 667 1579 2331 897 -131 -306 -1037 -2102 -683 470 -137 917 2453 1114 224 588 -744
1668 -744 -2069 -1380 -407 -459 930 2582 1401 528 259 -1116 -2577 -1533 -114 -157 1772 2502 1185
1685 1185 511 155 -1316 -2035 -1264 -491 -96 974 2023 1461 695 406 -758 -1598 -1614 -753 -399 411 1778
1704 1778 1982 1319 87 -497 -1612 -2144 -831 468 621 1542 2090 859 -201 -193 -1558 -2371 -761 263
1722 263 13 1609 1898 672 -288 -27 -1415 -1990 -688 -178 -15 1627 1669 421 481 149 -1622 -1904
1740 -1904 -1228 -952 -144 1705 1883 1050 623 -64 -1116 -1696 -1430 -704 176 1369 1379 1567 622 -243 -985
1759i85n76R7O98J120K95R52K31j152r91m26j194L1J257P40L77J136K66j038o25
1778B13j059j021L9J026P28M89J335j03j046m04l68j529p8J043N46R92R05j35
1796A573p44j86j244j017L60p7Q68J122Q12l22J61q93j186l63J19l44J037R96
1814F72L49K45K58j248o23n49n24N2J156R61Q8Q15k81j113n19o02m53L00K37J086
1834C07L73R40j98j186m65p56n37M02K09J015R51O35l87p02l02j554l33L16Q24
1853d48L28Q06O27j63j99p95r51k85j22o1J042Q53O75L56m70r50j016k95o03O22
1873a049R85O65M55K63m35p69o65n39j51J63R77K55J136K57n88l92o04j260m79
1892a775R89Q16M8R20O26n78n42q28o65m31M31N72M11J188M43q87l76m01o68n23
$$ plain form
1759 -985 -1561 -1464 -766 354 649 1601 1832 680 -311 -737 -1931 -1900 -643 97 474 1610 1876 838 213
1778 213 -846 -1867 -1828 -802 -74 415 1750 1647 601 197 -171 -1700 -1778 -735 -189 803 1708 1573
1796 1573 829 643 -601 -1618 -1258 -1335 -467 655 1467 1145 1306 413 -773 -1136 -1017 -1361 -324 672
1814 672 1021 1266 1524 276 -347 -896 -1420 -1368 -212 749 837 1652 1371 258 -261 -863 -1316 -1016 -779 307
1834 307 680 1620 1422 236 -229 -985 -1522 -1120 -911 104 1055 1690 1303 601 299 -1255 -1588 -1272 -448
1853 -448 -120 686 1313 1150 951 156 -795 -1080 -1202 -1263 -221 632 1307 1663 1193 243 -773 -1068 -1671 -1049
1873 -1049 -64 601 1056 1319 884 115 -550 -1089 -1240 -1077 -100 155 1291 1548 960 568 -36 -1296 -1775
1892 -1775 -786 30 78 998 1624 1046 504 -324 -989 -1420 -989 -417 -6 1182 1625 738 362 -39 -707 -1230
1912a230l0N08Q87P75M27j02m88j076q62jK05L75M83R82M11J14p66o09m49p81
1932a227k45R76R51k93R13M93q89m19q71n71m16R64N17L13J031L76q70m70p77
1951e14q05j99Q27O12OJ185K19n40o87k57j188p5N47O80N40P64K92m71o72l70
1971a06q07l35N21N06M08N07O28k40q26O2q53r69J66R55L59P71O55j63j124n36
1991d21o03m35K8J393M22Q4R33m01r07n67J66o84q6R11J71J52P34K97n96o03N8
2012D6j294j32O68L56O02R22L13n59j223o9q27k94P67R28R5N65M13p87o83l36
2032e29j26o01P47P02K2J67J056q21p41K57n82q79L68P89j70Q32J306m91j114
2051A92j96o97q75N77J269m0M34P68j72j423k94J2n67M90R31k76l2R20j15o98
$$ plain form
1912 -1230 -1260 -752 135 910 1337 1235 747 -329 -1191 -1192 -987 -612 -129 853 1264 1378 612 3 -446 -1227
1932 -1227 -1472 -496 455 162 1075 1568 679 260 -611 -1182 -1598 -634 -117 196 1227 1603 733 263 -514
1951 -514 -1319 -1518 -691 -79 -73 1112 1331 791 104 -153 -1341 -1416 -869 -189 351 1115 1407 936 264 -106
1971 -106 -913 -1248 -727 -221 187 694 1322 1082 256 318 -535 -1504 -1338 -383 -24 747 1402 1239 115 -421
1991 -421 -1024 -1459 -1431 -38 384 468 1401 1000 93 -474 -308 -992 -1078 -167 4 156 890 1187 591 -12 46
2012 46 -1248 -1380 -712 -356 246 1168 1481 922 -301 -370 -1197 -1491 -724 204 299 864 1277 490 -193 -529
2032 -529 -655 -1256 -509 193 215 382 1438 617 -124 133 -449 -1328 -960 -171 -341 491 1797 1306 192
2051 192 -4 -701 -1576 -999 270 230 664 1432 1260 -163 -457 -445 -1012 -522 409 133 101 1021 906 208
2071B08o3k80q11j54Q56K57N7R86M30q53n80l73p07m97J101P73J76N22M53j256
2091B45l55m37k56l08R66N32P8R6N05o28p12L13m17p44N95M77p9P11O65l44r95
2112i2J8o31n84N48J000l41O08Q62n22j031m62J68o68J47J151J26J48P59p14q87
2132c97l9J26m85L9N31M05j40J196k39r56k39q0o81QN46P49M05L83J05j062m01
2153b26j56n20l37J140L86J05L21M2n25k86r3m75m12M44O97L3N15L03n41m85n7
2174a27q83l35P76Q30j27N41M27m66o01m95k23l71M68N29K84N30J82m66l65o28
2194e20J48m10L92J38L75L03L04K44r34l20j33k15m56J016K32J74Q66k68o35l17
2214a6n11m11K27K80O37P7O47m6m36p10l9m99P3M67K61K74K14K04n61K2m02m69
$$ plain form
2071 208 145 -135 -946 -1100 -244 13 70 1056 1486 633 53 -320 -1027 -1524 -423 350 526 1048 1501 245
2091 245 -110 -547 -803 -1111 -145 387 465 561 1066 438 -274 39 -378 -1122 -527 -50 -129 582 1247 903 -92
2112 -92 -74 -705 -1289 -741 259 -82 526 1388 866 -165 -627 -459 -1127 -980 171 297 445 1204 490 -397
2132 -397 -436 -310 -795 -756 -225 180 40 1236 997 41 -198 -278 -959 -951 -405 344 749 1132 1237 175 -226
2153 -226 -382 -902 -1239 -99 287 392 713 755 230 -56 -149 -624 -1036 -592 105 138 653 956 415 -70 -127
2174 -127 -1010 -1345 -569 261 134 675 1102 636 35 -460 -683 -1054 -586 -57 227 757 939 473 108 -520
2194 -520 -372 -782 -390 -252 123 426 730 974 40 -280 -413 -628 -1084 -68 164 338 1204 936 301 -16
2214 -16 -527 -938 -711 -431 206 283 930 884 448 -262 -301 -800 -727 -260 1 275 489 693 132 154 -248 -717
2236g17j47O02R0O06K07K98k84o21j39m87l89O13N01M09R1J24k15o03n09p8l7
2257f85J37N10K15M64kj37l83m46j19n87M80K75R65Mj6j13k85n47r0k68p7L08
2279c97N25J75K59l49M3o48j95j56LK1Q41K81K57J52n03k07o29l89J75P08K7R1
2301H5N96j2l03m98k04m40M6M96L70K23L75k48j88n42m17k91J61M49M18K73L62
2322G11j48K02q43j18l52j58M07M5M57J83L23m29Q9o40k58j51K73M57L15L47O
2343G18l89q3m78m51K19j5J00P04J75K01j24j65l52n51k25K10L34K44K26M72l25
2364D45r4p63J94k23j06M57j6O51O4j32m38K08n16j67l27L73O70n7K90K17m17
2385C13l54n20j16l1L99P1P51j5Pj57k63n69m1M8p4L54M65K39m5J2m13l68l16
$$ plain form
2236 -717 -864 -262 -172 434 641 939 655 34 -105 -592 -981 -368 133 542 633 757 542 -61 -570 -648 -685
2257 -685 -548 -38 177 641 639 502 119 -327 -446 -1033 -553 -278 687 691 675 562 277 -270 -360 -628 -705 -397
2279 -397 128 303 562 213 256 -392 -587 -743 -740 -719 122 403 660 812 309 102 -527 -916 -741 -33 -6 85
2301 85 681 669 366 -132 -336 -776 -730 -234 136 359 734 486 298 -244 -661 -952 -791 -342 76 349 711
2322 711 563 765 -78 -196 -548 -706 -299 -254 203 386 709 280 369 -271 -529 -680 -407 50 365 712 718
2343 718 329 246 -232 -683 -464 -479 -379 325 500 701 577 412 60 -491 -716 -506 -172 72 298 770 445
2364 445 351 -412 -218 -441 -547 -90 -106 545 609 477 39 247 -269 -436 -763 -390 280 223 513 730 313
2385 313 -41 -561 -677 -708 -309 -238 513 498 505 348 85 -484 -525 -477 -551 -197 268 507 462 474 61 -307 -623
2408f23k10N80K3L44L61N4K61n81k42n85J21j39L86N02J10M75j16o99l42J94m43
2429e69j45N47M45j15P1K79j34n09k60q4j07L85j02M43M28l32k61k72P8k28k31
2450f73N19J71Q2M1N77l60n20k35pk97L10L66R3K95K21k85m22M2l38n3K3N22J68
2473B40L85k90L46o47k07N6n34l9N90K16K67N75l31n60m00Pl96J11M96L07P9J60
2495D31J87n99q1l66n11O66K22L20j82M37J78k85m90P0m89m6K30L17M28KQ7k53
2517B73j44m79j63k59N44L74L3J02O76n26o65q3j81j29L42M74mK87J17j24n83
2538a18l79L35m16J46L56Q3L69J96J3o49o4q0m75K75J78M48M9J13K23o24l80J08
2560b93m91K73K89M06j35L57Nl59m10J43qm61L20N59J59k99M83k14l87j53l82
$$ plain form
2408 -623 -833 -253 -230 114 475 529 790 209 -33 -618 -497 -636 -250 252 362 837 721 22 -320 -126 -569
2429 -569 -714 -167 278 163 234 513 379 -130 -390 -474 -581 -196 -298 145 573 241 -20 -292 -214 -442 -673
2450 -673 -154 17 99 140 717 357 -163 -398 -405 -702 -392 -26 67 362 583 298 -124 -82 -420 -473 -450 72 240
2473 240 625 335 681 34 -173 -117 -651 -690 -100 116 383 958 627 67 -333 -326 -722 -611 -115 192 271 431
2495 431 618 19 -62 -428 -939 -273 -51 269 87 524 702 417 -73 -3 -492 -538 -308 9 437 439 526 273
2517 273 129 -350 -513 -772 -228 146 179 281 957 431 -234 -317 -498 -627 -285 189 185 472 589 465 -118
2538 -118 -497 -162 -578 -432 -76 7 376 572 585 -64 -128 -208 -683 -408 -230 218 267 380 603 -21 -401 -293
2560 -293 -784 -511 -222 184 49 406 411 52 -358 -215 -223 -684 -364 195 354 55 538 324 -63 -216 -598
2581e98Q2J89K14K44J32P39q02l93J7l76j67L79L66K27L13J46k90m25Kl16k95
2602f12L00M42q1J16M05l13j94j64k43l56J85N85J72o7J82J66m04n97M8K2j90
2623e98N17K75K48J44m6n14l41j24l40J60L07N95r9PN40m90k49j11l05q8L06M75
2645B69l35L82K25J5k95n62j40K08j03M22P7J60N12n40m45j63K94m82jO65N5L49
2667E67l7k92k42l54J39m33j16P10L68P7K82J34m60m05l77j73k08R03M40m40N25
2688F08o2o73K08m44j72r7N30M60K5N9J62n47n00K38m59j3O37K16j0M03L36p25
2710A80j86L2n52k88M25L11L0M70M38m03o53m6l37p2L25M78O0K05L27m07l53j96
2732b12n61P4K12L76M11K23L1p7n12r1l43k37K63M01J75O9N23k68j60k59m86l05
$$ plain form
2581 -598 -516 -327 -113 131 263 1002 200 -193 -176 -552 -719 -340 26 253 566 712 422 -3 -1 -317 -612
2602 -612 -312 130 49 165 570 257 63 -101 -344 -700 -515 70 242 175 357 523 119 -478 -430 -408 -598
2623 -598 -81 194 442 586 540 26 -315 -439 -779 -619 -312 283 184 191 731 241 -8 -119 -424 -512 -206 269
2645 269 -66 316 541 556 261 -301 -441 -233 -336 86 163 323 835 295 -150 -313 -19 -501 -502 163 218 567
2667 567 530 238 -4 -358 -219 -652 -768 -58 310 387 669 803 343 -62 -439 -612 -820 83 523 83 608
2688 608 546 -127 81 -363 -535 -632 -102 358 383 442 604 57 -443 -205 -664 -677 -40 176 166 569 905 180
2710 180 -6 26 -526 -814 -389 -78 -48 422 860 457 -196 -242 -579 -651 -326 152 212 417 744 337 -16 -212
2732 -212 -773 -699 -487 -111 300 523 554 477 -35 -126 -469 -706 -443 -42 133 202 725 457 297 38 -448 -753
$$ [...]
8191E3
##END NTUPLES=NMR FID
##END=
