##TITLE=1H_DE-Gly_M
 200.13MHz, D2O,
 8 sc
 
 30.4.2025
##JCAMPDX= 6.0         $$ Bruker NMR JCAMP-DX V2.0
##DATA TYPE= NMR FID
##DATA CLASS= NTUPLES
##ORIGIN= UXNMR, Bruker Analytische Messtechnik GmbH
##OWNER= pz
$$ XWIN-NMR		Version 3.5
$$ Wed Apr 30 13:46:46 2025 Russian Standard Time (UT+4h)  she@DPX200
##.OBSERVE FREQUENCY= 200.1313
##.OBSERVE NUCLEUS= ^1H
##.DELAY= (6, 6)
##.ACQUISITION MODE= SIMULTANEOUS
##.ACQUISITION SCHEME= undefined
##.AVERAGES= 8
##.DIGITISER RES= 18
##SPECTROMETER/DATA SYSTEM= spect
##.PULSE SEQUENCE= zg30
##.SOLVENT NAME= D2O
##.SHIFT REFERENCE= (INTERNAL, D2O, 0, 14.3821)
##AUDIT TRAIL= $$ (NUMBER, WHEN, WHO, WHERE, WHAT)
$$ ##TITLE= Audit trail, XWIN-NMR		Version 3.5
$$ ##JCAMPDX= 5.01
$$ ##ORIGIN= Bruker BioSpin GmbH
$$ ##OWNER= she
$$ F:/spectra/data/she/nmr/H-C/1/audita.txt
$$ ##AUDIT TRAIL=  $$ (NUMBER, WHEN, WHO, WHERE, WHAT)
(   1,<2025-04-30 13:44:51.20 +0400>,<she>,<DPX200>,
      <created by zg, POWCHK disabled, PULCHK disabled
       configuration hash MD5:
       00 E9 B6 7A A2 85 ED C7 34 08 36 98 17 FE 4E 26
       data hash MD5: 16K
       11 46 2F 36 E6 7A 9A B3 7F F7 66 F4 AE 49 DF 55>)
$$ ##END=
$$ 
$$ hash MD5
$$ E4 FA 3F BF F0 90 C0 F7 90 26 FF 01 2B D9 9B 72
##$RELAX= 
##$RELAX= 
##$RELAX= 
##$RELAX= 
##$RELAX= 
##$RELAX= 
$$ Bruker specific parameters
$$ --------------------------
##$DU= <F:/spectra>
##$EXPNO= 1
##$NAME= <H-C>
##$PROCNO= 1
##$TYPE= <nmr>
##$USER= <she>
##$AMP= (0..31)
100 100 100 100 100 100 100 100 100 100 100 100 100 100 100 100 100 100 
100 100 100 100 100 100 100 100 100 100 100 100 100 100 
##$AQSEQ= 0
##$AQ_mod= 1
##$AUNM= <au_zg>
##$AUTOPOS= <>
##$BF1= 200.13
##$BF2= 200.13
##$BF3= 200.13
##$BF4= 200.13
##$BF5= 200.13
##$BF6= 200.13
##$BF7= 200.13
##$BF8= 200.13
##$BYTORDA= 1
##$CFDGTYP= 0
##$CFRGTYP= 5
##$CHEMSTR= <none>
##$CNST= (0..31)
1 1 145 1 1 1 1 1 1 1 1 1 1 1 1 1 1 1 1 1 1 1 1 1 1 1 1 1 1 1 1 1 
##$CPDPRG= <>
##$CPDPRG1= <>
##$CPDPRG2= <>
##$CPDPRG3= <>
##$CPDPRG4= <mlev>
##$CPDPRG5= <mlev>
##$CPDPRG6= <mlev>
##$CPDPRG7= <mlev>
##$CPDPRG8= <mlev>
##$CPDPRGB= <>
##$CPDPRGT= <>
##$D= (0..31)
0 0.7 0 0 0 0 0 0 0 0 0 0.03 0 0 0 0 0 0 0 0 0 0 0 0 0 0 0 0 0 0 0 0 
##$DATE= 1746006290
##$DBL= (0..7)
120 120 120 120 120 120 120 120 
##$DBP= (0..7)
150 150 150 150 150 150 150 150 
##$DBP07= 0
##$DBPNAM0= <>
##$DBPNAM1= <>
##$DBPNAM2= <>
##$DBPNAM3= <>
##$DBPNAM4= <>
##$DBPNAM5= <>
##$DBPNAM6= <>
##$DBPNAM7= <>
##$DBPOAL= (0..7)
0.5 0.5 0.5 0.5 0.5 0.5 0.5 0.5 
##$DBPOFFS= (0..7)
0 0 0 0 0 0 0 0 
##$DE= 6
##$DECBNUC= <off>
##$DECIM= 32
##$DECNUC= <off>
##$DECSTAT= 4
##$DIGMOD= 1
##$DIGTYP= 9
##$DL= (0..7)
0 120 120 120 120 120 120 120 
##$DP= (0..7)
150 150 150 150 150 150 150 150 
##$DP07= 0
##$DPNAME0= <>
##$DPNAME1= <>
##$DPNAME2= <>
##$DPNAME3= <>
##$DPNAME4= <>
##$DPNAME5= <>
##$DPNAME6= <>
##$DPNAME7= <>
##$DPOAL= (0..7)
0.5 0.5 0.5 0.5 0.5 0.5 0.5 0.5 
##$DPOFFS= (0..7)
0 0 0 0 0 0 0 0 
##$DQDMODE= 0
##$DR= 18
##$DS= 0
##$DSLIST= <SSSSSSSSSSSSSSS>
##$DSPFIRM= 0
$$ [...]
##$SUBNAM0= <"">
##$SUBNAM1= <"">
##$SUBNAM2= <"">
##$SUBNAM3= <"">
##$SUBNAM4= <"">
##$SUBNAM5= <"">
##$SUBNAM6= <"">
##$SUBNAM7= <"">
##$SUBNAM8= <"">
##$SUBNAM9= <"">
##$SW= 18.0517328524113
##$SWIBOX= (0..15)
0 0 2 0 0 0 0 0 0 0 0 0 0 0 0 0 
##$SW_h= 3612.71676300578
##$TD= 16384
##$TD0= 1
##$TE= 0
##$TE2= 300
##$TE3= 300
##$TEG= 300
##$TL= (0..7)
0 120 120 120 120 120 120 120 
##$TP= (0..7)
150 150 150 150 150 150 150 150 
##$TP07= 0
##$TPNAME0= <>
##$TPNAME1= <>
##$TPNAME2= <>
##$TPNAME3= <>
##$TPNAME4= <>
##$TPNAME5= <>
##$TPNAME6= <>
##$TPNAME7= <>
##$TPOAL= (0..7)
0.5 0.5 0.5 0.5 0.5 0.5 0.5 0.5 
##$TPOFFS= (0..7)
0 0 0 0 0 0 0 0 
##$TUNHIN= 0
##$TUNHOUT= 0
##$TUNXOUT= 0
##$USERA1= <user>
##$USERA2= <user>
##$USERA3= <user>
##$USERA4= <user>
##$USERA5= <user>
##$V9= 5
##$VALIST= <valist>
##$VCLIST= <CCCCCCCCCCCCCCC>
##$VD= 0
##$VDLIST= <DDDDDDDDDDDDDDD>
##$VPLIST= <PPPPPPPPPPPPPPP>
##$VTLIST= <TTTTTTTTTTTTTTT>
##$WBST= 1024
##$WBSW= 4
##$XGAIN= (0..3)
0 0 0 0 
##$XL= 0
##$YL= 0
##$YMAX_a= 280647
##$YMIN_a= -332214
##$ZGOPTNS= <>
##$ZL1= 120
##$ZL2= 120
##$ZL3= 120
##$ZL4= 120
##$ABSF1= 10
##$ABSF2= 0
##$ABSG= 5
##$ABSL= 3
##$ALPHA= 0
##$AQORDER= 0
##$ASSFAC= 0
##$ASSFACI= 0
##$ASSFACX= 0
##$ASSWID= 0
##$AUNMP= <proc_1d>
##$AZFE= 0.1
##$AZFW= 0.1
##$BCFW= 1
##$BC_mod= 2
##$BYTORDP= 1
##$COROFFS= 0
##$CY= -3
##$DATMOD= 1
##$DC= 2
##$DFILT= <>
##$DTYPP= 0
##$F1P= 0
##$F2P= 0
##$FCOR= 0.5
##$FTSIZE= 0
##$FT_mod= 4
##$GAMMA= 1
##$GB= 0.15
##$INTBC= 1
##$INTSCL= 1
##$ISEN= 128
##$LB= 0.25
##$LEV0= 0
##$LPBIN= 0
##$MAXI= 10000
##$MC2= 0
##$MEAN= 0
##$ME_mod= 0
##$MI= 1.114404
##$NCOEF= 0
##$NC_proc= 0
##$NLEV= 6
##$NOISF1= 3.799351
##$NOISF2= 2.8
##$NSP= 1
##$NTH_PI= 0
##$NZP= 0
##$OFFSET= 14.38212
##$PC= 1
##$PHC0= -1548.756
##$PHC1= 4.192209
##$PH_mod= 1
##$PKNL= yes
##$PPARMOD= 0
##$PSCAL= 0
##$PSIGN= 0
##$REVERSE= no
##$SF= 200.129724274929
##$SI= 16384
##$SIGF1= 3
##$SIGF2= 2
##$SINO= 400
##$SIOLD= 16384
##$SREGLST= <1H.CDCl3>
##$SSB= 0
##$STSI= 0
##$STSR= 0
##$SW_p= 3205.1282051282
##$SYMM= 0
##$S_DEV= 0
##$TDeff= 0
##$TDoff= 0
##$TI= <>
##$TILT= no
##$TM1= 0
##$TM2= 0
##$TOPLEV= 0
##$USERP1= <user>
##$USERP2= <user>
##$USERP3= <user>
##$USERP4= <user>
##$USERP5= <user>
##$WDW= 1
##$XDIM= 8192
##$YMAX_p= 0
##$YMIN_p= 0
$$ End of Bruker specific parameters
$$ ---------------------------------
##NTUPLES= NMR FID
##VAR_NAME=  TIME,          FID/REAL,        FID/IMAG
##SYMBOL=    X,             R,               I
##VAR_TYPE=  INDEPENDENT,   DEPENDENT,       DEPENDENT
##VAR_FORM=  AFFN,          ASDF,            ASDF
##VAR_DIM=   8192,          8192,            8192
##UNITS=     SECONDS,       ARBITRARY UNITS, ARBITRARY UNITS
##FACTOR=    0.0002768,     1,               1
##FIRST=     0,             0,               0
##LAST=      2.2672688,     0,               0
##MIN=       0,             -332214,         0
##MAX=       2.2672688,     280647,          0
$$ Real data points
##PAGE= N=1
##DATA TABLE= (X++(R..R)), XYDATA
0 0 0 0 0 0 0 0 0 0 0 0 0 0 0 0 0 0 8 -8 8 -8 8 -12 16 -16 16 -24 24 -29 32 -38 44 -50 55 -62 70 -80 90 -99
38 -99 111 -122 138 -153 168 -186 206 -227 250 -274 302 -333 367 -407 447 -494 547 -607 677 -758
58 -758 854 -969 1113 -1289 1521 -1838 2290 -2997 4216 -6746 14064 -80776 -332214 -203764
72 -203764 -107417 -69677 171648 280647 45227 -49764 37359 -50914 -122089 19025 7033
83 7033 -144322 -51751 111318 63386 66303 156284 23858 -158135 -93541 -34803 -101595 -19448
95 -19448 118579 55699 14864 121371 81297 -79920 -87652 -74953 -156949 -75401 135779 159884
107 159884 85945 88664 -5422 -170867 -128388 6027 -1218 5579 85559 32329 -52227 32762
119 32762 91535 1115 -31429 -18966 -111705 -129928 25706 107719 76472 99605 75383 -74004
131 -74004 -123391 -45872 -43566 -48857 49729 83555 22124 44425 76909 -18272 -85366 -50280
143 -50280 -60981 -71307 37612 108482 51574 26486 34392 -37581 -75555 -8115 1438 -50792
155 -50792 -19147 28940 9915 39917 103578 48072 -52338 -69277 -80106 -95726 -5546 100601
167 100601 87945 48205 39533 -23364 -85847 -45618 -5020 -27941 -9374 39303 25776 17740
179 17740 58526 38174 -36330 -51277 -42471 -59911 -22850 53565 58579 29088 35040 15291 -37180
192 -37180 -36225 -15742 -39778 -39418 13018 37439 38633 61919 46124 -26620 -64528 -54279 -48538
205 -48538 -17703 46676 63136 30119 16566 6030 -25791 -30024 -9669 -20658 -33724 -5277
217 -5277 21920 29256 47610 48203 -1357 -45763 -49915 -45039 -27076 21176 50051 35668 21553
230 21553 14507 -10190 -26469 -19818 -23398 -31501 -10162 20861 33579 41405 38587 2256 -37888
243 -37888 -45690 -35445 -18995 12821 35904 29221 15987 11429 763 -12821 -15926 -21495 -30895
256 -30895 -19373 9726 31645 41622 37471 8371 -28949 -43583 -35388 -16966 8315 27447 26334
269 26334 15429 9470 3961 -5379 -13204 -20991 -28076 -20064 4114 27932 38590 32635 8447 -21320
283 -21320 -36268 -30912 -14080 4833 17859 18951 13909 10173 7882 988 -9814 -21094 -27821
296 -27821 -20356 711 24238 35755 29024 8122 -16676 -29911 -26463 -12095 3155 11366 13247
309 13247 11678 11232 10671 5240 -6542 -20262 -27472 -20472 -512 21127 32334 26154 6986 -13496
323 -13496 -23914 -21168 -10311 528 6363 8051 8998 11925 13165 7206 -5211 -19495 -26028 -19259
337 -19259 -866 18932 28084 22389 6319 -10405 -18926 -16927 -8332 -1793 2373 4622 7707 12595
351 12595 15134 8884 -4790 -18816 -24200 -17931 -1163 17101 24466 17918 5366 -7246 -14475
364 -14475 -12514 -6797 -3824 -2312 2325 7603 12684 16142 10120 -4997 -18139 -21544 -16213 -1419
378 -1419 15272 21189 14395 4983 -3899 -11292 -10516 -5782 -5523 -5166 866 8212 11970 14868 10524 -5062
394 -5062 -17312 -18265 -13128 -2711 11706 17565 10908 4691 437 -6140 -9186 -6334 -7255 -8751 -635
409 -635 9974 13325 14564 10199 -5250 -18264 -16580 -9676 -2305 10062 16251 8815 1825 1743 -2820
424 -2820 -7845 -5110 -5512 -9936 -3473 8858 12348 12265 11522 -744 -15573 -15550 -8988 -5471 4321 14563
440 14563 10885 3823 4699 -90 -9700 -9366 -6105 -9147 -3018 11428 13632 8534 7613 -627 -14388
455 -14388 -13213 -3972 -2585 621 9812 8118 1068 5862 6177 -4449 -9143 -7268 -11720 -8961 8413
470 8413 16088 11361 9630 2878 -13556 -17588 -6705 -2663 -19 10893 11846 2071 1819 3987 -5187
485 -5187 -10128 -4100 -5335 -7319 4453 12669 6331 5447 6550 -5342 -12585 -5324 -4066 -7255 2705
500 2705 11172 6087 5908 9872 -1188 -13670 -10426 -7854 -8273 5128 17590 10641 2877 2553 -6486
515 -6486 -15040 -5528 2400 -2407 952 8496 2811 -400 7974 4929 -7264 -7155 -5154 -10656 -4322
530 -4322 10880 11432 5621 8109 1701 -13009 -11470 -3444 -5547 -1587 10950 10655 2780 5345 2836
545 2836 -10383 -11485 -2491 -3652 -1523 10370 10079 171 1534 2918 -6003 -6108 948 -3523 -7835
560 -7835 1548 7165 3779 8433 10439 -3493 -13227 -8410 -8006 -6615 8559 16009 6584 2201 1715
575 1715 -8178 -11996 -2029 745 -3575 3062 8516 1750 1149 6183 -710 -9167 -4199 -2335 -6508
590 -6508 479 9251 4836 1860 6647 1033 -8096 -5408 -3433 -8417 -2816 9505 8761 5794 7212
605 7212 -21 -12690 -10381 -2787 -2604 3142 11319 6448 -1540 526 510 -5733 -2806 1247 -4407 -5481
621 -5481 3324 5541 3388 7246 5509 -6080 -9300 -4740 -5504 -2828 7024 9093 2978 3444 3242 -5388
637 -5388 -7975 -3228 -4082 -4005 4896 9056 4253 3325 2342 -5682 -8826 -2203 -292 -1693 3103 5636
653 5636 450 1023 4595 708 -4178 -3345 -4660 -7079 -360 7661 7195 5302 4559 -3178 -9388 -6166
669 -6166 -2055 -1557 2739 6942 3412 778 2640 288 -4716 -4258 -2927 -4346 -672 5760 5965 2942
685 2942 3241 -404 -5980 -4641 -1466 -2102 -766 3654 3811 2589 4048 2780 -3476 -6209 -5222 -4774
701 -4774 -1568 5553 7552 4616 2070 -673 -5558 -5394 -1520 -960 -684 2535 3519 2162 2955 3083 -1337
718 -1337 -4805 -4257 -4194 -2334 2937 6172 4621 2436 480 -2869 -4806 -2680 -1969 -1682 939 3942
734 3942 3418 3423 2719 -1245 -4743 -5186 -3719 -1638 2650 5399 4288 1771 433 -2003 -3495 -2762 -1569
751 -1569 -1441 97 2578 3554 3384 2841 -271 -4407 -5021 -3950 -1600 1646 4541 4404 2597 751 -1115
768 -1115 -3019 -3155 -2591 -1861 -190 2288 3655 3590 2866 166 -3208 -4646 -3969 -1571 1213 3325 3633
785 3633 2808 1038 -497 -2379 -2797 -2994 -2465 -617 1604 3836 3914 2687 407 -2522 -4312 -3866 -1972
802 -1972 640 2613 3798 2905 1587 -73 -1376 -2574 -3086 -2438 -1469 1154 3080 4167 3142 679
818 679 -1965 -4076 -4032 -2299 -177 2203 3084 2701 1959 456 -1011 -2318 -2830 -3017 -1687 542 2592
835 2592 3812 3249 866 -1478 -3552 -3768 -2409 -221 1705 2785 2734 2187 1036 -641 -2102 -3099 -2928
852 -2928 -1928 243 2460 3691 3314 1619 -1171 -3345 -3659 -2292 -890 1261 2112 2547 2061 1162 338
869 338 -1862 -2768 -3114 -2342 -13 2236 3696 3308 1600 -689 -2994 -3704 -2585 -1149 305 2130 2540
886 2540 2341 1752 850 -1469 -2856 -3122 -2375 -679 2257 3763 3213 1639 -91 -2256 -3077 -2325 -1131
903 -1131 -169 1122 2337 1993 1733 1447 -1262 -3164 -3171 -2725 -1066 1957 3964 3197 1424 -48 -2290
920 -2290 -3235 -1853 -677 -569 605 2098 2214 1910 1728 -262 -3198 -3396 -2446 -1654 954 3618 3262
937 3262 1725 536 -943 -3061 -2655 -1246 -1053 -189 2573 2571 1769 1663 85 -3306 -3510 -1591 -892 663
955 663 3204 3069 469 541 -169 -2055 -1973 -1134 -1876 -1477 1648 3088 2274 2639 1451 -2897 -4416 -2444
973 -2444 -1580 11 3163 3800 1077 590 53 -1932 -2793 -962 -901 -1160 1391 2994 1428 1534 1273 -1807
991 -1807 -3664 -1478 -789 -1171 1093 2726 927 1094 1835 -290 -2699 -2418 -1920 -2692 763 4170 3102
1008 3102 1558 985 -1832 -4489 -2341 113 -315 1596 2915 843 -535 1370 153 -2382 -1626 -699
1024 -699 -2314 -640 2832 2551 1385 2378 322 -3355 -3049 -1043 -1765 -584 3084 2723 1024 2146
1040 2146 891 -3508 -3306 -1365 -1268 17 3807 3215 332 379 210 -2997 -2043 443 -526 -1561 808
1057 808 1648 486 1886 2731 -870 -3114 -1895 -2174 -2088 2295 4197 1760 1420 1145 -2481 -3699 -1252
1074 -1252 -353 -1099 2015 3286 922 332 1441 -1364 -2912 -1089 -508 -1591 852 2681 649 256
1090 256 1473 -154 -2292 -983 -1068 -2715 -588 2850 2047 1561 2702 -510 -3936 -2985 -1042 -1385 1192
1107 1192 3938 2059 -8 417 -822 -2559 -1169 494 -1229 -916 1608 1198 430 2227 1215 -2098
1123 -2098 -1920 -811 -1873 -514 2305 2405 919 1568 719 -1990 -2311 -886 -1597 -946 2241 2773 1048
1140 1048 1134 619 -2520 -2800 -430 -474 -569 2023 1915 237 160 1114 -566 -1347 -529 -1359 -1878 597 2061
1159 2061 1521 1779 1430 -1391 -3020 -1806 -1144 -740 1598 2631 1105 157 707 -875 -2042 -941 -762
1176 -762 -1315 6 2005 1332 1045 1189 -787 -2296 -1347 -343 -551 445 1712 1004 717 1330 242 -1221
1194 -1221 -1640 -1324 -1857 139 2225 2422 1274 1100 -609 -2235 -1681 -465 -68 558 1414 957 59 673
1212 673 475 -1192 -1453 -1353 -1426 -618 1217 2067 1245 651 3 -1596 -1881 -709 -395 -427 750 1163 996
1231 996 1047 834 -779 -1784 -1485 -1320 -168 1364 2227 1359 644 47 -1184 -1327 -410 -336 -358 363 1051
1250 1051 978 1239 778 -591 -1605 -1809 -1214 -534 1008 1990 1566 809 -250 -586 -1504 -737 -296 -396 246
1269 246 850 1230 1185 826 -307 -1246 -1719 -1318 -234 688 1656 1180 594 271 -279 -995 -896 -626 -592 18
1289 18 569 1048 1480 766 -21 -1356 -1898 -1188 -494 544 986 1062 296 53 -60 -629 -714 -1023 -636 -45
1309 -45 610 1399 1404 875 -290 -1030 -1663 -1308 -155 573 1309 1332 696 621 -151 -450 -724 -1085 -1136 -177 732
1330 732 1342 1502 952 -42 -1065 -1856 -1162 -322 339 857 829 961 692 255 -341 -1110 -1370 -919 -526 516
1350 516 1220 1413 1043 134 -750 -1358 -1319 -451 -239 492 852 946 572 447 -286 -408 -976 -822 -278 266 1491
1371 1491 1615 955 210 -986 -1460 -1121 -816 -264 341 819 407 663 462 183 -779 -1386 -1138 -495 99
1390 99 1528 1485 865 616 -225 -1090 -769 -591 -175 -34 828 735 721 627 285 -838 -1418 -1014 -946 86 1151
1411 1151 1425 991 175 -161 -1022 -1248 -439 -373 -235 482 921 669 741 269 -526 -1263 -887 -831 -287 700 1347
1432 1347 809 745 51 -1221 -984 -336 -466 -742 588 1210 1018 632 645 -902 -1437 -1084 -539 -348 967
1451 967 1613 633 138 -83 -289 -1210 -418 -263 -931 111 1021 590 598 1211 -344 -1503 -1001 -552 -733 444
1471 444 2196 983 222 149 -331 -1468 -367 377 -371 -102 1125 649 118 628 138 -1405 -1019 -363
1489 -363 -619 -22 899 869 -6 378 472 -898 -1209 113 -1076 -808 1205 1491 396 1020 340 -1718 -1989
1508 -1989 -326 -56 211 1658 1333 -105 -279 455 -682 -739 766 -240 -996 59 1013 288 445 892
1526 892 -799 -1768 -566 -536 -711 622 1573 382 147 737 -480 -1659 -521 -175 -1137 588 1922
1543 1922 987 54 51 -705 -1702 -7 845 -284 44 898 293 -438 1246 614 -953 -861 -238 -1121 -549
1562 -549 1825 1467 506 664 -284 -2155 -1170 357 -213 148 1776 670 -708 536 146 -1297 -842
1579 -842 96 -414 -475 1352 927 -318 324 298 -1088 -670 412 -144 -982 558 1055 163 947 1043 -1037
1598 -1037 -1866 -418 -711 -761 1493 1987 107 -295 -218 -1257 -1237 488 601 -398 404 1081 -327 54 960
1617 960 -212 -1237 -184 12 -818 149 1565 374 -114 598 -466 -1446 -585 -124 -618 156 1589 1065
1635 1065 66 442 -599 -1868 -895 254 -292 500 1669 135 -674 -109 126 -1131 -309 426 -526 -431
1653 -431 866 600 231 780 494 -1202 -1010 -401 -716 264 1407 1243 -64 108 -133 -1465 -912 304
1671 304 -242 -205 1034 739 -255 246 138 -885 -1058 -31 18 -420 806 692 -129 26 203 -416 -809
1690 -809 -154 -309 -773 417 1257 507 224 478 -854 -1594 -487 135 133 847 872 92 -556 235 -431 -781
1710 -781 -60 -153 -340 202 962 506 413 299 -454 -992 -498 -83 -195 312 859 663 -274 113 2 -610 -724
1731 -724 -222 -247 305 1157 726 154 -62 -357 -1053 -731 -221 128 100 787 521 25 164 -49 -466 -404 -280
1752 -280 -397 92 682 814 511 158 -249 -1031 -886 -29 172 386 565 535 -88 -224 70 -419 -667 -252
1772 -252 -35 -25 711 606 412 5 -160 -523 -975 -167 302 328 514 442 391 188 -22 -143 -815 -487 -398 95
1794 95 547 630 493 -95 -322 -906 -510 -462 244 554 245 423 288 400 93 -428 -441 -941 -420 175 407
1815 407 738 658 91 -294 -582 -784 -422 29 372 237 308 333 291 228 -348 -538 -393 -460 -104 315 704 557
1837 557 448 -339 -421 -471 -336 -132 144 229 194 331 414 403 -25 -669 -911 -566 -38 350 839 758 276 -699
1859 -699 -224 -615 -232 -42 -170 173 253 518 417 279 -90 -713 -777 -344 -54 402 724 528 195 -274 -459
1880 -459 -282 -382 62 167 26 267 484 520 -118 23 -385 -788 -490 45 391 615 565 104 -24 25 17 -438
1902 -438 -297 -176 -172 259 805 724 -15 -16 -354 -935 -567 50 294 306 412 32 -162 -103 -219 -481 -350 -103
1924 -103 108 -97 816 564 336 -12 -460 -774 -622 -228 72 329 523 548 37 -51 88 -417 -766 -21 113
1945 113 176 686 988 209 -570 -172 -624 -536 244 502 159 497 526 -180 -374 234 -331 -734 -335 17 -119
1966 -119 432 1099 163 -287 -143 -513 -992 79 560 114 276 847 42 -529 83 -193 -536 19 514 -22
1986 -22 53 542 135 -550 -70 -128 -641 -257 280 142 -171 1066 361 -254 254 227 -1036 -853 368 -165
2006 -165 469 1035 864 -749 -306 -302 -1047 -497 962 582 79 610 507 -614 -557 230 -750 -828 246 -83
2026 -83 -521 678 895 -247 -275 398 -723 -939 375 269 30 586 1234 -18 -470 172 -1027 -1227 244
2045 244 813 155 734 955 -381 -1070 -52 -173 -711 195 472 -383 -140 583 220 -114 408 -137 -1153
2064 -1153 -475 378 -432 190 1547 396 -702 -256 -359 -1260 -446 962 128 210 1138 247 -1061 -284
2082 -284 409 -738 -68 955 161 -303 497 502 -866 -28 355 -557 -549 351 166 -458 920 1286 -315 -271
2102 -271 193 -1387 -1128 476 914 248 763 838 -843 -362 -140 -408 -509 535 343 -768 330 719
2120 719 -584 -340 832 -736 -932 -10 666 -483 384 1213 -66 -299 164 -92 -1004 289 609 -96
2138 -96 601 1317 -271 -572 -170 -511 -1101 45 905 144 -20 532 12 -848 241 462 -686 -271 459
2157 459 -136 -367 780 556 -572 169 -599 -1047 -201 605 368 43 842 358 -861 -133 172 -961 -686
2176 -686 480 451 84 1017 585 -585 -668 -118 -363 -498 680 279 -166 726 579 -335 -147 204 -335 -853
2196 -853 108 251 100 613 759 -265 -804 -429 -494 -508 503 501 -12 242 726 -154 -426 158 -195 -716 -187
2217 -187 361 226 293 733 12 -376 -255 -362 -278 -164 181 209 402 683 128 -488 -230 -129 -1009 -248 438
2238 438 469 359 688 50 -386 -337 -317 -310 62 206 330 75 554 23 -213 -231 -665 -359 -487 278 477 197
2260 197 113 357 -386 -512 -212 -116 -200 -6 -37 272 470 265 -111 -527 -171 -307 -309 340 261 210 459 258 50
2283 50 -228 -432 -159 -161 -161 222 280 416 236 173 -286 -529 -556 -597 86 124 198 536 436 -100 -224 -273 -565 -133
2307 -133 49 79 532 178 382 54 -364 -531 -637 -621 12 188 372 477 339 -4 -254 -248 -216 -326 -316 -8
2329 -8 383 349 270 -11 -195 -493 -442 -274 -212 -145 314 535 243 84 -174 -289 -338 -296 -280 17 185 387 500
2352 500 61 35 -369 -409 -402 -107 469 337 394 616 300 89 -238 -59 -501 -629 -227 220 527 550 349 72
2374 72 -641 -677 -100 -325 303 539 341 400 327 -70 -163 -286 -289 -224 65 290 364 584 93 111 -350 -548 -298
2397 -298 -375 37 182 208 107 492 -87 -460 -266 -303 -472 -241 309 66 606 622 58 -435 -487 -406 -580 73
2419 73 225 -112 273 411 231 -190 -271 -345 -218 -210 387 216 21 214 344 -211 -479 -290 -140 -533 132 152
2441 152 149 392 561 56 -322 -274 -655 -506 351 431 320 340 336 -323 -491 -81 -250 -221 162 450 -266 293 460
2464 460 48 -323 -171 -264 -783 -80 595 235 126 706 -385 -480 -116 102 -504 38 669 210 444 492 -204
2485 -204 -575 -418 -391 -766 121 634 148 -52 592 149 -384 -150 321 -834 -382 105 111 125 646 607 -462
2506 -462 -247 -366 -480 -493 771 700 9 553 453 -776 -465 20 -294 -212 559 604 38 445 414 -465 -564
2527 -564 231 -260 -424 123 371 -268 711 262 -321 -401 -11 -391 -807 282 828 485 519 811 -495 -886
2547 -886 -309 -520 -651 507 853 -74 -215 820 -297 -613 190 19 -614 -192 396 64 87 864 255
2566 255 -461 34 -195 -842 -95 683 265 354 416 -169 -843 -180 37 -526 -62 1031 647 44 533 -11
2586 -11 -987 -59 208 -526 -40 500 2 -252 498 517 -491 -419 -183 -764 -420 484 497 47 606 725 -654
2607 -654 -938 -275 -725 -137 940 622 299 432 130 -787 -695 55 -77 -346 413 471 -186 486 639 -192
2627 -192 -331 193 -323 -743 219 836 -115 260 631 -138 -672 -163 -18 -608 170 842 295 86 472 -316
2647 -316 -691 82 -146 -331 42 475 115 86 335 58 -493 -9 -120 -870 -416 537 226 226 713 357 -682
2668 -682 -165 50 -528 -20 581 407 -8 748 256 -802 -476 -117 -100 -206 571 296 -235 464 139 -657
2688 -657 -429 -112 -361 -427 411 444 49 608 517 -215 -475 -133 -457 -569 412 335 233 130 162 -489 -738 -155
2710 -155 -441 -284 168 531 -173 257 -17 -243 -354 -150 -36 -565 265 364 215 -110 245 -78 -497 -390
2730 -390 -99 -404 -90 339 121 322 341 -116 -666 -205 -221 -240 249 537 480 122 240 53 -178 -450 22
2751 22 -44 284 430 83 383 105 -69 -477 -512 -209 -123 16 214 643 301 201 92 -30 -421 -236 -446
2772 -446 283 296 224 316 299 -125 -444 -409 -294 -158 93 196 267 264 386 138 15 -331 -407 -321 -370 354 375 209
2796 209 240 -49 -274 -522 -99 21 -387 250 657 299 395 230 4 -499 -260 -420 -222 167 318 396 364
2817 364 139 28 -392 -249 -195 -233 -41 255 200 -63 13 37 262 -477 -351 -329 293 310 408 297 -13 -377 -213
2840 -213 -373 -409 -8 -187 103 381 324 184 34 -246 -566 -334 205 43 375 469 399 71 27 -191 -336 -327
2862 -327 -22 245 193 406 226 37 -12 -325 -565 -413 -209 -138 356 331 47 -31 53 -306 -714 -333 -346 -481
2884 -481 363 507 655 47 231 -4 -573 -84 -332 -158 43 517 411 319 151 12 -332 -77 -403 -538
2904 -538 190 730 77 487 173 -17 -581 -112 -111 -14 27 441 187 272 142 -68 -292 -136 -200 -186 153 386
2926 386 191 412 202 -113 -160 -241 -45 -199 56 303 158 -26 119 174 -352 -356 -313 -6 -24 318 379 139 240
2949 240 366 -506 -446 111 -274 -53 351 452 133 56 322 -287 -359 212 -424 -184 240 305 -105 312 326 94
2971 94 -194 -124 -243 -32 11 485 221 140 347 -104 -634 -52 -54 -184 393 448 176 160 360 -177 -357 -104 -166
2994 -166 -57 39 387 -17 18 255 -174 -486 -286 -169 -576 167 237 390 97 306 152 -763 -530 -136 -353
3015 -353 -5 375 370 -42 5 140 -426 -426 108 -243 5 480 240 82 269 238 -392 -329 153 -549 -211 366
3037 366 408 81 205 66 -584 -647 28 -137 -228 382 573 -33 347 35 -593 -468 80 -22 -435 366 631
3058 631 -132 17 313 -148 -589 -6 -268 -505 383 483 47 295 453 -173 -586 -277 93 -417 -7 673
3078 673 -8 79 230 -149 -593 -408 87 -152 92 443 386 -288 182 -44 -457 -378 -87 -453 -327 593 40
3099 40 -59 523 190 -366 -374 21 -472 119 456 569 162 -53 117 -611 -415 38 -56 -178 434 407 -32 150
3121 150 82 -437 -344 -23 -386 -170 151 166 0 268 104 -343 -554 -229 -264 -390 244 368 145 166 307 -324
3143 -324 -617 -50 -130 -214 202 317 -101 42 316 -84 -327 -178 -276 -118 363 457 268 139 213 -98 -363 -105
3165 -105 -453 -149 -28 286 229 -18 597 -167 -367 -221 -72 -232 -19 614 65 79 125 -325 -453 -142 122
3186 122 100 -207 399 408 -62 108 149 -98 -168 -332 -438 -52 226 407 164 361 155 -420 -96 -130 -160 -294
3208 -294 320 434 261 -52 -61 -269 -576 -188 -23 -335 10 29 7 312 220 109 -168 -25 -122 -167 176 326
3230 326 0 148 176 -159 -470 -308 -108 -101 116 212 189 108 400 -98 -483 -182 -167 -209 199 278 231 213 203 -177
3254 -177 -134 -445 -119 107 108 411 202 80 376 249 -117 -41 -249 16 -55 1 132 52 281 -11 -253 -450
3276 -450 -389 -8 -86 39 369 290 351 -81 -174 -356 -349 -146 -202 210 250 -18 352 53 -349 -259 -245 -219 -290 200
3300 200 403 343 165 29 -382 -213 -185 -185 36 108 331 300 69 -85 -238 -192 81 -82 80 106 -28 432 205
3323 205 206 -111 -404 83 27 -66 210 106 376 85 145 -76 -48 -193 -404 -44 -196 67 138 -156 134 -179
3345 -179 -103 -9 -376 -300 82 103 287 232 7 -27 -242 -186 -273 -47 265 64 295 193 135 402 -613 -476 -289
3368 -289 26 -123 28 388 -30 250 38 -323 -146 -215 -359 121 -132 247 121 -96 -47 -198 -454 -222 -61
3389 -61 119 23 133 122 527 136 -495 -190 -246 -293 -92 122 36 375 401 164 -260 -261 -506 -287 -289 194 355 232
3413 232 354 163 -56 -249 -178 -67 -176 191 403 54 26 126 -85 -269 -423 -55 22 69 351 169 243 -54
3435 -54 189 -129 -342 -100 -232 -290 410 376 105 57 51 -308 -233 -158 -172 -4 221 189 217 416 267 -67 -446 -247
3459 -247 -291 -88 95 149 91 445 -94 -29 -411 -114 -312 38 284 404 124 267 188 -278 -110 -184 -271 -112
3481 -112 308 308 -110 132 578 -234 -413 -71 -129 28 313 211 386 169 261 -225 26 -134 63 -285 75
3502 75 -53 25 181 236 80 -580 -289 -101 -441 469 219 414 347 203 -257 -344 -201 -71 -214 54 352 122
3524 122 -27 271 -205 -381 -230 -312 -431 -19 589 357 21 1 -171 -446 -212 -266 130 -21 343 544 57
3545 57 254 -170 -336 -64 -42 33 -141 258 340 -106 -40 126 -347 -420 -334 -140 -131 97 131 399 388 344 -435 -187
3569 -187 -132 38 -387 174 232 -64 -129 57 -242 -548 -87 186 22 216 333 227 80 232 -191 -347 -164
3590 -164 -130 123 208 378 188 252 105 108 -178 -349 -148 -192 257 552 221 202 60 51 -309 -238 -25 -203 96
3613 96 182 304 -17 339 93 -474 16 -61 -99 -24 187 48 -95 -39 327 -282 -176 -48 -91 185 376 272
3635 272 202 96 158 -253 -208 -17 -8 247 -56 41 20 113 -132 -253 -408 -118 -324 -13 79 273 114 36 -28 -270
3659 -270 -325 -287 37 -301 292 103 205 20 139 -103 -384 -272 -65 220 127 413 174 -12 418 -42 -298
3680 -298 -37 175 -263 284 102 139 -39 229 -355 -411 -263 -112 -162 318 283 27 205 -13 206 -364 -29
3701 -29 199 -325 -13 137 166 -3 106 72 -164 -9 -310 -310 -111 283 147 223 262 -161 -422 228 -324 -232 -177
3724 -177 201 217 79 36 -11 -323 -54 -3 -208 -54 420 -27 156 74 102 -71 -409 -219 -229 -208 -24 374 51
3747 51 202 -26 -404 -303 -173 -235 25 -158 472 354 76 -37 -81 -317 -274 107 -73 134 86 319 57 85
3769 85 -111 -139 -330 -219 10 272 173 480 364 -145 -79 -251 -308 -192 -203 -17 182 33 189 -53 86 -149
3791 -149 -183 -331 -170 52 117 150 450 270 -129 -272 -194 -121 -140 -205 -159 84 166 -342 -243 -258 -244 -145 -243 196 -121
3816 -121 312 -65 109 247 -146 -213 -180 -132 54 67 152 450 275 153 -37 -200 -330 92 85 333 -187 353
3838 353 -173 -53 -346 -257 -195 -189 -40 206 283 291 70 -108 -309 -333 -196 -202 -155 263 207 125 15 413 -47 -218
3862 -218 -32 -219 -147 43 323 237 64 -94 -44 -90 -51 -237 -205 59 329 405 114 -92 293 -186 -112 -257 119
3885 119 109 161 53 -23 121 -8 -276 -163 -131 -212 37 163 65 168 -83 39 -211 -366 -126 -65 -136 231 397
3908 397 287 182 -62 -150 -223 -322 96 -166 -44 110 189 244 -4 -58 -343 -185 2 -77 -220 230 146 219 184
3931 184 -198 -348 -287 -362 -50 -26 64 212 351 -241 -23 -127 -254 -566 -7 -41 103 20 119 46 -39 -107 -77 -326
3955 -326 -69 17 14 61 131 122 -344 -159 -353 169 77 111 371 -19 -172 195 -90 -274 -155 -73 71 -164 283
3978 283 286 141 84 3 -57 -272 -236 -45 62 71 225 -290 -41 93 -375 -128 -335 -161 88 130 103 229 -27
4001 -27 -115 -201 -38 -218 -515 -174 -34 588 349 252 149 -223 -280 -270 -37 -221 293 238 86 -17 282 -209
4023 -209 -429 188 55 65 23 -29 218 116 247 -213 -279 -176 -32 -455 454 202 199 251 194 78 -424 -157 115
4046 115 -83 121 371 143 -126 28 91 -22 -257 210 -38 207 59 132 -22 332 68 -430 -105 -179 -145
4067 -145 36 206 301 173 116 154 -186 -100 -164 -245 5 546 196 27 14 -5 -274 -167 -55 -54 -44 -139 319 -31
4091 -31 111 125 -116 -278 -20 168 -20 -151 147 3 243 7 -168 -186 -13 92 -325 320 374 -9 179
4112 179 9 -83 -291 233 -198 -300 62 120 94 74 -58 -78 -132 -374 200 -67 -163 502 118 -83 203 -1
4134 -1 -373 -193 139 29 -68 118 60 -142 261 86 -463 -215 -32 -388 59 247 78 -9 -232 59 -269 -88
4156 -88 136 -229 -45 111 -12 -97 36 33 -141 -81 -105 -209 -16 -253 365 5 23 59 42 12 -12 147 181 102
4180 102 176 192 -72 84 -23 -229 -94 -270 -118 212 221 -205 77 247 -105 -177 -52 -142 -144 72 169 150 -34
4203 -34 102 -159 -220 -34 22 -291 318 -97 84 53 28 -324 -325 62 -9 -65 -230 59 160 144 -102 -64 -223 -202
4227 -202 114 -89 -73 462 185 -103 19 124 -94 -167 82 97 -59 -19 129 100 67 97 -450 -221 37 19 -41
4250 -41 178 230 197 178 31 -264 -192 -73 -163 98 191 -13 66 -156 -55 0 -131 16 199 186 266 269 33 -35 -187
4275 -187 -347 -121 121 -78 -33 207 233 -129 27 -22 -111 88 -35 -228 69 297 139 117 336 14 -228 -235
4297 -235 6 101 -44 35 -147 73 21 -16 103 83 -52 -341 -229 1 37 226 54 -67 -60 -317 -533 -149 -50
4320 -50 71 83 202 306 -191 -203 -211 -53 -94 -119 -48 -13 408 311 -159 -14 -229 -92 64 -269 -77 -170 113 67
4344 67 -39 117 -165 -153 -138 71 141 -8 118 73 105 -201 164 -111 10 -40 -75 -73 226 50 18 334 33 -134
4368 -134 -134 31 11 47 53 99 421 -148 22 22 1 37 -218 199 16 164 221 296 17 38 -164 29 287 -86 145
4393 145 -200 -89 205 -218 -257 -111 471 -80 103 76 77 -204 14 -26 -91 -118 -99 -5 -127 349 138 -53 104
4416 104 87 -189 -370 150 56 225 3 158 -400 -88 125 -199 -50 -214 -111 239 61 5 -181 -31 132
4437 132 -204 -58 -79 115 -35 102 15 208 -220 142 -192 -277 -79 -365 -380 66 67 -318 223 103 -169 -201
4459 -201 -311 174 155 79 335 261 52 -77 -61 -168 14 157 -167 -44 28 330 -146 -371 7 -228 -42 87
4481 87 167 220 288 15 275 134 2 -195 -119 131 14 -258 99 -1 4 -25 -28 -192 -456 175 -153 -200 36 126
4505 126 -4 -119 22 -346 -353 127 176 -198 -45 17 -338 237 -179 -166 -345 -206 -83 -9 134 253 -353 140
4527 140 -9 -35 -207 -19 -73 79 113 129 -125 -33 90 8 -318 -75 6 -236 20 329 -57 -215 322 58
4549 58 -311 -250 -116 10 43 217 -137 -308 95 33 -214 -188 -101 58 -88 172 91 -252 57 238 -177 -177 -234
4572 -234 56 -41 209 202 -245 335 -255 -330 -146 201 11 -145 15 290 -369 117 85 -408 158 -53 201 -79
4594 -79 271 42 -177 195 58 -119 -219 -126 -71 -35 9 343 -90 -46 54 -180 -222 65 264 16 134 246
4616 246 -82 -27 37 -87 -346 -87 128 -186 -2 121 -43 -161 334 -330 -146 -161 -73 141 -161 205 -56
4637 -56 -86 288 12 56 -154 -289 163 -86 -148 -102 -37 49 -30 81 -32 -270 -364 -200 626 66 -169 92 -125
4660 -125 -120 35 53 64 176 178 447 -148 224 -46 -382 -204 111 117 57 236 425 64 77 -47 -351 -81 -16 -70
4684 -70 7 65 170 -59 69 -114 -289 -95 91 -119 224 109 148 102 -191 115 -41 -74 -208 312 -216 -42
4706 -42 242 40 8 48 -226 -390 -101 -91 -109 -61 42 185 133 39 -30 -165 -181 -33 -7 273 225 198 64 -134
4730 -134 -22 -55 -246 139 -104 -125 -96 -196 -219 21 -206 -151 95 -33 257 -136 193 -177 123 13 122 -30
4752 -30 -107 66 52 -213 176 280 337 24 -270 32 -200 144 65 -27 262 106 -48 225 56 10 -165 -263 -58
4775 -58 11 99 389 -81 -63 -174 -406 10 322 -72 -14 30 197 -119 211 98 211 -104 -52 -75 96 218 319
4798 319 23 -156 181 -174 -276 -175 -78 -318 264 -123 188 197 100 19 -169 -159 145 294 -287 -42 -131 74
4820 74 -39 -187 -64 -215 -226 -115 -21 -46 68 33 -11 -37 -93 -96 -321 -180 126 58 65 197 173 -265 75 -330 -169
4845 -169 25 -38 72 -95 -118 -15 -123 -63 -234 -31 -105 103 -34 69 -185 230 80 -130 -96 -8 -302 -120
4867 -120 228 -59 76 -119 -224 -112 273 -21 -139 35 84 -7 -182 62 -155 -30 -84 -307 134 -229 -13
4888 -13 82 160 97 21 -237 38 274 -97 115 189 -22 -25 54 -129 -163 -162 116 60 378 176 311 189 129 -153 -130
4913 -130 -19 -79 -12 37 -20 -107 -28 -5 -5 92 122 -3 -125 -185 -39 6 29 -301 -131 10 -203 -285 136 -163 -150
4938 -150 -192 309 23 172 -2 -296 -61 351 -90 -16 -111 9 9 -213 45 -284 -278 -82 -123 21 -54 246 -87
4961 -87 166 -118 -171 12 140 349 17 58 -22 -49 33 253 17 -207 95 131 36 99 -62 -118 -169 218 -184 -189
4985 -189 70 -10 78 -176 407 86 -41 -88 -83 18 -209 54 8 -85 219 68 -4 3 404 -275 -192 -170 274 -24
5009 -24 -124 123 -118 -15 -32 262 -128 -48 204 -85 113 159 77 160 230 16 -224 -31 24 -88 250 21 194
5032 194 70 36 161 -267 49 -108 89 -40 275 404 -84 -54 -97 -222 168 125 -86 -146 97 207 -351 -23
5054 -23 179 -73 -250 -10 -263 59 203 -4 -131 106 4 -124 -16 3 -37 -280 153 228 -178 -47 212
5075 212 -243 -82 76 -25 145 128 -58 -190 141 48 -435 -343 42 130 -233 440 -16 -115 194 121 -213 18
5097 18 63 123 -157 149 350 76 -188 8 -164 176 20 11 175 323 148 -112 137 -51 -185 -50 92 154
5119 154 35 80 585 -57 -181 79 -49 -20 -163 147 -57 20 443 41 -79 118 81 -143 -98 -30 -178 -7
5141 -7 267 264 34 -45 -58 -145 223 -60 -366 22 441 -259 -103 39 -61 -190 185 6 -105 119 73 -43 -70
5164 -70 -43 109 -16 -201 99 -125 -3 152 54 13 218 83 88 -185 211 -3 166 66 296 -31 -183 119
5186 119 -179 -349 172 23 -97 73 155 158 -223 3 113 -183 139 -139 138 95 -24 -223 -151 -84 -189 145
5208 145 37 121 -131 67 -3 -105 -64 233 -67 -231 6 -43 -134 79 295 115 -99 83 -256 -42 -408 102
5230 102 28 -277 131 -76 -325 188 246 -210 -163 -123 134 -293 78 237 97 -276 -5 -142 -132 144 195 84
5252 84 115 -360 -115 -10 -36 -215 -34 -122 77 -166 175 -16 -87 -152 -105 54 -27 14 -83 57 18 49 275 -7
5276 -7 -3 -218 -11 -134 -123 -177 23 4 -151 -82 -21 39 -71 -205 -18 113 -5 355 -72 33 41 -74 122 80
5300 80 36 -3 221 101 106 -362 142 74 28 -34 -188 67 -78 42 48 150 -180 52 36 -119 -106 -17 68 -73 -233
5325 -233 40 64 396 63 -334 188 44 44 -53 -150 -127 -249 102 -2 10 32 177 172 57 99 86 27 -136 -361
5349 -361 -92 172 194 252 131 -144 -122 12 -39 180 -76 344 11 78 159 -133 -94 -40 65 -14 -217 50 100
5372 100 281 26 43 -4 -49 -189 116 -148 8 -205 -30 40 132 243 27 -271 -318 -191 -26 -140 -42 138
5394 138 87 -157 -46 -170 -296 -45 -47 12 38 265 17 6 228 32 4 68 75 -214 -49 97 -69 -37 36 -355
5418 -355 -94 63 -101 418 -98 -165 -119 249 -106 -32 -177 19 -407 36 -85 106 69 -43 309 -45 24 -256
5440 -256 -42 -49 -75 -63 -113 -184 -28 -112 -119 -121 -59 -75 89 18 322 54 -119 31 -130 19 -164 -46 32 59 19 102
5466 102 40 -264 23 -295 -102 115 73 45 115 -58 60 80 72 113 -84 -316 -94 103 -10 246 236 -526 329
5489 329 -59 -13 -30 39 38 -60 -24 -68 -457 27 123 -89 -122 -54 28 -152 140 185 203 308 -67 -32 -69 -120 175 -188
5515 -188 203 105 -372 12 -160 254 44 -80 63 370 -25 -45 -159 226 -160 -176 -297 178 147 141 63 161 185
5538 185 -86 301 -50 21 284 -18 -132 59 132 128 -26 -3 12 58 22 475 231 83 -10 -161 -160 176 81 -222
5562 -222 68 28 -54 37 -7 -59 -20 244 213 50 247 -35 15 -95 21 -89 147 -193 -137 -125 -172 -55 -38 34
5586 34 -33 10 174 -263 32 -51 -291 239 57 -48 -10 -68 41 -174 -47 -139 -170 106 -3 -210 34 353 -12
5609 -12 109 8 -237 30 74 183 178 -104 154 72 -33 -77 6 -56 295 -200 -198 143 339 -264 -46 -84 -54 -220
5633 -220 170 113 -98 -103 -87 14 57 -21 -186 -117 251 109 -72 105 -48 -47 -427 -31 -15 -222 -272 222 -96 -156
5657 -156 22 106 -120 -90 -79 -44 -330 145 70 -176 88 28 -50 40 111 -156 33 292 -114 -246 285 120 -119
5680 -119 -132 -242 -20 -98 360 -225 316 215 150 -152 -110 70 -124 83 72 -16 -32 280 20 -146 -128 -11 -146
5703 -146 249 173 27 -21 -31 -183 -221 -163 -318 -216 -407 109 77 -203 -91 47 -128 -213 -61 -89 -157 5 26
5726 26 76 89 141 -91 187 -80 6 -279 82 -153 146 -79 82 218 25 -110 -205 27 64 248 -135 -194 94
5749 94 78 -26 116 167 28 -19 121 -101 264 -211 153 -167 64 -90 69 132 -167 -145 23 28 -20 -104 103
5772 103 -95 -15 -187 183 314 -10 219 -67 -227 9 33 -122 -360 200 38 20 29 -308 162 135 132 -20 161
5795 161 -189 -61 -86 337 65 -58 -140 2 -191 -176 54 -94 -73 53 -48 -71 -246 -122 -7 -62 124 193
5817 193 -225 192 92 -237 43 -186 -42 -97 -120 22 -186 330 60 -117 -167 -157 -437 -94 -114 -95 69 -217
5839 -217 217 -26 92 145 -3 -9 49 -187 37 88 265 -175 275 -104 30 275 -206 -40 -136 200 -50 64
5861 64 -358 -115 -213 -56 -14 127 88 14 110 393 -90 -106 -117 146 17 -277 66 42 228 85 16 -155 107
5884 107 -135 211 5 47 109 -120 -307 -91 -102 -303 191 -20 40 -117 46 43 156 -199 -272 -68 -336 -69
5906 -69 174 65 213 252 -16 18 71 -79 146 18 20 -200 326 -252 78 -51 -125 -311 -87 -305 -194 68
5928 68 18 -142 2 -60 -360 -126 -73 -66 -278 8 98 154 279 277 6 -146 -320 -24 52 179 -7 165 118 -31
5952 -31 -224 -69 -344 -258 69 7 317 -77 247 222 26 -43 16 -158 224 200 -79 -167 147 -124 -30 181 -3
5975 -3 -66 71 137 -96 -62 -317 222 462 -271 -30 -222 187 6 32 38 103 18 -16 38 102 32 210 -89 -87 -184 -102
6001 -102 35 13 -77 1 -154 -51 -234 354 212 -59 47 220 -348 -159 162 -148 -127 193 -131 37 316
6022 316 22 -130 -152 -109 -143 -212 108 -127 18 150 -36 -88 -239 -18 -76 20 -122 -38 128 -43 31 -16 -55 186
6046 186 -134 -179 290 46 -2 -71 103 1 -141 209 -158 -152 -69 376 -200 163 227 -86 -78 222 -30 -47 -207
6069 -207 155 -122 -135 65 -87 -61 -172 32 -320 -97 -52 -52 103 14 -59 -35 51 53 123 -9 275 13 213 110
6093 110 -50 -81 -577 16 -230 -32 352 -16 164 30 307 -145 199 -41 12 -277 98 -53 112 190 -127
6114 -127 -111 -59 25 -428 -185 236 123 -17 -192 14 -187 302 -149 -96 -194 135 71 236 22 76 -34 -279
6136 -279 77 -143 112 -165 305 -91 234 -280 -138 -126 166 -158 -169 126 62 -133 32 179 -77 -24 80
6157 80 11 -168 26 69 193 119 199 44 2 -14 -20 84 132 286 139 99 3 47 -56 57 -79 -164 75 -77 -91
6182 -91 -139 -51 29 -113 269 -97 -326 -28 48 -73 -140 16 -19 -340 -39 58 -110 -68 25 408 -77 127 30 -202
6206 -202 219 -125 -300 53 -34 -35 123 276 -248 55 67 207 -435 125 -5 143 354 -397 -383 -2 119 -117
6228 -117 -169 95 39 84 99 188 -93 76 -86 46 88 2 104 -125 113 101 37 136 -4 -191 22 -67 -5 139
6252 139 139 283 95 -105 -86 -39 23 -404 -22 -305 101 -238 -65 -19 -199 -312 -87 -68 70 273 74 68 -98
6275 -98 -16 -43 -112 -106 290 -264 -284 -96 54 53 48 -6 103 -161 -76 -85 -48 -166 204 52 -53 -111 -137 140 43 92 -25
6302 -25 153 396 14 -145 -171 62 227 -157 294 21 92 54 218 222 10 -54 -16 39 3 -60 82 -165 66 45
6326 45 -122 202 47 -130 192 51 -40 -92 34 -2 137 -238 -217 150 -85 -33 197 214 165 -210 96 -278 -66
6349 -66 108 -61 -219 -18 111 -54 306 62 147 -105 -69 27 -69 156 -139 -153 204 -195 37 -328 9 -238
6371 -238 82 -169 346 120 32 164 -282 339 -121 -106 -37 -14 215 157 -207 83 6 -46 -216 58 -20 -68 -152
6394 -152 -179 -159 -134 -299 -68 10 -51 -85 -130 64 -84 195 -125 114 -69 -53 -159 -108 -11 141 253 84 203
6417 203 -25 -78 -106 42 160 103 193 -139 -71 155 -95 -387 189 106 -274 -175 304 136 -88 -32 -347 -32 67
6440 67 105 -55 60 79 49 -15 185 98 54 109 281 130 231 243 -35 73 -117 -260 -261 88 -120 -27 -85 188
6464 188 -7 43 -115 -148 -21 -186 -227 -15 -26 143 176 -63 -56 -111 -98 -85 -99 -13 -163 190 -116 127 -225 136
6488 136 219 -23 -79 -139 -417 273 219 10 216 264 170 20 281 -254 -260 83 114 69 -1 45 -250 -177 56 -170
6512 -170 -13 303 227 25 -178 1 -84 -151 268 -96 -75 -66 281 -93 411 35 -13 -42 39 78 -190 -96 275 24
6536 24 77 5 -120 12 12 133 -16 29 -105 247 103 88 157 -449 34 31 -43 -7 -63 82 -222 114 -71 208
6560 208 -136 27 7 -145 -40 -71 2 -501 137 225 -140 30 -47 -101 52 -26 16 34 -109 -148 -94 68 -148 -240
6584 -240 324 236 157 -10 -59 -151 -2 134 -235 -274 -91 229 -214 -28 296 -375 -116 151 -80 155 -120 -102
6606 -102 -287 -340 -27 -230 31 208 -244 -65 70 -57 -130 109 187 -53 19 5 -207 -114 108 117 178 113 106 -130
6630 -130 -59 -2 -8 -209 -179 -91 364 -227 107 -153 132 -91 27 24 90 -174 8 24 50 -130 -435 -100 -95 -62 -104
6655 -104 -151 52 -169 -23 -52 -178 -163 116 -44 -149 125 -49 -44 -99 17 -321 18 335 113 -83 57 81
6677 81 19 50 34 17 91 229 130 -101 130 -47 -76 16 -58 60 -49 99 -18 -15 -35 -32 114 446 230 61 -85
6702 -85 -54 254 31 142 133 290 202 -141 175 -203 -64 79 -3 68 75 -179 -180 371 -122 -253 -98 74 25 249
6726 249 84 24 -28 -115 -86 -61 -119 -92 56 -177 234 -195 -63 61 -33 -49 -20 -51 69 -87 54 -356 -122 25
6750 25 79 -47 -154 -204 54 -28 63 110 -20 -185 98 -315 -79 -237 -147 -241 -84 80 209 224 54 -124 -79
6773 -79 6 69 34 317 -195 70 -35 95 314 -312 -87 -49 284 -147 26 -173 308 162 247 232 55 -64
6795 -64 29 -224 -26 137 119 88 -24 25 63 180 105 30 -25 -69 9 -101 -71 -205 26 49 -84 43 170 279
6819 279 45 -112 -186 -77 278 46 -32 262 121 111 -142 26 188 -29 122 -46 122 61 196 62 22 42
6841 42 68 -104 -213 -42 227 194 22 317 188 -32 -108 -113 -100 278 66 -57 37 -102 28 -156 -102 -30 -211
6864 -211 51 357 153 115 140 115 -159 135 -229 91 29 175 36 -87 58 22 -40 58 20 -39 -237 -245 -22 -190
6888 -190 -37 89 -55 145 26 -203 -107 221 -164 -234 149 148 -33 75 53 18 -238 -185 191 52 -28 87 100
6911 100 -7 14 16 -146 125 -75 -43 34 -107 167 -45 -155 -82 -45 -205 52 15 151 259 145 -39 209 387
6934 387 -418 128 -17 -36 73 -125 18 -68 -284 -105 -96 150 -156 145 35 25 199 -71 112 -226 -338 350
6956 350 -284 93 2 24 -134 -142 105 50 164 10 11 292 109 244 22 -210 79 -195 25 -75 228 -193
6978 -193 293 -1 3 -76 -143 -175 -212 -120 -33 -50 -100 -157 -59 -128 221 -44 12 173 221 -263 41 -43 79 -187 -374
7003 -374 25 -28 45 96 198 -150 17 46 227 -29 -53 233 75 -31 -259 154 97 77 -175 109 -60 -97 264
7026 264 -186 -186 -126 77 -205 -111 150 -46 84 -3 -240 27 -69 -33 98 -195 -198 149 97 -193 48 -103 -233
7049 -233 100 153 12 -112 65 48 -115 25 -3 -179 9 298 -28 240 83 70 -232 25 -287 154 81 164
7071 164 135 -308 28 -140 -134 135 -78 2 212 -23 86 -52 24 202 160 32 205 432 -183 -19 107 -383
7093 -383 197 176 -367 -39 252 -255 151 -130 -29 245 -46 145 -212 40 -138 -13 -141 -5 58 -46 299
7114 299 102 -433 20 -129 83 25 -268 190 238 -76 -15 13 -84 -32 -35 103 123 16 192 -10 -26 238 -45
7137 -45 9 -40 28 -142 18 -19 -291 -20 -272 -204 -71 -375 155 -173 132 -199 109 83 88 61 -14 -179 81 22
7161 22 -91 -95 -50 -75 -216 -14 -175 -118 258 -279 37 237 -161 -17 -248 -146 -39 -88 -277 57 43 -182 -209
7184 -209 101 91 -119 62 54 92 -220 157 154 20 44 149 248 -185 -156 79 -10 151 160 -222 1 -207 -306 -145
7208 -145 -161 -170 -434 81 125 174 -53 -170 189 164 -161 313 111 -91 102 27 -55 -137 -156 -332 -88 -211 21
7231 21 -61 -5 -121 196 79 -21 9 -196 104 34 -28 -91 36 -27 189 249 16 -196 -153 288 -16 -176 296
7254 296 -117 66 -85 149 -162 -38 124 -260 -21 228 23 164 -209 371 -246 24 -373 -41 193 -138
7274 -138 -29 14 -225 89 142 -59 14 -170 139 -217 27 -40 60 -137 -287 -308 131 -29 292 151 218 6
7296 6 -152 111 50 -279 -30 -180 52 -25 -381 -79 -71 -147 30 317 -166 -224 164 119 6 -69 -196 -178 -1 -154
7320 -154 -182 217 157 -98 24 -70 -201 89 -273 127 -121 -75 -99 -29 75 146 78 28 35 147 -20 79 -160 74
7344 74 59 129 164 199 -59 107 -48 -72 -286 -23 -84 133 -203 123 85 -88 198 -44 -74 105 203 11 5 15
7368 15 32 -511 206 -189 307 -150 2 109 -58 35 -104 -78 -109 -95 236 113 182 -17 -109 122 -5 -151 213
7391 213 228 136 176 107 -137 104 51 -81 -377 -292 76 -173 -105 -257 -113 -137 10 -37 -56 -59 -190 -60 -51 184 114
7416 114 -202 -141 -112 143 -192 -105 -165 88 198 102 271 298 100 48 -128 178 151 26 217 -50 -16 127 -247
7439 -247 145 -59 -290 166 -146 106 36 -29 77 268 -309 -13 -178 20 65 -47 88 115 31 -68 138 -190
7461 -190 29 -8 -87 -137 125 134 28 37 -104 -68 -356 -138 -84 -54 -140 -167 263 -15 469 30 71 -187 -116 103 170
7486 170 -165 108 275 -294 48 -58 -89 28 360 76 -136 -285 236 77 -244 -34 -60 -131 -9 108 -21
7507 -21 -111 52 10 -284 -23 264 -105 -26 -212 -6 103 119 46 9 5 316 321 -127 21 65 500 -33 -152 -102
7531 -102 44 129 31 141 112 -56 -10 -147 9 -17 -6 0 201 98 45 -7 102 -204 -41 -125 -204 51 199 -80
7555 -80 45 67 130 -106 350 -378 -51 150 175 317 -127 -62 -51 10 -205 -67 -275 -50 25 19 -204 178 226 -7
7579 -7 327 -50 -65 -21 47 60 -4 106 94 114 -10 67 -62 -78 -26 -105 -394 -75 -29 -140 -108 93 171 -131 -5
7604 -5 326 26 -55 -24 -239 -232 -73 261 98 -202 -123 -318 240 -121 -201 -16 52 -246 -139 29 -114 -292 155
7627 155 124 125 142 -88 -94 104 33 -46 25 -242 70 -92 -10 85 -78 -215 -199 -106 -125 163 112 4 -307 116 115 174
7653 174 47 213 195 -50 -146 -7 34 -43 184 -146 -60 88 -199 125 -40 -60 102 16 -83 -167 1 -361 85
7676 85 -28 -194 87 89 -141 -133 109 136 -39 26 65 -248 57 -67 -117 222 58 -538 -74 493 153 -119 185
7699 185 -281 39 67 -277 -259 21 121 17 98 340 -24 12 290 254 -3 -34 -163 195 236 -112 -211 -52 -47
7722 -47 4 -48 -3 -63 -41 64 147 133 -63 250 -109 -68 -87 14 -64 -184 29 51 -6 136 10 -110 -63 234 -20
7747 -20 -54 226 -103 -265 -105 43 -86 -324 -61 184 10 -22 68 -1 -268 -193 159 -38 237 259 48 -6 77
7770 77 -107 186 15 -37 17 -98 -48 -97 -50 246 227 77 -33 -67 -92 57 123 286 151 -141 284 -202 144
7793 144 90 -100 31 208 -46 113 147 381 -211 110 -137 106 76 314 -12 59 196 -5 -170 124 40 -228
7815 -228 -34 -148 -118 -164 1 102 124 107 -36 -119 45 170 -111 64 141 -23 91 -146 -101 -445 -67 -239
7837 -239 118 -11 180 62 157 -83 138 54 -173 -79 152 -255 -116 14 139 -68 -169 -185 -251 -110 -178 -49
7859 -49 -100 -51 39 -213 104 -33 -14 -94 -57 -19 120 -207 12 -80 -53 49 108 249 86 307 201 114 211 184 -370
7884 -370 -97 -113 77 14 -258 -88 202 71 -98 -191 -198 -395 -287 7 188 93 -19 287 52 11 -128 -273
7906 -273 96 238 -1 82 107 -47 -150 -30 -78 -153 -132 84 34 -36 18 107 -77 -124 63 235 -31 -146 23
7929 23 -207 196 20 348 -184 27 -231 -38 55 -113 93 14 184 -119 33 -184 -92 -260 264 -65 39
7950 39 -5 -37 -165 51 19 9 47 180 -169 -44 141 4 -126 -52 -227 -219 124 -122 -97 -201 151 224 62 242
7974 242 -25 -131 111 -19 234 -31 -51 -203 -177 -42 25 -52 203 41 304 331 -298 -64 -283 34 213 66
7996 66 -228 -94 -20 -85 -125 -142 -42 -332 81 32 188 -175 187 -101 -39 87 -246 82 38 26 -91 106 -22
8019 -22 113 28 -47 -275 -20 -194 -197 129 -236 160 -107 295 421 76 -145 -335 -124 -225 40 -353 65 49
8041 49 -48 -25 -96 -161 50 -109 -60 478 -238 30 118 -35 251 135 228 -15 97 140 84 -141 -19 136 124 -117
8065 -117 -47 231 -27 95 -109 -27 16 37 -83 -206 224 148 -287 184 2 -170 178 86 -1 53 80 -412 -20
8088 -20 -13 213 -157 346 5 -88 -24 -43 88 -5 50 213 32 -16 48 -234 -187 80 96 12 82 -325 105 95 60
8113 60 -40 77 21 150 61 168 54 -76 -247 -181 -185 -46 17 -142 -372 156 -33 -195 -98 148 -211 108 -50
8136 -50 21 -25 -21 169 -162 39 24 15 140 -26 354 -123 83 -38 -130 -83 136 188 -15 -108 -112 -168 80 -36 102
8161 102 -22 40 86 -143 108 -112 -94 15 155 -277 175 102 144 40 -97 -16 82 -339 -87 -5 217 92 -186
8184 -186 120 -207 -152 -230 -249 -39 79
8191G9
$$ Imaginary data points
##PAGE= N=2
##DATA TABLE= (X++(I..I)), XYDATA
0 0 0 0 0 0 0 0 0 0 0 0 0 -8 8 -8 10 -16 16 -24 26 -32 40 -48 57 -66 81 -91 107 -126 145 -166 188 -216 244
33 244 -277 312 -353 394 -443 496 -552 614 -682 757 -838 929 -1027 1133 -1248 1376 -1516
50 -1516 1672 -1840 2027 -2238 2473 -2738 3040 -3386 3789 -4262 4831 -5529 6407 -7553 9120
65 9120 -11397 15027 -21743 38428 -176011 -167837 139487 104071 228386 231209 -37672 -193835
77 -193835 -35193 -46475 -110728 15349 66933 -77112 -1365 166532 95649 -7668 42509
88 42509 -56064 -205452 -98457 49987 4983 39809 152169 73140 -37025 30743 8374
99 8374 -143923 -128706 -21375 -32875 32781 200657 164993 -9955 -52772 -87887 -178053 -91025
111 -91025 90399 84758 26580 68558 28042 -66398 -902 66532 -33406 -87058 -32937 -53471
123 -53471 -49298 99590 160328 54211 2032 -19680 -126039 -137962 -4789 42901 18528
134 18528 78270 96829 2308 -19472 13721 -58766 -112742 -35764 9795 4727 78908 121057
146 121057 23405 -43478 -24238 -55951 -77385 3241 37548 -15682 3016 60179 33587 18131
158 18131 48985 -11146 -108442 -89084 -29753 -8336 63443 134299 73746 -20655 -38260 -62501
170 -62501 -91048 -27362 39668 18364 14137 53458 33435 -3464 15145 -1968 -69085 -65974
182 -65974 -14509 -2494 25290 80783 61633 -3456 -15192 -20719 -56080 -43321 1114 -2163
194 -2163 -2583 44908 59216 27260 15266 -6890 -67017 -79663 -27902 9366 33879 71050 60211
207 60211 -314 -27466 -24538 -37497 -32186 720 4452 -6626 19947 43783 30762 18884 4529
220 4529 -40357 -67865 -39531 -3545 20199 51305 57391 18607 -13520 -19190 -29871 -35023 -14739
233 -14739 -1443 -1577 17740 42025 35283 16101 -1818 -33515 -56250 -37903 -2760 20393 38455
246 38455 42769 18077 -8074 -13747 -17417 -23610 -17917 -9692 -6608 8980 33910 39500 23957 1607
260 1607 -27360 -49469 -39709 -8489 18103 33678 35787 18823 -2773 -11622 -13383 -17572 -18161 -13835
274 -13835 -8095 6571 27561 36735 25383 2240 -23873 -40518 -34904 -10478 14106 26904 27273
287 27273 15748 1864 -5620 -8112 -12947 -17648 -18200 -10999 4546 24327 34231 25705 3247 -21013
301 -21013 -34928 -30163 -9968 10316 21288 20381 12594 4334 -198 -3587 -9369 -16969 -20104 -13492
315 -13492 2781 22068 31634 24635 3966 -18338 -29604 -25060 -9385 7606 16089 15320 10453
328 10453 6200 3600 -228 -7623 -16790 -20391 -13938 2121 19852 28735 22369 3577 -15226 -24417
342 -24417 -20640 -7747 4783 10587 10601 9317 7664 6014 2473 -6194 -17189 -21142 -13203 1701
356 1701 17972 26467 19534 2259 -12726 -19495 -16853 -7027 2934 6424 6279 8579 9740 8332 4307
371 4307 -4761 -17406 -21321 -12494 1978 15882 23541 17807 1553 -10670 -14758 -13885 -7611 1163
385 1163 3727 3588 7767 11592 8625 3813 -3901 -15694 -20224 -10353 2760 12280 18965 15682 1849
400 1849 -8081 -9228 -10499 -8993 -2258 1397 1209 7769 14832 10939 2695 -4396 -15775 -20807 -9570
415 -9570 4826 11367 15680 14558 1094 -8051 -6783 -6492 -8208 -3366 794 -583 4729 14163 11717
430 11717 3278 -2380 -11249 -19580 -11698 2870 8045 12050 15341 6100 -5576 -5650 -6315 -11303 -7737
445 -7737 1135 1877 5713 15230 11845 -324 -5370 -9185 -15689 -9569 4912 7680 6157 9971 6041
460 6041 -3322 -2366 -346 -8989 -11243 -3495 -850 2172 15485 17315 3533 -4942 -8509 -17247 -14694
475 -14694 2726 9743 7482 11292 9283 -4158 -6644 -1590 -7183 -10379 -556 2958 433 8685
489 8685 13706 2672 -4371 -2658 -9188 -13308 -2043 5175 1429 6825 13029 4438 -2834 -374 -7675
504 -7675 -16587 -7424 3158 3941 10855 18014 5005 -8430 -7436 -9049 -12451 -577 10047 4023
518 4023 2242 7776 2332 -4429 1868 934 -10570 -9056 -179 -1436 3260 15258 11915 -1692 -3014
533 -3014 -5881 -14921 -9561 4443 4949 4141 12413 8885 -3822 -4245 -3381 -11603 -9544 4022 5626
548 5626 3480 10215 8076 -4907 -5909 -438 -6471 -6813 3002 1849 -3130 5307 10730 3031 828
563 828 2113 -9805 -16079 -4765 2929 3621 12539 14992 378 -8372 -5639 -8728 -10158 2598 8003
578 8003 1695 3872 8199 332 -4205 875 -3211 -10120 -3266 3329 108 3906 10944 3726 -3590
593 -3590 -145 -2662 -10392 -5586 1809 -607 2959 12497 8472 -1475 -2507 -6081 -14046 -7354 5269
608 5269 6228 6064 9965 2995 -7205 -4691 -880 -5055 -2796 3445 -85 -1867 6096 7837 1125
623 1125 615 -477 -9721 -10350 -306 2565 3130 9233 8605 -1259 -3855 -1829 -7011 -7955 266 2672
639 2672 1382 7355 8886 626 -3880 -3171 -7245 -7701 906 5172 2120 3874 5117 -753 -2243 1229
655 1229 -1858 -6785 -3566 -592 -1088 4441 10440 5834 -1053 -2891 -6886 -9932 -2969 4254 4064 4613
671 4613 6172 1336 -3456 -1715 -2127 -5929 -3448 1005 989 3054 7048 4718 -1307 -2263 -3691 -6728
687 -6728 -3652 2171 1921 2069 4992 3947 54 -457 -1365 -5998 -6085 -1614 1205 3546 7851 6757 -356
704 -356 -3789 -4562 -5952 -3531 1430 3413 2069 3283 3526 295 -377 -848 -3906 -5704 -2386 525
720 525 2539 5763 5705 1536 -2266 -3430 -5005 -4443 -644 1895 1868 3079 4180 1847 -114 -1435 -4181
737 -4181 -5988 -3291 724 2957 5060 5322 1819 -1902 -3233 -3713 -3642 -1135 966 1275 2136 3811 2958
754 2958 694 -1225 -3510 -5306 -3639 -285 2787 4519 4920 2567 -1164 -2733 -3576 -3198 -1934 96
770 96 1606 2554 3438 3355 1169 -1123 -3367 -4640 -4141 -864 2277 3954 4125 2614 -51 -2098 -3044
787 -3044 -3234 -2376 -653 711 2366 3313 3336 1687 -357 -3038 -4400 -3629 -1183 2137 3674 3962 2551
804 2551 373 -1477 -2614 -2906 -2646 -1070 356 2038 3572 3454 2039 -280 -2803 -4292 -3682 -1794
820 -1794 1260 3061 3771 2546 796 -831 -2138 -2922 -2557 -1604 -242 1594 2884 3315 2434 187 -2449
837 -2449 -4004 -3749 -1929 650 2490 3614 2992 1429 -659 -1883 -2353 -2620 -1762 -576 1091 3037
853 3037 3637 2753 938 -2171 -3681 -3807 -2019 305 2306 2796 2541 1742 -113 -1227 -2271 -2583 -2474
870 -2474 -1251 554 2388 3824 3213 827 -1642 -3071 -3666 -2069 291 2052 2348 2656 1923 115
886 115 -961 -1642 -2608 -3128 -1597 823 2116 3559 3381 1019 -1602 -2830 -3437 -2687 -420 1591 1845
903 1845 2328 1993 674 -566 -1282 -2654 -3544 -1825 617 2234 3652 3642 1270 -1681 -3290 -3038 -2618
920 -2618 -353 1478 1358 1753 2826 1152 -152 -964 -1961 -3516 -2226 154 1494 3106 3967 1765
936 1765 -1212 -2080 -2447 -2854 -1439 1194 1292 1753 3229 2391 -376 -1054 -1960 -3929 -2486 871 1954
953 1954 2660 3235 1562 -1609 -1808 -1295 -2284 -1855 303 487 436 2929 3394 762 -384 -1391 -4088 -3704
971 -3704 133 2202 2453 3649 2724 -934 -2231 -1553 -2377 -2179 328 1307 750 2194 3325 376 -1393
988 -1393 -978 -2701 -3339 -311 1556 917 1898 2855 220 -1081 -145 -1846 -3424 -1683 427 694 2587
1005 2587 4699 1584 -1776 -2220 -3264 -4113 -590 2741 2014 1623 2711 213 -1941 -471 -385 -2434
1021 -2434 -1391 564 98 1001 3430 2625 -617 -550 -1599 -3780 -2282 1169 1193 1024 3684 2338 -1004
1038 -1004 -1057 -864 -4114 -2672 712 1296 1781 3347 2419 -1846 -2094 -803 -2485 -1363 1648 1185 -396
1055 -396 1401 2348 -303 36 669 -2394 -3780 -995 302 597 3484 4122 342 -1578 -1539 -3082 -3145
1072 -3145 672 2282 902 2139 2869 -303 -1706 -395 -1693 -2788 -234 1650 381 1412 2825
1087 2825 447 -1319 134 -1134 -2606 -943 715 -499 1010 3581 2041 -214 -291 -1835 -4459
1102 -4459 -1965 1447 1490 2288 3402 716 -2351 -1736 -1051 -1888 -337 1727 373 -104 2076 1219 -590
1119 -590 138 -465 -2746 -2235 591 817 806 3159 2326 -962 -763 -720 -2566 -2404 331 626 552 2760 2303
1138 2303 -483 -1219 -1027 -2605 -2239 921 1697 993 1839 1628 -950 -1089 270 -1016 -1670 -351 -49
1155 -49 -842 1491 3068 997 -303 -429 -2151 -3296 -760 1593 1203 2334 2564 -85 -1442 -751 -1284
1172 -1284 -2166 -288 850 155 1385 2457 793 -805 -421 -1310 -2500 -501 1282 708 936 1854 743
1189 743 -495 40 -631 -1976 -1345 -42 262 1383 3023 1705 -579 -986 -1938 -2450 -1069 1003 1406
1206 1406 1085 1439 513 -714 -274 -198 -1763 -1593 -282 103 889 2263 1815 108 -980 -1402 -1825 -1310
1224 -1310 361 643 919 1293 1109 110 -305 -359 -1652 -1544 -589 294 1328 1998 1860 244 -1086 -1250
1242 -1250 -1345 -1052 299 631 566 1046 1142 407 95 -262 -1370 -2009 -819 245 1130 1746 2051 628 -620
1261 -620 -1103 -1297 -1200 -425 258 534 761 1160 654 311 -425 -1540 -1791 -1330 263 1099 1421 1640 821 -669
1281 -669 -1120 -1070 -1029 -525 -147 562 856 1171 1153 245 -514 -1423 -1918 -966 21 1313 1697 1714 505 -302 -1051
1302 -1051 -906 -981 -806 -343 137 1130 1218 1296 579 -493 -1309 -1632 -1048 -126 891 1538 1462 380 -252 -897
1322 -897 -645 -706 -819 -306 -12 747 1213 1297 855 -470 -1222 -1579 -1094 -205 669 911 1142 721 39 -571
1342 -571 -893 -748 -1140 -537 89 545 1159 1324 678 -371 -1311 -1352 -1244 -196 470 921 929 776 305 -408
1362 -408 -309 -821 -963 -567 -323 360 1232 1658 661 143 -688 -1638 -1488 -395 394 794 1163 812 353 44
1382 44 -259 -714 -1163 -717 -119 548 1450 1548 1046 -120 -1006 -1273 -1373 -654 355 435 917 847 600 36 -103
1403 -103 -396 -1273 -994 -138 742 918 1227 1191 -160 -1270 -973 -1041 -765 247 801 625 832 509 100 -189
1423 -189 -168 -881 -1490 -404 524 392 1469 1274 305 -798 -832 -1422 -1116 102 715 632 780 1132 215 -379
1443 -379 -368 -1186 -1684 -200 733 802 1144 911 -28 -796 -447 -587 -966 -63 425 139 100 1013 798 -229
1463 -229 -182 -1013 -1730 -952 453 688 1128 1564 675 -950 -851 -799 -1103 -449 708 400 399 954 643 -471
1483 -471 -487 -276 -1458 -791 464 544 249 977 605 -945 -486 -101 -1232 -950 345 321 -40 1472 1643
1502 1643 -170 -654 -549 -1717 -1487 545 1283 669 1140 1051 -1149 -1223 143 -552 -668 445 457 -440 232
1521 232 1414 475 -460 -1 -841 -1870 -266 885 484 1122 1503 192 -809 -249 -673 -1852 95
1538 95 958 70 964 1429 272 -999 -560 -697 -1089 285 1322 -1 -180 740 -273 -625 259 436
1556 436 -1394 -1094 496 -293 138 2056 1183 -906 -351 -913 -2392 -745 1472 914 350 1399 104
1573 104 -1422 -681 -16 -1114 -747 1033 559 -72 1113 716 -853 -669 493 -771 -929 752 439
1590 439 -472 943 1072 -156 -320 253 -1213 -1990 48 903 632 1943 1631 -844 -1657 -476 -772 -623
1608 -623 1019 1256 -205 350 753 -487 -484 560 -216 -1179 -223 599 -107 642 1569 281 -663 -251 -523
1627 -523 -1729 -214 754 101 526 1751 221 -1032 -146 -741 -1408 -236 1120 793 482 1038 -146
1644 -146 -1369 -466 -58 -798 -67 745 -228 -233 1100 811 -361 126 165 -1089 -1144 651 682 582 1388 889
1664 889 -985 -700 -315 -773 -511 893 752 2 603 492 -601 -561 11 -459 -698 704 791 413 591
1683 591 703 -525 -609 53 -792 -834 88 503 90 774 1247 -54 -569 -360 -1207 -1296 168 1066 536 835
1703 835 735 -603 -1144 8 -278 -832 105 617 2 292 329 427 -576 -231 -480 -795 -149 860 514
1722 514 361 623 44 -661 -338 -312 -814 -284 366 421 529 833 351 -566 -749 -563 -735 -132 465 624 161
1743 161 364 0 -429 -349 -48 -691 -586 96 510 473 809 827 -275 -646 -493 -927 -514 305 761 614 433
1764 433 256 -222 -407 -372 -386 -440 344 345 445 909 809 -272 -640 -803 -864 -428 226 810 464 86 201 -137
1786 -137 -11 -248 -260 -522 -216 401 311 624 421 -69 -712 -886 -777 -344 355 444 80 424 330 -45 191
1807 191 -296 -737 -451 -318 179 296 804 443 -119 -360 -871 -806 -210 215 272 393 485 237 17 -117 -133
1828 -133 -346 -713 -352 -76 473 860 339 -30 -498 -594 -385 -231 159 201 620 266 26 -146 184 -8 -336
1849 -336 -270 -622 80 403 501 771 104 -298 -315 -466 -472 275 97 326 252 396 339 78 -65 -154 -684 -590 -62
1872 -62 426 533 535 339 -487 -783 -776 -175 -211 101 203 170 484 330 -90 -335 -594 -521 -310 57 424 458 513
1895 513 249 -459 -515 -488 121 -242 -109 310 361 414 845 199 -165 -755 -671 -460 76 486 605 313 196 -191
1917 -191 -769 -394 125 -110 -124 189 468 -28 457 249 -430 -673 -447 -431 -420 559 670 509 215 85 -333
1938 -333 -214 -356 -519 -403 589 611 232 416 388 -383 -820 -283 -393 -343 689 888 -205 -160 297 -188 -361
1959 -361 26 42 -379 -131 373 325 245 669 -162 -684 -541 -414 -678 416 885 606 103 173 -124 -581 -75
1980 -75 -146 -528 12 865 344 26 263 68 -723 -383 450 -438 -216 717 200 58 168 323 -387 -486 79
2001 79 -881 -783 831 772 473 475 327 -1170 -969 25 -434 -14 1134 529 -456 -1 321 -754 -378 441
2021 441 -276 -670 259 664 -25 412 884 -831 -713 -4 -583 -734 494 981 81 462 638 -673 -1030
2040 -1030 -315 -174 -668 705 1276 61 87 309 -847 -1001 194 288 -206 319 844 -450 -446 775 116
2059 116 -558 79 -77 -1119 -308 780 439 88 860 -152 -1446 -666 -8 -629 158 1218 455 -361
2077 -361 507 -314 -1248 -338 401 -466 -285 1203 293 -353 9 274 -803 -129 534 -174 -584 428 358
2096 358 -253 683 1009 -762 -876 -158 -574 -326 1224 1267 171 358 438 -1110 -1177 298 23 -119 668
2115 668 451 -453 -26 562 -348 -871 227 -223 -881 -74 628 237 -61 778 -140 -641 -45 147 -811 593
2135 593 897 310 219 784 -481 -1345 -240 -168 -337 407 1316 222 -446 144 -133 -687 181 354 -643 -377
2155 -377 858 176 -413 827 573 -705 -623 -47 -248 204 1293 570 48 217 -202 -1133 -715 332 -436
2174 -436 -181 969 581 -160 247 204 -972 -816 194 -80 -123 554 208 -400 -170 42 -377 -538 204 -495
2194 -495 -428 426 605 33 108 300 -748 -948 -68 254 -181 863 846 -280 -4 -112 -629 -540 -81 -409
2214 -409 -317 216 605 -90 137 299 2 -591 -299 -204 -502 35 539 174 238 207 -190 -743 -336 259 -184
2235 -184 132 726 475 236 -44 -172 -628 -350 170 -108 -2 137 507 -8 337 295 -588 -367 -115 -335
2255 -335 -101 522 378 65 144 -95 -724 -394 -211 6 -135 378 304 345 134 299 -585 -479 -393 -302 119 493
2277 493 776 130 14 -181 -395 -502 -216 -187 31 531 517 362 129 128 -319 -479 -580 -97 -190 155 690 579
2299 579 213 -57 -467 -449 -400 -267 65 354 485 121 216 112 -209 -149 -535 -49 85 468 710 473 401 -57
2321 -57 -360 -186 -9 -230 -120 -22 282 487 229 208 -117 -653 -223 -346 29 251 728 519 278 -7 -149
2342 -149 -409 -206 57 91 306 356 544 450 180 281 -522 -784 -314 -16 248 304 417 232 -255 -245 -274 -508
2364 -508 -407 -314 43 213 448 547 -47 1 -337 -358 -453 -187 511 404 531 141 -45 -74 -226 -464 -162 -271
2386 -271 -242 204 557 543 80 93 -615 -341 -399 15 -1 229 513 473 45 15 -265 -529 -408 -469 -45 312 324
2409 324 380 448 157 -343 -772 -552 -369 -92 -15 784 284 103 153 -322 -438 -160 -129 -117 145 378 542 215
2431 215 79 -73 -581 -682 -47 123 23 368 412 -2 10 115 -344 -493 -135 -13 66 602 648 125 10
2452 10 -571 -523 -479 229 -48 -93 494 629 -46 57 318 -154 -636 -271 -206 -109 597 544 191 -30 314 -552
2474 -552 -612 -115 102 -77 630 1212 251 -270 276 -48 -850 -294 293 -78 319 950 197 -33 88 196
2494 196 -626 -39 120 -99 -50 572 184 217 369 31 -1033 -760 101 -205 278 676 724 -83 -153 -254 -885
2515 -885 -610 44 -78 -226 606 601 -299 22 201 -377 -665 176 5 -198 530 638 -15 -36 229 -549 -883
2536 -883 -317 -23 -503 616 1183 -124 36 95 -642 -1095 -84 619 -181 741 1005 -364 -507 138 -335
2555 -335 -694 145 142 -108 125 767 -145 -22 408 -179 -1001 -325 -44 -373 100 795 416 -142 390 -185 -1195
2576 -1195 -449 492 -204 245 797 438 -459 24 -216 -1053 -405 640 -13 -395 573 283 -278 420 387 -705
2596 -705 -473 226 -514 -111 797 692 -38 -178 219 -746 -943 184 93 201 1070 668 -40 -250 119 -702
2616 -702 -505 384 304 -146 383 485 -123 -126 147 -487 -479 72 -180 -467 234 669 180 -142 440 -470 -913 -298
2638 -298 292 -328 660 1120 99 -96 0 -439 -899 -2 331 -29 368 854 -143 -354 175 -21 -636 -104
2658 -104 255 -249 373 892 452 113 210 -123 -808 -229 118 -70 196 531 404 -158 -109 -387 -796 -239 247
2679 247 304 115 682 656 -340 32 52 -530 -17 -29 -27 -52 493 677 -23 -58 32 -878 -613 -120 147 -76 370
2702 370 751 103 48 -121 -495 -610 200 121 -77 587 535 -13 -141 364 -280 -773 -68 70 -39 367 653
2723 653 373 -159 3 -136 -461 -147 338 -73 225 669 345 54 -69 -477 -302 131 61 378 236 443
2743 443 247 -53 -320 -150 -436 -22 236 8 18 116 453 -88 159 -354 -361 -475 5 292 4 472 106
2764 106 -253 -403 -370 -441 -283 224 150 152 388 360 232 -302 -116 -629 -717 25 228 427 472 261 253 -113 -389
2787 -389 -283 -679 -87 -44 -21 324 330 407 -316 -287 -529 -197 -41 -47 145 450 208 13 111 -430 -522 -320 -209
2810 -209 -56 -65 250 550 351 -24 -465 -409 -285 -411 200 145 398 213 179 -121 -245 -94 -234 -184 -7 22
2832 22 -38 530 124 -282 -45 -344 -444 -205 234 -46 320 143 192 177 -160 -404 -483 -133 155 142 242 143
2854 143 375 -136 -361 -63 -394 -401 -182 141 443 248 290 88 -215 -345 -369 -332 169 63 411 476 390 111
2876 111 -251 -479 -29 -303 -222 194 -37 313 307 -25 -9 -21 -386 -463 -255 -92 138 207 539 150 27 -2 -305
2899 -305 -354 -177 119 419 318 219 278 37 -127 -247 -461 -327 61 418 516 538 253 83 -83 -337 -256 -146
2921 -146 -13 171 259 577 140 -43 -54 -197 -320 -138 83 351 -68 257 162 -295 93 -323 -257 -288 76 184
2943 184 270 459 610 20 -288 -65 -508 -422 281 121 299 346 249 -134 -341 121 -324 -360 -85 103 104 581
2965 581 422 -232 15 36 -398 -562 -45 315 202 439 202 451 -75 -135 -244 -617 129 316 193 291 299 49
2987 49 -363 -242 -266 -420 130 304 -46 114 421 -4 -220 129 -288 -673 -199 187 -61 100 858 157 -21
3008 -21 -314 -139 -575 -249 88 -273 340 380 240 -440 -80 -16 -568 -441 322 405 6 386 559 -35 -219
3029 -219 21 -467 -303 114 38 -84 566 406 -279 -182 185 -284 -508 139 -163 82 585 721 -37 -512 -197
3050 -197 -254 -685 205 493 -182 465 41 78 -130 382 -314 -704 -147 187 -316 62 794 38 -4 294 -317
3071 -317 -580 44 76 8 204 702 12 -350 -259 -521 -498 -115 446 101 396 531 119 -352 -101 -138 -491 -229
3093 -229 143 -6 20 321 473 74 125 228 -530 -409 312 193 155 420 84 32 -256 -88 -458 -487 351 16
3115 16 318 462 411 -171 -161 -101 -459 -243 480 76 60 61 492 97 -60 106 -530 -553 95 172 10 431 332
3138 332 -49 -105 88 -331 -484 133 257 9 173 255 -322 -375 10 -423 -234 -192 317 -27 366 494 157
3159 157 -285 47 -293 -563 9 123 -73 63 483 -38 190 69 -578 -347 -538 376 123 452 443 159 -258
3180 -258 -381 -261 -183 145 262 -111 111 371 227 -175 176 -114 -426 -327 -116 -29 -212 488 279 -248 -122
3201 -122 6 -442 -224 57 36 63 387 475 38 -115 -180 -225 -175 83 -68 -171 467 30 40 -159 -285 -367 -423
3224 -423 79 288 224 330 426 -146 -184 -222 -242 -502 134 -19 -249 411 376 36 -189 -47 -258 -512 -169 195
3246 195 -132 291 138 140 -97 -121 -269 -454 37 -9 17 360 274 223 -184 -87 -153 -226 164 82 143 -6 496 170
3270 170 163 8 -400 -376 -172 51 157 225 330 14 21 -122 -322 -328 -253 -157 136 275 134 132 282 -125 -259 -306
3294 -306 -218 -9 289 405 511 187 133 -171 -41 -196 -192 94 339 93 397 412 10 -26 -266 -372 -407 -143
3316 -143 -323 222 243 139 261 -249 -161 -285 -339 -14 -13 339 211 133 -8 -367 -211 -310 -323 -369 144 105 243
3339 243 242 322 37 -17 -38 -74 -109 -189 119 178 238 252 143 -281 -315 -323 -219 -131 -190 -239 263 -78 -155 -136 -431 -347 -1
3366 -1 -75 75 -113 147 257 -70 -202 90 -88 -127 -205 265 -23 392 300 209 -119 82 -253 -257 -5 228 446
3389 446 225 51 65 37 -265 -323 -47 -103 -41 364 322 -39 92 0 -272 -354 -473 79 384 75 351 128 245
3412 245 -182 -365 -201 -418 -267 -107 -200 -68 581 68 -143 -234 -132 -256 -181 244 490 -71 165 36 141
3433 141 -66 88 -263 -207 -60 66 108 487 284 -198 -266 -232 -464 -235 -272 142 240 416 -18 -232 94 -492
3455 -492 -132 -474 -25 243 298 140 178 181 92 -208 -286 -351 56 280 246 523 -64 -82 -145 -145 -270 -154 -44 301
3479 301 296 236 405 175 -33 -355 -596 -542 197 60 184 68 629 8 -460 -237 -242 -206 -270 278 102 359 598
3502 598 349 -7 -98 -158 -381 -93 12 -216 378 604 204 -306 106 -157 -478 -67 15 81 86 319 48 -232
3524 -232 -106 -241 -218 -71 129 -254 102 419 -82 -48 -292 -191 -460 -121 42 152 171 430 225 -322 254
3545 254 41 -279 -134 43 -12 108 302 59 244 -53 -61 -47 -214 53 -47 -27 195 150 79 -62 85 -312
3567 -312 -561 17 -30 101 148 377 88 -46 -63 -327 -300 56 148 251 237 181 -17 -251 172 -289 -326 22 32
3590 32 -87 253 390 164 -249 -281 -14 -718 -18 181 12 -36 240 375 -147 16 -223 -447 -44 21 167
3611 167 276 393 74 -118 -118 -191 -248 32 7 -42 147 39 -98 -73 -35 29 3 -426 62 165 -87 256 189 112
3635 112 76 25 -479 -308 21 -124 164 574 359 -326 -370 322 -163 -63 150 247 -126 445 258 76 -119
3656 -119 -92 -447 -293 136 112 -115 303 190 -258 -296 -108 -60 -254 163 235 165 291 504 2 84 -67 -185
3678 -185 -202 -145 213 155 -29 218 172 -155 -50 103 -293 102 173 325 -16 436 96 -201 -162 -34 -324 -173
3700 -173 129 -248 92 430 11 -177 -58 -86 -344 -161 47 94 197 485 225 131 -73 -194 -277 -48 -132 191
3722 191 195 247 123 -141 -93 -64 -19 -306 -120 237 134 388 394 -198 -73 -117 -440 -198 142 94 510 74 -150
3745 -150 155 -87 -297 -186 138 -223 -41 20 241 161 -46 74 -132 -205 -63 203 250 274 248 118 102 223
3767 223 -15 -311 -121 -91 53 476 172 293 134 -29 127 -209 -102 -249 86 290 258 90 153 42 -92
3788 -92 -160 -274 -12 -41 251 191 78 53 478 56 87 -308 -22 280 101 282 331 186 -193 -130 -30 -127 -94
3811 -94 251 -177 236 127 468 -108 -206 -135 -158 -335 61 20 2 224 92 -41 -256 -126 -327 -59 79 260
3833 260 282 245 88 45 -256 -190 -401 -103 -121 257 241 94 456 167 27 -181 -64 -310 65 65 82 90 199 -149
3857 -149 -174 -105 -461 -62 -74 73 322 304 447 124 74 83 -357 -37 -116 -287 186 281 272 -76 -159 -44 -114 -195 -158
3882 -158 144 2 62 242 526 -39 -159 109 -199 -105 177 -13 377 15 115 48 78 133 -223 -225 -171 -73 341
3905 341 355 169 -158 1 -58 -148 -16 -354 339 55 375 343 -48 157 -305 -237 -447 -176 23 144 158 325
3927 325 -15 -23 -19 -100 48 -20 185 141 85 130 347 -203 -153 -217 -37 -220 -129 -63 147 32 42 130 -61 -224 43
3952 43 -22 -261 -223 58 -92 42 35 -193 -25 -131 -164 19 -98 -56 407 149 -44 3 28 -200 22 -105 102
3975 102 466 169 323 -76 35 180 -283 -327 159 166 56 186 95 -169 -19 114 -371 -296 162 -65 59 365
3997 365 149 60 -251 112 -534 -333 69 74 269 232 205 28 -81 -19 -3 -261 322 -110 -9 96 158 -190 -214
4020 -214 241 -256 -186 150 19 158 160 213 -288 -195 -73 -317 -263 -241 49 -159 214 466 377 -305 -44 -343 -317
4043 -317 -228 351 364 214 313 182 -71 59 -34 -386 -102 235 -23 -369 233 225 -116 68 3 -222 35 117 44
4066 44 278 217 278 17 -58 40 -158 -327 298 268 14 -29 164 -28 -293 -44 -269 -319 76 96 -40 143 324
4089 324 -217 14 -144 -258 -255 57 148 -32 138 220 -189 -94 -82 -164 -88 -212 97 50 10 489 -112 -248 207
4112 207 45 -111 -53 -38 20 117 -54 -161 -185 -162 248 -287 244 307 -120 107 418 342 143 31 100 -254 210
4135 210 100 -64 137 271 78 -480 -184 -9 -317 -234 309 129 38 146 24 -68 -221 -228 -203 -27 29 31 156
4158 156 -7 156 -46 108 -161 -85 -413 162 144 -8 228 230 -188 86 137 102 -110 181 258 -141 198 224 28
4181 28 -117 257 -76 -274 50 20 67 395 553 38 -155 -264 -236 -402 33 36 -97 229 369 -68 -343 -178
4203 -178 -28 -546 54 158 13 125 331 -19 -317 46 0 -79 -93 187 7 188 325 176 75 156 248 -210
4225 -210 114 274 206 298 315 376 -83 106 -270 -172 60 386 71 80 130 40 -175 -187 50 102 -184 246 -177 144
4249 144 18 4 95 -20 148 -229 -50 49 73 -46 353 150 -281 -318 -51 -137 -131 102 201 132 -30 93 77 -112
4273 -112 76 -146 -27 -21 -313 -199 245 311 197 -78 43 -153 -23 -11 412 255 -184 48 88 -173 42 -68
4295 -68 -438 -265 -175 -51 341 134 126 -167 -233 -211 32 9 -143 56 226 31 69 -110 -387 -101 -138 -302 247
4318 247 -80 88 269 270 287 -211 -181 -283 -61 146 -87 16 221 -72 -124 -460 -126 95 -106 211 -82 -262
4340 -262 289 74 86 -160 21 -185 -316 -123 328 282 432 -86 -87 -138 -418 -312 195 29 186 43 91 116
4362 116 -178 -74 -142 -139 -243 -345 94 70 -9 147 43 116 -314 -74 -196 45 172 -17 -91 152 388 90
4384 90 -159 -10 -40 -85 -101 121 125 114 186 -126 50 -48 25 127 -301 42 249 322 219 34 -339 190 124 -427
4408 -427 11 -131 43 -53 -64 -188 183 58 -15 -35 288 392 119 -104 127 0 -241 93 -25 -212 337
4429 337 14 87 61 388 -23 -130 -143 -194 -234 -30 234 151 255 211 -98 -20 3 -37 -204 29 266 128 72 245
4453 245 -204 -140 196 -61 -295 38 88 60 178 -74 -117 -134 -189 148 -185 -168 -29 100 247 138 -138 50
4475 50 -183 -10 -166 166 25 165 70 -33 38 -160 184 -3 -137 -91 253 -323 -113 417 57 -131 56
4496 56 213 -154 207 1 1 -76 147 149 -108 -20 -52 -16 -191 -21 -106 256 270 70 254 175 33 -485 66 373
4520 373 93 81 119 269 -471 1 -12 -14 -252 45 149 -138 232 287 -52 -412 123 -84 -388 250 254 13 -20
4543 -20 281 -35 -257 57 -268 -194 215 -41 12 144 10 13 46 43 89 -300 -464 84 4 -98 -93 330 -220 175
4567 175 32 -199 5 20 44 -53 335 -243 -395 -211 -102 -179 -164 339 -205 221 86 245 -68 62 -163 77
4589 77 128 51 -19 -186 275 158 -324 -295 155 7 174 -253 -61 -213 108 332 -159 -74 71 -288 -239 -51
4611 -51 50 35 144 427 17 -221 197 161 -228 -9 223 -175 -43 346 49 -56 56 -209 -375 153 88
4632 88 -4 56 427 15 -307 145 -17 -209 -273 224 177 -229 228 66 -81 64 63 -245 48 -48 -53 74 352
4655 352 32 -357 -20 -50 -304 -226 342 266 101 325 -19 -38 3 268 74 -210 249 -11 -79 125 208 -20
4677 -20 -149 6 -74 -113 412 156 -370 -100 -282 -120 -158 36 -67 -38 110 -48 -64 92 219 -112 50 -90
4699 -90 29 -137 101 340 -209 52 455 -24 -86 121 -30 119 142 240 44 239 79 -108 -347 -112 78
4720 78 -78 -254 54 125 -296 -90 81 -53 -131 -66 -8 -164 25 -28 -146 284 -17 141 17 173 262 -174
4742 -174 120 -209 -8 135 -10 34 121 -137 42 -125 -295 -103 107 356 -131 150 -169 97 -70 -47 145
4763 145 299 -43 -156 -65 11 -138 60 -50 -14 -181 34 -85 -167 82 -96 -120 0 -217 -181 58 26 103 -23
4786 -23 -61 28 81 32 -47 -260 225 171 -87 84 282 -140 -142 95 -229 92 393 -3 132 -36 62 196 -339
4809 -339 -5 -265 -106 -206 200 76 214 48 54 131 -330 148 -119 -101 138 222 172 -162 204 -342 337 -61
4831 -61 -74 76 217 74 281 231 -250 156 103 -389 -133 -114 -98 254 28 -22 26 236 -86 -168 -389 111 83
4854 83 47 18 315 -17 -138 -37 143 -299 -62 -181 209 158 123 -108 -41 304 -307 -34 -20 -33 207 179 112
4877 112 -37 -117 -192 -193 -92 -284 -115 -91 122 -191 -9 80 -4 -238 131 -57 -91 -106 125 9 -9 -115 166
4900 166 -240 -104 -469 -271 359 -195 49 -148 -30 -153 -220 -17 108 25 61 83 73 123 -42 137 -158 -241
4922 -241 -82 86 -74 144 55 -301 325 -151 -284 -156 -196 -232 384 88 166 441 -161 -14 215 72 -153
4943 -153 -258 -19 87 -199 -9 64 260 -163 149 -264 -393 125 43 34 -126 325 101 156 -203 108 -143 71
4965 71 -31 -73 85 -14 9 -136 87 -112 89 123 72 243 7 -42 -313 -29 7 237 -122 -115 45 -190 -40
4988 -40 -42 427 -107 84 -67 -147 -6 90 59 134 355 -39 75 212 -33 -44 -91 198 119 -284 305 245 -8 -175
5012 -175 -127 -212 159 66 -84 149 -47 155 16 -228 32 -162 -180 -127 117 84 -84 326 -174 -157 -93 5 -158
5035 -158 27 -19 60 -244 351 -76 -238 -114 -187 19 85 65 97 133 318 -60 -234 37 -201 -74 -95 33 99
5058 99 -142 81 -25 -10 121 28 81 -101 -157 -93 -77 12 -211 -128 35 16 47 -360 192 208 -47 253 -67 -34
5082 -34 -171 62 54 -335 85 12 -48 35 -340 -83 111 56 -190 -104 -33 -62 -212 87 53 -112 -87 82 -147 -83
5106 -83 348 208 -11 304 460 -125 -16 38 -20 -177 62 297 -220 238 33 -115 -97 -69 -145 -315 -1 -13
5128 -13 159 91 47 103 -229 53 -183 -349 -193 45 -140 -53 53 27 110 10 86 -274 -19 -21 9 -115 220 92
5152 92 -354 -24 101 -45 -32 129 46 -49 4 -242 -384 -69 348 -86 2 209 4 -208 116 56 -55 -5 4
5175 4 98 -127 290 85 46 50 1 -77 31 -46 -24 38 -85 -113 37 -71 93 -157 -244 -1 -177 -72 -227 35
5199 35 -147 114 -37 -42 -328 417 -130 -54 -211 48 276 -100 236 103 -148 -15 -75 -266 -73 155 -168 -165
5221 -165 152 28 -174 221 -284 106 65 174 -4 -32 -135 157 17 3 173 -60 100 236 -65 -59 9 34
5243 34 -184 -107 -59 146 149 69 -168 -197 -67 -227 -23 74 -79 -89 -77 -42 230 357 350 -34 -159 174 -6 -17 -11
5268 -11 131 -202 119 -54 166 -72 33 123 -23 -193 33 -127 3 107 85 -161 -81 -213 19 -237 92
5289 92 24 -15 19 -153 62 -59 153 46 89 148 219 219 -138 -147 10 -65 48 79 -320 -87 330 -100 37 42 178
5314 178 160 -207 -15 175 192 122 -152 -68 -85 -213 149 -442 144 48 34 -160 -211 -83 390 186 145 28 112
5337 112 -10 135 48 -185 102 23 15 219 -46 -225 -48 177 -8 -137 -265 269 244 -81 -230 -174 8 -8
5359 -8 -139 284 -45 -69 -57 4 -39 -282 15 212 -6 95 88 -207 45 94 -218 -122 308 -137 -128 212 99 122
5383 122 -177 -254 -58 -8 -131 55 268 180 -36 -131 -7 -46 -56 -374 218 81 60 137 129 66 93 -186 -236 -150 26
5408 26 -105 -7 18 243 -31 179 -25 -144 -55 73 56 56 149 84 -120 146 -7 -165 -191 -13 56 172 188 97
5432 97 73 379 -168 11 -334 -119 -312 -15 47 120 83 23 -121 43 -112 -129 118 33 248 26 -191 185 272
5455 272 -219 -165 -13 -42 0 61 254 57 75 371 166 -91 219 46 -55 -28 7 297 -306 -36 11 -75 -142
5478 -142 -173 72 -18 237 -198 15 121 208 -100 60 7 42 74 20 -28 -254 147 26 -298 -236 46 131 -96
5501 -96 160 155 142 201 -99 -113 -14 17 -188 -139 57 221 -219 225 -282 -22 -266 36 77 -144 169 54 162
5524 162 115 3 -120 -151 -69 49 -247 35 -120 -155 -178 -39 -392 -257 61 63 -57 7 46 -73 87 280 -19
5547 -19 194 -251 60 -100 36 46 -181 113 237 -89 -260 -94 -52 240 -203 229 -37 -213 33 -35 25 147
5569 147 182 -12 -169 270 -64 -192 -57 44 112 68 208 53 109 190 146 -74 58 -112 -101 -51 -171 168 -77
5592 -77 345 13 -2 60 115 -357 217 2 34 97 78 198 -99 137 -168 -77 17 157 -69 -403 190 259 9
5615 9 69 -144 -372 -175 -31 94 169 254 -118 194 -36 118 47 -114 -116 -39 68 89 359 182 51 7 37 -244
5639 -244 83 186 -211 -158 215 -187 -303 -280 25 -76 -101 166 2 -55 28 -75 -2 -20 247 -62 35 -19 -52
5662 -52 33 270 33 26 189 143 -74 -48 -69 4 175 73 254 -13 51 -127 -71 -168 -261 96 -112 -102 -85 153 197
5687 197 -217 -106 -232 -26 70 -190 192 64 -176 8 440 -231 -56 27 263 -112 180 23 84 306 -31
5708 -31 22 -67 -59 33 -266 346 429 8 96 -212 171 -2 22 -136 172 -54 340 151 -28 57 -37 -88 -205 344
5732 344 -239 102 -8 4 -47 -120 177 -283 -269 -80 -129 28 272 101 22 72 -67 0 -151 91 -211 -306 -62
5755 -62 230 237 67 184 10 -183 23 58 -13 20 -90 222 -158 28 -83 -211 -331 57 -157 15 -93 -28
5777 -28 124 4 51 -167 106 -94 -157 118 78 -103 135 -185 -129 55 -55 56 25 -3 107 148 46 -8 -152
5800 -152 -107 -30 72 -87 -122 127 42 179 118 -145 -155 62 -187 24 -7 -115 37 111 91 -230 -8 -277 288
5823 288 116 158 -210 33 2 138 -81 -70 -117 19 77 17 389 -258 -139 128 105 -90 -73 -56 -70 27 3 240
5847 240 65 -95 3 -113 -152 -214 71 -116 142 79 39 115 62 -202 -49 -90 18 -103 6 -58 -179 120 16
5870 16 -94 -99 -247 42 -58 -82 -22 -12 -18 -83 28 -124 -119 -63 -287 21 225 9 243 -122 -112 -311 -216 -108 107
5895 107 131 -234 100 -19 183 -238 -167 193 -133 -246 -317 -32 174 -167 125 -28 -245 11 -49 55 -177
5916 -177 -264 186 257 -245 -303 -163 -264 217 -14 249 27 -15 -244 -73 98 -192 -5 189 -164 90 291
5937 291 151 18 209 -197 -195 99 -362 -217 -74 -157 -182 -60 148 63 -77 36 -45 -11 276 0 20 64 -131
5960 -131 56 -140 -141 172 64 -36 6 10 32 132 22 29 266 19 -39 -399 6 -43 11 -212 239 -136 -144 -67 -40
5985 -40 147 9 -63 -47 202 -279 -154 -279 -151 133 152 203 212 255 349 63 -28 91 -62 -111 -223 54 -169 98
6009 98 141 81 162 -83 17 -199 -97 113 184 -71 -60 231 250 -64 -52 50 -62 -39 14 -15 4 -3 346 -329 -136
6034 -136 214 -41 -25 95 110 -33 -113 54 170 217 20 -200 78 29 15 46 45 -58 -211 -236 -23 129 32 -28
6058 -28 -18 -297 -47 169 -211 80 -91 12 -185 -42 14 -47 53 -220 173 20 23 -115 -98 165 69 -65 -20
6081 -20 -151 202 -68 103 54 -16 6 232 -145 29 147 91 -279 -101 47 -80 281 134 181 -47 357 -259
6103 -259 130 -70 67 221 -163 340 188 -22 369 -250 -30 -100 73 -192 12 300 284 154 168 125 -440
6124 -440 -91 -120 153 399 58 426 136 -66 -313 -33 -60 -68 14 54 152 -249 35 -254 -3 -295 -191 -315
6146 -315 86 217 -6 188 -18 -48 457 -20 -62 305 -43 -38 187 18 38 -60 194 -51 131 16 153 -155
6168 -155 184 519 -72 46 178 -11 -343 311 142 27 -99 173 248 -200 -389 -107 -70 -6 -54 -67 -150 12
6190 12 249 -50 -86 182 98 -47 15 177 -74 401 -211 -5 46 -193 -266 -157 -11 -67 -52 107 104 -139 156
6213 156 67 -166 -205 90 198 148 -3 175 39 94 -105 77 -100 -23 25 -262 -78 180 -42 -102 -10 -237 -41
6236 -41 16 10 -119 -11 184 52 187 -225 -445 -90 -55 81 -260 52 140 81 -86 -100 237 -86 60 -76 80
6259 80 358 -144 -11 27 85 -80 -319 -4 198 110 176 -187 103 -225 -117 -286 46 -35 87 245 198 94
6281 94 -102 -94 -26 -166 -62 87 185 371 25 223 -133 372 -67 -158 -118 116 115 63 48 302 -103 -117 -310 -119
6305 -119 27 -120 73 -97 28 55 70 -330 -174 76 -124 10 -20 -10 -84 120 -224 89 202 -136 -108 -43
6327 -43 -77 -115 110 227 16 -99 104 -323 65 131 -63 79 -49 204 87 29 20 -10 -105 -100 -48 22 259 -98
6351 -98 107 88 -190 119 -64 -63 -56 35 -407 -73 79 127 133 26 -172 -215 -140 107 207 47 -3 218 -94 128
6375 128 -169 -142 -35 6 33 -188 23 -147 105 47 -151 -25 204 -132 -86 61 313 145 149 159 -135 -171 291
6398 291 -11 168 -308 150 -46 280 -23 -147 206 -65 -65 -314 -134 147 10 50 -159 -125 -113 159 -106 -213
6420 -213 -236 -178 -29 -166 25 -125 90 77 -13 169 57 60 173 125 -5 -164 -166 -124 -95 -71 -17 13 -135 -61 135
6445 135 -3 181 269 40 112 222 108 92 270 -56 55 -123 -32 -87 112 -140 251 122 -103 248 200 -66
6467 -66 119 -197 39 -20 -201 107 -160 43 112 133 15 -111 1 -12 -148 129 -58 35 -58 225 -15 -158
6489 -158 269 -231 -86 -162 -286 1 7 165 14 -132 -224 48 -153 -92 41 -95 45 7 335 53 81 -273
6511 -273 -285 266 252 -14 -6 -172 -115 -35 56 46 -186 173 49 -27 -2 117 -79 -76 -106 -27 -94 37 115 163 -77 -93
6537 -93 -199 -1 -133 -14 22 4 127 153 -94 -52 -58 -97 212 -13 -51 195 51 129 72 154 -156 -126 14 227
6561 227 25 -153 58 33 65 22 41 87 -40 -71 44 111 11 -212 -114 130 60 -169 54 -46 -218 -156 -18
6584 -18 29 -108 -41 324 -84 167 235 261 -181 181 230 132 -233 -54 -155 -64 -51 110 187 172 -27 -124 -320 -70
6608 -70 70 23 269 -204 -357 103 117 -245 89 -122 124 15 14 109 -195 -29 274 -46 182 167 81 154 -142
6631 -142 -63 -211 -120 124 -24 133 168 149 2 157 -79 -115 154 231 -5 -73 38 89 -312 27 -57 -111 59
6654 59 191 -13 152 -241 50 -277 -85 15 -172 35 127 -210 -250 -160 226 259 19 287 -84 43 167 22
6676 22 -210 -148 252 -25 -380 -28 125 -43 -128 257 -300 -98 -157 -91 258 61 -321 -27 160 30 -88 18
6698 18 -302 -166 134 -135 107 150 80 225 46 -88 90 211 -234 -22 46 118 -26 28 206 -90 -23 -184
6720 -184 -229 6 264 -27 56 23 51 54 -59 186 -96 -36 254 -147 -91 -33 10 -129 60 5 -95 -375 58 178
6744 178 -107 -145 133 -13 98 209 -61 -101 90 88 -44 187 199 148 46 -62 -65 171 287 -141 -230 246 -33
6767 -33 -173 205 -77 -54 34 -93 107 -64 -175 108 -207 42 218 -93 83 112 355 -89 -100 157 61 30
6789 30 -175 74 -146 -155 339 -15 24 28 63 -45 -178 -38 286 98 247 -252 -33 163 236 -56 -8 -353 -169
6812 -169 269 -47 -44 -126 -166 87 -143 -97 -19 117 -47 125 130 190 -23 -82 -15 -210 -103 -14 59 192 206 313 -236
6837 -236 -90 178 103 -34 -113 -40 -74 -31 -28 -26 -144 -82 78 64 -10 33 -429 -44 5 61 79 -187 142 92 -50 12
6863 12 -12 133 209 -14 -43 -148 176 201 133 -139 148 -91 -9 217 177 151 -99 15 -42 -212 29 85 114 172
6887 172 264 102 -58 -284 -123 -217 27 -166 65 -12 -66 46 46 -101 -29 -68 17 -192 20 188 5 -61 202
6910 202 -146 -43 -112 -49 -56 -41 -3 -57 18 -111 -82 76 126 -71 -64 77 112 -189 -343 239 -238 -47 346 -64
6934 -64 -93 148 260 -147 26 -63 -122 210 -23 -93 91 30 98 299 -18 28 -55 232 -245 -65 -54 -276 -35
6957 -35 150 140 -114 250 -177 -121 -125 -5 190 -125 39 58 98 -169 -7 60 -75 -117 93 -59 241 -64 6
6980 6 39 241 -190 -44 -105 22 -260 -246 -127 -126 -39 31 -49 -53 -17 208 -20 57 108 4 -28 -43 -95 -297 -119 -110 225
7007 225 -13 118 -138 -113 -10 74 -165 -357 51 -108 -15 -340 -9 44 -203 -44 -123 -269 6 -10 2 0 -84
7030 -84 -84 36 36 2 -30 4 201 -64 74 -191 -30 -138 16 315 105 -140 29 89 171 -58 -80 -125 216 -169
7054 -169 89 6 38 158 -364 -85 119 149 348 81 17 79 305 85 107 125 -137 -139 17 63 -172 85 -42
7077 -42 -112 98 35 -89 -79 -120 148 -301 128 -232 -61 -84 -39 54 -249 -111 117 -88 -177 167 258 -36 123
7100 123 -46 136 108 -3 -199 -349 159 245 210 -188 252 109 85 16 -51 120 -131 177 -73 124 56 30 -198
7123 -198 -125 -54 -201 168 -138 88 -136 83 -78 -127 -253 22 -119 120 90 17 -34 -240 -52 -101 -133 -106 -115 -104
7147 -104 132 -162 137 262 217 -210 -23 -116 17 -192 -215 240 108 85 -277 237 -26 -307 -298 116 88 80 381
7170 381 -36 115 -35 -91 13 282 -99 132 285 -13 -15 150 -46 -124 -10 184 142 -51 -59 154 303 -89
7192 -89 -185 -205 57 -304 -18 89 134 49 -124 56 -129 1 127 -43 -101 125 1 18 -184 269 33 52 234
7215 234 -98 41 -41 160 -65 41 11 -210 33 -31 186 -185 -116 -68 -34 34 -131 -44 13 134 196 52 144 239
7239 239 -129 138 109 430 237 -164 16 -7 -330 -77 -79 -285 -211 210 247 -63 -111 -2 102 411 83 -148
7261 -148 142 21 79 -78 -64 -204 81 6 20 136 236 168 -47 -45 63 56 -36 -159 -40 -180 213 -19 -35 -213
7285 -213 -128 137 -115 -160 -291 -272 -82 -24 -154 10 101 -6 106 259 154 62 -25 189 -181 -87 -92 -191 156 -197
7309 -197 -178 -20 103 299 -91 59 44 71 59 -68 -67 -103 82 150 330 -120 -94 -138 137 25 14 -256 31 103
7333 103 -281 170 -121 59 45 -124 -186 -176 -42 127 -131 18 -4 19 -18 124 -49 108 -40 -114 -30 49 -117
7356 -117 -388 -14 45 -4 -81 -192 -191 139 -183 -37 -46 -253 -81 172 -72 30 50 243 22 20 -36 48 29 62 -16
7381 -16 292 234 -54 132 -20 -76 -41 -167 133 -1 -156 -87 -173 27 -143 -78 151 -2 42 7 14 50 -120 351
7405 351 -4 -362 102 91 -75 98 7 -75 192 -2 -115 -48 68 -209 -34 192 -146 -125 -159 230 46 -35
7427 -35 -180 20 -162 -113 -287 -218 -41 149 251 8 -26 -66 -449 181 -56 -13 -190 -11 -121 25 -84 94
7449 94 -213 81 24 -210 355 -147 100 43 8 -329 79 -176 -138 261 320 133 -124 156 -51 -220 -77 -192
7471 -192 -12 -159 63 186 66 -102 -175 -60 -105 -20 -270 105 15 -241 192 132 -89 -44 -184 -242 -15 -102 -95
7494 -95 345 180 -91 122 26 -184 40 314 56 -407 161 -97 292 -224 87 0 -112 174 -84 263 -169
7515 -169 341 60 26 129 208 18 151 -62 191 -46 152 172 -381 -83 -375 -137 -85 -137 166 31 88 -53
7537 -53 -134 54 192 -6 -192 124 126 -170 244 38 -40 13 -87 -144 -42 0 37 -34 213 298 -217 77 23 -4
7561 -4 184 385 -61 144 289 -102 31 -86 -15 -111 -87 -50 198 78 320 70 -6 284 -101 -24 -104 141 186
7584 186 59 -167 115 -119 -114 34 -151 5 -48 18 -257 20 223 -16 -109 -214 -68 -161 -24 118 -123 7
7606 7 -61 -301 46 -20 -66 -328 42 235 -124 12 -121 120 146 -101 -90 -103 -130 262 -104 36 -21 -224 -324
7629 -324 -8 296 178 141 -67 -57 -104 -198 195 -234 -114 119 -180 -441 79 114 -84 -254 -166 -210 -232 -126 -100
7652 -100 -183 -41 174 -125 36 27 -28 53 219 -189 -329 -149 22 -267 -65 189 -131 -76 -208 215 -155 174
7674 174 -32 -11 299 2 -55 -119 199 -18 -104 108 -144 174 -53 -59 89 95 38 -144 -113 307 -149 -43 -331
7697 -331 163 -26 166 192 -89 -21 164 243 -60 18 -234 208 -85 -284 194 -130 -105 -119 -7 33 88 -32 -64
7720 -64 -88 -111 -133 -88 -254 -155 38 -142 -62 116 -113 175 -85 -286 -7 102 188 -19 -7 164 -109 145 -226
7743 -226 -23 243 109 10 90 5 92 -208 -70 299 77 -9 -2 -148 220 40 -64 -105 53 158 40 43 147
7766 147 -66 324 95 204 14 2 -140 -55 111 134 172 103 95 -318 -150 176 43 -26 -249 -51 -23 28 -52 -37
7790 -37 33 -12 -239 223 303 108 5 -179 -155 194 -51 -217 -8 -193 -23 131 108 -58 3 252 -250 -183 182
7813 182 45 54 67 342 38 -28 -106 -134 177 -444 -73 71 -105 144 78 130 -119 114 -198 -58 126 -36 -64
7836 -64 113 -163 248 -181 -40 121 -62 -86 -60 104 284 133 182 -40 -88 112 -209 -13 52 -249 -80 102
7858 102 23 -86 -178 -363 -75 -94 -62 128 61 211 62 -115 138 -305 -67 -35 -190 244 58 -54 43 42 20
7881 20 121 -288 -3 -138 -37 -298 15 39 -32 -233 -71 -152 -87 88 173 -338 253 -197 -142 -103 138 -7 18
7904 18 -108 -11 107 -84 147 -38 -149 -138 -230 248 -66 -78 1 10 -75 -115 -51 -83 62 173 82 61 44 521 -101
7929 -101 -50 -189 3 87 -6 -12 -2 188 152 198 -101 -174 -178 5 -57 117 -39 -178 -154 -61 -150 11 -385 -103 -107 39
7955 39 127 -245 11 60 306 -11 -98 153 81 100 11 268 38 335 -2 -78 -16 73 -161 -160 -241 107 -227 -123
7979 -123 -186 -94 167 -39 136 -146 254 -94 255 97 -174 233 -168 -54 222 -87 177 74 78 122 164 70
8001 70 93 -191 206 -73 -353 -11 183 -94 -24 -39 76 53 175 -57 -19 -73 177 -271 -248 26 -167 98 -338
8024 -338 29 7 -39 189 100 -138 -138 181 77 15 -181 -97 213 -119 12 316 -28 171 99 62 147 -70 -6 146
8048 146 -14 28 19 -146 -224 204 -129 73 228 72 232 -68 -107 79 78 11 216 -86 169 -65 -79 -37 12 -210
8072 -210 -218 151 -151 181 -68 102 4 86 113 437 -222 26 -165 71 -288 52 122 130 250 -75 -61 52 86
8095 86 -123 103 -13 97 -333 243 63 253 151 -83 232 199 135 277 284 -91 46 187 -64 1 37 35 30 185
8119 185 -6 -91 -77 -161 -111 -279 138 -30 -200 -121 -3 -76 -219 44 197 -28 88 86 39 -26 -228 137 10
8142 10 10 -67 126 -136 143 -189 107 16 -205 50 123 258 131 -7 -38 78 -2 434 96 52 -137 129 -180
8165 -180 104 151 -91 -89 166 154 -66 47 472 -75 -144 -165 139 91 25 -198 -188 121 -146 221 -90 -271 -86
8188 -86 -5 136 -26
8191b6
##END NTUPLES=NMR FID
##END=
