##TITLE=1H_DE_Gly_DL-Len
 200.13MHz, D2O,
 8 sc
 
 11.9.2025
##JCAMPDX= 6.0         $$ Bruker NMR JCAMP-DX V2.0
##DATA TYPE= NMR FID
##DATA CLASS= NTUPLES
##ORIGIN= UXNMR, Bruker Analytische Messtechnik GmbH
##OWNER= pz
$$ XWIN-NMR		Version 3.5
$$ Thu Sep 11 16:32:18 2025 Russian Standard Time (UT+4h)  she@DPX200
##.OBSERVE FREQUENCY= 200.1313
##.OBSERVE NUCLEUS= ^1H
##.DELAY= (6, 6)
##.ACQUISITION MODE= SIMULTANEOUS
##.ACQUISITION SCHEME= undefined
##.AVERAGES= 8
##.DIGITISER RES= 18
##SPECTROMETER/DATA SYSTEM= spect
##.PULSE SEQUENCE= zg30
##.SOLVENT NAME= D2O
##.SHIFT REFERENCE= (INTERNAL, D2O, 0, 14.3821)
##AUDIT TRAIL= $$ (NUMBER, WHEN, WHO, WHERE, WHAT)
$$ ##TITLE= Audit trail, XWIN-NMR		Version 3.5
$$ ##JCAMPDX= 5.01
$$ ##ORIGIN= Bruker BioSpin GmbH
$$ ##OWNER= she
$$ F:/spectra/data/she/nmr/H-C/1/audita.txt
$$ ##AUDIT TRAIL=  $$ (NUMBER, WHEN, WHO, WHERE, WHAT)
(   1,<2025-09-11 16:30:57.64 +0400>,<she>,<DPX200>,
      <created by zg, POWCHK disabled, PULCHK disabled
       configuration hash MD5:
       00 E9 B6 7A A2 85 ED C7 34 08 36 98 17 FE 4E 26
       data hash MD5: 16K
       49 03 C9 8C 8E 18 60 66 14 1D 40 2A F8 1E 7D D7>)
$$ ##END=
$$ 
$$ hash MD5
$$ 48 03 FA 7E F6 19 5C AA 89 0C 97 94 8B 1A 1B 04
##$RELAX= 
##$RELAX= 
##$RELAX= 
##$RELAX= 
##$RELAX= 
##$RELAX= 
$$ Bruker specific parameters
$$ --------------------------
##$DU= <F:/spectra>
##$EXPNO= 1
##$NAME= <H-C>
##$PROCNO= 1
##$TYPE= <nmr>
##$USER= <she>
##$AMP= (0..31)
100 100 100 100 100 100 100 100 100 100 100 100 100 100 100 100 100 100 
100 100 100 100 100 100 100 100 100 100 100 100 100 100 
##$AQSEQ= 0
##$AQ_mod= 1
##$AUNM= <au_zg>
##$AUTOPOS= <>
##$BF1= 200.13
##$BF2= 200.13
##$BF3= 200.13
##$BF4= 200.13
##$BF5= 200.13
##$BF6= 200.13
##$BF7= 200.13
##$BF8= 200.13
##$BYTORDA= 1
##$CFDGTYP= 0
##$CFRGTYP= 5
##$CHEMSTR= <none>
##$CNST= (0..31)
1 1 145 1 1 1 1 1 1 1 1 1 1 1 1 1 1 1 1 1 1 1 1 1 1 1 1 1 1 1 1 1 
##$CPDPRG= <>
##$CPDPRG1= <>
##$CPDPRG2= <>
##$CPDPRG3= <>
##$CPDPRG4= <mlev>
##$CPDPRG5= <mlev>
##$CPDPRG6= <mlev>
##$CPDPRG7= <mlev>
##$CPDPRG8= <mlev>
##$CPDPRGB= <>
##$CPDPRGT= <>
##$D= (0..31)
0 0.7 0 0 0 0 0 0 0 0 0 0.03 0 0 0 0 0 0 0 0 0 0 0 0 0 0 0 0 0 0 0 0 
##$DATE= 1757593857
##$DBL= (0..7)
120 120 120 120 120 120 120 120 
##$DBP= (0..7)
150 150 150 150 150 150 150 150 
##$DBP07= 0
##$DBPNAM0= <>
##$DBPNAM1= <>
##$DBPNAM2= <>
##$DBPNAM3= <>
##$DBPNAM4= <>
##$DBPNAM5= <>
##$DBPNAM6= <>
##$DBPNAM7= <>
##$DBPOAL= (0..7)
0.5 0.5 0.5 0.5 0.5 0.5 0.5 0.5 
##$DBPOFFS= (0..7)
0 0 0 0 0 0 0 0 
##$DE= 6
##$DECBNUC= <off>
##$DECIM= 32
##$DECNUC= <off>
##$DECSTAT= 4
##$DIGMOD= 1
##$DIGTYP= 9
##$DL= (0..7)
0 120 120 120 120 120 120 120 
##$DP= (0..7)
150 150 150 150 150 150 150 150 
##$DP07= 0
##$DPNAME0= <>
##$DPNAME1= <>
##$DPNAME2= <>
##$DPNAME3= <>
##$DPNAME4= <>
##$DPNAME5= <>
##$DPNAME6= <>
##$DPNAME7= <>
##$DPOAL= (0..7)
0.5 0.5 0.5 0.5 0.5 0.5 0.5 0.5 
##$DPOFFS= (0..7)
0 0 0 0 0 0 0 0 
##$DQDMODE= 0
##$DR= 18
##$DS= 0
##$DSLIST= <SSSSSSSSSSSSSSS>
$$ [...]
##$SUBNAM0= <"">
##$SUBNAM1= <"">
##$SUBNAM2= <"">
##$SUBNAM3= <"">
##$SUBNAM4= <"">
##$SUBNAM5= <"">
##$SUBNAM6= <"">
##$SUBNAM7= <"">
##$SUBNAM8= <"">
##$SUBNAM9= <"">
##$SW= 18.0517328524113
##$SWIBOX= (0..15)
0 0 2 0 0 0 0 0 0 0 0 0 0 0 0 0 
##$SW_h= 3612.71676300578
##$TD= 16384
##$TD0= 1
##$TE= 0
##$TE2= 300
##$TE3= 300
##$TEG= 300
##$TL= (0..7)
0 120 120 120 120 120 120 120 
##$TP= (0..7)
150 150 150 150 150 150 150 150 
##$TP07= 0
##$TPNAME0= <>
##$TPNAME1= <>
##$TPNAME2= <>
##$TPNAME3= <>
##$TPNAME4= <>
##$TPNAME5= <>
##$TPNAME6= <>
##$TPNAME7= <>
##$TPOAL= (0..7)
0.5 0.5 0.5 0.5 0.5 0.5 0.5 0.5 
##$TPOFFS= (0..7)
0 0 0 0 0 0 0 0 
##$TUNHIN= 0
##$TUNHOUT= 0
##$TUNXOUT= 0
##$USERA1= <user>
##$USERA2= <user>
##$USERA3= <user>
##$USERA4= <user>
##$USERA5= <user>
##$V9= 5
##$VALIST= <valist>
##$VCLIST= <CCCCCCCCCCCCCCC>
##$VD= 0
##$VDLIST= <DDDDDDDDDDDDDDD>
##$VPLIST= <PPPPPPPPPPPPPPP>
##$VTLIST= <TTTTTTTTTTTTTTT>
##$WBST= 1024
##$WBSW= 4
##$XGAIN= (0..3)
0 0 0 0 
##$XL= 0
##$YL= 0
##$YMAX_a= 168796
##$YMIN_a= -214002
##$ZGOPTNS= <>
##$ZL1= 120
##$ZL2= 120
##$ZL3= 120
##$ZL4= 120
##$ABSF1= 10
##$ABSF2= 0
##$ABSG= 5
##$ABSL= 3
##$ALPHA= 0
##$AQORDER= 0
##$ASSFAC= 0
##$ASSFACI= 0
##$ASSFACX= 0
##$ASSWID= 0
##$AUNMP= <proc_1d>
##$AZFE= 0.1
##$AZFW= 0.1
##$BCFW= 1
##$BC_mod= 2
##$BYTORDP= 1
##$COROFFS= 0
##$CY= -3
##$DATMOD= 1
##$DC= 2
##$DFILT= <>
##$DTYPP= 0
##$F1P= 0
##$F2P= 0
##$FCOR= 0.5
##$FTSIZE= 0
##$FT_mod= 4
##$GAMMA= 1
##$GB= 0.15
##$INTBC= 1
##$INTSCL= 1
##$ISEN= 128
##$LB= 0.25
##$LEV0= 0
##$LPBIN= 0
##$MAXI= 10000
##$MC2= 0
##$MEAN= 0
##$ME_mod= 0
##$MI= 1.114404
##$NCOEF= 0
##$NC_proc= 0
##$NLEV= 6
##$NOISF1= 3.799351
##$NOISF2= 2.8
##$NSP= 1
##$NTH_PI= 0
##$NZP= 0
##$OFFSET= 14.38212
##$PC= 1
##$PHC0= -1562.031
##$PHC1= 9.39226
##$PH_mod= 1
##$PKNL= yes
##$PPARMOD= 0
##$PSCAL= 0
##$PSIGN= 0
##$REVERSE= no
##$SF= 200.129724274929
##$SI= 16384
##$SIGF1= 3
##$SIGF2= 2
##$SINO= 400
##$SIOLD= 16384
##$SREGLST= <1H.CDCl3>
##$SSB= 0
##$STSI= 0
##$STSR= 0
##$SW_p= 3205.1282051282
##$SYMM= 0
##$S_DEV= 0
##$TDeff= 0
##$TDoff= 0
##$TI= <>
##$TILT= no
##$TM1= 0
##$TM2= 0
##$TOPLEV= 0
##$USERP1= <user>
##$USERP2= <user>
##$USERP3= <user>
##$USERP4= <user>
##$USERP5= <user>
##$WDW= 1
##$XDIM= 8192
##$YMAX_p= 0
##$YMIN_p= 0
$$ End of Bruker specific parameters
$$ ---------------------------------
##NTUPLES= NMR FID
##VAR_NAME=  TIME,          FID/REAL,        FID/IMAG
##SYMBOL=    X,             R,               I
##VAR_TYPE=  INDEPENDENT,   DEPENDENT,       DEPENDENT
##VAR_FORM=  AFFN,          ASDF,            ASDF
##VAR_DIM=   8192,          8192,            8192
##UNITS=     SECONDS,       ARBITRARY UNITS, ARBITRARY UNITS
##FACTOR=    0.0002768,     1,               1
##FIRST=     0,             0,               0
##LAST=      2.2672688,     0,               0
##MIN=       0,             -214002,         0
##MAX=       2.2672688,     168796,          0
$$ Real data points
##PAGE= N=1
##DATA TABLE= (X++(R..R)), XYDATA
0 0 0 0 0 0 0 0 0 0 0 0 0 0 0 0 2 -8 8 -8 8 -8 16 -16 16 -24 24 -31 32 -40 46 -51 59 -67 75 -84 98 -108 122
37 122 -135 151 -167 186 -207 230 -254 281 -311 343 -376 414 -457 503 -553 611 -674 748 -828
56 -828 923 -1029 1158 -1308 1497 -1726 2024 -2423 2987 -3838 5267 -8100 15778 -81768 -214002
71 -214002 -20863 -50651 -88053 115275 143256 -6240 47491 58740 -61048 -48498 -35511
82 -35511 -108245 -35606 34696 17228 115471 139365 -33040 -43874 1455 -141110 -116654 74379
94 74379 15514 -31243 138963 107601 -45736 18714 5105 -151901 -98617 14434 -3397
105 -3397 62473 127980 41243 4276 -2874 -87872 -59574 5178 -67397 -32907 92116 33610
117 33610 15877 133067 32711 -128477 -54454 -41884 -120739 17719 136546 44057 35575
128 35575 72486 -34355 -72269 -19193 -58384 -57793 15629 10768 41315 112040 40716 -23741
140 -23741 4814 -73500 -126451 466 34200 -23036 69818 107828 -9130 -1873 39897 -71763
152 -71763 -104416 -20897 -25631 -4721 96100 87650 28899 17776 -44995 -86640 -31999 -26788
164 -26788 -30251 47775 47939 472 63392 66732 -42653 -44967 -23402 -97862 -59738 65621 59015
177 59015 39716 81156 18906 -62878 -37245 -36029 -58471 -9176 17019 13228 60730 65326 13822
190 13822 8549 -26570 -96658 -56558 5506 -6611 36420 91840 28755 -11142 22563 -21603
202 -21603 -72741 -31326 -21658 -35872 29529 75501 51795 41193 8644 -57746 -64705 -42348
214 -42348 -32788 16834 52471 25875 29890 45343 -3973 -28529 -13080 -52206 -70084 -1963
226 -1963 33839 33473 68573 56851 -16125 -40310 -37314 -52610 -29197 10487 15272 29276 48088
239 48088 30814 17023 1768 -47142 -64338 -33805 -19413 10448 64935 58038 15335 8562
251 8562 -11082 -49300 -37561 -15377 -23260 -3684 35637 43105 41498 34972 -6355 -45570 -53609
264 -53609 -47582 -17378 27315 40422 37467 35467 10031 -17871 -16823 -26831 -45763 -27472 2346
277 2346 17075 43696 59480 28170 -12122 -33286 -48767 -43332 -11686 13741 26093 34019 29110
290 29110 18065 8424 -14105 -37487 -40690 -33831 -14221 26246 52250 44139 24846 -263 -32107
303 -32107 -42945 -28687 -15228 -3266 15532 27690 31144 30658 16466 -10414 -36201 -48070 -38085
316 -38085 -7337 23928 41493 42464 23594 -3049 -19162 -25682 -29006 -24145 -11199 3623 21481
329 21481 38337 39812 20011 -10352 -35493 -45693 -34917 -8127 20236 34092 31732 21836 7759
342 7759 -7613 -19033 -26779 -30056 -23000 -2362 23118 40643 40087 20190 -7994 -32082 -40876
355 -40876 -29122 -7627 9203 21243 27656 23947 15209 4774 -12371 -31507 -37101 -26684 -4522
368 -4522 22736 40942 37560 17933 -6723 -25686 -30379 -24215 -13758 -90 12482 20677 27505
381 27505 27209 10957 -12462 -30570 -38341 -30063 -4044 22872 34121 30943 18051 -1081 -16026
394 -16026 -22232 -23139 -19290 -10269 3829 21795 32838 29514 13580 -9333 -32044 -37825 -23970
407 -23970 -3128 14836 26532 26645 16139 5173 -3753 -14770 -24721 -26092 -17234 -509 20302
420 20302 35232 32972 13442 -10405 -26922 -31795 -22967 -5703 9400 17034 20526 20635 14531 2117
434 2117 -12928 -25154 -29951 -22290 -680 22797 32182 27285 13894 -5675 -22412 -23746 -17323
447 -17323 -12496 -2544 11147 18972 22820 22689 8831 -12484 -28269 -32370 -21597 761 19367
460 19367 28131 25727 10931 -4587 -10320 -15837 -21094 -14915 -5949 672 17069 31207 23782 7882
474 7882 -7646 -26533 -33352 -17978 -349 11883 22675 21932 12268 5793 -4167 -16310 -19443 -20001
488 -20001 -16007 4100 23022 24892 23469 13149 -12699 -25385 -19094 -15738 -8553 9301 14879
501 14879 12610 18810 15506 -413 -11121 -21415 -28846 -15998 4367 17200 28734 26251 4866
514 4866 -8489 -13016 -22175 -17289 -1926 -1059 2682 20159 21390 10923 8062 -6647 -27979 -25293
528 -25293 -11988 -2985 15060 26508 16913 8987 2559 -12316 -16567 -12378 -16904 -9056 11309 16692
542 16692 18585 23945 5769 -18031 -18648 -18458 -19009 1464 16645 10715 13418 16212 2243 -4898
556 -4898 -6059 -19608 -22123 -7367 2220 14119 29425 19403 1229 -5474 -18857 -25751 -8712
569 -8712 1509 -405 12731 19759 7727 7685 7446 -13489 -22610 -13883 -13112 -2215 20458 21639 12402
584 12402 10164 -4160 -17774 -11778 -11226 -13379 1806 10475 8942 19455 19353 -3478 -12305 -14035
598 -14035 -24497 -14056 10243 12573 12132 19264 6899 -7161 -3151 -8548 -17950 -9844 -3093 -701
612 -701 15653 23431 11939 4679 -5330 -23641 -19685 -4701 -3006 6752 20536 11086 3668 9306
626 9306 -2591 -16581 -11206 -11414 -13338 5734 18912 14301 14197 8051 -11341 -14945 -9901 -12928
640 -12928 -4405 8128 5715 9698 18230 7177 -4088 -4846 -17145 -23123 -4584 6900 8472 19527
654 19527 17470 -1608 -5854 -5445 -15032 -11395 -1446 -3112 3032 15590 13747 8627 6204 -9856
668 -9856 -20463 -12376 -8454 -2403 15021 16469 6077 7544 3284 -10954 -10445 -6251 -13232 -6177
682 -6177 9472 11352 13138 15487 1562 -12262 -11644 -13550 -10583 3445 7752 6472 12517 9620
696 9620 -222 -459 -5220 -17544 -13138 -2154 794 11350 20971 9854 -1039 -3488 -12053 -15297
710 -15297 -4865 -1018 -39 8680 11145 7313 8361 2015 -11615 -13765 -11177 -9456 3365 14802
724 14802 11268 8743 6817 -5274 -10936 -5902 -8372 -9086 1169 6312 7780 14472 11588 -1730
738 -1730 -8415 -12185 -15031 -5986 4879 7533 10815 10874 2903 -1183 -1970 -9488 -11695 -6365 -4204 1426
754 1426 13150 14840 7314 2556 -6210 -15062 -11384 -4077 -710 5146 10171 7475 5897 4904 -2630
769 -2630 -8733 -10223 -11351 -6133 5593 11260 11381 10400 2168 -7786 -8658 -7893 -8047 -1917 3832 4276
785 4276 8215 10653 5647 -1155 -6650 -12749 -12355 -3680 3628 9162 12395 8323 957 -2537 -6396
800 -6396 -8962 -6675 -4093 -2165 4824 10629 9822 7215 1667 -8133 -12482 -9381 -4692 1100 8310
815 8310 9218 6228 4381 756 -4552 -6902 -8662 -8093 -2576 4668 9631 11758 8328 -639 -6768 -9547
831 -9547 -9603 -4700 1535 4160 6045 7628 6156 2322 -1247 -6541 -10857 -9034 -3119 3421 9435 11261
847 11261 7094 367 -5075 -8071 -7729 -5299 -2126 2074 5337 7313 8167 5367 -1243 -7397 -10077
862 -10077 -9108 -4034 3806 8823 8760 6125 2449 -2508 -5714 -6710 -6260 -4923 -1055 4241 8650 9646
878 9646 5878 -151 -7008 -10307 -8437 -2877 1799 6073 7540 6156 3247 271 -2935 -6413 -8172
893 -8172 -6308 -2096 3591 8957 10153 6037 -514 -5584 -8496 -7442 -3326 787 3807 4935 6593
908 6593 5614 2102 -1651 -6026 -8938 -7795 -2149 4261 8196 8820 6056 356 -4469 -6531 -5978 -4618
924 -4618 -2191 1626 4968 6345 6886 4437 -1253 -7511 -8855 -7034 -3099 3150 7513 7442 4653 1234
940 1234 -1642 -4617 -5772 -5444 -3918 -835 4009 8050 8065 4648 -964 -5826 -8780 -7129 -2062 2624
956 2624 4561 6041 5317 2454 247 -2067 -5463 -7544 -5621 -944 3678 7143 8649 5067 -914
971 -914 -4993 -6560 -6120 -3420 367 3089 4495 5617 5057 2260 -2309 -5842 -7277 -6001 -2002 3825
987 3825 7617 6826 4032 533 -3576 -5785 -4811 -3377 -2612 861 4474 5902 5941 4055 -1034 -6509
1003 -6509 -7889 -6069 -2069 3065 6090 6483 3986 637 -1817 -3255 -5231 -5238 -2608 86 3058 6581
1019 6581 7455 3043 -1568 -4611 -7082 -6059 -1437 2058 3364 5181 4847 2355 438 -2212 -5184
1034 -5184 -6118 -5140 -965 4287 7213 6005 3575 -595 -5496 -5684 -3613 -2938 -293 3332 3889 3781
1050 3781 4888 2567 -2470 -5160 -6303 -5744 -1196 4023 6006 6199 3799 -633 -3018 -3665 -5187 -3184
1066 -3184 -542 479 3421 6527 4826 1310 -877 -4855 -7608 -4416 -290 1903 4623 5653 3034
1081 3034 773 -543 -3575 -4865 -4142 -3702 291 4285 5903 5165 3489 -2004 -6009 -4869 -4198 -2434
1097 -2434 2657 4430 2894 3709 3103 -768 -2540 -3630 -5775 -4293 233 3540 5608 6593 2538 -1424
1113 -1424 -3454 -5077 -4618 -951 134 1445 4559 4842 2526 1572 -980 -5854 -5730 -2768 -739 2669
1129 2669 6243 4577 1533 615 -2167 -4580 -3337 -2747 -2039 1422 3772 4460 4898 2278 -3223 -4733
1145 -4733 -4763 -4820 -664 4230 3724 3548 3589 485 -2166 -1846 -3525 -4843 -2011 680 2763 5615 5484
1162 5484 910 -1662 -4006 -5685 -3375 -371 898 3119 4702 2491 1098 1341 -2594 -5368 -3560
1177 -3560 -2755 -778 4303 5752 3545 1871 -555 -4399 -4029 -2296 -2239 7 2661 2591 3458 3980 448
1194 448 -2626 -3566 -5211 -3804 1052 3484 3731 4529 2216 -1743 -2179 -2360 -3984 -2494 18 600 3001
1211 3001 4988 3579 626 -1303 -4468 -5092 -1952 -23 1703 4324 3359 1403 1239 -578 -3800 -3281
1227 -3281 -3008 -2784 835 4407 4025 3369 2009 -2132 -4612 -3487 -2525 -682 2281 2729 2487 3103 1662
1244 1662 -1054 -1943 -3496 -4835 -1834 1039 2589 4563 4167 519 -1981 -2103 -3556 -3093 -349 236
1260 236 1363 3682 3460 1615 466 -1964 -4310 -3624 -1640 403 3121 4110 2324 1345 249 -2475
1276 -2475 -3202 -1686 -2237 -1014 1862 3218 3275 3230 895 -2873 -3599 -3383 -2308 378 2522 2823 2856 1821
1294 1821 72 -1188 -1999 -3295 -2955 -803 992 2768 4285 2650 -32 -1587 -3147 -3612 -1622 78
1310 78 689 2209 2858 2188 1061 -124 -2468 -3501 -2959 -1401 1156 3635 3413 2530 697 -1237 -2902
1327 -2902 -2476 -1769 -1056 585 2070 2108 2829 2251 -623 -2283 -2962 -3190 -1651 1074 2488 2842 2346 824
1345 824 -704 -1834 -2155 -2440 -1381 -2 1467 3066 3264 1884 31 -1909 -3485 -2916 -919 353
1361 353 1759 2634 2123 1098 386 -952 -2117 -2509 -2177 -803 1467 3106 2915 2117 -210 -2248 -2661
1378 -2661 -2264 -1586 -88 1157 1652 2077 1791 1097 -988 -2024 -2863 -2519 -653 1457 2644 2921 1775
1395 1775 65 -1268 -2147 -2416 -1475 -564 677 1540 2300 2319 1473 -286 -2369 -3062 -2255 -634 1028 2308
1413 2308 2364 1698 588 -310 -1233 -1756 -1835 -1228 60 1479 2481 2485 1387 -555 -2186 -2788 -2015 -928
1431 -928 724 1725 1901 1711 774 -345 -1040 -1814 -2237 -1415 -230 1495 2639 2765 1036 -210 -1866
1448 -1866 -2073 -1910 -792 202 838 1567 1782 1250 272 -876 -1928 -2679 -1913 -120 1519 2228 2298 1337
1466 1337 -325 -1356 -1851 -1714 -1333 -179 607 1258 1806 1962 913 -1039 -2226 -2621 -1534 -243 1353
1483 1353 2232 2093 818 436 -517 -1435 -1863 -1396 -652 142 1585 2391 1925 872 -898 -2038 -2313 -1495
1501 -1495 -255 791 1689 1833 1337 700 -49 -1201 -1936 -1996 -841 180 1413 2032 2188 617 -833
1518 -833 -1385 -1610 -1476 -761 181 1029 1086 1717 1065 3 -1091 -1853 -2082 -951 266 1197 2048 1706 752
1537 752 -449 -1174 -1425 -951 -957 -260 549 1424 1666 1239 594 -1045 -2101 -2037 -876 -81 1419 2133 1273
1556 1273 594 106 -1047 -1601 -1328 -1157 -526 558 1513 1797 1521 185 -1233 -1658 -1877 -1094 81 1093
1574 1093 1075 1480 1158 143 -381 -1249 -1718 -1574 -377 607 1579 1917 1233 269 -836 -1456 -1545 -1031 -484
1593 -484 322 1197 1554 1275 810 99 -1225 -1753 -1219 -608 299 1760 1867 1000 709 -447 -1117 -1096 -1248
1612 -1248 -663 203 1004 1169 1740 1036 -60 -1362 -1525 -1809 -523 565 1010 1288 1224 336 -249 -623 -1475
1631 -1475 -1807 -1014 -41 452 1781 2014 892 -198 -1102 -1939 -1456 -329 178 886 1154 980 660 393
1649 393 -836 -1341 -1124 -986 -672 933 2012 1418 1105 -198 -1228 -1349 -1142 -865 -183 723 756 1180 1218
1668 1218 532 -456 -1135 -1815 -1342 -97 598 1213 1677 1048 -420 -447 -863 -1143 -850 -284 307 1053 1739
1687 1739 1308 364 -183 -1158 -1832 -1056 -258 368 1378 1288 724 433 -373 -995 -920 -943 -1126 182 1046 1136
1707 1136 931 969 -255 -1433 -1195 -1376 -476 541 1271 796 1144 708 -91 -283 -888 -1309 -788 165 737
1726 737 1398 1139 449 -426 -878 -1668 -1139 -307 -98 268 1288 1256 863 738 -500 -1173 -1296 -734 -108 805
1746 805 1631 885 811 50 -993 -992 -868 -828 -598 823 984 1052 1213 242 -804 -1010 -1131 -1231 -236 775
1766 775 996 1063 842 129 -304 -687 -1098 -995 -273 122 1068 1333 1272 80 -345 -1127 -1394 -872 -144 48
1786 48 861 955 679 357 -66 -825 -1430 -1049 -639 19 826 1402 858 414 -387 -1069 -927 -759 -744 199 1073
1807 1073 704 1123 804 -122 -1003 -986 -1465 -944 382 1094 1136 1249 368 -119 -584 -1204 -1066 -772 -317 435
1827 435 1009 1178 613 36 -769 -1258 -1225 -537 -96 729 891 1187 331 3 -402 -992 -747 -914 -496 369
1847 369 1266 1065 792 254 -719 -1025 -696 -673 -50 536 673 740 990 334 -278 -570 -950 -1237 -413 552 1132
1868 1132 852 931 91 -506 -919 -992 -757 -577 169 702 1112 968 219 -112 -733 -1208 -1222 -562 453 1080
1888 1080 1069 762 463 -283 -772 -887 -648 -663 -144 946 970 1078 776 -218 -798 -1307 -1065 -703 185 696
1908 696 845 971 552 -165 -560 -676 -850 -751 93 483 1261 1029 810 -117 -832 -984 -1123 -653 -171 388
1928 388 1021 1105 580 304 -335 -988 -1164 -877 -645 540 1187 1179 898 321 -512 -854 -839 -818 -12 462 390 1088
1950 1088 957 433 -370 -744 -960 -810 -391 518 792 1010 937 152 -506 -786 -731 -729 -459 125 783 997 1094
1971 1094 456 -304 -947 -1225 -755 -356 199 734 950 833 449 -264 -769 -798 -925 -544 -299 812 1132 1229
1991 1229 727 100 -802 -1304 -896 -446 154 482 748 987 425 164 -622 -937 -916 -706 -268 351 1270 916
2011 916 697 -177 -414 -843 -719 -842 -447 75 647 829 866 29 -355 -959 -975 -824 -3 373 898 891 675
2032 675 -109 -505 -573 -977 -840 -136 38 777 993 1153 510 -297 -978 -1140 -340 156 320 906 655 661 199
2053 199 -170 -324 -942 -1002 -602 -44 923 1059 888 468 -392 -745 -1104 -743 -140 95 760 814 664 638 -124
2074 -124 -555 -1197 -833 -829 -68 713 1045 977 381 -103 -642 -812 -730 -381 -239 215 915 1084 783 270 -314
2095 -314 -936 -1171 -735 63 741 892 1021 619 137 -141 -1023 -989 -510 -244 277 682 1064 801 328 -546
2115 -546 -1053 -1254 -697 57 554 831 769 454 253 -270 -733 -553 -988 -640 298 934 1097 985 154 -467
2135 -467 -828 -720 -918 -244 348 825 677 939 471 17 -113 -997 -1122 -617 210 670 1026 949 343 -281
2155 -281 -259 -925 -776 -454 133 433 976 995 625 -70 -742 -878 -949 -648 -130 394 859 641 534 -59 -532
2176 -532 -751 -838 -654 35 511 805 919 708 158 -607 -834 -934 -536 -114 414 615 690 531 -18 -86 -698
2197 -698 -977 -968 -301 115 537 819 551 120 -255 -812 -824 -514 -158 173 313 789 552 527 -86 -329 -987
2218 -987 -816 -425 -3 1021 695 762 433 -321 -797 -553 -716 -470 234 106 755 854 737 -55 -568 -760
2238 -760 -910 -317 154 654 825 621 715 336 -152 -633 -1051 -618 -253 322 940 780 631 221 -422 -1058
2258 -1058 -915 -567 126 647 834 727 271 226 -218 -713 -845 -818 -233 382 893 1077 710 6 -511 -642
2278 -642 -612 -588 -71 245 475 745 960 287 -395 -583 -812 -768 -323 425 876 731 641 226 -18 -519 -734
2299 -734 -684 -138 -43 299 657 709 555 -327 -449 -1041 -751 -497 71 662 465 476 467 -85 -515 -776 -572 -892
2321 -892 -365 721 978 746 398 -102 -575 -867 -1048 -506 -67 309 395 730 567 188 -365 -472 -899 -630
2341 -630 -113 129 970 838 870 -176 -316 -823 -879 -204 -313 -6 773 587 641 344 -311 -581 -1049 -631 -298
2362 -298 356 762 885 342 312 -133 -556 -651 -704 -407 193 199 862 851 228 4 -816 -889 -628 -126 200 540
2384 540 602 719 327 87 -527 -788 -797 -322 -92 465 905 687 426 75 -788 -1002 -1074 -344 72 258 554
2405 554 579 412 345 -176 -699 -715 -612 -72 417 918 911 534 8 -506 -476 -483 -219 58 310 506 778 601 162
2428 162 -657 -631 -963 -785 -97 276 805 814 577 23 -265 -731 -662 -523 -137 109 509 580 522 193 -314 -526
2450 -526 -1090 -723 -40 372 648 973 567 425 -196 -628 -689 -683 -282 178 466 795 666 186 17 -588 -766
2471 -766 -458 -286 -205 178 420 441 343 -71 -415 -508 -636 -290 -173 615 646 691 197 -5 -127 -827 -636 -483
2493 -483 -255 337 307 692 353 117 -465 -803 -1006 -613 -270 329 719 378 110 97 -267 -632 -462 -197 -34
2514 -34 81 512 776 553 170 -381 -467 -599 -486 10 248 600 687 815 263 -245 -495 -734 -522 -34 66
2535 66 795 772 496 53 -178 -685 -700 -548 -245 232 313 695 589 530 115 -566 -952 -472 -481 99 346 514
2557 514 455 -13 -126 -270 -327 -626 -26 6 211 425 663 606 114 -177 -723 -541 -231 -142 466 718 517 388
2579 388 51 -393 -594 -638 -398 -190 248 576 713 574 265 -43 -882 -636 -227 -93 135 680 527 263
2599 263 140 -204 -308 -500 -566 -353 89 495 591 596 69 -178 -316 -511 -288 -151 280 517 362 455 187 -270
2621 -270 -388 -735 -683 -329 -37 458 420 248 148 84 -738 -660 -598 -580 90 551 593 555 441 -155 -470 -569 -560 -700
2645 -700 -21 105 388 614 105 -90 -184 -473 -657 -145 242 219 591 601 735 159 128 -352 -475 -68 -78 242
2667 242 300 773 504 285 -148 -429 -115 -535 -29 261 758 579 390 464 -238 -599 -490 -320 129 334 396
2688 396 462 502 156 -188 -356 -591 -494 -423 161 379 841 557 399 148 -121 -425 -175 -204 -76 99 423 390
2710 390 360 -155 -343 -576 -260 -249 6 698 561 233 357 116 -192 -311 -535 -276 -210 198 480 356 391
2731 391 117 -268 -571 -561 -155 -84 290 266 358 113 192 -27 -423 -540 -512 69 112 573 418 557 207 -171
2753 -171 -271 -366 -471 46 157 233 569 528 -9 -87 -420 -445 -291 -344 168 600 172 494 20 109 -311 -207
2775 -207 -219 -188 336 378 504 287 135 -162 -408 -514 -223 58 65 81 283 383 207 -83 -127 -589 -397 -429 101
2798 101 147 236 397 137 158 -403 -178 -384 -290 0 193 261 214 61 -48 -235 -279 -137 -299 -90 436 293
2820 293 391 286 -111 103 -421 -315 -602 -80 7 204 371 391 99 -214 -401 -366 -546 -119 284 253 598 41
2842 41 161 -285 -179 -232 -324 -245 -20 226 306 432 -51 -85 -216 -392 -121 -129 198 288 -46 122 231 56 -93
2865 -93 -322 -583 -315 -141 171 640 530 38 -189 -302 -479 -145 -173 -122 -189 274 327 127 113 -150 -470 -449
2887 -449 -144 -40 123 131 390 -64 113 8 -203 -270 -224 -55 -25 192 144 212 -33 -63 -12 -403 -400 -116 233 192
2911 192 293 384 143 -87 -178 -217 -259 -271 -48 230 123 281 209 7 -88 -310 -240 -131 -199 24 187 560 223
2934 223 105 -242 -458 -371 -225 45 80 115 360 123 -195 -210 -376 131 -49 33 34 395 546 341 274 69 -372
2957 -372 -457 -120 -87 77 90 35 195 275 -38 -216 -157 -248 -117 -82 421 582 102 -110 -28 -420 -402 150 -241
2980 -241 148 332 337 83 271 146 -167 -308 -43 44 -215 254 62 195 196 -101 -77 -149 -100 -267 -278 12 -72
3003 -72 162 398 -193 -150 -310 -359 -371 65 282 51 203 206 16 79 -260 -234 -107 -104 -164 192 419 -63 139 -332
3027 -332 -196 -86 -118 -196 280 265 271 -7 141 3 -376 -221 7 -114 167 -68 -10 172 105 -81 -229 -144 -67
3050 -67 -173 -21 168 296 173 160 157 -133 -165 -115 24 -8 242 219 288 298 -69 53 -390 -87 -178 -219 -98 51
3074 51 332 161 -43 -122 18 -257 -272 134 219 220 213 356 73 8 150 -142 -159 -330 57 121 451 161 -53 -147
3098 -147 -264 -415 -107 -24 -115 304 298 95 285 65 -115 -247 79 -121 121 96 212 346 208 38 -50 -195
3120 -195 -123 27 8 -45 103 357 76 -111 -61 -36 -292 -48 -146 91 304 72 70 -106 -178 -23 -287 -215 75
3143 75 139 -19 137 46 232 -100 89 -287 -82 82 118 367 186 30 149 66 -136 86 -202 -103 173 235
3165 235 -23 54 -17 -81 -97 141 -57 -116 107 186 167 140 -85 -95 -402 -138 18 -46 -74 -73 190 196 83 -130 51
3190 51 -123 -367 -94 -198 -102 -225 -64 282 -65 -147 208 -210 -36 -104 -8 -2 66 93 130 -204 -56 -77 -4 -33
3214 -33 -84 -79 -136 193 -189 69 154 65 -392 -66 -114 244 165 249 -339 -172 -239 -230 -22 309 78 170 50 -91 282
3239 282 49 67 -266 29 195 -22 291 182 125 -42 -15 -112 -86 -376 -209 37 109 49 326 16 -40 -50 -207
3262 -207 -336 224 22 -44 27 68 148 140 -5 -98 69 -275 242 151 -51 -74 -91 -38 -113 -162 -45 6 29 -94 -136
3287 -136 -131 197 243 -20 4 -84 -46 -115 227 86 338 2 346 -133 -32 -150 186 -213 237 190 -47 -235 -23
3310 -23 -18 -153 -258 -151 35 -129 230 -8 -101 160 124 74 -319 -117 -285 114 -13 104 -15 86 -202 -122
3332 -122 -30 -208 -179 232 161 112 150 0 79 51 170 -319 -117 -33 -32 -65 213 203 -203 -161 41 -217 51 -14 209
3357 209 -39 35 -145 -175 134 -22 67 -191 -162 35 108 -42 224 4 -50 -157 -111 -98 68 125 -12 84 174 -11
3381 -11 50 67 -31 -115 221 16 -90 366 -13 8 -30 -122 -172 -98 -6 -22 61 51 223 228 11 177 -263 -21 -114 -157
3407 -157 132 27 -260 -240 -170 -247 130 141 -28 -31 164 -217 232 110 224 -7 -1 -138 -268 -257 80 87 -60 -39
3431 -39 132 114 135 120 95 -66 157 63 174 6 -22 -42 62 -54 -84 -3 160 40 282 -35 -260 -218 -68 68
3455 68 37 -112 -43 -144 -1 319 -45 166 -7 -184 -187 -241 144 -84 -165 -100 -117 69 -205 -143 -96 173 -110 16
3479 16 -17 -138 101 -13 58 74 127 -194 -57 -22 -1 32 -38 -39 30 -83 148 9 10 -163 91 -221 -115 197 106
3504 106 -243 169 -254 15 -51 64 151 -9 236 207 218 -183 135 52 163 64 -57 -343 12 225 -28 69
3526 69 109 -44 -11 45 -207 -83 -54 13 86 26 30 -93 212 -17 86 -114 -47 264 -140 -17 12 100 -94 -127 -147
3551 -147 -82 -54 -39 -11 160 129 39 -51 81 -202 -226 118 165 147 -123 83 -255 -92 -69 -118 -21 -98 40 37 213
3576 213 151 273 -119 -77 -174 -46 10 -17 -35 -135 131 221 -123 -72 -78 -44 131 -127 -224 28 28 133 -60 -267 -241
3601 -241 126 -150 -117 -47 -152 304 -96 136 -225 143 -109 102 -181 137 82 -96 309 1 46 -49 -209 -217
3623 -217 -60 -71 -90 3 -70 267 79 -111 -204 -353 -138 -59 70 112 0 93 -84 103 -60 -339 -82 24 196
3646 196 125 -234 -7 39 106 99 -71 -157 -295 191 168 92 -20 73 415 -48 -232 -364 -88 19 39 265 -2
3669 -2 213 -111 -192 -79 -54 12 25 13 32 94 107 -69 -39 -112 -53 -319 -180 122 -114 2 41 -189 -127 -246 -262
3694 -262 -256 58 -48 -183 83 142 9 -221 -204 -174 -48 -160 -88 149 19 76 331 -533 -97 -199 -332 -79
3716 -79 -48 231 8 15 -95 34 -8 -129 -156 223 219 -174 171 25 80 0 -91 -156 -151 128 136 -74 366 138 103 147
3742 147 -45 -149 56 182 103 266 -51 83 52 256 101 -151 77 15 -80 172 169 268 45 -7 -206 -211 -279 -103
3766 -103 212 114 183 232 -35 -94 -141 -196 -180 -150 116 203 121 26 -104 8 -441 -34 -125 -237 331 -48 123 10
3790 10 78 108 -93 -99 -88 -261 -388 -203 -57 142 127 185 -150 -285 -64 79 -59 126 284 107 -115 17 8
3813 8 -108 120 -121 -413 67 97 186 21 50 -274 333 -122 -348 -143 27 369 62 249 134 50 15 -8 -67
3836 -67 156 -65 9 642 -87 212 -119 -90 -94 -117 -145 -129 -15 21 18 289 -174 -104 -335 -168 -88 -16 -46 87 -175
3861 -175 122 -257 -37 -371 -237 -194 -182 -35 244 37 -43 235 -98 -217 -253 -17 -206 173 285 -10 121
3882 121 345 87 -313 -308 21 -130 196 223 81 177 88 -79 99 -92 135 -34 171 231 318 198 -81 -91 -86
3905 -86 -144 -252 -162 232 172 188 279 -106 -60 -25 -62 -336 67 301 198 -17 -59 144 46 -258 -347 -198 -319 -49
3929 -49 92 50 195 -57 310 59 -120 -250 -69 241 -29 277 280 -124 -126 132 -231 70 -227 -30 121 123 100
3952 100 407 -31 193 -248 -98 -141 -205 -130 312 45 296 -49 -80 -210 -377 -43 -77 -52 134 324 229 39
3974 39 5 -26 -383 -46 -25 96 193 127 184 192 -75 32 -346 -249 -127 119 146 -42 -76 41 126 -78 -265 -58
3998 -58 -129 -210 43 152 139 252 -16 -95 -314 -103 -19 227 39 387 277 360 82 -137 -78 -143 -126 -95 171 182
4022 182 380 288 -76 -210 -261 31 91 32 92 26 186 -91 -44 -223 -22 -387 88 -245 362 133 174 203 -145
4045 -145 69 -67 -235 -178 -244 -265 13 81 293 225 -56 -89 -221 -189 -64 240 180 127 2 -59 -100 -67 -187 -192 -172
4070 -172 -163 6 -19 248 98 84 186 116 27 -466 -17 104 235 391 -6 33 -416 -492 -267 -119 149 183 279
4093 279 297 -58 133 -9 -83 24 -255 -16 -128 60 126 221 78 -127 -176 -76 -63 135 -23 186 86 4
4115 4 212 -167 -39 -352 -61 -146 -121 257 160 497 -35 -94 52 -231 -288 -37 66 112 -64 193 -43 -2 -191
4138 -191 -264 -82 -202 -251 -34 190 -42 -35 -124 -184 -294 -153 26 -136 339 145 -38 -26 -77 -19 -188 -154 97
4161 97 85 22 300 154 155 325 -208 -364 -129 81 -117 -49 132 113 321 -27 -191 -85 -308 -91 -188 -3 492
4184 492 15 302 140 21 -46 -123 -66 108 71 122 -29 165 7 3 -182 -154 -274 -93 92 -64 115 -22 170
4207 170 -269 -31 -286 -290 -108 35 166 187 35 -50 -16 -107 -238 -12 -7 -92 223 -22 62 310 136 -96 -44 -164
4231 -164 -14 3 186 23 419 195 21 -169 -289 -15 -155 -160 127 257 423 199 75 139 -400 -392 -122 -111
4253 -111 83 346 113 46 -17 138 -24 112 -27 83 120 78 72 75 -47 -99 -427 -61 -339 -33 -5 141 166 72
4277 72 109 147 -65 -93 -128 -152 -221 142 242 469 -213 116 78 -369 -124 -369 -179 66 -67 111 281 -271 -323
4300 -323 -174 -103 -247 -115 265 198 87 -8 -61 206 -125 99 5 42 104 22 350 9 179 105 -177 -200 -226 -24
4324 -24 -7 218 143 120 124 -88 -113 -258 -63 -193 -28 144 162 245 5 107 -379 -174 90 -114 -97 366 40
4347 40 165 128 -5 -34 -322 -177 94 197 -42 282 64 105 -197 -111 -74 -328 -20 268 -228 314 403 43
4369 43 87 48 -184 -264 -174 292 -320 482 272 -1 68 54 -259 -351 -173 -92 81 128 193 -56 -115 -20 -10 -43 108
4394 108 -221 -80 236 41 -38 99 93 18 -100 -141 12 -48 23 272 223 123 253 -64 -66 3 -99 -115 101 233
4418 233 -94 50 143 -205 -458 -186 -301 -125 208 47 222 -106 199 -174 -122 59 -173 332 93 367 252
4439 252 28 -51 23 50 34 -172 -165 215 -58 190 114 -37 -157 -196 -232 -137 -76 130 17 132 104 -246 208 -222
4463 -222 6 -287 -103 -107 205 -82 169 -30 -13 81 -247 -50 -111 151 -151 183 202 -113 -38 -62 -81 -115 61
4486 61 -255 219 235 289 365 -65 -333 -283 13 115 24 -142 202 66 95 -232 -165 75 -286 17 240 126 81
4509 81 4 -88 311 25 -46 -74 -186 -75 -64 448 33 -62 -15 -4 -258 -303 -35 -328 190 -41 8 108 161 -46
4533 -46 39 -158 -67 -49 138 -116 69 -181 -114 -146 -114 112 -364 -75 -244 227 -14 21 15 32 -92 -109 -352 -83
4557 -83 22 144 33 84 19 -30 -389 37 -183 -333 120 133 424 171 196 164 -181 -30 -375 390 -70 103
4579 103 310 116 63 47 84 96 -456 -15 37 -31 54 321 -32 -92 4 -64 -144 78 -60 -258 128 -9 70 309
4603 309 172 22 -200 -107 57 4 238 442 185 -341 103 -5 152 -149 -399 -48 398 197 -65 47 89
4624 89 -166 17 52 111 270 -195 264 25 59 244 -170 -43 -256 -67 107 386 189 62 -96 31 39 -316
4646 -316 22 -6 -38 -180 169 181 172 -99 -185 -215 147 -106 183 289 -42 219 -317 -28 -117 -288 -154 -122 -140
4669 -140 59 24 87 201 -17 -27 -20 149 9 -325 -130 354 155 308 -237 224 -175 -254 -246 -231 153 -79 186
4692 186 218 62 231 90 -172 -108 -99 -34 -112 292 -85 21 -139 -24 28 -27 -214 -393 22 91 95 -118 -133 38
4716 38 -61 112 -21 -223 72 84 315 69 -150 -1 -74 42 93 -287 13 135 -137 -104 -25 139 -292 -62
4738 -62 -23 0 -163 96 78 317 122 -83 -25 -144 -58 -216 60 85 162 309 58 -28 134 -309 -423 -116 -52
4761 -52 212 135 -209 50 -144 -355 -38 -256 -22 20 67 140 172 -133 -158 -74 -125 -239 -326 48 152 203 112 -103
4785 -103 69 -302 161 -189 -62 10 60 65 219 206 -126 4 -14 -162 79 -207 29 331 42 127 -63 -286
4807 -286 -318 -135 -247 0 227 171 338 -79 -54 -19 -26 256 -120 -306 -5 221 204 -328 -46 46 -107 -77 -125
4830 -125 -124 209 3 270 5 -28 6 -368 -96 -235 -105 -61 211 22 442 62 -189 -278 -240 -8 -150 25
4852 25 78 227 209 -36 -226 44 -52 225 -16 111 96 97 335 126 -260 -8 -120 107 -48 79 37 10 373
4875 373 30 86 -153 -150 26 22 28 -71 395 53 97 1 68 274 -106 -78 2 141 -20 75 143 16 272 37 -371
4900 -371 -251 -172 -15 69 157 94 -51 -189 13 -56 -9 21 43 286 -156 393 -41 162 -10 -74 189 -41 -13
4923 -13 190 57 -153 79 -166 -108 -196 -135 177 166 22 45 76 -59 -18 77 -51 -157 15 110 93 408 46 -43
4947 -43 -18 -67 82 -252 285 100 200 221 -84 -110 -218 -187 -262 169 -320 104 174 -107 -28 392 18 -268 7
4970 7 -120 67 142 84 172 -67 46 -124 -35 -245 -192 95 69 -235 120 -54 69 246 -276 36 -105 18 175
4993 175 60 104 113 82 347 -22 -110 5 -51 -54 -63 242 142 88 -197 -158 -21 -270 113 15 258 89 25 114 146
5018 146 168 43 -65 -29 -121 20 -229 158 94 -117 168 -54 -25 -47 -308 401 -32 106 -351 -123 -173 -221 -77
5041 -77 -147 -124 188 17 77 -157 -251 -121 -76 48 -64 28 67 159 143 179 37 -78 -130 137 114 127 -167 44 231
5066 231 150 165 10 -177 -148 -207 -205 -150 23 531 218 220 108 80 236 -94 -136 -46 34 16 158 98 187 -91 -119 -325
5092 -325 109 -120 -172 3 132 4 -74 100 13 -160 -110 142 -336 78 289 292 0 -4 216 47 61 327 122
5115 122 -53 164 347 286 226 -157 -24 -75 106 -282 -6 139 1 55 -85 -130 -98 -253 228 196 226 71 468
5138 468 80 78 -272 -129 68 150 198 62 267 150 65 69 10 -113 -153 -233 120 -72 286 -69 -287 3 -222
5161 -222 -228 4 4 -5 182 -68 143 66 -112 127 -334 -47 -88 45 -226 -57 117 212 76 -257 -162 -298 -74
5184 -74 -83 120 -84 125 208 173 195 -102 111 -111 -18 77 232 235 132 -16 -9 -322 19 -141 -241 340 192 -187
5208 -187 419 108 173 -35 -80 -275 -109 69 368 178 -184 -135 -129 105 -148 -256 -134 -32 3 96 -86 192
5230 192 63 170 -192 -25 1 -43 66 170 254 224 -112 -231 -176 -24 -174 66 25 75 -36 35 -70 -161 -182
5253 -182 4 -92 -75 127 -182 27 150 -66 376 17 -19 70 -54 62 0 121 -59 -171 -194 195 -82 -396
5275 -396 -50 33 -137 279 -10 251 102 -157 -192 54 14 -100 -136 132 184 231 -9 56 -35 -54 71 8 81 34
5299 34 83 270 -109 188 289 -87 58 115 14 39 -137 2 45 298 -101 -66 68 -100 94 10 172 84 138
5322 138 21 -21 -227 44 -152 -29 490 306 39 254 248 112 11 -172 -473 -197 29 38 -65 194 -10 75
5344 75 49 -248 218 451 238 187 89 -135 187 -95 78 -274 -133 71 -4 -63 -77 -65 -46 -122 86 -129 -232
5367 -232 -8 -110 372 129 50 -13 -139 99 -33 -53 70 244 240 -98 -176 -173 -68 61 32 -112 -259 109 -70
5390 -70 33 22 88 -227 159 -103 184 -163 -139 289 131 50 43 68 -185 -75 -212 -302 -18 -149 276 -173 -122
5413 -122 -107 -241 -476 -201 81 185 -14 103 341 -319 26 -276 -10 -42 -142 -23 107 -50 -125 156 -106
5434 -106 181 -319 -160 33 -134 -3 -78 -262 316 -84 -97 -29 257 35 33 -1 185 130 -101 169 -175 -67
5456 -67 30 91 -58 169 53 -182 -192 -24 -252 -109 123 161 54 -58 19 -169 303 -73 -93 -187 30 -277 -10
5479 -10 -3 -73 -62 -346 94 77 52 82 -13 -62 -28 -140 51 252 66 -340 -160 -189 -132 -187 -233 -86 -15 -298 98
5504 98 -209 -55 -354 -230 -144 138 122 99 -41 140 81 -74 -145 -109 -72 10 -96 123 216 180 11 -182 -75 -44
5528 -44 -131 -51 120 -142 -29 -40 90 -128 -98 29 297 180 3 -67 -224 142 -238 -158 -365 -21 88 140 -114
5551 -114 -219 -60 -53 -77 69 -122 245 -214 -16 117 -182 60 225 -20 -13 51 -109 140 -40 105 88 -25
5573 -25 -199 -105 -142 -46 98 197 322 49 -101 9 -85 11 -115 -197 -9 -1 -103 167 236 98 -216 98 -110 -84
5597 -84 -33 -94 -192 66 179 49 -79 -206 -39 -231 67 4 -128 53 18 -5 58 210 239 -176 225 -32 -194
5620 -194 52 -49 -63 -132 90 -96 -127 96 43 -68 -181 -162 115 18 24 116 -89 -93 19 72 -42 257 -19 -238
5644 -238 102 -45 -187 45 411 -11 -204 -120 12 -98 -138 262 -178 9 85 10 -165 74 285 241 -257 133
5666 133 -50 -68 -153 123 -174 170 86 -109 87 -141 -125 15 -88 76 -10 -122 -11 -79 113 28 -297 41
5688 41 -48 -28 -88 16 -1 170 -40 -68 8 -138 287 -243 32 52 51 -163 78 -52 224 -94 194 121 184 -121
5712 -121 -96 137 152 78 -43 -96 -100 -282 63 -127 82 -1 -116 -46 7 21 100 357 -3 303 -170 -7 -42 68
5736 68 -276 -362 -189 181 81 -223 -95 136 -13 -93 0 -175 78 136 -133 -305 -11 196 -225 144 255 -46
5758 -46 -48 29 -210 62 -30 83 149 111 -36 77 -317 -299 -320 125 -168 -77 118 -197 -9 -217 78 -132 75
5781 75 -1 -214 152 25 59 138 -15 -61 -56 161 39 69 23 -105 -153 -114 50 -19 -93 64 176 160 -28 48 65
5806 65 17 49 -125 112 52 199 -91 126 -64 -111 47 -2 122 -24 8 -123 -140 38 -31 -90 -128 -213 -65 -74 -86
5831 -86 14 98 14 46 -56 2 119 208 -78 282 28 139 97 -55 60 264 -12 36 -21 -216 84 46 80 -149
5855 -149 -96 189 14 164 -88 -209 260 -112 -22 -88 -123 385 21 -232 -326 -250 145 47 -83 96 -25 -259
5877 -259 -29 -45 -129 -51 82 283 139 127 -46 -153 120 12 74 -66 180 59 69 -35 78 89 62 -12 -135
5900 -135 145 81 -67 28 -16 72 148 2 -72 223 -64 47 -148 -214 -118 -20 -116 151 -48 169 -153 302 27
5923 27 -58 135 127 65 209 -138 61 -39 31 -129 -313 -62 117 194 250 -47 112 -51 219 154 6 138 -116
5946 -116 201 18 267 -138 -92 24 -253 -201 2 22 -131 87 -283 269 -228 150 32 28 -86 160 176 114
5968 114 127 276 -3 -284 -31 -207 -43 -86 93 -287 122 131 129 110 170 -148 -362 74 -6 23 122 117 -260 -7
5992 -7 -63 -120 -191 189 104 -86 92 -11 42 91 87 218 -27 -38 76 -121 203 80 -28 171 -37 -104 -148 -79 -53
6017 -53 225 -169 55 331 -174 -56 -94 45 135 23 56 -83 -236 -118 -154 116 81 -42 -27 72 164 238 -40
6040 -40 102 -30 -84 -62 -102 215 20 -153 -148 -148 -121 277 -90 143 -155 -29 81 -4 106 -202 -90 5 24 -12
6064 -12 66 -165 177 -204 41 -30 316 24 20 -62 -94 -159 -94 -59 -88 -18 167 -210 19 97 174 -76 172 138 54
6089 54 79 58 -83 -85 -28 -200 62 -35 -187 75 -108 152 -36 131 120 -62 -178 113 -138 -200 -68 -18 -160
6112 -160 -50 25 -304 43 -149 -102 211 25 -77 235 131 -273 -141 189 14 -33 134 286 -142 380 83
6133 83 -127 31 -46 85 -96 43 1 41 339 -59 340 -222 -199 -104 -59 13 -184 59 29 50 121 49 -104 -63
6157 -63 -18 58 7 37 2 43 163 -87 120 -131 168 234 -71 -35 -40 37 -120 -151 -37 -98 162 -87 -129 38 -92
6182 -92 -23 42 63 -99 21 -188 212 208 7 -120 -113 -30 -287 317 181 307 -36 221 81 -188 -18 112 140
6205 140 -176 -131 64 116 -163 351 27 -327 242 -180 53 61 -75 -24 -74 -21 -80 -170 183 84 -60 -166 55
6228 55 161 10 232 -92 -52 65 -212 -130 -51 -120 -10 27 184 -228 -197 -38 -265 153 -144 181 79 -23
6250 -23 47 78 49 -17 -152 10 -60 14 120 -78 -40 -50 48 73 -132 48 -177 14 160 -29 136 231 -15 -150
6274 -150 -440 76 44 -88 106 -111 -51 38 -25 125 -43 -169 136 6 7 -52 240 -122 5 6 210 -212 -85
6297 -85 100 -162 -2 -71 16 187 243 174 -106 -59 51 54 -131 23 6 -146 154 -19 -64 174 -50 -219 159
6320 159 278 85 141 -160 -22 257 170 153 70 73 253 -192 11 -306 -138 -66 -39 -95 135 -99 146 20 290
6343 290 86 73 5 -30 -181 23 50 -83 70 121 69 -89 81 -43 140 -227 -100 -94 -147 121 -84 6 -172
6366 -172 -122 152 56 43 -62 357 -70 344 25 93 129 139 179 -94 -39 -52 164 55 32 -140 45 81 -277 241
6390 241 -117 198 39 -215 52 -189 21 123 -42 67 145 128 62 -135 58 0 6 -135 -175 -81 140 220 27
6413 27 355 -43 186 -80 8 -128 255 44 59 178 111 55 -57 103 44 42 36 -78 278 94 -56 -38 131 52
6437 52 13 -80 62 -123 199 189 13 -10 -27 -12 -75 -137 -66 87 10 91 161 98 48 -157 97 199 17 -23 27 28
6463 28 186 -209 -4 111 -45 -33 459 -150 -169 78 0 72 201 -76 -89 -205 111 -28 -10 -120 178 -111
6485 -111 -212 -126 -123 -134 116 115 337 118 12 158 352 -104 -328 -76 46 5 -95 -7 -33 11 65 -117 -184 257
6509 257 41 -163 -13 -155 -170 -1 -54 127 66 152 -98 -53 208 113 224 49 -288 -113 -98 291 -113 -41 77
6532 77 102 -155 75 -11 93 -157 -54 -21 -79 -106 -106 28 -306 -21 125 -173 -56 65 28 -3 -20 -13 -93 16 -95
6557 -95 -52 -304 -103 -273 -216 373 -80 131 -105 -276 152 -57 23 -270 159 -202 221 234 -51 -15 -169 34
6579 34 -291 172 -8 76 -72 -15 47 45 47 -1 -18 -93 -50 -13 158 -81 -159 -211 -54 -34 90 -204 -156 -37 -86 -267
6605 -267 -343 -13 -23 37 14 59 246 142 -160 86 -76 -111 20 -46 -246 -19 -68 -20 -37 141 190 137 231 69
6629 69 47 111 156 43 41 29 117 -40 39 34 -20 -132 -170 -36 -68 -49 198 -74 38 69 146 -9 -228 62 -5 -175
6655 -175 118 170 53 224 10 153 48 -54 -79 -107 -138 -233 75 -87 65 74 251 148 13 66 -95 8 190
6678 190 197 123 23 -119 -14 -357 73 -90 29 75 -199 -303 -84 -96 -292 -66 124 -257 -38 201 20 -170
6700 -170 -42 153 137 -49 21 -71 67 179 -18 150 -149 20 148 -205 -45 201 -60 42 294 -294 -348
6721 -348 139 72 -89 -129 -139 -98 -73 49 -178 19 -37 46 218 -147 186 -65 88 -93 90 -355 18 -121
6743 -121 12 -44 42 310 72 15 -79 -223 -206 -109 107 110 183 47 -220 171 246 76 -39 -150 10 122 -313
6766 -313 -4 26 198 26 -158 136 92 -20 -47 205 23 83 -67 -8 -219 -71 30 -44 124 -205 149 -33
6788 -33 61 116 -47 -24 -59 7 -144 -147 93 101 -16 258 -169 104 -50 -283 -102 260 -29 122 36 22 -100 256
6812 256 -358 -61 -6 130 213 383 -223 111 208 125 154 -10 1 199 -84 75 -165 94 -86 -211 19 38
6834 38 128 231 -150 -187 40 49 -264 242 447 -175 -77 93 -61 -12 43 80 -161 -161 -76 -260 189 -183 144 84
6858 84 154 29 -274 -287 -89 -2 -260 109 32 -114 -3 9 44 84 -74 -102 -5 32 185 127 -131 147 -209 -103
6882 -103 -219 156 -35 56 -96 128 -59 129 168 198 119 97 184 -127 -103 -180 -3 150 17 108 -152 -17 -70
6905 -70 -26 212 -121 267 197 97 -101 -73 -141 -117 -186 -45 -105 -82 -9 40 213 13 0 81 -131 42 380 -1
6929 -1 -69 50 178 37 -9 -11 67 -119 -20 -4 202 -99 -99 -101 -176 -26 -39 -235 5 -73 -87 -89 207 -312 66 174
6955 174 143 4 -105 167 186 7 -82 34 -58 -94 35 41 81 -170 139 138 60 160 6 27 18 -123 -28 -186 -148
6980 -148 280 -1 -178 -218 -57 -33 216 -85 130 -15 -91 -228 12 -13 -161 -150 231 -45 -130 83 101 17 61
7003 61 152 -199 -18 -31 -82 -48 -87 376 -19 -273 61 -81 -29 -39 -59 144 271 161 85 67 -175 -186 4 -198
7027 -198 -66 149 66 53 5 -306 -124 -214 20 -194 65 108 3 68 219 117 -24 127 -4 -331 -137 114
7049 114 203 261 -113 227 -26 56 -146 15 109 -102 323 172 134 -53 -124 109 -171 -235 99 22 62 -12 -33 100
7073 100 -23 -102 39 66 -131 88 28 156 3 268 77 14 10 109 -111 -309 -118 6 -183 -115 -190 -94 15
7096 15 13 -125 42 -166 75 298 -81 214 300 -178 21 -89 -91 116 92 24 257 80 -193 -103 -6 55 -250 -251
7120 -251 -107 220 94 4 -31 265 56 -7 -98 76 -43 22 334 -73 -63 74 87 -60 -226 -110 258 159 129
7143 129 -71 129 146 2 -148 15 -90 -195 71 -19 -315 -37 164 4 21 -86 -211 -83 38 250 -6
7164 -6 -220 204 -353 -228 -151 -2 -100 -80 78 2 -28 -119 57 -198 138 -1 -132 54 -16 3 80 -38 -139 -98
7188 -98 -106 -87 -6 -85 -54 83 5 30 -229 -33 -343 -51 45 135 -55 42 -69 -130 185 107 112 -210 -92 -37 65 -89
7214 -89 -83 -103 -80 171 -174 -72 21 -248 -116 -65 170 -99 -146 -28 116 151 -74 128 -61 -56 -10 98 -36 34
7238 34 128 -139 -206 18 -177 -189 316 -81 24 239 -200 19 202 53 -169 106 -30 64 -54 -119 -205 -81
7260 -81 220 -28 -329 -56 117 -182 -5 13 40 126 -99 1 2 -79 75 70 -23 -109 -125 -158 -116 166 -39 283 165
7285 165 28 47 -80 -75 -13 254 -23 62 273 -54 12 -19 -157 -59 -11 159 -47 54 -68 -94 -35 -202 -77 175
7309 175 41 -70 -7 39 81 -134 222 -229 -107 6 175 5 -76 -196 143 -104 -65 -117 6 -67 149 0
7331 0 -13 -191 153 138 24 -34 -252 -27 -25 -127 26 97 -66 -255 -16 56 -94 -59 202 -121 65 -323 -125
7354 -125 67 109 6 -304 -52 272 -124 81 144 -172 162 -203 56 121 106 -91 -38 98 -303 135 -27 -140
7376 -140 143 21 -207 -200 102 -75 23 98 54 149 59 105 169 -77 -32 -125 -95 0 273 14 -10 55 -90 -16 -51 74
7402 74 159 14 185 122 -60 -57 60 -6 8 -281 8 149 -71 183 -22 -44 -134 236 201 222 188 -233 -128 137
7426 137 259 -228 16 148 26 -144 -8 23 -42 -26 261 -54 89 -338 -22 -88 5 178 197 114 -181 -130 65
7449 65 -106 72 50 -293 -186 123 205 -5 57 70 21 -8 101 128 -70 -144 67 -274 116 273 -351 41 -263
7472 -263 -59 154 245 160 258 -59 -43 29 -134 -128 155 -116 -64 216 -189 72 202 -23 101 -73 -86 237 -124
7495 -124 398 127 281 137 53 -168 -7 3 70 218 264 167 -315 197 -13 -68 0 49 -53 65 147 125 181 87
7519 87 45 -39 89 95 36 -220 39 12 39 277 -179 -38 -125 78 88 171 180 -107 294 84 -39 43 -148 100 113
7544 113 -5 -110 -17 121 -30 -10 -5 -256 235 237 53 -72 -103 284 -63 14 -173 -4 126 40 105 -110 257
7567 257 113 203 72 80 243 71 12 -100 237 -135 58 68 14 -79 -212 183 21 -183 -155 -16 38 60 -76
7590 -76 52 64 -100 -15 12 -96 -12 -244 -16 23 32 -32 59 -20 -138 78 -39 -10 51 38 -28 14 -63 139 -184 20
7616 20 -55 149 7 -157 -16 46 -60 29 -174 107 -281 -72 66 86 153 -125 -213 -119 67 -102 143 83 -72
7639 -72 -105 -5 -59 -188 -236 120 159 46 121 124 -32 -75 83 -128 -16 -151 -92 -33 -9 -63 105 315 -29 101
7663 101 -15 -87 -54 39 240 -16 240 191 186 63 -199 255 172 96 160 7 -32 128 14 110 91 62 180 143 -26
7688 -26 195 -28 22 314 -34 -87 -155 -116 -52 -38 -66 -149 117 -49 -87 -67 -220 -4 -39 112 100 66 62 -227 173
7713 173 -147 204 -237 -126 -103 -107 41 33 82 -175 82 -254 4 -55 187 -65 330 100 -133 128 -158 17
7735 17 -190 65 152 -209 127 -47 -85 -135 137 282 19 -345 -6 -45 103 -18 89 -81 -89 -15 -162 278 -58
7758 -58 121 73 106 -181 -29 315 -227 -39 -142 -137 156 72 61 -54 -106 -86 -237 3 -58 144 -168 -214 54 23
7782 23 40 94 -203 -120 -32 -139 -2 5 37 -136 -31 -85 109 -71 17 -205 27 6 116 -114 -156 -90 -24 -121 418
7807 418 79 -13 7 72 33 -82 -110 -169 147 32 69 -8 222 40 -24 -19 -70 -177 47 -31 149 -27 -255 55
7831 55 -84 114 -65 -100 -99 79 -282 120 126 -121 -76 113 135 163 -73 -271 -57 219 14 51 -51 -136 13 -136
7855 -136 -62 -69 -64 -135 197 -202 -297 -47 44 -32 228 -130 41 -188 -74 -92 -180 197 88 -8 -45 -29 -186 26 143
7880 143 -156 -142 61 14 2 1 165 -99 -159 157 -62 14 213 -1 173 -230 -68 28 -376 65 -17 14 12 204
7904 204 142 -47 21 51 132 -206 -59 -169 4 -213 143 33 -139 192 128 71 -69 114 -326 -44 -62 -108 -187
7927 -187 -133 15 74 -65 -128 129 -232 5 204 -62 26 61 -237 177 189 130 -108 106 8 -32 362 -55 -9
7950 -9 70 111 268 -98 175 -36 157 96 42 32 127 136 -4 70 90 -207 126 169 71 26 60 233 -57 252 -242
7975 -242 -142 -275 79 -37 114 77 -47 63 -101 -33 -6 63 -6 -93 -147 -121 116 33 106 -65 -83 -99 -12 -128
7999 -128 64 -68 -228 49 172 197 -40 -62 78 170 -116 -28 153 182 -78 30 57 131 -105 -302 192 -205
8021 -205 -45 107 -48 40 87 -38 77 13 -217 -105 103 103 -145 -44 -407 -31 -281 36 11 -175 174 137
8043 137 47 -150 171 -189 229 -38 -68 294 18 -128 42 -111 228 202 -152 -53 -79 -15 44 -302 153 -170
8065 -170 36 -313 -63 -47 -67 149 -3 98 149 92 -2 -35 136 -194 -191 86 14 207 191 9 103 -65 32 189
8089 189 174 187 -40 0 -40 115 100 11 -80 -459 14 263 -120 11 127 228 -144 -109 -184 0 85 -212 300
8112 300 -86 -82 80 -71 -48 -54 -161 -28 206 84 205 126 -15 -149 84 -69 41 38 -89 -270 -237 10 143
8135 143 -14 93 77 155 -49 -82 -131 15 123 -142 -245 -74 59 124 29 112 -195 82 -51 92 -21 15 73
8158 73 -192 65 -233 58 82 12 35 -186 58 -84 93 -89 158 -54 167 87 36 -46 -23 88 213 49 -198
8181 -198 187 -56 -80 -123 -5 -4 8 188 -177 -29
8191b9
$$ Imaginary data points
##PAGE= N=2
##DATA TABLE= (X++(I..I)), XYDATA
0 0 0 0 0 0 0 0 0 0 0 0 0 0 8 -8 8 -8 11 -16 16 -24 25 -32 39 -43 51 -59 71 -81 94 -108 124 -140 161 -180
34 -180 204 -230 261 -292 326 -364 403 -449 498 -551 611 -674 743 -820 905 -995 1098 -1209
52 -1209 1334 -1471 1623 -1799 1994 -2220 2482 -2789 3156 -3608 4171 -4901 5889 -7310 9534
67 9534 -13545 23084 -98276 -12320 103354 -20001 134001 147127 -48549 -58463 18149 -93734
79 -93734 -80570 -1845 -32718 14498 112243 58527 64170 69617 -95293 -133630 -13165 -72899
91 -72899 -65409 131310 100473 -27642 86083 75804 -114304 -74987 -3827 -115690 -57464
102 -57464 106533 78581 57100 93995 -11108 -83583 -46827 -75554 -50075 48501 8174 -1260
114 -1260 110401 57732 -33265 44385 -13830 -170782 -72348 36345 -25454 59323 168796
125 168796 35265 -47611 4885 -62553 -103073 -7775 700 -13931 61756 61922 32967 65124
137 65124 -4714 -94786 -47007 -49160 -81895 44558 105710 12473 40355 80354 -46466 -74979
149 -74979 3085 -60428 -89152 31336 58637 34486 91899 62347 -41716 -54951 -64596 -80118
161 -80118 -3650 37023 14904 60174 62137 -14221 7860 24344 -77260 -82123 -4954 -30806
173 -30806 -6141 111918 88025 1767 12805 -26558 -100216 -50771 1216 -13057 26948 60771
185 60771 30505 37581 32258 -35877 -50929 -43062 -72558 -20453 65683 47381 37864 68269 -382
198 -382 -64360 -20546 -25071 -65894 -9955 33568 13352 49322 77664 17828 -25298 -41061 -76658
211 -76658 -57359 3354 24907 48539 66077 20214 -7322 5596 -31078 -57625 -20433 -20493 -27700
224 -27700 40854 75624 37499 28232 8487 -61572 -72427 -28583 -15077 7980 47905 41079
236 41079 25477 27160 -581 -28105 -32313 -51231 -46039 7682 36531 42646 63000 35835 -28196
249 -28196 -38793 -31817 -47548 -23103 18510 16283 21499 47780 36275 5447 -12116 -42392 -61656
262 -61656 -37365 -2813 28859 57329 49060 16031 -1695 -22866 -43023 -29589 -15888 -18617
274 -18617 5699 39256 40022 35130 26909 -15283 -53395 -50101 -32793 -9117 27362 44982 35594
287 35594 23003 6139 -13410 -22631 -31675 -37156 -20287 5370 26098 48255 49291 15098 -19384
300 -19384 -37332 -46683 -35862 -3180 18534 24706 30695 28645 15176 -20 -16946 -36164 -41962
313 -41962 -27886 186 32342 48383 40134 16841 -12258 -34929 -37088 -24972 -12196 1383
325 1383 17474 27594 30284 27566 10732 -17372 -40340 -44363 -28101 183 28898 43686 35977
338 35977 14195 -6994 -20221 -27513 -26758 -19014 -7795 7733 26271 37869 33089 11909 -16978
351 -16978 -38145 -42264 -27452 99 23920 32435 28189 18646 4110 -10572 -19909 -26809 -30149
364 -30149 -17715 5806 27731 39867 35256 11706 -16886 -35030 -36779 -22589 -2540 13066
376 13066 22386 25694 21034 12827 1773 -16798 -33067 -33433 -19780 1795 27235 40789 31307
389 31307 9634 -11330 -26387 -29627 -21337 -8953 2617 13634 23247 27816 22129 4506 -16841
402 -16841 -32634 -35814 -22207 4568 26018 32145 26645 12233 -5939 -17672 -20438 -21156 -18074
415 -18074 -7346 8731 23416 31500 27139 8424 -17337 -33460 -32942 -18991 1213 19839 27314
428 27314 22460 13024 3718 -6975 -17844 -24685 -23046 -12384 5019 24331 34778 26345 4868
441 4868 -13674 -26821 -29903 -17404 326 9210 15599 22122 20013 10389 55 -14895 -29268
454 -29268 -29101 -15115 5642 25642 32396 22950 6740 -11533 -23747 -20854 -13670 -9334 1754
467 1754 13977 17146 20789 21705 3716 -18337 -26216 -27612 -18724 5328 24106 25268 20959 9671
481 9671 -5917 -14019 -16973 -19918 -13348 -2957 6072 21239 29735 17350 796 -11359 -28014
494 -28014 -29386 -9027 4936 10250 21317 20486 7284 3409 -1673 -17308 -22827 -17972 -12091 6050
508 6050 25635 27272 19890 6295 -16978 -26613 -17587 -12663 -3702 13905 15410 9890 17476 12911
522 12911 -6624 -13101 -17370 -26749 -13300 10502 18339 22782 22801 3821 -11970 -13418 -19314 -16865
536 -16865 -2813 1368 6991 22631 21113 7865 3195 -11854 -30468 -20568 -3602 1321 16187
549 16187 26451 11242 1491 2438 -10459 -17983 -11075 -12204 -9318 10422 20222 19267 19984 3274
563 3274 -19752 -20957 -18102 -15128 5592 19095 11004 12471 15006 -2240 -9364 -6003 -18390 -21096
577 -21096 -1339 7838 12395 25184 18150 -3238 -8960 -14859 -21516 -8749 2456 1497 12496 19777
591 19777 9180 6912 3580 -17845 -24076 -11557 -8819 2174 24291 20901 5956 5287 -4738
604 -4738 -19049 -11147 -5325 -10142 95 12342 10612 15885 16319 -3102 -14575 -15626 -21497 -10790
618 -10790 11409 13815 12387 18044 4944 -9629 -4700 -8929 -19196 -7779 2829 2152 14906
631 14906 23106 8135 -2326 -7145 -19913 -18100 -2629 1296 6260 16846 10758 4264 7369 -3863
645 -3863 -16749 -12136 -11157 -10781 9327 21703 12616 10886 5659 -14208 -17320 -7328 -8167 -3860 9460
660 9460 8512 7624 14379 7289 -5466 -8086 -15777 -19143 -3276 8107 10165 18027 14440 -3022 -6488
675 -6488 -5580 -14876 -11665 868 -691 3811 17291 14245 4285 1146 -10387 -20462 -11919 -2688
689 -2688 1788 13119 14832 5864 4491 1568 -9771 -9904 -6979 -11965 -4338 11438 12447 12277 13919
704 13919 -794 -15205 -12133 -10573 -9154 4508 10432 6659 9570 9122 -397 -3494 -7173 -15165
718 -15165 -11599 -491 4196 12616 18037 7700 -2879 -4906 -11669 -13808 -3405 313 75 9216
732 9216 12786 6804 5415 220 -12470 -15245 -9377 -5178 4848 14790 12081 6824 2965 -5417 -10013
747 -10013 -6750 -7672 -6895 2599 7363 8576 13070 9167 -4557 -9871 -11333 -13248 -4771 6945 8874
762 8874 8975 9499 3021 -2788 -3756 -8380 -11553 -6159 -1166 4598 13740 13127 5122 -756 -8143 -14103
778 -14103 -9399 -2072 349 5427 9841 6669 4912 3943 -3328 -10274 -10372 -9070 -4103 7032 12692
793 12692 11045 7223 -122 -7791 -9082 -7395 -6082 -1037 3941 5270 8646 9675 3597 -2974 -7613
808 -7613 -12266 -10835 -1507 5631 8903 11089 7192 107 -3841 -5815 -8225 -6986 -3706 173 5989
823 5989 10812 9770 5121 -1553 -9493 -12012 -8174 -2718 3248 8402 7987 5226 3384 -157 -5149
838 -5149 -7170 -7850 -6902 -1084 6278 10284 10305 5931 -1896 -8223 -9730 -7974 -3281 1725 5004 6835
854 6835 6964 4983 1465 -2845 -7857 -10091 -7184 -1156 5097 10146 10293 4653 -1160 -5036 -7593 -7382
870 -7382 -4274 -996 1963 5824 8029 7675 3530 -2623 -7863 -10401 -7929 -1530 5120 8344 8157 5297
886 5297 521 -3374 -5229 -6038 -6034 -4010 475 5304 8386 8645 4613 -2111 -8298 -9396 -6914 -2216
902 -2216 3438 6949 7023 4669 2886 -138 -4026 -6343 -6821 -5527 -886 5632 9314 8574 4011 -1493
918 -1493 -6567 -8501 -6358 -2167 1232 3717 5724 6164 4485 1068 -2360 -7030 -9192 -6118 -180
933 -180 4905 8362 8338 3805 -1595 -4426 -5596 -5891 -3906 -889 2352 4582 6987 7001 3070 -2745 -7153
950 -7153 -8581 -6471 -1015 4846 7322 6593 3937 889 -2760 -4640 -5243 -4796 -3607 513 5545 7348
966 7348 6647 3801 -2167 -7355 -8030 -5377 -1107 2755 5703 6047 4164 2096 -70 -3306 -6583 -6655
982 -6655 -4138 -63 4689 8109 7641 2642 -2480 -5159 -6375 -5504 -1881 1471 2514 4169 5962 4138
998 4138 1066 -2617 -6218 -7993 -5462 6 4594 7338 6939 3114 -992 -4255 -5326 -4251 -3121
1013 -3121 -1494 2239 5018 5428 5506 2831 -2817 -6632 -6160 -4781 -1151 4287 6218 5080 3295 914
1029 914 -2006 -4077 -4821 -4713 -2748 865 4443 7206 6277 1667 -2342 -5500 -6933 -4384 342 2164
1045 2164 3399 5580 4118 1138 205 -2306 -6110 -6039 -2971 3 4346 7473 6154 2510 -1731 -5266
1061 -5266 -5732 -3565 -1959 742 3686 4005 4346 4389 954 -3912 -5126 -5534 -5025 173 5178 5297 4632
1078 4632 3341 -871 -3853 -3930 -4007 -3559 -91 1590 3785 5983 4448 650 -1912 -5955 -7199 -2793
1094 -2793 781 2433 5383 5462 1401 -292 -506 -3697 -4847 -3168 -2569 -91 4822 6518 4170 1836
1110 1836 -2586 -5657 -5381 -3328 -1143 2743 4063 3112 3533 2865 -1349 -3303 -3640 -6057 -3487 2124
1126 2124 4203 4611 5486 1814 -3090 -3703 -3751 -4174 -1211 1115 1766 3953 4807 2296 633 -2415 -6326
1143 -6326 -5737 -2116 127 3561 6372 3739 424 -133 -2466 -4661 -2883 -1708 -1595 1810 4699 4236
1159 4236 3218 1641 -3315 -5532 -4465 -3468 491 4020 3672 3206 3151 -86 -2436 -2404 -3776 -4915 -674
1176 -674 2109 3182 5553 4667 10 -2873 -3674 -4850 -2773 708 1298 2551 4278 2475 1124 62
1192 62 -2960 -5452 -3384 -2017 53 4705 5479 2794 999 -1360 -4581 -3655 -1456 -1526 254 3332
1208 3332 3172 2862 3053 109 -3676 -4213 -4233 -2827 1410 3946 3488 3597 1749 -1991 -2219 -2178 -3775 -2175
1226 -2175 515 1352 3529 5216 2626 -604 -1910 -4446 -4664 -1294 1149 1983 3743 3031 745 353
1242 353 -1007 -3479 -3033 -2148 -1674 1332 4374 3880 2573 1062 -2759 -4562 -2842 -1770 -736 2169
1258 2169 2780 2247 2441 1434 -1243 -2822 -3545 -3860 -1098 1839 3286 4153 3106 -334 -2228 -2481 -3219
1275 -3219 -2358 -285 498 1581 3616 3413 1485 -199 -2383 -4434 -3690 -1063 941 3244 3821 2464
1291 2464 633 -574 -2282 -2626 -2148 -1784 -493 2411 3067 3265 2536 -189 -3388 -3506 -2464 -1774 1015
1308 1015 2672 2371 2173 1726 83 -1665 -2169 -3364 -2892 -247 1872 3162 3817 2098 -625 -2069
1324 -2069 -3095 -3026 -1341 494 1382 2270 2433 1630 700 -765 -2741 -3481 -2223 -776 1392 3506 3433
1341 3433 1665 2 -1807 -2746 -2056 -1516 -971 714 2041 2510 2556 1522 -984 -2602 -2940 -3017 -719
1358 -719 1709 2872 2406 2190 365 -1191 -1670 -2216 -2188 -1131 318 1405 3071 3042 1177 -794 -2813
1375 -2813 -3446 -2186 -437 1042 1976 2564 1685 738 -218 -1435 -2286 -2469 -1361 -18 1814 2946 2919
1392 2919 1271 -582 -2300 -2948 -2038 -732 320 1464 1991 1711 1347 563 -1063 -2396 -2626 -2061 39
1409 39 1803 2564 2464 1471 -535 -1533 -2221 -2004 -1238 -351 826 1986 2533 1934 599 -862 -2524 -2832
1427 -2832 -1914 31 1581 2363 2102 1411 126 -1055 -1677 -1922 -1681 -985 419 1704 2531 2025 700
1444 700 -1169 -2299 -2550 -1470 -346 1092 1998 1847 1356 662 -294 -1198 -1685 -2088 -1179 391 2079 2572
1462 2572 2131 703 -776 -1915 -2406 -1671 -562 298 1437 1388 1464 1186 93 -1221 -2083 -2164 -1223 265
1480 265 1883 2510 1766 696 -907 -1226 -1586 -1470 -770 95 932 1845 1935 1383 200 -1152 -2234 -2180 -1375
1499 -1375 550 1611 1823 1440 812 -258 -929 -1479 -1632 -1586 -495 775 1573 1965 1764 321 -1136 -2106
1517 -2106 -2080 -1093 -120 1162 1607 1387 954 554 -305 -1283 -1762 -1624 -872 713 1946 2112 1428 256 -1056
1536 -1056 -1820 -1501 -1000 -120 372 1264 1669 1584 709 -354 -1102 -2200 -1929 -647 702 1596 2093 1296 412
1555 412 -788 -1003 -1588 -1450 -637 -5 1233 1711 1461 1035 -11 -1580 -2064 -1625 -525 689 1605 1706
1573 1706 942 229 -97 -977 -1133 -1098 -950 -420 1031 1774 1625 1225 -31 -1532 -1853 -1327 -590 587 1093
1592 1093 1223 834 1013 -157 -418 -1303 -1520 -1269 -46 845 1525 1979 1134 -252 -1165 -1573 -1703 -783 152
1611 152 636 1099 1587 962 185 -414 -1399 -1991 -1325 -384 990 1478 1634 734 372 -843 -1315 -986 -655
1630 -655 -738 423 1502 1173 1271 926 -656 -1575 -1663 -1462 -341 796 1247 1194 1037 516 -500 -813 -977
1649 -977 -1575 -462 271 1025 1700 1939 415 -480 -1150 -1770 -1342 -197 244 1061 1211 976 486 71 -602
1668 -602 -1435 -1384 -828 -154 1165 1810 1331 827 -296 -1259 -1247 -660 -633 213 1029 1307 1107 1029 178 -1101
1688 -1101 -1301 -1411 -1118 128 1215 1267 1242 784 -521 -887 -1031 -1082 -899 58 306 1050 1815 1030 230 -469
1708 -469 -1645 -1704 -802 -15 564 1105 1224 374 113 -292 -989 -1026 -856 -377 423 1274 1257 1152 459 -814
1728 -814 -1539 -1119 -968 -144 970 822 841 792 586 -620 -698 -891 -1430 -693 651 1060 1453 1272 132 -668
1748 -668 -798 -1196 -1158 -195 260 497 1019 737 600 142 -615 -1606 -1203 -390 30 1028 1583 856 329 -342
1768 -342 -586 -874 -751 -548 -45 559 889 1148 936 60 -728 -1244 -1236 -1051 36 937 946 918 804 -201 -682
1789 -682 -982 -1141 -975 -473 363 1322 1422 948 -49 -728 -1346 -1282 -603 199 251 985 796 659 -81 19 -912
1810 -912 -1558 -870 -489 405 1303 1298 370 20 -587 -1246 -887 -554 -290 335 854 939 990 644 -192 -950 -1298
1831 -1298 -1110 -728 518 632 936 752 219 -601 -571 -651 -749 -223 -60 775 1337 993 631 -217 -787 -1494
1851 -1494 -1056 -443 431 702 1256 811 185 -121 -616 -1073 -1052 -829 -315 806 1323 1016 612 -164 -1018 -1377
1871 -1377 -764 -119 -17 817 813 920 668 493 -569 -894 -959 -733 -257 549 1176 1391 755 175 -656 -942
1891 -942 -932 -735 -584 94 662 1121 952 447 -93 -948 -1088 -828 -306 493 1160 908 729 176 -230 -763
1911 -763 -997 -341 -396 -14 610 1208 829 491 -185 -1108 -1504 -844 -137 623 948 1057 779 288 -182 -849
1931 -849 -989 -1204 -472 205 840 1087 1153 557 -276 -1163 -1061 -825 -309 178 449 946 1027 712 -87 -485 -1061
1952 -1061 -1179 -752 23 468 1069 984 825 -296 -741 -999 -963 -428 -40 480 802 1260 935 132 -349 -1141
1972 -1141 -1081 -934 -28 528 1152 921 533 423 -284 -658 -791 -584 -410 99 737 1320 821 609 -230 -822
1992 -822 -1033 -700 -209 324 794 859 694 271 -236 -815 -1036 -1157 -381 429 990 1168 761 400 -532 -1090
2012 -1090 -1062 -839 -579 19 516 956 987 602 195 -500 -1164 -1202 -576 243 940 1118 533 298 -6 -496 -925
2033 -925 -1029 -352 7 612 804 981 642 157 -877 -1164 -1129 -721 162 546 879 1124 479 149 -541 -703
2053 -703 -665 -912 -334 352 870 1220 737 180 -418 -1159 -984 -697 15 476 1056 914 563 201 -337 -875
2073 -875 -1180 -976 -573 194 1264 976 1132 188 -413 -789 -1094 -677 -29 291 627 636 679 503 72 -586 -1184
2094 -1184 -998 -743 120 931 1291 784 368 -450 -923 -663 -375 -446 120 581 936 1099 772 193 -773 -1314
2114 -1314 -1231 -431 137 749 1061 625 231 3 -375 -590 -997 -599 -172 431 848 775 834 66 -754 -1017 -700
2135 -700 -337 39 624 895 969 819 272 -360 -692 -985 -1079 -310 350 1001 888 569 367 -680 -826 -1263
2155 -1263 -552 -170 269 585 714 1081 285 -165 -588 -1223 -922 -515 114 675 1090 727 90 -318 -524 -907
2175 -907 -830 -386 48 424 942 997 416 -9 -647 -1096 -806 -511 173 768 1026 617 396 -96 -570 -795 -758
2196 -758 -501 -117 631 1070 973 655 -250 -552 -950 -730 -861 225 346 524 721 880 0 -376 -996 -993 -957
2217 -957 -213 450 905 1041 557 164 -414 -694 -885 -419 38 310 793 890 773 415 -391 -909 -876 -708 -394
2238 -394 293 843 957 625 74 -379 -508 -587 -614 -221 128 630 895 869 321 -78 -853 -930 -778 -166 462
2259 462 827 898 914 139 -245 -451 -676 -523 -359 -95 557 607 975 589 -43 -637 -758 -903 -381 274 431
2280 431 716 451 703 295 -432 -659 -665 -606 -342 452 964 1014 193 -114 -382 -658 -710 -734 -310 299 413 578
2302 578 798 173 -408 -874 -698 -929 -188 270 746 657 375 -32 -280 -647 -855 -473 -371 38 545 920
2322 920 762 262 -204 -696 -989 -720 -301 264 641 625 484 111 1 -625 -626 -550 -516 123 662 1122 1026 472
2344 472 -71 -822 -820 -667 -367 191 865 718 378 557 25 -239 -706 -741 -554 -158 671 801 845 261 -175
2365 -175 -81 -638 -935 -353 -103 483 676 721 532 322 -266 -669 -1145 -548 -129 518 920 410 599 152 -319
2386 -319 -861 -645 -513 -394 212 554 590 809 379 -160 -665 -676 -821 -211 532 579 646 702 203 -218 -523 -975
2408 -975 -724 -95 238 378 647 795 338 -93 -663 -874 -695 -542 172 529 634 682 648 -103 -452 -1062 -911
2429 -911 -308 105 559 932 969 416 -19 -236 -614 -605 -533 147 264 305 611 386 274 -445 -717 -806 -639 147
2451 147 441 649 753 525 122 -303 -628 -487 -688 -432 273 460 953 437 87 -338 -788 -559 -723 -11
2471 -11 361 736 520 436 310 -336 -586 -852 -663 -214 290 620 688 620 1 -314 -680 -884 -509 -513 238 158
2493 158 648 378 455 -55 -279 -861 -628 -422 184 605 637 635 166 -365 -330 -446 -296 -326 -97 489 652 343
2515 343 473 -52 -574 -924 -968 -440 32 584 717 589 247 -218 -363 -564 -725 -395 -34 124 542 944
2535 944 644 -45 -83 -439 -636 -298 25 279 713 555 549 312 -328 -581 -764 -304 -45 335 554 654 324
2556 324 499 -400 -480 -439 -250 -242 202 380 604 470 614 -13 -699 -876 -314 -212 144 593 542 460 277 -218
2578 -218 -702 -797 -455 -342 -117 578 419 207 145 60 -578 -456 -584 -476 44 507 430 578 739 -56 -554
2599 -554 -487 -428 -334 264 225 616 599 387 -72 -305 -719 -613 -205 147 451 458 536 429 172 -164 -269 -683 -460
2622 -460 -233 142 423 721 353 225 -60 -457 -786 -436 -174 282 322 571 639 134 -88 -509 -448 -462 -59
2643 -59 288 209 574 654 371 -125 -255 -570 -408 -97 231 576 565 585 480 79 -621 -479 -481 -86 87 286
2665 286 558 457 357 -32 -450 -490 -483 -267 -76 417 407 437 331 157 -299 -411 -249 -262 11 478 738 454
2687 454 606 111 -183 -469 -953 -197 56 232 523 596 123 218 -292 -358 -279 -369 119 224 365 225 253 -203
2709 -203 -262 -481 -446 -329 -179 212 736 421 93 190 -367 -300 -291 -512 -114 73 340 503 523 28 -215 -273 -424
2732 -424 -582 -271 246 325 573 352 -222 -275 -126 -302 -328 -142 -20 125 310 248 -41 112 -352 -613 -219
2753 -219 -323 -122 241 656 479 -127 149 -82 -320 -288 -240 25 318 241 313 287 -349 -190 -281 -262 -205 -120 92
2776 92 411 511 263 216 -35 -453 -492 -248 65 206 325 262 380 -26 126 -459 -177 -369 -347 264 301 374
2798 374 189 227 170 -284 -263 -355 -217 505 264 394 203 266 25 -50 124 -347 -114 46 126 463 202 449
2820 449 13 -251 -194 -266 -92 69 44 225 334 243 -9 -155 -374 -376 -292 -157 223 339 292 104 -102 -134 -123
2843 -123 -340 -405 69 -2 284 467 221 267 -7 -317 75 -225 134 244 80 524 131 219 -224 -393 -199
2864 -199 -222 69 127 196 315 319 167 -163 -133 -363 -95 130 155 34 67 126 346 154 -263 -355 -491 -162 -31
2887 -31 550 252 594 125 -415 -256 -505 -303 -101 -105 241 208 338 215 252 -116 -365 -238 -118 -131 248 448
2909 448 293 11 -67 -36 -430 -286 -315 -218 -50 28 177 116 85 -214 -271 -403 -360 -177 210 323 433 308 18
2932 18 -106 -216 -149 -236 -78 299 342 310 62 192 145 -350 -39 -359 -39 10 -1 184 38 44 22 -158 -58 -256
2956 -256 38 -109 143 377 441 302 -46 -330 -53 -379 -226 -60 -77 376 254 81 -49 -122 -326 -492 -157
2977 -157 -44 171 183 188 78 74 -377 -226 -125 17 -334 35 163 238 13 174 37 -123 -322 -321 155 157 -75
3000 -75 -26 193 -13 131 -213 -169 -246 -162 232 143 312 116 -84 -185 -217 -213 -146 -52 7 293 250 239 262 -67 -156
3025 -156 -449 -193 -233 189 46 174 121 147 150 -274 -1 -327 -171 14 54 151 106 55 -6 -197 -247 -340 -90 37
3049 37 -80 369 189 51 88 73 -171 186 0 65 163 205 129 29 -12 -173 -154 -258 -231 -125 55 87 280 -27
3073 -27 108 -105 -66 26 -238 168 -61 143 299 171 -3 -105 -22 -225 -79 12 87 257 130 97 10 7 -254
3096 -254 89 -117 -216 -84 179 88 160 -162 -131 5 -31 -55 -183 87 239 208 -50 444 289 -235 135 -342
3118 -342 -166 54 238 204 146 367 276 -68 -437 90 -221 -147 1 298 209 202 -1 109 -437 154 -214 -129 94
3141 94 141 24 -154 104 106 -33 -390 73 29 -88 305 477 145 -256 -5 -400 -392 149 -14 246 209 227 -46
3164 -46 -106 159 -92 -142 -183 101 -30 -93 -62 134 67 -61 -41 -299 -141 -192 69 58 235 -155 -15 -24 150 72
3188 72 -20 -159 -114 92 49 83 286 57 -239 -111 121 -72 -114 124 111 169 266 40 29 53 -142 -8 -48 -108
3212 -108 -63 31 -27 288 80 -162 2 -95 -280 -34 174 279 -99 218 219 -144 -203 -134 -3 -1 300 71 83 118
3236 118 193 -104 -160 211 -69 -125 317 197 165 -11 -76 90 123 208 -65 107 37 -188 -218 292 -44 79 -194
3259 -194 -30 -130 184 7 -54 261 144 196 -158 -405 155 106 -132 49 96 134 -107 42 -18 -47 -103 -95 -35 -115
3283 -115 250 182 -56 34 -43 83 -246 95 168 -102 93 81 -5 -81 -29 -7 19 -223 -27 28 267 42 78 80 -21
3308 -21 170 -5 -218 -21 46 256 96 147 -311 -18 -60 148 60 37 36 262 -69 45 203 18 151 205 -234
3331 -234 35 109 60 -45 136 -50 -48 -36 -45 245 -391 -262 207 62 115 280 80 -124 155 -57 -201 -85 31
3354 31 84 -40 -3 240 47 -57 -189 -129 -201 -58 -64 129 160 204 136 -189 147 -188 155 47 -167 263 221 66
3378 66 -11 -81 -92 -197 43 256 -80 103 -236 -116 -24 -107 18 -360 -258 223 148 -38 -23 0 167 18 -388
3401 -388 50 -44 52 -60 -82 -86 97 -186 -173 53 86 -24 -429 208 250 50 -72 141 -9 -194 61 -29 100
3424 100 -61 231 180 -116 201 -205 17 -157 -50 120 -155 171 -81 -46 30 -18 -87 -197 35 10 170 -21
3446 -21 23 150 -76 -125 11 -82 -74 -28 170 -291 -31 29 -86 -191 -217 -117 35 -22 5 -356 -9 -85 -1 -80 -112
3471 -112 26 13 0 99 -136 -54 -135 133 147 99 -194 -67 -188 101 81 5 91 -207 -2 -107 42 101 105 -105
3495 -105 -6 36 -40 126 68 13 254 -81 100 128 119 -161 -116 -129 -20 209 62 284 279 44 26 43 -99 0 20
3520 20 42 -163 102 242 62 -5 -198 1 -174 127 132 -105 -135 146 89 279 1 7 -65 41 69 -194 -103 96
3544 96 265 165 -209 126 114 -55 143 -187 136 399 29 417 -97 -271 47 -47 -63 -226 168 -67 286
3565 286 -112 -35 84 96 122 -178 110 -26 37 47 126 -64 -107 83 216 75 7 83 188 -192 -108 327 269 -158
3589 -158 -173 -229 -32 187 108 -93 97 67 147 176 0 -113 47 -259 -24 -14 133 384 -143 -141 47 -153 -158 110
3613 110 -97 100 418 125 -1 13 95 -157 -43 -156 -75 -202 37 -18 296 -50 184 -117 -29 127 -196 224
3635 224 307 -67 -70 -33 -174 -128 -59 189 -81 -78 72 -238 44 -101 -343 33 -92 -145 -131 250 40 58 88 282
3659 282 -295 -436 -409 79 186 118 136 -40 -186 -177 21 -53 -141 -255 -71 36 -32 74 154 -80 -12 58 -219 149
3683 149 61 63 97 151 56 -17 -98 -233 -30 -157 0 -108 -6 -51 -37 123 -285 -235 -49 205 353 -17 227 253
3707 253 108 178 12 -236 -243 -230 -259 82 -19 138 212 -5 -152 -168 -128 -22 281 -162 117 -19 82 11 -50
3730 -50 -124 -147 -114 30 26 63 310 200 -75 -208 -72 -74 112 27 71 164 285 55 -74 -226 -206 33 251 -259
3754 -259 110 31 168 5 -139 334 260 -391 -117 15 301 311 124 16 232 39 -58 -308 -172 -166 11 -220
3776 -220 225 397 329 -70 -258 83 -389 6 95 -308 -69 448 -57 91 -73 -226 -316 48 -267 23 198
3797 198 367 -317 -8 -84 -319 -249 -221 29 166 19 18 223 87 -30 -172 -122 2 -170 307 52 28 46 -242
3820 -242 -46 -312 -142 -408 -29 289 379 -102 50 -15 76 -128 -199 139 -114 -79 118 -89 184 129 -32 7
3842 7 -106 -147 100 -63 421 299 157 93 -4 -7 85 -181 -198 85 -12 101 210 130 142 -48 -314 -23 38 65 -23
3867 -23 -26 491 -116 -109 214 -217 -120 -103 156 -12 75 245 -216 -83 45 -304 -9 -398 -82 76 54 593 24
3890 24 75 -16 -380 -352 -78 -7 45 -25 260 277 -122 123 -278 -127 -225 274 109 220 -84 320 -1 89 -43
3913 -43 5 -96 113 145 258 140 49 247 -295 -279 -72 -252 -100 -67 173 256 209 -27 -142 -174 -151 -299 123
3936 123 -73 63 142 171 -17 163 -133 -80 -96 -259 -37 30 197 212 189 69 208 -296 59 -50 -251 222
3958 222 419 -60 -289 224 -331 -37 -169 21 -124 289 141 88 -3 147 -107 -274 -40 -6 -349 123 38
3979 38 -44 171 11 -290 -254 -217 -116 26 -207 377 120 131 -28 97 -35 -372 104 -107 149 57 193 76
4001 76 37 -91 -29 -196 -88 -8 360 279 133 116 78 -94 113 -206 -216 149 137 274 -52 4 -138 102 -210
4024 -210 -59 -159 60 -20 -56 257 94 7 8 -112 -71 -275 -227 -13 335 397 244 213 215 118 -204 -35 240 -289
4048 -289 75 217 268 121 46 -73 -302 -200 -273 -76 -61 22 198 449 27 -58 10 -203 -215 6 159 123 -151
4071 -151 52 250 89 -296 -177 158 -305 -92 220 302 29 -55 47 -63 -109 -136 -190 27 260 225 479 92
4093 92 152 -158 -250 -351 -193 -152 157 69 485 231 227 -90 -69 -309 -149 -88 43 -175 331 368 -53 -113 -263 -35
4117 -35 -69 -45 229 -206 198 9 87 -32 -205 -198 -54 111 161 312 96 188 224 -141 -530 -160 -374 -67 -102
4140 -102 113 226 213 -34 -181 -90 -263 -170 -28 95 83 95 225 166 87 -324 -201 -140 -350 139 137 -58 119
4163 119 428 135 -39 -95 -357 5 -40 -27 91 184 104 -78 -87 -349 79 188 -13 143 366 180 158 75 -318
4186 -318 -357 -255 24 -173 26 -37 159 -27 84 -97 -73 -91 -143 301 180 238 59 168 -119 -28 -158 -63 -312
4209 -312 104 -123 17 71 335 23 -9 -157 -333 172 47 23 -6 84 246 76 92 -145 -157 -312 147 -67
4231 -67 396 78 212 269 98 112 -371 -331 -209 -30 364 267 45 189 -228 -397 -2 -168 -386 -150 23 197
4253 197 306 171 0 47 -150 -254 20 -57 78 288 143 244 95 -311 -152 3 25 -244 147 78 215
4274 215 -100 241 -155 -365 0 -50 -295 123 -116 294 308 -66 -143 -383 -175 -267 -314 31 385 340 94 55
4296 55 258 226 -282 -189 126 -72 183 463 236 246 47 -204 17 -21 -38 -118 -124 302 146 -169 37 -188 -76
4319 -76 -284 36 -107 74 -225 253 166 105 -199 -156 -233 24 -158 105 196 123 -94 -258 -359 -232 -134 -101 -9
4342 -9 176 123 245 473 220 99 -318 -142 -200 34 220 -12 143 243 22 54 -287 -240 122 -32 -123 125
4364 125 71 15 -146 88 -337 -173 -71 -112 -52 -102 250 150 171 -47 -188 -186 -81 -181 -123 30 145 232 48
4387 48 -240 -119 -47 -158 34 -48 232 -121 -10 184 101 -157 -229 -122 -177 72 -96 195 246 180 5 -99 -90
4410 -90 -332 -251 -150 36 207 168 194 134 -352 -116 -217 -282 253 237 56 34 198 -188 -20 -206 -84 -147 -102
4433 -102 -11 105 35 252 30 -147 -26 -160 92 183 49 21 165 132 -165 34 -296 -317 -87 -322 56 201
4455 201 142 103 -79 -185 -236 -53 -130 -36 -36 -26 96 -45 38 131 -192 -316 -155 -115 7 14 129 204 114 48 -393
4480 -393 -454 -203 -106 -57 4 249 -65 372 150 -177 -93 -81 -171 172 322 52 161 123 205 -130 -122 -98 -108 -198 -6
4505 -6 49 46 -89 23 -126 0 74 -223 -162 51 128 179 125 94 -55 187 -467 -86 153 -54 -14 136 122 145 -132
4530 -132 -222 -209 -143 1 -117 -20 -209 97 80 -85 -64 -279 -324 -177 -152 28 -76 -116 187 -48 -435 -237 -217
4553 -217 37 -14 301 392 59 155 -100 92 18 -142 55 68 20 -19 87 15 -140 -174 59 -318 -102 7 -57
4576 -57 160 199 -50 435 -66 -217 213 -419 -159 -111 108 78 317 -193 -276 15 -171 -169 15 41 231 97 -31
4599 -31 50 295 -129 -162 -278 31 143 200 173 -126 303 -55 -215 -183 -534 -87 -78 113 71 344 400 -24 -223
4622 -223 81 -193 -48 -198 -66 247 105 69 -87 -80 -10 -181 -78 66 -25 178 109 168 172 21 -393 -265 -233
4645 -233 -43 53 100 21 52 -300 -39 -277 -456 -67 -68 192 231 -167 313 -77 176 74 -28 -364 3 -53 172
4668 172 13 357 0 -150 -166 -54 37 -238 39 94 262 84 -78 -142 -141 -264 -158 -242 118 -3 -162 233
4690 233 44 86 -165 -141 -202 -49 7 41 -21 189 301 121 -72 -273 -247 -431 -58 127 246 143 253 95
4712 95 38 -132 -87 -111 -33 -80 -78 217 279 197 46 -51 -163 -270 -22 70 -123 244 177 -242 -81 -20 1 -190 76
4737 76 47 369 128 261 163 -314 -66 -256 10 -167 42 140 256 244 -24 -80 -156 -151 -223 136 -13 36 -311 107
4761 107 27 -81 -190 -53 157 -12 28 240 85 391 -114 -167 -277 8 -204 -160 110 -181 -172 124 117 -35 -75
4784 -75 -176 35 -191 20 198 258 165 -189 120 108 -212 -124 -261 20 -223 210 204 -87 15 8 -141 -235 -326 -232
4808 -232 -119 -193 19 -46 182 161 -48 -289 -118 26 -244 238 65 351 -25 -84 -23 -378 -287 -90 -51 145
4830 145 -23 148 -14 242 129 -112 -161 -111 67 -177 31 340 113 -208 -17 -24 -88 -215 -86 227 291 203
4852 203 42 -64 29 -427 -123 -25 -137 75 99 149 198 -128 -92 85 -224 99 -175 64 170 83 116 28 -122
4875 -122 -302 2 -237 -15 24 319 67 -106 275 16 -107 -92 -226 3 231 -1 293 -7 -34 -91 -209
4896 -209 -170 1 -363 -54 290 183 92 -79 5 -12 -159 -152 -78 81 85 295 393 262 1 -247 29 -211 6
4919 6 -55 114 206 325 -10 331 174 -297 -147 -171 83 232 175 158 35 11 87 183 -53 -121 -202 -105 37 212
4943 212 -19 118 -174 -164 -224 -391 -26 261 -72 193 94 288 -98 -215 23 -23 -8 -25 -4 13 -9 -11 -78 101
4967 101 -226 129 106 -174 112 342 22 -50 36 137 -212 -270 -76 37 46 -116 302 204 -162 -225 -9 -148 50
4990 50 18 175 202 15 -93 -261 -220 -215 -76 245 85 19 -49 389 -152 142 -220 -289 -348 -103 -121 36 54 -82
5014 -82 317 -37 118 -281 -68 55 -274 224 17 -61 -167 -74 -94 -58 294 -195 132 129 -148 26 269 172 -121
5037 -121 -339 10 -100 -87 -15 -31 217 -90 64 -10 -155 137 -23 -83 -30 22 20 -36 198 -146 -198 -92 -64 -92
5061 -92 -24 255 262 4 -137 -18 -356 -379 109 34 -170 -3 246 38 2 73 -225 -236 2 -171 162 -90 36
5084 36 317 144 17 -135 -310 -44 66 88 -26 -130 182 15 44 -243 -120 26 -120 58 117 -72 64
5105 64 -57 190 -108 -39 -180 13 -96 46 -62 297 2 -108 87 52 188 -217 -231 -235 56 35 316 -142
5127 -142 124 -201 -414 -143 62 150 -59 10 143 277 -531 -38 184 -147 -235 107 192 292 -78 -130 31 -150
5149 -150 17 -142 -45 -182 -99 139 139 105 208 -128 158 -160 -50 -92 -16 38 35 -53 29 64 -173 75 -208 91
5173 91 35 18 178 -6 133 56 -220 -41 79 22 76 -106 -84 356 -42 -30 -17 -167 -22 167 -198 -51 -28
5196 -28 87 -129 -166 -35 -63 -96 -129 -212 -20 136 -28 153 -23 251 10 -147 76 -46 60 213 195 187 -21
5219 -21 44 -36 -132 -94 -43 174 73 170 121 179 -409 -44 -212 27 -83 204 171 55 94 64 -60 -54 -4 121 22
5244 22 57 58 -91 115 -78 -7 -135 0 102 44 294 84 49 65 7 138 -194 -28 -196 -110 293 -119 156
5267 156 -123 -43 -160 -138 67 -77 36 -220 218 89 -6 173 -161 -113 -200 -270 -186 119 132 104 83 -91 -62 -114
5291 -114 -86 211 -91 53 -6 182 51 19 -161 -79 94 -101 27 -2 98 -57 -199 121 27 17 31 -323 -52
5314 -52 -139 -67 70 -53 -85 -91 -202 -299 0 -94 39 213 75 232 150 -118 -38 -233 53 -61 81 375 -26
5337 -26 -25 -33 -160 23 -174 -243 106 31 33 -67 374 -78 75 -247 -156 -59 298 55 22 88 77 -59 38 47 -281 68
5363 68 -6 -198 -104 467 74 -89 -99 66 -342 -201 89 -273 -71 -340 156 -357 11 143 -107 -210 -41
5384 -41 9 -136 148 252 124 85 -80 77 41 -131 48 22 246 60 201 -3 161 14 -260 149 208 -356
5406 -356 -105 133 -316 85 146 -41 375 -254 202 153 -33 -23 80 111 7 -90 -55 -48 -146 -43 67 2 5 -179
5430 -179 -51 -180 -220 107 -48 68 -143 119 143 31 70 -338 109 -123 355 -268 -172 282 -117 -37 125 234
5452 234 -56 -139 -25 60 108 47 263 -130 -137 24 3 71 14 -107 -108 45 -56 104 -38 -152 -198 32 37 90 -509
5477 -509 196 110 38 -21 146 -125 -51 -20 268 -146 110 221 -117 -24 64 -34 -254 -121 55 132 -59 275 -105
5500 -105 -57 -154 -254 19 150 -187 77 156 226 44 -66 371 -147 -276 -147 -93 -111 25 -109 -16 -45 -126 30
5523 30 9 -309 -173 -18 156 6 12 -74 47 -179 42 122 124 19 -21 -133 -82 61 116 -190 46 44 86 -5 53
5548 53 -129 124 100 130 48 -54 42 172 37 202 157 -4 -161 -173 -20 153 57 -125 47 34 -104 220 368
5571 368 210 -94 -287 -256 -125 -64 -57 175 175 -41 28 -79 -222 60 127 -266 16 -181 -147 14 -100 -172 271
5594 271 -305 -141 -71 -126 202 264 -302 22 111 69 160 -193 -55 -204 -128 -116 217 183 -20 -108 183 -83 233
5617 233 -99 117 33 210 -75 -291 210 6 159 -86 74 -19 -166 -5 10 15 43 170 -143 -274 -15 154
5639 154 -16 -126 65 -123 -106 -70 -341 -11 88 -153 -153 12 -64 -43 -135 -262 152 -211 78 -160 240 95 -43
5662 -43 6 176 119 33 83 271 -28 -23 131 241 35 -60 130 -208 -205 -98 -92 -10 13 231 180 -257 214 -173 289
5687 289 57 -2 53 -110 -382 122 90 234 -35 4 -277 204 -127 112 -51 -226 -150 -155 -35 271 6 25 -201
5710 -201 2 -52 -129 -138 -133 -43 -170 1 -169 56 -23 -110 -119 -183 -1 -32 -215 -90 -45 267 23 131 -47 -70 -73 -162
5736 -162 -183 56 -134 -157 15 -76 -50 -97 165 -153 -114 188 201 -126 -91 90 14 167 22 -156 204 164 69 -70
5760 -70 135 -107 199 49 45 101 83 -77 -39 -50 -97 96 257 207 68 -48 -23 328 -99 111 42 -35 20 125
5784 125 30 -18 32 9 5 -62 89 -111 -230 115 -42 -86 109 87 37 162 -163 119 -22 -65 108 -156 114 -69
5808 -69 -16 0 -42 50 162 275 28 -15 78 -37 25 135 45 -126 11 220 -161 104 2 110 62 -117 -25 240
5832 240 -69 66 -201 84 -32 49 -72 75 26 -8 58 182 -78 -4 -11 142 22 -20 -67 -93 -76 -139 60 145
5856 145 -138 -111 180 -48 -171 -134 -241 28 27 67 -19 -61 253 67 -38 4 -77 -69 117 177 -121 151 182 -19
5880 -19 113 -122 114 179 204 37 -30 112 121 15 -137 -179 -112 -64 98 -105 77 60 114 -63 -51 113 -85 133
5904 133 -167 -5 -124 4 -55 -29 -125 72 -189 29 -24 -10 85 -135 175 179 45 175 58 -39 -140 20 -107
5927 -107 -32 -239 73 110 142 69 -92 -161 191 -196 -21 -1 -228 53 221 -141 174 -52 -56 202 -1 19 -122
5950 -122 -62 188 -50 11 85 111 190 -152 -40 -79 101 -60 52 -40 -46 -21 -205 -27 -18 -28 -92 146 48 -11 67 -318
5976 -318 212 247 143 277 220 46 103 -53 7 187 -149 -137 -162 -272 -172 -116 137 244 309 28 174 95 71
5999 71 -16 135 -142 16 55 -8 -213 -278 117 63 -186 -219 63 17 -91 284 32 -454 19 45 133 230 -18 -62
6023 -62 225 95 25 71 240 -177 -97 -170 140 188 -84 -49 -234 -215 234 22 -55 -47 6 -6 160 -92 64 -80
6047 -80 -34 45 -318 -94 22 151 -52 30 -131 -16 27 -182 -68 -5 -98 31 129 233 30 -293 -11 -193 154
6070 154 -4 14 -96 93 64 31 105 -152 -15 -155 69 21 159 102 -99 97 -225 139 172 139 79 -68 -55
6093 -55 -104 -180 -49 -141 -5 -58 -82 104 -428 -92 -124 -98 -35 95 48 219 71 -74 -133 -161 -126 -194 -82 122 -21
6118 -21 45 139 191 -236 -143 -245 32 55 360 -81 26 -104 -131 100 -76 -120 -38 141 -52 -379 48 161 -67
6141 -67 -157 -79 157 209 15 -153 62 -162 -242 15 108 44 118 31 93 86 149 103 -59 -53 89 137 44 -156 36 -175
6167 -175 -142 23 -18 245 -105 108 -145 -60 12 188 -331 120 185 192 46 20 -330 -29 161 8 46 -44 21 -124
6191 -124 52 -152 11 65 54 14 -16 69 160 -173 -22 -77 -168 -19 180 48 -65 198 -115 -201 -112 73 4 -13
6215 -13 264 160 155 -113 -124 -113 -34 -225 -211 -123 292 240 -19 33 -101 8 29 162 62 -157 7 128 449 331
6239 331 46 -433 -212 -68 40 332 -34 -308 1 -96 -229 -61 -83 -131 -287 15 294 111 61 156 102 -47
6261 -47 57 213 284 -47 116 66 330 236 190 28 -32 9 -211 15 -51 125 25 36 -52 72 -64 -74 18 -108
6285 -108 -272 102 -8 222 199 7 -202 171 -110 163 -257 52 82 255 240 -22 -25 231 -104 217 -137 -68
6307 -68 -42 237 -144 -195 -78 -113 44 130 85 -54 -46 56 -3 86 94 -95 -69 51 204 -192 110 -87 267 72
6331 72 -42 -102 16 -156 180 -185 3 179 18 204 -76 110 2 82 16 -16 202 22 94 -58 -212 -286
6353 -286 -374 104 -53 110 39 -53 0 22 -199 46 5 -309 -4 -277 242 -217 -16 -24 57 -108 -65 22 94 -272
6377 -272 -170 -218 129 84 -201 -62 -61 151 -5 -182 -186 118 -1 233 160 -22 76 58 19 -86 43 -206 214
6400 214 -211 123 84 -214 -278 -240 -92 -41 179 -44 -19 -79 -223 -21 44 -119 -33 -50 117 89 -69 -197 -113 105
6424 105 44 -177 77 115 -66 -21 43 -35 61 13 -139 -144 -72 249 -103 313 -86 285 249 -190 153 -14 -62 81
6448 81 430 -132 112 -56 136 -183 -59 -36 -61 -107 64 -135 -157 136 185 -45 -96 -175 -174 5 -179 -8 412
6471 412 234 86 198 3 -227 100 104 27 50 190 -4 277 30 256 -131 -147 -369 258 21 -93 135 26
6493 26 -49 -247 -286 26 83 55 339 130 115 -253 -69 -280 -124 -47 -84 93 53 -100 220 223 2 -280 -8 221
6517 221 110 -221 -4 101 32 10 -323 -68 114 -91 -55 -109 258 -29 -55 24 139 35 18 86 125 -18 -47
6540 -47 117 57 -4 -114 54 -208 -140 167 -16 -218 76 -354 204 98 190 130 -353 212 -55 -92 134 434
6562 434 -15 99 55 -68 -118 -34 -2 -171 -17 -67 78 37 65 -219 -70 -199 29 85 117 115 163 -132 60 17
6586 17 -23 -174 78 33 -121 512 -21 130 203 167 -73 -187 -146 -293 27 132 63 -56 -122 -112 -52 -124 39 -179
6610 -179 10 123 264 -29 -187 -39 19 -316 -24 -50 -73 -125 137 -2 -91 -13 -244 -26 118 52 231 -99
6632 -99 179 6 157 -143 1 -105 -8 200 -40 166 237 -131 12 115 39 -62 -327 45 138 241 56 256
6654 256 263 -39 -29 -139 39 20 -177 49 118 -258 97 125 89 -67 145 283 -364 95 -108 119 26 -114 -63
6677 -63 -141 61 241 55 -137 132 311 138 -101 -214 -382 -200 -41 22 -106 130 116 -101 -197 -35 190 -46
6699 -46 -368 203 282 159 251 -28 46 -107 112 -172 -10 -252 143 51 -83 80 -4 -165 -257 -45 -104 6 31
6722 31 111 -41 70 290 -35 -58 244 -318 46 307 0 244 195 -7 -216 -6 140 -167 120 15 -54 -89
6744 -89 36 68 -166 127 -76 -163 -132 -43 -21 307 -164 -11 -96 -180 -166 -180 -159 -264 93 269 178 10 260 -133
6768 -133 -272 111 96 -278 -127 -101 119 239 289 -82 -28 -152 -167 177 -205 106 156 -122 -285 24 -9 -107 78
6791 78 -299 -13 -41 269 161 144 -348 -114 32 63 129 -46 -117 11 -29 220 -55 -12 204 141 -64 -114 -68 -209
6815 -209 124 130 -79 -103 -132 -148 -148 -53 -140 65 -48 120 185 63 -178 -119 -66 45 -64 -145 -139 -190 -24 59 -93 -114
6841 -114 -76 199 -158 -16 -41 80 51 -32 82 -273 151 -343 30 109 28 123 270 189 -215 -160 -224 -138 -100 208
6865 208 -12 21 255 -27 97 -222 54 136 -92 4 -7 101 -204 -41 19 -220 -110 -140 -75 -355 110 293
6887 293 157 -98 -158 29 -12 129 135 -178 -13 72 -338 -258 -62 -37 -62 -132 143 -61 -52 77 85 91 -82 -46 -259
6912 -259 -305 -179 -172 -90 -153 25 -4 -182 198 112 -49 52 172 -131 7 -194 146 56 -79 114 -170 -50 -191
6935 -191 20 -248 165 -123 84 37 55 -122 155 58 -125 -113 450 106 -74 -176 -39 -67 -160 44 125 18
6957 18 82 -12 -140 94 182 -135 -68 108 -88 -189 -12 -266 40 38 -275 -141 -105 -38 168 79 -71 180 -260
6980 -260 -179 21 90 335 -134 122 154 15 157 -68 88 -270 7 -320 -19 125 36 -81 -92 219 25 -8
7002 -8 -97 -120 36 55 -28 88 -258 -137 32 73 -262 34 -160 -77 137 -82 -25 177 68 155 -57 -28 -151 113
7026 113 86 86 68 117 260 -323 -116 -98 114 -287 -64 47 46 41 7 349 -170 199 90 9 8 190 34 39 -86
7051 -86 88 -236 -170 76 -28 63 -9 -50 -100 -252 -21 10 -62 -72 215 142 -51 274 -48 295 -92 54 -42 182
7075 182 -268 -102 93 51 -63 -178 19 -23 -73 45 -309 294 206 -203 -117 -160 -124 46 -338 -150 -10 -85 91
7098 91 23 -82 66 162 15 -56 -14 -74 -76 109 -41 -98 239 103 80 38 -186 -79 -102 96 123 -127 -94 -9 -25
7123 -25 96 125 104 215 62 -15 107 41 -111 -13 21 -86 -236 -308 -110 -39 -101 49 294 178 -203 -92 -102 -145
7147 -145 183 -182 -6 182 -32 225 -5 157 170 77 -105 -47 159 -56 -239 -88 40 -195 -21 -75 97
7168 97 208 -114 139 34 -115 -194 -83 -31 50 63 -193 -116 362 159 6 -207 -244 120 -66 -139 208 -50 23
7191 23 433 -76 59 295 80 -64 -201 235 -41 81 -70 -10 14 -133 -169 81 -216 413 402 -163 142 -69
7213 -69 -55 -96 -156 -132 -9 -42 154 164 17 19 -57 -89 -303 -158 139 55 -131 112 -9 -129 65 35 -76 182
7237 182 188 -44 -53 222 -103 -46 155 124 158 69 143 -123 425 30 -44 132 -161 -124 21 -12 -27 176 -106 68
7261 68 35 151 165 -236 32 365 -72 25 9 103 3 11 171 -40 -106 -225 66 -133 265 125 62 201 73
7284 73 61 -14 19 143 -73 316 -360 -206 -1 -140 153 38 34 -128 46 290 104 90 -81 -32 -52 31 -95
7307 -95 -138 33 74 -74 171 242 -202 -116 307 -60 -6 -16 26 4 156 260 265 -212 -136 -266 -85 -37 198 -126
7331 -126 37 206 53 192 118 -71 -217 -18 -164 -149 195 193 150 195 -128 237 315 -35 41 338 15 165 -7
7354 -7 2 2 111 -225 -215 36 53 -32 -1 207 -170 -117 -211 -54 -31 -82 -36 151 -38 11 94 -79 -201 -261 -111 139
7380 139 -53 337 141 -115 254 144 222 162 -57 72 -196 7 -313 173 -93 -183 -11 -200 -328 -2 -37
7401 -37 92 75 -46 46 199 212 0 8 -219 69 56 57 -101 32 -309 134 -222 -81 -132 29 -181 -157 171 63
7425 63 -51 -147 132 -108 -50 -26 -120 130 22 150 -84 179 111 -28 -137 73 169 -108 -176 76 -109 -11 5
7448 5 -317 -8 38 -15 117 30 -144 73 49 307 -289 -267 -86 -74 20 -135 -103 -76 -93 -301 -57 -341 131 -24
7472 -24 75 -148 109 168 33 120 -234 130 -68 60 -39 53 273 -57 -118 202 53 -17 -154 110 -5 -185 11
7495 11 -80 20 79 -272 101 -100 -144 -64 132 169 -49 -17 11 -259 -165 76 -22 89 -144 319 126 2 -102
7518 -102 -74 -131 -55 46 -37 -110 115 212 62 -61 -263 62 -26 -88 -38 -236 196 -343 201 132 -73 -174 10
7541 10 -28 89 -186 190 256 -51 -141 129 92 287 39 -46 -142 -1 175 89 91 109 -18 -42 -6 68 -232 117 -267
7566 -267 -135 -384 -22 44 46 328 -92 124 10 39 -85 131 -56 -32 -75 -58 -183 -134 241 77 -74 12 -30
7589 -30 -315 -74 33 289 245 133 304 115 105 127 234 11 -34 126 -142 0 134 20 13 69 -73 167 171
7612 171 -3 174 109 11 -10 146 -182 -196 161 85 42 6 -11 -10 -12 -528 132 104 79 -82 -36 98 -2 -144 -173
7637 -173 -22 97 36 -101 -109 -136 44 -94 5 -52 51 -188 78 -234 -86 -99 -86 -88 258 -123 -83 215 -128 45
7661 45 -231 111 -180 118 10 218 -161 -125 59 133 246 49 -161 6 45 -27 199 -251 201 117 -19 83
7683 83 -67 107 201 -244 -38 -78 -148 76 66 -96 -203 -78 -30 247 39 193 116 -12 -315 -219 77 -135 33
7706 33 123 260 140 -214 350 133 -132 67 85 66 59 -241 -125 255 83 15 -104 -58 53 147 164 -107 61
7729 61 -212 51 -188 -81 -90 -89 89 -64 -160 -126 85 -104 30 -191 176 27 -58 62 8 18 -13 -289 -112 -30
7753 -30 -118 3 -46 -126 163 -245 16 -155 -247 -95 -190 -22 -17 -181 -85 -257 5 20 130 -138 -90 -5 -70 110
7777 110 -79 -146 63 60 -168 217 90 53 70 -1 -5 123 -337 140 -157 118 20 153 61 -124 265 111 159 -120
7801 -120 -52 53 98 168 -101 116 -129 59 16 114 -58 36 120 -70 100 41 71 -57 86 -49 -157 101 176
7824 176 -65 -131 131 -40 32 -28 205 -22 -164 -263 -148 -173 29 -130 -183 76 137 -10 -7 -70 -200 -62 23 -16
7848 -16 -19 210 40 -118 -37 -167 198 -198 -339 -156 -96 -226 101 -77 -184 8 66 113 38 107 -141 146 -331
7871 -331 -136 -121 -65 -152 -136 -33 211 143 -44 -26 151 -19 230 -122 56 336 -82 -106 146 3 -273 72
7893 72 216 -129 -305 -56 227 -123 -113 261 -213 77 -27 -149 36 48 213 82 66 -52 127 34 -133 125
7915 125 333 90 -38 -115 93 157 -77 85 -15 5 -168 -119 -50 -150 -89 103 -54 -179 295 159 11 35
7937 35 155 448 -273 36 161 -6 354 -79 -271 230 100 -129 8 218 119 142 -24 38 73 112 44 99 -127
7960 -127 0 -80 204 18 -22 205 -98 117 -82 281 -55 11 22 -135 -32 1 -122 -13 -134 -113 5 -62
7982 -62 186 -91 -98 -65 29 63 -77 11 -139 198 -104 225 -105 -86 -169 82 115 29 -167 114 22 -102 -100 173 84
8007 84 70 73 148 -179 -67 -12 116 231 -212 188 -213 337 -104 81 121 -135 -64 -174 -92 131 44 -165 21
8030 21 211 -35 -100 -63 -327 32 109 147 165 86 26 -49 -177 -301 -91 78 -212 60 -120 20 -284 329 209
8053 209 -11 8 -139 -217 67 -108 -246 34 -107 171 -240 -88 133 22 119 85 210 -61 87 -12 202 -71
8075 -71 98 -181 55 -14 -21 197 227 211 -97 96 -106 225 -230 -62 83 42 -51 -161 -23 -140 -333 -112 -9
8098 -9 57 -70 -78 -70 63 -16 -74 -230 -75 313 -41 0 -33 -19 123 317 211 25 269 -38 -17 127 115 -156 -247
8123 -247 130 -170 161 294 -96 282 219 72 79 -325 -53 145 -12 -141 198 -263 141 39 -93 -54 -258
8144 -258 -197 90 189 -12 388 92 -153 -59 -45 102 211 184 103 -43 -110 -20 -186 -204 -87 199 221 107 20 -137
8168 -137 -13 39 -144 -119 -126 -90 71 32 127 -337 123 -105 -34 32 265 192 -116 111 63 -166 -167 -45 -6
8191f
##END NTUPLES=NMR FID
##END=
