##TITLE=1H_DE-AcClnew
 200.13Hz, .
 8 sc
 19.8.2026
##JCAMPDX= 6.0         $$ Bruker NMR JCAMP-DX V2.0
##DATA TYPE= NMR FID
##DATA CLASS= NTUPLES
##ORIGIN= UXNMR, Bruker Analytische Messtechnik GmbH
##OWNER= pz
$$ XWIN-NMR		Version 3.5
$$ Wed Aug 19 15:03:10 2026 Russian Standard Time (UT+4h)  she@DPX200
##.OBSERVE FREQUENCY= 200.1313
##.OBSERVE NUCLEUS= ^1H
##.DELAY= (6, 6)
##.ACQUISITION MODE= SIMULTANEOUS
##.ACQUISITION SCHEME= undefined
##.AVERAGES= 8
##.DIGITISER RES= 18
##SPECTROMETER/DATA SYSTEM= spect
##.PULSE SEQUENCE= zg30
##.SOLVENT NAME= CDCl3
##.SHIFT REFERENCE= (INTERNAL, CDCl3, 0, 14.3821)
##AUDIT TRAIL= $$ (NUMBER, WHEN, WHO, WHERE, WHAT)
$$ ##TITLE= Audit trail, XWIN-NMR		Version 3.5
$$ ##JCAMPDX= 5.01
$$ ##ORIGIN= Bruker BioSpin GmbH
$$ ##OWNER= she
$$ F:/spectra/data/she/nmr/H-C/1/audita.txt
$$ ##AUDIT TRAIL=  $$ (NUMBER, WHEN, WHO, WHERE, WHAT)
(   1,<2026-08-19 15:02:11.93 +0400>,<she>,<DPX200>,
      <created by zg, POWCHK disabled, PULCHK disabled
       configuration hash MD5:
       00 E9 B6 7A A2 85 ED C7 34 08 36 98 17 FE 4E 26
       data hash MD5: 16K
       2B 88 D1 41 25 4B 65 16 5A 36 38 19 6C 73 8E DC>)
$$ ##END=
$$ 
$$ hash MD5
$$ 78 AE A7 2A 5B 2F 84 0A 0A 26 6F 83 6A 9D 87 B8
##$RELAX= 
##$RELAX= 
##$RELAX= 
##$RELAX= 
##$RELAX= 
##$RELAX= 
$$ Bruker specific parameters
$$ --------------------------
##$DU= <F:/spectra>
##$EXPNO= 1
##$NAME= <H-C>
##$PROCNO= 1
##$TYPE= <nmr>
##$USER= <she>
##$AMP= (0..31)
100 100 100 100 100 100 100 100 100 100 100 100 100 100 100 100 100 100 
100 100 100 100 100 100 100 100 100 100 100 100 100 100 
##$AQSEQ= 0
##$AQ_mod= 1
##$AUNM= <au_zg>
##$AUTOPOS= <>
##$BF1= 200.13
##$BF2= 200.13
##$BF3= 200.13
##$BF4= 200.13
##$BF5= 200.13
##$BF6= 200.13
##$BF7= 200.13
##$BF8= 200.13
##$BYTORDA= 1
##$CFDGTYP= 0
##$CFRGTYP= 5
##$CHEMSTR= <none>
##$CNST= (0..31)
1 1 145 1 1 1 1 1 1 1 1 1 1 1 1 1 1 1 1 1 1 1 1 1 1 1 1 1 1 1 1 1 
##$CPDPRG= <>
##$CPDPRG1= <>
##$CPDPRG2= <>
##$CPDPRG3= <>
##$CPDPRG4= <mlev>
##$CPDPRG5= <mlev>
##$CPDPRG6= <mlev>
##$CPDPRG7= <mlev>
##$CPDPRG8= <mlev>
##$CPDPRGB= <>
##$CPDPRGT= <>
##$D= (0..31)
0 0.7 0 0 0 0 0 0 0 0 0 0.03 0 0 0 0 0 0 0 0 0 0 0 0 0 0 0 0 0 0 0 0 
##$DATE= 1787137331
##$DBL= (0..7)
120 120 120 120 120 120 120 120 
##$DBP= (0..7)
150 150 150 150 150 150 150 150 
##$DBP07= 0
##$DBPNAM0= <>
##$DBPNAM1= <>
##$DBPNAM2= <>
##$DBPNAM3= <>
##$DBPNAM4= <>
##$DBPNAM5= <>
##$DBPNAM6= <>
##$DBPNAM7= <>
##$DBPOAL= (0..7)
0.5 0.5 0.5 0.5 0.5 0.5 0.5 0.5 
##$DBPOFFS= (0..7)
0 0 0 0 0 0 0 0 
##$DE= 6
##$DECBNUC= <off>
##$DECIM= 32
##$DECNUC= <off>
##$DECSTAT= 4
##$DIGMOD= 1
##$DIGTYP= 9
##$DL= (0..7)
0 120 120 120 120 120 120 120 
##$DP= (0..7)
150 150 150 150 150 150 150 150 
##$DP07= 0
##$DPNAME0= <>
##$DPNAME1= <>
##$DPNAME2= <>
##$DPNAME3= <>
##$DPNAME4= <>
##$DPNAME5= <>
##$DPNAME6= <>
##$DPNAME7= <>
##$DPOAL= (0..7)
0.5 0.5 0.5 0.5 0.5 0.5 0.5 0.5 
##$DPOFFS= (0..7)
0 0 0 0 0 0 0 0 
##$DQDMODE= 0
##$DR= 18
##$DS= 0
##$DSLIST= <SSSSSSSSSSSSSSS>
##$DSPFIRM= 0
$$ [...]
##$SUBNAM0= <"">
##$SUBNAM1= <"">
##$SUBNAM2= <"">
##$SUBNAM3= <"">
##$SUBNAM4= <"">
##$SUBNAM5= <"">
##$SUBNAM6= <"">
##$SUBNAM7= <"">
##$SUBNAM8= <"">
##$SUBNAM9= <"">
##$SW= 18.0517328524113
##$SWIBOX= (0..15)
0 0 2 0 0 0 0 0 0 0 0 0 0 0 0 0 
##$SW_h= 3612.71676300578
##$TD= 16384
##$TD0= 1
##$TE= 0
##$TE2= 300
##$TE3= 300
##$TEG= 300
##$TL= (0..7)
0 120 120 120 120 120 120 120 
##$TP= (0..7)
150 150 150 150 150 150 150 150 
##$TP07= 0
##$TPNAME0= <>
##$TPNAME1= <>
##$TPNAME2= <>
##$TPNAME3= <>
##$TPNAME4= <>
##$TPNAME5= <>
##$TPNAME6= <>
##$TPNAME7= <>
##$TPOAL= (0..7)
0.5 0.5 0.5 0.5 0.5 0.5 0.5 0.5 
##$TPOFFS= (0..7)
0 0 0 0 0 0 0 0 
##$TUNHIN= 0
##$TUNHOUT= 0
##$TUNXOUT= 0
##$USERA1= <user>
##$USERA2= <user>
##$USERA3= <user>
##$USERA4= <user>
##$USERA5= <user>
##$V9= 5
##$VALIST= <valist>
##$VCLIST= <CCCCCCCCCCCCCCC>
##$VD= 0
##$VDLIST= <DDDDDDDDDDDDDDD>
##$VPLIST= <PPPPPPPPPPPPPPP>
##$VTLIST= <TTTTTTTTTTTTTTT>
##$WBST= 1024
##$WBSW= 4
##$XGAIN= (0..3)
0 0 0 0 
##$XL= 0
##$YL= 0
##$YMAX_a= 630741
##$YMIN_a= -559637
##$ZGOPTNS= <>
##$ZL1= 120
##$ZL2= 120
##$ZL3= 120
##$ZL4= 120
##$ABSF1= 10
##$ABSF2= 0
##$ABSG= 5
##$ABSL= 3
##$ALPHA= 0
##$AQORDER= 0
##$ASSFAC= 0
##$ASSFACI= 0
##$ASSFACX= 0
##$ASSWID= 0
##$AUNMP= <proc_1d>
##$AZFE= 0.1
##$AZFW= 0.1
##$BCFW= 1
##$BC_mod= 2
##$BYTORDP= 1
##$COROFFS= 0
##$CY= -3
##$DATMOD= 1
##$DC= 2
##$DFILT= <>
##$DTYPP= 0
##$F1P= 0
##$F2P= 0
##$FCOR= 0.5
##$FTSIZE= 0
##$FT_mod= 4
##$GAMMA= 1
##$GB= 0.15
##$INTBC= 1
##$INTSCL= 1
##$ISEN= 128
##$LB= 0.25
##$LEV0= 0
##$LPBIN= 0
##$MAXI= 10000
##$MC2= 0
##$MEAN= 0
##$ME_mod= 0
##$MI= 1.114404
##$NCOEF= 0
##$NC_proc= 0
##$NLEV= 6
##$NOISF1= 3.799351
##$NOISF2= 2.8
##$NSP= 1
##$NTH_PI= 0
##$NZP= 0
##$OFFSET= 14.38212
##$PC= 1
##$PHC0= -4490.47
##$PHC1= 7.192299
##$PH_mod= 1
##$PKNL= yes
##$PPARMOD= 0
##$PSCAL= 0
##$PSIGN= 0
##$REVERSE= no
##$SF= 200.129724274929
##$SI= 16384
##$SIGF1= 3
##$SIGF2= 2
##$SINO= 400
##$SIOLD= 16384
##$SREGLST= <1H.CDCl3>
##$SSB= 0
##$STSI= 0
##$STSR= 0
##$SW_p= 3205.1282051282
##$SYMM= 0
##$S_DEV= 0
##$TDeff= 0
##$TDoff= 0
##$TI= <>
##$TILT= no
##$TM1= 0
##$TM2= 0
##$TOPLEV= 0
##$USERP1= <user>
##$USERP2= <user>
##$USERP3= <user>
##$USERP4= <user>
##$USERP5= <user>
##$WDW= 1
##$XDIM= 8192
##$YMAX_p= 0
##$YMIN_p= 0
$$ End of Bruker specific parameters
$$ ---------------------------------
##NTUPLES= NMR FID
##VAR_NAME=  TIME,          FID/REAL,        FID/IMAG
##SYMBOL=    X,             R,               I
##VAR_TYPE=  INDEPENDENT,   DEPENDENT,       DEPENDENT
##VAR_FORM=  AFFN,          ASDF,            ASDF
##VAR_DIM=   8192,          8192,            8192
##UNITS=     SECONDS,       ARBITRARY UNITS, ARBITRARY UNITS
##FACTOR=    0.0002768,     1,               1
##FIRST=     0,             0,               0
##LAST=      2.2672688,     0,               0
##MIN=       0,             -559637,         0
##MAX=       2.2672688,     630741,          0
$$ Real data points
##PAGE= N=1
##DATA TABLE= (X++(R..R)), XYDATA
0@%%%%%%%qJ6j6J6k2L0m0N0n8P2r4J19j45J71j98K37k85L37l94M56n28O10p01
30c75Q05r17J039j178J335j506J690j893K118k365K636k930L250l598L980m401
46b310M861n361N904o504P166p896Q702r594J0595j1723J3001j4465J6156j8137
60i605K0502k3379K6968l1582L7752m6475N9808q2806J32770m11744L11898O08981
72E93088j132726M90646O29395r64611J26684Q23155q33854p6493Q59219n56355
82d1852l86797Q49303l25718n97317P55689J3392p63292O41549K79612q76657
92d52088M17647N29813r14602K28645P48270q44914m224Q73741p58789k40922
102d17423R23507n66622m20225R28240l39441n87876Q08429j12459p12987O52184
$$ plain form
0 0 0 0 0 0 0 0 0 -8 8 -8 8 -14 16 -24 26 -32 40 -54 65 -80 91 -107 130 -155 182 -212 244 -284 326 -375
30 -375 430 -487 552 -626 709 -797 893 -1000 1118 -1247 1389 -1541 1709 -1889 2091 -2310
46 -2310 2551 -2810 3094 -3410 3756 -4140 4562 -5032 5563 -6160 6841 -7624 8532 -9605
60 -9605 10897 -12482 14486 -17096 20656 -25819 33989 -48817 83953 -327791 -15893 593088
72 593088 -539638 -48992 580403 -384208 -257524 565631 -268223 -344716 514503 -41852
82 -41852 -428649 420654 94936 -502381 253308 266700 -496592 144957 424569 -452088
92 -452088 -34441 495372 -419230 -190585 557685 -287229 -291453 582288 -176501 -417423
102 -417423 506084 -60538 -480763 447477 108036 -479840 328589 216130 -496857 155327
112A55327J60332p41330M52233L99533p49885J83022N85144o83034o0978P58151
122D58515n41234l00433Q30951l97045n34238Q32498j95585o75890P92722K2610
132B92871p77533O46875J99927q21170M64874L92795p58069K63733N38140o66172
142b23729O641O15365n16288k16597O79785l01763m16744O63245j06237o09126
152d25448N87330J12564p11082M98944L29131p66441L37243M78367p73599J58903
162a74088O15501o77623q852O94533n51324k12332O86637l80014l74077O56828
172B75189j46063m95962N53527O4432o08961L91631K80624o38194K34475M88412
182C99110o21782L2279O15317n76991j65107P12127m49475l15651P49337l08350
$$ plain form
112 155327 315659 -425671 26562 426095 -323790 -140768 444376 -238658 -299636 458515
122 458515 -82719 -383152 447799 50754 -483484 349014 153429 -522461 270261 292871
132 292871 -484662 162213 362140 -459030 5844 398639 -359430 -95697 442443 -223729
142 -223729 -217088 398277 -118011 -334608 345177 43414 -373330 289915 183678 -425448
152 -425448 161882 274446 -436636 62308 391439 -375002 -37759 440608 -332991 -174088
162 -174088 441413 -236210 -245062 449471 -101853 -314185 372452 -7562 -381639 275189
172 275189 129126 -366836 186691 251123 -357838 33793 314417 -323777 -89302 399110
182 399110 -222672 -190393 424924 -152067 -317174 394953 -54522 -370173 379164 70814
192G0814m69173O91084j53780n62398O07591M2963n91377M62708K02458o03943
202c03053K61964L48916n38862P6791M88557m31084j36150N52285l17131l40212
212c37979N89844j45690m83661N89089K0600o16564N07219J67777o86070M12361
222A6926L32113o76220K78255M40596o41685R7083N09339n29650n8111N61193
232C29839l66479k25272N32652k03220l83288M72766M970m75279L90486K00495
242B77670n53047K45337L53938n79412J07843N05549n32349l2258N89528m73035
252i0236j92775O13497l58615l02831O13828k03170l97204N33454o3059m74292
262c21403M16185J07607m80234K86464K66790m70501J02848L79074m26512o8194
$$ plain form
192 70814 -398359 292725 138945 -423453 184138 227101 -364276 98432 300890 -303053
202 -303053 -41089 307827 -231035 -154244 334313 -96771 -232921 319364 2233 -337979
212 -337979 251865 106175 -377486 211603 232203 -384361 122858 290635 -395435 16926
222 16926 349039 -327181 -48926 391670 -250015 -152932 356407 -173243 -231354 329839
232 329839 -36640 -261912 270740 67520 -315768 156998 161968 -313311 77175 277670
242 277670 -275377 -30040 323898 -255514 -147671 357878 -174471 -206729 382799 -90236
252 -90236 -283011 330486 -28129 -330960 282868 79698 -317506 215948 152889 -321403
262 -321403 94782 202389 -277845 8619 275409 -195092 -92244 286830 -139682 -207876
272b07876M90635l21620k22957N45616k21163l85522N40745r3449m85239N19441
282A58611N7885n46516M28056J71647n79964K99891K91160n31731J70324L89530
292C08893m55337l134M27652l50730j61480M58196j90308k90207M42541m4206
302A41880m21676L73981J04557m91768L07127K60775n17727J97596L60485n23050
312b07820O8546M42424m54814l7550M95088l59788j66506M76746k48647k73813
322b66134M43082q7181l40623L70008O0052m09346K45081K00502m26328J29741
332h1146L47986m01836r429M37246l70609j56261M98466k82971k59206N30352
342B52592j78840l60575M86931p9454m26663M21610N3484m32483L23164J62814
$$ plain form
272 -207876 282759 -38861 -261818 283798 62635 -322887 217858 124409 -360830 158611
282 158611 216496 -330020 98036 269683 -310281 -10390 280770 -250961 -80637 308893
292 308893 -146444 -149578 278074 -72656 -234136 224060 33752 -256455 186086 141880
302 141880 -279796 94185 198742 -293026 14101 274876 -242851 -45255 315230 -207820
312 -207820 -139274 303150 -151664 -189214 305874 -53914 -220420 256326 7679 -266134
322 -266134 176948 89767 -250856 119152 179204 -230142 14939 215441 -210887 -81146
332 -81146 266840 -134996 -144425 292821 -77788 -234049 264417 -18554 -277760 252592
342 252592 73752 -286823 200108 120654 -306009 115601 169085 -263398 59766 222580
352B22580m28241J74156K49373l74462L9230L39402k79227j05497L75480j90387
362B2407k53459L85108o6655l49568L81970N8746m33383L20320J54639m83192
372b63067K48826K62170m67755J65422L34376m38136M3233L65913l63645n9207
382a71870L93360k42763j60719L67275j28583k67900L10122J3780l25839K49186
392C6049J58703l70450J42774K64786l92161L6994L70075l55225n6976M34570
402B69139l10227j69394M43717k36900k45050M39508j25455k96133L80984l0577
412A19612l42150K85394P8166l34360J90716J88137l08810N9604K56449k72077
422g9319o7922L23305j89457j70654L60999j11539k81855L49216k8652l51952
$$ plain form
352 222580 -205661 -31505 217868 -156594 -117364 222038 -57189 -162686 212794 22407
362 22407 -231052 154056 87401 -262167 119803 178549 -254834 65486 220125 -263067
372 -263067 -14241 247929 -219826 -54404 279972 -158164 -114931 250982 -112663 -171870
382 -171870 221490 -21273 -181992 185283 56700 -211200 98922 112702 -213137 36049
392 36049 194752 -175698 -32924 231862 -160299 -123305 246770 -108455 -165431 269139
402 269139 -41088 -210482 233235 -3665 -248715 190793 65338 -230795 150189 119612
412 119612 -222538 62856 141022 -193338 -2622 185515 -123295 -63691 192758 -79319
422 -79319 -147241 176064 -13393 -184047 176952 65413 -216442 132774 104122 -247830
432b47830L32412P6359l84754K75238J50652m06708J84383K20272l71426J00953
442g0449K84727l08666j1536L00874k35899j22641L09161j19553k04304K95161
452A16875q745k91407K36744R3205l41674J82660K06114l51443J08275K76976
462B27580l53591J4019L24220l06507n5023L57469k33341j33071L35504j59598
472A7661k02348K97867n0593k33742K43359N2034k67336J48099J38996k73486
482a29489O1792K36541k44547l0296K96440k19456j34219L30048j62536k02674
492a98396L53764q8345k64418L25232k7382l10237K76872N5745l07134K15217
502C0918J28530k95426J12772J76194k56255J7169K30409j79396p7211K51154
$$ plain form
432 -247830 84582 160941 -223813 51425 202077 -204631 -20248 200024 -171402 -70449
442 -70449 214278 -94388 -105924 194950 -40949 -163590 145571 26018 -178286 116875
452 116875 108130 -183277 53467 146672 -195002 -12342 193772 -157671 -49396 227580
462 227580 -126011 -111992 212228 -94279 -149302 208167 -25174 -158245 177259 17661
472 17661 -184687 113180 62587 -171155 72204 124238 -143098 5001 143997 -129489
482 -129489 -67697 168844 -75703 -105999 190441 -29015 -163234 166814 4278 -198396
492 -198396 155368 67023 -197395 127837 100455 -209782 67090 122835 -184299 30918
502 30918 159448 -135978 -23206 152988 -103267 -86098 144311 -35085 -112296 138858
512A38858j10285j81512K45582k3192k47620K39474P1001k98081J94682J35408
522A64315l32625J39366K02679l16581Q7728K49364k88660R010K57711k38901
532f6594n6782K64747j51833j11856K40246p2647j76644J88077J8585k08632J41168
543G835J18762k27036O7208J87731k40525j0864K54185k13533p1086L01018j80147
554f452j44059L03698j37212j94889K98125o3941k19302K60487k902k43538J89230
565C9245O0377k31167J22242J31350j99217L3234J70725j67144n9589K05209j03855
576A410j27393K28004m2149j99277K13118J1591k46797J96589Q1018k60286J61779
587A7607J27511k69832R9985J61539k44081M8453J97507j93915j7339J99431j44449
$$ plain form
512 138858 28573 -152939 92643 69451 -178169 61305 132306 -165775 28907 164315
522 164315 -168310 -28944 173735 -142846 -55118 194246 -94414 -85404 172307 -66594
532 -66594 -123376 141371 -10462 -122318 117928 45281 -131363 56714 75299 -133333 7835
543 7835 126597 -100439 -33231 154500 -86025 -96889 157296 -56237 -127323 173695 -6452
554 -6452 -150511 153187 15975 -178914 119211 55270 -164032 96455 93553 -149985 39245
565 39245 99622 -131545 -9303 122047 -77170 -43936 126789 -40355 -99944 105265 1410
576 1410 -125983 102021 59872 -139405 73713 85304 -161493 35096 116114 -144172 17607
587 17607 145118 -124714 -24729 136810 -107271 -58818 138689 -55226 -72565 126866 -17583
598a7583q8547J92521o6448j35060J79493J2181j85912J34084P7479k19667R1946
609b5513J53228k20992M4637K02813k20863k0190K28966j92325o4644K49780j40257
620e360j08429K31624r3463j50638J96497k4735j61395J55842M4450j70811Q5363
631a055R5563j67970J9921J54705j37462m0552J91788j13347j10970K05221p5746
642B0096j54727K17670k4107j87129J98321J1341k13867J62391N7130k05207J25496
653G408J00136j88574O1302J20677j60571j169J47022j03700n6723J56303n2772
664B9339j23568J43633M372j66782J35525P1090j94880J05607J13960k18131O5113
675c4722J53963k06217L4259J83752j82929j2844J81280j51118n3188J75934r1465
$$ plain form
598 -17583 -106130 86391 19943 -115117 64376 76557 -109355 24729 102208 -117459 -25513
609 -25513 127715 -93277 -48640 154173 -66690 -86880 142086 -50239 -114883 134897 -5360
620 -5360 -113789 117835 24372 -126266 70231 45496 -115899 39943 84393 -86418 -1055
631 -1055 94508 -73462 -53541 101164 -36298 -76850 114938 1591 -109379 95842 20096
642 20096 -134631 83039 58932 -128197 70124 81465 -132402 29989 87119 -118088 7408
653 7408 107544 -81030 -19728 100949 -59622 -60791 86231 -17469 -74192 82111 29339
664 29339 -94229 49404 53776 -113006 22519 93609 -101271 4336 118296 -99835 -34722
675 -34722 119241 -86976 -52717 131035 -51894 -64738 116542 -34576 -87764 88170 -3295
686c295p8679J53606l7052j12269J07820J8752j26005O9652Q4096j26519J8901
697c0992J26387j30556l6997J63293j10229p4002J93043q4781j16780J91178o1513
708B8051j47829J84046j7974j55349J61773J7942j64399J13284M9493j51935O9295
719a3602R0247j21487J4038J10100r5180m8980J23547m9531r2124J35249j993
730E0284j36267J20882L3378j68068J05130P7969j71891Q4078J07039j73378M3569
741b7275J20106j54454J2503J35709j15033k1879J28334q0228o3142J11485k9757
752A6369q5260R6651K3711j08756O1589O2641j26974K8957J08327j22340L93J39741
764I5049j19310m0429J51153j03655o6701J62252p0015q7080J49461m3177j09898
$$ plain form
686 -3295 -81974 71632 34580 -77689 30131 48883 -77122 -7470 76626 -49893 -30992
697 -30992 95395 -35161 -72158 91135 -19094 -93096 99947 15166 -101614 89564 28051
708 28051 -119778 64268 46294 -109055 52718 70660 -93739 19545 69038 -82897 -13602
719 -13602 76645 -44842 -30804 79296 -15884 -64864 58683 9152 -82972 52277 50284
730 50284 -85983 34899 68277 -99791 5339 83308 -88583 -4505 102534 -70844 -27275
741 -27275 92831 -61623 -49120 86589 -28444 -50323 78011 -2217 -65359 46126 16369
752 16369 -68891 27760 51471 -57285 4304 66945 -60029 -31072 77255 -45085 -44692 95049
764 95049 -24261 -64690 86463 -17192 -83893 78359 8344 -78736 70725 27548 -82350
775h2350J21553m679j10159R3923L8053j06652M6211O5164r9757r83R7523p2307
787a4460l9602J19091m9734q5753J21304k4584j14034J25653J0983j28929J12190
798C2125L1640j42296Q5528N3654j31201O3595P5909j12050K5992P9425r0773
809b8452j2092Q5807m9927m0851Q6043j3499p8432P0005K1472j03144O0355O4931
821F2216j15340M1370R1294j28837J3662J12338j21207l102J30000j04077k7984
832d9667J24110q6117n0389J14215m9144n8431R6367j4198p1836N9881J7182p4318
844d2345K9224N6990o4834n378Q1479o1274m5140R9014m4900o8173J15505k4640
856B5528r1178J10754j2316j07834J01870J1109j05031Q8521K9520j03077N7305
$$ plain form
775 -82350 39203 34524 -75635 18288 56341 -50311 -4100 61064 -38693 -39676 57847 -14460
787 -14460 -54062 65029 15295 -70458 50846 26262 -87772 37881 48864 -80065 32125
798 32125 63765 -78531 6997 60651 -70550 -6955 68954 -43096 -17104 62321 -28452
809 -28452 -40544 45263 -4664 -45515 40528 27029 -51403 18602 40074 -63070 -2715 62216
821 62216 -53124 -11754 79540 -49297 -35635 76703 -44504 -47606 82394 -21683 -49667
832 -49667 74443 -11674 -62063 52152 3008 -55423 40944 26746 -45090 14791 31973 -42345
844 -42345 -13121 43869 -20965 -26343 55136 -6138 -51278 47736 2836 -65337 50168 25528
856 25528 -65650 45104 32788 -75046 26824 37933 -67098 21423 50943 -52134 5171
867E171M0022r0594L0222N8247o4015r5O4324m3270l8330O4294j2917o2535O8022
880A8546K0633q6066N6101M2053j05719M2900O8445j05505L1671Q5920j03628
891c4649P509Q8350r1765r690R2536o3829k4383Q2270m0544m5116O2110r711n2225
904c9137M6506K5117n7866J9261M7060o4209o690P1798n5560k4106Q9411m9359
916B226m8128R1046m0647o1728R4096k0227o6911Q4579o945p5252O3480J0191
928B5780o9195M6028L2343n8967J7102M2745n0453j3402N6144k8738l5119O6473
940C0741j0207o2319O2923N634p9449O2460K8588q4554N4039M0184r0215L5760
952f415M8275q0123K3718N7385o2308M243N1927m6120j6818M6432j7782k8255
$$ plain form
867 5171 45193 -45401 -15179 43068 -20947 -21042 43282 12 -38318 25976 13059 -49476 18546
880 18546 39179 -46887 9214 51267 -54452 -11552 56893 -48612 -16941 68979 -34649
891 -34649 -27140 61210 -30555 -40245 52291 -11538 -35921 46349 5805 -39311 22799 13088 -39137
904 -39137 7369 32486 -25380 -6119 40941 -23268 -29958 41840 -13720 -37826 51585 2226
916 2226 -45902 45144 4497 -57231 36865 16638 -50273 34306 27361 -47891 15589 25780
928 25780 -43415 2613 34956 -24011 -6909 35836 -14617 -28019 28125 -613 -35732 30741
940 30741 20534 -41785 21138 26772 -52677 9783 38371 -46183 7856 48040 -42175 -6415
952 -6415 41860 -38263 -14545 42840 -19468 -15225 36702 -9418 -26236 20196 2414 -25841
964b5841M0103Q047m5244K2728K8394n6159J1524N4226n7253q07O8430o2365j8542
977c2759P5962n6872k5840Q3765m4847l5097P6152l6456m4311O5126j7118m1827
989c4122N2326J893m2642K6760J5656l9070N050L6086k6092j6226M8012j9029
1001H602m2153N3521o658n5894O1123Q766o6670N5799J5096p4599M7187K5855
1013B9975o7476L9522L3173n9830K0929L1484m7752N616L4541k5485q054L1182
1025A7825q913k7687K2709J0373l8115K0198L2076m6617J0209M3061n5817r5N5409
1038C4616n2721m744O3581m9285j6266N9915m3065k3043N7613k6090k5117M7818
1050B3212j3142l1848K9888K268l0155J6740K1796k5909k513L1872k4757k1661
$$ plain form
964 -25841 14262 22309 -22935 -207 28187 -27972 -16448 37778 -19475 -20282 48148 -14217 -32759
977 -32759 43203 -13669 -39509 44256 -591 -35688 40464 4008 -40303 24823 7705 -34122
989 -34122 18204 20097 -22545 4215 19871 -19199 -14149 21937 -4155 -20381 27631 8602
1001 8602 -33551 19970 13312 -42582 18541 27307 -39363 16436 31532 -43067 4120 29975
1013 29975 -37501 2021 35194 -24636 -3707 27777 -19975 -14359 20182 -5303 -13357 17825
1025 17825 8912 -18775 3934 14307 -23808 -3610 28466 -18151 -7942 35119 -20698 -20793 34616
1038 34616 -18105 -22849 40732 -8553 -24819 35096 -7969 -31012 26601 511 -24606 23212
1050 23212 10070 -21778 8110 10378 -19777 -3037 18759 -7150 -9663 22209 -2548 -24209
1062b4209M2543j4803l1981N0641p099m4894M7201k035n0684M5236R345m7559
1074b8298L7939J4244m6651K2777J7832l7081J2348K5223k3666k940K4428j4445
1086A710j9720K4797J756k8826K6411J5275m1065J9925K3407m8665J6902L5508
1098B7415m7412J2492L9956m8135K101L9439m0611k313M0479k7248r101L1629
1110A8691j7034j7593K1447J5j8292J2810J6019k1902k873K6071k3542j3835L9144
1123A9126j8349k1959M5008j7479l2619M4575j3019l4252M5499n015l4037L7330
1135A4809k497l4030K6625M511k5415J7783J1401j8569J886J2891j1399j1109
1147a3113J8947J424k1250K1306Q793l4690J9213J6774m0334K0811K6384m2728
$$ plain form
1062 -24209 18334 3531 -28450 22191 15092 -29802 17399 15364 -35320 9916 19261 -28298
1074 -28298 9641 23885 -22766 11 17843 -19238 -6890 18333 -5333 -8273 16155 1710
1086 1710 -18010 6787 8543 -20283 6128 21403 -19662 263 23670 -24995 -8093 27415
1098 27415 -19997 -7505 32451 -15684 -13583 25856 -14755 -17068 23411 -3837 -12938 18691
1110 18691 1657 -15936 5511 5526 -12766 44 16063 -5839 -8712 17359 -6183 -20018 19126
1123 19126 777 -21182 23826 6347 -26272 18303 5284 -28968 16531 11516 -22521 14809
1135 14809 12312 -21718 4907 9418 -15997 1786 13187 -5382 -3496 9395 -2004 -13113
1147 -13113 5834 7258 -13992 7314 16107 -18583 630 17404 -22930 -2119 24265 -18463
1159a8463J6249K8015m4747R890L0411l7069O977L0658k8571j592K3093j9080
1171d229p627J7933l028j0259R751Q625j6705k250J9577j7495q686L1851j6364
1184A094j7190L5741j7720k4791L8684j2757k5381L9695q592k8204L2497o018
1196G058k7409K6654K035k1489J8022O422j8857M559J0158j1745m401J7030k984
1209E053j5350J7889J747k6286J8801J0524l0193K0017J7041l4788J4495J9129
1221A8079l5168J0772K3729k8579N994K3034k3400l044J9022j3487p557J7152
1233F547p90j3011R671P651j9305K664J8739j9502j701K7300k1159r814L0014
1246A7304k1222j3921L3980j5930j5722L2528j3340j9770K6716p863j8277K2400
$$ plain form
1159 -18463 -2214 25801 -18946 -9056 21355 -15714 -8737 21921 -6650 -8242 14851 -4229
1171 -4229 -11856 6077 3049 -7210 2541 11166 -5539 -7789 11788 -5707 -14393 17458 1094
1184 1094 -16096 19645 1925 -22866 15818 3061 -22320 17375 8783 -19421 13076 7058
1196 7058 -20351 6303 8338 -13151 4871 11293 -7564 -3005 7153 -4592 -8993 8037 5053
1209 5053 -10297 7592 9339 -16947 1854 12378 -17815 2202 19243 -15545 -1050 18079
1221 18079 -17089 -6317 17412 -11167 -5173 17861 -5539 -8583 10439 -3048 -10605 6547
1233 6547 5757 -7254 2417 10068 -9237 -6573 12166 -7336 -9037 18263 -2896 -12710 17304
1246 17304 -3918 -17839 16141 211 -15511 17017 3677 -16093 10623 2760 -15517 6883
1258F883M13j6301J2593M793j5515K052J2019r398n860J8431n044j7303K0032
1271G795r13k5157K3505O787k9099K2975J0349l3831J8260J3863l1819J5405J8199
1284A6319k6836Q048J6857k1787k33J6156j0780n431J4559p18j3773Q395Q061
1297H837j9241M941J9409k1294K97K5684k4992o356L0014k3786q735L4135k0333
1310a420j2648L1668j7942j6108K8334j0550j5105K3669l560j6124J3586K346
1322F146j4838N185J1486j0141m299J6959p810j5823K0777k310k2570K5077M204
1335A2043k9088K3553P611l3702K0956J3485l1978J7525J7234k9952R175J7600
1347A4462k4575K432J9546j4788m578J7668p033j3536J3871K924j8124J1706J3264
$$ plain form
1258 6883 7296 -9005 3588 8381 -7134 -5082 6937 -2461 -8321 10110 5066 -12237 7795
1271 7795 6882 -18275 5230 12017 -17082 5893 16242 -17589 671 14534 -17285 -1880 16319
1284 16319 -10517 -2469 14388 -7399 -7632 8524 -2256 -7687 6872 6154 -7619 776 8837
1297 8837 -10404 -5463 13946 -7348 -7051 18633 -6359 -12715 17299 -6487 -15222 18913 -1420
1310 -1420 -14068 17600 -342 -16450 11884 1334 -13771 9898 6338 -9786 3800 6146
1322 6146 -8692 -3507 7979 -2162 -6461 10498 2688 -13135 7642 5332 -17238 7839 12043
1335 12043 -17045 6508 14119 -19583 1373 14858 -17120 405 17639 -12313 -3138 14462
1347 14462 -10113 -7681 11865 -2923 -7501 10167 3134 -10402 3469 6393 -11731 -25 13239
1360A3239k2470N826J9289k6073N60K6154k4313l105L0136k2747r551K9382j8966
1373b639j3226K9015j1009j5492K4322m710j9185J6587L628j8511R925J3067j7170
1386e398l49J8579j5778j0166K4797j0063j7126K8501n361k5308K7234m12k9283
1399b0133K6037P025k9772K1016J1042k9858J2787J5132k4781O078J9409j8085
1411d103l441J9177j1587j2591J9508j542j8606J8562O772k5702J3901J3830k9203
1424a5025J0675K1971k9222N622K5807k9209j351K7970k4308n638K9214j7254
1436g48j1627K5238j0358j6782K0440M03j8457J4173R932k0944M172J7820k0543
1449g281l942K6570j6943j2439L0719j4268k1300L2375q468k5664L2823j851k9196
$$ plain form
1360 13239 -9231 -3405 15884 -10189 -9629 16525 -7788 -10893 19243 -3504 -13055 16327 -2639
1373 -2639 -15865 13150 2141 -13351 10971 6261 -12924 3663 7291 -11220 -1295 11772 -5398
1386 -5398 -5747 12832 -2946 -13112 11685 1622 -15504 12997 7636 -17672 9562 9150 -20133
1399 -20133 5904 12929 -16843 4173 15215 -14643 -1856 13276 -11505 -5427 13982 -4103
1411 -4103 -7544 11633 46 -12545 6963 5421 -13185 5377 12149 -13553 348 14178 -15025
1424 -15025 -4350 17621 -11601 -5979 19828 -9381 -10732 17238 -7070 -12708 16506 -748
1436 -748 -12375 12863 2505 -14277 6163 6566 -11891 2282 12214 -8730 -4558 13262 -7281
1449 -7281 -11223 15347 -1596 -14035 16684 2416 -18884 13491 5023 -20641 12182 10331 -18865
1462a8865K7804K883l0628K1674R802k7209J4549J4767k3736L912J7382j7685
1474e350m888K0977q776j3659K0946j636k2865J9191P249k7659J7523J5991l1446
1487a4402J1927K1338l3134O228K7011k9519P24K9789k5246p326K8567j8129j3085
1500a5257K7142p661j7780K1573J235k2690J3813J1361k3344O792K1125k3018
1512f709k815K6720k1528j1419L1886j5922j7630L3723j0851k4420L1042m669
1524G408k7491K7935L597k7966K1086R353k7980J1883J5553k3636L665K1413j8194
1537c374o871K3421j2356j6399K5273l258k3099K4769M544l0001K0410J1826l2832
1550a7947J6297J9881l2190R515K4128l0457R15K7016k3856n860K8554j5574j3965
$$ plain form
1462 -18865 8939 11822 -18806 2868 12670 -14539 10 14777 -8959 -5047 12335 -5350
1474 -5350 -10238 10739 1963 -11696 9250 7614 -15251 3940 11189 -16470 1053 17044 -14402
1487 -14402 -2475 18863 -14271 -8043 18968 -10551 -9827 19962 -5284 -12610 15957 -2172 -15257
1500 -15257 11885 4224 -13556 8017 9252 -13438 375 11736 -11608 -4816 16309 -6709
1512 -6709 -9524 17196 -4332 -15751 16135 213 -17417 16306 5455 -18965 12077 7408
1524 7408 -20083 7852 11449 -16517 4569 13922 -14058 -2175 13378 -10258 -6593 14820 -3374
1537 -3374 -10245 13176 820 -15579 9694 6436 -16663 8106 12650 -17351 3059 14885 -17947
1550 -17947 -1650 18231 -13959 -4444 19684 -10773 -9858 17158 -6698 -12558 15996 422 -13543
1563a3543K5393p094k0727K1638M130k4218J6195J3615k7784P859K1309k7902
1575a1129R88K8983k4973o580L2188k1955j4509L3105j5400j8973L2429p762k3406
1588a6994K6832q21k6031K0292Q300k4682J2271J5713k3275J264K1245j9023p985
1601a2894K6848j2031j7321K8470o012k6305K7826K167l0943K6019J0279l4225
1613a8122J9863J5811l4620J3033K1859l0210N700K5107k4981m055K5236j6979
1625b358j1666K5207o468j8550K1459K502k5227J6074J2470k7708J0935K1618
1637A8288k9021L025K7112k8468m190L2143k3624j0250L3869j8490j7393L1545
1649A4546j1312k1552K8492j804k3944K1532O037k5836J2444J4510k3534L893
$$ plain form
1563 -13543 11850 4756 -15971 5667 9797 -14421 1774 15389 -12395 -4536 16773 -11129
1575 -11129 -10141 18842 -6131 -12711 19477 -2478 -16987 16118 718 -18255 14174 6412 -16994
1588 -16994 9838 9017 -17014 3278 11578 -13104 -833 14880 -8395 -7131 14114 -4909 -12894
1601 -12894 13954 1923 -15398 13072 7060 -19245 8581 10748 -20195 5824 16103 -18122
1613 -18122 1741 17552 -17068 -4035 17824 -12386 -6686 18421 -6560 -10615 14621 -2358
1625 -2358 -14024 11183 4715 -13835 7624 10126 -15101 973 13443 -14265 -3330 18288
1637 18288 -10733 -7708 19404 -9064 -13254 18889 -4735 -14985 18884 394 -16999 14546
1649 14546 3234 -18318 10174 8370 -15574 5958 11995 -13841 -1397 13113 -10421 -6528
1661f528K2303k0092o881K6364j5621j6436K9799p958k3342L0164j197l0067K6574
1674G082N718l2677K2493J3589l2151J5328J8338l0544O420K2396k4472j342K5388
1687A5566j7092j0607K4496r379j8614K3228P69k3821K0089R425k8926J3864J7025
1700A6023l0376Q386K4676k8778J243K8422k6262o788L0253j9742j2405L0407
1712A5059j1739j8598K5883l690k3119K0439O613k4271J3334J5238k5150L533
1724f468K2120k3060m705K8712j8286j3056L1143j3846k1070L1224o892k5236
1736a9420K9774M75k8519K3977O273k9365J7238J3331k6260R506J8389k2700o66
1749g967K1275j6675r189K4236q351j7377K3736j151k5275K1364P414k9156J8521
$$ plain form
1661 -6528 15775 -4317 -11198 15166 -455 -16891 12908 4950 -18392 11772 10575 -19492 7082
1674 7082 12800 -19877 2616 16205 -15946 -618 17720 -12824 -6404 15992 -8480 -9822 15566
1687 15566 -1526 -12133 12363 2984 -15630 7598 8367 -15454 4635 14060 -14866 -1002 16023
1700 16023 -14353 -5967 18709 -10069 -8826 19596 -6666 -13454 16799 -2943 -15348 15059
1712 15059 3320 -15278 10605 6915 -16204 4235 10848 -13423 -89 15149 -10001 -6468
1724 -6468 15652 -7408 -12113 16599 -1687 -14743 16400 2554 -18516 12708 5816 -19420
1736 -19420 10354 10829 -17690 6287 12560 -16805 433 13764 -12496 -2990 15399 -7301 -7967
1749 -7967 13308 -3367 -12556 11680 3329 -14048 9688 8537 -16738 4626 12040 -17116 1405
1762A405J5512l1661J2243K0768l1729N728K5854k7357n67K7966k2088q536K6604
1775A4142j4445j4328K4700m427j8910J9292M172k3133J2105J3493k3706N505
1787e540K1941k3124l102K6807k1296j0668L0874j6050j6283L1965j1040k2142
1799a7658K9227m988k4861K5763K768k5328J9096Q556k5173J0417J4528k1221
1811h874K389K0013j6204p401K2140j0651j6141K3764k541k2296K3112M553k8181
1824a6318J9176J1064l0481J5218J7960k9576Q978K1643k7549J345K3925k1540
1836f155m779K5042j4057j1898K2348o507j7849J9088L129k1105J4602J1301k4254
1849a1094P641J8015k4637J901K4534k2358m450K7432j9817j1218K8252j4221
$$ plain form
1762 1405 16917 -14744 -2501 18267 -13462 -7734 18120 -9237 -9804 18162 -3926 -12462 14142
1775 14142 -303 -14631 10069 5642 -13268 6024 10196 -12937 -832 12661 -11045 -5540
1787 -5540 16401 -6723 -9825 16982 -4314 -14982 15892 -158 -16441 15524 4484 -17658
1799 -17658 11569 6581 -18280 7483 10251 -15077 4019 12575 -12598 -2181 12347 -8874
1811 -8874 -6485 13528 -2676 -10077 12063 1412 -14729 9035 6494 -15802 7310 11863 -16318
1824 -16318 2858 13922 -16559 -1341 16619 -12957 -3979 17664 -9885 -8540 15385 -6155
1836 -6155 -10934 14108 51 -11847 10501 3994 -13855 5233 8362 -12743 1859 13160 -11094
1849 -11094 -3453 14562 -10075 -8174 16360 -5998 -10448 16984 -2833 -14051 14201 -20
1861b0j5250K7636p440j9326K2990j169k1822J7315O930k1166J0485J3695k0219
1874g361J191J8712j7026o665K3651j1498j4277K5147o640k1539K4576j98k5154
1887a7081K3011O352k7435J7847J0766k7536J1883J5763k3720N577J8675j9313
1899e211k706J9262j3055r397J9825m728j5466J7759K301k1450J4192R961k4065
1912a2778J0898J7023k5408N296K1149k5273j30K4841k1458m691K6001j6992j0419
1925a1941K3829j0915j4117K1146k693j6398J5567M278j8565Q258J1639j7639
1937g551J634J8547j5681o424K2259j3221j3479K5195q141j8258K5876l557k2869
1950a5670K3159J029k4418J9929O720k3535J4404J0349k2044P106J3624j7435
$$ plain form
1861 -20 -15270 12366 4926 -14400 8590 7421 -14401 2914 9844 -11322 -837 12858 -7361
1874 -7361 -6170 12542 -4484 -11149 12502 1004 -13273 11874 5234 -16305 8271 8073 -17081
1887 -17081 5930 12282 -15153 2694 13460 -14076 -2193 13570 -10150 -4573 14102 -5211
1899 -5211 -7917 11345 -1710 -11107 8718 3990 -11476 6283 8584 -12866 1326 11287 -12778
1912 -12778 -1880 15143 -10265 -4969 16180 -9093 -9223 15618 -5840 -10531 15470 -1522 -11941
1925 -11941 11888 973 -13144 8002 5309 -11089 4478 8756 -9809 -1551 10088 -7551
1937 -7551 -5917 12630 -3051 -9475 12784 -437 -13916 11279 3138 -15120 10756 7199 -15670
1950 -15670 7489 8518 -15900 4029 10749 -12786 1618 11967 -10077 -2971 10653 -6782
1962f782P23J6645j1792o953J6815o188j3932J6765J221j8507J5523P538k2893
1975a1817J1596J2821k4589Q124J8325k3478L440K0806k1600k474K1713j6563
1987c696o662K1623j0052j1356J8118l760j5205J3953M244j6507R052J1130j7776
2000f894K156J6280j7086l429K1346j4271q722K3326j1755j4027K3207p345j6568
2013a3782K2205k148j8483J7937J938j9217J2721P316j7074P042J1673j4829n85
2026e286J4380j1195p032J7323n709j2904J7837j200j8698J6667M057k1313J5162
2039B089R350k2622J1014J2399k2384O279J5484j8718J735J6878j4371m283J5781
2052H631q788q957J4686j378j2660J1630M703j6497P295J0889j7633L763J6583
$$ plain form
1962 -6782 -6059 10586 -1206 -8159 8656 2468 -11464 5301 6522 -11985 3538 11076 -11817
1975 -11817 -221 12600 -11989 -3865 14460 -9018 -5578 15228 -6372 -8846 12867 -3696
1987 -3696 -10358 11265 1213 -10143 7975 4215 -10990 2963 7207 -9300 -248 10882 -6894
2000 -6894 -4738 11542 -5544 -8973 12373 -1898 -10620 12706 951 -13076 10131 2786 -13782
2013 -13782 8423 6275 -12208 5729 7667 -11550 1171 8487 -8587 -1545 10128 -4701 -5286
2026 -5286 9094 -2101 -9133 8190 2481 -10423 7414 6214 -12484 4183 8240 -13073 2089
2039 2089 11439 -11183 -169 12230 -10154 -3875 11609 -7109 -5374 11504 -2867 -7150 8631
2052 8631 -157 -9114 5572 4194 -8466 3164 7867 -8630 -1335 9554 -8079 -4316 12267
2065A2267j7803r97J9416j7283n366K1599j4028q107K1870j0574j1541J9270o421
2078B302j3172J6239n23j3332J1278M180j3557M728R004j1583r05J3767q741p482
2092g797J6010n997j3400J7640j511j7002J7882K423k0255J5354N673k1131J2682
2105E71R526j9452Q509J1382j7275K915J2365j2715j533J3132p065o707J1651
2118E304j995j1436R975M273j4153Q064R495j6676M345J3247j7591J470J6970
2131A1292j6137j655J8227j4505n528J7864j0798p769J6925n840r963J3255j381
2144C987j1757Q919M348j1428M442R328j1055j607J2737r643o554J6145o538j0659
2158i335J7249m033j4701J6424o56j6106J5227L130j6470J1539N462j5926P182
$$ plain form
2065 12267 -5536 -6533 12883 -4400 -9766 11833 -2195 -10302 11568 994 -10547 8723 2302
2078 2302 -10870 5369 4846 -8486 2792 6972 -6585 -1857 7147 -4436 -5341 8426 -315 -7797
2092 -7797 8213 2216 -11184 6456 4945 -12057 5825 8248 -12007 3347 9020 -12111 571
2105 571 10097 -9355 -846 10536 -6739 -3824 8541 -4174 -5707 7425 360 -6347 5304
2118 5304 3309 -8127 1848 6121 -8032 32 9527 -7149 -2804 10443 -7148 -5678 11292
2131 11292 -4845 -6500 11727 -2778 -8306 9558 -1240 -9009 7916 2076 -7887 5368 3987
2144 3987 -7770 1149 5497 -5931 -1489 7839 -3216 -4823 7914 -1729 -8283 7862 1324 -9335
2158 -9335 7914 3881 -10820 5604 4948 -11158 4069 7199 -9271 2268 7730 -8196 -1014
2171a014Q244j2833K932J0252r630k644J0666n835p289J1412p08j1012J0736L226
2185F503j4832Q886P157j6365P407J0972j6602M371J2572j6003R95J3849j2841
2198c931j644J3951r059n291J1791m721p947R607J149r452O167N909j1223J632
2212c062J0317j1088j894J4495j0049n895J6208r049r366J7045o249j0967J6732
2225G178l528j2481J3907j065j2532J0856K557j0910O719N024r442J356P200o567
2239a728l060R646l118p765J0222l17j2024J0403L479j4327J0163O596j6223P981
2253g2Q550j6466N832J0770j4429L072J1315j2097p45J0603q055l525R881k992
2267A642o415P317J325r101M420O324r997J811J0503j0809j846J2982j0734m475
$$ plain form
2171 -1014 7230 -5603 -2671 7581 -2049 -4693 5973 138 -7151 4261 3553 -7459 3277 6503
2185 6503 -8329 557 7714 -8651 -1244 9728 -6874 -2503 10069 -5934 -4939 8910 -3931
2198 -3931 -5575 8376 -683 -5974 5817 1096 -6851 2756 3905 -5547 620 6529 -4694 -3062
2212 -3062 7255 -3833 -5727 8768 -1281 -7176 9032 -17 -9383 7662 1413 -9554 7178
2225 7178 3650 -8831 5076 4011 -8521 2335 4892 -6018 701 5725 -3717 -2361 4839 -1728
2239 -1728 -4788 4858 1740 -6025 4197 3880 -8144 2259 5738 -8589 1574 8170 -8053 -72
2253 -72 8478 -7988 -2156 8614 -5815 -2743 8572 -3525 -4270 6333 -1722 -5247 4634 1642
2267 1642 -4773 2544 3869 -5232 -812 5512 -4485 -2674 7829 -2980 -4826 8156 -2578 -7053
2281g053J5179q932o513J5498p406q705J4147m837r292J2521j376r381Q952J297
2295D099r326M873M588p577J068P580n922l750R184l942p731J0917p99j0638J1220
2310C844J525j3395R988L974j4140Q763O599j3541N859P772j2355K399Q730r075
2324c053n80R165n498m406P986j813p391P004K795r359N337O203j1339K809R062
2339F922j1752J095J1697j1145j136J2290j0268l387J2242p697m486J1353m704
2352A024o078Q667j655o968N955K423o821K641N747o911j595Q556n919m773J1244
2367E537m194p999J2180k896j0718J2221n51j1657J1555J617j2127R067L011j1371
2381f325O310M932q996L100N888o669j014O204l409m243O695K97p304O010L113
$$ plain form
2281 -7053 8126 -806 -7319 8179 773 -7932 6215 1378 -7914 4607 3231 -6150 2802 4099
2295 4099 -5227 -354 4234 -3343 -2275 5305 -617 -4367 4817 875 -6856 4061 3262 -7376 3844
2310 3844 5369 -8026 1962 5936 -8204 559 7158 -6383 -524 7248 -5107 -2708 6022 -3053
2324 -3053 -3633 5532 34 -4372 3614 1801 -5590 1414 4209 -5150 187 6390 -4949 -2140 6922
2339 6922 -4830 -3735 7962 -3183 -4319 7971 -2297 -5684 6558 -1139 -5625 5728 1024
2352 1024 -5054 3613 1958 -5010 945 3368 -3453 -812 4935 -1976 -3571 4985 -934 -5707 5537
2367 5537 1343 -6656 5524 2628 -8090 4131 3580 -8077 3478 5095 -7032 2035 5046 -6325
2381 -6325 -15 4917 -4079 -979 4909 -1760 -2774 3430 21 -4222 2473 2770 -4534 1476 4589
2396D589j0115N083O189j1357M360Q590j2128K516R639j2015R96J0590j0113n11
2410c687J0253q048k648Q708m946m029P205r72n205M375K327o313J171N968o170
2425b011j545R129n908m804J0755n211p249J2088l487q723J2001k014r998J0474
2439C497l11r825Q753J844q775N753L127p612K335M616n145p52N889k693m258
2454c557O096m87p083O439K350q940O192M315j0655M971N921j0866L928P451r990
2469c915K058P792q741k45P647o021j997P141k883m216N397J46n986L703L807
2484C687o753J686O587p588q66Q695p379k676J0399o407m317J0569n438n764R973
2499D408l588o034Q751j515o227O242L09n959L630K697m720P92M581l802k552
$$ plain form
2396 4589 -5526 -443 5746 -5611 -1251 7339 -4789 -2273 7366 -4649 -3653 6937 -3176 -3687
2410 -3687 6566 -1482 -4130 4578 -368 -4397 2808 1836 -3369 1006 3333 -2980 -1809 4159 -2011
2425 -2011 -3556 5573 -335 -5139 5616 405 -6844 5244 1757 -6966 5035 3021 -6977 3497
2439 3497 3186 -6639 2114 3958 -4817 936 4063 -3549 -1214 3402 -1743 -2495 3394 701 -3557
2454 -3557 2539 2052 -5031 1408 3758 -5182 1010 5325 -5330 -359 5562 -5304 -1376 6075 -3915
2469 -3915 -1857 5935 -2806 -3051 4596 -1425 -3422 3719 836 -3380 2017 2163 -3823 -120 3687
2484 3687 -3066 -1380 5207 -2381 -3247 5448 -1931 -4607 5792 -615 -4932 5637 199 -5565 4408
2499 4408 820 -5214 3537 2022 -4205 2037 2346 -3613 17 2714 -2006 -1214 3367 -435 -2987
2514b987N938k334n084P349n33p371P743O90r230P446K327r721O871L715r685
2529d866N130M354q810L106N167o650R62N230m271j792M559j370l913M022J925
2544B783n779K731M433p350J240O869p913J96Q658q021j275R169p609k309R336
2559E159o159k872Q540m672l643O746k635l795M950j00l620K344J996l562m19
2574a742M232k822k767O237k017n300P233j244p139P952J26q128P803J158q796
2589e214O614K119q303N252L255p050L122L668n571O23M001l176j509M131o97
2604A265l822L480J472n663K979L787o620K313N322p441J177O332p377M11P045
2619D660o548n49O751n538j615O000l610k256N011j410l113L157P26l729J351
$$ plain form
2514 -2987 2951 617 -4467 2882 2349 -5022 2721 3411 -5819 1627 3954 -5767 1104 4819 -4866
2529 -4866 264 4618 -4192 -1086 4081 -2569 -1607 3623 -648 -2440 2119 749 -3164 858 2783
2544 2783 -2996 -265 4168 -3182 -1942 4927 -2986 -2790 5868 -2153 -3428 5741 -1868 -4177 5159
2559 5159 -1000 -3872 4668 -4 -3647 3099 464 -3331 1619 1519 -2101 243 2239 -1323 -1742
2574 -1742 2490 -332 -3099 3138 1121 -4179 3054 1810 -5329 2623 2749 -5379 2424 3582 -5214
2589 -5214 1400 3519 -4784 468 3723 -3327 -205 3463 -2108 -1485 2516 -660 -2169 1962 1265
2604 1265 -2557 923 2395 -3268 -289 3498 -3122 -809 4513 -2928 -1751 4581 -2796 -2385 4660
2619 4660 -1888 -2437 4314 -1224 -2839 3161 -449 -2705 2306 896 -2217 940 1666 -2063 -712
2634g12L186l721n23N157l880k577O463l403m047P574k556n218P577j774o100
2649d554O915n34n966N846P17n597L867J588m672J784K673l053l61L396j627k744
2665b322L688Mm499M060J670n868L894K684o905L433L706p035L062M343o742K080
2681g47M268n904J037M241m225j7L628k402j455K567k12k496J574K208l379J96
2697a118M101m213j200N835m308k177P030m182l318P327l808l852P157k803l932
2712c461O285j846l969M760q19l309L082N20k369R58J468j545j144K447l88k868
2728b198L383O18m569L638J405n667L899K294o153L796K751o339L066K996n771
2743b851K389L230m620J224K952l338j83K544j367j336K054N59k588J035K324
$$ plain form
2634 -712 2474 -1247 -1770 3387 -493 -3070 3393 -10 -4057 3517 961 -4257 3320 1546 -4554
2649 -4554 2361 1827 -4139 1707 2424 -3173 694 2282 -2390 -606 2067 -986 -1347 2049 422 -2322
2665 -2322 1366 1370 -3129 931 2601 -3267 627 3311 -3594 -161 3545 -3490 -428 3915 -2827 -747
2681 -747 3521 -2383 -1346 2895 -1330 -1347 2281 -121 -1576 991 779 -1717 -143 2065 -1314 -1118
2697 -1118 2983 -1230 -2430 3405 -903 -3080 3950 -232 -3550 3777 -31 -3883 3274 471 -3461
2712 -3461 2824 978 -2991 1769 950 -2359 723 1243 -1126 -168 1300 -245 -1389 1058 670 -2198
2728 -2198 1185 1803 -2766 872 2277 -3390 509 2803 -3350 446 3197 -3142 -76 2920 -2851
2743 -2851 -462 2768 -1852 -628 2324 -1014 -1197 1347 -20 -1356 698 1257 -1331 -296 2028
2758B028l557K34M025l948n60N114m278j472N602l948j941N804l235k358N171
2773B681k553k570M185j375k303L051k48k030J304Q32j708j76K088j087j637L012
2789A466o91l101L609j29l976M101M75m588L976Q30m897L490J395m437K797J805
2805B125l791J452J890k730J80K066j176j126J897K35k567J569J636l462J287
2820e15K972m105P50L749m553K29M260m239n7M340l765n38L743k986p88L102j784
2837a85q35K044o79j052P05O22j048m01K044j032j688L048j076k775L916p98l482
2854b672M518o07m085M484l50m220M165K10l867L395N13l370K201Q17k343R66
2870b45J182j098m84J236L0j864J225J403k826J158K465l728Q18L191m175O24
$$ plain form
2758 2028 -1529 -1295 2730 -1218 -1778 3336 -942 -2414 3188 -760 -2701 3103 -132 -2490 2681
2773 2681 128 -2442 1743 368 -1935 1116 868 -1162 142 974 -734 -910 1178 91 -1546 1466
2789 1466 775 -2326 1283 1154 -2822 1279 1754 -2834 1142 1972 -2925 565 1960 -2477 320 2125
2805 2125 -1666 -214 1676 -1054 -874 1192 16 -1110 787 1022 -1545 24 1660 -1802 -515
2820 -515 2457 -1648 -898 2851 -1702 -1473 2787 -1452 -1509 2831 -934 -1472 2271 -715 -1503 1599 -185
2837 -185 -1020 1024 345 -707 -2 620 -428 -829 1215 183 -1505 1543 467 -2308 1608 810 -2672
2854 -2672 1846 1239 -2846 1638 1288 -2932 1233 1443 -2424 971 1484 -1886 315 1132 -1211 -245
2870 -245 937 -161 -645 591 621 -1243 -18 1385 -1441 -283 2182 -1546 -728 2463 -1712 -1088
2886a088L751m104L63L762l883r7L450l093k74K950k097n80K044j066r40J072
2902A70L36j019Q7J550j255j072K586j372j955L606j192k671M065j075l404M206
2918A591o85l530L985o9l492L208L01l208K195Q63k338J047J343j520m17J518
2934G92n36j544J741O64k557J685J449l427J460K204l711J287K790l809Q58K840
2950B186l572L59K927k749r5K559j854p59J972q19j273J422N96j778O48J713k268
2967g85k35K774k366r68L780k404j704M158k269k341M324j684k503M033j128k710
2983b028L220m21k517K212M87j954R61J083j441m88J704n52j671K256K25k836
2999a760K376Q91l680K396J703m120K365K104m333J915K287m064J422K553l375
$$ plain form
2886 -1088 2663 -1441 -1078 2684 -1199 -1296 2154 -939 -1213 1737 -360 -940 1104 38 -902 170
2902 170 506 -513 -426 1124 -131 -1203 1383 11 -1944 1662 470 -2201 1864 789 -2615 1591
2918 1591 906 -2624 1361 1292 -2200 1008 1309 -1899 296 1159 -1179 -132 1211 -309 -726 792
2934 792 256 -1288 453 1117 -1440 245 1694 -1733 -273 1931 -1780 -493 2297 -1512 -654 2186
2950 2186 -1386 -1027 1900 -849 -944 1615 -239 -998 974 155 -1118 304 900 -878 -230 1483 -785
2967 -785 -1020 1754 -612 -1580 2200 -204 -1908 2250 -19 -2360 1964 280 -2223 1810 682 -2028
2983 -2028 1192 771 -1746 466 953 -1001 -40 1043 -398 -886 818 266 -1405 851 1076 -1760
2999 -1760 616 1507 -2173 223 1926 -2194 171 2275 -2058 -143 2144 -1920 -498 2055 -1320
3014a320P62K355k553j24K034j312q55J704M4j716J011J259k459L86K609k737
3030i12l09L621l034j153M201k930j700M608k407k177M382j899k524L771j050
3045D88k435K976r3k276J673P09j931L44J595j190r36K252o27k216K584N7l158
3062b184K960Q21l852K905J304m342K542J863m260K155K312l893J238K443l284
3077a272L18K594k168o11K488j000j743K073K47k508J583J670l117R91K671l544
3093a328J27L554l445m89M120l074j263M071k464j879L806j483k102L161n01k421
3109a610K114N28k422J122J697k171j29K534j937j388L296j427k343L856q51l231
3125b362L828k83l832L696M66l961L245J095l966K247J619l489J222K235k634
$$ plain form
3014 -1320 -558 1797 -756 -880 1154 -158 -1013 691 735 -981 30 1289 -1170 -784 1825 -912
3030 -912 -1221 2400 -634 -1787 2414 -516 -2216 2392 -15 -2192 2190 291 -2233 1538 488
3045 488 -1947 1029 936 -1340 333 1042 -889 -545 1050 -140 -1076 1176 549 -1667 917 974 -2184
3062 -2184 776 1597 -2255 650 1954 -2388 154 2017 -2243 -88 2224 -1669 -431 2012 -1272
3077 -1272 -954 1640 -528 -1139 1349 349 -1394 679 926 -1582 1 1671 -1446 -455 2216 -1328
3093 -1328 -1201 2353 -1092 -1581 2539 -535 -1798 2273 -191 -2070 1736 253 -1849 1312 811 -1610
3109 -1610 504 1032 -1390 -268 1429 -742 -871 1663 -274 -1662 1634 207 -2136 1720 869 -2362
3125 -2362 1466 1183 -2649 1047 1513 -2448 797 1892 -2074 173 1792 -1697 -475 1760 -874
3140h74K9K422j691j369K529m49k402K480Q56l394K002J880m044J509K920m181
3156a777Q81L608m107P6L841l610n76L929k679j222L503j730j833K740m19k193
3172a568J986Q64k406P75J974k516l45L130k278j372L961k030k509M347j541l205
3188b733M566p85l746M254j44m050L510O95l866K602J497l349J257K016k661j12
3204a049K490j548j409K763m31k677K574O83l563K351J866m074J857K656m411
3219a922J134L349m160M60L752l634l85L694k859j156L460j634j814K987m32k513
3235a673K120Q55k894J257K230l065K40L196l124q42L970k684j762M514k071k614
3251b347M391j354l247L989l52l450L341N82l495K135J446l143Q96K361k451m26
$$ plain form
3140 -874 -845 1577 -114 -1483 1046 597 -1805 675 1531 -1863 139 2019 -2025 -516 2404 -1777
3156 -1777 -896 2712 -1395 -1319 2522 -1088 -1664 2265 -414 -1636 1867 137 -1696 1044 625 -1568
3172 -1568 418 1282 -1124 -349 1625 -891 -1236 1894 -384 -1756 2205 175 -2334 2013 472 -2733
3188 -2733 1833 1048 -2698 1556 1412 -2638 872 1567 -2299 303 1800 -1549 -292 1724 -937 -1049
3204 -1049 1441 -107 -1516 1247 816 -1861 713 1396 -2167 184 2050 -2024 -167 2489 -1922
3219 -1922 -788 2561 -1599 -1139 2613 -1021 -1406 2288 -571 -1727 1733 99 -1715 1272 840 -1673
3235 -1673 447 1302 -1592 -335 1895 -1170 -930 2266 -858 -1700 2270 -414 -2176 2338 267 -2347
3251 -2347 2044 690 -2557 1432 1080 -2370 971 1553 -1942 193 1639 -1504 -608 1753 -698 -1124
3267a124K904j787j771L192p76k852L344L02l749L069J094m291K600K008m342
3282b179J926K695m173J008K986l568R9L262k617q42L134j505j959K749j28k729
3298a841K281J236l370J491K397l832O55L462l707k94M228l436j196M428k845
3313c43j959M466j921k463L942r33k888K994J99k917J987J369k720O60K215k322
3329f34p23L005j659j862L571r57l012L683k18l855L707O85m274L272J383m525
3345b413K545K042m245J692K636l649O24K802k752o21K890j504j696K807k16k706
3361a764K242J062l453J693K337l741R15L265l912QL883l576o99M227k870j552
3377a935M127k110k207L700r99k545K988J35k789J906J191k794P65K277k471l85
$$ plain form
3267 -1124 1780 -7 -1778 1414 638 -2214 1130 1432 -2317 752 1846 -2445 155 2163 -2179
3282 -2179 -253 2442 -1731 -723 2263 -1305 -1206 2056 -561 -1403 1731 226 -1733 1016 888 -1841
3298 -1841 440 1676 -1694 -203 2194 -1638 -983 2479 -1228 -1522 2706 -730 -1926 2502 -343
3313 -343 -2302 2164 243 -2220 1722 789 -2099 895 1094 -1823 164 1533 -1187 -527 1688 -634
3329 -634 -1357 1648 -11 -1873 1698 741 -2271 1412 1194 -2661 1046 1731 -2543 729 2112 -2413
3345 -2413 132 2174 -2071 -379 2257 -1392 -768 2034 -718 -1339 1551 47 -1649 1158 942 -1764
3361 -1764 478 1540 -1913 -220 2117 -1624 -709 2556 -1356 -1348 2535 -1041 -1740 2487 -383 -1935
3377 -1935 2192 82 -2125 1575 576 -1969 1019 1154 -1635 271 1462 -1332 -567 1710 -761 -1146
3393a146L103k195j577L628j564k534L996q18l336L876j13l896L445P66m004K752
3409C83J571l810J666K174l370M95K719k432o89K966j428j954K874k99k857K666
3425F75R06l569K156J871l973J474K714l892P73L302l569j16L518l000q85L479
3441A864j971j587L186r36k265K485K39k674J736J496k862P38K512k960l18L429
3457B112k688j247M077k277k154M232j637k865M098p72l263L623N4l414K714R17
3473A510l273J674J671k692M31K297k036r02K672j106k006K882j21l001K765P82
3489A547l756K453J699m019J951K411m098J242K873l805M95L194l082l24L139
3504A920k209j175K823j092j834K419J74k471J614J348k908Q27K442k968j9L324
$$ plain form
3393 -1146 1957 -238 -1815 1813 249 -2285 1711 893 -2443 1433 1320 -2576 869 1635 -2369 383
3409 383 1954 -1856 -190 1984 -1386 -891 1828 -604 -1293 1673 245 -1709 1165 866 -1991 675
3425 675 1581 -1988 168 2039 -1934 -460 2254 -1638 -865 2437 -1132 -1248 2270 -730 -1615 1864
3441 1864 -107 -1694 1492 556 -1709 776 1015 -1659 77 1573 -1289 -551 1961 -999 -1317 2112
3457 2112 -576 -1823 2254 -23 -2177 2055 418 -2447 1651 879 -2384 1239 1293 -2121 593 1510
3473 1510 -1763 -89 1582 -1110 -679 1618 -418 -1320 1352 246 -1760 1122 1001 -2000 765 1547
3489 1547 -2209 244 1943 -2076 -125 2286 -1812 -570 2303 -1502 -1007 2187 -895 -1219 1920
3504 1920 -289 -1464 1359 267 -1567 852 1026 -1445 169 1517 -1391 -564 1878 -1090 -1109 2215
3520B215k862j026L864k477j813M124j825k400L952j080k883L394j90k969K576
3535F00P49k895J553J511k560L47K181j941p93K709j220j933K916m30k812K930
3551I12M22l438K695J180l851K214J799l815J567K383l495P45K677k935k19K837
3567A678j999j108K769r17k006K381K10k706J901J357l103J232K329l336M25L030
3583B137l165l55L575k724j059L605k100j736L419j254k151K926k63k439K073
3598D89O85k510J116J609k272Q8K412k011r95K986j528j935L381q90k725L433
3614A333k74l318L189M03l522K750J049l482J985J577l151R98K098k524L7K355
3630A503j658j078K335o43k021K243M68k782J866J455l366J344K327l545P89K987
$$ plain form
3520 2215 -647 -1673 2191 -286 -2099 2025 200 -2200 1752 672 -2211 1183 993 -1976 600
3535 600 1349 -1546 7 1518 -1042 -695 1486 -455 -1248 1461 241 -1692 1224 794 -2018 912
3551 912 1334 -2104 591 1771 -2080 134 1933 -1882 -315 2068 -1427 -682 1995 -940 -1159 1678
3567 1678 -321 -1429 1340 423 -1583 798 1008 -1698 203 1560 -1543 -311 2018 -1318 -893 2137
3583 2137 -1028 -1383 2192 -532 -1591 2014 -86 -1822 1597 343 -1808 1118 855 -1584 489
3598 489 1174 -1336 -220 1389 -883 -795 1617 -394 -1389 1597 69 -1866 1515 625 -2100 1333
3614 1333 1059 -2259 930 1333 -2189 561 1610 -1872 113 1690 -1461 -463 1635 -889 -852 1503
3630 1503 -155 -1233 1102 459 -1562 681 1149 -1633 233 1688 -1678 -334 1993 -1552 -763 2224
3646B224l392Q2L264l024n80L359k344j100L115j478j642K571n11k017J920N46
3662I93k162J043J508k248P1K360k041q67L036j674j771L428j296k483L551o45
3678H03l005L406k3l266K849O10l266K085J294k918J160J821k354K3K106j584
3694b59r87K330o21j919K248K45k741J996J175l173J635J923l377J083K434l298
3710a306M33K852k858j91K907k247q94K751j411j473K429l93j969J874N86k381
3726a291J141J569k498L64K483k498m75L062k272j216L391j787j786L458j198
3741D47k346L148n49k579K611L39k581J770J007k384P60J671j956k57K228j351
3757b2j276K485o88k185K588O5k812K498P26l211K165J272l386J709J819l204
$$ plain form
3646 2224 -1168 -1086 2178 -846 -1426 1933 -411 -1511 1604 126 -1516 1055 544 -1473 447 993
3662 993 -1169 -126 1382 -866 -795 1565 -476 -1343 1693 19 -1752 1676 380 -2103 1448 803
3678 803 -2202 1204 1181 -2085 764 1374 -1892 193 1487 -1431 -271 1550 -804 -781 1325 -259
3694 -259 -1246 1084 463 -1456 792 1037 -1704 292 1467 -1706 -71 1852 -1525 -442 1992 -1306
3710 -1306 -873 1979 -879 -1070 1837 -410 -1304 1447 36 -1437 992 599 -1370 504 1090 -1291
3726 -1291 -150 1419 -1079 -715 1768 -730 -1205 1857 -415 -1631 1760 -27 -1813 1645 447
3741 447 -1899 1249 700 -1879 732 1071 -1510 260 1267 -1117 -357 1314 -642 -899 1329 -22
3757 -22 -1298 1187 499 -1686 902 967 -1845 653 1379 -1832 333 1605 -1781 -72 1747 -1457
3773a457J068K181k827K80K290k139m26K293j202j180J994k85j918J658P84k396
3789a282J132J770k763N08K521k888j37L127k607q03L428k241j413L323j632j759
3805a716L054q37k016K387r6k105J540P34j883O36J520j670m05K077j273j333
3821a386K504o89k082K749j62k828K682L82l166K502R85l243J998J376l189J372
3837a95J747k730O28K046k024k99K042j228j173J962k30j826J733O88k468J262
3853f5J530k768P78K295k807J75K799k727m51K985k204r29L011j587j447K622
3869A210q61j747K038J01j918J394Q91j978M86J584j824l01K345j609j039K694
3885A466j281j847K910p67k318K962k30k654K556L03k847K070Q98k615J365J421
$$ plain form
3773 -1457 -389 1792 -1035 -755 1535 -604 -1030 1263 61 -1119 875 590 -1328 330 1114 -1282
3789 -1282 -150 1620 -1143 -635 1886 -1002 -1139 1988 -619 -1422 2006 -235 -1648 1675 43 -1716
3805 -1716 1338 501 -1515 872 776 -1329 211 945 -938 -302 1218 -452 -857 1220 -53 -1386
3821 -1386 1118 429 -1653 1096 934 -1894 788 1170 -1996 506 1491 -1752 246 1622 -1567 -195
3837 -195 1552 -1178 -550 1496 -528 -827 1215 -13 -1186 776 546 -1280 453 1141 -1327 -65
3853 -65 1465 -1303 -525 1770 -1037 -862 1937 -790 -1241 1744 -460 -1389 1622 35 -1412 1210
3869 1210 349 -1398 640 741 -1177 217 1108 -870 -384 1200 -624 -925 1420 -189 -1228 1466
3885 1466 185 -1662 1248 481 -1837 1125 895 -1759 797 1100 -1747 323 1221 -1394 -29 1392
3901A392k270L78J716j708m52K005r28j349K108j42k213J915O39k662J712J404
3917A545k958J241J892l047P18K317k699K25K469k261m16K332j605r02K114p10
3933B55j319J688J15j793J046J016j964M70J908k022k99K500k034r54K980j719
3949a26j453L210j347j978L005q61k249K762j81k266K144L75k240J260R49j847
3965h43M35J493j303n69J791q19j492K025n6k119K065N53k681J787J101k988J544
3982g6J638k960J176J926k788M91K041k281J4K143j567o31J894q38j240J543J12
3999E97j636J208R77k021N25J703k249K8K431k110n27K812j968j135K873j575
4015f7j497K859r33j788K420l64j980J741L72j813J085J023j682J75J504j376
$$ plain form
3901 1392 -878 -500 1216 -492 -944 1061 133 -1216 892 750 -1463 452 1091 -1571 141 1545
3917 1545 -1413 -172 1720 -1327 -609 1708 -991 -766 1703 -558 -974 1358 -247 -1149 965 255
3933 255 -1064 624 739 -1054 -8 1008 -956 -486 1422 -600 -899 1601 -433 -1387 1593 -126
3949 -126 -1579 1631 284 -1694 1311 450 -1799 963 782 -1484 660 1035 -1205 55 1004 -843
3965 -843 -408 1085 -218 -787 1004 185 -1307 718 662 -1457 608 1161 -1520 267 1368 -1620 -76
3982 -76 1562 -1398 -222 1704 -1084 -593 1448 -833 -819 1324 -243 -874 1020 182 -1058 485 597
3999 597 -1039 169 1146 -875 -350 1353 -896 -868 1563 -547 -1074 1738 -230 -1365 1508 -67
4015 -67 -1564 1295 362 -1426 994 630 -1350 391 763 -1050 35 1058 -624 -449 1055 -321
4031c21o94J981q14j341K207m15k058K195O4k425K142O34k581J765R74k695J277
4048a05J334k322P68J660j890j6J648j324p42J738m38j348J621K44j970J213J016
4065A087k333R74J739k457M94K139k502o3K452k170m26K580j657r10K204j096
4081E5j225J848k49j317J264M27j490M85J055j416j48J822j224q44K171j104j522
4098a412K399o57j860K559k74k270K319K5k461K044N02k213J569Q62k047P40J113
4115I38j589N3J446q61p34J493l03j513J397M25j966J331J194k407R48J579k604
4132a173O05K075k407K62K256k170k80K119j696n97K003q88r55J564k98j309R82
4149I3N08j333M78J258j394k07J703j444p76K231j113j183K470r74j688K407o55
$$ plain form
4031 -321 -1015 966 152 -1189 1018 603 -1455 740 804 -1621 521 1155 -1426 339 1313 -1382 -105
4048 -105 1229 -1093 -325 1335 -555 -571 1077 -247 -989 749 311 -1037 584 828 -1142 71 1087
4065 1087 -1246 -272 1467 -990 -496 1643 -859 -922 1530 -640 -1066 1514 -143 -1053 1151 55
4081 55 -1170 678 429 -888 376 803 -687 -202 853 -563 -711 1111 -113 -957 1214 110 -1412
4098 -1412 987 330 -1530 1029 755 -1515 804 829 -1632 412 914 -1299 270 1132 -915 -175 938
4115 938 -651 -598 848 -13 -747 746 443 -1070 327 752 -1214 117 1311 -1096 -148 1431 -1173
4132 -1173 -568 1507 -900 -638 1618 -552 -832 1287 -409 -1006 997 109 -846 718 420 -889 93
4149 93 601 -732 -254 1004 -390 -597 1106 -338 -1114 1117 4 -1179 1291 317 -1371 1036 381
4166C81j905K304k0k011J880K68k026J211P41j702O18J279j295k41J345q63r80
4183a016J636k22j461J631L22k068J375Q32k353J221J376k279Q19J559k207L10
4199e25J666j778m4J766j175o17J553o86j085J317Q1j324J030P80j660L96J357
4216A052j800N1J972j684m20K250j664r31K329j295j128K366p83j421J936l82
4232D48j607J452K92j422R18Q36j369K2J196j006o39J679n29j262J827k37j868
4249a269J782K27k138J818P13k326J426R16k355J001J269j951O76J370j632pJ293
4266H13j068n28J344k97r73J114K98j600Q31Q99j742N71J621j929J25J939k077
4283f59l15K271j706n76K402j443j031K083r67j207J839k45j317J347K37j416
$$ plain form
4166 381 -1524 780 760 -1251 629 897 -1129 82 823 -879 -261 1018 -277 -518 827 -36 -1016
4183 -1016 620 398 -1063 568 890 -1178 197 1029 -1324 -103 1273 -1006 -187 1372 -835 -525
4199 -525 1141 -637 -681 1085 -90 -707 846 160 -925 392 473 -851 179 959 -701 -305 1052
4216 1052 -748 -697 1275 -409 -829 1421 -243 -1174 1155 -140 -1268 1098 315 -1106 830 448
4232 448 -1159 293 585 -837 81 917 -452 -430 766 -240 -879 800 271 -991 836 599 -1269
4249 -1269 513 740 -1398 420 1133 -1193 233 1149 -1206 -205 1064 -887 -211 1159 -473 -480 813
4266 813 -255 -783 561 264 -709 405 703 -897 -66 833 -909 -338 1283 -646 -521 1418 -659
4283 -659 -974 1297 -409 -985 1417 -26 -1057 1026 59 -1148 691 446 -871 476 713 -703
4299g03N26Q61j191m2J482r65p05J649p35j417J936k37j718K005Q5k110J718L71
4317H10k201J534Q52k016J108J058j946M33J257j472J4J440q50o56J358l86j320
4334i83J258L56j590J124R37j971O77J313k060L59J841j861j8J973j724n43J919
4351A007j244p93J874n41j132J407p9j429R49O50j346M65J239j418j94J581j329
4368c33o81K015r10j123K145p64j592K008l79j754K019J15j825J507L50j821R62
4385f1Q35j500M65J207j132l50J255p37r55J500m7j462J466M07k031J193R08k187
4403a226J091J424k155O19J596k147J45J735j601j38J747j137o75J444n70j054
4419i02J220K05j213Q51P28j492K04J310j477j61J901j367o23K041j309j168K255
$$ plain form
4299 -703 -177 684 -507 -549 933 -32 -737 912 177 -1240 696 459 -1259 746 831 -1279 439 810
4317 810 -1391 143 995 -1021 87 1145 -801 -368 889 -583 -569 871 21 -635 723 337 -983
4334 -983 275 631 -959 165 1102 -869 -192 1121 -939 -580 1261 -600 -618 1355 -369 -912 1007
4351 1007 -237 -1030 844 303 -829 578 499 -930 19 669 -677 -212 1027 -391 -585 996 -333
4368 -333 -1014 1001 91 -1032 1113 349 -1243 765 386 -1368 651 766 -1059 448 798 -1023 -61
4385 -61 774 -726 -261 946 -186 -536 719 -18 -973 527 480 -982 484 891 -1140 53 961 -1226
4403 -1226 -135 1289 -866 -247 1349 -798 -653 1082 -519 -657 1090 -47 -722 722 152 -902
4419 -902 318 523 -690 161 889 -603 -399 911 -566 -727 1174 -193 -816 1225 -84 -1252 1003
4436A003r20j353K313n71j629J879k00j752J524L84j523R87P90j476J97J068j073
4453c52l72J483n34j009J481k08j646J476M46j925J430Q75k151J007J129k240
4469a110P35J543j899L26J652j615l20J558j103o62J595l91j057J246P4j479Q33
4486g4Q39j597O05J408j726K3J703j725m09K105j319p76K160j066j249J996o69
4503B29j436J836p2j464J298L54j573O04R62j344J52J439j104o28J631q59j178
4520a153J856k94j552J866L7j958J550M44k047J355R77k026R12J166j907L14J368
4537I08j391j18J551q96p62J379m03j257J310L37j578J112Q82j966O35J338k017
4554i36L74J884j887n3K010j807n90K045j228q37K014p14j167J532k41j402J115
$$ plain form
4436 1003 83 -1270 1043 472 -1157 722 522 -1230 294 678 -845 142 932 -544 -347 721 -352
4453 -352 -724 759 225 -784 697 489 -1157 319 765 -1160 270 1145 -1006 1 1130 -1110
4469 -1110 -375 1168 -731 -405 1247 -368 -688 870 -233 -895 700 309 -748 498 572 -907 -74
4486 -74 765 -832 -227 1181 -545 -522 1181 -544 -953 1152 -167 -943 1217 151 -1098 898 229
4503 229 -1207 629 557 -907 391 745 -828 -224 738 -606 -454 985 -119 -747 884 25 -1153
4520 -1153 703 409 -1143 723 760 -1198 352 796 -1251 104 1081 -945 -33 1133 -774 -460 908
4537 908 -483 -601 950 54 -708 671 268 -989 321 658 -920 192 1074 -892 -257 1081 -936
4554 -936 -562 1322 -565 -618 1392 -415 -1005 1040 -188 -1025 989 275 -892 640 399 -1003 112
4571A12N40j359O35J063j406j29J420j179o10J895q16j165K028o65j687K015j82
4588E10j831J968K50k041J533N01k080J120R97j735O31J233j484j14J341j012
4604b13o55J532l45j167J390J54j787J167Q01j943R85J389k133N01J600k091O6
4621g49J973j711k41J990j334q23J774q59j081J657j38j283J177M05j535N59J014
4638G95j445J77J599j401m59J811j241r97K113q42j259K156n09j680J851j88j775
4655a294J674M16j772J191P50j775M96J134j367k6J554r78p16J537n93j348J633
4672E16N4j665J560N25k059J145R22k137Q89J401j934M62J530j788q5J575j270
4689c59m40J717p56r34J388k12j360J080N54j506Q33J068j734K43J498j732j32
$$ plain form
4571 112 652 -707 -72 991 -415 -544 876 -303 -913 982 166 -999 1029 364 -1323 692 510
4588 510 -1321 647 897 -1144 389 890 -1190 -70 927 -808 -177 1056 -428 -542 799 -213
4604 -213 -868 664 319 -848 542 696 -1091 76 877 -1066 -81 1308 -825 -324 1276 -815 -749
4621 -749 1224 -487 -728 1262 -72 -895 879 20 -1061 596 458 -825 352 757 -778 -219 795
4638 795 -650 -473 1126 -275 -734 1077 -164 -1161 952 110 -1149 1007 498 -1182 669 481 -1294
4655 -1294 380 796 -976 215 965 -810 -314 820 -547 -573 981 3 -713 824 231 -1117 516
4672 516 570 -1095 465 990 -1069 76 998 -1139 -250 1151 -783 -321 1209 -579 -664 911 -359
4689 -359 -799 918 162 -772 616 404 -956 124 678 -828 5 1073 -661 -418 1080 -652 -784
4706g84J989j465n60K128j371j079K097r20j181K012m02j437J576k6j611J104
4722G0O10j385N68J047j195k68J306r66o99J677m71j277J781j59j858J629K91
4739G01j987J598P43k068J107R73k072P04J283j675L40J454j367l00J302q37p42
4756h43J345j42j082J118L45j600P63R22j692N40J514j762Q4J721j761l73K012
4773A109j408o11K064j049j058J757o36j272J601Rj282J085M47j407M59R13j247
4790e26M5J399r63o11J542q09j178J798l56j452J780O3j814J472L09j865J274
4807A08P86j742Q84R52j620K72J157j258j24J400p38p40J319l72j236J267K30
4824E45j462J170P46j818P62J061j889M69J507j637J10J625j511l98J592j090
$$ plain form
4706 -784 1205 -260 -820 1308 -63 -1142 955 35 -1146 866 464 -973 603 577 -1034 70
4722 70 680 -705 -137 910 -285 -553 753 -213 -912 765 294 -983 798 639 -1219 410 701
4739 701 -1286 312 1055 -1013 94 1067 -1005 -301 982 -693 -353 1101 -266 -566 736 -101 -843
4756 -843 502 360 -722 396 741 -859 -96 826 -866 -326 1188 -574 -490 1231 -530 -903 1109
4773 1109 -299 -910 1154 105 -953 804 168 -1104 497 506 -776 309 756 -651 -192 721 -526
4790 -526 -481 918 -45 -656 886 77 -1101 697 341 -1111 669 732 -1082 390 699 -1166 108
4807 108 894 -848 36 988 -632 -360 797 -461 -585 815 77 -663 656 284 -952 315 545
4824 545 -917 253 999 -819 -57 1004 -885 -416 1091 -546 -436 1189 -322 -720 872 -218
4840b18o07J579n21r33J184m7j254Q44N14j209N37J050j326o0J364j277m46J744
4858I18r50q06J837q14j260J796m40j406J729k0j489J359K09j558Q96O22j227
4875f04M46J003j094j82J068p13p23J333k16j123J336J18j624J154N53j767J028
4892gR89j820P36J132j836L81J329j427L5J424j068m38J226o54p49J109Jr53Q17
4911B27M34j236L86R02j264J13J375j220k85J574j224o64J747r47q41J815o43
4928B49j113J529l95j266J303J40j162R40M46j229L72P24r36p0J128o32o09J198
4946F17l80j131J274%j266J281L67j579J004N33j612P80R09j457N21J050j346
4963d35L9J063r82k54J146m49o54R70j45j011P90L65j117O46Q53j350L10J032
$$ plain form
4840 -218 -825 754 233 -700 484 437 -817 27 541 -668 -131 919 -407 -467 897 -380 -826 918
4858 918 -32 -838 999 185 -1075 721 281 -1125 604 584 -905 454 663 -895 1 623 -604
4875 -604 -158 845 -249 -431 637 -76 -799 534 318 -805 531 649 -975 179 732 -1035 -7
4892 -7 982 -838 -102 1030 -806 -425 904 -523 -488 936 -132 -570 656 2 -747 362 363 -590 227
4911 227 661 -575 -189 713 -551 -438 937 -283 -568 1006 -218 -882 865 -82 -923 892 249
4928 249 -864 665 270 -996 307 447 -715 225 671 -558 -186 538 -398 -468 660 28 -581 617
4946 617 237 -894 380 380 -886 395 762 -817 187 720 -892 -112 797 -660 -139 911 -435
4963 -435 -396 667 -315 -569 577 128 -526 444 299 -712 78 443 -674 -28 825 -525 -215 817
4981H17j392M9J382j217j45J449j070n33J350p59p02J338l27q53J043k0j007O23
4999B6M06q80L00Q34q49k37J047p61o59J372m44q94J396k77j221J277o9j296J194
5018B65L07j250Q80M34j281N20O20r24K34P88o73k21P32m16n97Q29Q0r03Q46L37
5038F07j257O61O10j323N11J035j306K74J045j275l6J137j002j29J169p21m43
5055d43R37m32n93P01N3o19M72M13p71K0P11p26k02J072o08m92J191n95q59J270
5075E00l55r02J280j20j031J015j3j061Q25K31q60N87M01p84J46N12n96j39O92
5094C28k08n02P24n0q67O71K80r66O84N46j130M51O63j215L42Q28r51J46Q59q01
5114a68j95P70n06l64P59j26m88N15J27o62K53M50o80J13P71o87k03Q37o83l66
$$ plain form
4981 817 -575 -526 856 -361 -506 943 -127 -660 690 -69 -771 567 240 -613 430 410 -597 26
4999 26 432 -448 -148 686 -163 -400 647 -114 -773 599 155 -739 657 380 -841 436 367 -929 265
5018 265 572 -678 202 636 -645 -125 495 -429 -195 593 -80 -301 431 15 -582 247 327 -576 270 607
5038 607 -650 11 621 -702 -191 844 -462 -188 857 -418 -454 683 -319 -448 721 0 -443
5055 -443 494 62 -531 170 223 -396 76 489 -282 -262 449 -277 -479 593 -15 -507 684 89 -770 500
5075 500 145 -757 523 403 -628 387 374 -687 138 369 -491 96 497 -287 -141 371 -225 -364 328
5094 328 120 -382 342 292 -575 96 376 -590 94 640 -490 -39 624 -591 -249 579 -372 -226 633 -168
5114 -168 -363 407 -99 -463 296 170 -318 197 324 -338 -85 365 -315 -202 569 -118 -321 516 -167 -533
5134e33J027n47m21J068m82o25Q68k78o39Q14Jo05N12J49o19K05L54m34m0N92
5154C67k93l92O42k24o10P22O1p67P55K01r73N82L10r15N19M85q39L86M76p49
5174b56Q4M48m58l9M83j65k70L01M5n32K94L57n52J75N98p43j8O68p06o6Q63o37
5196a26j64Q26n98l51Q15m68l05P24k36l61M65j19l99K92J56k48M4L37k54k86
5216b56M60j57m79O36N6o63O83K2q45O42J71p74O00L22p57L92K90o70J88L73m03
5237a69J17L19k23j98K50k0l34L01K19m17J43L80n94J9N32n29jO87n86j12O15
5258C99n25k26O67l78k07N71k00l40L68q1l21K70K15k69lL40l24k69N17j77l80
5279c53O33j02n28N93o4o16N57J29n78N13J55o08K90K09m66J49L27k83k2K59j48
$$ plain form
5134 -533 494 -53 -474 594 112 -513 355 77 -562 252 253 -352 160 309 -310 -105 249 -185 -225 367
5154 367 74 -318 324 100 -510 212 273 -494 261 462 -511 71 381 -534 -15 470 -369 17 493 -256
5174 -256 -172 276 -182 -221 262 97 -173 128 173 -359 -65 292 -260 -85 513 -230 -248 420 -286 -352 511 -126
5196 -126 -290 536 -62 -413 402 -66 -371 353 117 -244 221 102 -297 -5 151 -97 -53 284 30 -256
5216 -256 204 47 -432 204 260 -403 280 302 -543 99 270 -504 96 418 -339 53 343 -327 -139 234 -169
5237 -169 -52 267 44 -154 96 76 -258 43 262 -155 -12 368 -226 -207 325 -204 -205 482 -104 -216 399
5258 399 -126 -352 315 -63 -270 301 101 -239 129 48 -273 -3 212 -57 -60 280 -44 -313 204 27 -353
5279 -353 280 178 -350 243 179 -437 120 249 -329 184 339 -269 21 230 -236 -87 240 -43 -65 194 46
5300D6k70K91J3l25L03K05m54J49L19n70J44M64n24Q8N56n62l6M67m70q3N71l32
5322a0j39M02j80k90K59K4k30J54K78l14j16M38l37k84O25k30l68O83j84n91O45
5343B35j28n56O15O6n58M69R3n77K99K17m11J74K84k17j15K54j12k65L08P7l91
5364b39L41K23o04K21L91o32J88N27o02J01N48o58o4N83m66j05O19l38k58M67
5384B43k02l36L71R0l35J76K59m04o8M72m25j55O57l10l59O84k53n67P14q8o00
5405d36O76O6o72N02J02o08L61K94n13K02L62m26p5M08k82k54N05m4m56M52Q4
5426B48o40L96L05p00L78M71p70J98N51p27K1O74n35j44O86m16l32O32k41m21
5446c66N37R8n71L80K51o41J77N08o09M6O80n97k32P99n37l92Q40k78n42P86j21
$$ plain form
5300 46 -224 67 80 -245 58 263 -191 -42 277 -293 -149 315 -209 -121 435 -127 -163 304 -166 -249 322 -10
5322 -10 -149 253 73 -217 42 66 -164 -10 268 -46 -162 276 -61 -345 280 50 -318 365 181 -410 235
5343 235 107 -449 166 232 -326 143 236 -341 -42 175 -236 -62 222 5 -110 144 32 -233 75 152 -239
5364 -239 102 325 -279 -58 333 -299 -111 416 -186 -85 463 -195 -259 324 -142 -247 372 34 -224 243
5384 243 41 -295 76 166 -169 7 266 -138 -206 266 -159 -314 343 33 -326 358 105 -462 252 164 -436
5405 -436 240 306 -366 136 238 -370 -9 285 -228 -26 336 -90 -165 243 -39 -293 212 168 -288 164 248
5426 248 -392 4 309 -391 -13 458 -312 -114 437 -290 -269 405 -130 -274 412 -4 -336 296 55 -366
5446 -366 171 269 -302 78 329 -312 -135 373 -236 -190 490 -107 -339 460 -77 -469 371 93 -449 337 216
5467B16o58O36L3o55M57L22o39K56M04o39K8N41m33k01P23k80n26O87j21p00P50
5488B01J55q56O78K86r33M63M67r07K91O89q01N9P15o41k34P87m51l86P83j37
5508B28o70O08J37p98N02M07p91K67O76q64K1P82p43j98R83o01l93R62m19o44
5528e48Q78j44p51Q53P9q16N42L09q07K94N89p39M7P84p01k79Q65m41n40R52j89
5549B37q07R08J9j014Q26K56j039O72N56j066L50O89r63L7Q95p26k10R27n25m97
5569d75R03k63p45Q85R1r28O76L85j026M14O83j031J89Q95q94j12R79p63m42J156
5589E77n55o27J092k33r11R30P5j005P83M06j027M33O86j032J19Q92q49j97J099
5608F56o93n18J120m47q18J133j17r90R92J98j124O85N05j167M63P83j064J49
$$ plain form
5467 216 -442 194 227 -428 29 351 -288 -32 372 -267 -239 302 -131 -332 391 111 -415 272 151 -549 201
5488 201 356 -500 178 464 -469 -6 461 -446 -155 534 -267 -208 507 -134 -368 419 -32 -418 365 228
5508 228 -442 166 303 -495 7 414 -377 -110 566 -298 -277 505 -238 -436 547 -54 -447 515 96 -548
5528 -548 330 186 -565 288 367 -449 93 402 -405 -111 478 -261 -214 570 -131 -410 455 14 -526 426 237
5549 237 -570 338 357 -657 169 425 -614 58 614 -452 -102 587 -376 -339 556 -170 -380 547 22 -475
5569 -475 428 165 -580 305 396 -532 144 529 -497 -83 600 -431 -242 653 -241 -353 626 -137 -579 577
5589 577 22 -605 487 254 -657 273 348 -657 126 532 -495 -62 624 -408 -289 603 -246 -443 656
5608 656 -37 -555 565 118 -700 433 316 -674 318 516 -608 77 582 -585 -122 661 -403 -254
5626b54R63r57k13J085o86n24J145l47q58J046n8j050R11K87j149P00O25j193
5644e27L37Q74j103K5J121r71k60J209p42n97J224m28q69J144n8j083R53L10j215
5663f56O50O70j176L32R28j097p2J132r32l79J282o42p21J237l11r80J108K9j188
5682g86J008L84j322O87P19j249L22R78j107k9J152q98m15J229o32p48J264k79
5700B78r80J075J24j215Q49M94j291N89Q51j257J96J097j210j11J288r40m69J375
5718G43o61q29J304l11j068J156J43j233R21M77j297N43Q37j221J66J131j085
5735b84k32J296q84o07J390n33r31J340j41j216J157J93j329Q77O18j395O14Q63
5753G96j347J81J154j101k22J303q72n56J290m70r74J265m3j199J055L53j367
$$ plain form
5626 -254 709 -248 -461 624 -62 -586 559 212 -646 400 342 -708 203 490 -659 41 666 -527
5644 -527 -190 684 -419 -394 727 -244 -504 705 -37 -634 590 162 -707 437 379 -704 249 559 -656
5663 -656 -6 664 -512 -180 748 -349 -421 711 -221 -600 682 40 -681 556 245 -735 373 402 -786
5682 -786 222 606 -716 -29 690 -559 -237 741 -366 -395 757 -141 -556 673 41 -707 557 278
5700 278 -702 373 497 -718 131 625 -666 -77 774 -483 -287 810 -400 -511 777 -163 -632 743
5718 743 82 -747 557 246 -822 334 477 -756 165 642 -655 -112 725 -496 -330 801 -284
5735 -284 -516 780 -104 -711 679 146 -785 555 414 -802 355 548 -781 96 714 -681 -67 796
5753 796 -551 -370 784 -317 -539 764 -108 -664 626 156 -818 447 404 -795 260 613 -754
5770g54Q26O88j464N04J060j362R9J294j189k87J367q57o62J463n70r12J276j45
5788C75j182J084K70j294P85P01j341L82J043j296J0J299j095l76J448q19q03
5805h09J451m47j064J403r7j300J182K73j403Q53O66j343M76J000j238J5J199
5822H17j026m09J369o83q19J371l05j159J251J07j373J048N17j512P90Q52j542
5839g06M57J136j400O5J321j139l65J422q41p01J370l66j025J213K8j277R42N14
5857F48j376O60Q97j384K19J233j291j19J390j093m83J529p52q90J486l95j168
5874h89J368jj310J077L63j362P31P45j311K84J134j198j26J276r25n70J415n47
5892A54r91J442k28j275J303J63j477J110N39j536P71R02j506L60J114j291RJ244
$$ plain form
5770 -754 72 760 -704 -200 860 -502 -403 891 -298 -585 782 -75 -737 726 156 -756 520 375
5788 375 -807 277 547 -747 38 739 -602 -220 823 -473 -463 836 -259 -635 813 -6 -809
5805 -809 642 195 -869 534 437 -863 319 592 -811 42 708 -635 -159 841 -397 -382 817
5822 817 -209 -618 751 68 -751 620 315 -844 407 514 -859 189 706 -806 -16 836 -706
5839 -706 -249 887 -513 -448 873 -266 -631 791 -50 -751 619 253 -772 441 469 -808 134 648
5857 648 -728 -68 829 -555 -336 897 -394 -513 877 -216 -699 830 78 -812 674 279 -889
5874 -889 479 478 -832 245 608 -754 -23 722 -589 -305 829 -369 -495 781 -144 -714 701 154
5892 154 -837 605 377 -898 405 568 -909 201 740 -796 -25 877 -629 -269 845 -446 -437 807
5910H07r36n09J346o71q11J320k04j153J135K65j365Q92O19j486N96J029j468
5927e94K37J289j365j47J465j092n11J480o80q54J372l23j070J164J32j256Q81
5944A28N48j309N21R09j252M9J252j115l36J457q85p63J534n94j006J461k24j267
5962h92J315Q1j389J054N12j438P12Q11j310K73J041j080j93J232p98o25J331
5979F37m42r75J230J7j297J111L79j437Q13P78j530N46J078j467K12J212j258
5996c93j23J340r96m72J341o02q15J246j97j073J000K69j213P26O57j303L90J004
6014G86j242k8J368j157l63J494r39p03J551o30r79J439k40j187J211J20j244
6031g43Q48N42j250M95Q32j145P4J101r71l49J239o43p30J298l57j074J281qj313
$$ plain form
5910 807 -129 -638 708 37 -774 546 342 -811 324 589 -776 116 735 -751 -155 874 -594
5927 -594 -357 932 -433 -580 885 -207 -718 762 82 -772 600 277 -793 371 503 -753 128
5944 128 676 -633 -112 797 -455 -406 846 -269 -605 852 -33 -796 738 144 -862 599 375 -892
5962 -892 423 504 -885 169 681 -757 -45 766 -544 -271 770 -310 -503 729 -69 -694 637
5979 637 195 -780 450 467 -830 281 660 -777 36 814 -716 -170 908 -559 -347 865 -393
5996 -393 -516 824 -172 -644 697 95 -720 526 329 -744 256 525 -688 38 695 -608 -218 786
6014 786 -456 -484 884 -273 -636 858 -81 -784 767 137 -842 597 357 -830 381 501 -743
6031 -743 105 647 -603 -108 724 -421 -347 754 -217 -566 673 30 -700 598 241 -833 448 440 -873
6050h73J169L47j443Q78O54j441N99Q96j325K46J073j092j46J142p65m96J131
6067E54l88q41J079j9j112R38L80j300P18P44j370M33J009j301P3J240j163k32
6085e58J344r27n07J309n97p62J174j98r60R36K01j084O61N68j128L09R21j057
6103c55o6J159r00m41J319o72p79J375m32j001J324j76j150J159J58j252Q99M10
6121E79j189N45P21j113J86R42q94k49J059n84n94J102k85r41J067R6j189R24
6139A83M19j308P13O98j354M86Q91j267K18J084j095j06J102p81m08J069m58o55
6157e69R64r0q61P56L08j074N44O54j148K83R58j087n8J187j014l08J299q27n72
6176f55J288n24p81J177k63r33J005Q8j007P40L67j000L85O79r03L5R02p45l19
$$ plain form
6050 -873 296 643 -800 78 732 -709 -110 786 -539 -293 780 -312 -458 684 -81 -577 554
6067 554 166 -675 404 385 -727 211 591 -709 9 753 -617 -184 825 -476 -403 837 -326 -558
6085 -558 786 -141 -648 661 64 -698 476 278 -682 254 455 -629 32 600 -528 -219 702 -355
6103 -355 -421 738 -162 -603 716 44 -735 640 208 -793 531 355 -795 364 522 -730 169 579
6121 579 -610 -65 656 -457 -271 671 -223 -472 587 3 -591 511 226 -715 352 448 -741 183
6139 183 602 -706 7 705 -649 -163 728 -539 -321 763 -332 -438 664 -117 -525 544 86 -569
6157 -569 395 305 -556 200 508 -566 -22 632 -516 -233 725 -362 -420 767 -247 -555 744 -83 -655
6176 -655 633 109 -672 505 242 -691 314 402 -605 135 502 -498 -113 566 -337 -302 600 -145 -464
6195d64J048n76o18J117l12q70J087j3j088R30K64j163P69M53j150N57O68j066
6213d27J92Q45q80j00R19o48l88R61l67p16R32m2q74P59L04j082O22N97j177M67
6233a03P88j138J84J000j045p0J050q37l03J033n61n29R76k43p53Q08P3q35N81
6252G6M26r37K79O90q59pR48q43k59J102p01m72J119n32o83J150l10q32R93qr43
6273f03P85K71r72N51M70q93K39O97p73r5Q41n87m01R68l42p44R79j29r10R23
6293B75J78j108Q08L61j126O12N78j103L90P60j002J42Q00p86j34Q43m99m35Q10
6312C64j87o72O98J09p90N49M32r88M05O67r72J47Q94r87k3J023q39k95J066o87
6332h6m39J073m62o14R36k02p49P43J45q34M76M71q68K61O49p47q1Q73o76l35
$$ plain form
6195 -464 584 8 -610 507 195 -675 412 399 -689 241 505 -658 111 564 -586 -29 639 -427
6213 -427 -235 610 -270 -370 549 -99 -487 474 107 -609 323 281 -593 166 470 -612 10 607 -570 -103
6233 -103 685 -453 -269 731 -314 -384 666 -171 -474 559 -2 -531 445 202 -551 257 330 -505 76
6252 76 502 -435 -156 534 -325 -332 616 -227 -486 616 -85 -557 562 30 -653 497 187 -645 348 340 -603
6273 -603 182 453 -519 32 502 -391 -152 545 -228 -323 518 -69 -470 498 156 -588 391 262 -648 275
6293 275 453 -655 153 514 -612 0 578 -525 -135 625 -377 -235 565 -221 -355 488 -11 -446 364
6312 364 177 -495 203 312 -478 71 503 -485 -80 587 -385 -238 656 -331 -354 669 -170 -465 601 -86
6332 -86 -525 548 86 -528 408 206 -543 200 345 -489 -13 458 -410 -149 500 -247 -328 545 -131 -466
6352d66J002n05n81J053l34p83J021r6r34R10J16r85O98L63r53M39N59q54J08
6371b22P23o88j87Q32m91m13Q85k86p22Q95Jr35Q01K65j074O74M76j077M76O74
6391F07j048K58Q18r35qQ90p18l05R14m26n23Q62j70p03P02J72q80N48M11r03
6411d37L28O99r65R2R09q93j68J057p41l68J067n67n65R76k75p23R06n6q12O99
6431A63K16q45M42N09q20J42P29p42j79R22n83m72J066m72o79J092k47r27J040
6450C55nj023R26K27j050O38M69j048M15O56r02Q5P72o91k16Q99m78n63R42j59
6470B49q26Q22J65r96O81M35j110N55O45j103L46Q37j089N9R81q64j78R99o74
6489f6m18R85l88o55Q92p7q13P15K63r61M81O04r97K21Q47r75k7J032q46l45J147
$$ plain form
6352 -466 536 31 -550 503 169 -614 407 311 -623 287 403 -582 116 479 -474 -35 524 -330 -222
6371 -222 501 -187 -374 458 -33 -446 439 153 -569 326 327 -608 193 458 -616 58 534 -543 -67 607
6391 607 -441 -183 635 -300 -308 582 -136 -441 473 47 -476 386 216 -487 215 387 -493 55 466 -437
6411 -437 -109 590 -375 -283 626 -267 -435 622 -119 -487 580 13 -552 424 149 -574 332 276 -536 163
6431 163 379 -466 -24 485 -335 -193 536 -206 -385 537 -46 -518 548 76 -603 489 242 -685 355
6450 355 350 -673 253 480 -570 68 537 -511 -96 560 -342 -257 515 -176 -392 507 29 -534 408 249
6470 249 -577 245 410 -586 95 530 -580 -25 620 -483 -137 700 -389 -330 651 -213 -391 608 -66
6489 -66 -484 501 113 -542 350 273 -540 175 438 -523 -42 562 -435 -214 633 -342 -369 663 -183 -528 619
6510F19o64n93J188m10q03J087j54r46R58J37j001P08M12j019L90O88r28K9R04
6529F02p48l39J078n83o18J097k85q98J074kj071R11K86j153P07N54j210N46O97
6548F45j108J99Q77q81j83J041o45m79J044l52q05R92L1j040Q59L45j172O35O94
6567F97j279M30R22j227J36J086j069j54J154q23m56J193n18p37J082j67r10Q41
6585B01K36j029N99N66j038K44Q80j006n2J111r21l52J269p19p00J343m43r80
6603g91J304k06j092J118J46j200Q40M62j188N18P53j080J13R63r08k36J093o10
6621ao44J187l14r82J141L7j220J020L58j325P86O63j378N42Q84j293K08J103
6639G72j047j99J156p66n21J179m52q17J085k6j032Q57L77j233O57P31j264L04
$$ plain form
6510 619 -45 -638 550 140 -663 424 270 -676 282 419 -582 126 538 -481 -91 597 -331 -302 602
6529 602 -146 -485 593 10 -608 489 204 -694 380 378 -693 218 504 -649 58 612 -598 -52 645
6548 645 -463 -264 613 -268 -451 590 -55 -534 510 158 -647 345 376 -664 195 540 -632 3 697
6567 697 -582 -152 770 -457 -321 765 -304 -458 696 -127 -583 610 92 -645 437 270 -640 201
6585 201 437 -592 7 573 -465 -221 659 -347 -399 712 -209 -561 708 -11 -711 632 189 -791
6603 -791 513 307 -785 333 479 -721 119 581 -607 -89 664 -416 -303 660 -248 -484 609 -1
6621 -1 -645 542 228 -754 387 424 -796 224 582 -743 43 706 -672 -130 754 -539 -331 772
6639 772 -275 -474 682 -84 -605 574 122 -695 390 364 -668 189 566 -667 -10 721 -543 -239
6657b39J050j246l4J269j101k89J400q76o14J360n59q87J283k01j063J022K57
6674E32j210O97O07j199L85Q97j045r4J154q92m27J332o96p74J338l52j041J275
6692D87rj339J144L29j365Q18O32j331M67R06j200J22J101r62l57J209o12p49
6710g09J249k81j017J133J14j284R69N26j481P28Q54j446M09J124j372O7J250
6727H33j123k67J338q22o17J284m60q94J128M1j135Q46M71j261N42Q82j330K17
6745c27J154j168k09J424j018n88J511p39q80J500m03j146J365n2j245J064L52
6762E95j316P30P14j250K68R72j046j53J207q00n86J349n28r79J381j56j283J292
6780D11J70j463J072N55j548P78Q80j504L99J118j336J6J224r83m12J290o03p78
$$ plain form
6657 -239 811 -435 -469 800 -301 -590 810 -66 -680 680 121 -766 517 316 -747 275 532
6674 532 -678 19 626 -573 -188 709 -336 -430 724 -168 -595 737 41 -733 605 253 -788 487
6692 487 478 -861 283 612 -753 65 697 -634 -167 739 -461 -339 762 -200 -557 652 40 -709
6710 -709 540 259 -758 375 489 -795 174 700 -781 -53 801 -645 -236 888 -484 -417 833
6727 833 -290 -557 781 -41 -658 626 166 -728 400 441 -694 152 623 -638 -96 786 -544 -327
6745 -327 827 -341 -550 874 -144 -732 779 40 -840 660 257 -889 476 424 -821 243 595
6762 595 -721 9 723 -527 -259 713 -333 -486 721 -79 -665 684 156 -823 558 402 -881 411
6780 411 581 -882 190 745 -803 -25 855 -649 -250 868 -468 -452 772 -211 -623 667 64 -714
6798g14J199j52j114J037L08j307P57P61j484N11J089j458J38J349j282k35J514
6815I17j066n90J521p21r07J481l26j117J230R6j281Q91N35j344N59R02j254O5
6833d09J223j061m06J441p93q11J518m81j102J462j96j331J325K38j493J018O07
6850G49j484O27Q94j310K04J092j034k84J261p08p28J330l37j076J246O1j357
6867h54J094M46j536Q61Q66j596N21J110j486J34J331j276j85J390r23n72J357
6884F82n45r33J242n6j163R95M45j385O32Q76j381K61J246j324j45J505j155n39
6902g42J604q57q59J620n01j156J481j59j299J146L13j348Q04O38j245K89R98
6919G27j086j39J251q48n78J367n45j003J413j58j336J326K30j539J121N60j627
$$ plain form
6798 -714 485 333 -781 256 564 -743 14 775 -709 -198 891 -567 -429 920 -362 -597 917
6815 917 -149 -739 782 61 -846 635 309 -808 422 518 -763 128 663 -681 -122 780 -474 -409
6833 -409 814 -247 -653 788 -5 -816 702 221 -881 581 385 -946 379 617 -876 142 749
6850 749 -735 -108 786 -524 -320 772 -262 -546 715 7 -721 609 272 -804 442 503 -854
6867 -854 240 686 -850 11 877 -719 -198 912 -574 -440 891 -385 -570 820 -103 -675 682
6884 682 137 -796 446 390 -773 222 667 -718 -86 790 -591 -330 916 -408 -553 952 -203 -742
6902 -742 862 5 -854 766 265 -891 590 431 -868 278 591 -757 47 685 -560 -271 727
6919 727 -359 -498 753 -95 -673 694 149 -854 559 401 -935 391 621 -918 203 763 -864
6936h64Q40Q63j564N14J093j381P6J273j088l55J308o65p49J213j85j117J062
6953B74L12j351P93P75j476M57J132j489J12J393j310k56J567j103o14J612p78
6970E0r11J470l02j134J215J14j279Q96N50j289M77R19j208M0J221j044m17J421
6988G89p81q04J540m73j201J499j01j400J308K56j496J037N47j455O28Q68j299
7005e38J91J132j062k58J220o72p61J335l00j094J201J48j393J039N53j569P82
7022d6R27j584M68J193j481M8J391j229k79J426r08o43J355m54r44J166J0j136
7040g20Q61M96j280N15R04j353J88J238j208k06J475j076o23J593p60r09J573
7057G08m45j158J437j11j288J133L13j295P32O52j187K90R43j026k08J211p41
$$ plain form
6936 -864 -24 839 -725 -211 882 -499 -423 850 -238 -593 715 50 -699 514 329 -788 274
6953 274 586 -765 28 803 -673 -216 916 -573 -461 932 -378 -634 933 -170 -784 828 50
6970 50 -861 609 307 -827 388 502 -777 119 669 -620 -143 776 -432 -392 829 -215 -632 789
6988 789 8 -796 744 271 -930 569 468 -932 376 632 -864 173 720 -735 -107 761 -538
7005 -538 -347 785 -277 -535 685 13 -748 587 287 -807 394 542 -851 188 741 -828 -46
7022 -46 881 -703 -235 958 -523 -475 916 -313 -592 834 -74 -717 638 184 -760 406 416 -720
7040 -720 141 637 -643 -128 776 -577 -389 849 -359 -565 910 -166 -789 804 44 -865 708
7057 708 263 -895 542 431 -857 276 589 -706 26 678 -509 -219 724 -302 -510 701 -40
7074d0o36J296l64j100J306kj367J214L37j533R73P02j609P15R60j510L74J143
7092H59j295qJ225j000l65J231n63p34J115j09j058R28L36j211O25P61j332L49
7110b46J103j305k7J365j184l42J545j003o90J510n90r55J403k69j102J126J59
7127D98j211P55N68j170L47R35j076r0J140q23n56J355n54r15J412k66j245J355
7145D59L6j342J118L59j414Q77O14j369N30Q83j190J16J019r34k65J121n69p24
7163f75J133j56j014J003K40j302Q30O38j416N71R66j439L14J165j289m6J317
7180H40j067l97J334o90o96J171k96q96J001J20j018O67N32j074K75R01j106k2
7198d21J169r38m31J382p88p14J462n87r93J428k53j158J244K8j209R44L72j168
$$ plain form
7074 -40 -676 620 256 -844 462 460 -907 307 644 -889 84 786 -823 -108 852 -658 -284 859
7092 859 -436 -444 781 -219 -584 647 84 -650 465 356 -702 226 562 -649 -24 737 -595 -246
7110 -246 857 -448 -475 890 -294 -636 909 -94 -784 726 136 -819 584 315 -787 339 498
7127 498 -713 42 610 -560 -213 722 -354 -444 696 -127 -683 672 118 -797 615 349 -896 459
7145 459 495 -847 271 630 -784 93 707 -662 -132 751 -439 -323 696 -238 -503 618 49 -675
7163 -675 458 302 -712 291 531 -771 59 697 -719 -148 818 -621 -307 858 -431 -477 840
7180 840 -227 -624 710 20 -676 495 199 -697 304 424 -594 73 605 -469 -194 707 -399 -421
7198 -421 748 -190 -621 761 -27 -741 721 134 -859 569 316 -842 402 430 -779 165 537 -631
7216f31O07O15j037J89Q76q32k50J033n21o52J073k01j005J080J40j275R84M91
7234F84j445P41P85j440M98R74j300J79J106j067j84J141p79m27J048l78o93Q68
7252C11K0r58O90M51j024L96P82j119J05J087j086j48J246q96m78J365p47p16
7270g19J314m34q72J177j20j017R28J91j026N92N28r68K10Q18q00k31R86n82n62
7289e87J073k75q99J123n0j151J052K30j274Q63M91j270O29O94j121K51Q60r43
7307c04m2R51o92l87R33l42o74Q65J8q96P21L46j027N23O15j092L10R07j147Q5
7327c29J053r75k27J123p35m64J123n03o43R78j80p86P66J98q39M13N19q30P3
7346b65Q11p58k17J031o31n17J122m39q13J152k42r56J090J1j061R16K07j013
$$ plain form
7216 -631 -24 591 -446 -257 619 -213 -463 570 49 -603 470 269 -736 344 484 -791 193 684
7234 684 -761 -20 765 -675 -177 797 -503 -324 782 -285 -469 672 -107 -534 514 136 -557 311
7252 311 331 -627 63 514 -510 -114 668 -451 -346 741 -345 -493 753 -143 -621 744 -3 -719
7270 -719 595 161 -711 466 346 -671 257 448 -578 14 542 -426 -216 602 -198 -429 557 -25 -587
7289 -587 486 211 -688 435 385 -766 286 516 -758 105 596 -674 -45 649 -472 -221 639 -304
7307 -304 -346 605 -87 -474 459 117 -557 308 326 -570 151 497 -530 -7 608 -484 -174 733 -414 -329
7327 -329 724 -251 -478 645 -90 -554 569 66 -577 401 221 -565 201 399 -440 -27 492 -338 -265
7346 -265 546 -212 -429 602 -29 -546 576 137 -676 476 234 -722 368 379 -682 234 441 -572
7364e72O57L93r15L66O00q09L4O99n83k73P77k53n99P55J3q55P10K98j059O43
7384B7N96j153M11P81j140K44Q93r80j5R56p81k38Q97n03m22P80j62o17N97J87
7404C58p34L43M56p09O5P53p19k21R75o63m47J061n08n87J066l35p56R69j40q01
7424e74Q28N3q22O40K49p51L37M23o01K7O04m58k77O74k58n47P47j5p76O76K37
7445D16r49N95M48j020M30O19r39K41O95q20J1P26o03j72O86l59l78O22q5n81
7465d17N07K19o85L21N04p64J25O79p60j6Q36p08k00Q51n38l83Q68m00m72Q00
7485C67k24n54O28J1n95M08K65n57J73M09m44j15N70l74l44P03k18n79P54m0p77
7506e33P21J46q36O17K98q61M61M08p90K56M90o08Q8N01m04j90M98k10l50M61
$$ plain form
7364 -572 85 478 -437 -71 529 -280 -246 453 -130 -403 374 121 -478 277 290 -565 145 443 -616 27
7384 27 623 -530 -119 662 -478 -234 659 -321 -336 620 -161 -399 498 -5 -427 353 191 -426 171 358
7404 358 -376 -33 423 -286 -221 532 -187 -408 567 -96 -543 518 10 -577 489 154 -602 367 227 -574
7424 -574 254 307 -515 125 374 -377 -40 383 -218 -191 413 -45 -322 352 94 -453 294 279 -497 179 416
7445 416 -533 62 510 -510 -80 539 -400 -159 536 -284 -273 453 -150 -322 364 5 -373 249 164 -417
7465 -417 90 309 -376 -55 449 -315 -190 489 -271 -287 549 -159 -359 492 -46 -429 439 39 -433 367
7485 367 143 -411 217 228 -367 41 306 -251 -78 331 -113 -228 342 -32 -376 327 109 -470 284 244 -533
7506 -533 188 334 -502 115 413 -448 13 421 -369 -113 377 -231 -143 358 -46 -236 262 52 -298 163
7526A63Q0n68M05K70o79K40M98p37J46O79p52nP33o74j25P86n71k04P03l92l77
7547c81O45j62m41M69N8m55L03K48m72J7M75l75j99N94k87m01O96j89n96P21j0
7568B58p30P06N3p40N77J92p08M35L23o60K37L64m92jM21k72k09M38j08l58L86
7589A12J01n22L05L02n91K83L82o39J39N17o12N1N90n62j01O38m46k25N94k83
7609C3l37N21m3m24K87J90m44J38L70m39l9N08l74k40O27l28m04P19k05m94O50
7630B72j22n77N91J6n33M41J48m89K45K57m65R1L58l01j03M00j99k76M11l3m75
7651c43M59J56o29M01L05o81L06L86o71K48M44o35O7N19m72q1M89l12j80M21j16
7672H1l23L26R7m38K00L31m61K1N00m79j17O41m55k44O98l81l60O82k78m31O40
$$ plain form
7526 163 243 -325 80 350 -329 -89 409 -328 -182 497 -255 -260 473 -201 -326 460 -111 -315 388 -4 -381
7547 -381 264 102 -339 130 188 -267 36 284 -188 -171 304 -71 -270 324 37 -364 332 143 -453 268 258
7568 258 -472 234 287 -453 124 316 -392 43 366 -294 -57 307 -185 -186 235 -37 -246 192 84 -274 112
7589 112 213 -309 -4 298 -293 -10 372 -267 -128 389 -223 -172 418 -144 -245 393 -53 -278 316 33
7609 33 -304 217 174 -250 37 227 -217 -79 291 -148 -187 321 -53 -293 334 6 -398 321 116 -378 272
7630 272 150 -427 164 180 -353 88 236 -253 -8 249 -216 -125 233 -68 -171 229 30 -246 165 132 -343
7651 -343 116 272 -357 44 349 -332 -26 360 -311 -63 381 -254 -187 332 -140 -221 268 -44 -224 197 81
7672 81 -242 84 181 -257 -57 274 -187 -166 334 -145 -262 379 -76 -320 378 -3 -363 319 41 -390 250
7693B50j19m41M96Qm67L51J32m19J81K34l12k7L67k42k62M24o0m08M93M0n87M60
7715I2K02o81L89L32o84L31M03o70J86M82o01M7N09m25j13M64k26k83L77J2l86
7736b43L06J73m68J96L25n03L3N34m71j31O37m33k82O51l37l12O30k35m01N73
7756B42p6m92M59M6m60K96K15m02Q9L57l51j20M62k34k80N16j28m92N61%n85N21
7778A44J62o78M42K88o88K78L82o04J48M79m71n4M30l03j96M39j06l75M04Q0n09
7799c08L48K48n71K31M18o12J24N42n82o0O11n13j55O66l79k74N73k55l79N25
7819A98o4m05L79J21m39J60L33m44j4M64l68j97N89k98l92O70j88n34O87m2o38
7840d22O02Q7o90N24K52p15L98L30o25J49M03m47m6M57k52k51M42j02l95M07J26
$$ plain form
7693 250 131 -310 186 194 -273 78 210 -209 -28 206 -106 -133 234 -8 -270 154 94 -314 179 219 -368 92
7715 92 294 -387 2 334 -350 -19 384 -286 -100 382 -219 -172 337 -88 -201 263 37 -246 131 143 -243
7736 -243 63 236 -232 -36 289 -214 -181 353 -118 -249 388 -45 -327 324 -13 -325 305 70 -331 242
7756 242 166 -326 133 179 -281 15 230 -172 -83 274 -77 -197 265 31 -249 267 139 -353 208 208 -377 144
7778 144 306 -372 70 358 -330 -52 330 -274 -126 353 -118 -172 258 -45 -241 198 92 -283 121 201 -308
7799 -308 40 288 -283 -52 366 -246 -122 420 -162 -222 389 -124 -279 387 8 -266 307 52 -327 198
7819 198 134 -271 108 229 -210 -50 283 -161 -175 289 -79 -276 313 15 -377 293 105 -429 258 216 -422
7840 -422 180 267 -423 101 353 -362 36 366 -259 -110 293 -154 -200 257 5 -246 196 94 -301 106 232
7861B32n51L77K94o62K38M71o85R5O04o48K8O41n64j62O49m63k54O54k16l92N13
7882A99o3m51L57J95m90K00L93n15J3N15m23k25O72l65l61P15k43n52P23j17o12
7903d35O43N6o55N17J96o71L70K94n87J88M35m93o2N05k98l06N29j09m60N28N5
7924B40o24M63K51p08L60M30p17K06N15o96J03O20o25p8O71m46k64O20k60l98
7944c37N39kn41M37K23o24K28M52o53J05O05n96j15O93n06l14Q07l96m15P65k48
7965A07n30O69p5n17M95J32o00L32K97n30R7M12m22q8N28l28k93O31k00n13O34
7986B38k3o37N64K08p73N07K95q17L87M76p66K34N28o47j4N89m74j87O16k64l77
8007c37N54l7n27M15J87n64K50M71o63P8O13o59n7P39o05j89P95m82l59P54l18
$$ plain form
7861 232 -319 58 352 -310 -72 399 -286 -191 413 -235 -207 434 -130 -292 357 -106 -360 294 78 -314 199
7882 199 136 -315 42 237 -253 -53 340 -175 -162 353 -70 -295 377 12 -349 366 123 -429 294 177 -435
7903 -435 208 264 -391 126 322 -349 21 315 -272 -84 351 -142 -204 301 3 -303 226 117 -343 185 240
7924 240 -384 79 330 -378 -18 412 -305 -99 416 -280 -177 443 -182 -260 411 -35 -299 321 61 -337
7944 -337 202 200 -341 96 319 -305 -77 375 -278 -173 432 -164 -279 414 -92 -406 401 5 -410 355 107
7965 107 -423 246 171 -346 149 281 -319 13 310 -220 -123 289 -133 -221 307 -21 -314 317 117 -396 238
7986 238 215 -422 142 350 -423 84 379 -438 -51 425 -341 -107 421 -226 -240 349 -125 -312 304 40 -337
8007 -337 217 180 -347 68 255 -309 -59 412 -251 -173 440 -219 -276 463 -142 -331 464 -18 -377 377 59
8028E9m56O70j60m77N57L2n71L82K37n38K09L90m73m9N48m34k66O97k95m58P04
8049C08r8o78O99P1p82O22K63q14M34L88p59K69M86o65J15N11m72j50N56k85l68
8070c49N65n0m95M77J17o21L62L21o70K47N08p06J26O18o69m1O80n28k18P19l80
8091A3l51O43j97m53N04N6n40M03K28n76J87M37n45j4O16n09k10P35m39m09P86
8112C65k93n24P61r8o64O79L9p24N60J94o76L56L62n76J23M58m74j06N40k78l31
8133c07N75j20n29N52P5o60N21K65p25L76M05p88K49N69p52J34O07o13p2O26m57
8154f9k20N93k20l74N04k0n16L72K36n78K40M06n79MO45n92j15P24n11l02P83
8175D11l30m97P49k25n30O84o1n54N19R9n89L62K21n01J57M05
$$ plain form
8028 59 -397 273 113 -364 193 225 -346 36 273 -265 -56 334 -139 -188 360 -74 -340 357 62 -396 308
8049 308 210 -468 231 302 -480 142 405 -409 25 413 -346 -77 409 -256 -141 370 -102 -252 304 19 -349
8070 -349 216 166 -329 148 265 -356 6 327 -343 -96 412 -294 -168 450 -219 -260 420 -108 -326 393 13
8091 13 -338 305 108 -345 159 215 -325 78 306 -270 -83 354 -191 -205 411 -98 -308 427 -12 -421 365
8112 365 72 -452 309 211 -453 226 265 -459 101 295 -381 -25 337 -239 -116 342 -132 -238 302 24 -307
8133 -307 268 148 -381 171 246 -414 107 372 -353 23 428 -360 -111 458 -294 -160 447 -166 -238 388 -69
8154 -69 -289 304 84 -290 214 194 -322 50 286 -292 -52 354 -225 -221 424 -168 -283 441 -70 -372 411
8175 411 81 -416 333 108 -422 262 201 -353 166 265 -324 38 259 -242 -85 320
8191C20
$$ Imaginary data points
##PAGE= N=2
##DATA TABLE= (X++(I..I)), XYDATA
0@%%%%%%%%%%%%%oJ4j6J6j6K4l2M0m8N3o5Q0r6J12j28J48j74K04k36K72l09L50
35A87m00M55n14N76o45P23q10R05j007J115j235J368j512J670j841K028k233K459
53A289k708K979l276L608l982M402m871N398o001O692p486Q386r351J0216j0246
68d951N531M6738N26668q93543o1202J011500q02038k47145R65906n54381n13531
79e20448R22192k73913o46837P88003M6328p87582N73161L04743q39997L31728
89a02622N90088q05164Q9054P81392p37927j98283Q99925o00821m12498R73513
99D76657l94016o05445R31620k04345p64108Q15079L5807q17864O62962K68823
109D05170q29246M14160M47051p80401J57648O26209o32057r6414P35868m73607
$$ plain form
0 0 0 0 0 0 0 0 0 0 0 0 0 0 0 -6 8 -8 8 -8 16 -16 24 -24 29 -36 44 -52 60 -68 80 -94 110 -126 146 -163 187
35 187 -213 242 -272 304 -341 382 -428 477 -530 585 -650 718 -794 876 -965 1063 -1170 1289
53 1289 -1419 1560 -1716 1892 -2090 2312 -2559 2839 -3162 3530 -3956 4430 -4921 5295 -4951
68 -4951 580 47318 573986 -319557 -380759 630741 -171297 -418442 547464 -6917 -520448
79 -520448 401744 127831 -519006 268997 315325 -472257 100904 405647 -434350 -102622
89 -102622 487466 -317698 -228644 552748 -185179 -383462 516463 -84358 -496856 476657
99 476657 82641 -522804 408816 204471 -559637 255442 291249 -526615 136347 405170
109 405170 -424076 -9916 437135 -343266 -185618 440591 -191466 -287880 447988 -25619
119b5619l75805P64084k69128n83876P68212k3750p40723O77712J77424q58408
129d89877N29531L82232q59921L71121N56898q06701J46600O44999o99289p1876
139b96283P12140m97880k61072P11260k90560m63945O28468o2058n98266N35295
149A17099J94373o77784L79120L91799p32549J87086N69816o90712J8876P11368
159D68492o03818j80673P53772m86960l55759P60061k92052m74250P00052r7769
169A91096n88589N51646R9678o31829L92536L20019o11423J85628M78500n74987
179a87725n0097O05558m60894k41821P00743l15858m35604O99305j73482n87806
189d47681O61665J4069o56905N74979J76510p01433M09754L08307o71088K44589
$$ plain form
119 -25619 -401424 362660 93532 -490344 277868 254118 -486605 191107 368531 -489877
129 -489877 39654 421886 -438035 -66914 489984 -316717 -170117 474882 -224407 -296283
139 -296283 415857 -82023 -343095 368165 77605 -386340 242128 180070 -418196 117099
149 117099 311472 -366312 12808 404607 -327942 -140856 428960 -261752 -242876 468492
159 468492 -135326 -315999 437773 -49187 -404946 355115 63063 -411187 288865 191096
169 191096 -397493 154153 253831 -377998 14538 334557 -276866 -91238 387262 -187725
179 -187725 -237822 367736 -93158 -334979 365764 49906 -385698 313607 140125 -447681
189 -447681 213984 228053 -428852 146127 322637 -378796 30958 339265 -331823 -87234
199h7234M44873n67408N2770N13047m52321j62505N41305k76010l27316N50653
209B29854p7296m85067M81419R6313o08963L91139K92137o49830K82654M48668
219D01028o66041J18915N47480o18305k5925O31980m95552j69179O37113l64217
229b703l22591N83674j81998m14745N09093K3230m86495L60973J93458n30286
239b68390J95538L73355m96962L5835N12320m48729j54883N82147l63908l04774
249c38451O32809k25376m19475O09887j02345n23852N25373M1180n51965M27542
259G5327J94004n42556K67307K98090n07347R0242M02062l99439p0369M73781
269B81102k81403k55355M81168j47864m00534M79627K3862m99506M25603J62317
$$ plain form
199 -87234 357639 -209769 -156999 356048 -96273 -258778 282527 6517 -320799 229854
209 229854 152558 -332509 148910 245223 -363740 27399 319536 -330294 -47640 401028
219 401028 -265013 -146098 401382 -216923 -242848 389132 -106420 -275599 361514 -2703
229 -2703 -325294 258380 76382 -338363 170730 193960 -292535 68438 261896 -268390
239 -268390 -72852 300503 -196459 -160624 351696 -97033 -251916 330231 -33677 -338451
249 -338451 294358 68982 -350493 259394 157049 -366803 158570 199750 -352215 75327
259 75327 269331 -273225 -5918 292172 -215175 -124933 277129 -122310 -192679 281102
269 281102 -301 -255656 225512 77648 -322886 156741 180603 -318903 106700 269017
279B69017n84185L20720K92371n90857K19700M14418n48061P7146M68211m80008
289a41528p3720N00531l40117j91936M96842j87739l22473M24056l3192m13825
299b83101L45198J49959m53838K34630K91401m85636Q9167M05449m55429k8871
309a91071N04469l84487j58522N28644l07713k79570N20527j77714l47560M79951
319A86954m2737m11702L69811P9627m36554K52072K25426m05771J13003L32834
329B62963l71369n8005M08666k90440j94283M75415j77935l24899M74621p9546
339A25188m38301M41588M7940m83416L87478J64871n06895K71918K45138m85823
349b30314J53035L30576l99760K7623L71049l07756j23303L70273j80506k35814
$$ plain form
279 269017 -315168 5552 297923 -292934 -73234 341184 -206877 -129731 338480 -141528
289 -141528 -215248 285283 -54834 -246770 250072 62333 -260140 163916 130724 -283101
299 -283101 62097 212056 -241782 -7152 284249 -201387 -112220 293229 -162200 -191071
309 -191071 313398 -71089 -229611 299033 -8680 -288250 232277 54563 -292997 186954
319 186954 144217 -267485 102326 181953 -254601 -2529 222897 -182874 -69871 262963
329 262963 -108406 -166411 242255 -48185 -242468 232947 55012 -269887 204734 125188
339 125188 -313113 128475 176415 -307001 80477 245348 -261547 10371 255509 -230314
349 -230314 -77279 253297 -146463 -118840 252209 -55547 -178850 191423 10917 -224897
359b24897L65516k7593l33671L08181R6469m19025K30158K29585m40583J55451
369f0409L42192m42524M2640M01152m13396n7946M51274l24891j42612M53011
379B48491k33714k41139M02623j17020k97479L45313K7102l30836K39926J41928
389A85195l56921J12457K60570l27158l68L62819k82921j36046M08360k26596
399f09k48694M40817j26786l22846M29747l8835l92673L63989N0857m08868K93356
410C9455J54634l85784J84167K18310l52750N3702K74022k67659n4964L17839
420A80972j70004j78714L10692p5704k81774K98030M7393l41794K61783J46908
430A97788l96786J84390K27766m03489J16132L10215l67168K8034L42797l22205
$$ plain form
359 -224897 140619 113026 -220645 87536 184005 -235020 -4862 224723 -215860 -60409
369 -60409 281783 -160741 -118101 283051 -130345 -188291 262983 -61908 -204520 248491
379 248491 14777 -226362 176261 59241 -238238 107075 134177 -196659 43267 185195
389 185195 -171726 -59269 201301 -125857 -126225 236594 -46327 -182373 225987 -609
399 -609 -249303 191514 64728 -258118 171629 132794 -259879 104110 154967 -253901 39455
410 39455 194089 -191695 -7528 210782 -141968 -88266 185756 -81903 -136867 180972
420 180972 10968 -167746 142946 67242 -214532 83498 130891 -210903 50880 197788
430 197788 -198998 -14608 213158 -190331 -74199 236016 -131152 -103118 239679 -82526
440h2526p4499L52411k28218j47197L46789j17027k26364K87619j3493k87818
450a90323K20830J14063l05115J42121K17537l19991L2481K91301k99134n4880
460a51110L60303k41831j39154L76330j88630k22883L60051j03550k61401L29839
470A17964r104k90624K48607O5407l00726J58538J55895k64973O5507K25446k29055
481e7118n4014K64257j71399j49068L04460q6427k31181L03611j8861l09947K74850
492F9163O2070l39222K42378J42850l48796J68118J89660l36977Q6277K38860
502A74381k73759R427K63467k04054r0115K50177j17224j66304K37755m470k24123
513a44842J93786Q5206k80785J28403J74012k92647P4612K54784k85326j280K90110
$$ plain form
440 -82526 -157025 195386 -32832 -180029 166760 49733 -176631 110988 97495 -190323
450 -190323 30507 144570 -160545 -18424 199113 -120878 -88397 202904 -96230 -151110
460 -151110 209193 -32638 -171792 204538 15908 -206975 153076 49526 -211875 117964
470 117964 108860 -181764 66843 132250 -168476 -9938 145957 -119016 -53509 171937 -57118
481 -57118 -111132 153125 -18274 -167342 137118 50691 -180490 123121 104260 -205687 69163
492 69163 131233 -207989 34389 177239 -171557 -3439 186221 -150756 -64479 174381
502 174381 -99378 -89951 173516 -30538 -120653 129524 12300 -154004 83751 79281 -144842
513 -144842 48944 134150 -146635 -18232 155780 -136867 -62255 192529 -92797 -94077 196033
524A96033k66439p1632L15191k04357j18981L13262j39852j75952K67823o8263
534D6833k06485K20717K7016k12972J47757J00457k21975N3575J70333j95780
544g0524k3720K38346j56094j13168K65572j18852j93155K82844n2141k38854
554a79746K79770Q231k82380K34054N9984k93309J86112J24892k68053J17987
564a2458J62050k39437K8027J86007j76784m3432K08645r8759j21369J94496l1217
575E5769j91717J74030N4334k26141J47745J25721k56894R1846J73539k61471
585a13239M4885K23734k30894n446K40673j99524o9522K34749j40138j09610K25523
596A01191o3649j49621J80413R15j85734J26724Q1425j88930P3627J51936j91378
$$ plain form
524 196033 -70406 -142038 173153 -31204 -150185 163077 23225 -152727 115096 46833
534 46833 -159652 61065 88081 -124891 22866 123323 -98652 -45077 125256 -70524
544 -70524 -94244 144102 -11992 -125160 140412 21560 -171595 111249 59108 -179746
554 -179746 100024 108255 -174125 59929 119913 -173396 12716 137608 -130445 -12458
564 -12458 149592 -89845 -61818 124189 -52595 -96027 112618 13859 -107510 86986 55769
575 55769 -135948 38082 92416 -133725 14020 139741 -117153 -25307 148232 -113239
585 -113239 -68354 155380 -75514 -80960 159713 -39811 -109333 125416 -14722 -124332 101191
596 101191 37542 -112079 68334 69249 -116485 10239 91664 -97266 -23639 128297 -63081
607f3081k771J96435j78006o4979K41221j35695j17006K53699r9902j72821K37612
618I4706m8490j95153K16713J4220k04188J61661N7301k04952R5170J08256j70560
629g5316L3793J49829j34166m6447J64527r1201j11582J82380k7436j59643J78586
640F3324K0425k09022J52443O8839k25294J31044J20152k23697Q6416J43481k14843
651h6732L3732J65100j70762q288J76170j20459o6105J57637o5682j12683J41108
662D3036J0303j41800J09407P1495j75189N8990J26926j81761K1012J82205j71426
673d6802k7238K04243j59921p5051K14920j19933j00051K12108p5853j29042J75432
684G2812l4452j42765J36773K4301j33804Q6606O8901j29419J8659J05115j05632
$$ plain form
607 -63081 -65852 130583 -47423 -112402 128819 -6876 -123882 129817 29915 -142906 94706
618 94706 46216 -148937 67776 81996 -122192 39469 96770 -108182 -13012 95244 -75316
629 -75316 -41523 108306 -25860 -72307 92220 1019 -110563 71817 44381 -115262 63324
640 63324 83749 -125273 27170 96009 -129285 1759 121911 -101786 -15370 128111 -86732
651 -86732 -53000 112100 -58662 -66950 109220 -11239 -77344 80293 14611 -98072 43036
662 43036 53339 -88461 20946 92441 -82748 -23758 103168 -78593 -57581 124624 -46802
673 -46802 -74040 130203 -29718 -104769 110151 -9782 -109833 102275 26422 -102620 72812
684 72812 38360 -104405 32368 56669 -77135 9471 78372 -51047 -32388 72727 -32905
695c2905l4014J45194p0220q9416J58348m4144j42240J63055j918j67582J62118
706D6276L7381j90335J32291O3273j96230J01354R8863j73701O3570J17588j50754
717e0424P245J22338j08599l5953J30489n1300q0178J15086m686j24955R2506
728A1569N2079j43479P2605J02541j58407L3222J30728j61210K61J59521j37243
739c7813k7012J67180j14412o4080J53475p8169q3118J40316k7704r6708J05233
750C7188J0738j12337O1968N6824j05604K5860J00296r8242k4234J22908q7993
$$ plain form
695 -32905 -66919 78275 8055 -81361 76987 32843 -109397 53658 51740 -115842 46276
706 46276 83657 -106678 25613 88886 -107344 -5990 92873 -80828 -17258 100330 -50424
717 -50424 -43179 79159 -29440 -65393 65096 13796 -66382 48704 44018 -80937 11569
728 11569 63648 -79831 -7226 95315 -63092 -29870 100858 -60352 -60091 99430 -37813
739 -37813 -64825 102355 -12057 -76137 77338 -831 -83949 56367 28663 -68045 37188
750 37188 47926 -64411 -2443 54381 -51223 -25363 74933 -23309 -47543 75365 -12628
$$ [...]
8191b6
##END NTUPLES=NMR FID
##END=
