##TITLE=1H_DE-AcCl_old
 200.13Hz, .
 8 sc
 19.8.2026
##JCAMPDX= 6.0         $$ Bruker NMR JCAMP-DX V2.0
##DATA TYPE= NMR FID
##DATA CLASS= NTUPLES
##ORIGIN= UXNMR, Bruker Analytische Messtechnik GmbH
##OWNER= pz
$$ XWIN-NMR		Version 3.5
$$ Wed Aug 19 15:08:56 2026 Russian Standard Time (UT+4h)  she@DPX200
##.OBSERVE FREQUENCY= 200.1313
##.OBSERVE NUCLEUS= ^1H
##.DELAY= (6, 6)
##.ACQUISITION MODE= SIMULTANEOUS
##.ACQUISITION SCHEME= undefined
##.AVERAGES= 8
##.DIGITISER RES= 18
##SPECTROMETER/DATA SYSTEM= spect
##.PULSE SEQUENCE= zg30
##.SOLVENT NAME= CDCl3
##.SHIFT REFERENCE= (INTERNAL, CDCl3, 0, 14.3821)
##AUDIT TRAIL= $$ (NUMBER, WHEN, WHO, WHERE, WHAT)
$$ ##TITLE= Audit trail, XWIN-NMR		Version 3.5
$$ ##JCAMPDX= 5.01
$$ ##ORIGIN= Bruker BioSpin GmbH
$$ ##OWNER= she
$$ F:/spectra/data/she/nmr/H-C/1/audita.txt
$$ ##AUDIT TRAIL=  $$ (NUMBER, WHEN, WHO, WHERE, WHAT)
(   1,<2026-08-19 15:07:28.48 +0400>,<she>,<DPX200>,
      <created by zg, POWCHK disabled, PULCHK disabled
       configuration hash MD5:
       00 E9 B6 7A A2 85 ED C7 34 08 36 98 17 FE 4E 26
       data hash MD5: 16K
       D3 D1 0B EE 6D 2D B3 B1 FC 07 79 99 A2 09 E5 C8>)
$$ ##END=
$$ 
$$ hash MD5
$$ 37 B2 FF DD 34 68 E2 E3 B0 D1 F5 85 BA 39 D8 E4
##$RELAX= 
##$RELAX= 
##$RELAX= 
##$RELAX= 
##$RELAX= 
##$RELAX= 
$$ Bruker specific parameters
$$ --------------------------
##$DU= <F:/spectra>
##$EXPNO= 1
##$NAME= <H-C>
##$PROCNO= 1
##$TYPE= <nmr>
##$USER= <she>
##$AMP= (0..31)
100 100 100 100 100 100 100 100 100 100 100 100 100 100 100 100 100 100 
100 100 100 100 100 100 100 100 100 100 100 100 100 100 
##$AQSEQ= 0
##$AQ_mod= 1
##$AUNM= <au_zg>
##$AUTOPOS= <>
##$BF1= 200.13
##$BF2= 200.13
##$BF3= 200.13
##$BF4= 200.13
##$BF5= 200.13
##$BF6= 200.13
##$BF7= 200.13
##$BF8= 200.13
##$BYTORDA= 1
##$CFDGTYP= 0
##$CFRGTYP= 5
##$CHEMSTR= <none>
##$CNST= (0..31)
1 1 145 1 1 1 1 1 1 1 1 1 1 1 1 1 1 1 1 1 1 1 1 1 1 1 1 1 1 1 1 1 
##$CPDPRG= <>
##$CPDPRG1= <>
##$CPDPRG2= <>
##$CPDPRG3= <>
##$CPDPRG4= <mlev>
##$CPDPRG5= <mlev>
##$CPDPRG6= <mlev>
##$CPDPRG7= <mlev>
##$CPDPRG8= <mlev>
##$CPDPRGB= <>
##$CPDPRGT= <>
##$D= (0..31)
0 0.7 0 0 0 0 0 0 0 0 0 0.03 0 0 0 0 0 0 0 0 0 0 0 0 0 0 0 0 0 0 0 0 
##$DATE= 1787137647
##$DBL= (0..7)
120 120 120 120 120 120 120 120 
##$DBP= (0..7)
150 150 150 150 150 150 150 150 
##$DBP07= 0
##$DBPNAM0= <>
##$DBPNAM1= <>
##$DBPNAM2= <>
##$DBPNAM3= <>
##$DBPNAM4= <>
##$DBPNAM5= <>
##$DBPNAM6= <>
##$DBPNAM7= <>
##$DBPOAL= (0..7)
0.5 0.5 0.5 0.5 0.5 0.5 0.5 0.5 
##$DBPOFFS= (0..7)
0 0 0 0 0 0 0 0 
##$DE= 6
##$DECBNUC= <off>
##$DECIM= 32
##$DECNUC= <off>
##$DECSTAT= 4
##$DIGMOD= 1
##$DIGTYP= 9
##$DL= (0..7)
0 120 120 120 120 120 120 120 
##$DP= (0..7)
150 150 150 150 150 150 150 150 
##$DP07= 0
##$DPNAME0= <>
##$DPNAME1= <>
##$DPNAME2= <>
##$DPNAME3= <>
##$DPNAME4= <>
##$DPNAME5= <>
##$DPNAME6= <>
##$DPNAME7= <>
##$DPOAL= (0..7)
0.5 0.5 0.5 0.5 0.5 0.5 0.5 0.5 
##$DPOFFS= (0..7)
0 0 0 0 0 0 0 0 
##$DQDMODE= 0
##$DR= 18
##$DS= 0
##$DSLIST= <SSSSSSSSSSSSSSS>
##$DSPFIRM= 0
$$ [...]
##$SUBNAM0= <"">
##$SUBNAM1= <"">
##$SUBNAM2= <"">
##$SUBNAM3= <"">
##$SUBNAM4= <"">
##$SUBNAM5= <"">
##$SUBNAM6= <"">
##$SUBNAM7= <"">
##$SUBNAM8= <"">
##$SUBNAM9= <"">
##$SW= 18.0517328524113
##$SWIBOX= (0..15)
0 0 2 0 0 0 0 0 0 0 0 0 0 0 0 0 
##$SW_h= 3612.71676300578
##$TD= 16384
##$TD0= 1
##$TE= 0
##$TE2= 300
##$TE3= 300
##$TEG= 300
##$TL= (0..7)
0 120 120 120 120 120 120 120 
##$TP= (0..7)
150 150 150 150 150 150 150 150 
##$TP07= 0
##$TPNAME0= <>
##$TPNAME1= <>
##$TPNAME2= <>
##$TPNAME3= <>
##$TPNAME4= <>
##$TPNAME5= <>
##$TPNAME6= <>
##$TPNAME7= <>
##$TPOAL= (0..7)
0.5 0.5 0.5 0.5 0.5 0.5 0.5 0.5 
##$TPOFFS= (0..7)
0 0 0 0 0 0 0 0 
##$TUNHIN= 0
##$TUNHOUT= 0
##$TUNXOUT= 0
##$USERA1= <user>
##$USERA2= <user>
##$USERA3= <user>
##$USERA4= <user>
##$USERA5= <user>
##$V9= 5
##$VALIST= <valist>
##$VCLIST= <CCCCCCCCCCCCCCC>
##$VD= 0
##$VDLIST= <DDDDDDDDDDDDDDD>
##$VPLIST= <PPPPPPPPPPPPPPP>
##$VTLIST= <TTTTTTTTTTTTTTT>
##$WBST= 1024
##$WBSW= 4
##$XGAIN= (0..3)
0 0 0 0 
##$XL= 0
##$YL= 0
##$YMAX_a= 563821
##$YMIN_a= -532833
##$ZGOPTNS= <>
##$ZL1= 120
##$ZL2= 120
##$ZL3= 120
##$ZL4= 120
##$ABSF1= 10
##$ABSF2= 0
##$ABSG= 5
##$ABSL= 3
##$ALPHA= 0
##$AQORDER= 0
##$ASSFAC= 0
##$ASSFACI= 0
##$ASSFACX= 0
##$ASSWID= 0
##$AUNMP= <proc_1d>
##$AZFE= 0.1
##$AZFW= 0.1
##$BCFW= 1
##$BC_mod= 2
##$BYTORDP= 1
##$COROFFS= 0
##$CY= -3
##$DATMOD= 1
##$DC= 2
##$DFILT= <>
##$DTYPP= 0
##$F1P= 0
##$F2P= 0
##$FCOR= 0.5
##$FTSIZE= 0
##$FT_mod= 4
##$GAMMA= 1
##$GB= 0.15
##$INTBC= 1
##$INTSCL= 1
##$ISEN= 128
##$LB= 0.25
##$LEV0= 0
##$LPBIN= 0
##$MAXI= 10000
##$MC2= 0
##$MEAN= 0
##$ME_mod= 0
##$MI= 1.114404
##$NCOEF= 0
##$NC_proc= 0
##$NLEV= 6
##$NOISF1= 3.799351
##$NOISF2= 2.8
##$NSP= 1
##$NTH_PI= 0
##$NZP= 0
##$OFFSET= 14.38212
##$PC= 1
##$PHC0= -4491.032
##$PHC1= 7.192299
##$PH_mod= 1
##$PKNL= yes
##$PPARMOD= 0
##$PSCAL= 0
##$PSIGN= 0
##$REVERSE= no
##$SF= 200.129724274929
##$SI= 16384
##$SIGF1= 3
##$SIGF2= 2
##$SINO= 400
##$SIOLD= 16384
##$SREGLST= <1H.CDCl3>
##$SSB= 0
##$STSI= 0
##$STSR= 0
##$SW_p= 3205.1282051282
##$SYMM= 0
##$S_DEV= 0
##$TDeff= 0
##$TDoff= 0
##$TI= <>
##$TILT= no
##$TM1= 0
##$TM2= 0
##$TOPLEV= 0
##$USERP1= <user>
##$USERP2= <user>
##$USERP3= <user>
##$USERP4= <user>
##$USERP5= <user>
##$WDW= 1
##$XDIM= 8192
##$YMAX_p= 0
##$YMIN_p= 0
$$ End of Bruker specific parameters
$$ ---------------------------------
##NTUPLES= NMR FID
##VAR_NAME=  TIME,          FID/REAL,        FID/IMAG
##SYMBOL=    X,             R,               I
##VAR_TYPE=  INDEPENDENT,   DEPENDENT,       DEPENDENT
##VAR_FORM=  AFFN,          ASDF,            ASDF
##VAR_DIM=   8192,          8192,            8192
##UNITS=     SECONDS,       ARBITRARY UNITS, ARBITRARY UNITS
##FACTOR=    0.0002768,     1,               1
##FIRST=     0,             0,               0
##LAST=      2.2672688,     0,               0
##MIN=       0,             -532833,         0
##MAX=       2.2672688,     563821,          0
$$ Real data points
##PAGE= N=1
##DATA TABLE= (X++(R..R)), XYDATA
0 0 0 0 0 0 0 0 0 -8 8 -8 8 -8 16 -22 24 -31 32 -48 56 -65 80 -95 112 -135 158 -183 208 -240 279 -322
30 -322 367 -417 473 -536 604 -682 766 -857 954 -1066 1187 -1319 1462 -1617 1789 -1976
46 -1976 2183 -2404 2648 -2915 3212 -3540 3903 -4306 4758 -5268 5850 -6521 7298 -8215
60 -8215 9319 -10674 12385 -14618 17661 -22069 29034 -41670 71529 -277521 5132 513110
72 513110 -495276 -51186 512135 -370208 -206452 558239 -286015 -297756 530004 -151832
82 -151832 -401596 501151 -38038 -458040 425741 92423 -504312 344469 200521 -510069
92 -510069 236318 304604 -497482 127122 382046 -452262 8090 442730 -389164 -104041
102 -104041 474351 -303149 -211320 482949 -205323 -302842 463377 -96519 -377822 420343
112 420343 14419 -429703 354051 123411 -457674 269973 223049 -459276 172171 308495
122 308495 -435391 67039 374468 -387410 -39425 418001 -318946 -141200 436969 -234293
132 -234293 -232322 431046 -138920 -308045 401278 -38481 -364604 350234 61389 -399648
142 -399648 281375 155199 -411988 199036 238266 -401799 107873 306585 -370142 12890
152 12890 356913 -319170 -81150 387239 -251737 -169379 396222 -171599 -247367 383585
162 383585 -82933 -311031 349950 9405 -356978 297348 100478 -382771 228650 185177
172 185177 -386954 147899 258504 -369383 59830 316414 -331218 -30504 355634 -274895
182 -274895 -117614 374125 -204114 -196506 371183 -123248 -262749 347525 -37198 -312910
192 -312910 305007 49005 -344579 246661 130543 -356703 176133 203250 -349157 97402
202 97402 263501 -322838 14932 308412 -279542 -67029 336011 -221747 -144318 345103
212 345103 -152629 -212905 335266 -75880 -269189 307132 4472 -310204 262133 84116
222 84116 -333691 202822 158399 -338255 132588 223157 -323621 55467 274602 -290848
232 -290848 -23877 309777 -241889 -100697 326769 -179978 -170503 324934 -109054 -229221
242 -229221 304635 -33445 -273732 267699 42311 -301937 216671 114045 -312743 154758
252 154758 178015 -306202 85663 230855 -283077 13162 270244 -244889 -58932 294453
262 294453 -194039 -126848 302361 -133203 -187137 293723 -65704 -236784 269123 4973
272 4973 -273066 229839 75076 -294103 177877 140789 -298636 116116 198236 -286248 48091
283 48091 244194 -257635 -22268 275886 -214563 -90677 291492 -159723 -153101 290273
293 290273 -96552 -205896 272517 -28972 -245988 239627 39038 -271486 193864 103550
303 103550 -281333 138229 161009 -275368 76003 208525 -254383 10717 243864 -219894
313 -219894 -54146 265486 -173970 -115291 272487 -119164 -169505 264697 -58359 -214189
323 -214189 242609 5220 -246963 207351 68331 -266062 160786 127440 -270299 105409
333 105409 179167 -259343 44348 220585 -233846 -18870 249216 -195267 -80399 263408
343 263408 -146084 -136656 262502 -89251 -184324 246715 -28361 -220778 217305 32971
353 32971 -244070 176397 91146 -253282 126545 143031 -248283 70832 185842 -229789
363 -229789 12375 217727 -199116 -45702 237254 -158183 -100374 243716 -109288 -148963
373 -148963 236933 -55005 -189040 217385 1886 -218582 186039 58448 -236029 144607
383 144607 111465 -240253 95267 158097 -231011 40763 195596 -208693 -15864 221738
393 221738 -174568 -71148 234987 -130745 -121836 234538 -79838 -164824 220573 -25080
403 -25080 -197738 194184 30213 -218757 157252 82659 -226901 112129 129347 -222127
413 -222127 61771 167847 -205162 9022 196281 -177218 -43315 213496 -140028 -92408
423 -92408 218865 -95812 -135888 212331 -46837 -171666 194365 4344 -197939 165951
433 165951 55073 -213356 128544 102734 -217007 84121 144603 -208652 35064 178348
443 178348 -188619 -15829 201933 -157944 -65666 213969 -118437 -111385 213605 -72524
453 -72524 -150277 201058 -22978 -180070 177184 27085 -199128 143742 74654 -206573
463 -206573 102772 117094 -202319 57017 152059 -186941 9073 178007 -161652 -38332
473 -38332 193686 -128107 -82820 198625 -88209 -122081 192804 -44141 -154290 176698
483 176698 1953 -177976 151203 47487 -191826 117663 90280 -195244 77821 128019
493 128019 -187888 33804 158601 -170129 -12032 180135 -142879 -56916 191381 -107661
503 -107661 -98255 191606 -66570 -133541 180798 -22217 -160636 159745 22718 -178071
513 -178071 129919 65519 -184965 93250 103691 -181227 52150 135149 -167386 9034
523 9034 158417 -144550 -33600 172424 -114294 -73539 176734 -78361 -108750 171405 -38778
534 -38778 -137573 156935 2408 -158693 134102 43179 -171092 104060 81498 -174167 68465
545 68465 115239 -167624 29015 142654 -151742 -12041 162045 -127346 -52361 172202
555 172202 -95786 -89560 172480 -58864 -121385 162831 -18905 -145894 143896 21699
565 21699 -161615 116886 60449 -167877 83665 94948 -164321 46359 123421 -151595 7163
576 7163 144379 -130686 -31578 156929 -103002 -67790 160638 -70271 -99636 155586 -34362
587 -34362 -125625 142318 2952 -144587 121559 39754 -155673 94437 74199 -158327 62266
598 62266 104533 -152338 26834 129086 -138013 -10121 146539 -116034 -46440 155750
608 155750 -87626 -80028 156116 -54362 -108890 147630 -18316 -131210 130752 18366
618 18366 -145717 106636 53381 -151576 76852 84631 -148670 43342 110366 -137337 8124
629 8124 129240 -118624 -26588 140443 -93829 -59050 143702 -64449 -87582 139093 -32165
640 -32165 -110802 127119 1227 -127785 108530 34155 -137720 84353 64968 -140200 55773
651 55773 92108 -135082 24230 114176 -122540 -8615 129902 -103152 -41011 138345 -78003
662 -78003 -71030 138883 -48421 -96900 131406 -16143 -116969 116351 16752 -130088 94748
673 94748 48183 -135390 67952 76330 -132706 37716 99429 -122416 5978 116340 -105389
684 -105389 -25357 126260 -82788 -54570 128900 -56129 -80102 124423 -26919 -100803 113282
695 113282 3253 -115794 96268 32825 -124372 74282 60379 -126298 48520 84543
705 84543 -121438 20208 104103 -110029 -9196 118042 -92610 -38168 125482 -70008
715 -70008 -65012 125882 -43464 -88153 119134 -14508 -106215 105641 15056 -118036 86156
726 86156 43507 -122936 62009 68936 -120634 34743 90008 -111491 6065 105414 -96183
737 -96183 -22192 114440 -75923 -48537 116889 -51907 -71509 112837 -25690 -90098 102767
748 102767 1406 -103377 87406 27884 -111026 67670 52546 -112677 44508 74193
758 74193 -108346 19201 91768 -98267 -7077 104333 -82825 -32975 111168 -62850 -56947
769 -56947 111740 -39360 -77681 105986 -13656 -93887 94179 12592 -104497 76983 37869
780 37869 -108881 55502 60593 -106823 31183 79293 -98609 5551 92972 -84840 -19731
791 -19731 100969 -66605 -43208 102951 -45051 -63577 99120 -21597 -79962 89941 2497
802 2497 -91612 76054 25941 -98093 58327 47675 -99241 37760 66639 -95163 15260
813 15260 82001 -85974 -7994 92952 -72186 -30770 98752 -54366 -51909 99160 -33542
824 -33542 -70192 93956 -10779 -84477 83401 12556 -93847 68042 35054 -97642 48844
835 48844 55272 -95718 26997 71972 -88219 3985 84146 -75810 -18745 91184 -59277
846 -59277 -39837 92854 -39876 -58071 89250 -18749 -72619 80876 2863 -82867 68315
857 68315 23786 -88457 52356 43085 -89254 33884 59896 -85345 13804 73353 -77012
868 -77012 -6849 82904 -64637 -27104 88032 -48789 -45927 88379 -30253 -62194 83836
879 83836 -10068 -75021 74609 10645 -83467 61105 30607 -87030 44168 48547 -85392
890 -85392 24890 63366 -78814 4522 74134 -67750 -15580 80300 -53058 -34253 81646
901 81646 -35674 -50426 78292 -16827 -63228 70684 2368 -72129 59422 20903 -76910
912 -76910 45159 37833 -77411 28839 52428 -73845 11245 64040 -66391 -6786 72178
923 72178 -55458 -24376 76419 -41515 -40619 76516 -25324 -54660 72386 -7695 -65696
934 -65696 64149 10399 -72902 52203 27820 -75852 37331 43488 -74282 20329 56386
945 56386 -68302 2387 65672 -58382 -15341 70890 -45189 -31713 71802 -29662 -45796
956 -45796 68463 -12902 -56860 61355 4060 -64445 51036 20393 -68255 38242 35132
967 35132 -68275 23664 47737 -64737 8131 57637 -57868 -7669 64418 -47989 -22984
978 -22984 67806 -35611 -37051 67619 -21305 -49206 63736 -5775 -58703 56323 10091
989 10091 -64872 45775 25394 -67379 32626 39141 -65972 17664 50427 -60700 1940
1000 1940 58625 -51965 -13659 63079 -40293 -28042 63748 -26626 -40354 60701 -11812
1011 -11812 -49903 54226 3188 -56353 44954 17440 -59494 33512 30350 -59307 20586 41328
1023 41328 -55997 6918 49844 -49827 -6826 55608 -41154 -20045 58416 -30400 -32131 58127
1035 58127 -18035 -42483 54673 -4709 -50497 48184 8891 -55655 38986 21983 -57648 27555
1047 27555 33712 -56243 14605 43357 -51472 885 50288 -43688 -12640 53976 -33421 -25023
1059 -25023 54257 -21387 -35535 51264 -8473 -43552 45333 4540 -48764 36978 16803 -51020
1071 -51020 26812 27745 -50321 15471 36841 -46979 3629 43779 -41224 -8189 48281 -33402
1083 -33402 -19400 50185 -23921 -29487 49466 -13209 -38071 46132 -1783 -44573 40263 9796
1095 9796 -48639 32119 20937 -50019 22106 30846 -48480 10850 38960 -44104 -1044 44703
1107 44703 -37129 -12723 47622 -27994 -23390 47646 -17376 -32335 44742 -6055 -39098 39299
1119 39299 5267 -43304 31714 15885 -44882 22551 25191 -43874 12497 32861 -40531 2090
1131 2090 38508 -35143 -8153 42019 -28061 -17769 43305 -19674 -26320 42389 -10373 -33472
1143 -33472 39304 -554 -38800 34109 9267 -42089 27075 18593 -42989 18466 26936 -41496
1155 -41496 8828 33582 -37479 -1246 38211 -31314 -11152 40449 -23309 -20168 40133 -14109
1167 -14109 -27668 37392 -4314 -33242 32432 5431 -36560 25640 14385 -37566 17646 22181
1179 22181 -36355 8989 28357 -33105 109 32745 -28177 -8463 35265 -21893 -16336 35848
1191 35848 -14602 -23225 34599 -6660 -28849 31572 1596 -32912 26913 9739 -35268 20744
1203 20744 17406 -35669 13326 24115 -33971 5164 29422 -30280 -3326 32972 -24777 -11622
1215 -11622 34423 -17757 -19042 33732 -9708 -25164 30941 -1254 -29586 26256 7022 -31991
1227 -31991 20140 14603 -32327 12999 20979 -30695 5358 25879 -27407 -2256 29168 -22744
1239 -22744 -9519 30787 -16934 -16041 30715 -10471 -21605 29120 -3524 -26029 26080 3479
1251 3479 -29066 21700 10320 -30611 16233 16617 -30590 9861 22080 -28846 2862 26256
1263 26256 -25426 -4275 28914 -20520 -11159 29842 -14400 -17261 28870 -7422 -22245 26081
1275 26081 -139 -25596 21754 6920 -27282 16166 13281 -27146 9832 18529 -25390 3184
1287 3184 22468 -22222 -3345 24891 -17909 -9378 25784 -12799 -14673 25315 -7183 -18999
1299 -18999 23533 -1389 -22269 20602 4374 -24358 16646 9876 -25140 11810 14878 -24637
1311 -24637 6379 19036 -22789 574 22171 -19595 -5333 24011 -15242 -10890 24389 -9924
1323 -9924 -15735 23178 -4014 -19532 20449 2094 -21953 16427 7898 -22896 11414 13029 -22293
1336 -22293 5842 17126 -20235 82 19975 -17019 -5443 21511 -12896 -10404 21715 -8240
1348 -8240 -14606 20684 -3262 -17819 18576 1729 -20059 15624 6496 -21222 11867 10924 -21325
1361 -21325 7547 14801 -20367 2846 17900 -18295 -2090 20103 -15227 -6921 21185 -11265
1373 -11265 -11435 21068 -6582 -15290 19605 -1486 -18170 16903 3686 -19837 13133 8545 -20159
1386 -20159 8558 12728 -19164 3518 15977 -16927 -1538 18062 -13696 -6315 18939 -9768
1398 -9768 -10513 18660 -5489 -13879 17304 -1061 -16307 15111 3234 -17828 12223 7175 -18382
1411 -18382 8798 10649 -17994 4997 13606 -16754 964 15847 -14644 -3103 17243 -11739
1423 -11739 -7049 17708 -8160 -10647 17135 -4042 -13606 15551 289 -15689 12910 4632 -16726
1436 -16726 9489 8593 -16600 5390 11918 -15340 1032 14291 -13042 -3231 15655 -9923 -7186
1449 -7186 15895 -6258 -10499 15076 -2343 -12980 13441 1517 -14667 11059 5136 -15410
1461 -15410 8175 8307 -15285 4929 10969 -14455 1564 13044 -12886 -1863 14484 -10654
1473 -10654 -5215 15139 -7902 -8317 14999 -4627 -11037 14093 -1033 -13199 12286 2664 -14557
1486 -14557 9687 6302 -14989 6412 9540 -14405 2683 12133 -12841 -1215 13833 -10411
1498 -10411 -5013 14553 -7295 -8345 14296 -3745 -11071 13096 -131 -12984 11139 3415 -14013
1511 -14013 8575 6583 -14268 5692 9276 -13727 2654 11387 -12496 -469 12851 -10715
1523 -10715 -3448 13688 -8422 -6231 13810 -5755 -8715 13292 -2815 -10766 12034 381 -12284
1536 -12284 10121 3591 -13071 7553 6639 -13055 4482 9255 -12230 1052 11301 -10544 -2412
1549 -2412 12526 -8096 -5682 12835 -5158 -8450 12252 -1910 -10619 10836 1397 -11948 8740
1562 8740 4483 -12494 6201 7141 -12239 3392 9275 -11284 534 10812 -9794 -2239 11691
1575 11691 -7838 -4808 11986 -5559 -7074 11665 -3027 -8959 10796 -346 -10408 9329
1587 9329 2411 -11337 7361 5061 -11616 4862 7480 -11200 1988 9502 -10033 -1071 10929
1600 10929 -8157 -4114 11646 -5685 -6885 11551 -2800 -9224 10580 299 -10874 8905
1612 8905 3365 -11745 6641 6137 -11846 4002 8429 -11169 1193 10128 -9877 -1592 11206
1625 11206 -8125 -4162 11680 -5988 -6432 11501 -3614 -8304 10818 -1156 -9781 9597 1341
1638 1341 -10797 7959 3786 -11212 5847 6079 -11082 3419 8082 -10324 698 9670 -8926
1651 -8926 -2094 10698 -6927 -4855 11036 -4422 -7337 10671 -1616 -9335 9529 1321 -10642
1664 -10642 7719 4140 -11217 5439 6615 -11083 2852 8608 -10171 144 9970 -8690 -2416
1677 -2416 10692 -6748 -4770 10793 -4577 -6723 10268 -2247 -8273 9293 169 -9359 7932
1690 7932 2450 -9942 6151 4571 -10068 4055 6532 -9637 1759 8133 -8652 -698 9277
1703 9277 -7139 -3195 9913 -5143 -5563 9883 -2742 -7610 9187 -85 -9221 7817 2629
1716 2629 -10140 5882 5178 -10376 3542 7429 -9855 938 9048 -8695 -1642 10079 -7046
1729 -7046 -4076 10469 -4959 -6139 10208 -2665 -7839 9410 -346 -9015 8161 1935 -9741
1742 -9741 6496 4047 -9954 4589 5922 -9712 2481 7521 -8967 238 8761 -7712 -2120
1755 -2120 9580 -6053 -4419 9849 -3982 -6494 9518 -1564 -8271 8566 1030 -9493 7028
1768 7028 3610 -10169 5005 5980 -10174 2600 7996 -9434 10 9462 -8123 -2523 10270
1781 10270 -6288 -4803 10463 -4186 -6787 9958 -1854 -8216 8930 464 -9173 7481 2622
1794 2622 -9574 5676 4599 -9555 3683 6234 -8986 1542 7601 -8045 -669 8560 -6654
1807 -6654 -2798 9041 -4972 -4843 9106 -2912 -6642 8557 -630 -8092 7498 1759 -9058
1820 -9058 5895 4118 -9406 3843 6222 -9144 1551 7927 -8232 -944 9095 -6754 -3328
1833 -3328 9631 -4869 -5490 9549 -2697 -7183 8874 -410 -8443 7652 1780 -9134 6064
1846 6064 3798 -9260 4172 5575 -8921 2167 6967 -8140 98 7996 -6953 -1990 8656
1859 8656 -5384 -3977 8819 -3571 -5767 8504 -1517 -7246 7770 705 -8411 6480 2958
1872 2958 -9063 4763 5130 -9185 2628 7022 -8694 286 8483 -7568 -2109 9450 -5939
1885 -5939 -4411 9763 -3924 -6402 9420 -1708 -8012 8533 614 -9050 7146 2801 -9507
1898 -9507 5417 4715 -9413 3450 6368 -8846 1365 7550 -7774 -708 8354 -6444 -2713
1911 -2713 8699 -4732 -4510 8640 -2855 -6140 8135 -814 -7423 7193 1310 -8330 5809
1924 5809 3430 -8794 4029 5415 -8720 1982 7075 -8070 -247 8348 -6865 -2556 9053
1937 9053 -5199 -4649 9161 -3202 -6451 8672 -943 -7831 7643 1272 -8655 6147 3386 -8939
1951 -8939 4317 5165 -8669 2326 6584 -7918 289 7562 -6774 -1708 8108 -5284 -3496 8226
1965 8226 -3591 -5105 7924 -1719 -6445 7169 289 -7451 6064 2289 -8058 4558 4223 -8198
1979 -8198 2745 5960 -7863 718 7334 -7039 -1436 8334 -5683 -3587 8828 -3920 -5538
1992 -5538 8697 -1887 -7106 7993 318 -8265 6782 2472 -8894 5132 4475 -8935 3251
2005 3251 6106 -8473 1234 7332 -7514 -844 8092 -6170 -2719 8391 -4535 -4437 8292 -2710
2019 -2710 -5872 7730 -837 -6996 6797 1161 -7748 5522 3037 -8113 3904 4834 -8089 2036
2033 2036 6371 -7530 49 7597 -6556 -2048 8377 -5139 -4038 8647 -3363 -5847 8427
2046 8427 -1321 -7300 7585 782 -8271 6271 2845 -8717 4571 4712 -8586 2621 6208 -7961
2060 -7961 595 7321 -6831 -1397 7928 -5418 -3212 8051 -3710 -4788 7774 -1907 -6043 7061
2074 7061 -38 -6952 6006 1785 -7465 4599 3516 -7597 2996 5051 -7322 1204 6348 -6629
2088 -6629 -739 7296 -5522 -2661 7852 -4052 -4481 7890 -2246 -6086 7453 -280 -7334 6527
2102 6527 1739 -8084 5111 3672 -8319 3410 5355 -8001 1495 6673 -7179 -482 7567 -5961
2116 -5961 -2353 7955 -4410 -4053 7876 -2669 -5481 7341 -830 -6519 6429 959 -7254 5214
2130 5214 2721 -7517 3740 4322 -7439 2054 5674 -6943 233 6756 -6056 -1622 7519 -4810
2144 -4810 -3460 7816 -3254 -5141 7687 -1459 -6538 7073 510 -7578 6023 2476 -8174
2157 -8174 4544 4262 -8199 2830 5801 -7810 903 6994 -6846 -1037 7671 -5519 -2838 7930
2171 7930 -3906 -4459 7674 -2128 -5743 6993 -341 -6628 5973 1424 -7133 4673 3092 -7298
2185 -7298 3176 4522 -7043 1500 5705 -6411 -196 6581 -5463 -1933 7134 -4188 -3576 7278
2199 7278 -2665 -5045 7007 -901 -6276 6265 936 -7133 5185 2765 -7564 3683 4404 -7499
2213 -7499 1997 5836 -6946 135 6789 -5953 -1690 7333 -4602 -3365 7422 -2995 -4773 7023
2227 7023 -1230 -5891 6208 509 -6568 5076 2159 -6879 3712 3659 -6776 2186 4899 -6350
2241 -6350 552 5897 -5571 -1120 6550 -4466 -2713 6851 -3120 -4215 6795 -1627 -5519 6365
2255 6365 68 -6485 5509 1801 -7119 4291 3469 -7334 2782 4979 -7122 1106 6183 -6447
2269 -6447 -682 6983 -5345 -2400 7386 -3939 -3935 7277 -2298 -5227 6751 -625 -6178 5860
2283 5860 1096 -6698 4647 2638 -6848 3228 4018 -6624 1656 5154 -6049 42 5970 -5178
2297 -5178 -1545 6467 -4069 -3026 6644 -2717 -4349 6450 -1191 -5478 5908 413 -6318 4991
2311 4991 2029 -6791 3827 3536 -6876 2356 4905 -6518 676 5937 -5782 -1019 6640 -4688
2325 -4688 -2612 6869 -3254 -4041 6663 -1694 -5197 6057 -46 -5958 5123 1524 -6343 3890
2339 3890 2955 -6358 2506 4135 -6002 1000 5057 -5305 -513 5668 -4327 -1949 5968 -3158 -3307
2354 -3307 5951 -1824 -4417 5630 -386 -5360 4993 1094 -5981 4054 2566 -6271 2815 3912
2368 3912 -6209 1458 5048 -5743 -133 5863 -4951 -1673 6404 -3791 -3120 6494 -2425 -4415
2382 -4415 6134 -944 -5356 5459 663 -5990 4429 2123 -6203 3186 3422 -6064 1779 4483
2396 4483 -5553 339 5232 -4782 -1097 5697 -3764 -2445 5854 -2554 -3650 5694 -1230 -4647
2410 -4647 5234 173 -5412 4503 1578 -5872 3543 2857 -6044 2304 4085 -5864 911 5067 -5338
2425 -5338 -518 5772 -4462 -1959 6141 -3292 -3276 6092 -1951 -4404 5711 -524 -5213 4985 961
2440 961 -5736 3911 2305 -5829 2693 3490 -5615 1355 4410 -5034 -27 5023 -4227 -1352 5334
2455 5334 -3179 -2571 5343 -2043 -3593 5076 -798 -4390 4493 482 -4944 3742 1762 -5271 2759
2470 2759 2920 -5278 1594 3949 -4995 344 4771 -4434 -980 5312 -3579 -2246 5539 -2528 -3401
2485 -3401 5395 -1193 -4318 4940 120 -4970 4154 1438 -5321 3104 2645 -5319 1916 3654 -4948
2500 -4948 633 4391 -4320 -684 4844 -3455 -1892 4990 -2385 -2942 4856 -1244 -3779 4472 -51
2515 -51 -4452 3851 1151 -4844 3028 2280 -5015 2024 3257 -4878 899 4130 -4459 -300 4787 -3853
2531 -3853 -1465 5155 -2970 -2616 5254 -1871 -3630 5005 -675 -4425 4470 591 -4949 3657 1771
2546 1771 -5159 2601 2874 -5054 1423 3743 -4604 197 4387 -3928 -1000 4734 -3040 -2098 4752
2561 4752 -1990 -3024 4554 -891 -3756 4096 223 -4266 3436 1296 -4540 2595 2325 -4552 1627
2576 1627 3184 -4347 583 3873 -3891 -527 4391 -3232 -1619 4632 -2379 -2608 4661 -1351 -3473
2591 -3473 4322 -252 -4142 3751 896 -4532 2989 1934 -4630 2005 2878 -4461 915 3591 -3971
2606 -3971 -224 4089 -3222 -1318 4274 -2320 -2251 4223 -1237 -3037 3897 -248 -3610 3356 789
2621 789 -4000 2619 1750 -4111 1785 2576 -4001 872 3313 -3685 -126 3855 -3174 -1119 4174 -2484
2637 -2484 -2024 4285 -1597 -2941 4161 -665 -3632 3798 397 -4101 3150 1420 -4352 2328 2361 -4348
2653 -4348 1329 3189 -4025 328 3761 -3507 -724 4095 -2724 -1716 4183 -1816 -2582 3986 -786
2668 -786 -3267 3577 195 -3719 3016 1126 -3932 2248 2008 -3949 1399 2753 -3776 455 3349
2683 3349 -3380 -442 3759 -2800 -1356 3995 -2052 -2184 3995 -1248 -2909 3805 -315 -3475 3366
2698 3366 665 -3864 2723 1561 -4064 1926 2399 -3933 998 3096 -3604 30 3565 -3052 -964
2713 -964 3834 -2280 -1830 3791 -1396 -2581 3580 -466 -3125 3099 491 -3442 2422 1335 -3602
2728 -3602 1674 2119 -3473 853 2752 -3187 -9 3193 -2725 -834 3491 -2125 -1653 3610 -1409
2743 -1409 -2358 3491 -592 -2973 3202 244 -3411 2723 1088 -3679 2046 1904 -3679 1274 2591
2758 2591 -3495 345 3187 -3097 -538 3530 -2455 -1460 3660 -1689 -2248 3572 -777 -2832 3210
2773 3210 121 -3289 2674 1004 -3464 1973 1811 -3492 1204 2490 -3283 347 2993 -2887 -478
2788 -478 3333 -2373 -1318 3537 -1716 -2036 3536 -957 -2663 3273 -176 -3157 2897 623 -3515
2803 -3515 2368 1444 -3618 1687 2171 -3575 910 2809 -3298 30 3275 -2825 -834 3552 -2164
2818 -2164 -1662 3619 -1386 -2364 3416 -526 -2919 3009 350 -3295 2443 1175 -3391 1707 1917 -3294
2834 -3294 893 2522 -3034 93 2960 -2618 -729 3218 -2049 -1480 3284 -1351 -2130 3153 -592
2849 -592 -2682 2914 179 -3058 2483 930 -3303 1925 1650 -3348 1252 2305 -3221 490 2829
2864 2829 -2890 -340 3166 -2377 -1157 3344 -1661 -1886 3336 -903 -2513 3031 -100 -2966 2571
2879 2571 765 -3209 1945 1515 -3256 1218 2233 -3114 348 2741 -2741 -415 3043 -2248 -1160
2894 -1160 3231 -1583 -1864 3204 -890 -2441 3013 -146 -2899 2642 635 -3218 2142 1363 -3331
2909 -3331 1511 2055 -3284 802 2607 -3087 23 3043 -2680 -768 3348 -2149 -1547 3409 -1428
2924 -1428 -2236 3312 -611 -2809 2978 248 -3195 2450 1065 -3349 1788 1837 -3319 1009 2441 -3122
2940 -3122 203 2915 -2674 -613 3201 -2110 -1387 3273 -1410 -2006 3189 -696 -2579 2924 88
2955 88 -2949 2491 791 -3239 1960 1545 -3298 1309 2151 -3213 586 2681 -2945 -210 3070 -2499
2971 -2499 -963 3273 -1913 -1679 3290 -1170 -2295 3115 -387 -2800 2768 456 -3116 2218 1249
2986 1249 -3268 1493 1985 -3158 719 2545 -2877 -105 2911 -2415 -896 3151 -1787 -1617 3182
3001 3182 -1113 -2238 3001 -370 -2734 2679 405 -3082 2212 1154 -3232 1594 1823 -3215 920
3016 920 2431 -3044 180 2900 -2686 -601 3177 -2154 -1327 3328 -1531 -2048 3284 -771 -2622 3039
3032 3039 4 -3041 2635 835 -3312 2002 1612 -3351 1283 2264 -3256 427 2793 -2870 -385
3047 -385 3169 -2352 -1202 3339 -1679 -1893 3288 -933 -2499 3094 -148 -2987 2689 665 -3228
3062 -3228 2171 1381 -3375 1529 2055 -3295 804 2617 -3025 27 3029 -2660 -737 3298 -2113
3077 -2113 -1463 3431 -1448 -2155 3334 -718 -2717 3021 119 -3106 2563 913 -3340 1950 1661 -3370
3093 -3370 1208 2319 -3176 381 2828 -2782 -455 3169 -2249 -1228 3308 -1580 -1914 3204 -788
3108 -788 -2526 2972 8 -2944 2539 795 -3191 1982 1529 -3290 1325 2166 -3165 575 2661 -2899
3124 -2899 -152 3045 -2441 -958 3286 -1859 -1661 3323 -1191 -2286 3159 -429 -2836 2829 374
3139 374 -3178 2334 1166 -3321 1669 1901 -3328 924 2524 -3076 102 2978 -2628 -729 3238
3154 3238 -2053 -1498 3326 -1334 -2181 3213 -547 -2717 2920 218 -3118 2426 1018 -3318 1835
3169 1835 1726 -3337 1127 2390 -3206 331 2844 -2879 -419 3225 -2393 -1200 3427 -1762 -1880
3184 -1880 3421 -1086 -2515 3202 -282 -2985 2845 534 -3295 2324 1311 -3471 1663 2042 -3397
3199 -3397 855 2670 -3135 49 3094 -2670 -803 3326 -2082 -1567 3384 -1342 -2235 3236 -546
3214 -546 -2778 2915 263 -3161 2424 1044 -3334 1790 1776 -3340 1051 2366 -3133 330 2861 -2809
3230 -2809 -476 3219 -2320 -1215 3354 -1691 -1893 3310 -988 -2475 3123 -184 -2943 2735 595
3245 595 -3214 2176 1380 -3359 1495 2047 -3260 722 2631 -2994 -96 3022 -2527 -916 3250 -1917
3261 -1917 -1658 3284 -1194 -2301 3089 -388 -2820 2749 421 -3111 2256 1184 -3279 1596 1911
3276 1911 -3223 872 2448 -2992 142 2915 -2618 -645 3206 -2124 -1377 3334 -1503 -2067 3221
3291 3221 -782 -2617 3006 -5 -3044 2578 792 -3307 2014 1498 -3389 1345 2172 -3235 578
3306 578 2729 -2943 -248 3140 -2459 -1007 3310 -1829 -1776 3315 -1095 -2389 3138 -295 -2880 2742
3322 2742 476 -3167 2229 1249 -3305 1559 1952 -3264 845 2469 -3012 90 2880 -2632 -673
3337 -673 3180 -2096 -1410 3267 -1478 -2066 3193 -754 -2576 2956 24 -3022 2538 791 -3234 1990
3353 1990 1491 -3320 1322 2128 -3201 572 2644 -2850 -194 2993 -2381 -961 3207 -1737 -1648 3194
3369 3194 -1057 -2280 2984 -274 -2749 2621 484 -3039 2058 1243 -3126 1437 1853 -3046 750
3384 750 2395 -2835 -11 2803 -2442 -698 3025 -1896 -1405 3122 -1269 -2012 3007 -597 -2503 2756
3400 2756 165 -2898 2308 859 -3061 1787 1536 -3099 1135 2174 -2989 421 2647 -2662 -347
3415 -347 2929 -2182 -1082 3099 -1610 -1762 3079 -903 -2327 2847 -146 -2732 2498 593 -2992
3430 -2992 1955 1295 -3070 1322 1923 -2979 639 2426 -2723 -86 2780 -2304 -774 2980 -1764
3445 -1764 -1453 3060 -1189 -2037 2944 -518 -2516 2700 206 -2854 2293 893 -3053 1737 1539 -3077
3461 -3077 1090 2100 -2947 381 2590 -2601 -339 2875 -2164 -1039 2990 -1576 -1671 2962 -861
3476 -861 -2212 2784 -192 -2599 2408 547 -2836 1896 1211 -2918 1270 1800 -2811 628 2288 -2578
3492 -2578 -45 2619 -2192 -764 2839 -1694 -1364 2869 -1106 -1937 2735 -471 -2335 2469 150
3507 150 -2643 2073 842 -2797 1583 1425 -2818 984 1970 -2673 322 2385 -2387 -339 2705 -1925
3523 -1925 -1015 2767 -1371 -1585 2759 -760 -2108 2521 -61 -2424 2189 580 -2633 1673 1186 -2723
3539 -2723 1121 1742 -2597 495 2154 -2353 -144 2465 -1989 -792 2616 -1510 -1365 2635 -937
3554 -937 -1848 2526 -351 -2281 2269 278 -2540 1931 892 -2670 1415 1451 -2659 858 1940 -2525
3570 -2525 254 2333 -2232 -383 2560 -1846 -1001 2685 -1294 -1539 2605 -709 -2027 2420 -58
3585 -58 -2353 2062 576 -2552 1606 1111 -2587 1056 1638 -2475 492 2038 -2243 -119 2332 -1871
3601 -1871 -702 2475 -1419 -1233 2488 -879 -1719 2374 -314 -2036 2143 231 -2307 1789 804 -2458
3617 -2458 1356 1302 -2470 842 1718 -2339 288 2086 -2088 -320 2304 -1683 -887 2421 -1233 -1386
3633 -1386 2367 -648 -1793 2201 -126 -2117 1866 480 -2287 1452 1008 -2296 986 1464 -2198
3648 -2198 446 1819 -2002 -128 2061 -1664 -653 2173 -1239 -1135 2208 -763 -1558 2099 -259
3663 -259 -1880 1837 240 -2081 1513 792 -2197 1105 1220 -2192 666 1594 -2083 155 1908 -1848
3679 -1848 -351 2104 -1445 -869 2207 -1009 -1334 2146 -512 -1670 1952 -4 -1953 1683 512
3694 512 -2078 1272 995 -2077 800 1375 -2035 320 1721 -1780 -148 1934 -1466 -644 2004 -1085
3710 -1085 -1060 1999 -659 -1447 1905 -229 -1731 1705 254 -1922 1399 706 -2022 1032 1115 -2014
3726 -2014 622 1501 -1896 154 1762 -1686 -283 1945 -1381 -737 2017 -975 -1154 1953 -544 -1525
3742 -1525 1835 -76 -1716 1558 392 -1849 1210 809 -1904 790 1200 -1795 312 1468 -1597
3757 -1597 -83 1660 -1333 -526 1788 -1020 -907 1759 -612 -1232 1707 -199 -1478 1511 197 -1639
3773 -1639 1232 586 -1696 916 916 -1708 544 1236 -1622 163 1519 -1444 -270 1644 -1146 -641
3789 -641 1707 -813 -1018 1645 -441 -1279 1546 -46 -1508 1252 388 -1621 1010 724 -1636 633
3805 633 1041 -1517 277 1297 -1337 -131 1458 -1092 -497 1534 -795 -829 1496 -473 -1103 1396
3821 1396 -116 -1302 1219 238 -1457 1020 565 -1503 758 905 -1508 407 1126 -1433 59 1326
3837 1326 -1230 -291 1480 -1003 -615 1534 -721 -924 1496 -378 -1188 1352 -11 -1353 1166 364
3853 364 -1400 886 676 -1433 578 917 -1365 235 1146 -1187 -114 1277 -974 -428 1349 -724
3869 -724 -720 1302 -443 -957 1207 -94 -1121 1059 180 -1241 900 445 -1301 643 722 -1274 359
3886 359 924 -1207 103 1079 -1079 -190 1187 -877 -459 1258 -617 -717 1224 -344 -936 1143 -63
3903 -63 -1086 952 229 -1152 735 516 -1163 487 709 -1104 172 901 -946 -92 1023 -822 -353
3920 -353 1024 -577 -566 1020 -326 -748 935 -75 -882 828 170 -983 643 394 -1025 457 606
3937 606 -1007 264 772 -904 26 899 -787 -206 1006 -610 -432 1018 -433 -625 972 -240 -808
3954 -808 875 21 -927 747 241 -981 563 446 -967 352 682 -929 113 778 -812 -126 840
3971 840 -619 -358 860 -444 -538 842 -225 -657 806 -27 -781 684 200 -835 536 381 -820
3988 -820 376 524 -812 206 627 -795 0 725 -663 -172 808 -543 -338 817 -376 -511 817
4005 817 -214 -608 747 -23 -708 619 180 -770 494 329 -762 310 481 -733 162 570 -623
4022 -623 -35 644 -488 -221 661 -353 -356 644 -181 -473 589 -46 -557 496 111 -580 377 260 -592
4041 -592 236 333 -577 133 419 -486 -4 484 -461 -117 571 -360 -252 551 -269 -346 536 -102 -429 477 14
4062 14 -505 425 115 -545 304 266 -510 185 381 -477 54 429 -379 -83 486 -277 -213 468 -193 -314 427
4083 427 -59 -390 354 55 -422 280 181 -436 219 253 -440 105 319 -401 4 378 -370 -98 425 -290 -141
4104 -141 435 -217 -218 439 -161 -301 406 -59 -364 369 20 -411 324 136 -418 212 211 -409 117 278 -367
4125 -367 8 328 -300 -66 332 -244 -142 322 -115 -235 287 -71 -273 277 4 -269 191 68 -286 149
4145 149 154 -243 111 178 -250 39 219 -208 -8 218 -198 -64 234 -156 -102 235 -112 -162 220 -46 -186 205
4167 205 -5 -224 180 33 -226 157 89 -211 90 117 -171 23 149 -126 -21 161 -112 -76 140 -59 -112
4188 -112 90 0 -127 94 69 -91 39 85 -95 -41 131 -76 -40 94 -59 -81 98 -54 -86 100 -39 -114 96
4211 96 2 -109 73 21 -126 87 71 -97 57 45 -104 34 38 -91 7 97 -94 -25 99 -67 -8 71 -39 -51
4235 -51 83 1 -72 44 46 -96 28 74 -74 -25 112 -93 -46 69 -52 -69 115 -22 -78 48 16 -93 45 37
4259 37 -71 36 48 -61 4 56 -51 -16 31 -8 -18 26 5 -7 -17 -9 -1 -18 28 8 -6 19 9 -6 30 -4 -50 54 -2
4288 -2 -72 34 -28 -100 49 35 -134 26 33 -116 56 70 -159 -10 107 -148 -48 138 -122 -54 189 -57 -104 152
4312 152 -30 -113 180 -7 -121 139 24 -165 112 74 -165 65 120 -125 -12 129 -136 -46 150 -119 -54 166
4334 166 -97 -139 135 -106 -137 149 -32 -160 166 35 -202 153 62 -205 120 94 -253 100 121 -237 22 168
4356 168 -194 37 239 -186 -45 248 -176 -119 247 -109 -158 193 -42 -205 209 22 -203 137 80 -215 84
4377 84 119 -211 31 158 -167 -57 201 -145 -116 184 -112 -125 198 -42 -170 212 7 -194 161 68 -208 154
4399 154 146 -222 89 163 -243 42 241 -219 -19 271 -191 -74 288 -178 -149 295 -131 -250 250 -60 -281
4420 -281 255 16 -290 211 110 -345 134 212 -285 52 243 -268 1 291 -186 -87 303 -137 -179 323 -65
4441 -65 -220 289 -19 -287 277 44 -326 257 158 -335 200 172 -332 106 225 -369 68 273 -321 -26 341
4462 341 -298 -103 387 -252 -193 363 -155 -282 359 -77 -294 343 44 -358 277 114 -381 197 210 -365 126
4483 126 289 -327 24 337 -290 -65 367 -204 -168 345 -127 -244 318 -57 -291 320 45 -341 237 122
4503 122 -390 153 196 -381 124 262 -360 87 267 -320 -36 346 -283 -93 379 -197 -189 389 -144 -263 374
4524 374 -33 -325 338 72 -386 252 162 -400 179 262 -374 75 312 -374 -55 373 -261 -133 375 -222 -232
4545 -232 349 -94 -285 338 18 -337 301 65 -386 234 201 -398 158 269 -418 93 324 -382 -18 399
4565 399 -307 -79 418 -264 -182 453 -197 -291 452 -132 -333 422 -22 -409 358 87 -463 267 204 -468 185
4586 185 283 -434 92 346 -392 -24 427 -330 -166 470 -229 -229 440 -131 -334 426 -19 -368 371 71 -423
4607 -423 297 179 -466 180 288 -459 125 307 -442 60 371 -364 -58 416 -328 -180 455 -261 -263 437 -166
4628 -166 -316 420 -41 -381 352 76 -434 298 155 -446 214 266 -458 82 318 -410 1 386 -308 -112
4648 -112 413 -246 -203 410 -116 -337 377 -17 -380 308 70 -417 274 188 -411 198 251 -415 61 362 -387
4669 -387 -40 375 -336 -160 423 -282 -193 437 -207 -303 427 -92 -358 383 3 -427 347 119 -424 304 219
4690 219 -473 169 313 -440 55 376 -373 -45 439 -318 -154 468 -205 -251 446 -148 -380 421 2 -444
4710 -444 353 105 -481 309 203 -474 208 290 -449 114 379 -436 9 407 -376 -109 459 -289 -213 474 -239
4731 -239 -296 470 -120 -359 420 12 -438 384 94 -445 334 214 -471 200 271 -465 76 351 -407 -32 447
4752 447 -366 -131 469 -268 -226 429 -161 -330 424 -52 -364 393 50 -440 294 163 -448 199 273 -425 81
4773 81 318 -369 3 359 -371 -103 429 -252 -186 426 -199 -273 406 -84 -341 401 0 -388 367 104 -416
4794 -416 263 201 -444 172 297 -415 74 353 -352 -46 406 -298 -134 442 -206 -211 432 -115 -311 416 13
4815 13 -409 346 104 -445 265 200 -458 167 311 -432 81 375 -435 -46 416 -328 -124 429 -242 -259 417
4836 417 -210 -306 433 -85 -399 430 1 -442 356 117 -476 295 190 -465 201 289 -448 87 406 -407 -17
4857 -17 448 -313 -107 463 -267 -229 455 -175 -316 455 -57 -408 363 71 -435 317 165 -455 202 244 -469
4878 -469 86 330 -396 0 406 -382 -102 412 -297 -146 456 -185 -250 417 -107 -315 403 -7 -367 348
4898 348 104 -420 305 164 -441 263 226 -388 90 330 -382 11 367 -311 -117 398 -260 -191 385 -143 -300
4919 -300 360 -22 -323 343 42 -378 266 151 -424 211 241 -425 73 344 -349 -1 376 -298 -71 404
4939 404 -247 -187 425 -141 -244 404 -80 -307 370 16 -380 320 105 -418 272 178 -442 183 277 -405 77
4960 77 337 -385 -28 373 -336 -102 427 -249 -226 421 -147 -314 443 -4 -365 375 64 -418 275 174 -407
4981 -407 194 262 -413 126 330 -363 15 349 -347 -107 440 -279 -158 402 -186 -253 413 -109 -337 379 -32
5002 -32 -373 347 43 -441 287 175 -418 221 241 -398 129 305 -388 36 355 -303 -69 397 -249 -144 387
5023 387 -185 -237 361 -98 -312 357 30 -342 301 118 -407 249 201 -424 137 268 -373 61 285 -340 -28
5044 -28 355 -311 -119 379 -184 -189 378 -125 -280 343 -18 -354 316 43 -354 260 143 -357 186 230 -362
5065 -362 128 276 -348 27 355 -319 -50 360 -243 -157 388 -149 -250 355 -45 -329 337 -11 -360 284
5085 284 117 -367 223 231 -394 143 299 -385 31 330 -345 -32 367 -266 -123 415 -189 -207 425 -116 -312
5106 -312 371 -34 -354 372 41 -346 270 132 -405 243 225 -431 135 284 -393 20 340 -350 -33 400
5126 400 -283 -157 418 -201 -255 395 -132 -279 397 -51 -341 341 73 -392 280 145 -397 180 248 -404 79
5147 79 332 -380 14 355 -305 -75 397 -255 -166 408 -169 -240 371 -112 -306 368 -18 -358 288 83 -379
5168 -379 224 184 -381 167 211 -400 87 268 -347 -16 358 -298 -98 359 -245 -176 402 -137 -268 378 -43
5189 -43 -326 338 38 -361 267 119 -382 169 188 -370 113 301 -374 -17 357 -299 -96 409 -259 -195 382
5210 382 -175 -257 361 -101 -288 337 -6 -361 291 114 -369 249 166 -367 146 260 -381 98 315 -359 -2
5231 -2 344 -302 -105 403 -244 -192 425 -148 -272 377 -68 -331 351 37 -372 281 141 -396 224 251 -419
5252 -419 120 292 -415 51 344 -359 -70 397 -297 -141 449 -235 -229 419 -153 -307 412 -61 -363 350 34
5273 34 -385 326 170 -422 231 206 -417 140 252 -367 50 317 -340 -22 383 -279 -153 391 -241 -206 411
5294 411 -130 -302 365 -29 -350 345 61 -416 268 136 -418 190 260 -393 115 332 -361 7 364 -320
5314 -320 -74 392 -249 -203 360 -175 -240 396 -77 -288 349 18 -385 287 97 -392 230 176 -391 118 248
5335 248 -404 50 335 -363 -12 389 -281 -108 380 -228 -243 410 -111 -303 421 -30 -359 375 53 -395
5355 -395 254 163 -392 168 256 -391 97 303 -370 15 385 -333 -114 432 -274 -215 429 -184 -282 420 -103
5376 -103 -363 395 -15 -398 319 90 -425 280 190 -456 200 295 -442 123 346 -401 47 409 -348 -89 451
5397 451 -273 -193 433 -198 -243 456 -79 -345 399 27 -390 334 110 -414 244 227 -489 168 289 -432 72
5418 72 377 -419 -11 425 -339 -135 439 -275 -206 488 -157 -286 437 -70 -381 396 38 -390 342 123 -415
5439 -415 264 213 -445 173 301 -425 63 367 -379 -40 408 -338 -137 423 -228 -239 437 -154 -340 415 -52
5460 -52 -381 359 52 -403 291 182 -456 236 278 -423 91 365 -388 30 406 -344 -88 445 -282 -218 461
5481 461 -177 -276 448 -103 -324 404 2 -437 351 119 -453 269 189 -465 207 299 -442 52 333 -410 -65
5502 -65 413 -357 -132 454 -284 -211 461 -172 -308 462 -54 -374 399 53 -435 373 162 -508 291 243 -451
5523 -451 159 345 -444 51 441 -399 -35 424 -375 -185 486 -262 -263 518 -164 -348 471 -83 -409 399 41
5544 41 -486 348 152 -503 258 251 -486 137 347 -464 65 418 -420 -27 463 -360 -131 495 -242 -292 507
5565 507 -169 -310 483 -51 -429 455 29 -469 315 189 -498 234 274 -499 149 377 -465 16 429 -404
5585 -404 -82 471 -357 -242 469 -254 -275 475 -154 -385 457 5 -428 399 84 -476 327 193 -484 210
5605 210 307 -510 114 399 -446 -2 453 -396 -119 482 -296 -233 511 -180 -358 471 -97 -410 441 22 -483
5626 -483 397 164 -498 274 250 -501 200 366 -507 78 429 -447 -72 475 -358 -154 533 -285 -296 557 -173
5647 -173 -372 501 -59 -445 470 67 -502 383 188 -552 288 283 -528 136 358 -509 76 476 -465 -55 535
5668 535 -371 -198 530 -273 -351 554 -166 -417 535 -41 -448 456 115 -522 374 228 -551 276 316 -538 158
5689 158 433 -538 24 489 -449 -94 548 -395 -216 577 -270 -329 563 -161 -415 517 -44 -501 459 115
5709 115 -575 354 200 -537 271 326 -582 181 406 -538 14 471 -445 -129 552 -343 -230 573 -231 -353
5729 -353 592 -105 -411 525 -9 -504 448 129 -569 355 262 -580 228 361 -553 87 439 -555 -29 548
5749 548 -427 -198 577 -324 -296 572 -217 -380 555 -79 -497 491 75 -565 404 203 -560 350 320 -572 214
5770 214 412 -557 63 509 -494 -68 602 -411 -196 600 -318 -324 633 -187 -445 559 -35 -541 514
5789 514 74 -601 429 252 -649 296 357 -637 208 469 -578 61 568 -549 -111 619 -420 -253 665
5808 665 -312 -376 640 -152 -492 587 -11 -569 511 116 -621 433 245 -668 284 416 -625 126 504
5827 504 -601 4 598 -522 -133 604 -416 -309 677 -294 -432 657 -159 -540 585 -1 -613 536
5845 536 171 -642 400 314 -667 299 468 -656 140 576 -585 -11 628 -492 -166 665 -409 -326 706
5864 706 -242 -471 654 -101 -570 580 55 -640 494 231 -700 362 352 -673 217 464 -629 92
5882 92 574 -578 -82 617 -487 -214 718 -347 -383 695 -204 -506 657 -40 -594 558 133 -670 426
5901 426 296 -730 329 434 -720 174 562 -684 -9 628 -567 -209 699 -458 -345 699 -349
5918 -349 -463 685 -169 -607 660 28 -672 572 183 -722 450 364 -721 295 512 -729 145 622
5936 622 -667 -53 718 -544 -199 730 -439 -390 789 -288 -528 721 -111 -638 678 59 -737 532
5954 532 228 -782 408 401 -812 238 545 -759 98 690 -685 -61 719 -536 -262 796 -406 -413
5972 -413 808 -250 -570 742 -47 -673 660 94 -751 555 309 -798 368 458 -781 220 600
5989 600 -749 6 678 -660 -183 785 -520 -331 789 -342 -496 799 -171 -651 756 -7 -698 620
6007 620 225 -777 478 395 -810 354 545 -777 190 682 -749 -6 753 -652 -208 839 -461
6024 -461 -388 837 -320 -572 791 -114 -713 687 39 -762 535 273 -839 458 436 -849 280 581
6042 581 -783 48 710 -693 -145 815 -551 -320 834 -412 -467 846 -191 -662 789 -49 -761 719
6060 719 159 -847 563 368 -872 398 548 -862 214 684 -801 -16 787 -706 -217 879 -569
6077 -569 -406 899 -368 -580 855 -181 -716 814 14 -807 680 292 -906 489 444 -896 360
6094 360 651 -868 155 724 -781 -46 861 -619 -257 867 -498 -474 907 -304 -652 823 -115
6111 -115 -780 773 99 -879 649 283 -919 460 502 -925 256 670 -860 47 784 -787 -173 897
6129 897 -639 -356 941 -432 -564 935 -225 -716 875 -60 -824 745 218 -883 612 456 -947
6146 -947 399 590 -913 210 722 -823 -37 849 -699 -259 914 -560 -462 939 -388 -632 910
6163 910 -141 -798 811 63 -903 695 318 -966 508 495 -962 329 682 -925 101 852 -808
6180 -808 -108 951 -656 -341 988 -507 -524 948 -284 -718 898 -69 -852 789 196 -955 626
6197 626 387 -982 448 576 -971 200 763 -874 -7 875 -776 -221 956 -601 -463 955 -409
6214 -409 -640 964 -198 -823 868 66 -914 734 271 -1001 597 492 -1016 377 678 -959 173
6231 173 846 -863 -59 949 -737 -292 1005 -551 -546 1017 -336 -727 993 -154 -882 843 110
6248 110 -984 669 373 -1019 516 560 -1010 289 720 -972 30 885 -815 -206 988 -683 -435
6265 -435 991 -473 -606 1023 -239 -772 934 19 -902 743 254 -970 636 460 -1019 430 644
6282 644 -1005 175 804 -935 -36 945 -774 -273 1013 -616 -490 1021 -397 -702 959 -153 -870
6299 -870 870 101 -971 734 368 -1053 508 577 -1002 299 748 -975 87 909 -860 -169 1003
6316 1003 -693 -408 1005 -522 -622 997 -283 -766 948 -42 -927 811 200 -1011 661 420 -1051
6333 -1051 454 662 -1019 223 828 -950 -8 950 -805 -252 1061 -640 -481 1059 -433 -690 1033
6350 1033 -176 -827 917 64 -991 788 356 -1009 592 531 -1052 331 750 -1003 110 915 -905
6367 -905 -133 989 -734 -347 1030 -540 -594 1030 -318 -768 969 -71 -901 875 177 -1029 718
6384 718 417 -1071 498 613 -1043 280 789 -990 45 959 -830 -202 1051 -664 -455 1061 -474
6401 -474 -643 1047 -232 -792 924 16 -948 799 262 -1069 619 479 -1024 392 700 -1017 145
6418 145 864 -893 -102 963 -744 -367 1031 -559 -540 1046 -320 -746 981 -95 -854 875 162
6435 162 -987 724 378 -1025 521 588 -1044 282 778 -976 46 932 -863 -189 1003 -713 -439
6452 -439 1049 -497 -647 1035 -268 -847 949 6 -944 817 240 -996 645 484 -1041 418 676
6469 676 -989 183 844 -905 -66 948 -764 -293 1057 -578 -527 1054 -354 -735 1002 -122 -861
6486 -861 894 80 -998 725 372 -1024 545 584 -1066 296 751 -995 108 922 -846 -171 1007
6503 1007 -725 -389 1047 -511 -595 1056 -294 -793 973 -16 -943 821 206 -1022 690 430 -1040
6520 -1040 460 643 -990 205 827 -903 -52 919 -777 -253 1012 -603 -476 999 -378 -679 965
6537 965 -169 -842 909 66 -938 751 275 -1020 546 509 -1015 367 715 -980 136 866 -879
6554 -879 -91 980 -733 -331 1025 -523 -570 1044 -297 -760 964 -64 -872 837 156 -979 671
6571 671 398 -1021 471 589 -990 255 753 -908 6 883 -798 -224 960 -589 -435 991 -394
6588 -394 -639 987 -187 -799 883 46 -936 741 257 -995 572 530 -1003 381 687 -978 128
6605 128 829 -895 -91 946 -689 -316 999 -564 -527 996 -337 -741 930 -105 -850 825 135
6622 135 -967 680 378 -986 491 562 -969 243 761 -923 54 900 -793 -184 942 -627 -419
6639 -419 998 -424 -616 969 -213 -768 893 -3 -894 761 252 -972 586 451 -953 382 622
6656 622 -957 137 779 -863 -55 901 -757 -268 959 -573 -449 963 -367 -653 931 -152 -813
6673 -813 833 91 -928 682 279 -963 524 523 -930 312 701 -887 75 824 -806 -158 919
6690 919 -620 -348 953 -453 -561 930 -229 -713 817 -1 -878 694 177 -929 550 412 -940
6707 -940 385 585 -906 187 710 -855 -9 853 -725 -210 907 -534 -436 976 -362 -619 924
6724 924 -159 -778 816 68 -870 696 280 -917 484 491 -907 319 643 -896 82 783 -765 -147
6742 -147 873 -591 -363 892 -457 -519 885 -249 -680 836 -52 -802 715 195 -855 583 364
6759 364 -900 409 568 -856 240 715 -802 17 825 -713 -199 899 -559 -379 907 -384 -581
6776 -581 898 -154 -736 777 36 -836 689 235 -899 560 427 -920 332 591 -847 116 729
6793 729 -783 -100 834 -608 -321 873 -466 -473 867 -260 -643 827 -65 -759 744 161 -827 572
6811 572 343 -864 421 487 -844 237 654 -843 13 758 -721 -177 851 -558 -381 851 -393
6828 -393 -546 848 -194 -663 759 -11 -789 666 209 -860 510 390 -860 325 551 -832 126
6845 126 699 -723 -81 774 -608 -248 860 -434 -453 823 -262 -617 792 -64 -722 668 149 -824
6863 -824 530 286 -824 405 455 -825 187 654 -755 19 741 -661 -154 815 -556 -347 811
6880 811 -379 -513 829 -193 -631 757 17 -748 653 229 -787 508 373 -833 343 551 -782
6897 -782 138 693 -724 -46 783 -619 -268 819 -454 -437 815 -271 -576 770 -93 -676 657 100
6915 100 -783 568 293 -788 395 447 -778 251 606 -724 65 690 -635 -144 773 -538 -300 843
6933 843 -377 -469 815 -188 -590 721 -39 -721 641 173 -778 497 340 -819 337 503 -753
6950 -753 159 620 -711 -25 686 -592 -215 777 -471 -414 797 -282 -511 734 -89 -644 649 78
6968 78 -721 561 297 -744 398 426 -752 243 565 -715 48 661 -614 -111 730 -517 -288 780
6986 780 -356 -458 743 -231 -572 681 -34 -679 606 147 -740 504 325 -766 345 456 -728
7003 -728 125 616 -647 -17 700 -566 -194 757 -418 -359 724 -255 -507 710 -86 -633 641 103
7021 103 -696 517 275 -749 398 406 -721 222 498 -717 48 641 -613 -105 705 -476 -292 763
7039 763 -351 -410 725 -210 -552 686 -17 -660 602 133 -712 516 305 -728 339 462 -718 173
7057 173 590 -662 8 652 -577 -212 707 -437 -332 738 -299 -504 678 -108 -593 638 54 -705
7075 -705 519 228 -690 408 383 -686 193 511 -692 70 604 -587 -102 673 -479 -224 680 -353
7093 -353 -395 716 -216 -496 685 -56 -589 579 139 -698 478 286 -730 337 438 -682 157 585
7111 585 -636 -30 611 -548 -154 674 -419 -359 698 -269 -491 643 -115 -590 593 82 -640 499
7129 499 221 -728 361 377 -663 231 510 -621 80 607 -576 -79 656 -468 -256 690 -369 -370 687
7148 687 -203 -529 624 -43 -584 571 131 -693 431 267 -687 308 423 -711 167 539 -642 -23
7166 -23 624 -517 -170 681 -421 -263 667 -259 -480 673 -103 -547 610 76 -625 495 207 -673 383
7185 383 366 -684 196 509 -641 51 569 -585 -84 660 -458 -264 667 -344 -404 663 -211 -510 628
7204 628 -43 -601 548 97 -657 430 246 -700 312 406 -651 156 500 -598 16 609 -524 -150
7222 -150 660 -395 -309 655 -253 -439 612 -99 -523 581 54 -618 471 208 -692 350 362 -658 172
7241 172 455 -637 32 575 -555 -117 601 -422 -262 689 -318 -382 638 -187 -495 608 -36 -568
7259 -568 511 131 -625 423 284 -659 291 409 -643 143 532 -575 -3 596 -495 -181 630 -421
7277 -421 -305 616 -244 -441 606 -118 -518 565 66 -611 462 224 -668 324 386 -645 179 465 -637
7296 -637 48 591 -516 -116 622 -441 -258 678 -314 -398 653 -150 -490 584 -25 -571 504 110 -634
7315 -634 440 257 -652 302 403 -628 120 480 -618 -1 579 -485 -145 649 -412 -281 632 -264
7333 -264 -449 623 -106 -506 551 83 -614 445 213 -638 348 338 -630 203 475 -579 56 558 -519
7352 -519 -116 596 -443 -224 648 -324 -370 624 -179 -498 588 -37 -558 495 114 -608 405 248 -656
7371 -656 279 389 -623 124 484 -533 -45 565 -496 -178 620 -348 -323 631 -236 -423 584 -104 -510
7390 -510 528 84 -574 455 180 -647 301 374 -631 213 462 -594 5 553 -485 -137 594 -439
7408 -439 -253 615 -283 -392 580 -150 -491 578 -1 -560 502 119 -656 397 260 -628 257 422 -614
7427 -614 93 505 -563 -16 574 -480 -193 627 -338 -314 661 -235 -429 601 -60 -523 528 35 -614
7446 -614 431 232 -642 291 343 -617 154 490 -566 19 556 -523 -138 592 -368 -271 641 -274 -386 611
7466 611 -174 -495 574 1 -593 482 158 -633 380 251 -629 246 407 -616 109 517 -542 -46
7484 -46 563 -453 -182 596 -361 -312 613 -229 -439 575 -84 -538 509 74 -620 456 229 -611 304
7503 304 364 -613 155 468 -559 41 562 -490 -150 583 -386 -247 609 -269 -395 609 -120 -506 571
7522 571 -2 -595 463 153 -602 362 272 -635 210 392 -599 90 519 -527 -71 572 -461 -213 590
7541 590 -360 -333 590 -193 -452 589 -70 -534 545 103 -597 426 234 -620 295 390 -594 138 474 -565
7561 -565 -10 551 -488 -160 589 -399 -278 613 -277 -407 614 -127 -537 541 22 -574 464 177 -647
7580 -647 334 299 -620 235 413 -603 56 498 -498 -69 562 -436 -196 611 -345 -303 610 -174 -468 566
7600 566 -43 -553 497 112 -581 387 235 -632 292 389 -618 132 480 -591 -7 529 -472 -148 612
7619 612 -350 -314 608 -255 -404 576 -98 -520 503 45 -580 451 178 -570 354 321 -612 211 407 -612
7639 -612 92 524 -522 -60 576 -426 -219 575 -309 -322 604 -205 -444 551 -48 -543 485 86 -602
7658 -602 384 249 -628 275 376 -603 130 493 -546 -29 541 -503 -174 608 -365 -298 610 -251 -434 591
7678 591 -77 -518 527 59 -575 461 182 -614 317 308 -627 204 446 -555 79 508 -549 -122 568
7697 568 -436 -189 603 -319 -356 627 -188 -455 568 -7 -500 484 140 -583 400 266 -620 272 374 -611
7717 -611 110 499 -561 -33 576 -439 -183 617 -347 -302 640 -237 -443 609 -97 -557 509 36 -582
7736 -582 412 187 -609 315 312 -632 193 440 -574 49 507 -510 -119 565 -426 -212 600 -283 -357 599
7756 599 -147 -429 561 -11 -518 511 125 -607 399 258 -615 259 392 -624 110 482 -545 -10 560
7775 560 -470 -159 615 -339 -331 621 -210 -465 603 -108 -566 516 62 -573 433 222 -602 320 342 -586
7795 -586 187 472 -577 57 568 -492 -80 586 -392 -236 619 -306 -347 627 -157 -462 585 -10 -541
7814 -541 518 123 -605 401 252 -613 264 402 -608 115 511 -589 -3 594 -473 -203 624 -367
7832 -367 -327 620 -217 -426 602 -44 -537 525 81 -596 456 235 -630 326 360 -612 203 480 -595
7851 -595 67 540 -517 -97 608 -437 -239 619 -316 -381 595 -168 -457 554 -38 -553 520 126 -616
7870 -616 378 291 -634 271 394 -609 127 511 -554 -28 581 -478 -194 638 -341 -299 637 -226 -430 601
7890 601 -75 -519 557 88 -604 406 231 -626 330 354 -646 182 445 -609 40 537 -554 -103 586
7909 586 -405 -272 639 -305 -382 610 -150 -470 567 7 -580 506 143 -589 387 272 -600 281 413 -595
7929 -595 120 525 -559 -16 597 -468 -208 617 -335 -305 638 -223 -429 601 -72 -538 558 103 -638
7948 -638 451 233 -651 286 359 -667 154 518 -590 48 568 -526 -96 613 -424 -262 642 -281 -377
7967 -377 632 -154 -476 580 -18 -538 480 133 -605 391 263 -632 271 420 -617 100 502 -595
7985 -595 -24 616 -478 -194 637 -376 -338 649 -238 -459 613 -81 -568 547 76 -613 478 239 -661
8004 -661 329 358 -618 191 478 -599 66 549 -544 -106 631 -417 -273 672 -306 -370 638 -167 -459
8023 -459 583 13 -584 495 137 -637 390 270 -673 272 405 -621 145 506 -577 -36 595 -464
8041 -464 -191 615 -354 -350 622 -223 -429 640 -70 -547 563 71 -581 467 232 -664 348 366 -666
8060 -666 207 516 -614 45 584 -536 -97 648 -459 -258 663 -328 -396 638 -190 -473 594 -29 -555
8079 -555 481 127 -611 408 280 -651 289 399 -643 154 520 -567 -3 609 -502 -145 626 -375
8097 -375 -314 678 -247 -447 627 -84 -544 580 61 -631 471 209 -659 328 343 -668 202 459 -610
8116 -610 58 567 -574 -109 626 -442 -246 671 -313 -379 636 -177 -466 596 -31 -556 534 116 -630
8135 -630 420 275 -649 318 402 -628 170 525 -590 -7 603 -498 -189 627 -393 -302 644 -274 -432
8154 -432 639 -116 -540 574 43 -630 461 224 -670 339 335 -651 241 463 -617 90 602 -548 -49
8173 -49 626 -457 -244 652 -346 -354 627 -156 -464 614 -48 -567 507 108 -632 441 251 -641
8191f41
$$ Imaginary data points
##PAGE= N=2
##DATA TABLE= (X++(I..I)), XYDATA
0 0 0 0 0 0 0 0 0 0 0 0 0 0 0 0 8 -8 8 -8 8 -16 16 -21 24 -27 35 -43 50 -58 66 -76 91 -103 118 -134 152 -173
36 -173 197 -221 248 -278 311 -347 387 -431 478 -529 587 -649 715 -789 865 -953 1051 -1158
54 -1158 1272 -1399 1540 -1699 1877 -2079 2303 -2557 2848 -3176 3534 -3883 4078 -3526 -927
69 -927 47902 515772 -271418 -318251 563821 -182210 -393672 511487 -42145 -476471 455302
80 455302 77474 -513958 361086 201791 -532833 259420 302754 -514499 139956 390549
90 390549 -474712 21820 450126 -406710 -97717 487565 -322288 -205832 495497 -220689
100 -220689 -302418 478872 -111445 -379107 435727 2618 -435089 371115 113438 -465723
110 -465723 286859 216606 -470930 188875 305725 -449754 81902 376629 -404320 -27392
120 -27392 424915 -337021 -132916 448469 -252419 -228484 446202 -155628 -309007 418966
130 418966 -52522 -370166 369023 50785 -408967 299900 148378 -424076 216057 235154
140 235154 -415369 122654 306742 -384303 25057 359752 -333177 -71557 392146 -265195
150 -265195 -162160 402622 -184339 -242232 391298 -94904 -308026 359086 -1616 -356318
160 -356318 307690 90751 -384633 240029 177239 -391537 159762 253202 -376765 71267
170 71267 314414 -341141 -20326 357388 -286751 -109726 379808 -216971 -191759 380519
180 380519 -135879 -261770 359690 -48538 -315782 319043 39923 -350977 261258 124273
190 124273 -365745 190132 199843 -359858 110114 262674 -334383 25847 309810 -291191
200 -291191 -58071 339115 -233124 -137191 349576 -163442 -207597 340984 -85960 -265839
210 -265839 314095 -4825 -308964 270408 75713 -334784 212339 151425 -341931 142885
220 142885 218245 -330059 65995 272420 -299826 -14030 310811 -252909 -92537 331263
230 331263 -192107 -164928 332615 -121145 -226991 315063 -44354 -275141 279849 33529
240 33529 -306699 229512 107878 -320233 167298 174517 -315511 97089 229935 -293380
250 -293380 23064 271488 -255539 -50620 297266 -204523 -120148 306364 -143227 -182022
260 -182022 298668 -75078 -233101 274956 -3748 -271004 236544 67152 -293771 185521
270 185521 133802 -300295 124631 192728 -290216 57004 240774 -263998 -13562 275147
280 275147 -222944 -83004 293771 -169485 -147381 295511 -106738 -202830 280345 -38544
290 -38544 -246033 249382 30958 -274601 204678 97584 -287084 149119 157490 -283106
300 -283106 86177 207361 -263312 19676 244740 -229284 -46661 267851 -183265 -109179
310 -109179 275890 -127982 -164767 268817 -66584 -210689 247286 -2319 -244785 212720
320 212720 61463 -265261 166746 121506 -271216 112001 174637 -262304 51260 217961
330 217961 -238866 -12126 248978 -202210 -74588 265873 -154272 -132462 267597 -97968
340 -97968 -182372 254176 -36716 -221415 226493 25868 -247348 186376 85963 -258860
350 -258860 136421 140128 -255575 79836 185329 -238118 20018 219224 -207819 -39549
360 -39549 240313 -166803 -95715 247802 -117417 -145614 241731 -62623 -186855 222721
370 222721 -5165 -217353 191868 51850 -235886 150952 105622 -241431 102029 153382
380 153382 -233745 47786 192399 -213191 -8853 220583 -180783 -64906 236250 -138226
390 -138226 -117016 238376 -88089 -162094 226905 -33229 -197465 202402 22949 -221060
400 -221060 166556 77072 -231578 121684 125889 -228673 70682 166620 -212843 16670 197077
411 197077 -185310 -37046 215810 -148044 -87620 222269 -103350 -132436 216359 -53778
421 -53778 -169253 198804 -2062 -196408 170734 49206 -212632 133613 97448 -217270
431 -217270 89510 140132 -210075 40665 175078 -191415 -10324 200331 -162205 -60662
441 -60662 214389 -123942 -107535 216377 -78843 -148178 206079 -29408 -180136 184062
451 184062 21277 -201459 151752 70208 -211044 111175 114392 -208447 64928 151385 -194088
462 -194088 15940 179023 -169135 -32896 196149 -135318 -78890 202088 -94811 -119582
472 -119582 196830 -49980 -153001 181063 -3177 -177577 155739 43026 -192258 122403
482 122403 86427 -196471 82765 124808 -190077 38958 156261 -173381 -6843 179058
492 179058 -147226 -52106 191911 -113019 -94425 194030 -72560 -131193 185162 -28237
502 -28237 -160336 165873 17301 -179995 137182 61368 -189058 101018 101265 -187107 59670
513 59670 134616 -174478 15678 159627 -152157 -28211 175025 -121807 -69510 180325
523 180325 -85307 -106100 175522 -44923 -136032 161199 -2867 -157980 138399 38596
533 38596 -171087 108481 77426 -174784 72974 111790 -169030 33741 139900 -154118
543 -154118 -7178 160303 -130748 -47740 171838 -100128 -85668 173799 -63917 -118743
553 -118743 165937 -24140 -144963 148660 16861 -162727 122934 56568 -170980 90326
563 90326 92580 -169221 52939 122775 -157790 13152 145347 -137498 -26627 159242 -109812
574 -109812 -64100 163872 -76510 -97208 159253 -39767 -124295 146039 -1528 -144044
584 -144044 125199 36055 -155719 97925 71177 -158923 65732 102066 -153591 30342
594 30342 127338 -140021 -6588 145622 -118951 -43024 155945 -91357 -77087 157639 -58757
605 -58757 -106881 150588 -22917 -130554 135073 14055 -146729 111991 49999 -154402
615 -154402 82755 82642 -153129 49110 110098 -143085 13262 130701 -125015 -22555 143332
626 143332 -100246 -56291 147603 -70444 -86034 143452 -37512 -110246 131615 -3265
636 -3265 -127938 112804 30462 -138324 88328 61923 -141185 59503 89612 -136425 27802
647 27802 112260 -124409 -5062 128679 -105727 -37599 138074 -81310 -68006 139850 -52425
658 -52425 -94630 133828 -20537 -115907 120160 12425 -130519 99671 44564 -137536 73509
669 73509 73905 -136462 43371 98572 -127463 11147 117088 -111231 -21162 128421 -88831
680 -88831 -51501 132126 -61852 -78284 128266 -32007 -99959 117249 -1064 -115616 100045
691 100045 29279 -124671 77699 57523 -126828 51560 82261 -122182 22968 102322 -111087
702 -111087 -6550 116785 -94137 -35680 124985 -72168 -62832 126421 -46252 -86528 120864
713 120864 -17699 -105533 108604 11866 -118549 90138 40674 -124802 66656 67049 -123895
724 -123895 39560 89317 -115846 10434 106141 -101267 -18736 116552 -81166 -46239 120082
735 120082 -56866 -70475 116712 -29960 -90077 106827 -2096 -104226 91335 25217
745 25217 -112334 71278 50504 -114183 47747 72632 -109922 22130 90598 -99926 -4352
756 -4352 103520 -84720 -30464 110892 -65067 -54777 112265 -41993 -76095 107496 -16611
767 -16611 -93169 96762 9689 -104932 80573 35380 -110734 59844 58862 -110033 35800
778 35800 78684 -102952 9973 93725 -89992 -16053 102953 -72007 -40592 105997 -50235
789 -50235 -62154 102852 -26133 -79590 93919 -1236 -92073 79920 23072 -99107 61877
800 61877 45540 -100494 40825 65030 -96447 18006 80680 -87294 -5484 91881 -73606
811 -73606 -28486 98123 -56083 -49870 99107 -35576 -68552 94724 -13080 -83514 85108
822 85108 10148 -93843 70694 32895 -98865 52254 53679 -98178 30833 71287 -91790
833 -91790 7792 84608 -80102 -15480 92783 -63905 -37475 95400 -44306 -56796 92448
844 92448 -22602 -72435 84277 -182 -83461 71584 21618 -89605 55265 41688 -90705
855 -90705 36325 59017 -86865 15912 72830 -78505 -5037 82581 -66106 -25486 87937
866 87937 -50348 -44432 88602 -32018 -60972 84586 -11996 -74230 76023 8672 -83455
877 -83455 63277 28870 -88001 46974 47393 -87561 28062 63132 -82093 7653 75012
888 75012 -71877 -12942 82337 -57586 -32377 84649 -40206 -49518 81947 -20938 -63274
899 -63274 74563 -1000 -72976 63173 18409 -78291 48560 36188 -79051 31669 51413
910 51413 -75452 13541 63480 -67909 -4908 71919 -56900 -22784 76398 -43023 -39202
921 -39202 76763 -26991 -53503 73062 -9519 -64814 65399 8469 -72678 54144 25984
932 25984 -76460 39817 42077 -75944 23244 55721 -70971 5352 66047 -61862 -12705
943 -12705 72297 -49192 -29752 74130 -33774 -44694 71536 -16686 -56640 64758 967
954 967 -64941 54383 18042 -69290 41197 33667 -69604 26070 46898 -66044 9936 57217
966 57217 -59025 -6318 64251 -49031 -21933 67802 -36589 -36186 67797 -22387 -48458 64207
978 64207 -7056 -58111 57208 8713 -64737 47146 24022 -67816 34443 38069 -67166
989 -67166 19809 49991 -62709 4103 58983 -54634 -11768 64468 -43486 -26739 66047
1000 66047 -29977 -39847 63718 -14929 -50288 57695 546 -57508 48415 15589 -61153
1011 -61153 36670 29219 -61188 23220 40752 -57813 8972 49647 -51430 -5333 55662 -42474
1023 -42474 -19007 58606 -31461 -31377 58438 -19037 -41931 55212 -5775 -50197 49066 7808
1035 7808 -55753 40340 20907 -58246 29400 32864 -57551 16749 42959 -53571 3166 50568
1047 50568 -46450 -10500 55114 -36656 -23414 56328 -24801 -34695 54057 -11662 -43600 48527
1059 48527 1853 -49600 40274 14814 -52401 29846 26495 -52071 18039 36171 -48688 5615
1071 5615 43537 -42704 -6730 48251 -34589 -18383 50247 -24818 -28767 49577 -13932 -37492
1083 -37492 46327 -2501 -44174 40670 9041 -48555 32893 20097 -50294 23332 30134 -49305
1095 -49305 12417 38504 -45523 718 44740 -39162 -11055 48384 -30471 -22087 49140 -20048
1107 -20048 -31680 46914 -8537 -39222 41900 3192 -44184 34479 14438 -46371 25200 24424
1119 24424 -45704 14776 32667 -42387 3811 38739 -36796 -6940 42420 -29421 -16969 43771
1131 43771 -20641 -25814 42747 -11049 -33133 39564 -1080 -38634 34415 8822 -42083 27526
1143 27526 18230 -43324 19219 26654 -42260 9914 33627 -38876 -27 38699 -33244 -9929
1155 -9929 41546 -25721 -19203 41901 -16726 -27202 39767 -6859 -33445 35154 3229 -37443
1167 -37443 28540 12830 -39022 20371 21266 -38141 11284 28094 -35001 1884 32979 -29949
1179 -29949 -7201 35755 -23341 -15565 36429 -15726 -22778 35121 -7508 -28569 32001 945
1191 945 -32768 27285 9159 -35196 21181 16863 -35780 14017 23653 -34462 6105 29190 -31189
1204 -31189 -2217 33094 -26211 -10445 35089 -19693 -18081 35011 -11918 -24614 32756 -3455
1216 -3455 -29524 28490 5075 -32564 22521 13124 -33432 15272 20144 -32183 7306 25659
1228 25659 -29004 -829 29442 -24202 -8598 31307 -18178 -15552 31323 -11346 -21400 29641
1240 29641 -4158 -25932 26429 3093 -28990 21943 10027 -30550 16434 16380 -30564 10130
1252 10130 21861 -29052 3325 26208 -25957 -3735 29169 -21442 -10623 30512 -15738 -16868
1264 -16868 30111 -9071 -22158 27890 -1836 -26023 23970 5362 -28229 18580 12101 -28568
1276 -28568 12179 17914 -27101 5213 22357 -23977 -1796 25199 -19520 -8414 26462 -14063
1288 -14063 -14218 26107 -8072 -18938 24231 -1917 -22376 21136 4140 -24569 17038 9741
1300 9741 -25385 12196 14763 -24921 6783 18915 -23171 1087 22181 -20260 -4694 24202
1312 24202 -16177 -10213 24884 -11232 -15159 24177 -5536 -19264 21929 494 -22121 18317
1324 18317 6390 -23546 13592 11849 -23415 8013 16439 -21695 2017 19787 -18618 -3911
1336 -3911 21723 -14443 -9374 22212 -9488 -14018 21292 -4140 -17628 19152 1182 -20075
1348 -20075 16024 6245 -21312 12087 10811 -21432 7697 14739 -20443 2989 17814 -18427
1360 -18427 -1878 19999 -15465 -6615 21222 -11707 -11022 21321 -7308 -14958 20189 -2409 -18073
1373 -18073 17924 2651 -20097 14535 7602 -20862 10206 12035 -20306 5269 15633 -18427
1385 -18427 62 18136 -15320 -5030 19342 -11353 -9655 19308 -6755 -13442 18044 -1944
1397 -1944 -16273 15735 2773 -17998 12648 7087 -18651 8967 10839 -18284 5034 13916 -16987
1410 -16987 942 16102 -14917 -3092 17554 -12096 -7002 18091 -8691 -10472 17668 -4828
1422 -4828 -13439 16318 -665 -15677 14017 3562 -16983 10842 7632 -17254 6994 11179 -16379
1435 -16379 2741 13917 -14388 -1754 15718 -11450 -5946 16352 -7806 -9654 15804 -3695
1447 -3695 -12549 14253 498 -14537 11805 4501 -15548 8754 8031 -15481 5284 10943 -14645
1460 -14645 1710 13146 -13017 -1846 14581 -10799 -5212 15249 -8068 -8272 15189 -4913
1472 -4913 -10888 14339 -1532 -12993 12701 2027 -14445 10385 5487 -15075 7384 8764 -14815
1485 -14815 3861 11528 -13607 89 13538 -11464 -3780 14635 -8555 -7296 14753 -5084
1497 -5084 -10373 13798 -1301 -12651 11948 2504 -14014 9304 6049 -14401 6225 9070 -13948
1510 -13948 2865 11413 -12670 -512 13031 -10781 -3700 13914 -8400 -6586 14100 -5725
1522 -5725 -9061 13534 -2812 -11045 12378 204 -12522 10605 3260 -13338 8273 6139 -13451
1535 -13451 5412 8741 -12818 2212 10883 -11407 -1191 12337 -9191 -4507 12921 -6386
1547 -6386 -7535 12703 -3168 -10040 11553 263 -11736 9592 3618 -12622 7050 6607 -12613
1560 -12613 4069 9082 -11731 964 10854 -10206 -2052 11875 -8151 -4846 12258 -5736 -7222
1573 -7222 11905 -3117 -9117 11065 -459 -10548 9601 2239 -11454 7681 4734 -11767 5400
1586 5400 7071 -11450 2759 9069 -10495 -90 10512 -8852 -3035 11419 -6622 -5853 11541
1599 11541 -3941 -8329 10901 -848 -10238 9474 2254 -11436 7350 5273 -11826 4734 7841
1612 7841 -11421 1809 9886 -10218 -1179 11207 -8377 -3974 11814 -6131 -6473 11711 -3641
1625 -3641 -8506 10951 -1037 -10030 9725 1553 -11008 8018 3953 -11450 5996 6178 -11335
1638 -11335 3652 8046 -10644 1158 9576 -9393 -1473 10591 -7618 -4069 11065 -5319 -6540
1651 -6540 10836 -2660 -8591 9928 241 -10146 8330 3175 -11026 6132 5917 -11108 3554
1664 3554 8215 -10460 741 9891 -9107 -2087 10891 -7231 -4688 11155 -4922 -6834 10726
1677 10726 -2430 -8535 9748 93 -9683 8252 2477 -10315 6413 4667 -10366 4354 6525
1690 6525 -9926 2076 8067 -8964 -280 9186 -7589 -2591 9830 -5743 -4850 9909 -3573
1703 -3573 -6883 9419 -1076 -8517 8297 1568 -9631 6549 4160 -10104 4333 6502 -9874
1716 -9874 1763 8457 -8946 -941 9791 -7417 -3566 10443 -5354 -5928 10383 -2961 -7829
1729 -7829 9686 -526 -9216 8423 1907 -10020 6712 4162 -10210 4744 6054 -9925 2572
1742 2572 7655 -9149 346 8832 -7914 -1892 9550 -6349 -4035 9846 -4410 -6027 9553
1755 9553 -2178 -7708 8769 231 -9024 7431 2721 -9781 5587 5115 -9990 3282 7240
1768 7240 -9467 738 8911 -8352 -1902 10027 -6626 -4413 10452 -4489 -6620 10163 -2103
1781 -2103 -8361 9279 369 -9527 7850 2726 -10079 5997 4791 -10044 3900 6501 -9473
1794 -9473 1695 7843 -8441 -476 8723 -7042 -2617 9188 -5326 -4526 9172 -3376 -6268
1807 -6268 8661 -1206 -7681 7726 1085 -8688 6338 3343 -9193 4488 5444 -9113 2236
1820 2236 7263 -8430 -159 8655 -7110 -2594 9440 -5371 -4881 9582 -3182 -6853 9097
1833 9097 -844 -8382 7991 1509 -9284 6408 3765 -9596 4506 5653 -9307 2380 7168
1846 7168 -8541 227 8223 -7285 -1865 8809 -5736 -3804 8965 -3927 -5528 8631 -1886
1859 -1886 -6968 7866 205 -8057 6711 2356 -8745 5133 4415 -8930 3188 6324 -8585
1872 -8585 990 7850 -7682 -1375 8966 -6226 -3733 9480 -4303 -5885 9388 -2119 -7680
1885 -7680 8666 284 -8966 7410 2627 -9681 5653 4772 -9754 3625 6568 -9252 1444
1898 1444 7868 -8261 -675 8738 -6831 -2721 9101 -5134 -4557 8950 -3198 -6068 8400
1911 8400 -1141 -7308 7407 924 -8157 6106 2960 -8596 4396 4855 -8578 2494 6506 -8089
1925 -8089 316 7880 -7064 -1922 8753 -5524 -4084 9074 -3680 -6013 8774 -1476 -7575
1938 -7575 7910 839 -8647 6550 3060 -9120 4764 5036 -9028 2713 6676 -8324 540
1951 540 7821 -7223 -1527 8457 -5699 -3487 8579 -3947 -5123 8252 -2005 -6404 7512
1964 7512 -58 -7415 6398 1883 -7953 4892 3726 -8094 3158 5364 -7804 1252 6764 -7043
1978 -7043 -808 7818 -5883 -2891 8417 -4256 -4868 8493 -2315 -6594 7999 -150 -7923 6980
1992 6980 2034 -8772 5476 4143 -9005 3575 5960 -8681 1485 7399 -7818 -659 8333
2005 8333 -6479 -2680 8737 -4838 -4538 8654 -3016 -6002 8068 -1028 -7112 7111 871
2018 871 -7839 5825 2757 -8134 4204 4469 -8060 2427 5987 -7538 483 7129 -6618 -1526
2032 -1526 8013 -5295 -3506 8373 -3631 -5360 8253 -1714 -6885 7636 411 -8011 6506
2045 6506 2539 -8699 4910 4464 -8760 3034 6140 -8299 962 7415 -7288 -1153 8181 -5895
2059 -5895 -3085 8455 -4135 -4784 8171 -2228 -6158 7493 -294 -7091 6366 1561 -7644 4992
2073 4992 3297 -7740 3381 4827 -7432 1606 6081 -6766 -302 6983 -5728 -2127 7536 -4311
2087 -4311 -3902 7661 -2647 -5552 7366 -736 -6831 6592 1258 -7750 5370 3242 -8172 3754
2101 3754 5011 -8080 1851 6501 -7415 -119 7553 -6321 -2114 8139 -4837 -3930 8181 -3052
2115 -3052 -5474 7714 -1153 -6625 6851 755 -7359 5583 2546 -7687 4057 4138 -7559 2359
2129 2359 5474 -7046 559 6545 -6177 -1206 7215 -4997 -2993 7558 -3495 -4654 7472
2142 7472 -1770 -6050 6981 143 -7170 6050 2063 -7846 4706 3917 -8100 3046 5557 -7835
2156 -7835 1164 6890 -7113 -788 7795 -5888 -2753 8165 -4270 -4453 8075 -2505 -5820 7440
2170 7440 -593 -6791 6423 1269 -7377 5067 2972 -7539 3462 4463 -7280 1803 5632 -6623
2184 -6623 64 6513 -5665 -1668 7049 -4401 -3243 7197 -2914 -4694 6984 -1233 -5909 6339
2198 6339 534 -6821 5329 2305 -7366 3960 3998 -7412 2334 5480 -7015 506 6606 -6192
2212 -6192 -1346 7331 -4950 -3128 7587 -3403 -4678 7348 -1636 -5930 6635 179 -6750 5533
2226 5533 1944 -7105 4131 3514 -7081 2561 4794 -6608 868 5781 -5819 -798 6441 -4689
2240 -4689 -2390 6767 -3362 -3849 6721 -1862 -5135 6269 -220 -6106 5508 1440 -6796 4377
2254 4377 3064 -7122 2996 4586 -6982 1371 5868 -6425 -403 6822 -5488 -2158 7323 -4160
2268 -4160 -3802 7397 -2598 -5188 7023 -861 -6273 6248 873 -6936 5059 2543 -7148 3597
2282 3597 4010 -6982 1998 5160 -6349 310 6025 -5430 -1283 6502 -4291 -2829 6648 -2906
2296 -2906 -4144 6449 -1414 -5261 5890 172 -6115 5028 1741 -6612 3918 3261 -6762 2510
2310 2510 4618 -6558 982 5727 -5907 -697 6510 -4917 -2327 6916 -3556 -3833 6867 -2038
2324 -2038 -5106 6403 -373 -6040 5497 1303 -6532 4289 2818 -6667 2884 4109 -6359 1364
2338 1364 5110 -5700 -245 5788 -4699 -1742 6061 -3474 -3084 6072 -2121 -4214 5686 -652 -5135
2353 -5135 5041 815 -5756 4103 2255 -6068 2957 3593 -6044 1623 4758 -5694 141 5650 -5010
2368 -5010 -1376 6234 -3969 -2828 6452 -2669 -4156 6287 -1191 -5253 5696 364 -6018 4757
2382 4757 1892 -6365 3530 3298 -6366 2086 4453 -5910 595 5274 -5130 -893 5834 -4072 -2300
2397 -2300 6000 -2838 -3491 5775 -1464 -4505 5346 -34 -5266 4582 1322 -5708 3603 2666 -5893
2412 -5893 2413 3855 -5756 1074 4894 -5270 -335 5623 -4521 -1761 6009 -3470 -3065 6143 -2186
2427 -2186 -4309 5855 -741 -5256 5227 717 -5845 4237 2158 -6037 3039 3400 -5920 1635
2441 1635 4476 -5392 230 5156 -4608 -1187 5523 -3529 -2423 5562 -2338 -3521 5302 -1034 -4329
2456 -4329 4723 260 -4937 3922 1555 -5225 2925 2695 -5263 1773 3732 -4982 551 4548 -4445
2471 -4445 -744 5101 -3680 -2022 5416 -2658 -3179 5415 -1483 -4166 5045 -135 -4920 4396 1174
2486 1174 -5371 3424 2459 -5486 2244 3558 -5235 916 4380 -4637 -397 4944 -3808 -1650 5162
2501 5162 -2734 -2798 5053 -1560 -3730 4651 -309 -4381 4021 934 -4804 3149 2071 -4969 2137
2516 2137 3070 -4833 1035 3941 -4425 -130 4579 -3817 -1307 4979 -2971 -2451 5138 -1959 -3483
2531 -3483 5017 -800 -4321 4558 431 -4936 3824 1641 -5259 2857 2747 -5223 1704 3724 -4871
2546 -4871 435 4456 -4256 -812 4848 -3372 -1943 4965 -2301 -2949 4771 -1139 -3746 4299 53
2561 53 -4284 3623 1152 -4593 2762 2187 -4609 1791 3076 -4398 730 3776 -3955 -366 4306 -3305
2577 -3305 -1414 4543 -2457 -2472 4560 -1501 -3345 4342 -441 -4007 3896 719 -4491 3144 1766
2592 1766 -4704 2240 2782 -4620 1154 3599 -4215 49 4147 -3616 -1101 4432 -2717 -2119 4460
2607 4460 -1692 -2941 4165 -541 -3613 3614 541 -4001 2875 1553 -4145 2043 2424 -4033 1045
2622 1045 3155 -3709 51 3735 -3216 -955 4048 -2501 -1921 4173 -1696 -2756 4060 -768 -3440
2637 -3440 3756 238 -4013 3191 1243 -4298 2454 2172 -4350 1544 3043 -4136 513 3727 -3691
2652 -3691 -541 4160 -2979 -1566 4317 -2089 -2467 4163 -1103 -3206 3834 -36 -3750 3226 969
2667 969 -4012 2440 1897 -4040 1531 2675 -3850 590 3286 -3449 -343 3703 -2863 -1269 3938
2682 3938 -2134 -2115 3941 -1324 -2836 3762 -406 -3430 3345 531 -3834 2779 1447 -4028 2065
2697 2065 2280 -3997 1184 3035 -3730 204 3592 -3236 -767 3891 -2576 -1714 3998 -1693 -2495 3805
2713 3805 -756 -3148 3387 186 -3510 2764 1150 -3694 1928 1997 -3614 1088 2656 -3347 176
2728 176 3119 -2854 -708 3443 -2256 -1517 3548 -1514 -2236 3454 -697 -2859 3166 135 -3275 2722
2744 2722 961 -3574 2112 1760 -3658 1369 2492 -3525 502 3088 -3195 -370 3477 -2619 -1256
2759 -1256 3667 -1929 -2070 3638 -1106 -2752 3389 -155 -3244 2863 763 -3519 2205 1626 -3561
2774 -3561 1394 2355 -3411 537 2897 -3017 -312 3288 -2454 -1153 3479 -1784 -1948 3446 -1016
2789 -1016 -2592 3238 -264 -3076 2882 572 -3416 2392 1369 -3600 1725 2064 -3532 961 2732
2804 2732 -3335 128 3196 -2882 -728 3526 -2326 -1534 3618 -1593 -2293 3526 -721 -2863 3191
2819 3191 162 -3287 2641 1049 -3465 1957 1796 -3425 1167 2473 -3217 309 2931 -2755 -572
2834 -572 3208 -2210 -1341 3304 -1500 -2048 3189 -714 -2622 2942 40 -2990 2518 829 -3251 1936
2850 1936 1572 -3334 1283 2208 -3209 544 2754 -2956 -209 3136 -2472 -1045 3323 -1837 -1748 3352
2866 3352 -1130 -2390 3152 -303 -2900 2756 551 -3191 2185 1321 -3336 1471 2048 -3239 657
2881 657 2619 -2864 -196 2997 -2355 -997 3211 -1761 -1743 3216 -989 -2367 3023 -244 -2849 2665
2897 2665 556 -3147 2160 1302 -3269 1538 1957 -3211 846 2536 -3021 68 2987 -2660 -697
2912 -697 3287 -2158 -1425 3394 -1517 -2157 3341 -743 -2716 3066 88 -3148 2567 877 -3374 2001
2928 2001 1664 -3417 1211 2332 -3220 359 2860 -2829 -419 3203 -2288 -1245 3329 -1598 -1960
2943 -1960 3256 -815 -2531 2986 -54 -2901 2586 755 -3194 2020 1463 -3272 1357 2117 -3177
2958 -3177 648 2634 -2920 -125 3012 -2492 -918 3261 -1932 -1593 3328 -1283 -2240 3209 -536
2973 -536 -2745 2872 263 -3121 2412 1094 -3293 1743 1835 -3254 972 2394 -3015 142 2852 -2553
2989 -2553 -666 3136 -1991 -1452 3200 -1289 -2117 3081 -474 -2627 2741 306 -2981 2284 1026
3004 1026 -3192 1651 1742 -3192 974 2307 -3021 243 2810 -2670 -543 3119 -2188 -1229 3279 -1567
3020 -1567 -1908 3227 -874 -2498 3060 -104 -2956 2634 694 -3239 2127 1457 -3340 1411 2149 -3265
3036 -3265 646 2691 -2947 -172 3137 -2465 -998 3313 -1857 -1772 3299 -1075 -2436 3105 -308
3051 -308 -2932 2712 532 -3213 2205 1330 -3340 1570 1986 -3317 871 2589 -3041 69 3021 -2654
3067 -2654 -711 3264 -2129 -1412 3381 -1466 -2081 3328 -753 -2627 3064 47 -3075 2656 785
3082 785 -3361 2052 1569 -3409 1375 2235 -3289 564 2775 -2966 -276 3120 -2447 -1056 3317 -1756
3098 -1756 -1809 3282 -999 -2431 3043 -182 -2863 2646 621 -3197 2097 1375 -3252 1396 2050 -3163
3114 -3163 642 2607 -2905 -111 3012 -2481 -880 3232 -1915 -1580 3288 -1279 -2214 3149 -508
3129 -508 -2756 2886 236 -3124 2392 1009 -3345 1771 1744 -3345 1080 2405 -3099 257 2885 -2752
3145 -2752 -557 3235 -2195 -1355 3335 -1512 -2045 3284 -735 -2615 3013 120 -3041 2501 902
3160 902 -3281 1939 1636 -3317 1197 2303 -3185 450 2796 -2895 -351 3164 -2408 -1097 3372
3175 3372 -1816 -1842 3351 -1101 -2442 3190 -318 -2925 2875 422 -3259 2363 1211 -3451 1728
3190 1728 1947 -3375 1014 2543 -3189 190 3061 -2792 -638 3331 -2210 -1441 3424 -1513 -2146 3315
3206 3315 -709 -2717 3001 103 -3101 2534 910 -3346 1900 1661 -3370 1205 2316 -3185 405
3221 405 2803 -2849 -377 3144 -2339 -1127 3344 -1704 -1823 3299 -998 -2415 3114 -251 -2880
3236 -2880 2774 540 -3202 2248 1262 -3348 1637 1957 -3309 874 2501 -3070 55 2990 -2640
3251 -2640 -723 3243 -2047 -1489 3317 -1361 -2169 3166 -557 -2676 2856 245 -3051 2360 1052
3266 1052 -3259 1762 1776 -3230 1041 2363 -3034 237 2885 -2664 -548 3161 -2169 -1251 3286 -1537
3282 -1537 -1971 3239 -790 -2539 3029 -48 -2957 2618 700 -3265 2097 1463 -3334 1426 2103 -3255
3298 -3255 678 2649 -3016 -85 3077 -2539 -892 3296 -1947 -1652 3347 -1225 -2285 3212 -444
3313 -444 -2810 2854 380 -3126 2329 1169 -3283 1695 1842 -3241 967 2444 -3056 174 2885
3328 2885 -2662 -601 3169 -2133 -1332 3255 -1504 -1976 3183 -813 -2571 2987 -40 -2961 2587
3343 2587 712 -3196 2037 1439 -3308 1423 2105 -3163 706 2634 -2924 -79 3031 -2505 -878
3358 -878 3190 -1883 -1553 3233 -1211 -2194 3086 -461 -2691 2727 350 -3042 2226 1094 -3160 1590
3374 1590 1800 -3104 891 2366 -2864 138 2775 -2504 -655 3008 -1986 -1350 3100 -1364 -1939 3010
3390 3010 -667 -2447 2767 87 -2809 2386 799 -3067 1855 1485 -3107 1204 2093 -2964 523
3405 523 2545 -2698 -237 2935 -2269 -970 3103 -1689 -1662 3103 -1024 -2233 2945 -272 -2681 2556
3421 2556 491 -2962 2072 1181 -3093 1435 1840 -3021 737 2386 -2769 2 2758 -2360 -703
3436 -703 2996 -1828 -1396 3056 -1205 -1958 2980 -536 -2477 2691 180 -2803 2320 845 -3028 1791
3452 1791 1523 -3084 1166 2064 -2954 463 2535 -2642 -270 2886 -2230 -977 3052 -1701 -1636 3025
3468 3025 -1026 -2153 2853 -297 -2604 2532 428 -2888 2061 1125 -2978 1453 1751 -2879 763
3483 763 2264 -2643 56 2613 -2296 -651 2841 -1777 -1295 2903 -1198 -1873 2767 -534 -2321 2523
3499 2523 118 -2643 2107 764 -2808 1617 1386 -2875 1061 1926 -2719 392 2341 -2462 -244
3514 -244 2679 -2035 -886 2805 -1486 -1537 2814 -876 -2030 2624 -212 -2422 2282 477 -2671 1835
3530 1835 1101 -2747 1270 1671 -2660 632 2119 -2443 -58 2457 -2040 -687 2611 -1573 -1299 2663
3546 2663 -1029 -1765 2521 -392 -2204 2305 211 -2486 1931 835 -2651 1470 1409 -2629 912 1915
3562 1915 -2511 302 2284 -2280 -311 2588 -1863 -938 2711 -1366 -1463 2650 -794 -1986 2478 -172
3578 -172 -2336 2164 462 -2574 1729 1051 -2636 1160 1574 -2560 554 2028 -2326 -63 2315 -1937
3594 -1937 -652 2522 -1513 -1208 2507 -982 -1683 2421 -441 -2036 2170 185 -2320 1837 766
3609 766 -2492 1407 1291 -2473 869 1743 -2360 336 2097 -2108 -285 2358 -1758 -827 2456 -1293
3625 -1293 -1349 2438 -788 -1787 2263 -223 -2122 1973 353 -2282 1574 929 -2380 1092 1425 -2290
3641 -2290 536 1800 -2087 -22 2041 -1749 -554 2222 -1315 -1056 2249 -841 -1517 2125 -343
3656 -343 -1812 1903 198 -2074 1538 714 -2185 1182 1178 -2190 697 1589 -2065 222 1889 -1833
3672 -1833 -321 2096 -1538 -800 2210 -1100 -1243 2185 -599 -1654 2029 -72 -1954 1744 430
3687 430 -2088 1403 893 -2134 955 1372 -2109 447 1697 -1898 -92 1939 -1580 -587 2064 -1182
3703 -1182 -1059 2068 -730 -1442 1938 -275 -1741 1714 210 -1917 1451 686 -2029 1030 1111 -2007
3719 -2007 643 1469 -1915 151 1755 -1691 -289 1959 -1368 -724 2042 -1015 -1163 2005 -589 -1505
3735 -1505 1863 -137 -1729 1636 353 -1905 1291 818 -1972 924 1154 -1887 436 1499 -1719
3750 -1719 -9 1690 -1466 -451 1796 -1131 -869 1811 -693 -1218 1732 -264 -1451 1516 141
3765 141 -1651 1260 535 -1735 970 911 -1729 586 1225 -1629 183 1470 -1447 -206 1590 -1187
3781 -1187 -597 1736 -863 -947 1691 -506 -1283 1557 -108 -1492 1389 285 -1624 1097 707 -1690
3797 -1690 746 1038 -1607 338 1315 -1443 -41 1472 -1233 -438 1579 -853 -782 1564 -526 -1067
3813 -1067 1464 -163 -1307 1273 211 -1424 1035 585 -1495 734 857 -1480 421 1149 -1386 68
3829 68 1312 -1241 -259 1450 -1007 -585 1527 -715 -896 1498 -406 -1174 1397 -66 -1351 1190
3845 1190 288 -1445 974 658 -1507 667 942 -1433 336 1157 -1285 -62 1334 -1073 -373 1409
3861 1409 -808 -700 1375 -477 -944 1284 -184 -1116 1155 136 -1240 934 440 -1280 661 746
3877 746 -1284 369 907 -1195 132 1125 -1046 -186 1204 -866 -453 1291 -646 -706 1254 -383 -902
3894 -902 1191 -94 -1096 1038 211 -1173 826 474 -1215 562 763 -1171 278 921 -1029 -1
3910 -1 1035 -884 -287 1102 -661 -517 1084 -408 -749 999 -127 -904 865 133 -982 670 379
3927 379 -1003 499 601 -983 230 746 -904 49 905 -797 -193 1003 -630 -380 1060 -447 -618
3944 -618 1004 -219 -791 945 -17 -916 787 215 -964 599 429 -989 401 641 -963 128 788
3961 788 -840 -70 888 -709 -289 912 -506 -500 916 -250 -651 838 -49 -772 692 171 -842 589
3979 589 383 -841 391 536 -830 229 671 -730 -6 772 -673 -178 819 -548 -355 876 -408
3996 -408 -513 831 -218 -640 759 -25 -757 648 106 -843 492 334 -824 382 475 -765 182 607
4014 607 -704 -25 698 -566 -181 728 -419 -348 724 -260 -470 649 -63 -579 585 85 -606 438
4032 438 243 -612 294 379 -578 126 441 -544 38 541 -476 -134 537 -354 -243 573 -275 -332 550 -120
4052 -120 -473 517 14 -516 454 144 -573 344 273 -546 242 346 -518 104 458 -457 -14 513 -367 -188
4072 -188 522 -229 -279 487 -123 -385 411 14 -446 335 148 -456 222 259 -432 142 315 -390 15 385 -360
4093 -360 -57 410 -282 -160 413 -199 -246 440 -136 -325 403 -29 -365 390 82 -428 291 145 -405 253
4113 253 220 -449 177 300 -383 56 320 -352 -73 380 -280 -154 387 -223 -261 339 -107 -258 311 32 -325
4134 -325 229 76 -310 175 177 -321 102 233 -258 20 269 -243 -31 281 -195 -96 262 -139 -114 255 -73
4155 -73 -177 238 -57 -190 212 19 -244 194 65 -262 99 89 -219 113 113 -221 59 169 -190 -13 205
4176 205 -137 -41 172 -82 -90 167 -38 -103 131 57 -158 80 65 -107 55 85 -94 -6 128 -48 -81 121 -28
4199 -28 -92 86 -7 -83 98 22 -110 47 30 -111 69 66 -103 52 59 -75 19 84 -110 8 89 -89 -33 129 -71
4224 -71 -41 113 -69 -52 109 -9 -103 75 20 -69 67 44 -88 37 75 -68 -24 66 -36 -43 95 -47 -76 88
4248 88 13 -102 82 38 -98 5 47 -80 -10 50 -75 10 46 -44 16 69 -40 -33 18 36 -4 20 7 -4 23 30 16 25
4276 25 37 4 0 16 13 -11 20 10 -27 32 34 -69 -4 51 -70 38 31 -72 -2 89 -99 2 138 -123 0 145 -78
4303 -78 -69 132 -66 -80 167 -16 -147 176 15 -170 126 104 -174 93 88 -170 65 143 -154 14 158 -111 -69
4326 -69 149 -81 -77 169 -49 -111 151 -21 -142 124 -5 -170 143 63 -208 91 100 -180 62 138 -205 65 195
4349 195 -196 7 226 -193 -22 234 -150 -91 235 -99 -146 254 -45 -191 228 11 -249 204 80 -229 132
4370 132 134 -254 66 159 -207 12 204 -168 -90 203 -132 -101 198 -81 -141 162 -3 -181 158 39 -209 141
4392 141 105 -215 98 172 -179 35 199 -181 2 254 -182 -54 248 -153 -123 264 -124 -180 273 -55 -254
4413 -254 254 1 -264 213 99 -286 161 173 -311 57 244 -286 11 269 -253 -65 296 -190 -169 280 -126
4434 -126 -202 294 -34 -268 285 39 -274 226 127 -323 153 205 -322 119 255 -344 24 275 -307 -33 311
4455 311 -282 -104 355 -196 -159 356 -183 -247 365 -66 -323 379 25 -357 310 128 -386 230 204 -395 145
4476 145 277 -340 67 376 -319 -62 365 -255 -113 377 -164 -242 354 -86 -266 320 5 -333 291 92
4496 92 -366 174 193 -335 87 248 -367 52 286 -301 -51 342 -254 -123 351 -190 -176 377 -115 -244 349
4517 349 -49 -318 372 32 -356 310 142 -383 206 185 -370 103 270 -366 15 361 -303 -93 371 -236
4537 -236 -196 375 -147 -279 341 -24 -337 296 58 -374 224 142 -402 151 254 -381 99 331 -349 -18 381
4558 381 -310 -112 407 -231 -192 447 -163 -262 470 -100 -314 414 -30 -379 367 84 -457 287 172 -464 224
4579 224 244 -467 102 329 -409 -16 437 -379 -120 445 -262 -230 460 -182 -328 426 -42 -411 373 68 -440
4600 -440 314 144 -455 219 254 -453 155 354 -386 4 402 -367 -90 424 -301 -178 456 -225 -256 446 -131
4621 -131 -313 418 -58 -403 392 48 -429 331 155 -444 233 237 -456 145 335 -409 11 385 -354 -75 437
4642 437 -283 -194 455 -148 -287 417 -74 -364 376 42 -411 302 164 -434 188 230 -445 77 349 -368 -19
4663 -19 357 -331 -107 411 -249 -203 427 -192 -297 407 -110 -351 402 46 -419 344 104 -428 299 201 -425
4684 -425 203 297 -438 78 393 -396 -31 438 -344 -124 440 -226 -238 471 -138 -359 433 -30 -442 375 102
4705 102 -441 310 227 -482 210 286 -470 97 383 -452 -17 426 -355 -102 492 -298 -207 498 -191 -302 472
4726 472 -102 -363 455 -11 -409 395 94 -455 347 192 -476 230 296 -493 123 378 -451 -11 420 -376
4746 -376 -90 452 -312 -201 445 -209 -304 436 -54 -368 400 37 -399 309 156 -475 225 269 -425 155 331
4767 331 -399 18 401 -349 -66 431 -270 -191 419 -178 -280 419 -101 -338 427 -1 -390 349 89 -435
4787 -435 308 187 -423 169 261 -388 86 354 -386 -49 396 -344 -122 447 -255 -215 437 -141 -304 440 -18
4808 -18 -362 380 97 -442 296 208 -436 192 292 -413 92 342 -389 -24 419 -338 -151 428 -264 -224 431
4829 431 -181 -300 418 -77 -393 409 12 -427 328 114 -467 265 209 -477 189 305 -445 98 374 -396
4849 -396 -14 441 -338 -99 491 -281 -227 469 -168 -332 445 -72 -381 436 69 -447 305 159 -477 208
4869 208 254 -441 127 332 -436 12 398 -327 -79 435 -291 -158 435 -223 -251 432 -104 -333 415 -12 -401
4890 -401 361 88 -400 287 154 -411 209 256 -417 150 296 -399 12 392 -319 -74 399 -279 -174 387
4910 387 -191 -252 415 -94 -330 362 45 -379 276 138 -420 209 194 -372 87 285 -364 -11 349 -332 -117
4931 -117 404 -237 -202 430 -172 -253 401 -79 -307 364 15 -373 358 103 -412 262 167 -413 170 253 -427
4952 -427 91 331 -377 -17 391 -349 -96 407 -246 -192 418 -144 -280 406 -73 -337 379 36 -386 324
4972 324 166 -420 241 253 -424 134 330 -392 43 382 -351 -78 390 -294 -152 429 -234 -270 426 -120 -347
4993 -347 374 -19 -377 319 63 -431 272 170 -433 218 243 -414 125 323 -382 52 382 -335 -30 410
5013 410 -287 -134 425 -185 -230 412 -88 -267 367 -13 -381 327 103 -400 251 178 -389 143 274 -362 54
5034 54 313 -354 -41 352 -289 -115 400 -221 -214 373 -114 -280 371 -25 -340 328 27 -358 278 154 -409
5055 -409 232 231 -372 103 281 -370 30 341 -322 -25 363 -264 -134 356 -171 -228 383 -112 -282 345 -9
5076 -9 -368 280 80 -405 220 195 -407 150 268 -387 69 326 -361 -48 403 -301 -159 411 -179 -227 399
5097 399 -122 -279 395 -35 -346 345 63 -362 296 153 -382 210 237 -398 149 284 -408 48 314 -349
5117 -349 -69 395 -290 -114 410 -244 -228 397 -144 -321 381 -34 -342 343 48 -384 301 162 -435 219
5137 219 262 -408 108 317 -382 33 373 -311 -86 367 -245 -179 419 -186 -274 388 -87 -303 375 3 -369
5158 -369 305 75 -392 255 147 -373 171 215 -372 87 282 -316 19 356 -294 -104 395 -250 -152 397 -146
5179 -146 -215 382 -59 -297 329 4 -332 295 141 -376 227 240 -369 127 258 -360 22 337 -314 -71 368
5200 368 -237 -146 368 -167 -274 361 -77 -296 365 1 -346 278 96 -378 255 161 -402 169 264 -371 90
5221 90 320 -302 16 344 -308 -76 393 -237 -156 417 -148 -286 404 -67 -297 367 40 -367 309 121 -396
5242 -396 226 180 -395 125 280 -393 41 329 -356 -54 368 -277 -136 438 -230 -207 422 -138 -300 397 -49
5263 -49 -355 386 68 -383 308 167 -379 224 232 -391 156 326 -414 66 349 -370 -15 379 -310 -132 415
5284 415 -248 -238 399 -126 -307 376 -52 -381 351 59 -395 248 139 -429 213 253 -398 131 309 -375 29
5305 29 383 -324 -75 409 -238 -162 420 -159 -255 385 -89 -311 351 -49 -376 301 116 -383 231 174 -414
5326 -414 177 243 -414 77 333 -351 -30 352 -298 -138 411 -208 -232 418 -142 -281 406 -83 -320 375 52
5347 52 -389 296 161 -396 227 214 -389 133 316 -408 16 382 -353 -93 410 -278 -159 434 -190 -276 404
5368 404 -108 -381 398 -32 -422 333 89 -406 255 199 -450 216 287 -444 126 370 -383 9 401 -364 -84
5389 -84 434 -277 -172 465 -189 -274 453 -94 -336 423 -22 -385 357 65 -449 263 200 -462 145 295 -456
5410 -456 92 365 -429 -10 423 -361 -145 437 -261 -240 474 -189 -278 439 -64 -351 407 42 -430 344 136
5431 136 -444 259 204 -430 193 309 -420 59 371 -374 -26 417 -344 -145 419 -250 -220 427 -170 -336 408
5452 408 -66 -371 358 52 -436 296 162 -445 214 229 -450 134 317 -427 33 400 -346 -95 424 -280
5472 -280 -151 443 -184 -256 450 -80 -348 413 8 -408 367 132 -396 289 187 -473 195 274 -447 72 337
5493 337 -417 -24 408 -350 -132 444 -287 -205 438 -178 -315 442 -98 -389 406 5 -413 369 132 -455
5513 -455 257 253 -459 178 350 -438 85 426 -403 -33 443 -353 -150 512 -292 -267 505 -178 -319 441 -63
5534 -63 -440 410 61 -476 349 170 -492 251 275 -482 175 330 -478 67 394 -429 -30 453 -344 -125 507
5555 507 -262 -237 502 -156 -331 465 -52 -386 434 73 -473 351 155 -488 237 271 -487 153 378 -452 20
5576 20 429 -424 -99 474 -340 -229 500 -209 -287 498 -147 -364 464 -15 -450 381 109 -451 351 241 -478
5597 -478 219 288 -501 150 392 -445 -3 429 -366 -113 497 -308 -196 503 -193 -337 487 -100 -397 423
5617 423 42 -461 386 123 -497 270 238 -515 167 328 -484 65 432 -460 -56 519 -377 -164 520 -292
5637 -292 -292 520 -187 -373 512 -42 -433 472 57 -518 376 186 -529 274 290 -551 175 394 -497 32 484
5658 484 -485 -69 529 -371 -182 527 -266 -316 578 -155 -357 532 -45 -462 461 74 -544 354 203 -567
5678 -567 268 308 -537 188 422 -520 41 500 -459 -79 558 -385 -217 567 -286 -342 561 -171 -430 514 -30
5699 -30 -494 454 107 -554 338 234 -577 262 334 -556 137 414 -519 44 500 -444 -107 559 -373 -230 556
5720 556 -254 -326 561 -111 -424 536 28 -507 469 123 -546 383 231 -557 237 369 -556 114 479 -521
5740 -521 -47 526 -452 -145 564 -366 -308 577 -241 -402 530 -124 -469 489 53 -570 442 187 -571 339
5760 339 341 -592 200 422 -551 83 521 -484 -58 554 -425 -207 598 -325 -355 584 -205 -446 539 -53 -535
5781 -535 504 82 -612 414 206 -629 305 372 -601 193 465 -602 24 572 -515 -115 644 -422 -246
5800 -246 645 -282 -354 618 -162 -495 595 -31 -563 525 126 -620 424 276 -656 291 385 -635 168
5819 168 482 -609 24 601 -535 -148 629 -405 -293 643 -291 -441 654 -136 -503 610 -16 -593
5837 -593 506 166 -663 424 325 -670 323 471 -640 131 528 -564 -18 643 -468 -174 682 -412
5855 -412 -294 697 -241 -427 691 -92 -567 580 27 -659 520 186 -704 368 322 -699 252 448 -646
5874 -646 79 536 -571 -78 637 -494 -242 658 -327 -343 695 -217 -515 659 -31 -570 595 122 -678
5893 -678 456 278 -701 348 416 -685 189 535 -657 26 597 -576 -178 694 -463 -299 710 -341
5911 -341 -484 679 -170 -559 656 -7 -663 553 159 -712 458 366 -736 309 474 -710 126 598
5929 598 -641 -23 691 -555 -199 773 -423 -356 768 -277 -516 725 -120 -637 660 57 -707 577
5947 577 217 -763 430 367 -784 277 543 -765 77 677 -674 -93 763 -559 -268 783 -419 -418
5965 -418 805 -272 -567 756 -58 -679 700 142 -757 551 261 -782 432 436 -758 223 596 -722
5983 -722 57 711 -657 -115 787 -507 -315 790 -382 -498 755 -231 -622 703 -8 -723 633 175
6001 175 -759 518 345 -823 353 525 -796 172 665 -721 -5 748 -613 -201 811 -480 -397 849
6019 849 -325 -539 822 -139 -682 729 71 -812 582 231 -817 448 413 -852 258 569 -778
6036 -778 96 697 -710 -131 767 -583 -286 822 -414 -470 818 -243 -636 780 -50 -714 700 164
6054 164 -831 584 341 -868 414 489 -842 220 657 -817 9 782 -686 -204 860 -560 -375
6071 -375 904 -420 -570 848 -209 -703 785 7 -820 681 224 -897 550 400 -874 370 612
6088 612 -840 153 778 -796 -41 856 -663 -259 897 -529 -454 937 -300 -621 875 -81 -769 752
6106 752 103 -843 664 299 -939 486 468 -925 292 673 -893 94 800 -773 -126 893 -632
6123 -632 -319 935 -486 -572 924 -237 -717 888 -42 -832 775 183 -925 605 389 -916 436
6140 436 573 -889 233 728 -846 18 829 -727 -221 940 -545 -445 927 -381 -613 887 -162
6157 -162 -760 793 24 -839 700 280 -943 536 454 -940 346 637 -924 133 842 -812 -90
6174 -90 917 -694 -296 946 -503 -502 954 -312 -685 924 -82 -856 804 135 -920 658 380
6191 380 -990 469 567 -1004 254 746 -893 -16 849 -773 -208 971 -621 -436 965 -412 -627
6208 -627 964 -200 -800 875 37 -905 769 261 -963 597 475 -1002 401 676 -965 172 851
6225 851 -876 -30 925 -726 -296 1016 -587 -512 1052 -338 -679 954 -121 -898 876 104 -950
6242 -950 699 335 -1010 547 560 -1024 290 750 -964 71 872 -826 -145 964 -666 -389 1017
6259 1017 -487 -583 1005 -284 -755 919 -9 -918 807 248 -962 656 440 -1051 433 660 -997
6276 -997 210 800 -926 -15 934 -787 -264 1026 -625 -501 1014 -448 -659 981 -176 -846 897
6293 897 80 -954 773 322 -1026 584 525 -1005 360 736 -971 122 864 -837 -116 992 -721
6310 -721 -341 1021 -539 -595 1022 -274 -799 948 -52 -921 838 181 -1001 672 413 -1033 439
6327 439 634 -1019 253 824 -941 10 925 -821 -220 1010 -670 -444 1056 -444 -678 1047 -216
6344 -216 -840 973 43 -975 816 301 -1030 613 500 -1064 393 723 -1033 169 874 -907 -113
6361 -113 1003 -736 -364 1023 -572 -593 1047 -358 -759 965 -66 -883 863 155 -990 693 391
6378 391 -1053 534 605 -1026 305 783 -967 74 935 -844 -193 1032 -678 -432 1085 -494 -616
6395 -616 1057 -277 -802 978 -14 -965 840 227 -1020 654 483 -1068 404 679 -1033 171 821
6412 821 -928 -64 973 -771 -297 1023 -583 -529 1031 -377 -720 1003 -125 -866 868 122 -970
6429 -970 732 399 -1039 544 590 -1038 327 755 -999 80 915 -877 -159 1001 -725 -417 1038
6446 1038 -547 -649 1036 -299 -822 969 -54 -962 838 202 -1036 678 447 -1057 424 641
6462 641 -1037 220 841 -912 -14 974 -791 -291 1024 -612 -481 1063 -380 -721 1004 -165 -882
6479 -882 906 97 -993 738 322 -1041 564 544 -1038 337 706 -980 115 878 -878 -153 989
6496 989 -762 -388 1030 -569 -555 1052 -320 -775 995 -52 -907 871 157 -1035 708 411 -1050
6513 -1050 496 644 -1006 254 827 -971 22 955 -827 -228 1016 -639 -458 1015 -439 -659 978
6530 978 -195 -839 898 16 -932 747 294 -1010 586 495 -1040 366 720 -966 170 845 -858
6547 -858 -98 990 -749 -298 1020 -570 -514 1067 -343 -720 973 -77 -866 897 134 -998 738
6564 738 359 -1046 495 560 -1017 299 798 -932 47 892 -834 -185 954 -648 -435 1004 -427
6581 -427 -641 962 -215 -803 894 26 -911 777 290 -987 597 474 -963 390 676 -961 138
6598 138 836 -885 -82 970 -718 -304 995 -575 -514 1009 -354 -703 962 -148 -866 844 95
6615 95 -950 708 350 -1012 493 564 -1009 300 706 -937 92 894 -803 -153 952 -642 -389
6632 -389 980 -438 -568 984 -234 -759 898 11 -891 785 223 -948 652 434 -975 412 640
6649 640 -931 182 786 -872 -31 889 -761 -292 983 -592 -448 987 -400 -634 931 -187 -815
6666 -815 833 43 -897 702 303 -970 502 514 -986 341 669 -930 114 815 -798 -133 920
6683 920 -642 -305 955 -483 -554 935 -260 -730 879 -39 -827 733 156 -903 590 382 -939
6700 -939 419 577 -911 205 733 -836 -1 876 -720 -246 937 -560 -418 947 -393 -584 909
6717 909 -146 -752 849 58 -830 706 278 -889 530 468 -899 325 669 -855 144 791 -771
6734 -771 -93 873 -639 -308 925 -477 -510 900 -289 -680 836 -47 -822 731 179 -881 632
6751 632 357 -907 384 555 -886 222 709 -823 38 821 -707 -208 883 -601 -400 923 -378
6768 -378 -559 883 -179 -717 801 -6 -826 696 234 -911 501 393 -908 379 623 -866 147
6785 147 752 -802 -49 844 -637 -247 880 -459 -485 871 -301 -606 832 -72 -744 762 131 -819
6803 -819 604 341 -847 414 506 -841 248 663 -822 36 757 -701 -176 850 -576 -363 845
6820 845 -407 -515 857 -206 -675 806 21 -758 721 201 -841 556 371 -867 344 539 -813
6837 -813 167 696 -749 -16 821 -614 -237 832 -491 -436 875 -288 -594 789 -61 -715 711 132
6855 132 -778 575 301 -835 423 460 -834 233 613 -802 11 750 -669 -156 768 -566 -302 808
6873 808 -382 -511 811 -199 -644 783 -15 -719 643 168 -826 521 373 -837 372 497 -818
6890 -818 165 643 -750 -2 771 -617 -226 796 -484 -390 815 -320 -555 750 -96 -701 673 82
6908 82 -759 571 266 -806 417 439 -797 273 579 -756 62 693 -655 -110 791 -521 -274 837
6926 837 -383 -472 781 -243 -569 757 -70 -687 652 148 -766 532 322 -780 373 477 -806
6943 -806 171 590 -722 6 715 -625 -150 776 -469 -349 778 -323 -517 760 -120 -631 684 76
6961 76 -709 578 240 -733 413 398 -726 262 542 -698 98 666 -629 -106 704 -542 -302 767
6979 767 -369 -440 750 -227 -572 705 -58 -698 615 142 -734 485 312 -778 332 468 -740 177
6997 177 588 -675 -18 706 -593 -163 762 -461 -352 763 -305 -476 728 -111 -599 640 69 -708
7015 -708 537 227 -721 401 368 -714 242 546 -717 61 619 -628 -113 702 -525 -265 736 -376
7033 -376 -454 752 -212 -551 675 -34 -676 632 145 -722 505 300 -722 369 460 -705 172 573
7051 573 -668 61 681 -562 -160 739 -442 -336 718 -324 -454 721 -146 -608 651 39 -688 520
7069 520 207 -732 388 355 -741 253 488 -688 69 575 -603 -85 680 -485 -239 738 -362 -398 710
7088 710 -205 -525 653 -40 -627 613 131 -690 514 253 -707 335 393 -714 192 526 -660 15
7106 15 631 -569 -158 681 -442 -293 711 -313 -452 684 -142 -567 615 25 -661 524 195 -695
7124 -695 375 345 -678 249 526 -650 86 618 -576 -64 678 -475 -233 694 -353 -394 712 -183
7142 -183 -517 655 -25 -600 569 94 -672 446 268 -713 290 412 -693 177 531 -611 7 627
7160 627 -561 -154 685 -410 -299 697 -297 -437 682 -148 -534 599 65 -625 513 218 -681 385
7178 385 339 -691 235 503 -621 60 573 -589 -58 655 -499 -268 686 -377 -385 667 -197 -502 623
7197 623 -42 -596 555 117 -646 448 236 -647 339 394 -676 186 514 -648 35 594 -526 -148 643
7216 643 -411 -282 671 -265 -418 643 -140 -506 578 -7 -600 488 208 -634 360 311 -679 228 441
7235 441 -621 51 550 -573 -84 622 -487 -247 631 -336 -363 655 -197 -483 618 -45 -562 544
7253 544 128 -623 464 240 -620 349 397 -638 160 510 -599 23 589 -495 -139 657 -392 -306 642
7272 642 -272 -441 624 -126 -543 554 20 -643 467 204 -658 366 328 -665 219 479 -613 44 564
7291 564 -567 -75 633 -438 -253 655 -308 -375 652 -152 -492 610 -36 -581 537 111 -635 434
7309 434 254 -632 301 372 -644 170 469 -583 -8 579 -526 -136 600 -408 -287 656 -281 -408 615
7328 615 -109 -521 573 31 -567 484 175 -623 358 358 -633 239 456 -583 68 541 -532 -92 581
7347 581 -448 -260 632 -311 -343 618 -190 -476 596 -23 -581 490 94 -622 419 267 -664 270 359
7366 359 -646 151 494 -584 6 569 -510 -157 628 -379 -282 645 -239 -424 624 -113 -509 560
7384 560 40 -598 446 195 -640 340 328 -612 211 463 -573 58 565 -547 -94 605 -436 -248 642
7403 642 -310 -392 616 -146 -495 578 21 -567 494 143 -598 382 286 -625 288 396 -618 141 498
7422 498 -541 -8 574 -447 -136 642 -348 -276 655 -243 -427 624 -93 -535 559 53 -615 440 168
7441 168 -641 311 336 -608 191 448 -572 33 555 -538 -115 613 -423 -241 644 -273 -371 668 -125
7460 -125 -499 582 1 -570 504 168 -591 397 289 -624 285 390 -591 125 512 -561 -26 566 -483
7479 -483 -147 583 -366 -283 614 -256 -407 597 -98 -539 549 32 -551 433 211 -614 315 322 -590 200
7499 200 451 -572 48 531 -502 -92 591 -385 -264 619 -259 -385 575 -115 -480 566 3 -561 478
7518 478 158 -613 368 304 -632 258 394 -594 85 514 -534 -11 563 -439 -180 609 -351 -297 631 -223
7538 -223 -430 548 -47 -506 554 71 -537 450 222 -610 319 379 -608 207 476 -538 40 561 -502
7557 -502 -124 587 -411 -279 625 -238 -404 633 -124 -499 559 16 -560 484 182 -597 355 287 -634
7576 -634 226 431 -625 78 495 -534 -10 608 -453 -130 609 -323 -283 627 -211 -445 581 -81 -514
7595 -514 547 62 -564 442 218 -616 309 356 -628 176 456 -591 13 533 -514 -136 581 -406 -263
7614 -263 604 -282 -404 596 -137 -505 530 26 -568 453 153 -609 364 313 -605 249 436 -592 91
7633 91 517 -507 -35 592 -432 -167 621 -328 -317 586 -212 -431 570 -67 -524 495 103 -603 419
7652 419 215 -619 291 323 -600 169 458 -566 13 546 -506 -143 585 -386 -267 643 -215 -412 584 -103
7672 -103 -508 560 52 -550 470 202 -590 345 328 -630 228 435 -597 69 515 -540 -57 589 -443
7691 -443 -224 599 -340 -330 597 -202 -481 585 -58 -538 513 96 -588 395 210 -618 271 372 -575 166
7711 166 501 -543 40 560 -490 -151 615 -380 -249 618 -235 -415 594 -106 -535 560 58 -620 454
7730 454 199 -625 344 318 -632 214 456 -592 94 524 -508 -73 581 -438 -183 591 -326 -335 605 -180
7750 -180 -439 588 -50 -513 509 96 -562 388 256 -610 300 365 -586 141 502 -535 -34 569 -463
7769 -463 -153 598 -358 -302 616 -251 -448 584 -100 -519 540 50 -618 421 193 -644 324 336 -636 207
7789 207 435 -581 80 545 -534 -84 623 -401 -219 613 -295 -353 626 -185 -460 586 -53 -509 488
7808 488 112 -575 386 257 -624 292 357 -589 144 494 -568 3 561 -492 -169 637 -367 -307 641 -232
7828 -232 -431 611 -97 -517 538 63 -598 436 204 -640 362 339 -620 206 477 -582 56 529 -535
7847 -535 -118 622 -445 -216 643 -322 -358 634 -199 -500 560 -48 -548 490 89 -616 394 246 -620
7866 -620 279 365 -621 145 491 -571 33 571 -468 -152 624 -380 -301 659 -220 -445 638 -82 -531
7885 -531 552 39 -587 449 231 -638 348 372 -636 186 470 -615 30 557 -538 -110 599 -444
7903 -444 -243 617 -318 -355 629 -169 -464 573 -39 -575 502 115 -622 408 279 -647 274 409 -613
7922 -613 152 479 -553 -30 540 -503 -160 612 -350 -305 619 -213 -428 589 -113 -551 558 72 -601
7941 -601 450 193 -658 354 336 -647 173 489 -606 33 557 -533 -81 643 -414 -246 650 -317 -365
7960 -365 618 -158 -454 605 -2 -547 504 142 -626 437 272 -654 284 396 -620 124 513 -586
7978 -586 7 584 -481 -138 623 -386 -327 640 -259 -445 594 -96 -580 556 77 -620 464 249 -648
7997 -648 352 362 -644 206 490 -615 66 568 -509 -65 642 -413 -223 654 -317 -395 638 -178 -496
8016 -496 598 -59 -568 529 97 -639 432 246 -615 288 361 -623 147 458 -564 -17 566 -501 -139
8035 -139 608 -389 -299 640 -227 -444 632 -98 -518 561 74 -613 467 224 -652 354 354 -665 225
8054 225 483 -585 41 580 -570 -99 635 -439 -253 657 -347 -371 625 -180 -477 592 -14 -567 524
8073 524 104 -637 426 263 -672 311 374 -626 129 500 -568 16 587 -511 -131 642 -381 -319 657
8092 657 -242 -428 630 -100 -520 603 27 -652 480 196 -672 337 319 -698 216 450 -662 47
8110 47 563 -557 -108 622 -468 -277 691 -336 -387 638 -196 -494 590 -41 -569 538 111 -639 451
8129 451 263 -643 303 405 -634 166 503 -592 -15 576 -535 -164 643 -445 -286 663 -289 -416 637
8148 637 -114 -547 590 17 -637 512 152 -631 387 316 -658 215 460 -609 74 596 -544 -91 655
8167 655 -442 -229 679 -345 -355 669 -189 -454 636 -37 -556 566 121 -620 437 229 -688 331
8185 331 376 -667 218 466 -624 -2
8191b
##END NTUPLES=NMR FID
##END=
