##TITLE=1H_DE-99_oil_c_TFA
 200.13MHz,CDCl3,
 8 sc
 
 30.7.2025
##JCAMPDX= 6.0         $$ Bruker NMR JCAMP-DX V2.0
##DATA TYPE= NMR FID
##DATA CLASS= NTUPLES
##ORIGIN= UXNMR, Bruker Analytische Messtechnik GmbH
##OWNER= pz
$$ XWIN-NMR		Version 3.5
$$ Wed Jul 30 14:22:55 2025 Russian Standard Time (UT+4h)  she@DPX200
##.OBSERVE FREQUENCY= 200.1313
##.OBSERVE NUCLEUS= ^1H
##.DELAY= (6, 6)
##.ACQUISITION MODE= SIMULTANEOUS
##.ACQUISITION SCHEME= undefined
##.AVERAGES= 8
##.DIGITISER RES= 18
##SPECTROMETER/DATA SYSTEM= spect
##.PULSE SEQUENCE= zg30
##.SOLVENT NAME= CDCl3
##.SHIFT REFERENCE= (INTERNAL, CDCl3, 0, 14.3821)
##AUDIT TRAIL= $$ (NUMBER, WHEN, WHO, WHERE, WHAT)
$$ ##TITLE= Audit trail, XWIN-NMR		Version 3.5
$$ ##JCAMPDX= 5.01
$$ ##ORIGIN= Bruker BioSpin GmbH
$$ ##OWNER= she
$$ F:/spectra/data/she/nmr/H-C/1/audita.txt
$$ ##AUDIT TRAIL=  $$ (NUMBER, WHEN, WHO, WHERE, WHAT)
(   1,<2025-07-30 14:21:19.57 +0400>,<she>,<DPX200>,
      <created by zg, POWCHK disabled, PULCHK disabled
       configuration hash MD5:
       00 E9 B6 7A A2 85 ED C7 34 08 36 98 17 FE 4E 26
       data hash MD5: 16K
       C9 83 50 63 43 5B B6 5B 06 1E 0C 23 59 DA 45 B5>)
$$ ##END=
$$ 
$$ hash MD5
$$ 60 8C 20 B6 DB 57 D3 16 E9 E6 2F 28 EF 50 F5 00
##$RELAX= 
##$RELAX= 
##$RELAX= 
##$RELAX= 
##$RELAX= 
##$RELAX= 
$$ Bruker specific parameters
$$ --------------------------
##$DU= <F:/spectra>
##$EXPNO= 1
##$NAME= <H-C>
##$PROCNO= 1
##$TYPE= <nmr>
##$USER= <she>
##$AMP= (0..31)
100 100 100 100 100 100 100 100 100 100 100 100 100 100 100 100 100 100 
100 100 100 100 100 100 100 100 100 100 100 100 100 100 
##$AQSEQ= 0
##$AQ_mod= 1
##$AUNM= <au_zg>
##$AUTOPOS= <>
##$BF1= 200.13
##$BF2= 200.13
##$BF3= 200.13
##$BF4= 200.13
##$BF5= 200.13
##$BF6= 200.13
##$BF7= 200.13
##$BF8= 200.13
##$BYTORDA= 1
##$CFDGTYP= 0
##$CFRGTYP= 5
##$CHEMSTR= <none>
##$CNST= (0..31)
1 1 145 1 1 1 1 1 1 1 1 1 1 1 1 1 1 1 1 1 1 1 1 1 1 1 1 1 1 1 1 1 
##$CPDPRG= <>
##$CPDPRG1= <>
##$CPDPRG2= <>
##$CPDPRG3= <>
##$CPDPRG4= <mlev>
##$CPDPRG5= <mlev>
##$CPDPRG6= <mlev>
##$CPDPRG7= <mlev>
##$CPDPRG8= <mlev>
##$CPDPRGB= <>
##$CPDPRGT= <>
##$D= (0..31)
0 0.7 0 0 0 0 0 0 0 0 0 0.03 0 0 0 0 0 0 0 0 0 0 0 0 0 0 0 0 0 0 0 0 
##$DATE= 1753870879
##$DBL= (0..7)
120 120 120 120 120 120 120 120 
##$DBP= (0..7)
150 150 150 150 150 150 150 150 
##$DBP07= 0
##$DBPNAM0= <>
##$DBPNAM1= <>
##$DBPNAM2= <>
##$DBPNAM3= <>
##$DBPNAM4= <>
##$DBPNAM5= <>
##$DBPNAM6= <>
##$DBPNAM7= <>
##$DBPOAL= (0..7)
0.5 0.5 0.5 0.5 0.5 0.5 0.5 0.5 
##$DBPOFFS= (0..7)
0 0 0 0 0 0 0 0 
##$DE= 6
##$DECBNUC= <off>
##$DECIM= 32
##$DECNUC= <off>
##$DECSTAT= 4
##$DIGMOD= 1
##$DIGTYP= 9
##$DL= (0..7)
0 120 120 120 120 120 120 120 
##$DP= (0..7)
150 150 150 150 150 150 150 150 
##$DP07= 0
##$DPNAME0= <>
##$DPNAME1= <>
##$DPNAME2= <>
##$DPNAME3= <>
##$DPNAME4= <>
##$DPNAME5= <>
##$DPNAME6= <>
##$DPNAME7= <>
##$DPOAL= (0..7)
0.5 0.5 0.5 0.5 0.5 0.5 0.5 0.5 
##$DPOFFS= (0..7)
0 0 0 0 0 0 0 0 
##$DQDMODE= 0
##$DR= 18
##$DS= 0
##$DSLIST= <SSSSSSSSSSSSSSS>
$$ [...]
##$SUBNAM0= <"">
##$SUBNAM1= <"">
##$SUBNAM2= <"">
##$SUBNAM3= <"">
##$SUBNAM4= <"">
##$SUBNAM5= <"">
##$SUBNAM6= <"">
##$SUBNAM7= <"">
##$SUBNAM8= <"">
##$SUBNAM9= <"">
##$SW= 18.0517328524113
##$SWIBOX= (0..15)
0 0 2 0 0 0 0 0 0 0 0 0 0 0 0 0 
##$SW_h= 3612.71676300578
##$TD= 16384
##$TD0= 1
##$TE= 0
##$TE2= 300
##$TE3= 300
##$TEG= 300
##$TL= (0..7)
0 120 120 120 120 120 120 120 
##$TP= (0..7)
150 150 150 150 150 150 150 150 
##$TP07= 0
##$TPNAME0= <>
##$TPNAME1= <>
##$TPNAME2= <>
##$TPNAME3= <>
##$TPNAME4= <>
##$TPNAME5= <>
##$TPNAME6= <>
##$TPNAME7= <>
##$TPOAL= (0..7)
0.5 0.5 0.5 0.5 0.5 0.5 0.5 0.5 
##$TPOFFS= (0..7)
0 0 0 0 0 0 0 0 
##$TUNHIN= 0
##$TUNHOUT= 0
##$TUNXOUT= 0
##$USERA1= <user>
##$USERA2= <user>
##$USERA3= <user>
##$USERA4= <user>
##$USERA5= <user>
##$V9= 5
##$VALIST= <valist>
##$VCLIST= <CCCCCCCCCCCCCCC>
##$VD= 0
##$VDLIST= <DDDDDDDDDDDDDDD>
##$VPLIST= <PPPPPPPPPPPPPPP>
##$VTLIST= <TTTTTTTTTTTTTTT>
##$WBST= 1024
##$WBSW= 4
##$XGAIN= (0..3)
0 0 0 0 
##$XL= 0
##$YL= 0
##$YMAX_a= 294685
##$YMIN_a= -288223
##$ZGOPTNS= <>
##$ZL1= 120
##$ZL2= 120
##$ZL3= 120
##$ZL4= 120
##$ABSF1= 10
##$ABSF2= 0
##$ABSG= 5
##$ABSL= 3
##$ALPHA= 0
##$AQORDER= 0
##$ASSFAC= 0
##$ASSFACI= 0
##$ASSFACX= 0
##$ASSWID= 0
##$AUNMP= <proc_1d>
##$AZFE= 0.1
##$AZFW= 0.1
##$BCFW= 1
##$BC_mod= 2
##$BYTORDP= 1
##$COROFFS= 0
##$CY= -3
##$DATMOD= 1
##$DC= 2
##$DFILT= <>
##$DTYPP= 0
##$F1P= 0
##$F2P= 0
##$FCOR= 0.5
##$FTSIZE= 0
##$FT_mod= 4
##$GAMMA= 1
##$GB= 0.15
##$INTBC= 1
##$INTSCL= 1
##$ISEN= 128
##$LB= 0.25
##$LEV0= 0
##$LPBIN= 0
##$MAXI= 10000
##$MC2= 0
##$MEAN= 0
##$ME_mod= 0
##$MI= 1.114404
##$NCOEF= 0
##$NC_proc= 0
##$NLEV= 6
##$NOISF1= 3.799351
##$NOISF2= 2.8
##$NSP= 1
##$NTH_PI= 0
##$NZP= 0
##$OFFSET= 14.38212
##$PC= 1
##$PHC0= -1199.063
##$PHC1= 13.19254
##$PH_mod= 1
##$PKNL= yes
##$PPARMOD= 0
##$PSCAL= 0
##$PSIGN= 0
##$REVERSE= no
##$SF= 200.129724274929
##$SI= 16384
##$SIGF1= 3
##$SIGF2= 2
##$SINO= 400
##$SIOLD= 16384
##$SREGLST= <1H.CDCl3>
##$SSB= 0
##$STSI= 0
##$STSR= 0
##$SW_p= 3205.1282051282
##$SYMM= 0
##$S_DEV= 0
##$TDeff= 0
##$TDoff= 0
##$TI= <>
##$TILT= no
##$TM1= 0
##$TM2= 0
##$TOPLEV= 0
##$USERP1= <user>
##$USERP2= <user>
##$USERP3= <user>
##$USERP4= <user>
##$USERP5= <user>
##$WDW= 1
##$XDIM= 8192
##$YMAX_p= 0
##$YMIN_p= 0
$$ End of Bruker specific parameters
$$ ---------------------------------
##NTUPLES= NMR FID
##VAR_NAME=  TIME,          FID/REAL,        FID/IMAG
##SYMBOL=    X,             R,               I
##VAR_TYPE=  INDEPENDENT,   DEPENDENT,       DEPENDENT
##VAR_FORM=  AFFN,          ASDF,            ASDF
##VAR_DIM=   8192,          8192,            8192
##UNITS=     SECONDS,       ARBITRARY UNITS, ARBITRARY UNITS
##FACTOR=    0.0002768,     1,               1
##FIRST=     0,             0,               0
##LAST=      2.2672688,     0,               0
##MIN=       0,             -288223,         0
##MAX=       2.2672688,     294685,          0
$$ Real data points
##PAGE= N=1
##DATA TABLE= (X++(R..R)), XYDATA
$$ [...]
1796b51J19l8J11M04o44L72m19M12J24j42j91L17Jl40J48lo6O7Lk49J13K45NK51
$$ -251 -132 -170 -59 345 -299 73 -346 66 190 48 -143 174 175 -165 -17 -20 -86 -19 -16 -265 -152 93 98 349
1820C49l44P2j08M1j61K64m8j10l9k2k4L56k92R5P6n7PJ57k13q9M56l94J03j15
$$ 349 5 77 -31 10 -151 113 65 -45 -84 -106 -130 226 -66 29 105 48 55 212 -1 -90 366 -28 75 -40
1844d0J84r2k08j34L13k94M35k7j23K04l17J12J53l14K07J5K1m3J0n6J68j32J5
$$ -40 144 52 -156 -290 23 -271 164 137 14 218 -99 13 166 -148 59 74 95 52 62 6 174 42 57
1867E7q9k12J24K76Mj72n8J76l28J55Q3j43Q5k1J5K25m8l1J19k98O4O5J13k0l62
$$ 57 -32 -244 -120 156 160 -12 -70 106 -222 -67 16 -127 -42 -63 -48 177 129 98 217 -81 -17 48 161 141 -221
1892b21L82j6p4K2j13L0K37l69N0j26L99j04j50K18m1M2JJ53l42J6J26j01j19
$$ -221 161 145 71 93 -20 10 247 -122 -72 -198 201 97 -53 165 124 166 167 320 -22 -6 120 19 -100
1915a00K58j15j22J95k0j14J08j28N7o7n7K68j98J89k69O8q9L7j59J79J26O9J4
$$ -100 158 43 -79 116 96 -18 90 -38 19 -48 -105 163 -35 154 -115 -47 -136 -99 -258 -79 47 116 130
1938A30o4R6o4K5P3l08J53j35R8J61j6L4r5j45J16l51J59P6J55k47K46k41J61
$$ 130 66 162 98 123 196 -112 41 -94 4 165 149 183 88 -57 59 -292 -133 -57 98 -149 97 -144 17
1961A7k25K49j05j6K27k63q2L50J13k43l53J03K48j0O9j49j9R0j25J12q6K73n56
$$ 17 -208 41 -64 -80 147 -116 -198 152 265 22 -331 -228 20 10 79 -70 -89 1 -124 -12 -98 175 -381
1984c81P22l12j18L12j94LJ10j69K08l1k90J80l16M77m20J36k26N15l54L9j26
$$ -381 341 29 -89 223 29 32 142 -27 181 150 -140 40 -276 201 -219 -83 -309 206 -148 -109 -235
2005b35L20j79L3J72j20J59m32K25N1J01o1j87o5M52j96j3N8r4m0O3j33N4Q7K5
$$ -235 85 -94 -61 111 -9 150 -282 -57 -6 95 34 -153 -218 234 38 25 83 -11 -51 12 -121 -67 20 45
2029D5j11q8M47k66J56k72RQ3r6K32o1o9k81K54j84K19k43J06J33J13j25l03J02
$$ 45 -66 -154 293 27 183 -89 -80 3 -93 139 78 9 -272 -18 -202 17 -226 -120 13 126 1 -302 -200
2052b00L0K37m5j62Q8J8J94M7k99K35k61J06o0L15l16l9J21j54M71k78J59n12
$$ -200 -170 67 22 -140 -52 -34 160 207 -92 143 -118 -12 -72 243 -73 -112 9 -145 326 48 207 -305
2074c05L19l9j1J90p2k27K49j72J63o3Km3L71l56M8np4K11l54k39M39J55l24K79
$$ -305 14 -25 -36 154 82 -145 104 -68 95 32 34 -9 362 6 54 49 -25 186 -168 -407 32 187 -137 142
2098A42K4k80K51j75q1Q6J76J07j96Q3k6r4r5O0J19J92k24mK21k96M7J8L8N2P0
$$ 142 166 -114 137 -38 -119 -33 143 250 54 137 111 17 -78 -18 101 293 69 65 286 -10 37 55 93 145 215
2123B15j06l18N15m52O2PO8j06R0K01j24j22j24M9J97L7l26M1J04R0j88L2J85
$$ 215 109 -209 306 -146 -84 -77 -9 -115 -25 176 52 -70 -194 -145 52 89 -237 -196 -92 -2 -190 -158 27
2146B7j36K40k01m5J91l3k99J40K42j83r5J57q6j24J42J70j24L30n14J4N53k44
$$ 27 -109 131 -70 -115 76 43 -256 -116 126 -57 -152 5 -81 -205 -63 107 -17 313 -201 -187 366 122
2168A22j0q1k92L87j45K0OJ77j31k96M08j72K26k37j95M16k96j58L26j01j69J78
$$ 122 112 31 -261 126 -19 1 7 184 53 -243 165 -7 219 -18 -213 203 -93 -251 75 -26 -195 -17
2190a7R6l71K90k6m8N7q4L86l11J58RJ9N4k02lj24O7K05p1qj50k8k70M21m5j52
$$ -17 79 -292 -2 -28 -76 -19 -103 283 -28 130 139 158 212 10 7 -117 -50 155 84 76 -74 -102 -372 49 4 -148
2216a48J87j1O5k01K30p6j79K24J50l21M3O7J80j12L1pL3l89K15m6L48j52J6j22
$$ -148 39 28 93 -108 122 46 -133 91 241 -80 -37 30 210 98 129 122 155 -234 -19 -65 283 131 147 25
2240B5q5K13m6r4k15L26R1j04j74L06m04K29J66k07J46j33j25J25j41J68O3m09
$$ 25 -60 153 107 13 -202 124 215 111 -63 243 -161 68 234 27 173 40 -85 40 -101 67 130 -279
2262b79M42j8j56K3m0p5J8K3P3j41J37o2P9P5j86Q4l45J79J54K09k36J85k39j56
$$ -279 163 145 -11 12 -28 -103 -85 -62 11 -130 7 -55 24 99 -87 -3 -348 -169 -15 194 -42 143 -96 -252
2286b52L02K08k32j57j58L48q2J09j31j57r6M42j68R8k7k5P2k02O7p6L95l05q1
$$ -252 50 258 26 -131 -289 59 -23 86 -45 -202 -298 144 -24 74 47 22 94 -108 -41 -117 278 -27 -108
2309a08K5j98M61m40L46P2m23N34j17j38r4R7m3q8K80j99K52r4J18k35j29L17
$$ -108 -83 -281 180 -260 86 158 -265 269 152 14 -80 17 -26 -114 166 -33 219 125 243 8 -121 196
2331A96k83M6l6J78k55K57l04K92k2M5K0q7l35K05K8J26J44k72J83P2j16N3M2
$$ 196 -87 -41 -77 101 -154 103 -201 91 69 114 134 47 -288 -83 -55 71 215 -57 126 198 82 135 177
2354A77j18k80L35Q1j00l61O30m62J6P7n2P3J80mm8k88NJ76l02O17m88K01k26
$$ 177 59 -221 114 195 95 -266 364 -98 -82 -5 -57 16 196 192 144 -144 -139 37 -265 352 -136 65 -161
2377a61k6M6L53J1j85k70R9K02l38K75L37m60K36j91J30k6p8P8k86J33k6N9K48
$$ -161 -187 -141 212 223 38 -232 -133 69 -269 6 343 -117 119 -72 58 32 -46 32 -254 -121 -147 -88 160
2400A60l77k4K94P3n62N13r4n1O8r0K94l66o6L97o4k32P7k6J63j80L13k68r5j25
$$ 160 -217 -241 53 126 -436 77 -17 -68 0 -90 204 -162 -228 169 105 -127 -50 -76 87 -93 220 -48 -143 -268
2424b68N16j19k1k25L4J03l6L05l93NJ02N9J00k4k27K09p6K7J5P0m8k14J20k43
$$ -268 248 129 108 -117 -83 20 -16 289 -104 -99 3 62 162 138 -89 120 44 71 86 156 108 -106 14 -229
2448b29M05j57K1m5J31p4j58L04k78J02q9J22k28K7nJ45o6J51j69Q3j57K7J19
$$ -229 176 19 40 -5 126 52 -106 198 -80 22 -67 55 -173 -146 -151 -6 -72 79 -90 -7 -164 -137 -18
2471a8J22J1j43L0J46l0O8j32K9l27M35k86K17m4j14jp7J08R3j18J66pj48O1j16
$$ -18 104 115 -28 2 148 118 186 54 83 -244 191 -95 122 78 -36 -37 -114 -6 87 -31 135 128 -20 41 -75
2496g5nK13j04J77M8j67j06J01R8k61l6L1qq0K12K2m4J23J36l14J23r3J07R0l20
$$ -75 -80 133 29 206 254 87 -19 82 180 -81 -117 -86 -94 -174 38 60 16 139 275 -39 84 -9 98 188 -132
2521a32K77m2J87l3m04Q4K9L7M8p1K49m16N07n37K56n2q4l7K78M5J0l61R7k00
$$ -132 145 103 290 257 -147 -63 -34 3 51 -20 229 -187 320 -217 39 -13 -97 -134 144 189 199 -162 -65 -265
2545b65K25j42M16k15P4J06m09JJ90j77J73k98K01K09J07m13k14P90o59L07q3
$$ -265 -40 -182 234 19 93 199 -210 -209 -19 -196 -23 -321 -120 89 196 -217 -431 359 -300 7 -76
2566g6J33j3M4k08R8j03K05j02o7OK65k97lK60k38q0m8K89j13j5k4J90j90Q7k22
$$ -76 57 44 88 -120 -22 -125 80 -22 -89 -83 182 -115 -118 142 -96 -176 -224 65 -48 -63 -87 103 -87 0 -222
2591b22Q1K94q2j74K41l02j09K70O1k40K77j51m7J09O1r5j28L05n9m44L44k03
$$ -222 -141 153 71 -103 138 -164 -273 -3 58 -182 95 -56 -103 6 67 -28 -156 149 90 -354 -10 -213
2613b13K06J21J9j7j10J34L7L3k01m1K55q7l66L23j43j0j08L46k56R4j61J29J5
$$ -213 -7 114 133 116 6 140 177 210 9 -32 223 136 -230 93 -50 -60 -168 178 -78 16 -145 -16 -1
2636ao4j6J57r5l38M18J7p9L31k97n5k39J96L79m27O6J6n4J95l7N2k09K99j91
$$ -1 -65 -81 76 -19 -357 61 78 -1 330 33 -22 -261 -65 314 -113 -47 -31 -85 110 73 125 -84 215 24
2660B4J29jr8Q2R3l14J13k10N0K61k36P2j1N4L23k8k26j41N1j76L42j2j06J3K13
$$ 24 153 152 54 136 229 -85 28 -182 -132 129 -107 -35 -46 8 331 303 77 -64 -13 -189 153 141 35 48 261
2685B61k24kr8K80K14n24L92m21rK40k30L16k78O0K8N1r6m8L75l23j4J21o2k5
$$ 261 37 35 -63 217 431 -93 299 -122 -131 109 -121 195 -83 -23 5 56 -40 -88 287 -36 -50 71 9 -16
2709a6J5p6J61k00L55k13J4R0J17l32L25l5j07J0p4N6N2k17J36j72j08L43r6q9
$$ -16 -1 -77 84 -116 239 26 40 130 247 -85 240 205 98 108 34 90 142 -75 61 -111 -219 124 28 -61
2733f1J65r1Rk99K77j61P2J73p2P3l2m6p6K9J05l6j83J30j70jK36J17R0r4q5j74
$$ -61 104 13 22 -277 0 -161 -89 84 12 85 53 7 -69 -40 65 29 -154 -24 -194 -195 41 158 248 154 69 -105
2759a05P7o8J19nO4l2J8k20l2L47k29O1J52l5qk32L04k23m5m7K90j74J70j45J64
$$ -105 -28 -96 23 18 82 50 68 -152 -184 163 -66 -5 147 112 104 -128 176 -47 -92 -139 151 -23 147 2 166
2784A66m43J95K83j22k88J54L16l08j11j18L07L7R2l1p0l36M25j42j09J55R2j03
$$ 166 -277 -82 201 79 -209 -55 261 -47 -158 -276 31 68 160 129 59 -277 148 6 -103 52 144 41
2806D1k54L39l2l78K55Lj91M05l14J65k0K5j0Jp1j30j9M48l42K03J16l81O9k7
$$ 41 -213 126 94 -284 -29 -26 -217 188 -126 39 19 44 34 35 -36 -166 -185 263 -79 124 240 -141 -72 -99
2830i9j26K26j38J50n8O8J8j14O3j72o2J75k60L35K5k58M73J84m19P0km5K21j36
$$ -99 -225 1 -137 13 -45 23 41 -73 -10 -182 -244 -69 -329 6 31 -227 246 430 11 81 79 34 255 119
2854A19j48oj87J53M68m89R6O9J45l45J2j97K67J53k91O12k57k66kK20J1j73J60
$$ 119 -29 -35 -222 -69 399 -90 6 75 220 -125 -113 -310 -43 110 -181 431 174 -92 -94 126 137 -36 124
2877A24j00p8J9O3M3LK35n07J78J68j4l00JK56l06n3K43k9k11L62j98r9K05J18
$$ 124 24 -54 -35 28 71 74 309 -198 -20 148 134 -166 -165 91 -215 -268 -25 -54 -265 97 -101 -200 5 123
2901A23M4n46L43K54k80J24l3ln2k5J14l17J25j8Kl3J32p8L6j28M89j17j01J12
$$ 123 167 -379 -36 218 -62 62 29 26 -26 -51 63 -254 -129 -147 -145 -178 -46 -124 -88 -216 273 156 55 167
2925A67k89K3J7PR3r7K7L06j68p2O9m3R5j37R9j63j35K12j07k05M65kk56J82j18
$$ 167 -122 -99 -82 -75 18 -79 -52 254 86 14 83 40 135 -2 97 -66 -201 11 -96 -301 164 162 -94 88 -30
2950c0q0J83p2k08K29k9Q4J42k47J77l09j02L31N4n7J04n2k39K58K23l17J48m16
$$ -30 -110 73 1 -207 22 -7 77 219 -28 149 -160 -262 69 123 66 170 118 -121 137 360 43 191 -225
2973b25K83j12q7O9J80k09M3j1k61K29K26j58k2J55j08k5K32k64k97L98q1L13
$$ -225 58 -54 -141 -72 108 -101 -58 -69 -330 -101 125 -33 -55 100 -8 -33 199 -65 -362 36 -45 268
2995B68m23J17j9m5N3j55L8J63j17J49N0K1N5j14k02Q7K9j21j31L47r6k22Q1L72
$$ 268 -155 -38 -57 -102 -49 -204 -166 -3 -120 29 79 100 155 41 -161 -74 -45 -166 -297 50 -46 -268 -187 185
3019A85K9l52q7J17P7j21O8K22k35R4J81l61L18j64l4J58l08J39P4l68L56j92
$$ 185 214 -138 -225 -108 -31 -152 -84 138 -97 -3 178 -183 135 -29 -63 95 -213 -74 0 -368 -12 -204
3041b04j04M57k15M93l69Q5k40r6K01J69K2l54L12j17j1k19M9mM11K8m29J51J29
$$ -204 -308 149 -66 427 58 143 -97 -193 8 177 199 -155 157 40 29 -190 -141 -145 266 294 -135 16 145
3064A45n0k2L1J29l32K32l49P6j20L57j38k0N0J52k5j64K4M14l90qj38JM08R6
$$ 145 95 73 104 233 -99 133 -216 -140 -260 97 -41 -61 -11 141 116 -48 -24 390 0 -8 -146 -145 263 359
3088C59n81J05K73l28O4kJ03j18R5K01j82o2J17J5nJ56rk00j0J89m03J0J31K39
$$ 359 -222 -117 156 -172 -108 -110 -7 -125 -30 171 -11 -73 44 59 54 210 201 1 -9 180 -223 -213 -82 157
3112A57j69L62m40O3j59L79n21L27J1j12p2l4L75j92J74jj22K64l53l0J45M8K9
$$ 157 -12 350 -90 -27 -186 193 -328 -1 10 -102 -174 -208 167 -25 149 148 26 290 -63 -93 52 100 129
3135A29j6k17K79j17j1j5k21K40J61l73L7J90j80L03N2j69J0N1j98r7N9j65J43
$$ 129 113 -104 175 58 47 32 -189 51 212 -161 -124 66 -114 189 241 72 82 133 -65 -162 -103 -268 -125
3158a25K85m41MJ94J9J32j64L5PM6j39N07n99L10j45J01J82l25K02O4l01J37N4
$$ -125 160 -281 -277 -83 -64 68 -96 -61 -54 -8 -147 360 -239 71 -74 27 209 -116 86 150 -151 -14 40
3181D0M5j39K54j40k12L39m14L40k41L0O7J45k18K45j35k12K2R4j52L19k51J61
$$ 40 85 -54 200 60 -152 187 -227 113 -128 -98 -31 114 -104 141 6 -206 -184 -90 -242 77 -174 -13
3203a3p4L8nm01L50J00j31J7K62k04K16J92k91J91l38O2N3r3m4J40mL2j91J82
$$ -13 -87 -49 -54 -455 -105 -5 -136 -119 143 -61 155 347 56 247 -91 -29 24 -69 -113 27 23 55 -136 46
3227D6M4j40kK0N6J69J47l30L8L1j22K86k46O4M8j45ok0K22j76J13l75M32l51
$$ 46 90 -50 -52 -32 24 193 340 10 48 79 -43 243 -3 61 109 -36 -42 -62 160 -16 97 -278 154 -197
3251a97M48l80J49k39J73J05j11O3O2K34k31k49J25j28J99k13J08Q9J11j55j1
$$ -197 251 -129 20 -219 -46 59 -52 11 73 307 76 -173 -48 -176 23 -190 -82 7 118 -37 -48
3272d8K15j38J2L65n12J35K56k86p9j85R4mK76j5j48M3J04k72L07P7k35rj12K88
$$ -48 167 29 41 406 -106 29 285 -1 -80 -265 -171 -175 101 86 -62 -19 85 -187 120 197 -38 -47 -159 129
3296A29q5l5q5K42p9k73M41j31l23P0n9K47Mk56M47m64K33j92K94q2P0J63l61
$$ 129 44 9 -76 166 87 -186 255 124 -199 -129 -188 59 63 -193 254 -210 23 -169 125 43 113 276 -85
3319h5J13j55L3J06J24k16J3j46K23J55m47L02R9j24J39l8j8jM5j92R1l54K85
$$ -85 28 -127 -94 12 136 -80 -67 -213 10 165 -282 20 119 -5 134 96 78 77 122 -70 21 -333 -48
3342d8O8J53k85p7M7j4K13o6l6K19j56J17j42k5M2j56K85p8O1M8k86L53l07K18
$$ -48 20 173 -112 -189 -142 -156 57 -9 -45 174 18 135 -7 -32 10 -146 139 61 122 170 -116 237 -70 148
3366A48j69m5L9j8L11k08mJ09j05O9j12k31L11k97K30P1j13p4J23k13p3R7M73
$$ 148 -21 -66 -27 -45 266 58 54 163 58 127 15 -216 95 -202 28 99 -14 -88 35 -178 -251 -154 319
3389C19o70L45J07j04M6J5j52L32j85J05l23L75n35N55k25J1k40OK52r8j12K17
$$ 319 -351 -6 101 -3 43 58 -94 238 53 158 -165 210 -325 230 5 16 -224 -218 34 -64 -176 41
3411D1K86l93No6K22q2j2J33m9q7l8L0j94N50l68nj16n7MK67L1j83M82m52J93
$$ 41 327 -66 -61 -127 95 13 1 134 85 -2 -40 -10 -204 346 -22 -27 -143 -200 -196 71 102 -81 401 -51 142
3436A42k83q1L05j56K83j92J06k90J79j08O7k2L0r5J67P8J7Q5m11K23P7l81L30
$$ 142 -141 -222 83 -73 210 18 124 -166 13 -95 -28 -50 -20 -115 52 130 147 232 -179 44 121 -260 70
3459G0J83k85J32p0J45J78m15n5o7K61L8j43J83j54K5Rk37MM8k24O01j63R8l58
$$ 70 253 -32 100 30 175 353 -62 -117 -184 77 115 -28 155 1 26 35 -202 -198 -150 -374 227 64 162 -196
3483a96J0M59m02K55k44Q5qj45L12k81K57M1o42M58q3p8M51l89j71M23om34K58
$$ -196 -186 273 -129 126 -118 -33 -41 -186 126 -155 102 143 -499 -41 -124 -202 249 -140 -311 112 106 -328 -70
3506g0j2J7pP7J01j10pN1p4O4j3J24k43K89j03q5nJ90o76N98j87R2j67K29p0R0
$$ -70 -82 -65 -72 5 106 -4 -11 40 -34 30 17 141 -102 187 84 -1 -6 184 -492 106 -81 11 -156 73 3 93
3532I3k29o2L55j32J95m04l7j4K26jj02J63j3m3j7P2K29l84J08o9J38R5k20J16
$$ 93 -136 -198 157 25 220 -184 -221 -235 -9 -10 -112 51 38 -5 -22 50 279 -105 3 -66 72 167 -53 63
3556F3Ok98L49n2L4r6m6L16k96P1k14L09K5j84p5J42k95Q5K81J90k03M5j16j9
$$ 63 69 -229 120 68 102 6 -40 276 -20 51 -163 146 171 -13 -88 54 -241 -156 125 315 112 157 41 22
3580B2j6Rk29J99R3k61M20k75n9p2J74k55L8M15l20K74N3l50J71J11q1j83N8J54
$$ 22 6 15 -214 -15 78 -183 237 -38 -97 -169 5 -250 -212 203 -117 157 210 -140 31 142 61 -122 -64 90
3604I0j43J87j75L1R0k58J18K9R0k25K85k58N00m61K48j28J61l08L62k12L43k96
$$ 90 -53 134 -41 -10 80 -178 -60 -31 59 -166 119 -139 361 -100 148 20 181 -127 235 23 366 70
3626G0o6q1p3l5K80j13K16j85nJ08k18K18l12J70q9O4J9K83k52mp8K79j80Nj4
$$ 70 4 -77 -150 -185 95 -18 198 13 8 116 -102 116 -196 -26 -115 -51 -32 251 -1 -5 -83 196 16 21 7
3651G%O1M7J1j30j0n7N6m3J00p3K0J54j85K9J72j72j42n3J65N6p0J45l9k21L40
$$ 7 7 68 115 126 -4 -14 -71 -15 -58 42 -31 -11 143 -42 -13 159 -13 -155 -208 -43 13 -57 88 49 -172 168
3677A68j58j08K02k52K55k41K43o0J17O4j28n2MJ9N2k73J89j7L58p16L58j71L1
$$ 168 10 -98 104 -148 107 -134 109 49 166 230 102 50 54 73 125 -148 41 24 382 -334 24 -147 -116
3700a16q7K07k17L82k07M5K30q8k05J95k25J2J23k23K22M2j05J45q1J96k48k29
$$ -116 -203 4 -213 169 -38 7 237 149 -56 139 -86 -74 49 -174 48 90 -15 130 49 245 -3 -232
3722b32q5L98L4k63K07J44j9l97K73k14r0L70j84Rj08L48k08Q2L5l19K20m1P5
$$ -232 -317 81 115 -148 59 203 184 -213 60 -154 -244 126 -58 -49 -157 191 -17 65 100 -219 1 -40 35
3745C5R0j24Q7j48J89j2k53J79J41k97R6j93J22J24k69K78j8L2N0j01J15q0j42
$$ 35 125 1 88 -60 129 117 -136 43 184 -113 -17 -210 -88 36 -233 45 27 59 109 8 123 43 -99
3768i9L11n0k37K60k13K7o5o9L94q5q3R8J07o32M82m5j40o3K6P1R7j82kJ03nj67
$$ -99 212 162 -75 185 -28 -1 -66 -135 259 174 91 189 296 -336 146 101 -39 -102 -76 -5 92 -90 -92 11 6 -161
3794a61J61l8r3j33J24L21L0k11M6j06j52K58J6l7n5j01r6R7K13o0oJ06p2n0K32
$$ -161 0 -38 -131 -264 -140 181 211 0 46 -60 -212 46 62 25 -30 -131 -227 -130 83 23 17 123 51 1 233
3819B33j40J11l24R2J83j71n9J25q7p8J15j05K06Qk24M1j69K26q5P4%Oj38O9j38
$$ 233 93 204 -120 -28 155 -16 -75 50 -37 -115 0 -105 101 109 -115 -74 -243 -17 -102 -28 -28 -22 -160 -91 -229
3844b29N7K48k61L32j70j87J09j00j5M06l78L46J27l06pn0L11j48P8k50l2k26
$$ -229 -172 76 -185 147 -23 -210 -101 -201 -216 190 -188 158 285 -21 -28 -78 233 85 163 -87 -119 -345
3866c45L05Q6J31l01K77j23N3M0l21q2L08J74k70k9r5k00N48k88K11J08l38j02
$$ -345 -40 46 177 -124 153 30 83 123 -198 -280 28 202 -68 -97 -192 -392 156 -132 79 187 -151 -253
3888b53mM3K89%O5m3K04k23o9r1L80l07j38P9R2n1m4Q7q8N0J85j85K40k00j79
$$ -253 -257 -214 75 75 140 97 301 78 9 -82 298 -9 -147 -68 24 -27 -71 16 -72 -22 163 -22 218 18 -161
3913a61K63l4j85J33j4j53M42k37k0k57J21J91R8r1l61M0J44K16j7O8j9q4n2j28
$$ -161 102 68 -117 16 2 -151 291 54 34 -223 -102 89 187 96 -265 -225 -81 135 118 186 167 83 31 -97
3937i7r1J34k33L53O3k15K2O1Q9L7k5j87r9K58k16J24J29l19K77r4O8M08n48J62
$$ -97 -188 -54 -287 66 129 -86 -64 -3 86 123 98 -89 -188 70 -146 -22 107 -212 65 -29 39 447 -101 61
3961F1j00L60j10P9l31J27K10m50J08j00mL61m55k3L34Q2k72J90nj33P2N8J55
$$ 61 -39 321 211 290 -41 86 296 -154 -46 -146 -150 211 -244 -267 67 149 -123 67 62 -71 1 59 214
3984B14l55K01r1J09j3p4o4J74o0j07M0r3J46n7j8J43j73J82o6l65N78l19m5O6
$$ 214 -141 60 -31 78 65 -9 -73 101 41 -66 -26 -119 27 -30 -48 95 -78 104 38 -327 251 -68 -113 -47
4008d7r8K34P1k72J18rJ12l22Q9J56k6j34Q7K35q3j17j45J91K8j78K11j06J38
$$ -47 -145 89 160 -112 6 -3 109 -213 -124 32 6 -128 -41 194 111 -6 -151 40 68 -110 101 -5 133
4031A33l47J2P2J84P1j13q8O1P3J80L8k99J03ok19J93J89k87L18k23k62K09K7
$$ 133 -214 -202 -130 54 125 12 -76 -15 58 238 276 -23 80 74 -145 48 237 -50 268 45 -217 -8 19
4054A9k46L60j63Pk33J28J69m0N3O0j24j00R6j54j3J97q9J24j52K79j03k22J53
$$ 19 -227 133 -30 -23 -256 -128 41 1 54 114 -10 -110 -14 -168 -181 16 -73 51 -101 178 75 -147 6
4077FJ4q4K3k13L08j32J79j62J49R4M1l75L45j01M2l06K83N0k25L2N9L8J04j72
$$ 6 20 -64 -41 -254 54 -78 101 -61 88 182 223 -152 193 92 134 -172 111 161 -64 -32 27 65 169 -3
4101cj1J74k21Jk27J77K52M6k70Q0J81o0j27l8J70l49j9J92J01Jp3K48m86L46
$$ -3 -14 160 -61 -60 -287 -110 142 188 -82 -2 179 119 -8 -46 124 -225 -244 -52 49 50 -23 225 -261 85
4125H5J24j60J47j73j47R5O2K7j13J10l76K36J3pJ21N8Jj00rj5M7J1L1k78K91
$$ 85 209 49 196 23 -124 -29 33 60 -53 57 -319 -83 -70 -77 44 102 103 3 -6 -21 26 37 68 -210 81
4150H1J5k57J69M1l12L09P8j88K55k07J6j78K96k03q7J17k8Q5o7J90j1K91k93
$$ 81 96 -161 8 49 -263 46 124 -64 191 -16 0 -178 118 -85 -172 -55 -83 2 -65 125 114 405 112
4173A12j58L9j15L07m0J09k53M9J01r8j80o1K55r9k4P2K02j34J0j36j23J90o3
$$ 112 -46 -7 -122 185 145 254 1 50 151 53 -127 -188 67 -32 -56 16 218 84 94 -42 -165 25 -38
4196c8O3oj84J31M3J48m3j54nO7L7M9mm6q5p2R8L15m70M0P8Q7m5l0q3Q7P7j25
$$ -38 25 19 -165 -34 9 157 114 -40 -45 22 59 108 104 58 -27 -99 -1 314 -156 -116 -38 49 4 -26 -109 -22 55 -70
4224g0Ol5R4J0J86L3j90l1j37L51l63O7L86p1l46K61l03L36l75L83j28l36N12
$$ -70 -64 -99 -5 5 191 224 34 3 -134 217 -146 -79 307 236 -110 151 -152 184 -191 192 64 -272 240
4247B40j94K69m18j60K85K3p2K24p7k76J64Jr3L20o23P01k57j82K36n71M58r0
$$ 240 46 315 -103 -263 22 45 -27 197 120 -156 8 9 -84 236 -387 314 57 -125 111 -460 -2 -92
4269i2J12R2l08K39p0J92k75J15j06K1K6J06K5j09j60K80J4K3k51p5K67J7m05
$$ -92 20 112 -196 43 -27 165 -110 5 -101 -80 -54 52 77 -32 -192 88 102 125 -126 -201 66 83 -322
4292c22K86j13K17q3R5j46Q4l26j88N77Q6k31O5o7L3j19K9M01l51J02j99J12K6
$$ -322 -36 -149 68 -15 80 -66 18 -308 -496 81 167 -64 1 -66 -33 -152 -123 278 -73 29 -170 -58 -32
4315c2j82K13N9j38Q2M7k15M4K53k98P5K15n1k30K00J4j44j1j22L65k45P3N7j08
$$ -32 -214 -1 58 -80 2 49 -166 -122 131 -167 -92 123 72 -158 42 56 -88 -99 -221 144 -101 -28 29 -79
4339g9j66K58m9K15k47j06K63q8J64l40J41J33Ok24Q1n4L75j0J7j61km7k28m9
$$ -79 -245 13 -36 179 -68 -174 89 1 165 -175 -34 99 105 -119 -38 -92 283 273 290 129 127 80 -148 -197
4363a97J50lp3OJ33K65j88M3j34K10N8j47j82J01j06Ok4J60o4O6N4k90K0K38j10
$$ -197 -47 -50 -123 -117 16 281 93 136 2 212 270 123 -59 42 -64 -58 -82 78 14 80 134 -156 -136 102 -8
4388hL60n70j16K78K3Q3L7k41J77k70L95j01oK94m22o4J09K8j69J08K51PO5O7
$$ -8 352 -218 -334 -56 -33 50 87 -154 23 -247 148 47 41 335 -87 -151 -42 -14 -183 -75 176 183 248 315
4412C15n05M07n9j73J55l02J18L05k97j04J07m3j81J13Q6k66M75l17L38j23j94
$$ 315 -190 217 158 -15 140 -162 -44 261 -36 -140 -33 -76 -257 -144 -58 -324 151 -166 172 49 -145
4433a45N8J50j69K06k0l23J30J90k84L32j09R1K26l15L4k23L60l86L18q7L28j58
$$ -145 -87 63 -106 100 80 -243 -113 77 -207 125 16 107 333 18 52 -171 189 -197 121 34 362 204
4455B04q3K87l75J09M1k63L42k09l6M4j64K11j48j18L28j82l66P1M23k55r1p2
$$ 204 121 408 33 142 183 -80 262 53 17 61 -103 108 -40 -158 170 -12 -378 -307 116 -139 -230 -302
4477c02K69q3K12j75K3J27nm0j16L23j77L09j97j45j30P1j2J44j5k04j0J75j04
$$ -302 -33 -116 96 -79 -56 71 66 26 -90 233 56 365 168 23 -107 -36 -48 96 81 -123 -133 42 -62
4500f2O4l0K5lk63L19K6j75j28L25R5r6J51n69L50m3k0Q0p3J53o28M2O51o2p7
$$ -62 2 -28 -3 -6 -269 50 76 -99 -227 98 193 97 248 -321 29 -14 -34 46 -27 126 -502 -460 191 129 52
4525E2o9j76Q7J05O8r5j4K0j94K51J03q6q8P7k09J71J2K2K20l23J26M5m44L39
$$ 52 -17 -193 -106 -1 67 -28 -42 -22 -216 35 138 52 -36 41 -168 3 15 37 257 -66 60 105 -339 0
4549@r4K19M8Pm9Q7k21M7q3J93p1k39l3M55l68M66j3q39L35o7K84j05Pk51L73
$$ 0 -94 125 173 180 131 218 -3 44 -39 154 83 -156 -189 266 -102 364 351 -488 -153 -220 64 -41 -34 -285 88
4574H8q6k27K20rJ05N6m83K58K86k39j01K69n37M64l14L10k23J42Q7MN9l29J42
$$ 88 2 -225 -5 -14 91 147 -336 -78 208 -31 -132 137 -400 64 -250 60 -163 -21 66 70 129 -200 -58
4597e8rk69M21k08J59J76o9K1j19n3j3m1J93l3k02j1L50p6j13k53J12Q2k0m3M3
$$ -58 -67 -336 85 -123 36 212 143 164 45 -8 -21 -62 131 98 -104 -115 235 159 46 -207 -95 -13 -33 -76 -33
4622c3R0k35J20j58n1K12%j6J96j36l33L87k67M87l61QJNo4J82j18L9q2J93l1
$$ -33 57 -178 -58 -216 -267 -55 -55 -71 125 -11 -344 43 -224 263 -98 -90 -89 -84 -148 34 -84 -45 -127 66 35
4647C5j49M74m21j38L25K1k60J35k56J33K50q9N8j83J90p1n1k0J44P6j69J67j56
$$ 35 -114 360 -61 -199 126 147 -113 22 -234 -101 149 60 118 -65 125 54 3 -17 127 203 34 201 45
4670D5M8r6K03m37Q1L32j17l03N95l58QL54l84O3kj7K3j1M8j83r4M45m57K98j02
$$ 45 93 -3 200 -237 -156 176 59 -244 351 -7 1 355 -29 34 32 15 38 27 75 -108 -202 243 -214 84 -18
4695a8J22l31P8J96o2JK36j99m7k33N12k19Oj04J18M9K1r8k65K79k16L78k65J66
$$ -18 104 -227 -149 47 -15 -14 222 23 -24 -257 255 36 42 -62 56 105 126 28 -237 42 -174 204 -61 105
4719A05m65M81k02K09j21J32r7R8k6j33J44pk7k71K42k81L29o2j17R5L90m29J81
$$ 105 -360 121 -81 128 7 139 42 140 114 -19 125 118 91 -180 62 -219 110 48 -69 26 416 -13 168
4742A68m60M65j69K18k12j99LJ88r1J4r1J43J74p9j53O0p6L40l69K12J20k60R2
$$ 168 -292 173 4 222 10 -189 -186 2 -89 -75 -166 -23 151 72 -81 -21 -97 243 -126 86 206 -54 38
4765C8j2j99K3J64j56R4j59J7K04J3L6J9on6l62M34j05N9j18K69k43J14k85K01
$$ 38 26 -173 -150 14 -142 -48 -207 -190 14 27 63 82 76 20 -342 92 -13 46 -72 197 -46 68 -217 -16
4789a6L5r1M4j71K38j24k15K71r6R9K56l07l5J13K8n3K6j42J23k03L78n0J7M3
$$ -16 19 -72 -28 -199 39 -85 -300 -29 -125 -26 230 -77 -112 1 29 -24 2 -140 -17 -220 158 108 125 168
4813A68l10J57o3o6K92L0n08K43m4l5q2QK71k25K49k94M07l23J72p2J22j51j06
$$ 168 -142 15 -48 -114 178 208 -300 -57 -101 -136 -218 -210 61 -164 85 -209 198 -125 47 -25 97 -54 -160
4836a60K68Rj92L9J12L8l51O0J0J48J23j39K40l37K79j34n2n5P2qj59M11L8j68
$$ -160 108 117 -75 -36 76 114 -237 -177 -167 -19 104 -35 205 -132 147 13 -39 -94 -22 -30 -189 222 260 92
4860I2j32K42k87J0J51L6p9j04P8m9k21L7K45R1k94l6L20k16J08J87M0n63N24
$$ 92 -40 202 -85 -75 76 112 33 -71 7 -42 -263 -226 19 110 -184 -220 100 -116 -8 179 219 -344 180
4883A80j93J18j34J81j72m1K00j0k71J03J6J6l7k9j91M1l3L41J50j19m4m2N6j04
$$ 180 -13 105 -29 152 -20 -61 139 129 -142 -39 -23 -7 -44 -73 -264 -223 -256 85 235 116 72 30 86 -18
4907a8N4o1K51P8l97M07j22l66P3R9J0m8K53l04J80j86L77l56K80l75P2j03M56
$$ -18 36 -25 226 304 -93 314 192 -174 -101 -2 8 -40 213 -91 89 -97 280 -76 204 -171 -99 -202 254
4930B54q1J05l09o5J03K28j21l63K64L0j78l6J39Nj09K03NJ15k20k51K83j06K10
$$ 254 173 278 -31 -96 7 235 114 -249 15 45 -133 -169 -30 -25 -134 69 74 189 -31 -282 1 -105 105
4953A05o9k64K09j04Q8P3j88L6P9K8J1l0r7J77J69n0m76N90l88J19r3m1Q8k15
$$ 105 36 -228 -19 -123 -35 38 -150 -114 -35 -7 4 -26 -123 54 223 173 -303 287 -101 18 -75 -116 -28 -243
4977b43M79j24j87J73q4r1j43n3J62L23n5j70J60P5m65K22O6M0l73L28j92L03
$$ -243 236 112 -75 98 14 -77 -220 -273 -111 212 157 -13 147 222 -243 -21 45 85 -288 40 -152 151
4999A51l6k44k4K63o1L5L35k26r2k41l1L31l71J04k19J14J69J20k61L98k68J30
$$ 151 115 -129 -153 110 49 84 419 193 101 -140 -171 160 -211 -107 -326 -212 -43 77 -184 214 -54 76
5021G6M2k41J58m97M48j14J42P3l45J38o1M46k05k75L25L0j26k47M06k31K41Q7
$$ 76 118 -123 35 -462 -14 -128 14 87 -258 -120 -181 265 60 -215 110 140 14 -233 173 -58 183 270
5043B70n01m6K45P2m3n0N7l7J26k8jm9J41P9j47j34K17j07J20O6k30M5M3j75j43
$$ 270 -231 -277 -32 40 -3 -53 4 -33 93 65 64 15 156 235 88 -46 171 64 184 250 20 65 108 -67 -210
5068b10K49n4o3J57J30p8k6j62K25l29mL43p6P3k49K25k48J44j0J8m6j49M60l36
$$ -210 39 -15 -78 79 209 131 105 -57 168 -161 -165 178 102 175 -74 151 -97 47 37 55 9 -140 320 -16
5092a6J60k3j51L7j01q8J20J65j52j10j8nK11p1j20k9k86M23j14L00p8k6j71L75
$$ -16 144 121 -30 7 -94 -182 -62 103 -49 -159 -177 -182 29 -42 -162 -191 -477 -54 -168 132 54 28 -143 232
5116B32j75K29j96k5J18k19k68L80p8R7j39R7J86j62k4q7J36J02J09k10P0R1l26
$$ 232 57 286 90 65 183 -36 -304 76 -2 95 -44 53 239 77 53 -34 102 204 313 103 173 264 -62
5139f2lJ67k74J96o1K14n41L58M0l24L09j96k39PL96j21j4KP5KK60l37M27l21
$$ -62 -65 102 -172 24 -37 177 -364 -6 34 -290 19 -177 -416 -409 -13 -134 -148 -146 -71 -69 191 -146 281 -40
5163d0j67J22lj9N44m76K34n5j75m6k7j07J27j00J9JK83k04j59J25K5K03Nn02
$$ -40 -207 -85 -88 -107 437 -39 195 140 -35 -81 -108 -215 -88 -188 -169 -168 115 -89 -248 -123 -98 105 110 -392
5187c92K36J27j60K53R3R8k28J45j34j1k05L07l79J88L5q4L3k19L84k00m9L49
$$ -392 -156 -29 -189 64 157 255 27 172 38 27 -178 129 -250 -62 -27 -111 -78 -297 87 -113 -162 187
5209A87q0j05j12J20K3j43N7j1j01n8K64L9R2j57Lj02J43k42J77m4J46l23L45
$$ 187 107 2 -110 10 33 -110 -53 -64 -165 -223 41 80 172 15 18 -84 59 -183 -6 -50 96 -227 118
5232A18o9J2j8j79K15K8j63J06N6J22l87J28J49j41J44k66J75Q2l7k67K30q0R4
$$ 118 49 61 43 -136 79 107 -56 50 106 228 -159 -31 118 -23 121 -145 30 112 75 -192 38 -42 52
5255E2r9L8J49rk90J70J72n3j79J36n3j34L00k38o2P3J16Q0m40N72k00k21N42
$$ 52 -47 -9 140 131 -159 11 183 130 -49 87 34 -100 200 -38 -100 -27 89 169 -271 301 101 -120 422
5278D22l85J30k17l6L1J41k0J84j66m53N28j18k15J49k8J15l5mk21L8L08N3j89
$$ 422 37 167 -50 -86 -55 86 66 250 84 -369 159 41 -174 -25 -53 62 27 23 -198 -160 148 201 12
5301A2k9J33m10L18j01J79o1m27M02o8P8J5l51R1K17K03o2m01J28R6j04N42k37
$$ 12 -17 116 -294 24 -77 102 41 -386 16 -52 26 41 -310 -219 -2 201 139 -262 -134 -38 -142 400 163
5324A63k5k48K33k04j4J66K32m77K27j07L9L5j32j16N66o23K46J60Lj43j72p9
$$ 163 138 -110 123 -81 -95 71 303 -174 53 -54 -15 20 -112 -228 338 -285 -39 121 124 -19 -191 -270
5346b70L43m4j00K14J15j05n46N16j42p8J35j13K6J70j46j07K20M17o10m6J41
$$ -270 73 29 -71 143 258 153 -393 123 -19 -97 38 -75 -49 121 -25 -132 88 505 -105 -151 -10
5367a0q5j98M05j43Q2r6l9j46R2O7J21l0o5j19J93J30l34p9L66m0O8R4l51K84
$$ -10 -95 -293 112 -31 51 -45 -84 -230 -138 -71 50 20 -45 -164 29 159 -175 -254 112 72 140 234 -117 167
5391A67k17J86j07o6J21j71j03L24J06l54L14k29k5k4R4J05J9m90J43J75Q1J32
$$ 167 -50 136 29 -37 84 -87 -190 134 240 -114 200 -29 -54 -78 16 121 140 -350 -207 -32 49 181
5413A81k16k79K24J55j39J25j93L1K04J26k71L42m23K11k98L47k10K27k15ml70
$$ 181 -35 -314 -90 65 -74 51 -142 -111 93 219 -52 290 -133 78 -220 127 -83 144 -71 -75 -445
5434d45K40J37j40K32j73J1L41k25J13jj99M5r5j1J70J68q7m1k66K39J5l50M06
$$ -445 -205 -68 -208 24 -149 -138 203 -22 91 90 -109 -64 -159 -170 0 168 81 40 -226 13 28 -322 84
5457H4O0j71l16l6K89L8l5o2M8J21k02L69j97J07j00j28J75o6P3l31K53K8N1N1
$$ 84 144 -27 -343 -379 -90 -52 -87 -149 -101 20 -182 187 -10 97 -3 -131 44 -22 51 -280 -27 1 52 103
5481A03k9j38P5K6m8N4J70j68j31J22k7p4m2K09q9o9K11j16J99m95K49K83l51
$$ 103 74 -64 11 37 -11 43 213 45 -86 36 9 -65 -107 102 13 -56 155 39 238 -257 -8 275 -76
5504g6N1J61l4Q7j10j9k7j48j44L81j24k54L49m33K85p5K06Q2k20j49K02k64N9
$$ -76 -25 136 102 189 79 60 33 -115 -259 122 -2 -256 93 -340 -55 -130 76 158 -62 -211 -9 -273 -214
5527b14R7o4K12l5n4l6L0n8K8L49k98J8J24J10l84j6K27N9k87J23j02J99J2j36
$$ -214 -117 -181 31 -4 -58 -94 -64 -122 -94 255 -43 -25 99 209 -175 -191 36 95 -192 -69 -171 28 40 -96
5551i6L4Q3j03j30K89j96J40l5l6J71j09j04J31J29j09j07j13R1L2K06k10M8j13
$$ -96 -62 21 -82 -212 77 -119 21 -14 -50 121 12 -92 39 168 59 -48 -161 -70 -38 168 -42 6 -107
5574a07q2J83K00n33L25j54j8M7lK44k4m07J94K33j87L03j85j69L65l67J87M6
$$ -107 -189 -6 194 -339 -14 -168 -186 -139 -142 102 78 -329 -135 98 -89 214 29 -140 225 -142 45 91
5596I1l21K56J23j21j40j32Q8p2k6K93J2n1J46j58p6j0q2J4L2oK29q6l52M27j19
$$ 91 -230 26 149 28 -112 -244 -156 -228 -254 39 51 0 146 -12 -88 -98 -180 -166 -134 -140 89 3 -349 78 -41
5621d1J22j78r2R3K95q4n6J61k31R6n9n9J14j81K40j78j34L6j00J72j89J94J57
$$ -41 81 -97 -189 -96 199 115 59 220 -11 85 26 -33 81 -100 140 -38 -172 -136 -236 -64 -253 -59 98
5644I8j67j3j56M54n42L82j56K4j68K23O5L26n24K28j86k01J60J03m3K69k51J93
$$ 98 -69 -82 -238 216 -326 56 -100 -76 -244 -21 44 370 -154 74 -112 -313 -153 -50 -93 176 -75 118
5666A18Mk97J06l0k55P08j25q2j86Lp3K66j34N2j33K1j93J07oK11l35J71K03k27
$$ 118 122 -175 -69 -99 -354 354 229 147 -39 -36 -109 157 23 75 -58 -37 -230 -123 -129 82 -253 -82 121 -106
5690a06P3k39M27j02K10j60l55K07R1j21%QN78m72m7j31N32l17k07k0L12k43Q2
$$ -106 -33 -272 155 53 263 103 -252 -45 46 -75 -75 -67 511 39 -8 -139 393 76 -131 -151 161 -82 0
5713@l6K36k50J51N0r0j76J89J8k46N20k95J32M6k16n8K52n07J67j60M92k87R9
$$ 0 -36 200 -50 101 151 61 -115 74 92 -154 366 71 203 249 33 -25 227 -280 -113 -273 219 -68 31
5736C1KM5p7j75K08k95L31k07L69k92J09k74K09q6K81k01k43L27l13K89j59o0
$$ 31 33 78 1 -174 34 -261 70 -137 232 -60 49 -225 -16 -102 179 -22 -265 62 -251 38 -121 -181
5758a81L06q5l0j85K68n5j23M8p6N5k04O6K88j82K66j27O0l96K09K05r7RO9j84
$$ -181 125 40 10 -175 93 38 -85 -37 -113 -58 -262 -196 92 -90 176 49 109 -287 -78 127 30 39 108 -76
5782g6k0K20Kj99O8K37l51M5j07J92N3j87NM2K15k17kL12k33N5qM0j67J25J54
$$ -76 -96 124 126 -73 -5 232 -119 -74 -181 11 64 -123 -118 -76 139 -78 -80 232 -1 54 46 86 -81 44 198
5807A98k22J53k14j23L78k74Q3J3j9Q9j71J99j09l1l2K56k00Q1j16l4K55k68J40
$$ 198 -24 129 -85 -208 170 -104 -21 -8 -27 62 -109 90 -19 -50 -82 174 -26 55 -61 -95 160 -108 32
5830C2M7J27k45L2J12P6m31K6L5k34K45J94L1J15R8k34m23K44K23k61L2r2K00
$$ 32 79 206 -39 -7 105 181 -250 -224 -189 -423 -178 16 47 162 260 26 -397 -153 70 -191 -159 -251 -51
5853e1J2K01j45k4oQ6lk72K02K63k2l37O4J88j51K09j21J30j0o0j51k1K17l9j36
$$ -51 -39 162 17 -7 -13 73 70 -202 0 263 241 -96 -32 156 5 214 93 223 213 153 2 -19 198 159 23
5878B3P8j75K5l5J2j74J71J32J45j96K6j29j36K73l3J76k52q7K34k05M9J55L16
$$ 23 101 -74 -49 -84 -72 -246 -75 57 202 6 32 -97 -233 40 7 183 -69 -156 78 -127 -78 77 393
5901C93l33p4L9k1k21M18O1l20J79r6J71k02Q3k0M7p2j40K48j07L3o5j18l2J14
$$ 393 60 -14 25 4 -217 201 262 -58 121 25 196 -6 77 57 104 32 -108 140 33 66 1 -117 -149 -35
5925c5J61r3q6J35q8oO5o9J3J37j63J13l90L20J04n9k13k1K37j88j87L81N6m3
$$ -35 126 33 -53 82 -6 -12 53 -16 -3 134 -29 84 -306 14 118 59 -154 -175 62 -126 -313 68 124 81
5949H1j18j36K57k4j76J24J5j94J19L41j38m61K00J34o9M8R4KR5J18n12Q0L92
$$ 81 -37 -173 84 60 -116 8 23 -171 -52 289 151 -310 -110 24 -45 3 97 99 194 312 -200 -120 272
5972B72l26J92J47n04K90R7r5N1j50M8j11o8K59j43J63k69J31L5k18j13K36o2
$$ 272 -54 138 285 -219 71 168 73 124 -26 22 -89 -157 102 -41 122 -147 -16 19 -199 -312 -76 -138
5994a38J80j53K11j06k3N5m67L02q6K69J84k54l21K08K21j08k33L86j26k0J16
$$ -138 42 -111 100 -6 -29 26 -441 -139 -225 44 228 -26 -347 -139 82 -26 -259 127 1 -19 97
6015I7l45K43Q3n4K06o09M18J31j73k68L53j3M1O9j65j2N7k6j00Qm0J15K00k45
$$ 97 -248 -5 78 24 230 -379 39 170 -3 -271 82 69 110 179 14 2 59 33 -67 -59 -99 16 216 -29
6039b9n6J71J58m69K35J60j46N4J08k97K18k79J67O3m38L38o6J14j5mq0J3o9J29
$$ -29 -85 86 244 -225 10 170 24 78 186 -111 107 -172 -5 58 -380 -42 -108 6 -9 -13 -93 -80 -149 -20
6063b0J29L9Q8o7j99J9K60K0j40J25l69p3k6J30M8J6l34M15l06P0M4j50K77P3
$$ -20 109 148 236 169 -30 -11 249 269 129 254 -115 -188 -214 -84 -36 -20 -354 61 -245 -175 -131 -281 -4 69
6087F9K69k00k52j34K78L9L7l24L84n07M35j08j45J79m3m0O7J11j75L01j83K1
$$ 69 338 138 -114 -248 30 69 106 -218 166 -341 94 -14 -159 20 -23 -63 4 115 -60 241 58 79
6109G9K36n11L65k57M4R5k79K78k05o9K14k05L55k91L59m9k45L49ok98O6J52j43
$$ 79 315 -196 169 -88 -44 51 -228 50 -155 -224 -10 -215 140 -151 208 159 -86 263 257 -41 25 177 34
6132C4K30m16K05j03J91Pj23k22K66k01J86m2o8l15M81J70l69O8K70n75J66J86
$$ 34 264 -152 53 -50 141 148 25 -197 69 -132 54 12 -56 -371 110 280 -89 -21 249 -326 -160 26
6154B6k13N25o89J51J47ln4J0J0J28o8j03K61j70K61j61j08q8K60k24PK31k23
$$ 26 -187 338 -351 -200 -53 -56 -110 -100 -90 38 -30 -133 128 -42 219 58 -50 -138 122 -102 -95 136 -87
6177h7M6N4J38j36j91L77l84n6J00L33k58J52J2l05K55Q0l12K06Oj19J93j52J58
$$ -87 -41 13 151 15 -176 201 -183 -239 -139 194 -64 88 100 -205 50 130 -182 24 30 -89 104 -48 110
6200A10r2j69K95j93O7l69L12K2j53J72n8j25P1J56j9NOj13p4L18k23J39k2M3
$$ 110 18 -151 144 -49 18 -351 -39 -17 -170 2 -56 -181 -110 46 27 32 38 -75 -149 169 -54 85 63 106
6224A06M5k54R7K2p2p3M30j42k6n3q0N69p23J53n4Q9J05l35L75j81m7J36j53Q5
$$ 106 151 -103 -6 16 -56 -129 301 159 133 80 0 569 -154 -1 -55 34 139 -196 179 -2 -49 87 -66 19
6248A9J25p6k22K66k06J43k03K05m36J94K73l2k27K44O0k20L6J32N3o2k01L78
$$ 19 144 68 -154 112 -94 49 -154 51 -385 -191 82 50 -177 67 127 -93 -57 75 128 66 -135 243
6270B43j29j03J9k51J98J46n8j63R5k43J14M3J90k12J41L9o7m08M49J20j75P0
$$ 243 114 11 30 -221 -23 123 65 -98 -3 -246 -132 -89 101 -111 30 69 2 -406 43 163 -12 58
6292E8j6J35r6p8R9m2Q8k87j09L70JK96n81M9J22%m0K32m00M09n4r9p5Lr3J97
$$ 58 42 177 81 3 102 60 148 -139 -248 122 123 419 -162 -113 9 9 -31 201 -199 210 156 57 -18 -15 -108 89
6318H9j08m3J4N1l9K19l72L24k20j38pM3K57k95P8L72j47j20J94k4l12K10J78
$$ 89 -19 -62 -48 3 -36 183 -189 135 -85 -223 -230 -187 70 -225 -147 225 78 -42 152 128 -184 26 204
6341B04l55J42k18R4J70Q9J05k51j18K69J65k18k00J51J46j49k22K29q4J89nj79
$$ 204 -151 -9 -227 -133 37 126 231 -20 -138 131 296 78 -122 29 175 26 -196 33 -51 138 133 -46
6363d6m4Rp2J98J45l48K09L49k77k36R5lP7j87k24M01J2J54k96k87N13j9J86n06
$$ -46 -90 -81 -153 45 190 -158 51 400 123 -113 -18 -21 56 -131 -355 46 58 212 -84 -371 142 123 309 -197
6387a97K22o5R9j25J11q7K0R7k85K26j13J77j8J69k92J7lj41L73K5j63j10l8M1
$$ -197 25 -40 59 -66 45 -42 -22 75 -210 16 -97 80 62 231 -61 -44 -47 -188 185 210 47 -63 -101 -60
6411f0r0J78j22j35K05j02O5K1L8k4L72n42J29j27K70Q6o1k84J95m2l7R0J31j80
$$ -60 -150 28 -94 -229 -24 -126 -61 -40 -2 -26 346 -196 -67 -194 76 162 101 -183 12 -30 -67 23 154 -26
6435b6L03k05j38k95J72K24pQ6j35m5j52N45k83L56k23m00J62R3M1O1R3m17J05
$$ -26 277 72 -66 -361 -189 35 28 114 -21 -66 -218 327 44 400 177 -223 -61 32 73 134 227 -190 -85
6458h5j13J47k11K65k24J73j13M35k68J22n05K59J71j02l6nJ7J38k20M38k85J11
$$ -85 -198 -51 -262 3 -221 -48 -161 274 6 128 -377 -118 53 -49 -85 -90 -73 65 -155 283 -2 109
6480A09j52K3l6K08k81KR4J07l31J9L05p4Qq0o0Q5O2J53j22j23LK7O0j71L94j51
$$ 109 -43 -20 -56 152 -129 -127 -33 74 -257 -238 67 -7 1 -79 -139 -54 8 161 39 -84 -81 -54 6 -165 229 78
6506G8K7k30O5p5J76k9O5j34K01k4Q3j17R7l44J07k52J40J86K67j79j39O9mm0
$$ 78 105 -125 -60 -135 41 12 77 -57 144 120 203 86 183 -161 -54 -306 -166 20 287 108 -31 38 34 -6
6530fo6l5M3J38k30J88Mj89K45k59Q2K62k47L04l97J24j51P2L5J75n6r9j85K04
$$ -6 -72 -107 -64 74 -156 32 36 -153 92 -167 -85 177 -70 234 -163 -39 -190 -118 -83 92 36 -63 -248 -44
6554d4J05qM2k32L11l48L52k36P2j34J18k49k9O7R1oK58Pl75R9n7L48l30K93l09
$$ -44 61 53 95 -137 174 -174 178 -58 14 -120 -2 -251 -280 -213 -122 -128 130 137 -238 -139 -196 152 -178 115 -194
6579a94L02l67K22J58k43O6L4K51k93o8K29j81mN8l4n6J17j76l5Q1J85j79K14
$$ -194 108 -259 -37 121 -122 -56 -22 229 -64 -132 97 -84 -88 -30 -64 -120 -3 -179 -214 -133 52 -127 87
6602H7j71J13J0J9J28k97o3K54k45L51qq6j8L9J6M2l5k2r4R0k74L60N8l50j01
$$ 87 -84 29 39 58 186 -111 -174 80 -165 186 178 92 74 113 129 171 136 114 20 110 -164 196 254 -96 -197
6627a97J81m5K94j29l01K59k36K38J68j71m7q3J69j16R5j29N0k01L63k12J13P1
$$ -197 -16 -61 233 104 -197 62 -174 64 232 61 14 -69 100 -16 79 -50 0 -201 162 -50 63 134
6649A34r6j46M1J66l78M73j58j02K69k14j98J7J44N9M9k42L33j24oJ22j25J4p6
$$ 134 38 -108 -67 99 -279 194 36 -66 203 -11 -209 -192 -48 11 60 -182 151 27 21 143 18 32 -44
6672d4J77n4m3j17J15k1j38K66r7j80Q6k1J08J9J27k91R2o6q7M43l09k7J17o4
$$ -44 133 79 36 -81 34 13 -125 141 44 -136 -50 -71 37 56 183 -108 -16 -82 -169 274 -35 -62 55 -9
6696iK54m30J00O3L72m03p3q9J92J35m57K15R3K55Q2l93K17j28O8k04j9K32r9
$$ -9 245 -185 -85 -22 350 -53 -126 -215 -23 112 -345 -130 -37 218 300 -93 124 -4 64 -140 -159 73 -26
6719b6K11k47Q3k12j14M44o0k03P4j10L0L42j80K1K8J9k76K33O2K94k43o0r5l
$$ -26 185 -62 21 -191 -305 139 79 -124 -50 -160 -130 212 32 53 81 100 -176 57 119 413 170 110 15 12
6743A2J36k4j7j58L06k99J1n7lK03K11k44p1J21J91k24q0K2K14k33J30k67J49
$$ 12 148 124 107 -51 255 -44 -33 -90 -93 110 321 77 6 127 318 94 14 36 250 17 147 -120 29
6766B9J29k71K40J41o3l46L19k10K08j1j69R1j42N9J82k09m0J31n4J78l26o8R4
$$ 29 158 -113 127 268 205 -141 178 -32 176 165 -4 87 -55 4 186 -23 -63 68 14 192 -134 -202 -108
6789a08rJ07K7j24R9J35J67j96m3J68j76L4N3k53J17J23p8K45m25k4K70m58K33
$$ -108 -117 -10 17 -107 -8 127 294 98 55 223 47 81 134 -119 -2 121 43 288 -137 -161 109 -349 -116
6812a16K08k24O2K62JL7k33r1K0j54J45qL01k98p1K02P0j33J16j25J28L2j57J29
$$ -116 92 -132 -70 192 193 230 -3 -94 -74 -228 -83 -91 210 -88 -159 43 113 -20 96 -29 99 131 -26 103
6836A03l61M68k33n0R9j83K37k37o2N9j8L61o6l84L27q1K89j34p4j57k18K56j71
$$ 103 -258 210 -23 -73 26 -157 80 -157 -219 -160 -178 183 117 -267 60 -21 268 134 60 -97 -315 -59 -230
6859b30N4L68j58j3J88k40p3J00n9Q3nj7P6Q9j96J1l1M00m49pK55j67l54L27r2
$$ -230 -176 192 34 21 209 -31 -104 -4 -63 20 15 -2 74 163 -33 -22 -53 347 -102 -109 146 -21 -375 -48 -140
6884a40L39l96PL35n27K83J83J8r9M5n3r0O5J7j50jJ92j54K96j85r0k48K98r2
$$ -140 199 -197 -190 145 -382 -99 84 102 3 48 -5 -95 -30 -13 -163 -164 28 -126 170 -15 -105 -353 -55 -147
6908a47J73L4m8n5P3L1J41l85J41k2J37j7j35K66l71N1R0n4J62k92J58o6J56k1
$$ -147 26 60 12 -43 30 61 202 -183 -42 -64 73 56 -79 187 -184 -133 -43 -97 65 -227 -69 -135 21 0
6932@k26P3r2J45j5K92j58J91m58J24J58q7J69j3Qj05K57j89j23k10K97J40J97
$$ 0 -226 -153 -245 -100 -115 177 19 210 -248 -124 34 -53 116 103 111 6 263 74 -49 -259 38 178 375
6955C75k87J9j87J26j79O0J66J07l21j08K47j55K7L5j15P1jM8KM33m72K91j40
$$ 375 88 107 -80 46 -133 -73 93 200 -121 -229 18 -137 -110 -75 -190 -119 -120 -72 -70 363 -109 182 42
6978D2j02J84l66L12k58J52J81j8M0jk51L9J56j63K9m2L83m32L3L09l50J51o5
$$ 42 -60 124 -242 70 -188 -36 145 127 167 166 -85 -46 110 -53 -24 -66 317 -115 -82 227 -123 28 -37
7001c7m1l9J83n9L13N1j28P2n63K14pRr6J66R5k39J34j40K17l55K45n9n0K25q1
$$ -37 -78 -117 66 7 320 371 243 315 -248 -34 -41 -32 -128 38 133 -106 28 -112 105 -250 -5 -64 -114 111 30
7026C0J06j98K50j70k03L60j79N8L5n6j33m2N2J11N9k19P1k85N36Ol52Q3R1j11
$$ 30 136 -62 188 18 -185 175 -4 54 89 33 -100 -142 -90 21 80 -139 -68 -353 183 189 -163 -80 11 -100
7050a00Q0J29k94N0R7J5j85L11k38jK27j69qJ42k33j63L18R4L2k61O3J9N5n6j36
$$ -100 -20 109 -185 -135 -38 -23 -208 103 -135 -136 91 -78 -86 56 -177 -340 -22 72 104 -157 -94 -75 -20 -76 -212
7075b12J42K7L12k38Jo3J23m5J80Q3m81R3r0l0K78k16J32j16O2J27j99P3J56p5
$$ -212 -70 -43 269 31 32 -31 92 47 227 310 -171 -78 -168 -198 80 -136 -4 -120 -58 69 -130 -57 99 24
7099B4J28k02K1J95l92j7J34J72Qq4J21j31q1l0K59j13K82j87k84K30M2j57J39
$$ 24 152 -50 -29 166 -226 -243 -109 63 71 -13 108 -23 -104 -134 125 12 294 107 -177 53 95 -62 77
7122G7j20L0l0L8P4J72j41K0k65M08l07k37N78k77m9l4J57p4j18K9K88j54N0j4
$$ 77 -43 -13 -43 -5 69 241 100 120 -145 263 -44 -281 297 20 -29 -63 94 20 -98 -69 219 65 115 101
7146A01j36N7k71R1J47j83M51Q7n23J17J15q8k36K76P8j76M4L24m20L46k91m5
$$ 101 -35 22 -249 -158 -11 -194 257 344 -179 -62 53 -35 -271 5 83 -93 -49 275 -145 201 -90 -135
7168a35K30j07l5k61L87j24J92J9m2nj81J78l73L62j5Mk46Q8J38k5O7K24k86R
$$ -135 95 -12 -47 -308 79 -45 147 166 124 119 -62 116 -257 105 90 94 -152 -64 74 49 116 340 54 63
7192F3j09M4J95k23j04R0M1k68K46K85n51N11j59j26K93k61l4J07oo0n1K30j81
$$ 63 -46 -2 193 -30 -134 -44 -3 -271 -25 260 -291 220 61 -65 228 -33 -67 40 34 -26 -77 153 -28
7215b8j67K14K4k34o6L38J48k16mj4j15M7K55q9Q6r2m7k49K35m0J14L1l40M66
$$ -28 -195 19 43 -191 -257 81 229 13 9 -5 -120 -73 182 93 179 87 40 -209 26 -14 100 131 -209 257
7239B57l73P2k00M72j40r0q5kJ30o1J57j22K7j47K96m8k29J67J9l53L80M1l14
$$ 257 -116 -44 -244 228 88 -2 -87 -89 41 -20 137 15 42 -105 191 143 -86 81 100 -253 127 168 -146
7262a46K56r5K0K63m56K76p0l72K23K26n01L98j76J98k14J39q0J84J2J68l08K93
$$ -146 110 15 35 298 -158 118 48 -324 -101 125 -376 22 -154 44 -170 -31 -111 73 85 253 -55 238
7284B38j24j55Qk90K74J21J41k93Q8K06l38L70m59N9kJ04J72K9Oj06K7K12k02
$$ 238 114 -41 -33 -323 -49 72 213 -80 8 214 -124 246 -213 -154 -156 -52 120 149 155 49 76 288 86
7307H6pk10J05j65L06m6j19J25q2o4J73k03m3J56j34J46j62m9M08k07j6K13j66
$$ 86 79 -131 -26 -191 115 69 -50 75 -7 -71 102 -101 -144 12 -122 24 -138 -187 221 14 -2 211 45
7330D5j47M85m54l42K38p8L90k63N5J76j0j16j39j3K99l04M89l65p4J25M1q5p6
$$ 45 -102 383 -71 -413 -175 -253 137 -126 -71 105 95 -21 -160 -173 126 -178 311 -54 -128 -3 38 -47 -123
7353a23J82j44Q0J01q6J80Kl29Q6K50ok52J31L3k28J04kk62K30J12K9j67o8K05
$$ -123 59 -85 -5 96 10 190 192 -137 -51 199 193 -59 72 105 -123 -19 -21 -283 -53 59 88 -79 -147 58
7377E8k2J57r8k93K43O8j31k85K72J6J90j38L6j19j67K40p0P7j02p0J10m7l89
$$ 58 36 193 95 -198 45 113 -18 -303 -31 -15 175 37 73 -46 -213 27 -43 34 -68 -138 -28 -75 -464
7400d64N09j37J16P9L8q5J05L4j32r9K75n22J86L05l93K77l9o8J93k4k62P8J46
$$ -464 45 -92 24 103 141 56 161 195 63 -36 239 -283 -97 208 -185 92 53 -15 178 154 -108 -30 116
7423A16K0J47k61j5J67j53J52l4k78M05j99J19O2m03J54n2j63L37L5j34o9K13
$$ 116 136 283 22 7 174 21 173 139 -139 266 67 186 248 -155 -1 -53 -216 121 156 22 -47 166
7445A66k99l5O3J98p6m2k2l25M95M9j57n9m2J54r5j66K16Q0k65Q7Q3K24j63n1
$$ 166 -133 -168 -105 93 17 -25 -47 -372 123 172 15 -44 -86 68 -27 -193 23 103 -162 -75 8 232 69 18
7469A8J10j15J43j77j01J95l4q5NOJ14Qj86K47j49J20r5j09j29L84k52J36j55
$$ 18 128 13 156 -21 -122 73 39 -46 -41 -35 79 87 -99 148 -1 119 24 -85 -214 170 -82 54 -101
7492a01JL10l7j19j30n9l8K62j43N4j50J19K7J3l0k21M51j25M9R2k42J5JO0j31
$$ -101 -100 210 173 54 -76 -135 -173 89 -54 0 -150 -31 -4 9 -21 -242 209 84 133 225 -17 -2 -1 59 -72
7517g2L3Lp0K63m7o4O9j03J01K4j59K04k35j55O2j25R2K86Jk46K30j33J67k23
$$ -72 -39 -36 -106 157 110 46 115 12 113 137 -22 182 -53 -208 -146 -271 -179 107 108 -138 92 -41 126 -97
7541i7j01L13J0q4l00M19k14O2k0K64k18M1l21L21k53K47k62Q2J80j59J1K9P5
$$ -97 -198 115 125 41 -259 160 -54 8 -12 252 34 75 -246 75 -178 69 -193 -111 69 -90 -79 -50 25
7564B5j4P1k96J48J18K63l30P2Pk10JJ66j75O7K79r4k4k92K41L0J21j36j69J35
$$ 25 11 82 -214 -66 52 315 -15 57 64 -146 -145 21 -154 -87 192 98 74 -218 23 53 174 38 -131 4
7588Dr1P9j19K27j35k5j14J53k7J0Q9l4J28k02j14j7K57o8l38N29k70P3M2k18
$$ 4 -87 -8 -127 100 -35 -60 -174 -21 -48 -38 51 17 145 -57 -171 -188 69 1 -337 192 -78 -5 37 -181
7612a81K24K6k78L24l42J22o3J27j09K7Q6J30j7j32kj15K96k22J8L12k62O2K2
$$ -181 43 69 -209 115 -227 -105 -168 -41 -150 -123 -37 93 76 -56 -58 -173 123 -99 -81 231 -31 31 53
7635E3j33j69J08N0K03k68j09L34j07O2K94j62j60j46j05K25l4J27J21Ml12M5
$$ 53 -80 -249 -141 -91 112 -156 -265 69 -38 24 318 156 -4 -150 -255 -30 -64 63 184 188 -124 -79
7657g9k20N44l54J38r3l86M37o8R6J46l2l59N2J15Q1Ql3oj62oJ46OP7R5k64R7
$$ -79 -299 245 -109 29 -64 -450 -13 -81 15 161 129 -230 -178 -63 18 26 -7 -13 -175 -181 -35 -29 48 143 -121 -24
7683b4N4k19J98M5P5k59J63J0nO5k53J51m6l6N2L0J60r7k6L3k27K37k8l45M6M51
$$ -24 30 -189 9 54 129 -130 33 43 38 103 -150 1 -45 -81 -29 1 161 64 38 71 -156 81 53 -292 -246 205
7709B05k47J0m9J56J0K09k50J97l60l41M35k99L09m0RK27m43L35R6J17l82L7J70
$$ 205 -42 -32 -81 75 85 294 44 241 -119 -460 -25 -324 -15 -55 -46 181 -262 73 169 286 -96 -59 111
7732A11o0p9j69L60k00m7O1Q2q8J10l62L83m8p1J1J72j21k62N12l98J41Q1j07
$$ 111 51 -28 -197 163 -37 -84 -23 59 -29 81 -281 102 54 -17 -6 166 45 -217 295 -103 38 119 12
7755A2rJ82m47J43K07m2k11L23k00O9l3k6J17pr9j73L29j74Q0j99P7J44j00M1
$$ 12 3 185 -262 -119 88 46 -165 158 -42 27 -6 -32 85 78 -21 -194 135 -39 41 -158 -81 63 -37 4
7779Dk21K29l36L52P4j85ok38K22M55k69j48J49m5o3o0Q0j74M12k6l59%L52o9
$$ 4 -217 12 -324 28 102 -83 -89 -327 -105 350 81 -67 82 37 -26 -86 -6 -180 232 206 -153 -153 199 130
7803A30k17j0PN2K41j2j04j53J48J17k35n4j21J91l58M37j9j98J89p1m7k18L75
$$ 130 -87 -97 -90 -38 203 191 87 -66 82 199 -36 -90 -211 -20 -378 59 40 -158 31 -40 -87 -305 70
7826G0j02K4R7P1k01j41K21k17j6J97J7j69K26m9p5J77k03j8L87m3j50n0j31R7
$$ 70 -32 -8 89 160 -41 -182 39 -178 -194 3 20 -149 77 28 -47 130 -73 -91 296 253 103 53 -78 19
7850A9R8o9j22J78q2J7J28j21P3m2j24j0K89j92PJ01l3q0j95N9Q9k2J63L15l17
$$ 19 117 48 -74 104 22 39 167 46 119 77 -47 -57 232 40 47 148 115 35 -160 -101 -12 -34 129 444 127
7875A27l13K34j38J6m2K69J76k20j52R1Q6k39K01j43J08j29J34JJ3l20K59j31
$$ 127 -186 48 -90 -74 -116 153 329 109 -43 48 134 -105 96 -47 61 -68 66 67 80 -240 19 -112
7897a12K29q5j3j28K1J9J19j52j75J14M68l71J2k07K59R2r0O3l3M4j87J08n6M
$$ -112 117 32 19 -109 -88 -69 50 -102 -277 -163 305 -66 -54 -261 -2 90 0 63 30 74 -113 -5 -61 -57
7921e7O7J61o3no8J47q9j76J9o1Q3N7N6o8q2K72k07q9j13K75j81J59N7n8q1q2
$$ -57 10 171 108 103 35 182 93 -83 -64 -125 -42 15 71 3 -79 193 -14 -103 -216 59 -122 37 94 36 -45 -127
7947a27L88j55O4k86J85j01q2k77M47j66j72K19j04j52J34K51r9J24j19j09n9
$$ -127 261 106 170 -116 69 -32 -114 -391 56 -110 -282 -63 -167 -319 -185 66 -33 91 -28 -137 -196
7968a96K40J5R5l8k83Q8KQ4J09m5n0q0R4p3J14k02O6Mj54J79R2o6Q9k15J7J06
$$ -196 44 59 154 116 -167 -79 -77 7 116 71 21 -59 35 -38 76 -126 -60 -56 -210 -31 61 -5 84 -131 -114 -8
7994hK21l25n6L9J54%K06l6m30L90k39kR5L8j85M3q7K16J93m48K83J93m07J32
$$ -8 213 -112 -168 -129 25 25 231 195 -235 155 -84 -86 9 47 -138 -95 -182 34 227 -221 62 255 -152 -20
8018b0J6j78O7j5P8L00k14k05K09j46K01k66N4J76q3J31L9k23K89j31k25j5k2
$$ -20 -4 -182 -115 -130 -52 248 34 -171 38 -108 93 -173 -119 57 -26 105 144 -79 210 79 -146 -161 -183
8041a83O1k38M73k13j53K29jmmJ69j04mj51P0K41j14J25j00j02r1J58J57j48K42
$$ -183 -122 -360 113 -100 -253 -24 -25 -29 -33 136 32 28 -123 -53 188 74 199 99 -3 -94 64 221 73 315
8065C15o1o14K60Q0K70K7k57J41q9q4R8j43o4K46J3k94P6L0j50O33l14L8k15k7
$$ 315 254 -360 -100 -20 250 277 20 161 72 -12 86 -57 -121 125 138 -156 -80 -50 -200 433 119 157 -58 -85
8089h5K36l14L70n03N36l32m4J00K4K86j35K28m73j8L1J18q6O7j85J52n8j68M46
$$ -85 151 -163 207 -296 240 -92 -136 -36 -12 274 139 367 -106 -124 -93 25 -61 6 -179 -27 -85 -253 193
8112A93l52O1K71p0m1j13km4K93l44p5O6n8L05k28J85j38L62r3p6j63j32J02K27
$$ 193 -159 -98 173 103 62 -51 -53 -97 196 -148 -223 -157 -215 90 -138 47 -91 271 178 102 -61 -193 -91 136
8136A36K6j42j16l5M4K34l92L31Q6k73M5Po4N6K09m85L17R5p6k17M44k21j91L42
$$ 136 162 20 -96 -131 -87 147 -245 86 172 -101 -56 -49 -113 -57 152 -333 -16 79 3 -214 230 9 -182 160
8160A60k35J55j13k55L39k71J77K34k94q7K26J43l35J10Q3k11k2L29p6r9m2J85
$$ 160 -75 80 -33 -288 51 -220 -43 191 -103 -190 36 179 -156 -46 37 -174 -196 133 57 -42 -84 101
8182A01j41k97K34O1R1k00J76J29k09
$$ 101 -40 -337 -103 -42 49 -151 25 154 -55
8191e5
$$ Imaginary data points
##PAGE= N=2
##DATA TABLE= (X++(I..I)), XYDATA
0@%%%%%%%%%%Qj6J6k4L2l2M0n6O9p8R5j18J37j61J92k24K62l03L47m03M64n28
$$ 0 0 0 0 0 0 0 0 0 0 0 8 -8 8 -16 16 -16 24 -32 37 -41 54 -64 73 -88 104 -120 142 -161 186 -217 247 -281
32b81O00o80P69q67R74j093J224j367J524j694J881k086K310k555K820l109L427
$$ -281 319 -361 408 -459 515 -578 646 -721 803 -891 990 -1096 1214 -1341 1479 -1630 1797
49A797l777M160m582N049n568O147o797P536q377R347j0484J1834j3471J5499
$$ 1797 -1980 2180 -2402 2647 -2921 3226 -3571 3965 -4412 4935 -5549 6285 -7186 8313
63H313j8091K1543k6395L3750m6354P3721k38930J95684K91444m64027R7234K31867
$$ 8313 -9778 11765 -14630 19120 -27234 46487 -192443 3241 294685 -169342 -72108 159759
75A59759k47612q9248L92997o9691l23862J09478J99863j43642j0920J06709j12401
$$ 159759 -87853 -177101 215896 146205 -177657 -68179 131684 -11958 -22878 83831 -28570
86b8570r2063J77619N5129j53789n1389J04765K3894n2884N682L7023o0175j7472
$$ -28570 -120633 56986 112115 -41674 -93063 11702 35596 -17288 -11606 25417 -34758 -52230
98e2230J15497J0828j43352K2787J28372n9920p2190J00298j9599j27749R9580
$$ -52230 63267 74095 -69257 -46470 81902 21982 -50208 50090 30491 -97258 2322
109B322J05761j67900m9876J80397k9822j33073J13046N9816j47842K7691J43859
$$ 2322 108083 -59817 -109693 70704 40882 -92191 20855 80671 -67171 -39480 104379
120A04379q9300j01962J09741L6451r8942K3422N9983o6080j6430P9281j9560
$$ 104379 15079 -86883 22858 59309 -39633 -16211 43772 -22308 -38738 40543 20983
131B0983o9152L6281M4726l8386j8985L9877j010m1309K2143M8256m0036m8676
$$ 20983 -48169 -11888 32838 -5548 -24533 15344 14334 -26975 -4832 43424 3388 -45288
143d5288N3146L7385n9100j2456N3463k5233m1073O0188J2765q4121K1820Q2075
$$ -45288 7858 45243 -13857 -26313 27150 1917 -39156 21032 33797 -50324 -28504 53571
155E3571n1737m7028P4342Q45p3723M5176N6668p6362l1195P9767k858o3691L1753
$$ 53571 1834 -45194 29148 29993 -43730 1446 58114 -18248 -49443 30324 27466 -36225 -4472
168d472L0984m9109M782N1148k8847l8165L8580J7848l3382N034K5862k3271j8887
$$ -4472 26512 -22597 -17815 33333 4486 -33679 4901 22749 -10633 -5599 20263 -3008 -21895
181b1895L5621J0371m2306k546L8743j0412k8243K3314J5076l4335j012M1315
$$ -21895 13726 24097 -18209 -20755 17988 7576 -20667 2647 17723 -16612 -17624 23691
193B3691j3004l8285K8949K5018l8459K35M0472k5942l1996M1290J3551m7697
$$ 23691 10687 -27598 1351 26369 -12090 -11855 28617 2675 -29321 11969 25520 -22177
205b2177M963L9799k4206k5191L7484Q394m0539J0538L2941k1788j5173K6586
$$ -22177 -17214 22585 -1621 -26812 10672 19066 -21473 -10935 22006 218 -14955 11631
217A1631j946k3291J5820J6479k3181q752K2967l548k1348J4009J4609k3891n672
$$ 11631 9685 -13606 2214 18693 -4488 -13240 9727 6179 -15169 -1160 13449 -10442 -16114
230a6114K8775k572k5618J1088J9573j7671q625K4500k787k6014J3995K1046k3376
$$ -16114 12661 10089 -15529 -4441 15132 -2539 -11164 13336 10549 -15465 -1470 19576 -3800
243c800j0189K4128n931k1004J7539J4256k5685m129K7851n915k1026J5252J1195
$$ -3800 -13989 10139 4208 -16796 743 14999 -10686 -14815 13036 7121 -13905 1347 12542
256A2542k0742J303K1227j0353j5828J5030P309j6123J104J2937j0745r163J6549
$$ 12542 -8200 -6897 14330 3977 -11851 3179 10488 -5635 -4531 8406 -2339 -11502 5047
269E047K723j8818N533J6375j1582r477J6745J936j7390N160J6642j1628j2004
$$ 5047 7770 -11048 -5515 10860 -722 -10199 6546 8482 -8908 -3748 12894 1266 -10738
282a0738J5527M187j7085L555J4007j1343q252J5414P32j4774O208J2436j1279
$$ -10738 4789 8976 -8109 -4554 9453 -1890 -10142 5272 6004 -8770 -2562 9874 -1405
295a405p178J4083O41j4356O783J0458j1394m698J3368j678j1439N652P554r096
$$ -1405 -8583 5500 6141 -8215 -1432 9026 -2368 -7066 6302 4624 -6815 -1163 6391 -2705
309b705k239J0613l864r698Q895P121j2075j570J1631m356q987R515N321j2887
$$ -2705 -4944 5669 1805 -7893 1002 8123 -3952 -5522 6109 1753 -7234 2281 7602 -5285
323e285j082J4003m030j1413P567O273j0076L56J0826n786q794Q775N322r426
$$ -5285 -6367 7636 3606 -7807 -240 6033 -4043 -3687 7139 1353 -7441 1334 6656 -2770
337b770j162Q513m686o186Q909K574j0803J235J0058m420n644O438J204p471K990
$$ -2770 -3932 4581 -105 -6291 2618 5192 -5611 -4376 5682 1262 -4382 2056 3260 -4211 -1221
352a221P778n955o207P676K076p584K578N283p248k834R929l60r119K926P051
$$ -1221 6557 602 -5605 2071 4147 -3437 -859 4424 -2824 -5658 4271 3911 -5208 -2282 4769
367D769n797l224Q426r99q696M927P000o494l679O226P9n853L240L627n970k096
$$ 4769 -1028 -4252 4174 3175 -5521 -594 6406 -88 -3767 2459 2538 -3315 -75 3552 -2418 -4514
383d514P212p60n735L384L309n138o9O480k763n504M600M115n568r49N065k543
$$ -4514 2698 1938 -3797 -413 2896 -2242 -2311 4169 1406 -4098 502 4617 -951 -1900 3165 622
399F22m169M738K157o266R2N833k573m102N143J538o130J234O029l395m409N282
$$ 622 -3547 1191 3348 -2918 -2826 3007 434 -3668 1475 3013 -3117 -1883 4146 751 -3658 1624
415A624J888n790J218M697l495l413M247J470m966N19M359k344k538L830M59m320
$$ 1624 3512 -2278 -1060 3637 142 -3271 976 2446 -2520 -2001 2358 14 -2524 1306 1765 -2555
431b555J896L389k961j801L912L98m575J873L463l464k000M414p71m531L073L167
$$ -2555 -659 2730 -231 -2032 1880 2278 -2297 -424 3039 -425 -2425 1989 1218 -3313 -240 2927
447B927m061j217M263p53l602K590K777m245r49M719j026l926K377K555l643l21
$$ 2927 -1134 -2351 1912 1159 -2443 147 2924 -1321 -2270 2449 1423 -2503 -126 2429 -1214 -1535
463a535L923j743l222K977K103l532k58K809j563j911L076P06l209M49K506j296
$$ -1535 2388 645 -2577 400 2503 -1029 -1287 1522 -41 -1952 1124 1830 -1379 -930 1576 280
479B80j860K038O70l078J152L379k410k459K879J133k783N25K425k627j259L301
$$ 280 -1580 458 1128 -1950 -798 2581 171 -2288 591 1724 -1059 -534 1891 -736 -1995 1306
495A306N80l455N49K467j671j311L140m13l316J908K431j774k062K546J20k456
$$ 1306 1886 -1569 -1020 1447 -224 -1535 1605 1192 -2124 -216 2215 441 -1621 925 1045 -1411
511a411J468J859k836q56K985l49k279J261R83j935L84K338j355k193J888J555
$$ -1411 57 1916 -920 -1776 1209 860 -1419 -158 825 -1110 -726 1612 257 -1936 -48 1507
527A507k262k56K436j388j415J939N69k148l6K017k05k085J437J006k216L84K335
$$ 1507 -755 -1011 1425 37 -1378 561 1130 -1018 -1054 963 758 -1327 110 1116 -1100 -716 1619
544A619j290j499J583R43j908K58J804j711j167K110N09k255N16J697j533p92
$$ 1619 329 -1170 413 1356 -552 -294 1510 -201 -1368 742 1251 -1004 -488 1209 -324 -1116
560a116J812m24j595Q57J556j530m59J647j77j572J045J369j704p90K314o77j530
$$ -1116 696 272 -1323 -466 1090 -440 -899 748 571 -1001 44 1413 -291 -1081 1233 556 -974
577i74J152P94j267n69J551m26j384J076J077j308m91J610m71j083O18J152j247
$$ -974 178 972 -295 -864 687 261 -1123 -47 1030 -278 -769 841 370 -713 -95 1057 -190
594a90k81J449m04j689J171Q84j718J88J460q37j104J510M37j358l61J681o43
$$ -190 -471 978 574 -1115 56 940 -778 -590 870 33 -1071 439 876 -482 -843 838 195
611A95r96J661l46j208N67J175j213n99J217o2r81M65P29j027n02J515R8j277
$$ 195 -801 860 514 -694 -127 1048 -165 -764 453 391 -590 -125 604 -423 -925 590 688 -589
629e89N8J209o20m16O87r8p82L82R01n53p90J030K9j161O66Q26j133m89J425n45
$$ -589 -531 678 58 -358 329 231 -551 -169 732 179 -611 419 448 -713 -47 779 -354 -843 582 37
649C7o02L51R52j185J50R04n02o70L93Q68j059L01M89o31n28J276L97j354pP15
$$ 37 -565 -214 738 -447 -297 607 105 -565 -172 696 -363 -62 427 -204 -732 544 941 -413 -420 295
669B95m92j46M64J94q02L52M38l04k34J36N25m46j01M69j71p52Q07L65q64N3O12
$$ 295 -197 -343 121 315 -487 -135 303 -1 -235 -99 426 -20 -121 348 177 -575 232 597 -267 -214 398
690C98p07k23R23o0j075N30N24k13n20P11L8r37Q68K99j068L10P64o00o4K31L86
$$ 398 -309 -532 391 331 -744 -214 310 97 -423 288 326 -611 257 556 -512 -202 562 -38 -102 129 515
711E15o47p0L16P9o74N86J26n03J50L06l9n01N32R0n33M5O83Qr36M94K41o40R8
$$ 515 -132 -202 114 193 -481 105 231 -272 -122 184 145 -356 176 266 -267 -222 461 469 -467 27 268 -372 -274
734b74N54j68m72M41M8m47p7P15m07k34M18P0m11K8O43o14j19P61l61k76L33J34
$$ -274 280 112 -360 81 129 -318 -395 320 -87 -321 97 167 -244 -216 427 -187 -306 455 94 -182 151 285
756B85o97K09L40K6o97M60L53l83j39L31j3n20M80M77l23n13M02J47l55L03J51
$$ 285 -412 -203 137 163 -534 -74 279 -104 -243 88 75 -445 35 512 189 -324 78 225 -130 173 324
777C24n89j68N05p5m97N79o5k40J9N76j23l87L4L48m46L6L51j70j44K84J96p14
$$ 324 -265 -433 72 -3 -500 79 14 -226 -207 369 246 -141 -107 241 -205 -169 182 12 -132 152 348 -366
799c66K80L10k48k22O44j54m82K60N7K5k95L25p2L7J07n4j86o0L60k3o86K92N0
$$ -366 -86 224 -24 -246 398 244 -238 22 79 104 -191 134 62 99 206 152 -34 -94 266 243 -443 -151 -101
822a01k32J36L57K4o08M12k08L57o44P91j34m12L28o7m6j1K08J47l43J79k62J92
$$ -101 -333 -197 160 184 -424 -12 -220 137 -507 284 150 -262 66 -1 -47 -58 150 297 -46 133 -129 63
844F3j82N8j1p7K11J36l49j41J76J02j69K67j01j5J50K0j79M5lL2j51Q0Qj15J62
$$ 63 -119 -61 -72 -149 62 198 -151 -292 -116 -14 -183 84 -17 -32 118 138 -41 4 1 33 -118 -38 -30 -145 17
869A7j0J45r0j31K14N9p8L27k23o29M39J14j73J2P5r6l6K13j22J47l94K00J23
$$ 17 7 152 62 -69 145 204 126 453 230 -399 40 154 -19 -7 68 -28 -64 149 27 174 -220 -20 103
892A03Lk30M84l48J52P1j59L1q7R0j24l14L99K2K5J01j50k69L6J65j80l4J93M08
$$ 103 106 -124 360 12 164 235 76 107 20 110 -14 -328 71 93 118 219 69 -200 -164 1 -179 -213 -20 388
916C88m26J68J2Pk81j05K43k09K15K07k20k04K50J06n1k15J93M5j94J85j14l74
$$ 388 -38 130 142 149 -132 -237 6 -203 12 219 -1 -205 45 151 100 -115 78 123 -71 114 0 -374
938c74M11K2qk75N7K48p9J25J91n65K85m6J45k84K38O7jl61M37k44n9K27J40k45
$$ -374 37 59 51 -224 -167 81 2 127 318 -247 38 -8 137 -147 91 158 157 -204 233 -11 -70 157 297 52
962E2l61L24j47N5o6J54N1l21j04M77k55J69N4j34j79M40j21k34N75n70J49j51
$$ 52 -309 15 -132 -77 -143 11 62 -259 -363 114 -141 28 82 -52 -231 209 88 -146 429 -141 8 -143
984a43p5N15k55j96k1m9M9M59o74K37J25j22O9K12kK06j59j95K08k26J92r1m5
$$ -143 -218 297 42 -154 -175 -224 -175 284 -390 -153 -28 -150 -81 131 129 335 176 -19 189 -37 155 64 19
1007A9j05K65j63K7k07j7J78k1J58l14L6K24K46l59j09j36P51o48M2M08k23l4
$$ 19 -86 179 16 43 -164 -181 -3 -24 134 -180 -144 80 326 -33 -142 -278 473 -175 -133 275 52 18
1029A8j28j59L33r8M7q5j32K2K77N1j38k32K61j15N5J09j94O1K33k98K97m3k16
$$ 18 -110 -269 64 -34 13 -72 -204 -182 95 146 8 -224 37 -78 -23 86 -108 -47 186 -112 185 142 -74
1052g4k6J4j35J82p8L33k30j76M14k6kk98J44j54L55l0N6m05OQ0K49o95L17j3
$$ -74 -100 -86 -221 -39 -117 216 -14 -190 224 198 196 -102 42 -112 243 213 269 -136 -130 -50 199 -496 -179 -192
1076a92J20o9R0J91Kl5m9K73m97O80m80j01K35k26q9J81J53j18k7J80k47k46K16
$$ -192 -72 -141 -51 140 142 107 58 331 -166 514 34 -67 168 -58 -147 34 187 69 42 222 -25 -271 -55
1099e5k9K14Pj43J87m69J79q2l5J53n7L03l37M06j33k69q5p4K86J54r7K71l55
$$ -55 -84 130 137 -6 181 -288 -109 -191 -226 -73 -130 173 -164 242 109 -160 -245 -319 -33 121 24 295 -60
1122f0j25L59k32p1K90q6j34J51k9k2J75l09PJ16k88J58J56P0j25K16l12J63k22
$$ -60 -185 174 -58 -129 161 75 -59 92 63 41 216 -93 -86 30 -258 -100 56 126 1 217 -95 68 -154
1145a54Q2j59K27m3m2k0l2J03k14K92J31K07n54L9K40M6k99J25k4q4J07R3o6J3
$$ -154 -72 -231 -4 -47 -89 -109 -141 -38 -252 40 171 378 -176 -137 103 149 -150 -25 -49 -133 -26 67 1 14
1169A4J16J51j88l32j35K90j09K45p9K84j99q8M9M1j76N8J26j99L50J31k6l20
$$ 14 130 281 93 -239 -374 -84 -193 52 -27 257 58 -30 19 60 -116 -58 68 -131 219 350 324 4
1191DR5k18J79j21K33o5j83n6P6o3J53m7M2k52K62j26K70o6l74K86J61n30J58
$$ 4 99 -119 60 -61 172 107 -76 -132 -56 -119 34 -13 29 -223 39 -87 183 117 -257 29 190 -340 -182
1214a82L95q8k85K47k06K63j35j17M8j05K13K4J07j69j47%L61l33J07J63l27K24
$$ -182 213 125 -160 87 -119 144 9 -108 -60 -165 48 72 179 10 -137 -137 224 -109 -2 161 -166 58
1236E8oJ1k04J33J75j79p0J54j1q3o3k2K91j44m3L00k73R4l29j01K99j07Q2M0
$$ 58 52 63 -141 -8 167 -12 -82 72 61 -22 -85 -107 184 40 -3 297 24 118 -211 -312 -13 -120 -38 2
1260Bp4r7L19O0k42R7n4j63J89p9k44J81K32m9k54R7L22k61K5n0P1K52l49J50
$$ 2 -72 -169 150 210 -32 65 11 -152 37 -42 -286 -105 127 78 -176 -79 243 -18 7 -43 28 280 -69 81
1284H1o0J9K08j50L9k90K33Nj83L09l80M6J8Q5L5l1K4j77K36j75J26O3j9k43N0
$$ 81 21 40 248 98 137 -153 80 85 -98 211 -169 -123 -105 -20 15 -16 8 -169 67 -108 18 81 62 -181 -131
1309a31m4K32k21R0J5q9M14l21O3j59J15j17J92j44J58l6k26J59J03L7k88K27
$$ -131 -175 57 -164 -74 -59 -148 266 -55 8 -151 -36 -153 39 -105 53 17 -209 -50 53 90 -198 29
1331B9l27J40L90k45M0r7l4R9j0n2M5K85n0l14nK43l29K07rJ33k6q3J31j98M4
$$ 29 -298 -158 232 -13 27 -70 -104 -5 -15 -67 -22 263 213 -101 -106 137 -192 15 6 139 113 30 161 -37 7
1356GJ7K18k76K06j96R8j27M2J89j6k03J44j19L4R4k42J34L6k50K58k2J74l18
$$ 7 24 242 -34 172 -24 74 -53 -11 178 162 -41 103 -16 18 112 -130 4 40 -210 48 26 200 -118
1379a18o1K11qJ93k45J38l8l08K36M0m9M0mk69J11K17k72J70j97Q3J66o7l2K78
$$ -118 -179 32 24 217 -28 110 72 -236 0 40 -9 31 27 -242 -131 86 -186 -16 -213 -130 36 -31 -63 215
1403B15k72m5r4L95M3k40M7q4k3M17m22K0J2J24k10l4J26J15Mk37J58J1K76l47
$$ 215 -57 -102 -196 199 242 2 49 -35 -58 359 -63 -43 -31 93 -117 -151 -25 90 94 -143 15 26 302 -45
1427d5r6P5J50l23J60J42J35j73K12l97P8Q1j58%J35K56j26j42Q8j21J85k23P4
$$ -45 -141 -66 84 -239 -79 63 198 25 237 -160 -82 -1 -159 -159 -24 232 106 -36 52 -69 116 -107 -33
1450c3j31j20M13L0k79L50j73L1j06kj3k40K42m6J55j57L2M00j59m92K14J10j04
$$ -33 -164 -284 129 159 -120 230 57 88 -18 -20 -33 -273 -31 -77 78 -79 -47 353 194 -298 -84 26 -78
1473g8j13N42q2k57J54l66P0K00m51L10O9p2J96m0k4rJ0O0l4k01J1M0j02J34j30
$$ -78 -191 351 269 12 166 -200 -130 70 -381 -71 -2 -74 122 82 58 49 59 119 85 -116 -105 -65 -167 -33 -163
1498a63K55j73J90k22L01j51l0k40K34j5P0M1p1k04j26L66n4j85K59j36Pr2JJ38
$$ -163 92 -81 109 -113 188 37 7 -233 1 -14 56 97 26 -178 -304 62 8 -177 82 -54 -47 -139 -138 0
1522@k80N29k36K8K61j93j88J61k24J6K21p9J48k09j2r9K2K29j2p1J07l31L6J93
$$ 0 -280 249 13 41 302 109 -79 82 -142 -126 95 16 164 -45 -57 -156 -134 95 83 12 119 -212 -176 17
1546A7J44n3j37R3L6J16k70j5M27j51k86R1j27P6j22J53r0J81j15m3j86J41K2
$$ 17 161 108 -29 64 100 216 -54 -69 358 207 -79 12 -115 -39 -161 -8 -98 83 -32 -75 -261 -120 -98
1569i8PQ7j62J23j5L52j13k51J38j61P0o9J32k84N73l80k15J79PJ10j33r3M87
$$ -98 -91 -4 -166 -43 -58 294 181 -70 68 -93 -23 -92 40 -244 329 -51 -266 -87 -80 30 -103 -196 291
1592B91o4k97K28K04mj9m82K84j22J9J34l48J40J07pj3k1M3j88R8O3p6Q6M0k00
$$ 291 227 -70 158 362 358 339 -143 141 19 38 172 -176 -36 71 64 51 30 73 -115 -17 46 -30 56 96 -104
1617a04J17J65k95J23jJ07n3K7m5kK4J28k7k43Q1l38M44j33l8K66N7j17l4j33
$$ -104 13 178 -117 6 5 112 59 86 41 39 63 191 164 -79 2 -336 108 -25 -63 203 260 143 109 -24
1641b4R1k00L44q0J21l41j04J45j60J49p4J61J01R1j73K22l31K33m86M36o4j74
$$ -24 67 -133 211 131 252 -89 -193 -48 -208 -59 -133 28 129 220 47 269 -62 171 -315 121 57 -117
1663a17J08O3J93k40j94K44m1M2Q8J8m50M08K5j80K20j35P6n9j69k57O00l39L9
$$ -117 -9 54 247 7 -187 57 16 58 146 164 -286 122 147 -33 187 52 128 69 -100 -357 243 -96 -57
1686e7MK94l58K08J2j02Qk3p9j87J77j8J95k64j45J97R1Kl6J53J81l07J11o7N5
$$ -57 -53 241 -117 91 103 1 9 -14 -93 -280 -103 -121 74 -190 -335 -138 -47 -45 -81 72 253 -54 57 -10 45
1711D5q0j82M97l51L49j89n3k08JL52l01j71L39K27j51j1L20n85j17L33q3J41
$$ 45 -35 -217 280 -71 278 89 36 -172 -171 181 -120 -291 48 275 124 113 433 -152 -269 64 -19 122
1733A22O0k34k77K08r4J30m7J24P0j33l13M55L3j08L2R2M5l74J90q8k7J38L8k32
$$ 122 182 -52 -329 -121 -215 -85 -132 -8 62 -71 -384 71 104 -4 28 120 165 -209 -19 -107 -134 4 42 -190
1757a90L12m9m9j04K08j90k2J22o7o2L7k70J87M03k44J9j58Q3j90L01l32O7O0
$$ -190 122 73 24 -80 128 -62 -84 38 -29 -91 -54 -324 -137 266 22 41 -117 -34 -224 77 -255 -188 -128
1780a28J23M4j15L77l48N3k24L17j20KL01l04q7P5j91K52j24K73Nq5K6j11J36
$$ -128 -5 39 -76 301 -47 6 -218 99 -21 -19 282 -22 -109 -34 -225 27 -97 176 181 96 122 11 147
1803A47j13r6J21m4J1j20j60L37J03j14q3K22j40j20k8P6j3k90J36N86m27O7j51
$$ 147 34 -62 59 15 26 -94 -254 83 186 72 -11 211 71 -49 -77 -1 -14 -304 -168 418 -9 58 -93
1826i3j17K34k6L5O6j75J72J39l16J26Lq6R4Qk8j36K70k09J28P6K4k32L24q9j56
$$ -93 -210 24 -2 33 99 -76 96 235 -81 45 48 -38 56 64 36 -100 170 -39 89 165 189 -43 281 192 36
1851C6L0k84L29j08R8j92J87k44j78K02Q2J12K7k43l9J85j2N3r2K88k13R1k71
$$ 36 66 -218 111 3 101 -91 96 -148 -326 -124 -42 70 97 -146 -185 0 -12 41 -51 237 24 115 -156
1874a56M5L21l83J8K53j56pK69j48l43M87m28J76J92m5q6R2k3l6J44k6k28K50
$$ -156 -111 210 -173 -155 98 -58 -65 204 56 -287 200 -228 -52 140 95 9 101 78 42 186 160 -68 182
1897A82m1j85R1j9O9On39L31N8J20JP3m49J32L24j95j47J6K50m4Jm2K30lN3l14
$$ 182 141 -44 47 28 97 103 -436 -105 -47 73 74 147 -302 -170 154 -41 -188 -172 78 34 35 -7 223 220 273 -41
1923d1O5k89L39m5J75k58k34K92Q4l77J32K63j88r5K49J32q1l4j28PR8n1N6M7
$$ -41 24 -265 74 29 204 -54 -288 4 88 -289 -157 106 -82 -177 72 204 123 89 -39 -32 66 15 71 118
1947A18Rj47J88j24J23k81k27L75k72J56P2L2j00j15K90k65k2L37O8m44O06l45
$$ 118 127 -20 168 44 167 -114 -341 34 -238 -82 -10 22 -78 -193 97 -168 -190 147 215 -229 377 32
1969C2j39M5j59K66p3P3qK55k22%r0j93K64j99L95k99K58l99P7J77j17L2J06r0
$$ 32 -107 -62 -221 45 -28 45 37 292 70 70 -20 -213 51 -148 247 -52 206 -193 -116 61 -56 -24 82 -8
1993hj52J95j87K18k60K63L0o4J9r3j58O82n60J87l53J56J77k24K65k18J22j22
$$ -8 -160 35 -152 66 -194 69 99 35 54 -39 -197 485 -75 112 -241 -85 92 -132 133 -85 37 -85
2015h5J01j81J74J43j33j06J2L87l09K21j59j21K66k60J71mK07l53j14K03k44
$$ -85 16 -165 9 152 19 -87 -75 312 3 224 65 -56 210 -50 121 117 324 -29 -143 60 -184
2036a84r2L96j46pk9q3M7K41n56N38o1n3J32k8J84l53J96n32M07m8K69j13l00
$$ -184 -276 120 -26 -33 -62 -145 -98 143 -413 125 64 11 143 115 299 -54 142 -390 17 -31 238 125 -175
2059a75M57l85p4J55o0n8K08Rjk3j42J31m9L7j96K97k43J59j36q2L78j15k89p8
$$ -175 282 -103 -177 -22 -82 -140 68 77 76 53 -89 42 -7 30 -166 131 -112 47 -89 -171 207 92 -197 -275
2083b75K01J17j31J85P7J8k80L47m14N7M7J95P2j77P0R5k12oM3m40K58k02N60
$$ -275 -74 43 -88 97 174 192 -88 259 -155 -98 -51 144 216 39 109 204 -8 -14 29 -411 -153 -355 205
2106B05j60k55L25r4J66J9q8k58L65O2l25K07k83R3K76m71J79M0J33k91N35l46
$$ 205 45 -210 115 21 187 206 118 -140 225 287 -38 169 -114 -21 255 -216 -37 3 136 -155 380 34
2128C4l6M2j34k44N23k79p6L58j59J11p9L6l5O9p8k87J72J48l35K87l06K76n1
$$ 34 -2 40 -94 -338 185 -94 -170 188 29 140 61 97 62 131 53 -234 -62 86 -249 38 -268 8 -43
2151d3R3r8J60j86k55O35j32p4j4oJ67l74J07P2j51j99O71o18J38J86J62l98L88
$$ -43 50 -48 112 -74 -329 306 174 100 86 80 247 -127 -20 52 -99 -298 373 -245 -107 79 241 -157 231
2174B31j00o09M40J77k28J32j20J7K78m45M43j37j10J0K91k23k24K8L56l69K0
$$ 231 131 -478 -38 139 -89 43 -77 -60 218 -227 216 79 -31 -21 270 47 -177 -149 207 -162 -142
2195a42K1q8K05j56r3J06J22O2k16L36k65r6J68k04L93r6J59M3k2m75K93J22k08
$$ -142 -121 -209 -4 -160 -253 -147 -25 37 -179 157 -108 -204 -36 -240 153 57 216 259 237 -238 55 177 -31
2218c1J34l05K21J24k26J14l13M53j03J6l6K01k31n5Nl0J76j28k08K17J67j52
$$ -31 103 -202 19 143 -83 31 -282 171 68 84 48 249 18 -37 -32 -62 114 -14 -222 -5 162 10
2240A0j70l2J16K1q6L23o5l00R7j37N4O9M3P5J87k84J15o7j92P7K87l69Q1K16
$$ 10 -160 -192 -76 -55 -141 182 117 -183 -86 -223 -169 -100 -57 18 205 -79 36 -31 -223 -146 141 -228 -147 69
2264F9k55K91J41j89q4j55L19N8p1l3m5k26J79n9J63P2J2j41k02M36m20J06K03
$$ 69 -186 105 246 57 -27 -182 137 195 124 91 46 -180 -1 -60 103 175 187 46 -156 280 -140 -34 169
2287A69q3j59J34j09J55j85O2j59J76J83m71K26R2J72j64k15J1L88j38J2oj26
$$ 169 86 -73 61 -48 107 -78 -16 -175 1 184 -287 -61 31 203 39 -176 -165 223 85 97 91 -35
2309c5j29M0K30r0j57K0R6j12q6M16k07K38k70j25J59J55k34rL4J18k52K75j58
$$ -35 -164 -124 106 16 -141 -121 -25 -137 -223 193 -14 224 -46 -171 -12 143 -91 -100 -66 52 -200 75 -83
2332h3O0r7k45N07k43k8j65M8M27k00j9n4J41j83P9K35q4o7n9Kj05J03n8J00l0
$$ -83 -23 -120 -365 142 -101 -129 -294 -246 181 -19 -38 -92 49 -134 -55 180 96 29 -30 -28 -133 -30 -88 12 -18
2357a8J93j86K8m6J42k06J48q5L3J24l74J55L58l81J78j19j16J03J13j55m9o0
$$ -18 175 -11 17 -29 113 -93 55 -30 3 127 -247 -92 266 -115 63 -56 -172 -69 44 -111 -160 -220
2379b20k3K07J29j20k06L76j51J20N8L4j51j97J22Q2M5j91P5q5K1m2R6L29l60
$$ -220 -243 -36 93 -27 -233 143 -8 112 170 204 53 -144 -22 60 105 -86 -11 -96 -75 -117 -21 308 -52
2402e2l5J70M0k41n4K78k20O2K56k97j75K95Q3r5J42r5J0k00J88J14l74K55o9
$$ -52 -87 83 123 -118 -172 106 -114 -52 204 -93 -268 27 110 15 157 62 72 -128 60 174 -200 55 -14
2425a4M2n7M6L1K5j82k13K94L7J6%J23k50J3j51J91J12j27m1L24j13k02k82M73
$$ -14 28 -29 17 48 73 -109 -322 -28 9 25 25 148 -102 -89 -240 -49 63 -64 -105 219 106 -96 -378 95
2449I5m5J14j03J7l35K94m7J29J79l68L33j28k6k33K13k70P6J04M6J1k71K26J6
$$ 95 50 164 61 78 -257 37 -10 119 298 -70 263 135 109 -124 89 -181 -105 -1 45 56 -215 11 27
2472B7K3j2j85o7K18l7L7r2j56L13m35L81p4J24p3k00K58nl01R2L88l92Q5LJ38
$$ 27 50 38 -147 -214 4 -33 4 -88 -244 69 -366 15 -59 65 -8 -208 50 45 -256 -164 224 -168 -83 -80 58
2497E8r3L9K09M0j47m6j26p6J71j33J51j73R5j00J64k25K77P3k77oJ16j10j71
$$ 58 -35 4 213 253 106 60 -66 -142 29 -104 47 -126 -31 -131 33 -192 85 158 -119 -125 -9 -119 -290
2520b90J8N02k56K26l45J90n4j84JJ99M5j85N5j40L24j73J80k33J3M2J15L5q5
$$ -290 -272 230 -26 200 -145 45 -9 -193 -192 7 52 -133 -78 -218 106 -67 113 -120 -107 -65 50 85 0
2543@K27k39k84K60J10R5j45k22J37P4o2m1J94j50o7L36l56J91r6j44K65j80J00
$$ 0 227 -12 -296 -36 74 169 24 -198 -61 13 -49 -90 104 -46 -113 223 -133 58 -38 -182 83 -97 3
2566CJ27j75L32k99M7R4l13J89O4R0j96j06k1R7J31j76J67R6j41j3P4j70j4K74
$$ 3 130 -45 287 -12 35 129 -184 5 69 159 -37 -143 -164 -67 64 -112 55 151 10 -3 71 -99 -113 161
2590A61k11J49k13l22K71N02l69L07l21O9j25K95k13P2L7k92k08L43P8K06k00
$$ 161 -50 99 -114 -436 -165 337 -32 275 -46 23 -102 193 -20 52 89 -203 -411 -68 10 216 16
2611A6J51j90Q1J03p9j67j55K24jJ85j90q4O9K9l1J06n3L8j19R9l0K24j84%k09
$$ 16 167 -23 58 161 82 -85 -240 -16 -17 168 -22 -106 -37 -8 -39 67 14 52 -67 32 2 226 42 42 -167
2636a67J22J1r0J6K18O3k45J57J58l88M57l51J80J53k32j04L0k8j24M7J17r2K3
$$ -167 -45 -34 -124 -108 110 173 -72 85 243 -145 312 -39 141 294 62 -42 -12 -40 -164 -117 0 -92 -69
2659f9K16l37L53m49L23M4Jj92L04l09J94K78n62P3K65j70j75K06K47m29K23j56
$$ -69 147 -190 163 -286 37 81 82 -110 194 -115 79 357 -205 -132 133 -37 -212 -6 241 -188 35 -121
2681a21R9J00k6Q2p9j14k41N43m71K25J3J9M6k64L50m6j09n3k2J30m27M58j5k47
$$ -121 -22 78 52 134 55 -59 -300 243 -228 -3 10 29 75 -189 161 115 6 -47 -69 61 -366 92 77 -170
2705a70K25M6m01L87j17j02L19j46l3k7r8l1K99o1O9k04K54j94p4J7l9J28k65
$$ -170 55 101 -300 87 -30 -132 187 41 8 -19 -117 -148 151 90 159 -45 209 15 -59 -42 -81 47 -218
2728b18m7M56p3K0l28K69K9o4QJ20j00r9j00J42P0j45K44j17j03kP9j32J62j55
$$ -218 -265 191 118 138 -190 79 108 44 52 172 72 -27 -127 15 85 -60 184 67 -36 -38 41 -91 71 -84
2752h4K38l16J19p4O6j22J2K55l0o3l45K03J31l31J16M02k33O1J16L2R7k36N3
$$ -84 154 -162 -43 -117 -51 -173 -161 94 64 1 -344 -141 -10 -341 -225 177 -56 5 121 153 250 14 67
2775F7k4j19L9N1N8K3k41K27j9j68L11j73k4p9p8J18J23l56L65Nn13L90J21M7
$$ 67 43 -76 -37 14 72 95 -146 81 62 -106 205 32 8 -71 -149 -31 92 -264 101 106 -407 -17 104 151
2799A51j30j08N6L6J22m27K53L2R3j76L39l67O4K12l07L12l52J32Ok47N54r8r8
$$ 151 21 -87 -31 5 127 -300 -47 -15 78 -98 241 -126 -62 150 -157 155 -197 -65 -59 -306 248 150 52
2822E2O5r1J15m23L38m04N22l69M10k42J09j99J51LJ17J5j94K05k58J51m34J67
$$ 52 117 26 141 -282 56 -348 174 -195 215 -27 82 -117 34 37 154 169 -25 180 -78 73 -361 -194
2844a94L87j9k85m1P7pP7J02l8J09l9r0Q5k22R8j78J89J1m5l3j66Ql0M6J07L75
$$ -194 193 174 -111 -152 -75 -82 -5 97 59 168 129 39 124 -98 0 -178 11 22 -23 -56 -222 -214 -244 -198 -91 284
2870B84k15R4l13n2J79%j91R7L05p0m19J04rJ4L89l02R4R0O2j0l08J39j5j06L2
$$ 284 69 163 -150 -202 -23 -23 -214 -117 188 118 -301 -197 -206 -192 197 -105 -11 79 141 131 -177 -38 -53 -159 -127
2895a27R5j79M75j74m2k05K94j93J56L2k18J17n8L1p1r4j8L99j76j71Q3J79p3
$$ -127 -32 -211 264 90 48 -157 137 -56 100 132 -86 31 -27 4 -67 -161 -179 220 44 -127 -44 135 62
2918F2j37K00O4j27J8J4J38k38M0k13J68j07L22j66k83K13M4k27J66K71l65J82
$$ 62 -75 125 189 62 80 94 232 -6 34 -179 -11 -118 204 38 -245 -32 12 -215 -49 222 -143 39
2940C9K40k83m3j84N12m32M98k96O4o0Q5j87j79L82j29k31M18O6j25j52K65n23
$$ 39 279 -4 -47 -231 281 -151 347 51 115 55 140 -47 -226 156 27 -204 214 280 155 3 268 -255
2962b55K38K11k87j58L50j68J21j43K79J0j30P7n4k03L29p0m05M68k59j31K8m
$$ -255 -17 194 -93 -251 99 -69 52 -91 188 198 68 145 91 -112 217 147 -258 210 -49 -180 -152 -156
2984a56L78l40M25k50J26j76j9r1q8J13L59k02j12O3j20J70k0j2P7L6k54J73j46
$$ -156 222 -118 307 57 183 7 -12 -103 -191 -78 281 79 -33 30 -90 80 60 48 125 161 -93 80 -66
3007f6L21j70J7k45j14N15n87K83k14M20p7J31l06OK7p8k5R2L31k76j65J52KN3
$$ -66 255 85 102 -143 -257 258 -329 -46 -260 160 83 214 -92 -86 -59 -137 -162 -70 261 -15 -180 -28 -26 27
3031B7J62m07l7o3O86l92n2J49k03K47j34j89K70o1j9j8O1j34R1j71L13j04K07
$$ 27 189 -218 -255 -318 368 -24 -76 73 -130 117 -17 -206 64 3 -16 -34 27 -107 -16 -187 126 22 229
3054B29M7j84m9J97m11M59m02K9J0J43k93J62j7l4Q5P4M3k11O7qj94K51K53l86
$$ 229 276 92 43 240 -171 288 -114 -85 -75 68 -225 -63 -80 -114 -29 45 88 -123 -56 -64 -258 -7 246 -140
3078a40J71o7J07o1K36l21P1J47k78L92k9l67Q8j23j8J49L9M2J84k58K21j93R
$$ -140 31 -36 71 10 246 -75 -4 143 -135 257 228 -139 -51 -174 -192 -43 -4 38 222 -36 185 -8 1
3101Aj12K15l18kK29J88K9m0l17J59N8k20R6k5L9J21J83n36K18P6P3P7j5m17K68
$$ 1 -111 104 -214 -216 13 201 230 190 -127 32 90 -130 -34 -59 -20 101 284 -252 -34 42 115 192 177 -240 28
3126B8J19p4M2j65L9m2J44j59M22k21m51N96l22R0PJ25M1l15o2L2K5R5k04L07
$$ 28 147 73 115 -50 -11 -53 91 -68 354 133 -318 278 -44 46 53 178 219 -96 -158 -126 -101 -6 -210 97
3150I7J07o2k4q7K39k16l10L29k9j37mK5j45K01L9l11K79L9J55p7l91q6L29K02
$$ 97 204 142 118 31 270 54 -256 73 44 -93 -97 -72 -217 -16 23 -288 -9 30 185 108 -283 -369 -40 162
3174A62l33Q4J6M1J20q5J13j31J06k71K58j92J47N3j52L35l3m31M8J14l8J67j55
$$ 162 -171 -87 -71 -30 90 5 118 -13 93 -178 80 -112 35 88 -64 271 238 -193 -145 -31 -69 98 -57
3197e7P2m6L6k6K5L4j20J68j09K37l34k30M96j49l4l46L01J40k00J03o7Q4rm7
$$ -57 15 -31 5 -21 4 38 -82 86 -23 214 -120 -350 146 -3 -37 -383 -82 58 -142 -39 -106 -22 -31 -78
3221g8j30J91j62J34j74J35J35j6j3l43M3M69k00j4o2l3J03Q3j27L3R5j23k0K36
$$ -78 -208 -17 -179 -45 -219 -84 51 35 22 -321 -278 191 -9 -23 -85 -118 -15 68 -59 -26 69 -54 -74 162
3245A62K0M8k93k52L28q9K31J01k67J76j39j45o5QJ68J18j04J3j64K95k97j8J43
$$ 162 182 230 -63 -315 13 -76 155 256 -11 165 26 -119 -184 -176 -8 110 6 19 -145 150 -147 -165 -22
3268b2k7K7j2l2m10L43Nj05j03J66k0K17qkp9J42Q9n22K52J31O0J3l85K38L4j09
$$ -22 -49 -22 -34 -66 -476 -133 -128 -233 -336 -170 -190 27 19 17 -62 80 169 -353 -101 30 90 103 -282 -44 -10 -119
3294a19r2M32k00l03N06j49J50j90k22M4N3K27p7J91k88L14k60k74K51o9j04J72
$$ -119 -211 221 21 -282 224 75 225 35 -187 -143 -90 137 60 251 -37 277 17 -257 -6 -75 -179 -7
3316gK20l88J53k67n7L95j71J2L70m6k5k75l4rJ98n8j35J53O3k93K71M0JK66m28
$$ -7 213 -175 -22 -289 -346 49 -122 -110 260 214 189 -86 -120 -129 69 11 -124 29 92 -201 70 110 111 377 -51
3341e1j13o5J54m8K37j87J34j6l23K4M32k88O0j52L72m33M68k05K2K79l36K4j0
$$ -51 -164 -229 -75 -123 114 -73 61 45 -278 -254 178 -110 -50 -202 170 -263 205 0 22 301 -35 -11 -21
3364b1J39p3l94M57k33r0J15l4L69l37K40j77k41O44l93L11l14j98N13k46j00
$$ -21 118 45 -349 108 -125 -215 -100 -134 235 -102 138 -39 -280 364 -29 282 -32 -230 283 37 -63
3385f3L6J39k0r5Q2M5m28K21q7MJ80j40K92m9n4J13n2k82K5K90r5j02k73K39n4
$$ -63 -27 112 92 -3 79 124 -304 -83 -170 -166 14 -126 166 117 63 176 124 -158 -133 157 62 -40 -313 -74 -128
3410a28J37j23L96k48L5k37R5K44m31M85j07J4j09j70J14mM7l07K54J85j14mj57
$$ -128 9 -114 282 34 69 -168 -73 171 -260 225 118 132 23 -147 -33 -37 10 -297 -43 142 28 24 -133
3433a33j7L25k33k40L17J68k69k08R4J74j00Q9r6O2M6J22k84j6k7M7P5K64j69
$$ -133 -150 175 -58 -298 19 187 -82 -290 -196 -22 -122 -33 -129 -67 -21 101 -183 -199 -226 -179 -104 160 -9
3456i%k11L54J36m26N1J64r3j18NK41k22J59J58J5k26M6n0J58m2l79M11j59J08
$$ -9 -9 -220 134 270 -156 -105 59 -34 -152 -147 94 -128 31 189 204 -22 24 -26 132 90 -289 122 -37 71
3480G1j68M25k98j7N5k17Q6k15K89l35O78m58K17m9R8k49K93l37O7M7n8j25K81
$$ 71 -97 328 30 13 68 -149 -63 -278 11 -324 354 -104 113 64 162 -87 206 -131 -64 -17 -75 -200 81
3503H1j98K93k94J14J16o9K35m56J03K7J20Q7j34j51Q1J24j72j5j9j06J04n0J63
$$ 81 -117 176 -118 -4 112 43 278 -178 -75 -48 72 159 25 -126 -45 79 -93 -108 -127 -233 -129 -179 -16
3526a6q3L15o1r0l9r1r4L3J48R4n23K30N28l55M4K4j3m8j76K37jR9j26j68O6J11
$$ -16 -99 216 155 65 26 -65 -159 -126 22 116 -407 -177 351 -4 40 64 51 3 -173 64 63 162 36 -132 -66 45
3552D5rp1J01L8J09r5k97qM77k30j87J52n5Q2j63j2J37l4M4j43J00J22k84N02
$$ 45 36 -35 66 104 213 118 -179 -187 290 60 -127 25 -30 52 -111 -123 14 -20 24 -119 -19 103 -181 321
3576C21m26j26R3J51n3K5n2P3k3P4p2O8j76J86j32j09L34k11r1J04n6q0K16M92
$$ 321 -105 -231 -138 13 -40 -15 -67 6 -17 57 -15 53 -123 63 -69 -178 156 -55 -146 -42 -98 -178 38 530
3600E30n38j4o7J21j49L91l19k57J43J53J8j80L08k88K22r4j1J43R3k55j25J52
$$ 530 -8 -22 -89 32 -117 274 -45 -302 -159 -6 12 -168 140 -148 74 -20 -31 112 205 -50 -175 -23
3622b3M39m79J66M5q6j12n0m5J13J79M4J04k12j74K8n8m5J42k34K89M7N5m4l61
$$ -23 416 -63 103 148 62 -50 -100 -145 -32 147 191 295 83 -91 -63 -121 -166 -24 -258 31 78 133 89 -272
3646b72J84L56k35J33n50M01M9k31j36L51j37j94J69M3J19j81K56j47j49J93m7
$$ -272 -88 268 33 166 -384 17 66 -165 -301 50 -87 -281 -112 -69 50 -131 125 -22 -171 22 -25
3667b5r1R5J50j52J81l1j41j17L18J1m48L61j76J74l6Pj48J58Q0k83l9L85op2
$$ -25 -116 -21 129 -23 158 127 -14 -131 187 198 -250 111 -65 109 73 80 -68 90 170 -113 -152 233 227 155
3691A55k29K9m5nP1m3K20J38k19j2k41J43j0n1q8K49m1r7N6O3n2L6R2J03l59L26
$$ 155 -74 -45 -90 -95 -24 -67 153 291 72 60 -181 -38 -48 -99 -187 62 21 -76 -20 43 -9 27 119 222 -137 189
3717A89k2k42R7m5J55j92K60r7k18L36k39j96J93RJ06m04L37J00J18j70k5K2R
$$ 189 167 -75 22 -23 132 -60 200 103 -115 221 -18 -214 -21 -12 94 -310 27 127 245 75 50 72 81
3740H1k30Q3r5M24j58J00q2o8q1M0l19J82O1j9K41k04R9j75N0l00M03q7j63K44
$$ 81 -149 -66 -161 263 105 205 123 55 -26 14 -305 -123 -62 -81 160 -44 55 -120 -70 -370 33 -54 -217 27
3764B7J60ok91P1k2K57Pk34J31n2k08l3L16l9j68J62n2P0j71K9l5L87K2k90n8
$$ 27 187 181 -110 -39 -61 196 203 -31 100 48 -160 -193 123 84 -84 78 26 96 -75 -46 -81 306 328 38 -20
3789b0k07M09r3j11K0p0j91L60j81j91N12M2k89K88m04R9K31k65Q4K06q4m24M33
$$ -20 -227 182 89 -22 -2 -72 -263 97 -84 -275 237 279 -10 278 -126 -27 204 -61 23 229 145 -279 154
3812A54J5k81Q9o5o2K26JJ57j98J55l24J79N9l48L8K63N2l85J36K74j67J71q7
$$ 154 169 -112 -23 -88 -150 76 77 234 36 191 -133 46 105 -243 -205 58 110 -275 -139 135 -32 139 52
3835E2K67l51N5r4K14k83J33J04n9N6n6K77j77q7q0K5j02j15J63L8R8o0rk1m5
$$ 52 319 -32 23 -71 143 -140 -7 97 38 94 38 315 138 51 -29 -4 -106 -221 -58 -20 78 18 9 -12 -57
3860e7J5j08K9K40k52K67j60n9K81j25M4l70J43K20J1m4k02J78J48k41J28j75
$$ -57 -42 -150 -121 119 -133 134 -26 -85 196 71 115 -255 -112 108 119 75 -127 51 199 -42 86 -89
3882h9J64p1J1Oj9K12l14j2n2K74k69L09M4q2l36K25n4m3J58J13k84n7j2J03l9
$$ -89 75 4 15 21 2 214 -100 -112 -164 110 -159 150 194 112 -224 1 -53 -96 62 175 -109 -166 -178 -75 -114
3907a14L14j84K03m7J46j14j18k71J33J68m69J09J44J29k59L95k10J94j97r7N8
$$ -114 200 16 219 172 318 204 86 -185 -52 116 -353 -244 -100 29 -230 165 -45 149 -48 -145 -87
3928h7L28l79J89l3kJ08k9q2j32m8M00k48r4Q4J5j78J78O2k80L64j55j01K90m79
$$ -87 241 -138 51 18 16 124 95 13 -119 -167 233 -15 -109 -25 -10 -188 -10 52 -228 136 -19 -120 170 -309
3952c09L25Q0l12M7J59rK8o5K30k71k9J02R5L22j19k89m9j49K50M0k40J88K12
$$ -309 16 96 -216 -169 -10 -19 9 -56 174 -97 -126 -24 71 393 274 -15 -64 -213 37 77 -163 25 237
3975B37j52L8k09j13K08j00l8K38k70K29m0j4j11R7oJ20j7k7k69J32j8R5L9K15
$$ 237 85 123 -86 -199 9 -91 -129 109 -161 68 28 14 -97 0 -6 114 97 70 -199 -67 -85 10 49 264
3999B64l74J20j45J70P1j66K00o8m1K05j49n5m88O17K4L8k53q3K27j75J17k66
$$ 264 -110 10 -135 35 106 -60 140 72 31 236 87 32 -456 161 185 223 -30 -113 114 -61 56 -210
4021b10M04j82m1J83m4q0k27K66j82J27K23k62P2m6o9J56L3rR5j91j47O7K66q8
$$ -210 194 12 -29 154 110 30 -197 69 -113 14 237 -25 47 1 -68 88 121 112 207 16 -131 -64 202 114
4045A14j78N5L2j76L77p9k89J10j59j36N41l47j76L51J94k58jK91k99m1J09J05
$$ 114 -64 -9 23 -153 224 145 -144 -34 -193 -329 212 -135 -311 40 234 -24 -25 266 -33 -74 35 140
4067A40j46K50l39J47q6Q8J11k84l8J91j02j32J56K90l55J25o5k2R2J03k62L5
$$ 140 -6 244 -95 52 -34 54 165 -119 -157 34 -68 -200 -44 246 -109 16 -49 -71 21 124 -138 -103
4089a03O4M7k99L29j88L42j56K08k21j40Q0J38K4j38P7L6L0q8j25k83K56J05J7
$$ -103 -39 8 -291 38 -150 192 36 244 23 -117 -37 101 125 -13 64 100 130 42 -83 -366 -110 -5 12
4112A2q8K24l6n3J98n84L86j08J48J3k64K9j0L34l40K37N4J72l70K68j59j84R
$$ 12 -76 148 112 59 257 -327 59 -49 99 112 -152 -123 -133 201 -139 98 152 324 -46 222 63 -121 -112
4135a12K34l50K75M9k99K37k35L55K6j75P2Q1N6k10l96L26K10j29P3L1J2n4J09
$$ -112 122 -228 47 96 -203 34 -201 154 180 5 77 158 214 4 -392 -66 144 15 88 119 131 77 186
4158A86m89O55j71k07J6O7k49K01K00k21k51L67K8j43R2N4m34M36k47P9O7R0J88
$$ 186 -303 352 181 -26 -10 57 -192 9 209 -12 -263 104 132 -11 81 135 -299 137 -110 -31 36 126 314
4181C14l96J81j18J06j02j38K20p9k08K6Q9j47N25n79J50j6K30l42K68J04K7j18
$$ 314 -82 99 -19 87 -15 -153 67 -12 -220 -194 -105 -252 273 -306 -156 -172 58 -284 -16 88 115 -3
4203cM7M1o9j71J32k92K73M56l20j21P2Km12O6J31J33K75k80k19L93q5K74m18
$$ -3 44 85 16 -155 -23 -315 -42 414 94 -27 45 47 -365 -299 -168 -35 240 -40 -259 134 49 323 -95
4226i5J75k56m7N16l20M4ML0j85n1J37K18l83J99k23K09L81m72K27k2j54J02k22
$$ -95 80 -176 -223 293 -27 17 21 51 -134 -185 -48 170 -213 -14 -237 -28 353 -119 108 86 -68 34 -188
4249a88M00k23M9m15N21k40J37j05K79j92j22R1j14k0J26KJ3J2j13L4L5K66m78
$$ -188 212 -11 38 -377 144 -96 41 -64 215 23 -99 -8 -122 -142 -16 -14 -1 11 -102 -68 -33 233 -245
4272b45M00j83K18j23J96l54M0J11p0p8k42M53o1L1m3j41m2J0K74k16L5j54N3
$$ -245 155 -28 190 67 263 -91 -51 60 -10 -88 -330 123 62 93 50 -91 -133 -123 151 -65 -30 -184 -131
4295a31M8J83j70R4p6m2L20k41q8P6K83k04j86R0n5j1j98L91j13m1J58j56L5n6
$$ -131 -83 100 -70 24 -52 -94 226 -15 -103 -27 256 52 -134 -44 -99 -110 -308 83 -30 -71 87 -69 -34 -90
4319i0O2j3o4P3J99l02O1k10K68j34L07p2k07%K34j86j64Q3K08J29m41O7K65N
$$ -90 -28 -41 -105 -32 167 -135 -74 -284 -16 -150 157 85 -122 -122 112 -74 -238 -155 53 182 -259 -192 73 78
4343G8j2J00n9j0j4k9k12K23l14K52Q7k74p4O3M2L96k48L1Ml0M1k4k37L63j80
$$ 78 66 166 107 97 83 54 -158 65 -249 3 90 -184 -258 -195 -153 243 -5 26 30 0 41 17 -220 143 -37
4368c7J13J65j87j24m0K10k28K07j98M68k47lJ08j21N9k36K10N3J9q0l1P6o9k37
$$ -37 76 241 54 -70 -110 100 -128 79 -119 349 102 99 207 86 145 -91 119 172 191 111 80 156 87 -150
4392a50K01m92K83L08l52K34K7j58O1n6J6M3j94K82k53K04L7R3j91j59J90k1J42
$$ -150 51 -441 -158 150 -202 32 59 -99 -38 -94 -78 -35 -229 53 -200 4 41 134 -57 -216 -26 -47 95
4415I5M7j69n2r9L49k83K10k53L47l33j39L48o8O7J14k17J94P9m61N13k97O9r7
$$ 95 142 -27 -79 -178 171 -112 98 -155 192 -141 -280 68 0 67 181 -36 158 237 -224 289 -8 61 -36
4438c6R0P3n9j22K27l84K73K37l32K49o3k59K33j43m5L8OO9j09J03q0K67j76l5
$$ -36 54 127 68 -54 173 -211 62 299 -33 216 153 -106 127 -16 -61 -23 -17 52 -57 46 -34 233 57 22
4462B2Q2j22l5n6K20k65J00k20K07r5N3J01L17k63J70j38j2klj32m5n2J43K97
$$ 22 104 -18 -53 -109 111 -154 -54 -274 -67 -162 -109 -8 309 46 216 78 66 64 61 -71 -116 -168 -25 272
4486B72l42l40K84J88j76K70O2j29o7l07L77q0N9j48J69J8m0l4j65J14r2J8JK19
$$ 272 -70 -410 -126 62 -114 156 218 89 22 -285 92 12 71 -77 92 110 70 36 -129 -15 -107 -89 -88 131
4510A31K4k44k1J30k53K58l81M79l4j46Q8m2Jj0M2J1L8q1j2Q9j61%J65o7m3M57
$$ 131 155 -89 -110 20 -233 25 -356 123 89 -57 31 -11 -10 -20 22 33 71 -10 -22 67 -94 -94 71 4 -39 418
4536D18k97K7j60j30J23R7r1k4p7j25J37J%j09k0R5R6M4J43k03J19j65K0J43j76
$$ 418 121 148 -12 -142 -19 78 -13 -37 -114 -239 -102 -101 -101 -210 -230 -135 -39 5 148 -55 64 -101 -81 62 -114
4561a14j80K64J90k51J1k03K64j72K20j97J85p7N1l7J57k10J87N5j25L40j15q9
$$ -114 -294 -30 160 -91 -80 -283 -19 -191 29 -168 17 -60 -9 -46 111 -99 88 143 18 358 243 154
4583A54j65J52j62k6r8L52k13m7J81q4j45J05QJ80j14P3J13l51Q7j39o5K42M1
$$ 154 -11 141 -21 -47 -145 207 -6 -53 128 44 -101 4 12 192 78 151 264 -87 0 -139 -204 38 79
4606G9j4j15m3Q0l7j48L0L4L16k43L68l63J43J02l1j44j29L5K1J0k37L82j02J54
$$ 79 65 -50 -93 -13 -50 -198 -168 -134 182 -61 307 -56 87 189 158 14 -115 -80 -59 -49 -286 96 -6 148
4630A48m90M87K48m82j1K04k94K01q8m1p1K36p9J15o8n7q6j47K50l1L6L13k65
$$ 148 -342 145 393 -89 -100 104 -190 11 -77 -118 -189 47 -32 83 15 -42 -128 -275 -25 -56 -20 293 28
4653B8l67K56n0l19N60o3J55O5l51j00J35L48l90K95l49J18P6O9L0j44JJ02j24
$$ 28 -339 -83 -133 -452 108 45 200 265 -86 -186 -51 297 -93 202 -147 -29 47 116 146 2 3 105 -19
4676a9m2K23l00O9J9k62L24k83L67J0j37J16j17KJ7n4J3J36J36j50jn9L71l87
$$ -19 -61 162 -138 -69 -50 -312 12 -271 96 106 -31 85 -32 -30 -13 -67 -54 82 218 68 67 8 379 -8
4700hPj61J71j99Q1L61l6k04j73L4J76j30L31k30l3j0M9L4k54J62p6j44M61k49
$$ -8 -1 -162 9 -190 -109 252 216 12 -161 -127 49 -81 250 20 -13 -23 26 60 -194 -32 -108 -252 209 -40
4724d0J04m98K70K95j75J40j22k4J71l31K35oj44K48j04P1q6J45k65O9Nj51k9
$$ -40 64 -434 -164 131 -44 96 -26 -50 121 -210 25 19 -125 123 19 90 4 149 -116 -47 -42 -193 -222
4747b22M08m16O8J02J97j10l3jL6j87L75q8j80k69K10N25p28L26j69K49k48J91
$$ -222 186 -230 -162 -60 137 27 -6 -7 29 -158 217 129 -51 -320 -110 415 -313 13 -156 93 -155 36
4769C6j07K23o3l03M97k50J24k29J20o8J75J60j62r8l10L79Q4j09k70Q7K56j90
$$ 36 -71 152 89 -214 283 33 157 -72 48 -20 155 315 153 55 -255 124 208 99 -171 -84 172 -18
4791a8l1j94J16j30N99m79M1J43k17N69m64M5j7K88l59O4j0k77M54O1k59K3j36
$$ -18 -49 -243 -127 -257 342 -137 -96 47 -170 399 -65 -20 -37 251 -108 -44 -54 -331 123 184 -75 -52 -188
4814a88K02M7m3j79K60l4R2k11r1m0J63j64J48J08k23lM81k60j05J48n9k7L56
$$ -188 14 61 18 -161 99 65 157 -54 -145 -185 -22 -186 -38 70 -153 -156 325 65 -40 108 49 22 378
4837C78l32j65K21k33Q9P5q0L3P9L17o17Q7L12l22J87J20L6k73o6K17oK38k69
$$ 378 46 -119 102 -131 -42 33 -47 -14 65 382 -235 -148 164 -158 29 149 185 -88 -154 63 57 295 26
4860B6L07m59J03j21k0J78M7k5J00K65m09k84M59M5j46mq8L31m97K79j86J67k58
$$ 26 333 -126 -23 -144 -164 14 61 36 136 401 -8 -292 167 212 66 62 -26 305 -192 87 -99 68 -190
4883a90L64j55j46j15L56k26K48n9r5O9J32k23J22j78L4O9O0Q9l92N3q9K96k78
$$ -190 174 19 -127 -242 114 -112 136 77 -18 51 183 -40 82 -96 -62 7 67 156 -236 -183 -272 24 -254
4906b54N86l33j72K09j39O4J6o7J2J14O3k79L01n7j72J76j33K5j51J79k89L62
$$ -254 332 -1 -173 36 -103 -39 -23 -90 -78 36 99 -180 121 64 -108 68 -65 -40 -191 -12 -301 61
4928F1k33P7J30N7j52K5K03j37J23l00K19j51N7J82j57l2p0L21q0l03K89j96J21
$$ 61 -172 -95 35 92 -60 -35 168 31 154 -146 73 -78 -21 161 4 -28 -98 223 143 -160 129 -67 54
4951E4q9J19J3j07kj87L25j27J09J53n12J6K88j89J12J27J8j08k19M26j09j31
$$ 54 -35 84 97 -10 -12 -199 126 -1 108 261 -251 -235 53 -136 -24 103 121 13 -206 220 111 -20
4973b0J23K71l62j23l14L51l5j54K12j11M47k74N0k06K4K11o5Qm2q7qK29J7l66
$$ -20 103 374 12 -111 -425 -74 -109 -263 -51 -162 285 11 61 -145 -121 90 25 33 -9 -96 -104 125 142 -224
4997b24J82M6r4J89j24j27K47Jk17k9J5M49j97r9o4j56K36l0j51k43M38j85K09
$$ -224 -42 4 -90 99 -25 -152 95 96 -121 -150 -135 314 117 18 -46 -202 34 4 -147 -390 48 -137 72
5020G2k5j96M23m01o4J34m0K8O0M6j4kJ19k70K87j9pj87j47K48o1K2J89m86N3
$$ 72 47 -149 274 -127 -191 -57 -97 -69 -9 37 23 21 140 -130 157 138 131 -56 -203 45 -16 6 195 -291 -238
5045b38N13l25O3l5J36j08j2j82J83J20k18PJ40q8J11k46J44J61k51Q0K30n2j14
$$ -238 275 -50 13 -22 114 6 -6 -188 -5 115 -103 -96 44 -44 67 -179 -35 126 -125 -45 185 133 19
5068A9M8l69J71L18j70K2n9J17P0j71M15n61j16K00J64j72KK04l1k81J90k31L02
$$ 19 67 -302 -131 187 17 39 -20 97 167 -4 411 -150 -266 -66 98 -74 -72 132 101 -180 10 -221 81
5091H1j05J13j39J20l33J45L70k14l87N02r7J5Q4l30K98k27J05j85J49J51n1J14
$$ 81 -24 89 -50 70 -263 -118 252 38 -349 153 56 71 155 -175 123 -104 1 -184 -35 116 65 179
5113A79m2K7k23K7K56mj30j83P8o0j66J96O7K40k84l11L11M4M2j65P3K1K34k7
$$ 179 137 164 -59 -32 224 220 90 -93 -15 -75 -241 -45 22 262 -22 -333 -22 22 64 -101 -28 -7 227 200
5137B00k49R3N4j80L55l38l26L71O6J29k28J5K69n54P58m49J17l38J24L01k92
$$ 200 -49 44 98 -82 273 -65 -391 -20 46 175 -53 -38 231 -323 435 -14 103 -235 -111 190 -102
5158a02K2K34o5k27K05k4M9j14J0j96l3O45m23J61P2k02j85N6J32K80j45j35l8
$$ -102 -80 154 89 -138 67 43 92 -22 -12 -208 -241 404 -19 142 214 12 -173 -117 15 295 150 15 -23
5181b3m5L28k85m36M01R7k44O8R3K01k65j48J77k75K74J03k38J80J91j02M9k26
$$ -23 -68 260 -25 -461 -60 37 -207 -139 -46 155 -110 -258 -81 -356 -82 21 -217 -37 154 52 101 -125
5203a25J07o4q2L41j87k61L37J91m03L14j49j57O4K37J22l16j10J60R2k46m4J08
$$ -125 -18 -82 -164 177 -10 -271 66 257 -146 168 19 -138 -74 163 285 -31 -141 19 111 -135 -179 -71
5225g1n4L59j99L5n5l4J51k24j9k10M02k9l39K38j22J89j39J47k51k8M13k25o3
$$ -71 -125 234 35 70 15 -19 132 -92 -111 -321 81 52 -287 -49 -171 18 -121 26 -225 -253 160 -65 -128
5248a28J25k8J90k85R2k7M16l09k32K15Q7l5q7k7L01j52k18j55J07L47l87K73
$$ -128 -3 -31 159 -126 -34 -61 355 46 -186 29 116 81 -6 -33 268 116 -102 -257 -150 197 -190 83
5270H3m2l7j5K74k29k85L36K2j33L26k78k7l2j79L98j68r7l2M3j33L4K78k08k6
$$ 83 41 4 -11 263 34 -251 85 107 -26 300 22 -5 -37 -216 182 14 -83 -115 -72 -205 -171 107 -101 -127
5294a27R1o1J58l3j11J05l4k85L42J02j82M6j24J09j7k2N5k01L1N5j40N37l02
$$ -127 -36 -97 61 28 -83 22 -12 -297 45 147 -35 11 -113 -4 -21 -43 12 -189 -158 -103 -243 294 -8
5317hJ56l47j16J91K76n0O9k09j23L77L9l96J00%J21m07J79J29M5n0J75k50J51
$$ -8 148 -199 -315 -124 152 102 171 -38 -161 216 255 -141 -41 -41 80 -327 -148 -19 26 -24 151 -99 52
5340E2K18k61M0k6j16j47O0J61K71m18L12j73J36l5O1q5P1j35N2n1L9K32k04K4
$$ 52 270 9 49 23 -93 -240 -180 -19 252 -166 146 -27 109 74 135 50 121 -14 38 -13 26 258 54 78
5364G8k95k96K74J81J64J2rq7k65K70m9j07j48J28j21L09j04k4o0K47rp6J9p7
$$ 78 -217 -513 -239 -58 106 118 109 22 -243 27 -22 -129 -277 -149 -270 39 -65 -89 -149 98 89 13 32 -45
5388d5J27n0P7j73Q1j60L28o1J4k36OL22q8j53n7N9K59l00K86j05k56K64j12j77
$$ -45 82 32 109 -64 17 -143 185 124 138 -98 -92 230 142 -11 -68 -9 250 -50 236 131 -125 139 27 -150
5412a50o0M24J19j66l06J61k16M25n42L30k53K36j0k17J8NK57Mk6j64M8O9k39
$$ -150 -210 214 333 167 -139 22 -194 231 -311 19 -234 2 -8 -225 -207 -202 55 59 33 -131 -83 -14 -253
5435b53K32o1J07K6j57J8K09j09k16L31k01O8K8J04p8J89m58K10K17k94R1K95
$$ -253 -21 -82 25 51 -106 -88 121 12 -204 127 -74 -6 22 126 48 237 -221 -11 206 -88 3 298
5457B98j30j99m0J69J59l03N4k31K09J60k42l0J76J99k89m0L19k9r0%k26J28K2
$$ 298 168 -31 -71 98 257 -46 8 -223 -14 146 -96 -126 50 249 -40 -80 239 210 120 120 -106 22 44
5480D4k45K97k41j39K58Kk3j1O5J67k57J52k2j7J6p7Nj00j36K50K6Rj01j3K36
$$ 44 -201 96 -145 -284 -26 -24 -47 -58 7 174 -83 69 47 30 46 -31 -26 -126 -262 -12 14 23 -78 -91 145
5505A45J15l56L3L96k51j82J67k0j14o5K35Ml99N42J3k34j19m6J0J82j92J65j98
$$ 145 260 -96 -63 333 82 -100 67 47 -67 -132 103 107 -292 250 263 29 -90 -136 -126 56 -136 29 -169
5528a69J23Q3J5J03l44J88J4j31K44j9J3r0j74J59L05j81n3j64J27k29R5J21K1
$$ -169 -46 37 52 155 -189 -1 13 -118 126 107 120 30 -144 15 320 139 86 -78 49 -180 -85 36 57
5551E7j14M4j6J30j35J98o2k52J47O3K01l82M42n66J89R4P8Pk98L42k73L63o4
$$ 57 -57 -13 -29 101 -34 164 102 -150 -3 60 261 -121 321 -245 -56 38 116 123 -175 167 -106 257 193
5574A93J75n86J85R0k13K43j37n9n5J78kK30m43L72k65J56r0J56J1J38o16N27
$$ 193 368 -218 -33 57 -156 87 -50 -109 -164 14 12 242 -201 171 -94 62 -28 128 139 277 -339 188
5596A88Kk77R1l43N10j84N4k01m4K49j71k8J67N0o3k20K12k64L14o0O4K18k44
$$ 188 190 -87 4 -339 171 -13 41 -160 -204 45 -126 -154 13 63 0 -220 -8 -272 42 -18 46 264 20
5619B0o3M3o2K82k04l33J66n2J64K70j40J2j41r5L19l16K99j18k1J18k09J78l4
$$ 20 -43 0 -62 220 16 -317 -151 -203 -39 231 91 103 -38 -133 186 -130 169 51 30 148 -61 117 83
5642H3k55J03R8m8j84P9MM19j48M2j29k63M60l53M46n04J91L9j0N3k20J93L9j86
$$ 83 -172 -69 29 -19 -203 -124 -120 299 151 193 64 -199 261 -92 354 -150 41 80 70 123 -97 96 135 -51
5666e1k11J89Q1j19m2J99R4J03l00J6r5K06p0J42j50k40M75l85J94J27m22K62
$$ -51 -262 -73 8 -111 -153 46 140 243 -57 -41 -136 70 0 142 -8 -248 227 -158 36 163 -259 3
5688CJ53j59L3j55J72J59l98K2j2L52j25k50J88J15k6J20k94L41m8j51pJ34J4
$$ 3 156 -3 30 -125 47 206 -192 -170 -182 170 45 -205 -17 98 72 192 -102 239 191 40 33 167 181
5711A81j82q1j58O8K39J89o8j72J69j06p4j78J99K18l20n3j8L62j85k7J54n9M5
$$ 181 -1 -82 -240 -172 67 256 188 16 185 79 5 -173 26 244 -76 -129 -147 215 30 3 157 98 143
5734A43k66K47l40K80k25N3J52k20K33k86M11k38n2q8J03K16k04oJ10n2jN2J06
$$ 143 -123 124 -216 64 -161 -108 44 -176 57 -229 182 -56 -108 -196 -93 123 -81 -87 23 -29 -30 22 128
5757A28J09k95P5j62J97p0L1R2j08R0l78K52J80l06J08K1j10L43j63R0j87k63
$$ 128 237 -58 17 -145 52 -18 13 105 -3 87 -291 -39 141 -165 -57 -36 -146 197 34 124 -63 -326
5779c26L68r0M4j7k11L27J06o5k58J93j14K00l41J05J79J04k83K20k38L22k84
$$ -326 42 -48 -4 -21 -232 95 201 136 -122 71 -43 157 -184 -79 100 204 -79 141 -97 225 -59
5800e9k15L63k98K07j58j2K38m1k16K25j54J6rJ22o8O0j50J77J73k03n8K89j12
$$ -59 -274 89 -209 -2 -160 -172 66 25 -191 34 -120 -104 -113 9 -59 1 -149 28 201 -2 -60 229 117
5823A17j11k2J95k30j04K17J23k26J74k73k9N48k77oK1mN7k04J80j93J01J8O5
$$ 117 6 -16 179 -51 -155 62 185 -41 133 -140 -169 379 102 96 117 113 170 -34 146 -47 54 72 137
5846A37l9K3j30Q1J05J84m80K22q4lj73K46L5k93Q2J34J18q5L6l67K35n9J91J0
$$ 137 98 121 -9 72 177 361 -119 103 19 16 -157 89 124 -169 -87 47 165 80 116 -251 -16 -75 116 126
5870A26q1k2j89M97k78jK28j54j68n3N3j4k50N42l24L6O4m3M13m40j59K27j67
$$ 126 45 23 -166 331 53 52 280 126 -42 -95 -42 -56 -306 236 -88 -52 12 -31 382 -58 -217 10 -157
5893a57J16P6j34M3p3L24k12j03R4J22j80O3J5q5Q3J4J64j42jj18O9r2K10q1k1
$$ -157 -41 35 -99 -56 -129 195 -17 -120 -26 96 -84 -21 -6 -91 -8 6 170 28 27 -91 -22 -114 96 15 -6
5918fQ9j73K43o8j39J69m1K52m88K11J51Mj23r1N2J96k82j18K04J3k33L00j24
$$ -6 83 -90 153 85 -54 115 74 326 -162 49 200 204 81 -10 42 238 -44 -162 42 55 -178 122 -2
5941bK7P2j74l49L95J40l9n3J02q8l6k83K31J31J26R2k78K3k2R6k14J62J17o3
$$ -2 25 97 -77 -426 -31 109 70 17 119 31 -5 -288 -57 74 200 292 14 37 15 111 -103 59 176 113
5965A13j21R0r7l1n5k51M52J5n2P2o9k6L4k03K63j81QRK02k34j28J44L3j39J05
$$ 113 -8 82 -15 -46 -101 -352 100 115 63 135 66 40 74 -129 134 -47 -39 -30 172 -62 -190 -46 -13 -152 -47
5990d7k87L44K74l70K33k24J20L5j29N3J30K70m34O1k91J49N1J52Q9N6j35k08
$$ -47 -334 10 284 -86 147 -77 43 78 -51 2 132 402 -32 29 -262 -113 -62 90 179 235 100 -108
6012a08J34O6m4p1o4R2j72L08j82M5J11J81k59o8R6Q0j57l1J90k42J36O7k58L48
$$ -108 26 92 48 -23 -87 5 -167 141 -41 4 115 296 37 -31 65 145 -12 -43 147 -95 41 108 -150 198
6036A98l26R7N6k09K28k67K59p8N2j46M7j42J74J07l98K94J2K9K02k05J76m7m06
$$ 198 -128 -31 25 -184 44 -223 36 -42 10 -136 -89 -231 -57 50 -348 -54 -42 -13 189 -16 160 113 -293
6059b93K03K44j55K13j47k5k9k03K10Q3k7N2k05m7K8p9L11J30m40L1M0J27o8J70
$$ -293 -90 154 -1 212 65 40 11 -192 18 101 74 126 -79 -126 -98 -177 134 264 -176 -145 -105 22 -46 124
6083A24k28K7P4L60m33K75m56J45L22k6m1j67J25j25J14j94jJ23J33j78O4Qmj85
$$ 124 -104 -77 -3 357 -76 199 -257 -112 210 184 143 -24 101 -24 90 -104 -105 18 151 -27 37 45 41 -144
6107a44J21QKr6M0J55j36o1l9J22L13J00j39m17K14O7j35j80k5J09k04J64k4L34
$$ -144 -23 -15 -13 -109 -69 86 -50 -111 -150 -28 285 385 246 -171 43 110 -25 -205 -230 -121 -325 -161 -185 149
6131A49k99K70j76L5k4j3L88l25K07k26Q7K09m51L96m01L05r1o1o1r6j26K02N1
$$ 149 -150 120 -56 -21 -45 -58 330 5 212 -14 73 282 -169 227 -174 131 40 -21 -82 -178 -304 -102 -51
6154e1J86j1n2n0K13p6k87L67n18N01l34m0l0J45J1J18j66j24K36j63K12p9j92
$$ -51 135 124 72 22 235 159 -128 239 -279 222 -112 -152 -182 -37 -26 92 -74 -198 38 -125 87 8 -184
6177a84l1M29k38j7K92k09j20K56j43mq9Q0j30p3Rn3L31N7m8Ok25L3K18p9k88
$$ -184 -215 214 -24 -41 251 42 -78 178 35 31 -58 22 -108 -181 -172 -225 106 163 115 121 -104 -71 147 68 -220
6202b20J43P7K16j60O8k30n7K60O5j47j69J60N9m3m8r1l8M9J26J05P8k89n0J15
$$ -220 -77 0 216 56 124 -106 -163 97 162 15 -154 6 65 22 -26 -117 -155 -106 20 125 203 -86 -136 -21
6226b1k55L01J87l1j06pj45J23j79J32J9k36J78K50j38j10J50j17j72l2L66k3
$$ -21 -276 25 212 181 75 68 -77 46 -133 -1 18 -218 -40 210 72 -38 112 -5 -177 -209 157 134
6248A34k52M1J98n7m1P1o4P8j90N1j32J13r0J09L63l78p6R7j27N5L1K56m00K55
$$ 134 -118 -77 121 64 23 94 30 108 -82 -31 -163 -50 -140 -31 332 -46 -122 -25 -152 -97 -66 190 -210 45
$$ [...]
8191a41
##END NTUPLES=NMR FID
##END=
