##TITLE=1H_DE-99_oil_2
 200.13MHz,CDCl3,
 8 sc
 
 4.7.2025
##JCAMPDX= 6.0         $$ Bruker NMR JCAMP-DX V2.0
##DATA TYPE= NMR FID
##DATA CLASS= NTUPLES
##ORIGIN= UXNMR, Bruker Analytische Messtechnik GmbH
##OWNER= pz
$$ XWIN-NMR		Version 3.5
$$ Fri Jul  4 15:19:09 2025 Russian Standard Time (UT+4h)  she@DPX200
##.OBSERVE FREQUENCY= 200.1313
##.OBSERVE NUCLEUS= ^1H
##.DELAY= (6, 6)
##.ACQUISITION MODE= SIMULTANEOUS
##.ACQUISITION SCHEME= undefined
##.AVERAGES= 8
##.DIGITISER RES= 18
##SPECTROMETER/DATA SYSTEM= spect
##.PULSE SEQUENCE= zg30
##.SOLVENT NAME= CDCl3
##.SHIFT REFERENCE= (INTERNAL, CDCl3, 0, 14.3821)
##AUDIT TRAIL= $$ (NUMBER, WHEN, WHO, WHERE, WHAT)
$$ ##TITLE= Audit trail, XWIN-NMR		Version 3.5
$$ ##JCAMPDX= 5.01
$$ ##ORIGIN= Bruker BioSpin GmbH
$$ ##OWNER= she
$$ F:/spectra/data/she/nmr/H-C/1/audita.txt
$$ ##AUDIT TRAIL=  $$ (NUMBER, WHEN, WHO, WHERE, WHAT)
(   1,<2025-07-04 15:17:17.98 +0400>,<she>,<DPX200>,
      <created by zg, POWCHK disabled, PULCHK disabled
       configuration hash MD5:
       00 E9 B6 7A A2 85 ED C7 34 08 36 98 17 FE 4E 26
       data hash MD5: 16K
       71 F0 1E 88 A7 61 95 C2 46 EE 46 A2 ED 15 C7 6B>)
$$ ##END=
$$ 
$$ hash MD5
$$ 49 67 D9 B2 57 5D 8D 33 D0 05 0C CE A5 38 6A 44
##$RELAX= 
##$RELAX= 
##$RELAX= 
##$RELAX= 
##$RELAX= 
##$RELAX= 
$$ Bruker specific parameters
$$ --------------------------
##$DU= <F:/spectra>
##$EXPNO= 1
##$NAME= <H-C>
##$PROCNO= 1
##$TYPE= <nmr>
##$USER= <she>
##$AMP= (0..31)
100 100 100 100 100 100 100 100 100 100 100 100 100 100 100 100 100 100 
100 100 100 100 100 100 100 100 100 100 100 100 100 100 
##$AQSEQ= 0
##$AQ_mod= 1
##$AUNM= <au_zg>
##$AUTOPOS= <>
##$BF1= 200.13
##$BF2= 200.13
##$BF3= 200.13
##$BF4= 200.13
##$BF5= 200.13
##$BF6= 200.13
##$BF7= 200.13
##$BF8= 200.13
##$BYTORDA= 1
##$CFDGTYP= 0
##$CFRGTYP= 5
##$CHEMSTR= <none>
##$CNST= (0..31)
1 1 145 1 1 1 1 1 1 1 1 1 1 1 1 1 1 1 1 1 1 1 1 1 1 1 1 1 1 1 1 1 
##$CPDPRG= <>
##$CPDPRG1= <>
##$CPDPRG2= <>
##$CPDPRG3= <>
##$CPDPRG4= <mlev>
##$CPDPRG5= <mlev>
##$CPDPRG6= <mlev>
##$CPDPRG7= <mlev>
##$CPDPRG8= <mlev>
##$CPDPRGB= <>
##$CPDPRGT= <>
##$D= (0..31)
0 0.7 0 0 0 0 0 0 0 0 0 0.03 0 0 0 0 0 0 0 0 0 0 0 0 0 0 0 0 0 0 0 0 
##$DATE= 1751627837
##$DBL= (0..7)
120 120 120 120 120 120 120 120 
##$DBP= (0..7)
150 150 150 150 150 150 150 150 
##$DBP07= 0
##$DBPNAM0= <>
##$DBPNAM1= <>
##$DBPNAM2= <>
##$DBPNAM3= <>
##$DBPNAM4= <>
##$DBPNAM5= <>
##$DBPNAM6= <>
##$DBPNAM7= <>
##$DBPOAL= (0..7)
0.5 0.5 0.5 0.5 0.5 0.5 0.5 0.5 
##$DBPOFFS= (0..7)
0 0 0 0 0 0 0 0 
##$DE= 6
##$DECBNUC= <off>
##$DECIM= 32
##$DECNUC= <off>
##$DECSTAT= 4
##$DIGMOD= 1
##$DIGTYP= 9
##$DL= (0..7)
0 120 120 120 120 120 120 120 
##$DP= (0..7)
150 150 150 150 150 150 150 150 
##$DP07= 0
##$DPNAME0= <>
##$DPNAME1= <>
##$DPNAME2= <>
##$DPNAME3= <>
##$DPNAME4= <>
##$DPNAME5= <>
##$DPNAME6= <>
##$DPNAME7= <>
##$DPOAL= (0..7)
0.5 0.5 0.5 0.5 0.5 0.5 0.5 0.5 
##$DPOFFS= (0..7)
0 0 0 0 0 0 0 0 
##$DQDMODE= 0
##$DR= 18
##$DS= 0
##$DSLIST= <SSSSSSSSSSSSSSS>
$$ [...]
##$SUBNAM0= <"">
##$SUBNAM1= <"">
##$SUBNAM2= <"">
##$SUBNAM3= <"">
##$SUBNAM4= <"">
##$SUBNAM5= <"">
##$SUBNAM6= <"">
##$SUBNAM7= <"">
##$SUBNAM8= <"">
##$SUBNAM9= <"">
##$SW= 18.0517328524113
##$SWIBOX= (0..15)
0 0 2 0 0 0 0 0 0 0 0 0 0 0 0 0 
##$SW_h= 3612.71676300578
##$TD= 16384
##$TD0= 1
##$TE= 0
##$TE2= 300
##$TE3= 300
##$TEG= 300
##$TL= (0..7)
0 120 120 120 120 120 120 120 
##$TP= (0..7)
150 150 150 150 150 150 150 150 
##$TP07= 0
##$TPNAME0= <>
##$TPNAME1= <>
##$TPNAME2= <>
##$TPNAME3= <>
##$TPNAME4= <>
##$TPNAME5= <>
##$TPNAME6= <>
##$TPNAME7= <>
##$TPOAL= (0..7)
0.5 0.5 0.5 0.5 0.5 0.5 0.5 0.5 
##$TPOFFS= (0..7)
0 0 0 0 0 0 0 0 
##$TUNHIN= 0
##$TUNHOUT= 0
##$TUNXOUT= 0
##$USERA1= <user>
##$USERA2= <user>
##$USERA3= <user>
##$USERA4= <user>
##$USERA5= <user>
##$V9= 5
##$VALIST= <valist>
##$VCLIST= <CCCCCCCCCCCCCCC>
##$VD= 0
##$VDLIST= <DDDDDDDDDDDDDDD>
##$VPLIST= <PPPPPPPPPPPPPPP>
##$VTLIST= <TTTTTTTTTTTTTTT>
##$WBST= 1024
##$WBSW= 4
##$XGAIN= (0..3)
0 0 0 0 
##$XL= 0
##$YL= 0
##$YMAX_a= 115716
##$YMIN_a= -180511
##$ZGOPTNS= <>
##$ZL1= 120
##$ZL2= 120
##$ZL3= 120
##$ZL4= 120
##$ABSF1= 10
##$ABSF2= 0
##$ABSG= 5
##$ABSL= 3
##$ALPHA= 0
##$AQORDER= 0
##$ASSFAC= 0
##$ASSFACI= 0
##$ASSFACX= 0
##$ASSWID= 0
##$AUNMP= <proc_1d>
##$AZFE= 0.1
##$AZFW= 0.1
##$BCFW= 1
##$BC_mod= 2
##$BYTORDP= 1
##$COROFFS= 0
##$CY= -3
##$DATMOD= 1
##$DC= 2
##$DFILT= <>
##$DTYPP= 0
##$F1P= 0
##$F2P= 0
##$FCOR= 0.5
##$FTSIZE= 0
##$FT_mod= 4
##$GAMMA= 1
##$GB= 0.15
##$INTBC= 1
##$INTSCL= 1
##$ISEN= 128
##$LB= 0.25
##$LEV0= 0
##$LPBIN= 0
##$MAXI= 10000
##$MC2= 0
##$MEAN= 0
##$ME_mod= 0
##$MI= 1.114404
##$NCOEF= 0
##$NC_proc= 0
##$NLEV= 6
##$NOISF1= 3.799351
##$NOISF2= 2.8
##$NSP= 1
##$NTH_PI= 0
##$NZP= 0
##$OFFSET= 14.38212
##$PC= 1
##$PHC0= -1204.757
##$PHC1= 13.79223
##$PH_mod= 1
##$PKNL= yes
##$PPARMOD= 0
##$PSCAL= 0
##$PSIGN= 0
##$REVERSE= no
##$SF= 200.129724274929
##$SI= 16384
##$SIGF1= 3
##$SIGF2= 2
##$SINO= 400
##$SIOLD= 16384
##$SREGLST= <1H.CDCl3>
##$SSB= 0
##$STSI= 0
##$STSR= 0
##$SW_p= 3205.1282051282
##$SYMM= 0
##$S_DEV= 0
##$TDeff= 0
##$TDoff= 0
##$TI= <>
##$TILT= no
##$TM1= 0
##$TM2= 0
##$TOPLEV= 0
##$USERP1= <user>
##$USERP2= <user>
##$USERP3= <user>
##$USERP4= <user>
##$USERP5= <user>
##$WDW= 1
##$XDIM= 8192
##$YMAX_p= 0
##$YMIN_p= 0
$$ End of Bruker specific parameters
$$ ---------------------------------
##NTUPLES= NMR FID
##VAR_NAME=  TIME,          FID/REAL,        FID/IMAG
##SYMBOL=    X,             R,               I
##VAR_TYPE=  INDEPENDENT,   DEPENDENT,       DEPENDENT
##VAR_FORM=  AFFN,          ASDF,            ASDF
##VAR_DIM=   8192,          8192,            8192
##UNITS=     SECONDS,       ARBITRARY UNITS, ARBITRARY UNITS
##FACTOR=    0.0002768,     1,               1
##FIRST=     0,             0,               0
##LAST=      2.2672688,     0,               0
##MIN=       0,             -180511,         0
##MAX=       2.2672688,     115716,          0
$$ Real data points
##PAGE= N=1
##DATA TABLE= (X++(R..R)), XYDATA
0 0 0 0 0 0 0 0 0 0 0 0 0 0 0 0 0 -8 8 -8 8 -8 16 -16 16 -22 24 -29 32 -39 41 -48 56 -64 72 -81 93 -103 117
37 117 -129 144 -160 181 -199 220 -244 269 -299 328 -361 400 -439 482 -533 588 -649 718 -795
56 -795 885 -992 1110 -1254 1432 -1648 1932 -2304 2831 -3622 4945 -7552 14594 -76319 -180511
71 -180511 48730 115716 4695 11935 95889 58569 16270 30954 31006 13307 22057 -13878 -65143
84 -65143 -41435 -12784 -59010 -69943 -23005 -11793 -22838 10732 50521 43994 12142 21355 51879
97 51879 37290 8190 10239 -1000 -25725 -17093 -5737 -23527 -21485 2552 -14709 -42865 -11405
110 -11405 15182 -16104 -17137 23814 17963 1651 31278 38808 8062 11223 27234 6471 -11552
123 -11552 -4535 -16509 -38324 -26338 -12932 -25597 -18697 7721 7471 -1946 12189 27899 21691
136 21691 11347 13880 14758 2211 -4461 -2092 -8421 -13952 -7210 -5400 -13003 -9822 -1102 -6982 -9793
151 -9793 5456 8527 -4735 3951 17783 4548 -560 16338 14977 -1660 1293 7303 -6523
164 -6523 -14170 -6013 -8491 -18290 -8849 -257 -6407 -2619 8780 7508 5644 12190 12583 5914 3956
179 3956 4190 -868 -6968 -3553 -2299 -9541 -7934 -1293 -3801 -5945 376 3824 -163 -157 6646 5126
195 5126 -1242 3621 8193 230 -312 6119 1027 -5363 -1013 -430 -6852 -6712 -1751 -3757 -6781 -346
211 -346 3538 -734 2634 8426 4418 2947 6304 4185 -757 -594 -374 -3837 -5631 -2928 -2672 -5647
227 -5647 -2620 1224 -1128 -849 4025 3274 260 2148 4680 1889 -381 2384 2333 -2046 -1294 1274
243 1274 -2333 -3721 -925 -1601 -4483 -2031 513 -1305 -1187 2541 3070 508 3042 5006 1714 209
259 209 2471 149 -2312 -1654 -1676 -3321 -3342 -1259 -1303 -2079 447 1714 -34 839 3551 1560 325 2248
277 2248 2040 -289 -702 1263 98 -2417 -822 144 -1945 -2194 -125 -909 -1753 -178 366 -317 436
294 436 2338 1402 417 1816 2060 -346 -313 740 -823 -2317 -1147 -976 -1707 -1326 -588 -474 -481 1161 1138
313 1138 147 1061 1680 336 -216 1347 474 -911 -180 698 -631 -1370 -147 5 -1436 -904 314 -588
331 -588 -674 380 665 -45 440 1202 391 183 973 565 -515 -203 114 -669 -1065 -62 -454 -851 -351 229
351 229 73 -196 643 565 -29 637 621 -606 -200 306 -116 -718 278 33 -451 -386 353 101 -746 -50 207
372 207 -431 -307 496 173 159 465 519 -16 34 403 202 -537 73 -121 -558 -445 162 -112 -316 328 261 -113
394 -113 -66 489 12 -434 334 62 -340 69 149 -296 -343 261 -54 -443 -264 235 120 -380 243 33 -265
415 -265 -62 334 14 115 304 140 -365 -133 58 34 -264 197 88 -271 -15 238 100 -85 -6 36 -98
436 -98 163 187 67 112 226 -104 -568 89 -70 -272 -296 363 0 -308 90 40 -7 147 234 -140 -105 287 233
459 233 102 101 76 -368 -278 20 8 -305 -146 -82 -248 -165 -195 163 164 -34 58 192 362 312 -2 120 -67 -19 94
484 94 -126 51 -186 -122 -248 266 -277 -326 290 -105 -118 0 174 -22 9 160 80 -114 -17 -21 -261 -11 8 -156
508 -156 200 170 23 68 27 338 34 -168 299 168 -280 8 -23 41 154 34 -63 31 2 -49 -74 -186 232 54
532 54 -167 95 -147 94 46 24 205 -318 -35 -150 -72 129 -5 -176 -208 -32 -60 67 85 85 259 109 49 -51
556 -51 8 246 -118 98 104 -2 -20 -156 37 -31 -53 -41 -190 -73 -113 -101 -37 246 84 73 0 -123 174 -104 -109
581 -109 -162 94 191 69 -59 11 -141 -150 -2 -66 -99 240 -134 15 114 -56 -174 84 -21 136 -86 -38 64
604 64 49 135 44 276 -135 -132 -68 32 92 122 172 42 -141 -150 -168 88 101 56 181 92 75 -125 48 271 12 -344
630 -344 84 250 -32 36 233 101 52 220 230 -176 99 214 45 -188 -73 85 -71 -39 29 -101 -93 -116 -264
653 -264 -190 -203 -42 -28 53 -124 -83 32 240 13 -73 -56 -34 9 -71 -61 319 -172 -79 -10 273 30 19 53 -77
678 -77 249 70 302 -48 29 138 -87 -132 31 47 196 -79 -117 -111 121 44 -84 74 -116 -100 109 171 200 -140
702 -140 160 -98 -189 16 29 65 33 -32 38 -38 -30 -69 -230 4 142 133 -48 58 -91 121 -58 108 136 124 15
727 15 -10 -12 47 -78 -204 68 -167 74 165 23 -218 135 2 -79 126 -11 56 -72 -83 -148 203 110 -27 -1
751 -1 -51 -130 176 259 -145 22 -52 -246 -70 148 -16 77 -60 173 91 243 514 74 32 119 230 -8 -74 -142
775 -142 -260 -132 126 1 315 126 -206 55 307 110 -145 -196 55 -84 82 25 17 242 73 -38 103 -99
797 -99 49 -118 195 -87 107 56 110 -236 -129 -89 57 -113 -192 157 -67 48 13 -9 37 -212 245 159 -98
820 -98 55 81 -4 -38 -245 -223 -7 -241 39 -479 83 113 -96 74 150 -96 -110 -134 -157 -26 -42 -26 110 -80
844 -80 -108 -80 226 44 50 183 -9 140 -233 -10 91 -56 -40 -115 -153 128 -95 29 213 143 21 -119 -142 -10
868 -10 30 111 -192 111 73 -81 80 93 139 83 -279 -59 58 133 161 59 69 205 -38 207 375 248 -216 95
892 95 -49 197 121 25 185 -164 9 85 77 -185 0 17 -19 -17 -131 281 101 193 -22 -74 -80 26 -255 -156 132
917 132 24 101 -98 -131 146 70 183 -85 -44 67 -2 -135 130 131 -135 6 60 111 -95 -44 59 -45 159 4
941 4 32 -24 125 -45 56 156 -146 -103 330 -316 -178 86 -158 -24 -282 -26 -41 388 -13 -76 -115 -174 201
964 201 134 -238 -102 116 -2 -57 112 42 46 -75 -84 -43 51 54 2 53 58 73 253 -272 163 -39 -13 -196 55 -88
990 -88 -5 119 -126 -3 -114 -123 220 124 -113 62 21 160 92 -175 -37 -196 -123 223 -283 -11 213 196 -73
1013 -73 51 111 170 45 131 35 -1 61 108 154 -47 -46 96 82 -218 105 -74 -92 256 -150 -87 3 -23 39 111 44
1039 44 17 164 218 293 38 -155 -103 -229 -13 -127 77 -4 -52 102 250 68 105 -5 165 173 37 -115 107
1062 107 -68 -89 -180 77 -143 14 -86 -51 -21 114 -99 -51 -294 292 105 -50 80 10 -151 -138 -27 269
1084 269 -155 62 -14 -301 -5 -117 -74 -41 -66 0 105 179 -139 -127 -112 -27 -73 94 86 77 -4 58 -171 20 -84
1109 -84 -20 -87 -8 3 -1 -54 80 23 -290 43 -202 -64 -330 178 -94 30 227 -72 -1 -73 48 200 118 74
1133 74 -41 58 72 -11 -122 25 -175 -38 -3 273 -77 172 54 100 47 81 -100 -126 -4 -163 79 25 -102
1156 -102 35 -23 -57 33 171 139 62 -88 26 194 -119 94 91 96 -218 -1 -283 -153 207 135 136 -75 -11 116
1180 116 222 -122 4 43 26 -37 -61 -20 97 16 -28 10 81 82 -127 28 -80 15 -284 31 227 58 84 177 -198
1205 -198 -119 421 161 -193 132 -64 200 -114 -101 -92 -116 172 -134 -148 -19 253 -21 72 -38 351 110 283
1227 283 103 -149 80 -41 -279 190 51 -32 214 -87 -268 60 106 -130 -21 63 127 -253 -12 37 80 128
1249 128 204 219 -155 443 -178 51 80 -17 -39 28 57 -50 80 -238 -15 -104 50 33 5 87 -87 3 20 -143
1273 -143 37 -173 -203 -135 -39 -88 126 52 -129 107 -169 118 262 -133 82 -191 -36 49 -164 -25 -58 -196
1295 -196 -50 43 -103 -220 -88 -105 69 177 -34 148 -357 -244 50 64 -86 -15 -138 184 -4 -188 8
1316 8 -196 238 -44 -133 209 120 -39 166 -217 145 -62 103 -242 81 132 -219 2 57 -132 23 -102 -57
1338 -57 -70 166 91 6 -9 -234 -164 81 6 -124 -4 -169 218 -373 -86 -44 55 328 195 -225 32 -13 110
1361 110 100 -116 6 68 -6 -31 -44 177 93 70 109 -238 238 121 -1 121 63 -5 -128 68 12 78 58 -31 189
1386 189 -79 -134 102 59 17 279 -320 -113 -13 -120 -5 149 14 103 -243 -82 52 200 -111 26 -199
1407 -199 -239 71 114 -52 115 -170 -126 77 -62 -235 62 -9 -56 -156 -15 -63 -137 80 -97 -40 173 123 -102
1430 -102 46 23 -25 2 -109 -26 -102 220 -107 -30 204 52 137 -152 -20 211 75 110 -215 -218 223 -192 111
1453 111 -201 44 158 31 -57 -55 171 132 -106 -258 -208 31 18 -39 206 -65 83 0 138 97 71 149 -249 39
1477 39 -109 134 -4 -183 15 99 -92 -26 18 3 97 -178 32 -161 -14 -134 176 36 -262 126 -35 29
1499 29 -255 -77 240 112 -321 -165 53 -184 -14 -32 93 -74 143 -106 -28 40 -249 -118 -61 323 -8 84
1521 84 -27 20 83 -1 195 40 82 29 -205 -112 -229 -38 28 -118 -108 30 305 -241 -66 -213 13 224 -16
1544 -16 183 -76 96 -71 109 120 213 159 94 -95 18 -125 257 148 -87 -62 -104 -56 -293 81 43 39 27 125
1568 125 -68 0 49 131 219 -125 -57 50 53 -175 9 -41 95 18 148 179 -21 -45 -164 -44 172 56 -139 5
1592 5 -271 -24 -138 21 205 -62 31 -166 159 174 123 -71 -134 287 147 -117 -109 -67 148 -27 -6 93 75 -278
1616 -278 -75 -47 134 90 -199 -24 101 49 206 -43 -93 41 -26 -8 23 -99 -163 -54 16 -383 304 -110 -166
1639 -166 131 -27 87 -112 15 307 177 -128 240 -205 35 -99 -33 -59 -36 -170 117 92 -242 22 222
1660 222 -123 -180 -124 63 26 -228 -38 108 -169 -140 -138 -159 45 65 64 6 116 279 -237 129 -98 -169 -25 101
1684 101 281 3 10 95 -71 -41 141 126 40 -97 -109 -22 -329 -24 -87 9 91 135 182 242 163 -58 5 -47 201 -42
1710 -42 149 40 -315 -259 53 -177 -209 78 -24 16 -47 13 70 -54 1 -109 118 41 120 107 -254 -55 3 146
1734 146 -169 9 102 -131 -9 -21 -64 -61 47 -128 -56 -117 145 -47 -203 9 -36 85 -63 -167 232 117 2
1757 2 -68 65 379 14 -136 -115 -59 -226 -3 105 -77 55 -110 -69 88 -11 -225 77 201 -73 94 78 -417
1780 -417 14 -237 -19 154 -23 -207 -77 115 -17 65 342 53 -49 210 -268 65 148 14 137 49 71
1801 71 181 161 216 -74 71 -48 93 48 159 163 -151 -141 -138 -57 -167 -375 166 12 -53 -87 -161 58 -90 13
1825 13 65 -58 -7 145 167 100 -92 -177 51 25 -154 -123 27 -265 128 -132 -110 80 157 80 -335 4 -46 76
1849 76 -51 278 79 -81 -248 -63 -67 -30 -82 145 -27 -50 203 48 -160 -144 66 107 -338 -106 -130 -138 134 290
1873 290 -89 -35 -199 222 12 81 23 -39 63 -54 -15 -167 -110 -79 136 130 -117 102 50 -70 -1 -178 57 142
1897 142 150 -319 59 -247 -142 -218 -57 -57 -55 121 -136 -123 34 -94 82 -138 -73 -251 40 -9 117 67 -19 -46
1921 -46 230 190 -17 -115 -106 -140 16 143 -75 104 11 38 -7 -4 108 -2 -85 -286 17 43 180 148 37 -78 54
1946 54 -89 -54 -148 163 -188 -243 -78 28 51 42 91 -68 116 272 146 91 122 15 17 -20 -95 188 51 -142 -93
1971 -93 123 -107 79 26 -56 125 289 67 92 165 195 -45 -115 -4 194 1 13 -305 66 174 62 -35 -60
1994 -60 284 197 -16 34 -92 188 147 112 316 25 112 -70 -44 187 37 -28 89 221 293 -150 -51 -183 -9
2017 -9 -104 260 64 -92 -4 -117 34 124 31 5 265 -46 -80 -222 -359 233 48 -131 23 -276 67 9 124
2040 124 105 112 256 -188 -115 41 87 -76 -300 73 134 8 258 336 76 -263 -34 -115 1 206 112 -372 40
2063 40 110 -202 -148 161 -57 88 -118 -15 54 144 213 -6 36 145 22 -14 -278 91 230 203 -290 -286 21 -21
2087 -21 51 30 93 -285 -105 -80 -119 87 135 -31 -140 -86 143 -312 133 -7 100 -199 145 55 86 -48 91
2110 91 92 -213 -151 -65 128 47 35 -140 180 -59 -11 6 159 -208 -4 327 165 -92 63 297 54 2 119
2133 119 48 69 169 4 -189 172 176 103 -202 160 136 63 33 3 136 48 -116 12 -42 213 130 -302 59 151
2157 151 0 -25 -17 -305 5 -153 -105 73 148 -145 3 -96 -142 39 -270 -62 106 273 -122 -176 -210 -114 50
2180 50 173 -68 -87 -39 -90 80 -30 140 91 72 -105 5 289 86 157 190 -35 41 -63 35 -123 -123 82 245
2204 245 -31 21 28 4 -57 -149 -104 90 150 96 -285 -29 -174 -165 -179 -152 88 298 39 20 -56 -324 38 -232 -186
2229 -186 55 -130 57 -252 -35 -131 96 258 298 126 242 324 -174 66 -244 -40 38 -194 248 210 -8 -140
2251 -140 17 -219 -316 3 126 159 17 -24 269 179 -127 -99 -92 -92 88 31 -159 96 -126 -109 -43 236 91 144
2275 144 67 42 -328 25 140 -48 3 58 -73 -147 -135 -303 -81 164 -23 -282 47 -67 -73 140 -214 -176 83
2298 83 -186 268 33 -169 18 10 62 2 -120 -16 -160 0 88 -139 -139 22 270 211 -152 -7 41 36 49 -126
2322 -126 13 65 -128 -182 -243 -11 74 47 148 -17 102 -48 42 75 -217 -145 -115 13 68 -7 -15 -179 -19 178
2346 178 70 -212 123 -402 -143 -153 -87 -164 -42 13 -66 70 281 16 -220 -144 0 -28 135 162 37 -18 -131
2369 -131 -293 -90 20 126 126 -82 112 -99 20 157 -100 29 -134 -50 -225 -160 218 184 -102 192 27 -294
2391 -294 22 132 102 30 -26 159 -28 32 -33 31 123 24 -86 -72 -121 74 -12 -90 -15 30 7 262 26 -94 189
2416 189 -288 -96 186 -73 15 -218 2 21 19 202 -309 224 -35 -28 9 -47 -122 -130 91 -61 91 -37 -48 42
2440 42 288 207 153 211 -213 130 -126 -244 49 1 67 -2 -151 297 36 -163 211 22 22 211 -325 10 -204
2463 -204 -265 -86 -129 -26 -163 3 8 -81 96 -158 39 -74 -198 -46 -288 -208 227 131 -134 95 71 -65 253
2486 253 26 474 5 -65 -24 138 119 -253 -462 -18 71 18 6 -21 62 118 250 -317 -216 -82 65 -34 -44 248
2510 248 -68 116 -32 -123 95 4 -76 284 60 51 -105 205 110 37 77 279 47 -106 131 65 -160 133 -213
2533 -213 122 -96 -35 114 23 154 -138 72 62 9 -51 35 70 111 -27 -6 -260 -45 -307 -145 -147 166 -266 -126
2557 -126 -3 2 -19 -43 -13 18 173 -70 -80 85 -53 -186 165 14 87 -139 65 59 132 59 228 -215 -50 -103
2581 -103 83 10 -109 -52 -29 302 -108 -28 -6 -10 216 -46 -62 -86 45 63 105 -25 67 17 38 103 -190 137 -249
2606 -249 312 25 -132 -13 -159 3 -62 -129 51 59 84 -66 -1 -60 -142 -29 216 -241 9 286 -180 102 -43
2629 -43 -110 -92 -147 -102 74 -49 -225 -44 -83 -54 -128 -61 -239 -90 -188 -98 354 44 -259 91 162 43 -45 30 27
2654 27 1 37 -91 241 -96 182 30 -23 -70 -31 1 126 170 -39 3 76 -98 164 234 22 -73 -247 -236 35
2678 35 469 1 -243 165 106 -225 60 -170 118 -63 -22 -77 -115 104 144 1 -116 -112 -17 -169 -92 17 -254
2701 -254 -204 -102 210 -113 146 -52 -34 49 160 -266 -93 -336 -216 -133 -45 214 108 206 -73 99 -78 -29
2723 -29 -123 -419 -5 352 198 -134 -81 256 49 18 67 -112 -110 67 -159 -169 -140 -9 122 -54 121 -88 89
2746 89 -109 -41 134 -101 111 33 -142 21 -4 101 78 150 103 -180 162 32 51 179 -62 -20 53 -202 68
2769 68 -201 -120 179 15 -65 209 169 73 -91 -86 6 -108 -47 100 71 -354 -111 -112 -247 23 150 -5 150 -71
2793 -71 20 107 87 -142 -42 -28 198 -107 118 -140 -4 -90 -19 -417 -45 -142 -60 -150 -118 -159 127 42 -133 -29
2817 -29 -190 -56 -211 9 -111 8 148 -37 -101 102 80 -63 73 -139 -14 -40 32 -185 135 11 -113 -154
2839 -154 29 95 187 -117 -61 -81 -150 125 218 -32 -144 193 -35 -47 -39 137 141 58 23 -131 -224 -192 401 -6 44
2864 44 9 109 89 -94 -26 -65 -31 -256 63 -103 206 46 216 213 -221 -329 -73 38 194 29 -1 106 130
2887 130 5 58 -105 76 -10 -85 -52 78 -19 -91 -58 -102 -24 -210 42 -47 358 -120 53 -88 -48 -75 -68 63 115
2912 115 -40 -16 -124 49 -166 -72 -199 -67 -69 -35 9 -171 18 -135 4 -59 60 -96 278 189 197 -68 157
2935 157 212 147 -150 30 -118 8 9 178 -298 -67 126 209 185 132 -5 -124 -73 -113 281 -113 -43 319 14
2958 14 8 -268 9 -286 -153 37 126 25 56 -16 20 20 90 75 -107 -135 57 -135 -150 24 146 129 -87 104 -139
2983 -139 -36 12 83 7 -48 -207 260 214 150 298 -130 267 -30 84 84 -47 -81 139 -37 78 -91 181 142
3006 142 -45 143 -81 143 -26 255 131 -31 6 1 -23 58 -109 37 224 25 -102 177 -106 52 -118 -133
3028 -133 46 68 -272 358 227 -34 67 5 -156 53 191 -25 -310 -85 209 230 -279 -109 -39 172 50
3049 50 -109 -147 -2 150 -6 -164 181 -63 158 71 -79 142 157 90 262 238 -199 112 105 -70 -31 185 68
3072 68 95 -92 52 358 -120 -257 245 23 96 -46 124 -49 -107 209 171 -25 27 200 61 35 36 57 25 44
3096 44 64 236 -24 -61 -105 -10 192 12 130 91 -23 166 195 -69 -23 91 20 -154 -187 -159 87 106 142 -49
3120 -49 -323 168 -117 152 -66 196 -218 -14 12 62 -176 -95 49 -59 -68 22 -190 -32 -125 -103 -147 204 -115
3143 -115 -225 -94 40 210 85 134 -110 245 -163 233 -25 42 -167 -264 204 224 7 -30 201 -45 -58 -155
3165 -155 108 -103 -332 -34 60 27 114 94 146 17 -270 -115 -234 -73 -21 -59 -33 -74 19 200 5 -127 10
3188 10 -88 77 35 -44 -108 287 219 246 -58 -45 -146 -66 59 150 -87 40 -58 -10 193 -79 59 61 250 78 -7
3213 -7 -133 138 22 39 24 -154 151 -26 -215 -387 23 -11 212 -231 28 70 39 -29 142 -130 20 174 -30
3236 -30 155 24 -177 34 -287 160 -110 144 218 322 311 -108 175 116 151 -102 63 198 98 -46 -215 64
3258 64 -59 255 -303 -69 236 158 -20 -120 206 -238 145 31 -293 -64 -63 142 -188 383 -207 -186 109 51
3280 51 260 107 -52 -143 120 -79 -192 220 -150 123 -20 289 65 -123 -83 -270 -286 14 -62 -209 -4 -102
3302 -102 218 -94 -159 87 -137 287 13 82 93 89 -17 -40 52 -8 -58 -131 -52 50 127 82 73 58 -85 255 119
3327 119 -246 -83 6 6 111 237 -275 -73 -125 36 -165 -75 227 4 -34 29 114 92 -80 163 111 -337 -94
3350 -94 -246 140 195 -212 119 -27 -132 -154 -295 -130 -236 -118 0 169 -77 -208 -51 -69 113 -34 -95 58
3372 58 112 4 35 -2 -58 85 -103 14 81 -199 -75 -33 -63 301 76 5 23 103 -167 -87 -98 -312 -65 -191
3396 -191 -270 -142 -103 14 48 250 89 207 -3 40 -46 -11 226 104 59 287 -112 -142 -35 -141 284 -69 80
3419 80 -121 -93 -214 -217 49 45 28 -129 -32 -62 -285 91 -64 11 126 0 47 -30 133 113 -44 65 92 -153 99
3444 99 296 -65 281 343 -14 309 77 9 98 213 186 -66 -68 -96 233 -27 -10 -96 -154 36 -166 -81 -110 150
3468 150 -145 -36 48 143 254 375 5 253 69 -178 61 -201 32 -147 109 -186 191 -86 56 167 63
3489 63 79 -41 -81 -16 8 99 -15 246 7 109 -44 54 39 44 54 -42 21 85 -37 66 99 213 -11 144 46
3514 46 256 -163 -18 203 -4 8 96 -198 -25 -6 -5 114 69 92 131 -221 40 395 162 -26 -141 7 -12
3537 -12 -10 -264 89 204 -75 -92 -13 -122 27 -197 65 -114 -74 -71 242 114 40 64 -407 228 57 -137 -71 -24
3561 -24 -82 -173 123 29 -27 -168 -271 26 -66 78 -214 51 -56 38 28 -100 -85 35 70 -116 63 149 273 182
3585 182 82 -102 156 -77 213 -167 -50 -15 -58 -262 -129 71 -236 -9 35 -12 151 -100 -1 -46 32 -58 189
3608 189 -217 -183 338 176 19 65 179 -234 99 46 -128 -143 -129 -98 -312 33 123 81 142 -289 -218 -17 133
3631 133 105 -152 -50 125 53 62 187 -298 -143 140 14 52 -15 91 281 227 -56 79 243 121 42 -101 2
3654 2 -277 75 241 -172 -364 15 -60 -193 -53 -33 183 -72 -25 18 194 42 -39 -15 -33 211 -337 -180 -161
3677 -161 -45 210 -80 44 16 -114 143 -110 190 -181 -39 296 -64 -92 -78 -32 119 -145 209 108 7
3698 7 -183 -15 -87 111 124 409 94 -31 -115 -215 -249 -58 181 -97 113 177 122 245 -71 -54 60 -95 -139
3721 -139 -51 297 -85 -12 178 -80 -35 -140 9 18 -56 97 -82 -10 48 66 -134 17 -101 -13 228 -51 -290
3744 -290 -4 186 -7 144 138 106 -38 -26 -246 165 -95 -263 -205 41 82 -45 171 -2 -198 52 -176 67
3766 67 -46 -225 -22 74 -37 56 68 11 36 31 -99 -107 -99 -133 132 -59 -155 -125 33 -58 -7 -135 212 196 -178 -43
3792 -43 52 -118 156 -39 -103 116 -123 -130 102 -102 -128 -24 121 134 126 -174 -81 203 -54 -169 -104 165 -139 316
3816 316 -294 49 1 -119 17 86 16 -23 -67 233 135 27 -47 -14 58 86 153 -71 -157 103 58 95 6 121 112 -10
3842 -10 -217 123 -111 -1 173 -25 -103 165 12 -184 140 31 -138 -102 107 -53 29 -79 -51 -268 215 -42
3864 -42 -100 -154 -8 247 52 -71 -79 -53 -188 130 105 26 138 180 68 101 63 96 61 -32 37 122 240 79 12 -88
3890 -88 -40 -10 -133 17 -76 60 123 209 -92 125 -143 -239 -77 -70 -166 -46 -28 -21 32 234 -181 -145 423 -168 -262
3915 -262 -49 -6 -12 84 36 -139 7 -79 -96 270 -82 -134 -123 124 -98 -162 -71 -283 54 57 -77 300 -51 -79 294
3940 294 20 296 33 16 -53 56 -39 -18 32 -239 116 -87 -6 -130 -138 -82 213 -225 -6 -194 -106 38 -154
3963 -154 -71 215 60 -42 39 134 -225 -100 41 -102 -6 -8 -53 202 -283 -371 91 277 -240 2 34 80 234
3986 234 74 76 173 14 5 41 -112 -132 -171 4 82 357 -28 -102 -139 -35 -9 -116 -35 -46 184 63 -83 80 -387
4011 -387 144 -151 -18 -51 9 -118 -156 -13 -50 0 -97 -25 -155 211 -150 -72 -268 25 -35 -56 -17 -37 75 211
4035 211 23 8 -146 304 67 -138 -233 -41 113 -11 -96 237 333 206 209 -177 92 -19 -94 -220 -176 -137 34
4058 34 215 -264 133 50 -72 -16 86 -62 -62 112 171 -230 -119 -71 114 -113 151 189 -303 -5 -18 195 5
4081 5 60 92 58 67 65 -122 -161 -290 87 -30 19 45 166 -136 -143 -47 166 22 -92 44 222 286 -60 -87 29 14
4107 14 93 62 -25 -129 -366 -21 15 -173 -73 289 219 -30 120 -191 -129 -67 26 -128 160 -3 -62 -122 -187 131
4131 131 221 -203 25 -36 -147 -100 -309 289 -108 373 116 70 -13 -176 -131 -52 -21 -175 96 -108 -88 139 360
4154 360 -176 -177 -67 -168 397 56 187 77 -197 139 246 157 251 62 210 -201 46 123 -166 -139 -153 -175 101
4177 101 -57 37 -100 -180 -25 170 149 -70 -124 -48 35 -98 -18 172 -199 72 36 117 -375 -83 82 -40 -38 -313
4201 -313 -107 184 90 82 50 -145 19 -61 -68 134 97 -177 -78 -169 -167 -141 302 -137 -304 -5 178 104 13 53 -45 -297
4227 -297 63 318 -47 -114 359 20 -239 -49 -133 60 166 -1 137 -80 -40 -122 127 -52 -135 -102 -70 -52 55
4250 55 274 53 -118 91 -159 106 169 -117 101 -19 26 197 -126 183 -200 -107 -245 -98 31 -161 -474
4271 -474 -141 -112 178 160 -193 -64 -206 30 -53 190 -53 -5 -74 73 -103 -73 11 139 -108 -236 -108 158
4293 158 135 -11 193 -86 -367 49 -62 -96 215 13 103 309 -131 -1 93 -137 229 -174 -44 -24 178 -204
4315 -204 -74 -225 -116 -14 172 236 23 107 38 -76 -65 67 136 126 -26 -15 202 -47 -92 -128 -51 -6 -77 274
4339 274 -243 -524 -22 -11 -44 215 -64 -46 -206 -180 -28 168 -76 -82 -119 -283 40 -19 -6 292 -71 59 -24
4362 -24 155 -76 -12 -99 91 -47 -63 -87 48 150 124 -171 -8 -180 33 -27 109 44 -6 58 109 31 25 327 -93
4387 -93 129 -290 42 46 -10 184 -108 254 12 -50 32 40 -124 -133 53 15 -143 -200 101 5 45 216 -105 -7 230
4412 230 84 -205 46 -55 14 111 479 58 -39 101 -265 214 180 -172 -142 -168 268 7 -8 128 121 -136 195
4435 195 -73 -52 121 312 96 -165 -91 -32 -44 11 58 70 -211 101 -266 45 78 301 12 -115 142 -357 151
4458 151 -83 58 -88 -124 -141 -153 -206 264 -47 -172 208 181 85 -124 53 243 85 -191 29 235 -42 143
4480 143 -275 -17 14 87 200 -58 -248 25 149 -150 -88 -23 -129 -113 126 -66 168 -6 -45 161 -176 -161
4502 -161 -27 -111 -106 127 -41 3 326 -39 295 202 -116 -99 -86 260 -53 -100 0 -134 -224 59 -313 -5 412
4525 412 54 -6 -88 179 106 -157 89 33 -64 -68 85 379 67 -13 -89 128 12 46 -35 -205 431 -87 -134 76
4549 76 225 146 51 47 -183 55 -168 -13 60 26 264 -204 55 103 67 39 50 -62 -10 4 -232 108 19 214 123
4574 123 -75 94 -25 -253 -65 23 21 -14 -15 54 -217 139 -81 -192 70 -22 221 156 -29 98 -231 97 48
4597 48 104 384 3 -284 -2 102 280 31 -74 18 -279 -140 -70 142 162 -26 -127 33 25 -22 -44 -64 63
4620 63 34 -48 -19 200 -52 -208 247 -123 -115 312 -157 56 -154 62 -53 126 105 122 122 272 227 157 -250 -30
4644 -30 -90 24 98 88 -200 -157 -56 8 172 -108 115 -217 -94 -41 273 38 -52 -233 -72 9 380 53 153
4667 153 52 77 129 191 110 -36 341 -141 -5 92 -65 -74 127 60 214 -145 62 -220 -49 -197 80 137 184
4690 184 -214 81 -111 118 -275 -19 -20 46 79 -43 -40 -61 3 -71 -112 -164 19 212 -12 -314 195 -117 83 17
4714 17 -33 187 -171 -121 37 -186 390 213 75 93 -60 117 -81 137 86 173 30 199 181 -86 -208 38
4736 38 -31 -119 108 146 -58 186 200 24 131 158 -14 -52 -24 -77 -50 -40 -357 -162 85 17 -63 -73 -2 -80 -151 60
4762 60 -39 182 -49 236 194 58 -51 -7 113 45 52 132 110 -69 55 -16 136 23 107 -124 -111 111 -364 -126
4786 -126 -205 134 82 -88 231 134 152 -110 168 -72 235 -76 -96 -200 55 71 310 -92 -308 -175 151 -201
4808 -201 -192 -64 -20 102 -470 -16 -127 45 -143 78 116 -95 68 212 164 34 -224 32 3 -52 137 107 -74
4831 -74 236 96 57 189 81 -48 160 86 259 149 52 -186 147 48 21 169 178 303 -50 -217 -217 -57 328
4854 328 -77 88 36 29 12 39 32 6 -210 264 -24 -53 -102 142 38 -187 22 -213 183 -51 94 -65 -117 69
4878 69 17 84 -88 69 -107 121 -16 -89 -165 -214 14 212 -64 222 6 -26 -24 -99 -119 14 -64 36 28 -158 -350
4903 -350 41 56 -277 -40 -147 -9 153 253 -127 50 156 -199 137 62 44 -7 210 145 89 171 47 207
4925 207 -6 102 -2 -34 37 108 2 30 181 21 138 10 -258 -82 121 -108 -105 206 -23 -154 75 80 10
4948 10 33 -58 -179 -210 4 238 36 -131 85 -115 -5 62 -141 -113 204 38 60 10 -141 15 293 42 147
4971 147 150 197 -132 -156 25 -148 121 -118 109 -148 -196 -142 -223 -61 99 99 -68 215 134 242 146 160 146 43
4995 43 87 -191 -30 -97 198 32 96 -65 -86 -84 -160 -118 23 275 -79 328 -149 272 63 110 68 181 66 -326
5019 -326 223 -106 -98 -130 -93 -290 -26 111 -56 -78 -234 -29 128 117 65 -111 87 -95 -183 -11 89 -142 21
5042 21 116 67 -155 22 238 -115 -79 55 -67 -122 110 28 -9 187 60 30 93 -230 56 286 -126 87 101
5065 101 100 -64 149 -167 -25 138 -249 -7 38 19 -33 -173 -81 -60 62 74 -94 -40 -68 -316 -101 44 -269
5088 -269 -63 95 176 87 -42 -1 -173 -108 -140 -33 135 -7 80 91 84 191 53 297 -212 -191 -198 -160 -27 -236
5112 -236 -146 -75 78 -139 -52 314 -59 -70 21 -177 -6 -202 -189 106 207 -126 -173 -72 -74 233 -51 54 15
5135 15 34 96 146 28 118 169 107 -155 -104 -47 207 134 48 291 -12 115 -124 -29 242 97 240 134 266 227
5159 227 -86 83 -168 19 369 -146 189 167 30 -245 -145 16 -117 -70 26 7 7 130 -162 20 156 189
5181 189 -6 -28 -150 -135 31 27 78 28 -298 99 -77 103 -167 236 113 -69 67 -275 -12 317 2 1 67
5204 67 -16 25 -147 118 -242 126 290 -112 200 -79 -104 -138 -79 54 -116 78 189 -221 -67 43 -33 92
5226 92 3 58 -199 -26 226 -9 -188 -160 33 -113 -232 -18 -159 -81 -6 -74 121 -32 5 222 -10 -28 135
5249 135 -102 139 -273 -52 -261 -30 147 -79 -139 -260 -14 85 -193 -159 -9 100 -149 75 -336 151 43
5270 43 -92 -207 182 97 -20 57 248 -97 -40 82 120 211 89 80 56 307 -187 -71 7 -216 -184 206 -40 -240
5294 -240 -111 -183 -10 -30 144 17 -158 244 110 43 -77 -18 -203 -181 50 -22 -21 6 61 -51 -81 -66 -249 -13
5318 -13 -62 -1 -151 103 -62 -137 173 29 -223 195 -164 15 167 235 -93 8 52 -2 -11 -133 -30 11 221
5341 221 -197 371 295 -9 192 479 -26 -190 138 -208 11 -282 96 -205 186 76 -82 52 -160 13
5361 13 -68 -199 -141 -36 81 159 -47 -63 70 33 77 232 4 -174 30 131 -82 15 185 -192 116 -292 247
5384 247 -25 -343 -83 -16 103 -115 -46 15 51 140 -147 334 51 -150 53 -23 25 -33 155 53 1 -125 224
5407 224 24 131 197 56 243 37 -118 -235 167 119 -274 186 125 -201 31 -28 135 61 30 48 -206 2
5429 2 117 -66 -123 97 162 188 10 -154 -150 139 -71 150 27 126 47 -60 149 32 -239 15 162 -126 16
5452 16 -154 -438 -156 135 -155 -82 -63 -102 -60 -64 206 -26 -407 -57 -26 355 -101 25 15 141 -55 -2 -194
5475 -194 49 -60 -219 211 -22 144 54 17 -177 1 136 36 138 -43 17 166 163 -94 -223 46 220 125
5497 125 -155 124 62 38 -188 99 132 -13 21 22 -151 -241 -31 -182 -249 -154 -36 -59 168 -79 -275 -8 -108
5520 -108 -1 -293 118 -77 -249 -12 -280 -66 79 46 66 -126 98 27 -195 49 -34 202 -66 -114 140 -145
5542 -145 412 -218 -28 -342 7 -175 -182 -52 -123 38 -45 167 -27 -91 59 -89 -49 270 -55 130 -34 -38 8
5565 8 41 -234 -15 36 -209 -171 -20 36 100 -111 124 -381 77 127 -97 75 69 28 -34 -241 -268 -26 -115 -4 -33
5590 -33 -188 -74 -191 16 -62 -206 158 -322 168 -197 -95 102 295 -136 104 67 57 -108 152 -49 92
5611 92 80 133 -44 -300 99 -101 125 127 53 70 62 -177 34 -81 63 -110 -230 29 148 -45 -33 -259 -35
5634 -35 14 44 -27 299 84 134 43 -156 -204 155 142 -11 -2 -125 -159 101 -68 185 178 13 177 -175 -182 290 267
5659 267 -128 -221 -262 15 -108 -38 -301 -151 -114 113 159 231 -343 -141 259 -63 -235 81 159 110 -188 -34 -138
5682 -138 272 80 -127 8 -41 -5 -82 28 -134 -47 -233 260 -162 -107 185 -62 -90 110 110 56 -434 312 17
5705 17 96 111 144 -15 100 -125 -158 132 64 203 -44 272 -78 289 -56 -49 -135 -107 25 -60 -61 -161 87 -54
5729 -54 133 60 112 -75 116 -88 345 58 220 172 41 82 -205 -36 -145 219 -71 84 -30 72 -205 124
5751 124 -67 172 -3 -197 -225 10 43 -139 -35 -51 -242 -9 274 68 -179 176 159 -263 -27 34 70 -82
5773 -82 70 25 -160 179 24 252 184 -11 310 -184 -182 171 76 -84 77 -105 -7 -113 135 83 -21 -270 -12
5796 -12 232 -176 -3 -33 -47 174 -119 1 -120 86 30 -93 -209 -23 -152 55 69 38 21 -92 -5 157 24
5819 24 -64 101 267 247 149 -143 -209 77 35 -222 -154 112 -228 -37 -34 -21 130 93 -173 -109 -156 87 10 -34 119
5844 119 184 -126 -9 -104 -130 -45 -22 -235 -160 41 118 -76 -13 -57 -293 181 204 60 -247 56 173 17 91 69
5868 69 -46 176 34 155 22 -177 215 184 236 -68 -50 245 47 170 26 168 -140 -65 29 30 88 113 73 -101
5892 -101 183 -35 114 179 131 -6 -4 218 -42 49 -214 -150 -29 -114 54 78 -240 -125 -277 108 -265 -103 -62
5915 -62 46 148 231 -308 99 105 -507 28 -140 -108 213 -3 -207 -36 -7 -21 -74 182 312 224 52 30 232
5938 232 242 -206 -61 -66 -3 -31 233 -130 -102 204 -34 127 -208 -29 176 162 -214 7 49 -209 -140 133 -135
5961 -135 -146 -160 20 -112 116 -107 -132 -62 -259 -112 -12 -39 15 135 181 -175 119 26 138 -48 251 -22 -159
5984 -159 -301 -91 78 7 -114 181 -223 235 2 110 132 -5 181 198 -25 136 182 -29 -120 -160 107 -13
6006 -13 42 -91 -93 -206 62 32 4 -189 -292 73 -216 145 -116 122 35 257 182 -70 159 208 319 -31 114
6029 114 57 111 354 157 157 82 -84 -275 67 357 -125 74 14 70 -139 176 -39 56 -67 192 -56 28 186
6052 186 95 -64 23 51 -181 69 36 -197 120 42 174 -148 -204 164 101 203 -104 -22 74 252 3 19 85 86
6076 86 34 53 -95 189 -22 -29 260 -185 136 -125 -239 17 -15 -85 -87 78 -86 141 210 41 138 -37 -124 -67
6100 -67 -150 181 -75 35 -47 -169 -215 -94 -253 -124 -3 -8 -263 -133 77 -82 -124 54 37 68 -27 133 -78
6123 -78 -68 203 97 16 15 -153 64 -89 -243 -54 -61 174 -192 62 240 -134 -43 120 114 78 -42 -63 -88 36
6147 36 -104 106 -122 -446 211 -207 320 66 -333 -488 71 -38 -98 -183 -109 187 -104 228 27 57 -135 -72
6169 -72 -101 -96 -60 111 -81 -18 -11 -91 -193 -72 -270 -73 57 -16 -130 6 -24 175 299 208 -157 -40 386 83
6193 83 -122 -90 183 9 3 -196 -121 77 90 24 280 5 -23 187 -23 -21 116 65 48 -159 -4 -26 74 23 -62
6218 -62 57 57 2 27 -190 -118 47 187 105 199 68 54 235 182 59 59 -115 -51 16 -96 -143 62 85 -24 -106 30
6244 30 -60 -72 -27 -266 65 -216 -104 -39 0 24 316 -46 -102 188 -244 -66 -75 -52 96 109 -26 233 82 -28
6268 -28 -34 -49 -91 116 -79 80 171 -48 -107 93 178 2 -215 75 -24 -149 -18 108 -59 -66 -139 -77 225 358
6292 358 -49 -62 -57 -69 1 -145 -16 -93 77 -56 146 0 -176 47 -1 124 86 120 -251 183 78 161 114 99
6316 99 -26 -80 -41 -105 -141 -176 246 -187 124 -180 89 116 16 279 25 55 -88 33 67 48 42 -130 51 -188
6340 -188 -7 -72 6 -39 -90 -195 -61 12 -178 -109 96 169 200 -252 -138 -161 -161 -159 109 -76 64 134 52 216 -89
6365 -89 255 125 -93 159 -220 -112 -10 25 64 76 -199 -143 59 180 68 81 37 -42 66 62 -95 49 -74
6388 -74 -205 -252 74 16 -178 -19 -267 -94 162 -68 83 64 -115 146 21 -164 312 187 107 108 239 -190
6410 -190 31 -30 -6 -57 -31 41 228 134 -11 -105 102 232 -215 -206 -46 -177 74 70 -72 7 98 65 -315 108 -137
6435 -137 -104 60 215 52 -4 -21 106 231 -253 -72 235 189 -33 49 -21 194 -224 -195 -14 -150 143 -247
6457 -247 -146 232 -123 -117 175 196 -105 -197 113 49 -104 -58 -115 13 -63 189 75 -15 -49 31 359 -325 -52 56
6481 56 -73 196 42 -25 236 -100 33 -122 -10 -343 211 101 73 -184 57 225 161 -154 -102 42 -235 -122
6503 -122 -106 75 190 143 -13 -61 -242 -212 117 59 -8 318 102 -26 -140 -49 34 20 -171 -180 168 174 60 161
6527 161 -48 -195 -16 182 -180 -359 17 227 233 106 -233 -28 92 -50 69 -215 44 -107 2 169 -126
6548 -126 202 162 -398 -14 -207 -90 119 28 -92 110 -64 -92 14 -61 -111 22 -152 37 -9 43 178 57
6570 57 -51 -228 -165 -36 -91 -33 -221 -66 16 42 -106 40 -86 170 1 -21 206 -190 78 268 -164 141
6592 141 -163 -112 -117 10 80 -114 -9 -87 94 -204 261 -186 -112 -167 -92 94 -220 -15 -138 -19 64 7 -184
6615 -184 38 -211 52 40 220 13 95 139 -106 -71 104 -121 -62 -79 4 -280 128 193 -116 14 -69 2 64 -17
6639 -17 -132 -91 121 -20 42 128 48 48 -209 -14 -13 12 79 -71 86 -111 -41 307 0 58 49 280 275 -181 160 -84
6665 -84 113 4 -188 223 221 47 -9 314 -147 181 -9 190 40 -27 245 -175 -18 122 232 142 -156 -86
6687 -86 -42 -138 63 123 103 212 -71 74 24 107 104 -8 141 -29 142 205 31 -78 -97 125 33 243 -68 -29
6711 -29 -180 -195 -18 -149 190 -249 134 -40 0 133 7 -193 58 13 151 -172 65 -101 -207 125 -25
6732 -25 96 -127 -126 5 38 -7 107 90 -223 37 253 69 -44 84 -159 -126 -1 -180 -94 -92 182 -194 46
6755 46 -95 -184 112 -102 -162 126 95 -234 -263 -143 -198 -49 46 -299 67 166 96 6 -45 -112 -74 -374 44 -51 36
6780 36 141 164 115 -6 278 -157 38 -48 -20 -175 -106 46 172 155 176 -116 217 -125 14 212 208 196 104 96 116
6805 116 -1 71 -45 -31 45 -72 -1 33 -56 103 128 -162 -78 29 79 302 218 160 51 127 -30 -182 49 -65
6829 -65 -106 -99 -213 229 -13 2 11 157 -30 -113 10 -32 -140 -127 214 -320 -31 119 -40 -77 -53 -124 125 -30
6853 -30 61 -323 230 -101 -67 20 -74 -258 138 42 252 -100 183 -43 92 72 1 145 261 16 44 89 -3 123
6877 123 -6 -155 -425 -172 -52 68 65 111 29 -72 77 296 -42 -49 45 108 -48 -41 158 175 35 -280 -265 64
6901 64 -61 -200 -282 -234 42 -162 146 159 30 -64 -189 146 -103 94 -95 -207 -40 129 192 59 -42 281
6923 281 -53 76 213 12 -86 73 32 -177 -60 -96 82 -77 218 167 -179 13 -96 156 -29 -246 0
6944 0 -105 41 98 -107 -64 -64 -211 200 -136 59 79 169 149 -181 95 4 -197 185 170 -116 87 -39 32 -332
6968 -332 -438 -17 -271 -149 17 -44 -143 8 -7 99 56 -259 -30 42 14 -101 -51 200 233 -245 441 -310 -85
6991 -85 29 83 47 -85 -118 -239 163 161 -73 -3 5 5 45 35 285 -160 -275 271 -168 22 -447 10 201 -65
7015 -65 -186 110 24 -43 28 -413 -467 -67 -16 -168 -23 -82 253 122 20 -148 9 -52 -169 -30 125 -17 110
7038 110 119 -15 -53 159 -86 -45 157 -173 296 57 11 73 -70 -87 -90 -167 -139 -284 -127 -20 20 -106 -35 -204
7062 -204 0 177 -86 10 11 197 -104 8 -191 3 -59 330 14 -274 -238 61 -13 0 -6 -197 31 -186 -34
7085 -34 -133 176 169 -137 101 102 158 -62 12 -59 -30 -149 -76 89 -41 -252 79 76 49 -61 165 -22 108 280 -47
7110 -47 -69 18 -145 -92 99 -81 4 228 -217 17 59 -84 45 28 1 163 -8 239 136 -33 73 154 240
7133 240 17 60 -324 -20 57 132 -163 -77 -33 -33 -324 -156 111 -142 211 -135 -128 -20 143 -167 -144 116 222
7156 222 203 101 -93 -240 -29 53 -75 146 -71 113 112 19 140 -242 25 66 6 -213 -239 -100 -153 130 119
7179 119 136 -141 234 176 22 -14 -299 -143 142 174 8 -353 250 -74 -280 434 -129 -363 77 -113 -13
7200 -13 283 89 152 -138 293 -25 170 -51 -151 -248 7 -161 -18 -352 -236 -230 -127 -317 -106 79 -1 96
7222 96 -20 -83 88 54 -116 -95 44 -53 118 31 40 65 -82 88 -87 108 -89 46 -184 2 370 220 -279
7245 -279 -78 -13 -136 336 -169 347 -16 -73 -125 107 -77 96 -122 -122 115 17 -72 -216 32 -3 6 -83 -196 119
7269 119 -134 88 175 30 -141 49 79 44 110 -80 -4 -114 130 -75 9 9 309 -117 -155 -40 8 80 79 102 -154
7294 -154 14 38 104 -31 -86 -37 -42 -10 219 22 93 -142 169 -41 -41 -97 12 85 -73 -214 -155 -30 73 -27
7318 -27 -184 44 156 143 180 -84 98 96 -52 38 313 72 -31 262 147 124 100 -205 -164 219 -157 345 -210
7341 -210 -183 -208 -26 82 -182 185 -133 29 56 113 -89 79 -82 -164 34 -22 18 -114 171 234 -31 -215 232
7364 232 -46 -235 11 201 -54 254 -88 -64 88 -18 96 -236 -3 143 108 -166 -75 -135 -175 -91 100 419
7386 419 300 256 -34 36 71 -14 115 260 -6 -43 -96 130 174 116 17 105 -57 70 -54 -206 9 -41 -31 72
7410 72 -163 22 -156 -73 -13 64 -91 -198 69 80 -8 -109 324 63 -19 48 -153 39 -86 -87 -2 -199 72 -197
7434 -197 189 289 -58 55 272 76 145 -237 -287 -91 -137 -14 119 -20 -12 215 -85 159 21 110 -150 -99
7456 -99 164 175 -137 20 -94 292 -9 -98 214 -11 227 215 -117 5 51 -68 -112 -139 -197 50 16 -207 -22
7479 -22 159 -30 59 -149 96 -68 111 -65 173 42 -9 71 27 -117 -126 -54 29 -300 83 -171 -143 236 32
7502 32 76 76 -129 -22 5 440 -7 -49 -187 -30 145 77 159 -128 -179 143 137 72 167 -273 128 36 142 -177 263
7527 263 344 104 171 100 -149 83 -104 95 179 -78 -40 -108 314 -30 -151 -102 160 162 36 -207 -91 -33 54 112
7551 112 -111 120 -90 -100 50 151 -211 -9 34 35 118 -21 208 40 -32 107 -25 -70 -210 -133 207 -22 -169
7574 -169 75 -81 298 -176 -181 -147 -164 -66 18 91 156 286 239 -103 3 93 55 -183 178 -169 -51 -184 131 -68
7598 -68 -225 -142 119 117 70 -74 -65 0 37 148 -9 -33 -276 74 -28 -23 18 -6 -200 -286 52 176 -36 46 -43 -310
7624 -310 -226 -27 -32 -6 97 75 20 38 -6 58 -126 -11 -81 -150 -117 -157 169 9 -125 -7 -5 29 -201 21 -213
7649 -213 -23 -106 -188 34 119 -35 -2 262 -210 -57 70 -85 -29 -168 -95 -20 -127 50 238 84 -156 40
7671 40 -136 61 -44 155 131 -143 -202 -34 -63 200 63 -174 165 -10 -48 -241 42 -128 -115 60 60 -150 106
7694 106 12 96 -146 -112 -2 7 173 79 -287 100 -99 32 -115 -276 40 73 83 417 -83 -39 2 1 140 -24
7718 -24 -41 44 98 28 -265 160 83 115 149 -30 9 -285 55 162 43 4 -146 -18 70 226 -64 -175 -413 -126
7742 -126 55 -126 -143 200 -92 -125 103 -59 -213 93 -198 -29 -132 121 6 -55 88 35 92 18 44 -262
7764 -262 462 249 -87 94 -75 -82 -1 17 251 167 -3 -117 -95 -301 85 95 23 104 -101 116 -7 -8 -78 -12
7788 -12 -242 -166 -170 110 19 18 -77 59 -116 90 102 -191 87 -51 151 -57 -63 -181 121 -329 -84 17 -79 26
7812 26 -307 81 74 37 -88 -232 -120 -37 -203 105 8 51 -200 231 18 -5 0 -223 137 116 262 31 -324 -7
7836 -7 8 -21 190 -254 10 88 -273 -48 173 -9 -202 -6 226 -217 -97 -204 -24 58 -177 -163 202 92
7858 92 94 -17 -112 -177 -84 240 97 26 58 245 7 9 -34 126 22 -42 17 -15 273 125 77 115 -51 142 -120
7883 -120 -43 19 271 110 3 -19 6 -70 -56 -162 -21 -57 49 102 -126 -87 3 155 291 64 -88 112 13 -15
7907 -15 -76 -195 -110 210 116 69 -37 -4 -153 -43 36 -29 -84 -53 -26 -121 117 -27 -154 15 221 -88 42 67
7931 67 72 211 -78 187 -106 -64 -114 288 -45 98 -150 -165 101 -37 42 143 -94 66 239 -73 188 116 -34
7954 -34 262 -91 9 -320 146 -2 -94 131 165 -239 -275 110 -96 152 -165 -195 -111 -18 19 170 -29 181 -237
7977 -237 -220 7 -51 62 191 -23 171 -343 40 -29 -134 36 179 -15 -98 -162 53 -192 43 -40 98 296
7999 296 -2 -262 5 -8 -234 -67 128 -115 51 -36 233 -188 -44 97 -35 -91 13 32 -121 -90 157 -87
8021 -87 -306 216 -71 181 36 -239 -20 -33 152 24 -189 313 118 -2 139 -19 248 -131 216 66 72
8042 72 9 78 119 -186 154 125 55 293 43 11 -242 260 -176 -32 -101 17 28 4 24 213 -67 108 -23 -59
8066 -59 -41 182 255 -37 -204 -94 -56 78 252 -46 -136 -192 -156 77 37 272 212 -26 -39 95 30 161 161 67 -100
8091 -100 223 85 161 97 15 -115 -162 103 -43 22 2 -265 -137 55 -180 -44 30 69 47 -181 -176 296 210 -72
8115 -72 15 62 92 -192 -197 -35 -172 59 -33 -40 -81 -33 -99 -136 40 141 -19 255 -108 -186 93 78 37 -77 -29 178
8141 178 246 317 172 28 46 55 -43 47 17 -118 -15 -234 -115 -66 202 -23 132 279 -210 134 -115 -3 -76
8164 -76 9 28 94 176 51 156 76 -137 43 158 242 -157 268 -6 -105 -169 -115 45 -73 28 -198 -47 202
8187 202 97 -68 -182 -185
8191a85
$$ Imaginary data points
##PAGE= N=2
##DATA TABLE= (X++(I..I)), XYDATA
0 0 0 0 0 0 0 0 0 0 0 0 0 -1 8 -8 8 -8 16 -16 16 -24 25 -32 40 -48 56 -64 73 -86 97 -113 129 -148 168 -190
34 -190 215 -240 271 -303 340 -380 421 -469 521 -577 636 -706 777 -857 946 -1041 1148 -1263
52 -1263 1393 -1537 1697 -1879 2087 -2323 2596 -2920 3309 -3784 4380 -5154 6208 -7733 10147
67 10147 -14561 25341 -114245 -69943 72443 -94773 -72803 39526 47481 -6896 38329 53272
79 53272 39702 34739 24704 -16980 12789 46198 5618 -28187 10954 6328 -31463 -30147 -9760
92 -9760 -32709 -60860 -43074 5012 9117 -6083 13404 32589 23340 36546 51388 30823 14579
105 14579 22902 -972 -39156 -25219 -2607 -38722 -53024 -11673 -6910 -28118 1723 24373
117 24373 1837 7677 36608 25556 6680 17314 14516 -6952 -966 10887 -7371 -15597 372
130 372 -6132 -25376 -16872 -1455 -8100 -16299 -6138 5526 3751 4875 16371 18506 14062 17879
144 17879 17309 3840 -2230 -811 -10714 -20468 -11775 -8295 -21596 -15293 3422 -2118 -6879 13788
158 13788 19193 3957 7171 17359 6769 -2698 5174 4034 -8765 -4947 1939 -7932 -11016 -1665
172 -1665 -3400 -8240 -2020 1397 -3183 -1401 4288 4816 2009 7702 10688 3981 1953 6588 1661
187 1661 -5629 -3089 -2526 -8909 -10318 -4779 -3307 -7720 -1730 6861 2426 1760 10561 8046 714 4714
203 4714 6066 -1505 -3697 448 -2230 -7667 -3844 -150 -5206 -4340 2021 -691 -2711 2389 3080 -129
219 -129 1998 4479 2538 1480 3430 3375 -1018 -828 1535 -2713 -5214 -1995 -2565 -5664 -3278 582
235 582 -144 -899 2923 5267 2027 2354 5905 2981 -1120 1627 553 -3586 -2620 -1121 -3350 -4461
251 -4461 -1148 -425 -2446 -450 2631 652 -403 2852 2566 145 1737 2525 755 -195 1013 224
267 224 -1549 -999 -421 -2937 -2996 -603 -1338 -2955 -74 1485 190 668 3336 2890 662 1513 2907
284 2907 117 -1085 274 -1100 -2777 -1639 -857 -1844 -1429 -127 263 -787 384 1884 394 -7
300 -7 2085 1212 -320 1065 1426 -314 -129 12 -267 -1276 -478 -437 -1701 -1297 -57 -773 -1067 557 1153
319 1153 30 785 1935 1173 -261 930 1165 -1004 -969 102 -906 -1773 -623 -474 -743 -416 559 242
337 242 -359 728 634 -285 239 820 -168 -392 557 440 -535 -167 60 -90 -478 -355 -184 -967 -305 476
357 476 -206 -363 739 338 -174 616 888 230 -26 447 314 -938 -336 -14 -599 -382 256 -217 -439 255
377 255 313 38 165 332 470 -72 319 648 -258 -494 372 -124 -383 -50 -170 14 -293 111 225 -239 28
398 28 286 -435 -50 264 -34 -56 344 314 8 -108 225 26 -412 -90 160 -421 -208 -152 -98 -75 436 259
420 259 259 231 324 148 83 279 37 -286 -172 282 -131 -337 110 148 -5 -49 169 86 -75 77 215 69 103
443 103 313 -87 35 84 119 -212 -225 284 17 -234 135 94 -184 18 173 -93 203 409 -62 1 209 25
465 25 -87 -71 -63 111 -178 137 -170 -106 28 121 -104 46 46 60 58 173 29 -71 -33 1 21 134 93 35 -138 -274
491 -274 36 16 -295 22 -2 -43 -193 -119 18 -268 152 193 -67 -154 94 226 87 -125 34 -7 -235 -101 112
514 112 -127 38 178 118 161 -48 152 -206 140 120 -281 -93 -163 328 68 -113 -52 -91 -90 -55 75 -149 174
537 174 45 51 18 -27 308 -126 -254 154 -110 -36 24 22 -10 -70 69 -200 -107 116 220 278 63 -57 -94 -60 77
562 77 -250 22 88 78 435 46 109 -36 181 113 229 -293 -306 -24 -178 184 35 96 165 -253 -210 -115 -50 124
586 124 55 -8 42 12 -88 111 121 21 -206 100 152 27 135 251 220 -191 143 -75 -72 -23 57 96 82 11 -246
611 -246 82 -236 -231 115 31 -86 134 122 23 -102 25 -223 -91 14 -185 66 45 91 -193 49 -144 154 63
634 63 111 -211 -244 -90 -81 -30 -116 -111 39 81 60 136 -29 78 263 16 -82 -62 155 -213 334 35 -264 -32 110
659 110 341 -212 31 111 53 -56 186 -27 -85 -145 109 295 -107 -134 355 -270 179 302 82 165 -152 -113 -28
682 -28 -118 -6 237 -40 23 160 -62 -84 143 3 -156 16 -189 8 -66 133 -164 -74 25 -39 17 110 -65 142
706 142 -68 -71 -94 161 122 -3 53 20 187 -89 131 -107 -44 56 100 -25 22 -116 -4 136 282 10 -10 327
730 327 166 -108 201 -111 140 39 149 98 209 204 -136 -135 12 122 -273 -149 -106 -87 117 -235 -4 -30 -202
753 -202 113 33 38 78 126 385 -79 -57 -39 84 91 -179 -251 49 113 14 -68 -104 44 -79 100 -82 27 146 5
778 5 -174 -51 -153 -132 -224 111 -303 38 447 -201 -88 173 98 -46 125 -105 -58 -179 103 -11 212 -121
800 -121 109 -153 21 9 325 53 -144 -12 131 -85 24 332 -260 -104 53 129 -21 -117 -117 -7 -8 -138 146
823 146 91 85 -230 -279 -29 -54 -85 246 278 81 104 87 27 187 51 -268 79 38 70 -150 -108 29 191 121 -52
848 -52 -334 109 -46 -90 14 -58 55 -85 124 -278 -20 124 38 141 67 -103 -94 -109 35 -214 -43 0 74 276
872 276 -28 -337 61 -60 -8 100 247 -46 211 -136 94 73 -158 143 -286 -75 -6 67 -252 179 122 85
894 85 -268 -116 -86 316 -62 -143 313 -7 -109 -288 171 151 24 -201 -86 -57 141 -3 -23 -203 173 -33
916 -33 -130 30 34 -7 -195 -36 -210 186 -75 -44 314 408 83 -267 146 -222 20 -98 -43 -60 -79 4 84 14 110
941 110 -30 -139 229 -100 21 -56 -101 -123 52 -114 -41 -68 246 30 125 262 -89 16 252 -20 244 -5
963 -5 -157 51 -130 290 122 -170 78 31 -201 189 86 141 -175 -440 -213 63 -60 -92 43 -132 -120 148
985 148 -97 40 -177 -78 323 117 15 93 -12 5 254 239 -3 -200 -185 -28 122 24 -81 -56 -106 -77 80
1008 80 265 -125 -211 -93 -50 -185 -91 51 -38 -22 11 -166 131 100 -69 -111 -63 83 -197 -70 -25 138 -164 -97
1032 -97 -147 -32 -103 -104 -28 69 -232 -161 -53 -19 -383 192 207 -64 -118 -153 -32 4 -24 156 -210 74 -128 85 -124
1057 -124 446 -78 -195 -38 -262 -48 -13 -114 204 -254 36 30 -19 168 -49 -177 101 50 13 -139 -13 12
1079 12 -183 -63 -32 -112 168 -28 -164 -220 -34 75 -23 -90 124 -11 29 257 -159 126 261 -17 246 -206
1101 -206 107 11 33 -1 -104 -25 135 -78 75 -83 123 -11 -199 146 237 -75 79 -99 23 43 -102 233
1123 233 143 -162 -96 -207 -26 143 -262 148 -30 83 -233 -192 -44 -187 -64 -135 90 -252 -179 310 -92 -61
1145 -61 -108 -53 139 -242 104 -16 -128 -50 -83 113 -167 70 -92 1 -6 75 -171 -78 89 -42 31 9 78 -129
1169 -129 -134 38 -66 77 -13 -127 -30 38 62 -38 323 -24 31 -143 55 267 -151 -117 22 -121 -28 -12 -21 163
1193 163 -140 269 173 198 -22 325 -18 74 77 -173 -40 -122 -7 203 87 -18 -172 244 61 -155 -138 -31
1215 -31 -145 -153 -226 -70 59 -38 -8 48 -202 121 -77 232 121 144 105 124 -75 -243 110 -171 264 -34 -134
1238 -134 -247 -158 172 -218 156 251 453 0 -120 -65 146 -43 306 -165 -64 83 37 -10 -2 166 -69 -266
1260 -266 72 -86 -12 94 -244 295 318 126 75 -45 157 -70 87 -138 45 -78 53 40 -21 27 4 136
1282 136 272 149 94 3 123 276 -20 12 56 -60 -306 -18 -203 9 6 -123 247 -229 -31 -195 16 -132
1304 -132 262 -217 -54 4 -108 120 -280 132 118 134 -110 174 4 -12 278 -169 73 35 -142 182 -106 -114
1326 -114 107 -24 -20 155 39 -327 71 -79 -35 -251 61 118 -71 52 -268 -16 59 -223 -28 12 73 23 207
1349 207 -150 76 40 -183 -132 -57 -327 -186 100 -142 188 119 -48 -179 37 0 -217 -251 28 -49 43 215 86
1372 86 -188 196 -209 90 -271 -55 15 37 -91 186 236 36 164 -248 -117 -101 -84 31 -190 41 53 -85
1394 -85 -90 48 108 106 -57 -132 -144 29 187 -7 -4 216 45 175 -82 -82 140 -179 -135 -172 -53 -13 36 -207 23
1419 23 212 49 -70 77 258 -100 98 -17 63 156 241 119 -228 257 -65 -36 6 126 66 -114 -253 -255 254
1442 254 34 -249 189 -253 -220 22 34 24 49 180 52 99 316 -266 20 179 43 32 66 93 -135 272 7
1465 7 -152 68 47 -88 53 -52 -41 26 180 57 -192 -147 -137 -61 -197 258 -7 82 -133 53 -173 -94 147
1488 147 43 -128 91 189 78 -121 -144 153 98 117 -6 -118 -75 38 84 60 70 -54 152 -20 235 209 -170
1511 -170 23 -158 -78 -161 -18 -596 -28 -90 207 -17 -33 -5 -41 124 20 38 84 57 -50 165 -16 223 132
1534 132 75 153 -89 -16 -13 122 72 20 137 -29 -301 -221 -63 -34 44 -113 27 248 268 -10 -76 26 120 -55
1558 -55 -168 -89 -16 -153 112 98 279 -114 -173 -31 147 73 -167 159 102 51 -3 -51 359 -378 17 -272 -59
1581 -59 98 27 213 -396 -38 -237 -175 117 31 37 199 -143 -128 -153 -20 135 -159 14 86 -77 -70 -261 -136 -109
1605 -109 122 96 316 -89 -153 115 118 96 227 182 82 -11 233 41 168 49 19 27 -300 66 -4 -24 73 282
1629 282 -6 -7 -119 134 -204 14 -136 -124 89 -44 -187 273 139 180 142 65 -55 -30 -139 63 137 -181 -120
1652 -120 -167 -280 143 52 99 -186 -244 -17 9 -44 -45 9 124 294 229 248 44 266 18 -12 -42 34 -93 56 85
1677 85 -170 -138 56 -55 88 52 25 6 -369 24 -56 -206 -93 -131 147 43 64 -69 -8 15 -12 -98 -34 83
1701 83 -236 -14 135 122 -106 30 239 -217 -136 -17 97 64 -88 136 20 164 -140 191 110 145 225 48
1723 48 3 -94 63 -199 190 -290 94 185 -102 47 -96 -95 75 -15 165 56 -232 52 2 -517 -173 -104 -203
1746 -203 258 -6 -248 17 30 -398 -222 95 -170 8 277 22 252 -11 -73 -62 -72 240 11 -100 -27 -42
1768 -42 -9 9 -94 18 53 146 -232 131 176 192 21 -203 16 -102 292 -25 -3 -24 69 39 8 -3 224 51
1792 51 -86 86 157 83 -161 -39 -327 201 -280 -29 -1 -7 295 -157 -147 390 -66 -96 -121 -296 247 204 -29
1815 -29 -79 39 321 -131 -32 -114 80 19 -109 198 -43 43 -180 -105 -192 -98 126 -195 134 -28 -103 -129 -86 -5
1839 -5 325 157 -77 -39 73 -99 92 -215 10 26 128 -161 -134 74 -107 119 -87 1 106 21 -88 20
1861 20 16 -2 141 15 221 117 -34 -99 -139 -293 47 119 258 -207 104 87 -165 -22 299 -149 32 -42 164
1884 164 -120 43 -180 -83 -1 -65 -8 -4 113 -135 -143 -263 -170 -11 139 -242 24 -200 -87 118 -182 116 -28
1907 -28 197 -20 -93 -197 -272 -164 109 -28 -246 -133 219 160 119 49 89 272 -87 -156 -42 -49 -136 67 -141 -246
1931 -246 28 -201 -308 154 23 -269 -100 207 20 -174 57 316 -16 28 229 -77 42 158 -111 31
1951 31 238 -16 -101 -174 201 -94 84 -209 -22 62 -56 100 77 73 129 -59 102 115 -228 -21 270 -119 -62
1974 -62 -158 -146 42 -56 171 170 80 -163 101 -63 -15 14 -132 96 117 160 385 -46 45 -180 3 43 -68 12 81
1999 81 -82 -53 -173 -80 104 139 42 165 153 -16 -37 211 -190 77 51 -135 151 259 57 -237 251 -34 -24
2022 -24 128 -5 -16 122 150 -42 188 37 133 -62 -15 168 192 99 -209 -166 -42 163 88 -251 2 -128 -86
2045 -86 241 46 92 191 -265 113 109 -23 -97 268 -301 23 -190 -17 25 -41 -167 94 46 55 -102 -125 141 113
2069 113 231 42 124 27 35 77 -97 -83 132 50 -106 150 133 156 201 -93 74 -39 -74 -204 -28 84 119 -120
2093 -120 -40 -18 193 -109 143 94 -82 -47 169 -164 -83 -25 -89 205 32 139 29 -109 -219 9 91 -129 3
2116 3 35 -16 -9 45 36 100 -9 3 34 95 164 -8 78 91 134 -116 -149 176 3 -148 100 197 237 255 89 48 -159
2143 -159 -9 308 -72 -205 3 -77 217 -93 -169 130 -101 177 -114 -46 -238 39 -144 -245 71 -151 61
2164 61 -77 -53 146 -125 23 -59 12 -91 -36 86 -11 336 81 10 71 -216 -72 113 37 165 25 -99 2
2187 2 -74 -125 -86 -263 278 -151 110 41 287 106 65 -130 102 88 -105 -105 17 -139 173 -48 183 207 -217 304
2211 304 159 -80 -242 4 -295 -36 146 -175 -249 299 -178 205 224 -137 4 -259 69 -50 -227 69 110
2232 110 -90 -78 100 195 1 -186 -123 -200 57 19 -183 10 103 100 92 73 -10 37 -108 -178 -145 -117 97 -326 -122
2257 -122 15 -94 151 148 171 19 10 -222 55 -109 152 121 197 -86 -201 139 51 -38 -93 -82 308 -62 158 238
2281 238 -31 104 277 -4 -51 4 31 -134 102 -171 -98 -122 -120 -188 22 -107 9 98 107 48 58 -37 136 190 65
2306 65 91 63 116 79 -76 -114 -33 156 53 90 119 36 30 50 119 36 -11 -204 -56 263 255 71 -90 -140 64 37 19
2333 19 207 -187 -59 24 -337 51 -195 -50 -45 57 403 336 -72 -224 188 -234 51 -261 -172 24 178 175 27
2356 27 196 173 97 57 -129 136 -164 64 32 26 -94 40 -47 97 -17 36 228 -137 63 -122 -93 -309 314
2379 314 114 68 10 -285 -199 -129 -19 -108 -14 -105 233 125 -30 -95 45 120 -73 128 -141 -83 90 10 67 213
2403 213 27 -6 132 204 70 157 -160 -14 299 165 166 70 148 -137 -7 36 117 -55 191 -260 233 241 -203 -27
2427 -27 39 -140 171 23 -174 -84 63 -70 102 -254 -310 280 -124 -92 -270 -33 -91 184 140 -16 -6 -279 253
2450 253 332 113 33 -51 -126 -221 242 -89 64 98 -175 40 -109 -221 -247 -36 74 -49 60 -77 224 183 289
2473 289 89 -131 -203 -129 6 104 24 -15 237 197 -83 163 137 192 -95 -248 -65 0 201 147 5 -207 -43
2496 -43 217 9 181 125 -31 -94 -53 379 18 181 -213 55 276 15 -58 -65 20 -35 -5 -59 -72 -157 -39 -94 -161
2521 -161 -96 337 198 -36 -172 -106 105 40 139 -143 -117 -70 245 -21 -43 -174 -71 97 220 -100 -6 113 -104
2544 -104 -139 121 -22 -49 60 39 -22 169 23 105 68 -211 147 -75 96 -95 -230 40 -26 61 -72 2 -59
2567 -59 -177 97 -23 -150 4 -204 113 159 -136 3 -238 202 -41 -129 -97 -187 -268 -25 15 28 -63 138 97
2590 97 198 30 -75 145 -144 -119 65 -47 -73 -42 91 -22 93 149 -92 -112 -27 171 -8 262 -40 -29 175
2613 175 -4 -172 -104 -117 182 146 -221 90 124 32 -118 -170 -136 -301 16 -130 56 -83 -66 99 71 213 201
2636 201 -276 43 143 -292 242 61 -24 -20 -60 98 -165 -64 34 -31 -88 22 54 -13 258 -223 -14 69 -104
2659 -104 116 -46 267 -276 87 -44 -11 247 83 53 -89 227 -158 -51 35 -8 -73 -21 -24 48 249 -108 -61
2682 -61 209 164 167 34 -113 36 148 66 65 -1 -102 -204 -99 382 5 -200 80 -103 177 69 -81 -26 112
2705 112 134 -123 -35 -117 102 -282 349 -130 47 -220 -309 -192 -92 147 -175 -90 -16 48 10 -130 124 -101 -114
2728 -114 250 -157 -162 29 327 -51 17 -220 -83 -194 71 -235 -22 40 155 -118 27 -212 -136 -153 166 51
2750 51 137 -163 211 44 2 -159 235 6 -197 251 63 20 108 -48 182 -76 141 198 -30 171 -89 -184
2772 -184 -72 -135 -128 162 -17 83 56 -136 -5 -189 -168 104 121 -156 124 124 -96 82 23 -47 66 133 -244 231
2796 231 139 130 57 -177 107 -155 -177 302 -56 443 184 -82 54 -74 15 -178 -3 -68 -13 -19 -53 -148 15 460
2820 460 -225 236 169 37 96 -45 -104 -121 327 -94 73 32 -28 155 85 128 -73 31 -77 37 118 -30 12
2843 12 45 -174 113 122 -78 -70 -75 129 100 55 130 49 -78 59 -149 -268 -28 -253 -495 -144 21 167 70 92 -89
2868 -89 159 -16 -8 175 96 164 87 76 34 -184 37 202 -173 -91 -25 87 -34 -157 118 -223 -100 -111 -275 -11
2892 -11 -61 -133 195 92 93 294 -33 28 -155 0 -37 152 44 130 114 -100 -57 -11 -22 -273 -129 61 -88 -53
2916 -53 250 252 43 273 35 -54 10 190 72 21 -138 14 -163 -23 -173 -55 115 170 123 -10 -27 87 134
2939 134 87 -34 32 -23 69 19 42 -35 -361 57 150 138 -84 -71 261 -188 115 117 37 -289 -44 108 8 -4 -48
2964 -48 45 -109 2 -26 37 39 -43 -122 -44 81 126 -177 -34 227 13 -300 -92 -1 140 52 178 112 88 96 -173
2989 -173 -224 81 -65 85 -225 205 9 169 -73 27 -273 32 -135 82 456 -79 165 -36 -159 -1
3009 -1 -169 -305 -269 142 218 193 -215 -241 38 20 57 99 139 -16 -115 -318 143 57 91 228 260 202 126 49 -74 -206
3035 -206 102 163 33 -56 81 56 -302 -14 -250 -73 0 54 -45 0 -192 148 32 31 -137 181 167 -1 71 -308
3059 -308 351 15 -55 -140 -158 -88 -110 182 -239 -67 -92 72 93 -2 55 126 131 -172 17 72 -126 73 -73 1 185
3084 185 113 11 -172 43 -262 89 197 191 15 -47 -9 42 33 -220 -161 109 23 -245 -74 69 -96 -10 -182 56
3108 56 47 -163 -118 169 143 -212 -69 -112 93 38 -161 176 -149 -78 -94 -75 94 75 -17 197 131 -3 -44 -138 19
3133 19 17 34 94 197 -222 -375 -252 -120 -17 8 -122 57 -19 -247 -209 231 -166 174 -23 -168 158 -1 45
3156 45 -91 -202 -28 -248 174 76 -52 -7 120 143 142 118 -139 -50 -142 162 -285 -50 -77 75 166 -227 -43 -71
3180 -71 -65 -163 -140 -86 61 155 -36 263 -264 -260 225 -189 194 -61 313 131 21 98 48 110 344 77 154 -108
3204 -108 227 -6 -182 -126 -145 118 -144 -158 -49 264 0 -121 132 -58 263 270 177 210 -109 266 -2 106
3226 106 123 169 37 -312 167 -136 -27 132 -363 73 -62 -320 -123 148 173 17 59 163 79 -215 -70 103
3248 103 116 189 -12 -22 30 205 -88 -30 129 179 321 176 -116 -158 -294 178 -156 239 -266 -177 -68 50 85
3271 85 32 150 -315 123 -65 119 -121 63 -23 -199 51 -16 44 13 -108 19 154 206 -174 118 232 -5
3293 -5 62 -46 -30 -84 -147 -98 -347 28 12 -77 -108 65 125 31 -35 -5 85 -29 86 -195 23 84 -197 16 66 265
3319 265 -168 -166 108 -22 28 -9 141 138 329 -9 -201 1 178 -16 -105 -89 -227 -106 59 -107 -132 -384 56
3342 56 -52 74 44 -218 216 282 79 -48 57 -126 -77 48 17 -247 8 80 374 106 49 98 201 109 155
3365 155 8 108 78 86 -100 71 62 -27 -190 128 -22 -174 -195 125 -63 -97 -21 -27 -220 -113 284 -390 -390 -157
3389 -157 252 -184 90 61 158 81 -69 16 40 -9 -70 3 -84 -56 38 260 4 84 -25 260 -9 214 -135 99
3413 99 -245 -245 161 -191 202 58 -141 -18 280 -24 134 68 270 -24 -34 -192 37 -48 -18 92 123 149 5
3436 5 -85 171 333 -166 -69 -208 -48 -21 -83 172 -63 158 60 72 127 -35 -65 -175 205 -87 99 42 -160 33
3460 33 -155 8 -5 -29 -96 -215 -48 50 -106 -102 18 13 -78 266 139 38 107 -131 16 -103 -67 26 270 -95
3484 -95 142 -126 -116 -193 70 -266 147 -54 1 89 203 13 233 -307 -159 -55 -225 -18 41 4 364 -17
3506 -17 -104 67 252 -62 -127 -51 -111 -128 3 211 62 -18 -29 165 179 -115 -180 148 149 -46 30 -114 90 106 -42
3531 -42 -127 -147 -155 176 241 -70 106 318 117 265 24 254 -89 -158 63 -310 -66 -77 159 202 -59 -121 11
3554 11 231 -20 42 -69 -267 94 159 -118 -286 3 -124 -16 -50 -204 -112 -188 46 162 138 3 -46 -30 -96
3577 -96 226 146 56 -313 105 25 203 129 96 -25 -35 -56 -70 -71 -1 10 -31 130 66 -75 89 -231 68 -26 147
3602 147 48 -20 -37 109 -84 77 -113 -115 -96 -35 -167 -127 225 130 -21 -203 55 41 -109 -44 -52 156 92 -32 -16
3627 -16 -76 -15 -73 128 253 -57 28 225 -43 274 181 236 -32 52 -105 -256 1 -84 32 83 -183 -199 106 211
3651 211 -59 27 -233 -56 144 6 -132 45 -281 48 -221 1 2 -9 92 -67 -163 -108 -119 -54 -75 136 89
3674 89 -199 185 136 -79 142 77 -245 90 -173 -124 272 296 -210 -2 97 -82 -299 -88 39 -53 64 43 -270
3697 -270 29 106 -139 -147 62 -60 -73 -12 -14 -21 24 212 10 165 -77 34 -180 169 110 -111 -284 -165 -94 198
3721 198 -20 -66 191 150 27 -73 -35 3 -130 -66 -98 47 89 -37 -24 83 -93 -62 -133 -113 -127 8 102 -17
3745 -17 55 79 -11 97 -152 69 15 -44 -161 -5 114 150 156 -127 185 -99 -31 -109 104 -116 138 -240 122 129
3769 129 -68 57 92 -75 -70 145 -26 94 -54 -104 -26 -61 -208 -64 4 -111 45 175 -41 -155 -181 -83 51
3792 51 185 -46 57 233 -22 10 121 197 64 24 -9 -104 -81 79 -108 147 -121 -17 -15 43 457 -182 -72
3815 -72 -61 46 154 -57 79 117 -1 -88 243 117 -340 20 154 -227 64 67 -251 -56 -89 -165 -6 -231 -161
3838 -161 38 -32 30 49 159 -150 134 110 -146 -48 208 -11 32 96 280 41 -64 -163 73 42 -62 41 -176
3861 -176 -5 93 52 55 246 93 -16 -41 -54 -207 29 53 -29 384 -50 -108 44 -216 67 45 229 -19 -240
3884 -240 176 -217 -35 84 155 141 36 66 -34 -96 -6 151 83 -130 -37 170 98 40 -342 -41 115 -25 104
3907 104 105 66 -219 100 111 11 87 -92 -212 161 9 -36 15 79 151 -7 60 -117 -177 -58 6 -11 148 133 -52
3932 -52 145 -56 -215 25 -107 17 -48 75 -152 142 19 87 -9 -156 82 -2 140 63 132 393 138 91 -119
3955 -119 275 202 13 -90 -120 -133 -173 188 76 -82 4 56 172 -155 117 88 -170 -93 -72 138 -23 -213 81
3978 81 35 120 -33 -31 181 121 -12 -84 -43 5 -87 -18 -64 2 -21 -146 129 179 -8 52 -190 -106 214 -61 63 -135
4004 -135 -47 -75 62 89 51 -19 209 52 3 101 157 29 149 -89 82 -88 -15 111 -78 89 -25 66 -204
4027 -204 -204 150 -280 147 -247 -164 37 363 6 175 93 -60 66 -152 -189 -179 -134 88 0 79 -99 -17 6 27
4051 27 -54 -10 -102 -25 81 -173 201 304 8 -158 285 153 41 254 168 -76 -201 -13 17 -57 -218 276 94
4074 94 -27 54 61 253 -84 141 196 53 -102 -132 -138 -92 92 125 -227 -104 59 -56 -72 32 107 96 129 94 -82
4099 -82 61 -30 -106 -225 -62 -92 -171 170 -20 21 -10 109 117 -38 43 139 -79 -55 -93 -47 145 43 -11 -184 203
4124 203 -70 -63 120 124 168 -25 -301 32 32 126 58 121 -61 29 72 137 -98 -61 226 49 -42 206 -101 -21 -10 -34
4150 -34 141 -45 -162 -101 -10 226 14 -121 -40 -76 -273 -198 29 0 -41 -123 269 -73 157 -48 -79 -126 204 28
4174 28 -143 159 -110 -35 -89 11 -22 160 112 93 -46 -74 36 -35 353 -143 -97 243 -109 56 -68 173 169 47
4198 47 58 -8 -117 38 -109 65 -66 -160 148 180 87 69 -84 -229 -47 5 79 67 -310 -97 -149 -338 117 75
4222 75 -18 -155 88 125 -85 91 8 -131 43 -36 156 271 53 -160 86 91 110 -57 -73 -71 -104 -117 316 -76
4246 -76 -31 57 314 107 -44 261 -184 -225 290 79 57 -98 -114 318 -98 -100 116 -20 -88 9 -68 190 71 63
4270 63 134 219 74 -44 -60 -21 -49 -147 -120 -88 -104 -242 185 207 -94 -190 282 110 -119 223 -40 8 25 26 100 176
4296 176 133 76 -283 202 85 -173 83 89 -7 -71 40 85 97 -304 -13 -423 -85 2 -232 135 -50 -57 -94 36
4320 36 -66 199 235 35 -242 128 197 59 128 -49 -157 -178 86 78 35 30 -28 20 -82 52 -118 -63 -32 -340 90
4345 90 220 177 30 252 328 -28 237 81 147 -214 -90 -78 24 235 -135 -32 -53 -244 100 -87 -82 -158 156
4368 156 175 93 -208 -58 31 -64 37 -328 -246 -90 -85 244 65 65 -4 -159 3 185 19 143 -37 -263 -18
4391 -18 321 -30 -13 125 -104 -89 232 214 40 1 121 -46 71 58 -333 12 31 165 -93 -151 -62 -57 -131 188
4415 188 181 -187 274 324 275 -32 -307 -8 -99 -91 125 294 -91 -183 -91 361 -68 71 -200 -290 65 -23 21 -416
4439 -416 -127 -176 -27 -13 -94 -240 -293 287 16 -92 -131 -60 39 -14 235 -56 -146 -16 65 21 -263 268 -251 -185
4463 -185 -52 132 141 74 -213 155 80 68 57 -97 106 -191 34 -130 2 -260 -197 257 187 -69 -105 74 205
4486 205 80 99 -49 -86 -197 -68 -184 -109 -36 17 -22 159 75 160 53 -106 17 -222 7 -1 -22 -171 14 -198
4510 -198 -129 116 -12 -104 -29 60 -304 -154 288 1 182 92 152 -179 -18 20 -307 -88 -367 94 133 46 -240
4533 -240 262 9 -250 -30 -13 -83 -57 -106 -20 -137 0 84 -29 268 -270 77 32 87 93 -183 108 -126 -290
4556 -290 -63 402 -296 101 109 183 68 -102 -39 -103 117 211 25 -72 468 -71 70 163 116 196 -483 5 73 -9
4580 -9 144 -106 -192 -71 136 -133 -85 81 -157 38 -39 -197 116 -176 166 47 -301 15 40 175 -176 171
4602 171 -237 150 -149 -98 55 -91 -19 -97 -38 134 51 102 43 97 -199 26 341 163 144 -235 191 148 264
4625 264 -20 74 198 194 -19 146 24 -6 104 -155 78 44 -158 -69 -92 109 -26 -112 -111 -98 -244 256 136 22
4649 22 22 71 270 -237 3 -22 -30 141 -179 63 123 -4 66 69 -174 281 28 138 160 -279 232 -159 42 -88
4673 -88 -21 60 103 -2 44 -29 -38 67 38 59 187 -40 52 -25 230 -173 269 47 123 141 -102 -116 49 36 9 -19
4699 -19 -77 -80 68 23 -78 -26 94 -109 -8 84 374 -248 49 30 -3 73 -106 -90 -167 88 -27 113 125 -97
4723 -97 112 -25 -234 -30 163 75 37 -95 -99 31 3 -377 88 -25 26 -67 -19 369 226 -133 -301 106 -124
4746 -124 83 -12 -45 -18 172 -94 93 -104 -125 250 58 170 -155 -126 252 29 94 -23 -271 147 -192 -33
4768 -33 48 -48 163 160 -105 184 127 -205 -10 78 197 64 323 -68 0 -2 75 -154 -295 83 65 -40 249 89
4792 89 -43 52 -95 54 -65 11 -80 180 -131 114 -23 -48 -53 -82 2 -171 332 144 -33 229 118 -118 -121 34
4816 34 118 -222 41 95 40 176 149 -74 -251 -57 39 129 -33 53 -282 -48 -123 -291 -86 139 -41 325 -31
4839 -31 22 -133 325 95 -51 51 200 223 160 -188 -111 172 60 -112 -11 122 -195 -99 -122 -313 -15 -22 111
4862 111 24 -75 -62 -19 -131 -113 209 74 -23 54 -148 68 -11 8 182 104 7 131 100 35 -165 -56 -108 73 -54
4887 -54 218 123 26 9 105 38 -164 -262 88 171 -304 -174 97 -15 183 125 -91 -13 -188 -139 -39 -137 -53 18 87
4912 87 -40 -133 351 -158 -75 98 -131 41 -112 243 -147 58 44 101 132 -88 -200 -40 117 -228 -262 242
4934 242 296 274 -148 94 -178 -54 -68 100 184 -109 144 15 -266 -243 -63 -120 -238 -88 -70 -140 -110 -80 86
4957 86 -167 173 -138 100 42 -73 29 160 -128 -122 92 93 -33 98 5 -258 -135 91 -3 124 -129 5 -131
4980 -131 -22 -27 179 13 40 -100 49 -216 -115 -148 -8 -287 72 -40 16 166 202 91 65 135 -41 6 269
5003 269 -172 -172 263 -204 37 -52 222 -112 152 2 -234 -9 260 -96 -221 1 -38 201 -73 -237 90
5024 90 41 -153 182 -55 -286 19 -132 -92 -36 -67 -61 92 52 -102 118 -191 30 -190 -120 152 29 -134 154
5047 154 -189 154 -84 -127 -134 191 165 87 -4 -108 99 39 -30 43 47 77 -30 238 -85 -346 96 -54 -35 130
5071 130 74 162 125 -118 83 11 -137 -70 102 -107 -162 -101 -201 -157 122 -61 -432 33 125 -46 130 10 -301
5094 -301 251 -101 298 179 -90 -113 40 100 -278 229 -15 35 154 278 -150 -38 149 -57 -30 -71 46 -147
5116 -147 262 45 165 -69 -300 35 -121 28 -37 205 -20 98 56 -9 1 -184 37 129 160 -141 -53 -133 12
5139 12 176 83 91 118 63 -23 -231 -15 -139 -62 -30 -338 -170 0 166 -153 49 26 -222 61 25 -63 -219 -209
5163 -209 57 -111 -215 -134 23 -64 10 261 -21 -69 -328 -368 -187 255 59 -120 206 78 71 -30 -131 -160 34
5186 34 -285 102 111 -21 -121 75 114 0 -96 -92 84 99 -33 -77 -249 98 51 -41 264 -56 263 47 264 -117
5210 -117 162 -298 72 -62 -247 69 -49 158 -154 -87 -14 59 107 -17 65 -42 211 -28 -62 -57 -71 28 -167
5233 -167 181 106 -72 -191 -132 -5 1 40 -130 -238 -26 5 -197 -23 12 10 -3 -104 161 23 209 34 -120
5256 -120 -166 54 24 101 27 146 280 31 291 312 59 226 -171 125 21 163 -6 -146 108 84 -175 83
5278 83 76 -37 -67 -26 30 123 56 55 -9 -52 -49 -196 131 -115 -174 24 54 11 -20 -156 -4 257 317 0 53 24 -299
5305 -299 -159 -268 -23 -135 -34 -197 -5 115 -167 -16 -78 -28 -69 -206 73 53 -55 -128 146 -237 -51 329
5327 329 -103 -82 -27 133 -75 5 163 -26 364 58 116 -120 -20 25 -76 -91 31 54 56 -79 136 -116 -7
5350 -7 170 -68 -205 211 -67 69 -1 -140 17 400 -36 -177 -35 -15 245 13 125 -32 38 72 84 -30
5372 -30 167 -43 -16 221 -321 -35 179 103 -21 28 50 -211 75 43 95 111 -58 -166 -127 -62 194 29 -10 123
5396 123 -11 33 -44 -218 17 -88 94 -80 12 -271 35 -251 -41 -233 -195 -111 -59 41 -35 62 -85 10 -161
5419 -161 245 -73 27 49 -20 327 137 -32 119 -86 -220 -116 116 82 58 -88 -5 -95 -154 54 81 5 5 -33
5443 -33 53 70 6 -150 60 -13 -290 48 4 -34 20 -86 17 94 -146 -37 30 -89 115 -301 -8 -8 -92 -70 256
5468 256 -58 -25 -162 -3 -165 -191 3 -128 -256 134 -174 110 84 178 -146 -17 36 -54 419 61 116 -188
5490 -188 -273 -115 -85 93 211 94 147 78 -139 105 132 -472 -46 5 269 -207 422 -247 -143 -205 23 -166
5512 -166 -189 0 -98 -143 132 42 -144 44 28 42 148 84 224 38 31 -137 -86 114 -58 341 2 59 131 143
5536 143 -10 60 163 -181 40 -225 26 -298 98 -105 54 -258 18 211 156 194 -105 -82 -131 -224 -62 -242
5558 -242 -100 201 61 187 -220 -65 132 250 223 289 142 -13 137 -93 -61 140 8 -213 22 -219 291
5579 291 -249 0 -93 -36 -56 -71 66 47 -32 -214 -11 -84 -75 -244 70 277 -56 113 118 -263 10 -70 -22 131
5603 131 -86 -57 -53 -53 -116 -94 -228 -113 279 30 146 -113 48 198 91 4 207 23 -190 210 109 41 -149
5626 -149 14 109 -283 -10 41 27 180 -150 245 177 -278 273 25 -27 -183 -252 -298 64 -99 -127 125 -100 -74
5649 -74 -313 -128 46 -24 -209 27 -54 -194 -1 -61 81 154 -20 -52 -97 108 -57 -80 17 69 -172 -222 -186 31
5673 31 199 -157 -93 71 -13 25 103 108 169 3 73 84 30 -105 26 -159 -51 -75 72 213 239 -32 -65 -300 127
5698 127 -26 -10 179 332 130 -178 -48 41 -61 -11 503 -226 52 -205 71 -84 -73 287 113 -65 -100 42
5720 42 14 -149 -143 46 67 -213 -31 -122 -19 -124 -146 -107 -225 8 -126 0 46 19 -100 151 124 -154 176 -78
5744 -78 -72 -174 -10 -84 -2 -102 -280 23 -257 -19 1 -316 -195 121 -172 -44 22 -75 -5 109 -55 94 204
5767 204 -24 127 90 -53 31 108 -115 55 68 -176 -65 -26 92 -189 221 -249 22 173 228 -83 246 -191
5789 -191 -33 268 -30 -417 -161 245 -111 30 14 -89 41 241 -198 -23 32 16 214 -91 -283 -105 95
5810 95 7 -127 163 -100 -59 -94 81 203 106 154 -124 -132 -73 160 40 -218 -34 -65 -58 -159 1 170 82 121 191
5835 191 -125 100 -215 -97 56 -2 -267 -234 468 179 -46 80 59 176 -67 5 171 93 310 -174 -149 -375
5857 -375 -25 -67 -243 116 39 43 23 155 -20 -243 -242 34 26 -99 -98 -181 123 -69 -140 23 -178 150 77 103 -15
5882 -15 -87 48 -100 -166 216 -30 241 47 71 -34 -46 90 25 -37 -121 25 -14 -91 8 243 -172 81 522 42
5906 42 -162 -9 206 77 41 67 267 78 27 72 -115 248 -16 30 7 153 -264 -76 21 121 71 -127 -150
5929 -150 17 55 70 -151 -88 238 206 -21 -23 -65 -186 63 -205 109 75 -119 -65 390 36 164 171 -10 -185 112
5953 112 36 -102 -166 50 156 105 100 -157 77 -238 35 -148 -165 -77 -258 -169 233 61 210 -166 -69 149 77
5976 77 254 140 50 56 -36 16 205 -27 -183 -89 -34 -140 57 -60 -6 -59 71 -102 202 -130 235 7 -192
5999 -192 46 -129 -43 -188 128 75 265 -158 142 523 -28 100 -178 -172 59 -113 66 228 -27 72 -259 190
6021 190 64 -118 -104 -127 156 -84 -55 -32 -70 -51 -42 -233 -103 -117 305 24 151 -318 180 84 -198 -41 59
6044 59 55 -141 -259 -14 -59 179 -25 -119 65 36 114 88 -65 47 102 -48 196 194 245 232 88 14 22 -152 -114 61
6070 61 79 -282 -86 7 137 -170 -132 146 -177 319 -66 -138 44 -186 220 160 -272 -27 43 -29 142 239 -159
6093 -159 -145 -191 179 115 182 -75 180 -163 83 16 -59 35 -196 -10 -405 45 30 -50 -49 17 124 215 142 71 61
6118 61 -87 -113 -137 79 74 26 148 -23 101 108 118 -154 -64 -222 -225 -212 46 86 -138 -60 21 200 155 91 -87 98
6144 98 167 -9 -71 89 65 73 4 144 119 90 -13 -6 172 -72 97 65 -108 -109 485 222 -20 39 -29 9 -185 21
6170 21 -16 223 5 168 26 117 191 80 88 46 -27 242 -151 -29 85 114 93 188 -102 27 65 -3 316 42
6194 42 54 110 -29 -94 -5 125 -154 -99 93 126 -264 -26 22 -389 241 25 212 -63 -69 206 -72 -132 -153 8
6218 8 -80 -87 116 3 -9 200 -187 -92 -17 125 28 -63 -63 152 -28 -22 76 51 -127 14 -173 11 171 117 77 105
6244 105 -50 -146 -121 -32 98 -126 221 85 -63 -81 131 -78 13 -192 226 -53 276 178 2 60 25 -10 20
6267 20 -180 138 -117 207 -220 -234 95 -24 85 -29 135 -191 -216 -82 -207 -101 37 9 185 -391 55
6288 55 256 -104 11 -178 -45 -56 109 5 -138 -75 -271 -134 -39 -57 49 168 -34 -73 156 -62 -234 63
6310 63 151 -21 63 -36 153 3 -57 141 -14 246 231 31 55 -143 -65 95 -150 -84 -58 -263 192 58 -8 -44
6334 -44 94 -297 138 -42 -93 -46 105 -137 47 -79 -78 -55 22 63 -135 -12 -6 -275 -87 -58 -107 385 -54 -221
6358 -221 -47 -205 295 82 -12 -181 -45 -160 128 98 100 5 -97 110 7 20 -22 -105 126 -278 115 -149 31
6381 31 -20 102 259 106 -28 -86 -212 -240 134 156 87 -87 -115 -57 223 -102 -124 265 26 151 187 -360 110
6404 110 51 199 -18 207 143 69 190 -78 -20 -159 48 -107 251 79 -98 -51 -218 95 -210 -156 -54 -64
6426 -64 -205 28 -95 -81 124 -180 -17 -36 93 313 -177 -15 46 -62 145 39 -176 94 204 195 37 -104
6448 -104 -156 236 40 -224 118 90 -199 -202 76 119 -62 70 -82 8 361 50 124 45 -111 14 -346 -54 331
6471 331 241 110 -184 -75 -34 8 -35 -292 -231 -144 -44 177 -147 -34 -132 20 222 -56 -35 -6 -248 167 104
6494 104 284 -71 -87 -134 142 113 -103 237 -171 17 11 31 -7 87 145 -2 -96 -130 85 -166 -136 255 -194 121
6518 121 -237 37 6 325 14 -85 -9 387 103 -13 -121 -169 -194 -48 -60 -133 53 10 -173 123 240 -69 319
6541 319 46 382 -111 -169 -44 -19 112 71 13 -154 -49 248 18 -176 21 -85 -195 -78 38 137 -103 -268
6563 -268 -224 112 -131 -76 -59 -220 -55 185 3 152 -157 -21 103 248 194 -67 -183 -2 77 -16 -168 199
6585 199 -87 -230 -127 -24 -105 -312 316 -92 -96 -429 -344 348 85 -227 146 153 16 -136 -175 -116 15 -36 24
6608 24 -7 -68 -98 -112 -4 -39 119 -208 20 -4 316 -265 228 -58 -59 149 212 -295 60 92 -51 -15 -126 -25
6632 -25 27 23 -10 -34 -54 194 -44 193 108 259 196 72 160 276 18 39 172 132 171 70 19 272 -89 -122 -221
6657 -221 -81 -123 -35 -194 123 -197 69 51 -22 286 116 128 -139 -8 -75 78 -62 -212 31 -124 -38 -38 -96
6680 -96 -24 297 216 -141 -69 -22 37 121 -211 -89 -96 -370 -30 145 12 53 -178 -8 -110 110 254 12 -107
6703 -107 123 86 -148 65 -419 -66 -228 120 -223 13 -118 -150 -108 -99 -144 -81 -228 -181 218 -48 90 -193 36
6726 36 177 -180 73 -188 -9 -251 341 137 -106 -46 -210 -8 249 37 -104 89 -43 119 20 -165 -187
6747 -187 219 56 261 -8 -347 183 79 231 88 -65 126 136 -230 -43 3 168 177 319 -147 -204 -147 -10
6769 -10 302 -125 -28 -275 95 -97 126 30 47 -247 -6 -350 -133 113 -167 211 -120 -79 124 92 18 -79 56
6792 56 -275 -116 95 212 251 -3 71 174 195 -23 -238 223 121 128 39 -72 -209 116 -30 -246 -101 55
6814 55 52 161 207 -198 -22 25 -133 -134 104 67 -111 -125 -21 81 105 137 78 -5 156 36 96 141 -107 -157 31
6839 31 17 32 -27 116 -14 81 -8 179 -98 -201 -66 27 3 -90 -109 -88 163 -43 21 -131 250 199 -46 -148
6863 -148 183 -110 -47 -1 -4 -3 -225 -44 -90 -361 -20 269 -26 15 170 261 93 -21 164 -158 -116 147 111 -159
6887 -159 30 155 72 -59 96 -6 95 47 -103 -21 59 196 -43 37 145 2 -3 226 -71 43 -84 -165 -187
6910 -187 -243 -69 -125 20 238 -106 292 -90 -161 -103 -423 -15 31 -85 -105 -42 -33 56 -12 -86 55 116 42 -52 45
6935 45 83 -151 143 56 -173 109 -5 -179 305 -86 103 -83 -205 -22 79 -100 -172 4 -119 86 -243
6956 -243 -260 220 -70 254 69 -57 44 -43 -72 151 -95 55 -16 8 43 144 219 -90 169 145 32 -114 -86
6979 -86 166 -87 68 -104 -72 -132 -4 239 -90 0 220 124 123 -243 45 44 -123 -2 211 24 33 -18 -288 556
7003 556 105 -189 127 38 106 -131 135 -55 -329 -168 -234 -15 -352 -87 -235 263 -274 -305 -51 -432 -207
7024 -207 -162 99 -30 -255 -113 41 -124 -261 -130 117 91 -48 151 -54 266 -149 -164 -4 -124 -149 281
7045 281 -6 -93 122 -123 -103 -222 23 76 6 136 3 -114 -2 122 -70 -120 193 177 153 -144 -44 108
7067 108 56 -167 81 -145 219 -28 110 27 54 -139 149 42 -86 16 86 -44 11 -55 -293 -180 -163 231
7089 231 12 -289 -36 -84 -42 311 48 -1 -63 -135 -195 -27 -138 -139 -18 37 -13 43 139 145 13 -312 -80 -140 -161
7114 -161 -120 251 -18 -94 -123 234 -46 63 -52 -198 -96 -198 -119 -206 210 -150 -221 -109 143 -11 46 33 -125
7137 -125 184 53 154 78 -146 68 -134 -162 35 -31 47 -52 -173 120 -159 -58 -93 -109 89 -30 83 51 10
7160 10 -6 229 -88 39 -34 -71 -37 -120 53 128 -142 120 180 -172 -63 68 19 -64 17 29 -251 -230 103 -173
7184 -173 -22 -36 -192 -78 -116 -216 -295 61 -227 74 6 1 -140 140 -76 26 -45 -89 175 -163 -137 13 112
7207 112 -158 14 42 -168 -117 211 105 226 -104 -8 49 96 -132 -165 164 183 131 -104 -227 188 132 -293 5
7230 5 -98 -108 55 -206 81 53 87 -4 78 -256 -22 319 237 -120 122 -80 240 66 26 315 -63 12 10 -65
7254 -65 -132 466 -312 -142 -146 99 -148 166 -37 146 158 -81 9 -143 16 126 107 171 -8 122 -94 26 208
7277 208 -69 -114 -179 147 -182 -55 62 -28 100 49 184 166 -96 -185 62 -58 83 -169 -51 315 177 296
7299 296 152 -100 34 3 -109 -180 -11 -36 79 -274 -75 -80 -162 57 39 -95 14 53 75 -319 29 120 -151
7322 -151 23 -135 -99 -146 133 -66 178 -289 -190 -38 57 315 5 -75 -18 -147 12 82 -278 -13 -176 -411
7344 -411 121 -95 171 107 -177 -20 -68 -78 118 126 124 105 -401 -44 131 265 -263 118 -113 -8 119 -167 -194
7367 -194 -160 17 -13 -69 -94 -244 -103 24 -230 253 169 -172 29 -39 -32 20 -148 -128 -143 -247 164 -298 127 -7
7391 -7 -81 222 88 91 141 50 19 184 122 -198 -150 -121 282 -127 94 26 94 187 -47 19 -14 -100 24 -120 -237 -98
7417 -98 -64 152 -144 24 40 -10 29 -130 -64 232 149 -91 -6 -13 -265 17 83 -23 129 0 79 282 306 36
7441 36 -46 -19 -114 -64 -140 -196 265 -310 -133 -142 180 -50 -113 -171 -190 118 282 -98 55 137 82 -129 190 210 -315
7466 -315 96 21 38 -75 -187 58 -32 -94 -130 115 83 -146 -150 200 77 196 -175 219 154 178 103 -398 17 -129
7490 -129 55 182 51 -114 87 180 124 -83 108 -88 -165 -6 -51 59 -232 -57 18 -87 62 38 65 -21 -159
7513 -159 -123 160 -78 1 -22 -5 16 -139 81 422 78 -192 -20 8 7 63 -24 -77 -140 -49 -233 -127 -20 -6 -75
7538 -75 79 84 -12 -69 -95 -80 243 -300 -116 -28 253 89 -83 -119 298 11 108 -64 -68 58 -98 144 226 -241
7562 -241 26 -46 37 56 -287 137 -308 -260 -161 101 -116 -459 -78 -148 68 -185 -104 49 -181 19 -106 -141 152
7585 152 -30 -94 156 -102 -171 -30 99 154 -259 -22 31 -181 -122 -194 -153 72 147 3 177 -32 36 -278 189
7608 189 153 14 219 -81 -42 48 110 244 120 310 53 -39 -160 -26 49 13 218 70 -286 -75 -167 179 90
7631 90 -2 160 36 -27 131 175 264 30 131 201 -139 -338 76 98 14 -90 -327 -58 144 108 21 -181 -45
7654 -45 185 -4 -134 -58 -135 -50 -32 58 -159 -56 103 51 -297 91 22 -193 -234 -147 -254 -187 55 43 -155 -49
7678 -49 -106 67 247 -325 13 93 155 49 -131 -147 -253 -100 -56 122 -26 125 226 -81 -184 -142 -275 163
7700 163 65 51 -155 -129 97 -116 -134 60 105 137 -143 -44 294 232 55 -249 -142 -206 -130 33 -123 -134 -2 -233
7724 -233 178 -129 150 42 -95 -200 67 71 -76 -6 -139 135 54 169 -43 -172 156 16 -120 -60 -149 -227
7746 -227 -91 -24 138 -271 61 -2 123 -73 -58 -110 -17 -226 -177 162 25 -1 32 -89 96 -3 -46 185 2
7769 2 -63 161 35 89 95 4 -60 -36 103 28 -224 -45 100 61 110 79 -58 33 -67 -190 -264 -209 11 159 178 -157
7795 -157 -145 -111 38 -179 -120 -86 -110 245 -104 -210 -258 25 -42 -54 -88 192 233 43 -84 -97 -269 -19 171 148
7819 148 2 -40 -11 54 -62 94 -172 -40 23 67 22 35 69 -229 295 17 139 51 241 -119 -78 -110 -84 -338
7843 -338 -25 -181 -155 89 220 -218 -98 -88 5 -154 114 229 134 -58 -164 -94 44 265 -197 -164 -31 -118
7865 -118 -72 17 -50 160 -70 109 181 -256 216 -36 274 -108 225 50 154 -171 62 -89 166 121 -113 -115
7887 -115 81 290 248 176 152 85 -182 50 -206 80 4 151 -120 -168 -32 4 97 11 -74 -98 -221 -45 34 36 -96
7912 -96 20 147 -3 -225 -114 16 12 7 -46 -28 144 -72 -76 73 -112 378 -60 100 -131 165 -160 11 58
7935 58 -186 -37 288 182 -111 3 125 -41 -218 25 -176 -160 -67 -358 -72 -197 273 -143 99 131 79 -62
7957 -62 -206 1 -115 -328 119 -15 9 219 -181 20 -13 144 -304 110 85 -37 -79 12 -59 116 -162 87
7979 87 -341 74 -101 13 7 22 112 220 -20 -288 108 261 93 42 155 -218 -78 -39 322 79 41 11 63
8002 63 -304 9 -110 -108 281 -176 119 -234 2 147 98 38 -171 -32 92 -26 88 44 -222 -231 265 57 -288
8025 -288 99 25 68 -182 68 -194 139 92 -153 72 118 112 -15 75 71 58 -100 31 -118 103 -31 57 -110 228
8049 228 -69 -274 2 61 49 197 -53 135 -326 -28 43 -90 113 -212 47 -122 69 8 89 -126 -106 -25
8071 -25 210 -108 -190 -47 71 -92 -99 -109 72 -80 139 -71 19 -271 156 91 122 41 -56 134 50 107 -255 -149
8095 -149 -153 -13 -119 -138 -218 220 -51 71 -124 -129 269 -79 -75 180 -112 72 80 119 -35 -116 19 295 119 -308
8119 -308 131 -244 95 -74 -84 68 48 35 -356 -108 86 265 -301 41 -118 252 -72 139 -8 122 40
8140 40 -262 74 -138 17 75 207 -64 -139 -57 -14 97 -48 -100 -42 -5 7 -200 -97 7 190 101 139 -144 -48
8164 -48 77 -75 207 -257 -163 130 -87 -223 400 74 -175 -165 -24 -51 -64 -174 211 135 124 147 58 115 91 108
8188 108 159 166 242
8191B42
##END NTUPLES=NMR FID
##END=
