##TITLE=1H_DE-99_oil
 200.13MHz,CDCl3,
 8 sc
 
 2.7.2025
##JCAMPDX= 6.0         $$ Bruker NMR JCAMP-DX V2.0
##DATA TYPE= NMR FID
##DATA CLASS= NTUPLES
##ORIGIN= UXNMR, Bruker Analytische Messtechnik GmbH
##OWNER= pz
$$ XWIN-NMR		Version 3.5
$$ Wed Jul  2 16:50:10 2025 Russian Standard Time (UT+4h)  she@DPX200
##.OBSERVE FREQUENCY= 200.1313
##.OBSERVE NUCLEUS= ^1H
##.DELAY= (6, 6)
##.ACQUISITION MODE= SIMULTANEOUS
##.ACQUISITION SCHEME= undefined
##.AVERAGES= 8
##.DIGITISER RES= 18
##SPECTROMETER/DATA SYSTEM= spect
##.PULSE SEQUENCE= zg30
##.SOLVENT NAME= CDCl3
##.SHIFT REFERENCE= (INTERNAL, CDCl3, 0, 14.3821)
##AUDIT TRAIL= $$ (NUMBER, WHEN, WHO, WHERE, WHAT)
$$ ##TITLE= Audit trail, XWIN-NMR		Version 3.5
$$ ##JCAMPDX= 5.01
$$ ##ORIGIN= Bruker BioSpin GmbH
$$ ##OWNER= she
$$ F:/spectra/data/she/nmr/H-C/1/audita.txt
$$ ##AUDIT TRAIL=  $$ (NUMBER, WHEN, WHO, WHERE, WHAT)
(   1,<2025-07-02 16:49:14.40 +0400>,<she>,<DPX200>,
      <created by zg, POWCHK disabled, PULCHK disabled
       configuration hash MD5:
       00 E9 B6 7A A2 85 ED C7 34 08 36 98 17 FE 4E 26
       data hash MD5: 16K
       15 AF 35 86 C2 E9 C9 C6 7A 00 DB 4B 35 93 09 48>)
$$ ##END=
$$ 
$$ hash MD5
$$ 47 7F DD CB 6B B4 E8 23 A0 4F E4 53 FA 5D 22 B7
##$RELAX= 
##$RELAX= 
##$RELAX= 
##$RELAX= 
##$RELAX= 
##$RELAX= 
$$ Bruker specific parameters
$$ --------------------------
##$DU= <F:/spectra>
##$EXPNO= 1
##$NAME= <H-C>
##$PROCNO= 1
##$TYPE= <nmr>
##$USER= <she>
##$AMP= (0..31)
100 100 100 100 100 100 100 100 100 100 100 100 100 100 100 100 100 100 
100 100 100 100 100 100 100 100 100 100 100 100 100 100 
##$AQSEQ= 0
##$AQ_mod= 1
##$AUNM= <au_zg>
##$AUTOPOS= <>
##$BF1= 200.13
##$BF2= 200.13
##$BF3= 200.13
##$BF4= 200.13
##$BF5= 200.13
##$BF6= 200.13
##$BF7= 200.13
##$BF8= 200.13
##$BYTORDA= 1
##$CFDGTYP= 0
##$CFRGTYP= 5
##$CHEMSTR= <none>
##$CNST= (0..31)
1 1 145 1 1 1 1 1 1 1 1 1 1 1 1 1 1 1 1 1 1 1 1 1 1 1 1 1 1 1 1 1 
##$CPDPRG= <>
##$CPDPRG1= <>
##$CPDPRG2= <>
##$CPDPRG3= <>
##$CPDPRG4= <mlev>
##$CPDPRG5= <mlev>
##$CPDPRG6= <mlev>
##$CPDPRG7= <mlev>
##$CPDPRG8= <mlev>
##$CPDPRGB= <>
##$CPDPRGT= <>
##$D= (0..31)
0 0.7 0 0 0 0 0 0 0 0 0 0.03 0 0 0 0 0 0 0 0 0 0 0 0 0 0 0 0 0 0 0 0 
##$DATE= 1751460553
##$DBL= (0..7)
120 120 120 120 120 120 120 120 
##$DBP= (0..7)
150 150 150 150 150 150 150 150 
##$DBP07= 0
##$DBPNAM0= <>
##$DBPNAM1= <>
##$DBPNAM2= <>
##$DBPNAM3= <>
##$DBPNAM4= <>
##$DBPNAM5= <>
##$DBPNAM6= <>
##$DBPNAM7= <>
##$DBPOAL= (0..7)
0.5 0.5 0.5 0.5 0.5 0.5 0.5 0.5 
##$DBPOFFS= (0..7)
0 0 0 0 0 0 0 0 
##$DE= 6
##$DECBNUC= <off>
##$DECIM= 32
##$DECNUC= <off>
##$DECSTAT= 4
##$DIGMOD= 1
##$DIGTYP= 9
##$DL= (0..7)
0 120 120 120 120 120 120 120 
##$DP= (0..7)
150 150 150 150 150 150 150 150 
##$DP07= 0
##$DPNAME0= <>
##$DPNAME1= <>
##$DPNAME2= <>
##$DPNAME3= <>
##$DPNAME4= <>
##$DPNAME5= <>
##$DPNAME6= <>
##$DPNAME7= <>
##$DPOAL= (0..7)
0.5 0.5 0.5 0.5 0.5 0.5 0.5 0.5 
##$DPOFFS= (0..7)
0 0 0 0 0 0 0 0 
##$DQDMODE= 0
##$DR= 18
##$DS= 0
##$DSLIST= <SSSSSSSSSSSSSSS>
$$ [...]
##$SUBNAM0= <"">
##$SUBNAM1= <"">
##$SUBNAM2= <"">
##$SUBNAM3= <"">
##$SUBNAM4= <"">
##$SUBNAM5= <"">
##$SUBNAM6= <"">
##$SUBNAM7= <"">
##$SUBNAM8= <"">
##$SUBNAM9= <"">
##$SW= 18.0517328524113
##$SWIBOX= (0..15)
0 0 2 0 0 0 0 0 0 0 0 0 0 0 0 0 
##$SW_h= 3612.71676300578
##$TD= 16384
##$TD0= 1
##$TE= 0
##$TE2= 300
##$TE3= 300
##$TEG= 300
##$TL= (0..7)
0 120 120 120 120 120 120 120 
##$TP= (0..7)
150 150 150 150 150 150 150 150 
##$TP07= 0
##$TPNAME0= <>
##$TPNAME1= <>
##$TPNAME2= <>
##$TPNAME3= <>
##$TPNAME4= <>
##$TPNAME5= <>
##$TPNAME6= <>
##$TPNAME7= <>
##$TPOAL= (0..7)
0.5 0.5 0.5 0.5 0.5 0.5 0.5 0.5 
##$TPOFFS= (0..7)
0 0 0 0 0 0 0 0 
##$TUNHIN= 0
##$TUNHOUT= 0
##$TUNXOUT= 0
##$USERA1= <user>
##$USERA2= <user>
##$USERA3= <user>
##$USERA4= <user>
##$USERA5= <user>
##$V9= 5
##$VALIST= <valist>
##$VCLIST= <CCCCCCCCCCCCCCC>
##$VD= 0
##$VDLIST= <DDDDDDDDDDDDDDD>
##$VPLIST= <PPPPPPPPPPPPPPP>
##$VTLIST= <TTTTTTTTTTTTTTT>
##$WBST= 1024
##$WBSW= 4
##$XGAIN= (0..3)
0 0 0 0 
##$XL= 0
##$YL= 0
##$YMAX_a= 118743
##$YMIN_a= -148066
##$ZGOPTNS= <>
##$ZL1= 120
##$ZL2= 120
##$ZL3= 120
##$ZL4= 120
##$ABSF1= 10
##$ABSF2= 0
##$ABSG= 5
##$ABSL= 3
##$ALPHA= 0
##$AQORDER= 0
##$ASSFAC= 0
##$ASSFACI= 0
##$ASSFACX= 0
##$ASSWID= 0
##$AUNMP= <proc_1d>
##$AZFE= 0.1
##$AZFW= 0.1
##$BCFW= 1
##$BC_mod= 2
##$BYTORDP= 1
##$COROFFS= 0
##$CY= -3
##$DATMOD= 1
##$DC= 2
##$DFILT= <>
##$DTYPP= 0
##$F1P= 0
##$F2P= 0
##$FCOR= 0.5
##$FTSIZE= 0
##$FT_mod= 4
##$GAMMA= 1
##$GB= 0.15
##$INTBC= 1
##$INTSCL= 1
##$ISEN= 128
##$LB= 0.25
##$LEV0= 0
##$LPBIN= 0
##$MAXI= 10000
##$MC2= 0
##$MEAN= 0
##$ME_mod= 0
##$MI= 1.114404
##$NCOEF= 0
##$NC_proc= 0
##$NLEV= 6
##$NOISF1= 3.799351
##$NOISF2= 2.8
##$NSP= 1
##$NTH_PI= 0
##$NZP= 0
##$OFFSET= 14.38212
##$PC= 1
##$PHC0= -1200.616
##$PHC1= 12.19219
##$PH_mod= 1
##$PKNL= yes
##$PPARMOD= 0
##$PSCAL= 0
##$PSIGN= 0
##$REVERSE= no
##$SF= 200.129724274929
##$SI= 16384
##$SIGF1= 3
##$SIGF2= 2
##$SINO= 400
##$SIOLD= 16384
##$SREGLST= <1H.CDCl3>
##$SSB= 0
##$STSI= 0
##$STSR= 0
##$SW_p= 3205.1282051282
##$SYMM= 0
##$S_DEV= 0
##$TDeff= 0
##$TDoff= 0
##$TI= <>
##$TILT= no
##$TM1= 0
##$TM2= 0
##$TOPLEV= 0
##$USERP1= <user>
##$USERP2= <user>
##$USERP3= <user>
##$USERP4= <user>
##$USERP5= <user>
##$WDW= 1
##$XDIM= 8192
##$YMAX_p= 0
##$YMIN_p= 0
$$ End of Bruker specific parameters
$$ ---------------------------------
##NTUPLES= NMR FID
##VAR_NAME=  TIME,          FID/REAL,        FID/IMAG
##SYMBOL=    X,             R,               I
##VAR_TYPE=  INDEPENDENT,   DEPENDENT,       DEPENDENT
##VAR_FORM=  AFFN,          ASDF,            ASDF
##VAR_DIM=   8192,          8192,            8192
##UNITS=     SECONDS,       ARBITRARY UNITS, ARBITRARY UNITS
##FACTOR=    0.0002768,     1,               1
##FIRST=     0,             0,               0
##LAST=      2.2672688,     0,               0
##MIN=       0,             -148066,         0
##MAX=       2.2672688,     118743,          0
$$ Real data points
##PAGE= N=1
##DATA TABLE= (X++(R..R)), XYDATA
0 0 0 0 0 0 0 0 0 0 0 0 0 0 0 0 0 -8 8 -8 8 -8 8 -16 16 -16 24 -24 28 -32 39 -42 48 -56 64 -72 80 -90 100
37 100 -114 126 -140 156 -173 192 -213 237 -262 286 -317 348 -385 423 -468 514 -568 627 -695 773
57 773 -862 969 -1093 1243 -1431 1671 -1988 2430 -3092 4191 -6339 12111 -63160 -148066 22847
72 22847 118743 51408 -21980 30671 90229 68163 22415 52445 82573 30105 -65864 -92702
84 -92702 -50653 -38581 -82924 -78059 -29191 -20829 -31245 9598 69665 76586 30090 19780 62402
97 62402 71866 27102 -8386 -11968 -7648 -20220 -40826 -36014 -12435 -13578 -40697 -50112 -19567
110 -19567 4857 -8492 -11692 15495 30507 31483 40015 45438 39120 28133 18871 14467 7245 -15711
124 -15711 -45386 -55319 -42338 -39763 -48880 -29012 5324 10464 2563 16673 43658 50051 32166
137 32166 24967 29919 19063 -3399 -13606 -12425 -13798 -22719 -25966 -16872 -16241 -26801 -27446 -9666
151 -9666 5874 100 -3575 19022 32592 18170 15653 33484 37137 20287 5999 3087 -4000
164 -4000 -24420 -38651 -38930 -33412 -27344 -25398 -17555 2748 12147 13097 27488 41889 37895 24672
178 24672 16286 14408 3534 -13888 -16496 -13015 -19431 -24773 -23349 -17000 -7901 -7524 -6769 3520 11596
193 11596 11609 7841 9043 18416 17747 7936 13788 19503 7211 -4669 -7370 -8720 -14539 -23038 -23814
208 -23814 -19064 -17834 -15688 -9608 1306 15820 18484 16455 26550 31106 19758 9921 7952 5049
222 5049 -6859 -19180 -18337 -16413 -22885 -24200 -16324 -7159 -263 25 3226 13663 16885 12523 12509
237 12509 17812 19712 9142 850 5176 3105 -10855 -15083 -11902 -14090 -18872 -20219 -12978 -6513
251 -6513 -5480 -1188 8131 15928 19938 16860 15905 21007 15434 3171 60 -618 -7725 -17832 -19803
266 -19803 -14086 -13000 -15857 -9859 -2247 1096 3922 5066 9321 14477 11504 7500 10291 12325 7653
281 7653 -11 -1154 2461 -4112 -13208 -10112 -7957 -13261 -15992 -12429 -5362 -1736 -1524 4240 12136
296 12136 15136 15458 13819 15058 15621 5838 -3325 -3203 -6257 -14545 -18887 -15588 -10572 -11478 -10629 -1265
312 -1265 5299 5834 8339 10810 13305 13167 7142 4320 6031 2990 -3824 -6625 -4253 -3462 -9878 -11257
328 -11257 -3779 -3144 -7674 -5334 -144 2496 1986 2211 7255 10178 7728 6325 6082 6835 4111 -3199
344 -3199 -4744 -2360 -6522 -12183 -10000 -5747 -4808 -6466 -2779 4593 5300 3972 6659 9334 8857 6550
360 6550 2983 2835 2876 -2835 -6435 -5248 -3906 -5745 -9638 -6431 -972 -3133 -4231 1748 5414 4866
376 4866 4785 6888 9129 7214 3061 2416 1722 -1210 -4674 -8306 -6794 -4870 -8868 -8493 -2043 502
392 502 132 1465 5943 9102 6392 4813 7309 5277 1541 -976 -2848 -2486 -3296 -7294 -6325 -3157
408 -3157 -3198 -4125 -3338 1102 2730 -727 801 6067 4983 2721 3882 5089 4749 1899 86 794 -732
425 -732 -4253 -6000 -6840 -5288 -5305 -7642 -4474 623 617 1237 5065 8603 8563 5762 6255 7263 2935 -892
443 -892 -2034 -3841 -5419 -7687 -8684 -6529 -4373 -5053 -3516 311 4136 4286 3081 6610 8581 4414
459 4414 2809 4491 3323 190 -2722 -3230 -2494 -4937 -6396 -5091 -4055 -3550 -3160 -2960 1405 3862
475 3862 1617 3207 6383 5994 4047 2816 4020 3135 -975 -2375 -1363 -3113 -5014 -5484 -5159 -2624
491 -2624 -2543 -3397 -943 1496 2104 1610 2768 6081 5671 2488 3416 4990 2074 -811 -1203 -1860 -3218
508 -3218 -5805 -6244 -4111 -4050 -3876 -2289 -134 3410 3766 2644 5849 7102 4204 2584 2731 1906 -885
525 -885 -4531 -3564 -3358 -5270 -4917 -3089 -1594 -9 254 457 3235 3450 2035 1546 2428 3021 896 -807
543 -807 1238 1221 -1993 -1607 -342 -729 -2159 -2979 -1755 -1131 -1904 -1761 -339 703 2049 1533 1667 4792
561 4792 4044 986 1438 1913 -115 -2634 -3251 -1924 -2732 -4649 -2931 -958 -662 202 506 2026 4088
578 4088 2662 1703 2702 2769 1098 -824 -1257 91 -1837 -4383 -2409 -1032 -2243 -2159 -1185 740 1117
595 1117 144 1841 3110 2604 2144 1325 1720 2305 -736 -2826 -1185 -1817 -3869 -3616 -1962 -765 -1436
612 -1436 -1412 1614 2650 1337 1971 2379 2436 2460 242 -165 1432 -325 -1937 -1855 -617 -470 -2388 -2490
630 -2490 -58 -829 -2376 -1223 220 834 502 468 3059 3676 2205 2468 2533 2116 1175 -1960 -2422 -1145
648 -1145 -3547 -5245 -3581 -2044 -1955 -2105 -236 2858 2924 2303 3765 4209 3482 1838 157 480 -127 -2452
666 -2452 -3561 -2175 -1706 -2556 -3291 -1219 515 -840 -1047 1231 2316 1459 1360 2106 3131 1867 290
683 290 881 1042 -272 -1193 -1926 -1256 -902 -3327 -3249 -841 -550 -1391 -851 1181 2266 591 892 2948
701 2948 2833 1311 1040 1108 1533 463 -1809 -992 -529 -2439 -3221 -2678 -1175 -850 -2138 -695 1944 1765
719 1765 1661 2248 3151 2855 1714 375 1498 319 -1509 -2483 -2176 -1692 -2308 -3438 -1045 1058 -160
736 -160 -289 1746 2877 1808 37 1135 2241 -303 -1206 -438 12 -173 -1173 -1532 265 440 -1142
753 -1142 -796 315 786 -830 -1510 453 1336 -781 -676 1301 1289 605 -9 839 1706 -64 -1315 -560
771 -560 -198 -644 -1594 -1724 282 417 -901 38 1703 1485 327 108 1927 1715 -762 -781 474 -487
789 -487 -1418 -1905 -1497 18 -522 -1508 475 1858 1076 38 965 2724 1391 -647 358 1256 -337
806 -337 -1984 -1902 -1206 -873 -2200 -2075 734 983 544 650 1476 2520 971 -364 1076 1527 -780 -1454
824 -1454 -398 484 -837 -2238 -795 809 -556 -1306 -93 299 505 -1038 -1276 1157 1131 -378 73
841 73 1683 2551 534 -308 1748 1423 -1248 -1739 -921 -1160 -2020 -2885 -1386 116 -572 -894 1087 1851
859 1851 2646 1107 1448 3025 2312 -539 -494 303 -878 -2448 -2879 -908 -557 -2314 -1528 288 255 256 -117
878 -117 1124 2454 1295 230 1452 1921 901 -646 -700 937 -487 -2465 -766 137 -553 -1590 -1110
895 -1110 245 744 -733 -462 1130 1317 382 -200 1049 2307 232 -840 984 1369 -186 -1192 -477
912 -477 154 -1343 -2727 -1097 -489 -1020 -1244 -566 1251 1799 565 1305 2857 2047 580 219 601 491
930 491 -1899 -2688 -1113 -852 -2025 -1534 -145 721 709 38 1120 2443 951 -85 258 639 413 -1683
948 -1683 -1419 803 -164 -1265 -424 442 565 -452 -769 508 446 -1072 -744 -95 342 -124 -1010 347
966 347 1565 127 -423 766 1466 655 -1137 -847 885 -267 -1761 -664 19 116 -677 -472 1053 1279
984 1279 -96 44 892 1179 136 -1121 -184 576 -1173 -1633 -161 266 -408 -944 -346 1627 617 -279
1002 -279 693 1313 926 -437 -653 798 263 -1806 -1580 -350 -289 -1080 -1111 440 1673 321 -157 1639
1020 1639 1748 413 -213 173 594 -206 -1537 -644 -66 -831 -860 -802 672 662 -967 -94 1479 488 -410
1039 -410 -280 790 801 -202 -418 1026 789 -132 -115 92 911 -410 -1587 -696 57 -1202 -1494 -1138 251
1058 251 386 -763 580 1988 1434 630 1298 1585 1188 -243 -1015 -17 -658 -1709 -1946 -1330 -680 -1115
1076 -1115 -1311 385 1345 593 366 1470 1719 1153 324 262 1163 -129 -1145 -740 -798 -588 -1328 -1695 -92
1095 -92 73 -887 -116 893 920 79 -224 715 1114 -422 -129 846 669 664 -396 -159 842 -302 -922 -461
1115 -461 -303 -386 -1382 -1488 82 33 -948 217 1686 1116 862 986 1583 1558 42 -342 -148 -585 -1134 -1925
1135 -1925 -1101 -124 -911 -1319 261 630 438 114 807 1589 1292 240 356 851 -165 -418 -721 -46 9
1154 9 -867 -617 465 369 -230 -286 97 828 150 -844 438 721 33 -286 228 472 -114 -339 247 646 141
1175 141 -387 213 -95 363 -582 -833 -28 68 -830 -262 285 736 222 -294 534 760 26 222 57 33 -115
1196 -115 -969 -597 102 -412 -816 248 715 847 205 148 1216 543 -64 -111 -250 -446 -1080 -1159 -379 -238
1216 -238 -815 84 407 722 1119 594 972 1387 153 -77 -234 -464 -822 -981 -1030 -169 -179 -946 222 447
1236 447 330 339 170 432 772 -129 43 557 302 -186 -382 122 323 -377 -547 -25 34 -458 -882 -319 -247
1257 -247 -212 -652 155 384 370 463 526 1136 983 225 318 626 339 -320 -540 -564 -423 -1156 -1246 -439 -533 -547 1
1280 1 475 1077 856 734 1084 1151 581 84 139 91 -312 -1097 -988 -351 -1132 -1050 -654 -366 398 326 330 903 656
1303 656 426 590 282 556 296 -418 4 279 -158 -268 218 -140 -59 -757 -622 25 -665 -596 -106 -131 -196
1324 -196 79 201 657 813 545 830 784 247 260 -501 -343 -481 -1140 -1023 -406 -260 -419 -57 -62 642 529
1345 529 606 913 590 733 576 216 170 -136 -687 -444 -438 -687 -546 -207 255 141 -250 197 625 33 326
1366 326 193 -37 359 81 -163 111 42 -358 -255 3 338 44 -196 156 342 -225 -174 -219 -216 -164 -375 -29
1388 -29 203 -123 196 422 234 499 340 48 121 50 -311 -348 -337 -361 -282 -494 85 403 30 380 608 247
1410 247 217 -105 -381 -292 -528 -699 -311 -328 87 -103 290 539 828 422 510 733 255 103 -281 -315 -569 -811
1432 -811 -884 -468 -182 -291 -192 300 765 269 226 1083 471 275 189 109 434 -208 -337 -188 36 -369 -412 -168
1454 -168 -383 -211 -236 -200 489 57 -152 411 159 246 202 35 463 86 -154 60 -45 1 -219 -246 -377 -244
1476 -244 -540 -417 -247 -510 -443 -223 39 543 514 427 1131 790 788 430 316 168 -475 -1064 -488 -784 -945 -745
1498 -745 -388 -159 -22 241 345 789 832 607 561 267 496 65 -711 -173 -113 -563 -235 -145 -108 -69 -287 -184
1520 -184 113 -453 68 4 265 337 -60 -2 425 128 196 326 357 438 -42 -33 -119 -97 -700 -835 -397 -347 -30 -244
1544 -244 33 665 21 387 379 556 914 51 -211 573 -74 -299 -403 -260 -280 -597 -560 -91 71 -69 500
1565 500 286 479 302 -153 343 478 -188 -198 -111 -236 -117 -616 31 -34 -90 169 368 390 179 -153 -260 28
1587 28 -199 -417 -408 -280 -128 -105 -481 285 803 23 301 314 216 259 -115 -196 -98 -162 -515 63 -104 52 -200
1610 -200 16 371 288 -119 -274 200 -178 -82 -568 -4 26 -528 -56 693 245 315 414 99 416 252 -141 -211
1632 -211 -23 -470 -622 -724 -498 -168 -370 -233 810 427 613 656 699 519 431 78 466 -357 -246 -41 -501
1653 -501 -164 -597 -506 -208 140 162 269 340 427 319 82 101 296 42 -358 182 215 56 -341 -23 59 -60
1675 -60 -580 -477 -185 89 -371 -384 -19 15 -319 -37 183 397 560 175 740 786 276 -303 179 -189 -88
1696 -88 -842 -759 -291 -231 -326 25 268 245 288 354 735 870 226 314 286 -311 -102 -484 -242 -3 -375 -578 -44
1719 -44 -27 120 -254 -137 308 324 -32 96 295 -138 -238 37 631 116 -236 -106 258 177 -86 59 -177
1740 -177 -141 -530 -450 -226 -26 -277 -39 330 302 36 73 389 438 544 166 222 178 4 -294 -383 -106 -274 -434
1763 -434 -265 -236 262 -135 112 639 398 -103 145 382 235 -93 -665 -388 -114 -474 1 -3 187 580 -32
1784 -32 107 627 219 32 -40 -63 91 -466 -484 144 12 -69 -51 100 267 130 364 339 461 -132 -147 -299 -163
1807 -163 -2 -215 -339 26 1 -269 -41 159 264 149 -2 120 177 -334 -216 159 455 109 -141 220 692
1828 692 42 -471 -34 409 -161 -420 -157 -52 -158 -639 -19 189 20 -186 -170 477 749 95 204 605
1848 605 321 -256 -192 -68 -353 -379 -594 -108 -293 -516 -286 105 271 380 281 506 573 -73 -5 -79 -19 79 -368
1871 -368 -425 -145 -65 -170 -310 24 246 -333 -147 250 126 -351 -208 -83 191 69 -36 25 133 -21 176
1892 176 193 540 117 -382 -80 12 -406 -514 -597 -207 -186 32 -265 398 436 -7 545 438 631 6 -143 372
1914 372 57 -269 -317 -232 -150 -185 -351 -226 68 265 -245 157 143 102 133 -145 286 147 14 140 186 -77 -258
1937 -258 10 131 233 -105 -175 169 299 -126 -340 -538 123 -294 -406 256 103 231 410 382 535 509 -25
1958 -25 -164 335 -150 -285 -257 -187 96 -261 -298 -24 161 -43 195 80 545 172 -23 141 -48 -63 -272 -8
1980 -8 -27 159 -31 6 209 23 91 -93 62 176 -121 -527 -35 -195 -270 -296 168 280 64 19 307 575 122
2003 122 79 257 240 -72 -321 -56 -20 -311 -198 -140 -94 217 76 -101 546 393 57 374 407 97 2 -322
2025 -322 90 133 68 -23 85 79 216 -69 -137 84 -256 21 29 22 71 -290 -122 214 -7 21 190 390 431 134
2049 134 -115 618 91 -310 -281 -76 -325 -191 -310 -456 194 -7 -54 111 559 514 235 365 590 95 -111
2070 -111 56 -214 -124 -398 -457 -78 -79 -262 -348 -22 38 -83 -81 -91 296 -38 -140 -20 32 -155 84 -113 -113 -74
2094 -74 121 -21 244 66 -152 -298 -364 -39 -262 -316 235 7 -69 -155 -74 216 237 200 363 329 107 187 -129
2117 -129 -270 110 -373 -225 57 -297 228 84 220 -49 -261 49 258 -178 75 105 161 -37 19 68 -159
2138 -159 158 -268 68 -180 -36 267 -143 -67 48 49 201 -233 -62 -220 -205 -217 248 351 82 350 41 274
2160 274 221 -153 111 23 -197 -321 -276 -22 -183 -97 51 -68 -84 385 377 174 311 108 137 18 408 -341 95
2183 95 57 -385 7 93 75 -48 213 178 139 256 -186 -212 -158 -71 -70 -115 -72 -277 70 401 42 109 179 166 -43
2208 -43 6 3 1 -303 -232 -125 -221 -147 -66 -267 262 -40 74 350 160 179 78 4 -23 249 -161 -114 -135 -147 -78 8
2234 8 -131 288 -94 -41 163 -340 -318 -91 -176 205 152 131 122 -49 48 -75 -42 -155 312 -22 61 -87 -186 -80
2258 -80 -176 -342 233 -147 -317 -174 62 150 218 309 286 151 215 152 -132 -374 -255 -166 -191 -150 -372 -242 -50 -114
2282 -114 144 6 62 287 184 9 123 -156 3 133 -243 -220 202 -203 -231 16 23 81 -42 -51 -268 -27 -227
2305 -227 -116 -164 68 96 -40 -156 45 428 303 97 199 133 106 47 -104 -224 -186 -185 -152 -124 151 -249 -170 86
2329 86 -85 71 467 28 216 287 78 65 -176 12 -151 57 26 -167 -368 107 -72 153 -16 289 64
2350 64 67 0 129 160 -88 -179 50 65 132 143 -59 72 -205 218 -32 -256 -87 -291 -360 -253 -298 -316 -129 83
2374 83 -229 -21 -45 325 -45 71 82 16 -148 -34 16 -236 -52 -298 -135 -25 -12 -200 -38 270 -9 -35
2396 -35 -65 -52 162 -286 57 -115 -162 77 148 150 89 -98 -9 286 -119 -77 -196 -77 -83 -354 -286 69 -280 -182 242
2421 242 87 229 66 100 228 142 55 -164 -32 -71 149 18 147 -110 -51 -245 -166 103 183 -95 -99 81 -141
2444 -141 83 49 -335 52 217 -222 183 209 -142 34 122 168 146 -218 22 134 -106 -380 4 -249 21 140
2466 140 -22 62 -127 274 12 225 142 -78 5 133 104 -442 -172 140 30 -137 -180 225 -99 -39 212 -173
2488 -173 220 17 159 -30 75 -335 -197 -134 218 39 208 -118 -116 153 -127 29 130 -168 53 -93 -128
2509 -128 9 183 116 119 32 165 -106 -3 238 -16 46 186 -69 129 -101 -139 131 -91 -342 -235 43 -61
2531 -61 181 169 13 142 134 -52 181 150 -32 -68 -123 37 14 -163 -74 295 101 -133 108 21 33 30 107 109 58 -308
2557 -308 40 1 201 151 -284 164 226 202 181 135 140 -256 -199 -128 -131 -188 -13 -240 121 -32 -164 -15 206 -13
2581 -13 -66 154 -78 81 -68 -187 13 -354 -355 -275 -208 138 -20 -350 -39 247 -4 -103 80 -78 136 106 -68
2604 -68 441 -233 -98 -185 16 47 -57 127 156 280 -36 -7 -228 99 33 -147 61 -43 208 -102 126 -24
2626 -24 -82 121 31 148 31 -102 -163 27 114 -107 -181 -114 -60 82 -246 235 -170 59 -318 -202 372 -106 -94
2649 -94 117 17 -177 -88 21 263 -112 -164 -68 37 45 -35 -36 -168 145 -367 -396 176 122 -62 92 204 143 290
2673 290 -73 271 71 70 60 -52 50 105 -333 -313 -126 -173 -76 -177 68 26 174 67 228 286 -69 -6 154
2696 154 22 -223 -219 -262 -132 -108 -94 67 -28 28 -66 102 -28 -2 -309 161 -87 31 -135 -254 69 -83 -207
2719 -207 79 92 -19 -34 -93 18 44 -55 -33 -156 -186 -110 -331 -83 239 -195 161 177 117 66 153 56 11 -45 -79
2744 -79 152 -231 -191 -69 -36 198 200 -269 0 28 -87 -248 -39 151 164 34 -287 -63 50 14 -95 45 -63
2767 -63 229 -145 9 -30 24 81 -159 -193 -94 -72 -260 211 51 -148 173 174 -37 260 51 -31 233 -333 -165
2790 -165 -406 -11 -68 -424 -43 1 3 29 119 283 339 118 -67 121 189 -31 10 -172 -35 -237 166 189 147 40
2814 40 -143 46 86 -33 32 -16 79 224 36 -89 117 -40 -148 -80 231 33 -127 121 -50 -85 -145 -99 189
2837 189 -118 -62 -227 -160 -242 42 72 275 230 -229 328 165 70 141 38 81 -167 25 -282 -51 102 -21 -44
2860 -44 114 107 -11 0 -141 -166 49 173 -153 -347 -224 -364 -53 247 193 28 233 187 97 141 -23 -97 38
2883 38 88 7 -155 -173 -194 -99 -74 141 15 273 8 -77 282 277 -119 157 -81 -132 -277 -83 -270 85 89 -111
2907 -111 -34 -132 -121 0 -24 91 -101 302 -59 53 43 -21 -77 266 215 49 125 27 -12 14 29 37 -261 -101 -11
2932 -11 -56 172 43 164 84 79 45 -64 25 12 72 -304 -138 69 -200 -238 -86 -203 -386 63 124 266 99 -114
2956 -114 -76 193 -73 -94 -253 -95 87 -172 -26 295 184 3 61 -42 -4 97 -211 -202 131 -93 -57 245
2978 245 -37 229 -175 95 -8 24 -99 162 -76 71 58 -109 -23 -20 -131 -136 -19 -60 105 -46 -5 -75 20 8
3002 8 233 136 165 95 179 112 -152 162 -78 51 175 -217 154 -158 19 -116 199 148 -58 -61 -291 34 101 -99
3026 -99 91 -244 197 216 -157 14 30 213 -76 -72 -25 -125 -170 -107 -48 -134 -150 -71 -42 67 47 371 147 156 -114
3051 -114 -112 141 -97 70 17 -167 -120 -94 -59 -42 11 41 8 -103 69 -117 48 210 224 -135 108 -185 -145 20
3075 20 -124 74 114 -187 -267 111 -15 -9 5 133 10 40 -344 94 28 -155 280 -90 -114 360 13 151 77
3098 77 4 254 339 42 95 97 -255 77 47 136 -54 -103 220 150 24 -151 -57 13 -19 -95 -25 154 -86 100 -12
3123 -12 -259 121 -36 -223 32 -97 40 -336 -141 -442 86 -86 -175 -60 -340 40 -70 -46 -94 322 184
3144 184 112 135 1 88 -73 79 -222 -320 -121 58 -103 85 -113 -84 354 190 191 299 186 -31 63 -67 15
3167 15 -38 -48 147 -87 -170 153 -116 -105 86 -23 123 -24 -29 62 52 163 24 -106 124 222 -49 159 145 72
3191 72 -133 -59 43 -77 -94 -76 134 -128 -59 169 51 138 130 109 -59 126 200 104 -2 130 3 -311 -28 170
3215 170 -53 17 -159 -164 -69 -39 69 -43 -51 -125 -65 98 118 268 -207 179 -126 -1 76 62 181 120 306 72
3239 72 -169 0 -223 12 -118 -73 150 105 -50 109 -115 248 223 92 226 22 194 2 90 -115 -200 -32
3261 -32 -89 -326 176 210 15 111 153 -173 -40 222 -385 250 -110 -60 -25 -41 -100 66 -81 -238 -129 37 -72
3284 -72 310 182 -74 -83 -112 -192 -35 -193 -118 0 0 154 263 209 298 400 -1 147 -76 -202 -30 -288 -22
3307 -22 -61 -195 -115 200 -58 20 176 -127 125 56 118 -7 146 55 198 -233 -41 81 -157 52 -145 -136 -189
3330 -189 31 -2 60 -12 -50 -23 -123 172 -108 -145 101 -171 306 69 69 118 73 71 311 173 253 141 -95 -56 -124
3355 -124 -166 -82 -173 -179 -39 -6 257 331 -89 48 154 46 19 28 99 -254 -137 -146 -421 68 -30 -78 244 -233 271
3380 271 -220 308 -66 207 74 -37 79 -52 -29 -13 227 -117 -16 140 165 -119 -22 -118 -94 111 -299 -231
3402 -231 -63 -166 -159 124 28 -132 47 -8 -47 102 25 -177 52 110 41 -200 -202 -66 19 -126 119 -29 -254 -48
3426 -48 218 99 -38 229 -77 -18 230 -109 -35 -28 -124 156 -18 -24 28 159 -254 -72 -70 40 -228 -372 -83 67
3450 67 18 40 -57 176 -24 -17 152 196 -69 -72 88 -70 -146 -42 -227 -39 28 -62 35 72 106 329 113 -27 267
3475 267 -31 181 51 -102 110 76 -72 -229 -82 112 87 -172 98 137 4 138 -160 -160 99 189 -58 248
3497 248 -95 290 34 91 221 -10 -247 -31 -300 -69 158 -38 13 -26 42 -241 -45 -116 51 370 173 174
3519 174 49 -225 198 90 22 -175 115 -6 -5 -160 -39 -77 307 126 172 -288 -223 -167 -80 85 -84 -33 156
3542 156 -4 1 39 -233 103 -99 247 63 88 -247 -151 48 -353 -223 178 -5 -117 -136 65 281 -51 -109
3564 -109 -54 -66 323 -10 179 210 -175 33 -171 -147 59 -175 270 -12 32 107 91 317 49 -5 -18 228 41
3587 41 -99 -97 58 -62 116 -138 392 343 -60 51 -55 -38 388 -37 70 411 44 242 238 -154 66 7 45
3610 45 -83 -82 -226 167 261 135 200 -32 -180 -129 73 -18 -57 -95 3 -247 182 -41 339 -44 170 -209 -82
3633 -82 -64 155 73 81 266 119 65 99 105 232 14 106 -113 -175 -161 -90 8 -190 -22 278 -10 130 77 158 -74
3658 -74 56 274 -4 -77 -140 -66 102 164 -52 -229 -114 -198 -28 60 260 49 -53 122 -58 -59 110 -86 -221
3681 -221 42 3 118 -152 118 144 -70 -143 276 -236 -146 32 67 -3 199 -116 -187 -128 -88 114 110 160 260 -42
3705 -42 -99 57 68 40 60 -54 -63 338 87 -62 77 -134 -6 402 94 22 -98 179 -330 110 63 -104 -226
3728 -226 266 162 -58 -2 -21 -189 -6 197 -38 -124 193 134 -64 77 -75 91 -28 77 -106 -117 159 -114
3750 -114 184 72 248 51 8 -189 275 -137 -140 87 -194 -82 -68 18 -134 315 -94 136 149 -90 182 254
3772 254 16 -282 83 -8 248 28 148 206 -71 -81 173 67 -89 53 -74 -136 -282 -112 168 -98 52
3793 52 228 -126 253 27 157 298 116 -155 -50 105 -509 -101 -272 1 -35 -128 -116 196 24 -29 -212 -100
3815 -100 187 -56 167 -81 97 -22 3 -74 -297 70 79 -63 -204 -23 -46 -88 377 -14 -353 324 41 86
3837 86 58 48 -122 -4 -95 236 -103 -68 -186 -12 -42 56 286 -69 -90 -196 -103 124 109 169 104 168 160 -14 122
3862 122 -75 173 1 -41 -109 7 126 -96 208 -306 -204 53 269 -92 -106 -196 -235 -117 115 -16 59 195
3884 195 -223 -226 103 180 -15 -174 190 -156 -42 -11 -350 242 1 122 -16 69 -68 -52 6 7 335 -139 107
3907 107 142 -65 -212 249 82 -134 -84 10 4 -31 -32 67 -202 -144 157 49 -147 147 136 121 -126 2 -137 101
3931 101 -134 -170 -128 -183 -222 52 86 144 -50 -67 300 -72 6 -125 -219 205 -213 194 -84 55 188 -89 -160
3954 -160 -15 4 -272 -83 149 -189 101 -109 -84 -26 -10 -114 135 122 296 -63 -32 122 -318 -109 244 -59
3976 -59 247 -105 -50 26 30 -70 14 -34 -86 148 143 -5 -117 -107 -77 -37 -214 37 142 314 138 155 133 70 64 -51
4002 -51 -52 -25 -387 -33 82 -62 159 -166 -149 -118 -145 161 284 365 189 -11 145 -213 156 29 74 -79 -101
4025 -101 269 -26 111 271 -201 76 121 -157 151 98 149 115 -187 77 -14 65 92 219 -123 -13 349 155
4047 155 -23 -83 -38 -252 100 -208 -226 119 -131 -31 -89 93 -26 -57 8 -24 7 -53 238 59 89 -149 144
4070 144 -105 -186 -2 -111 -197 60 82 127 122 125 -95 -53 81 207 -66 255 -58 -249 -109 68 -198 194 85
4093 85 137 -37 200 -91 129 69 -59 -78 58 134 66 103 -122 -220 163 -64 120 92 386 4 -106 -115 88 -126
4117 -126 84 132 6 -91 -68 47 73 -39 29 76 79 -81 63 92 -261 35 -188 7 -75 298 -187 408 416 17
4141 17 162 44 -143 -149 134 -315 -174 106 12 3 20 -342 140 38 -358 98 -278 140 -147 -87 45 130 -39
4164 -39 40 -256 174 -56 100 59 205 -48 -2 -7 201 75 -28 78 -108 -159 18 -299 73 -109 -81 -93 -46
4187 -46 212 -48 88 -38 -25 87 17 -172 -95 -86 164 1 104 48 -265 -42 59 -2 -107 119 -38 -114 33
4210 33 -186 173 205 -26 264 -62 -17 -219 172 -6 52 -35 57 -77 19 -159 -166 -242 -121 63 -255 -12 -254
4233 -254 43 121 51 26 90 79 -90 167 -122 -171 -94 -229 82 -16 -30 -31 -225 -14 96 119 246 83 -225 -109
4257 -109 -30 -99 2 199 142 -104 24 -94 -52 146 -283 -288 -102 -12 -26 -22 -40 -185 216 97 35 210 204 114 -143
4282 -143 236 156 -43 -36 307 35 -15 198 -85 -66 -134 -76 -167 13 -44 30 163 357 -35 143 -227 -72 64
4305 64 -318 106 -79 7 186 -209 74 -49 -147 -125 -47 -73 -163 -28 21 171 -67 12 -55 236 -130 -69 -138 -5
4329 -5 83 47 19 -1 -57 -113 150 -150 -201 32 -223 -69 -163 307 -80 -8 220 40 -52 -192 5 -97 -12 -92 -18
4354 -18 -200 -84 -11 34 141 147 -236 85 151 3 -265 -63 -20 -49 41 -296 48 326 -138 -30 269 -235 -197
4377 -197 238 -213 -85 29 144 102 14 9 -162 21 -212 -160 214 -163 -110 -15 154 201 -301 -118 -37 -24 -115 192
4401 192 -103 355 -46 27 215 -339 -132 185 -9 -126 263 -7 200 -146 -154 52 4 101 -181 237 -70 133
4423 133 33 -67 77 229 -199 -17 -69 -75 -148 -84 152 8 54 190 -232 -155 100 -41 18 -126 -15 267 213
4446 213 -41 -66 155 117 -155 -191 -20 32 185 13 -5 29 225 -161 -44 -180 -324 -20 69 15 -39 105 -71
4469 -71 54 -124 -6 -85 5 177 -47 -70 126 168 -240 -68 -33 214 152 24 253 37 68 -25 180 -29 -119
4492 -119 -140 -102 -252 -119 158 -38 -114 -77 98 -191 -84 -97 23 -37 10 289 -76 -12 -55 60 27 65 110 80
4516 80 140 121 -5 -201 165 -80 -41 -124 -1 10 -201 65 -122 134 32 -146 38 55 -179 172 26 -165
4538 -165 -31 -79 -96 -226 -126 59 135 -27 -118 -50 6 23 163 282 17 148 195 -157 29 151 104 21 -120
4561 -120 138 106 -62 -115 -9 6 -155 82 90 228 34 266 33 -62 -28 -19 47 18 -16 -99 12 -60 304 -102 -283
4586 -283 60 23 -141 86 -63 2 -80 12 144 83 10 -63 65 40 36 75 14 -24 -50 -35 55 175 51 151 -124
4611 -124 56 -136 -75 -38 123 236 -74 -23 24 444 -176 79 57 -20 99 -125 24 102 68 -102 -92 184 54
4634 54 8 47 32 135 317 -240 29 90 40 -93 -24 234 -172 -146 -47 -58 -77 192 95 -104 -104 -109 -41 205 3 112
4660 112 -92 117 -34 -65 16 16 95 -141 131 130 -13 -226 149 7 -175 -197 -30 39 -153 -148 -88 -14 -111 -266 237
4685 237 313 115 50 258 96 -9 182 207 -20 -416 129 29 -106 37 144 -260 95 136 -56 -37 -67 153
4707 153 -82 220 76 -156 -103 -224 7 20 -304 -211 24 -111 -96 -40 74 142 -61 -144 -18 47 11 -232 252
4730 252 -81 45 163 -8 142 -38 -40 -17 89 -95 -202 -72 -37 -285 -192 -20 -38 -47 126 247 145 -38 -29
4753 -29 -5 82 -215 -161 114 -21 0 -4 249 26 -22 -52 -11 192 223 211 279 68 52 17 40 7 -144 131 59 117
4779 117 120 15 160 20 165 40 -12 188 30 -159 232 -363 -23 114 -131 49 282 -54 45 200 -182
4800 -182 118 141 -214 -85 167 -121 -245 -45 -114 160 180 -136 3 107 27 114 -61 -248 -35 328 -84 218
4822 218 34 320 -62 -87 103 -55 57 128 48 16 -27 103 -91 30 -137 -66 164 53 184 32 28 51 244
4845 244 -92 25 -148 -29 -59 -118 155 -168 0 54 84 101 -184 23 128 79 50 201 -81 -13 -121 -35 3
4868 3 -126 93 -181 203 32 -5 132 85 52 62 108 -209 -47 -185 -31 -170 22 -115 105 0 156 105 203
4891 203 128 67 -63 -62 -167 91 -165 -57 -101 -67 -34 146 2 -157 -113 -34 107 -194 125 -53 -148 233 88
4914 88 225 -38 -216 -126 -31 -4 56 -166 43 -289 -108 15 99 -101 -227 0 62 -58 -13 126 -103 -25 92
4937 92 -263 46 28 -191 -20 -205 55 -82 -48 -57 -58 28 -234 -179 -56 -185 45 264 201 171 69 11 -134 151
4961 151 91 -7 -150 26 30 163 87 3 316 -113 128 -136 241 97 292 -39 -60 -83 12 -164 -125 210 184 109
4985 109 -94 51 -189 -38 -58 216 16 -59 -12 196 -17 -68 -12 -1 -79 -9 -89 52 -63 -351 -273 6 107
5008 107 140 258 122 -155 9 14 -421 -22 -108 96 -248 110 73 262 74 -170 54 33 151 82 -229 -158 97
5031 97 110 -178 99 -88 -76 28 -30 98 44 -139 122 75 -11 136 40 -25 369 150 6 95 91 224 78 192
5055 192 -74 -27 -81 -30 -47 232 -146 -73 -31 200 206 124 -160 97 -176 106 -136 -41 12 180 24 217 -81 -118
5079 -118 -107 71 -55 -120 14 5 27 -7 -22 20 -17 1 35 -204 94 151 -60 -30 311 223 -169 51 152 102 -46
5104 -46 -150 277 -81 -123 147 -128 234 45 -18 195 -282 54 -90 199 63 180 -35 -41 -57 95 -54 -67
5126 -67 -15 -33 -43 -207 -119 -68 -165 -241 51 93 -4 54 61 39 -4 186 -97 -98 76 -69 188 15 211 -47 -47 62
5152 62 -233 166 -75 -19 95 -59 76 -199 -63 -57 92 -123 53 -138 -52 -77 -151 -245 31 307 21 330 42
5175 42 -4 24 -181 -13 61 33 99 -179 -288 150 199 -237 14 32 18 28 -120 -99 -220 57 119 84 183 -93 93
5200 93 210 -42 26 -124 -62 -79 -104 68 -89 -201 -169 -352 22 144 -62 -48 285 -86 138 -265 -209 87 -89
5223 -89 332 -100 123 -130 250 -218 7 -96 -12 160 64 130 -44 -37 -92 -231 -59 -283 -159 -131 187 133 55
5246 55 -92 56 -269 -8 -230 -153 57 -130 -60 -121 -147 115 -433 0 222 -21 -109 -31 -31 -61 -67 -266 16 -248
5270 -248 -40 54 166 -192 254 -151 -189 178 193 144 -89 -156 266 44 -95 21 -7 -172 -14 -128 -25 -74
5292 -74 163 -57 -77 -172 -74 -237 226 -188 -407 -152 -93 -95 -158 -96 -59 88 96 -188 7 162 21 101 -45 254
5316 254 76 183 -192 -204 -65 -65 128 36 143 -105 -257 196 -67 -304 63 29 193 210 13 143 -20 89
5338 89 -136 -182 51 107 100 -111 -37 124 -60 -140 83 -40 29 106 3 -171 0 65 198 -210 -102 -208 -131 50
5362 50 -142 -137 128 109 84 51 163 -330 -265 -52 85 76 -147 -55 -247 -282 -107 64 89 -63 54 133 10 -9 55
5387 55 358 -12 -254 -148 -202 -112 113 -118 154 50 -133 97 38 223 -192 66 -217 -23 -12 -212 226 -134
5409 -134 -175 -80 -76 -48 -229 126 45 -185 -245 -103 -151 -214 -116 -128 34 45 -251 78 -158 -82 -15 -111 270 53 84
5434 84 177 94 -108 -129 29 44 183 39 325 148 314 -118 -29 -75 -107 -64 161 -68 -47 232 56 156 -94
5457 -94 80 -50 -164 -131 -66 207 94 74 67 0 -91 -232 -10 -40 64 -337 -37 -14 -24 -25 -150 233 -60 240
5481 240 -33 -14 -69 -159 74 -88 -126 -163 157 -50 -226 136 346 48 235 183 93 22 124 -39 24 -110 178
5504 178 53 -162 -95 -202 -109 -72 -34 1 80 51 -120 77 64 -75 70 91 -93 -13 3 -18 280 9 -85 -128 60
5529 60 -13 -99 -16 59 -116 77 -21 95 -126 7 50 95 95 -91 41 -101 149 -47 16 78 179 -18 -46 1 -153
5554 -153 143 149 -33 236 12 -39 -80 126 -45 95 110 43 82 -108 -10 72 -27 265 -65 -131 204 187 49 -67
5578 -67 252 135 -3 264 31 -192 -274 35 -71 46 104 -145 110 -257 -58 -59 -8 28 76 -61 167 -54 11
5601 11 -175 209 43 -6 -30 -146 218 -48 -182 -314 -223 103 72 -1 -73 7 -38 -194 -41 59 224 -210 68
5624 68 -13 109 49 -7 -165 48 101 -187 -10 109 -114 -263 -99 53 -50 -46 309 52 -139 266 -12 -157
5646 -157 -40 -71 77 -138 22 47 110 62 -14 -35 -118 -68 -306 -230 -16 115 57 -28 45 183 -40 -195 -276 165
5670 165 196 -78 42 -303 -191 50 -88 -16 -160 125 -124 -40 207 89 43 -183 136 125 -40 164 -34 90
5692 90 215 115 -132 287 -71 74 13 209 27 -242 31 -126 261 60 -17 -28 -104 -135 -153 -64 -234 121 -46
5715 -46 -26 -274 -31 205 -107 285 -163 -134 -265 -76 95 -44 27 -158 306 0 102 102 -93 -47 207 -24
5737 -24 54 177 27 -47 315 255 199 -95 155 126 -7 -18 7 -65 -95 152 241 -22 212 72 24 -190 -228 -80
5761 -80 109 139 -13 9 180 48 -175 -186 -85 148 -2 99 -99 3 -82 -198 254 -238 42 -13 94 158
5783 158 -92 221 114 -177 -93 38 -134 277 28 5 28 -190 -39 58 -90 17 101 -118 307 -9 -81 -67
5805 -67 47 -88 -72 18 39 88 -21 -17 173 -32 -130 -136 -363 -73 -65 42 58 -211 -71 229 120 -179 -9 -102 -185
5830 -185 -74 180 33 158 197 154 174 -139 -79 -51 -209 -80 -114 103 30 123 -173 87 213 -41 34 -97 -101 71
5854 71 49 -37 -135 48 -52 53 9 -81 37 -219 29 133 69 -263 -157 -67 -277 80 270 -11 67 132 -6
5877 -6 -43 -14 -17 31 137 -22 -210 -64 -107 294 -69 -44 103 58 -22 -41 -195 -84 41 -98 102 -202 -223 -38
5901 -38 -202 -270 -24 20 -34 80 -145 -20 -103 -46 281 203 224 85 -21 -192 -72 211 -15 -196 -67 -87 -184
5924 -184 170 75 31 7 121 -194 95 200 -100 110 119 290 -168 -125 -44 -57 1 198 -69 116 105 67 -116 64
5948 64 -162 10 -143 37 -241 -122 -171 -9 -317 43 -197 9 -90 -12 33 -99 27 116 146 15 167 -12
5970 -12 -23 -262 35 196 94 -490 -249 25 159 -141 75 -17 -189 186 176 52 -52 -79 -65 168 -83 -187
5992 -187 -155 -90 -123 -105 142 -152 35 236 -124 48 -3 41 -23 -82 83 -82 40 -33 -24 100 17 -59 138 -130
6016 -130 -57 144 -71 -27 -263 131 -43 -113 31 162 -73 329 -54 47 -37 236 -149 -115 75 96 -182 363
6038 363 61 -42 -45 -53 -54 246 -12 -230 127 23 -24 177 -127 -265 109 24 235 -166 65 357 16 -103 76
6061 76 16 149 -73 167 301 27 -173 -13 -14 -92 10 9 -249 -240 228 18 187 294 -88 97 215 84 -59
6084 -59 -90 -29 139 344 -28 -270 112 167 -69 56 118 -64 277 -245 -230 -158 -116 -211 -83 -29 104 111 -33 -32 247
6109 247 113 -203 192 115 -117 128 29 -9 -115 -141 -122 44 8 -192 2 -203 77 315 178 169 -202 -32 123
6132 123 71 89 70 64 -33 -295 -61 183 93 -30 -31 38 -228 -63 -15 131 343 -155 36 8 98 20 -15 103 44
6157 44 159 -54 -171 53 2 64 200 39 -37 327 229 -70 -9 -207 189 77 -39 -5 -15 -66 -37 -151 -353
6180 -353 105 99 2 280 27 207 -2 74 175 121 47 47 97 32 85 209 102 133 -22 127 90 -58 79 18 -184
6205 -184 70 -17 51 10 26 156 -132 296 71 13 116 171 113 -102 144 2 -22 -233 -297 -139 -267 194 141
6228 141 179 189 174 -129 -35 193 110 34 73 14 -57 -26 86 42 -41 -125 463 37 -86 42 159 298 -40 -154
6252 -154 -354 47 261 -43 127 -71 -91 -60 61 43 -22 -150 -144 -7 -32 -78 47 9 -75 -68 22 -119 -139 230 121
6277 121 -31 265 -77 -202 -70 -172 -128 205 -262 -44 80 -94 83 81 -25 -539 -107 -108 89 -54 10 184
6299 184 79 84 -121 38 -37 52 -193 16 -138 -299 13 -59 -7 120 -113 90 14 11 -56 71 108 102 165 -102 199
6324 199 -79 -19 -130 -89 151 64 -33 -21 -53 -110 224 36 186 -108 -124 -3 57 -141 4 -162 12 116 -25
6347 -25 140 -233 141 113 2 89 -41 -35 60 -75 -127 20 9 -242 -119 -45 -30 154 -72 -220 144 -204 131
6370 131 -67 58 -76 -168 28 -33 239 129 196 -118 -198 -5 -188 8 276 -124 -38 28 39 124 -43 -378 -17
6393 -17 -69 -313 152 62 -105 -23 210 -154 -303 138 236 -123 29 41 -220 72 274 -36 -113 140 11 -40 -45
6416 -45 189 -69 149 172 207 91 251 26 -101 -124 65 40 200 -34 52 -213 53 -116 -298 141 -19 2
6438 2 -117 409 -147 -215 197 -77 -125 29 -187 -202 233 -137 -8 -61 -67 -14 123 -77 135 145 309 -100 123
6461 123 71 -370 -53 -175 118 168 105 -56 -59 -68 -33 -371 -135 -54 137 -236 -196 -166 -163 90 -110 29 233 -74
6485 -74 -108 -84 85 105 14 70 -127 -32 -102 -172 117 460 221 321 105 -25 -16 -146 42 131 59 -107 34 -69
6509 -69 200 -14 194 196 269 324 103 -159 -14 -127 -142 24 -252 85 42 -120 -206 -23 117 126 15 187 -4
6532 -4 -12 183 62 -97 -229 8 90 -105 18 -292 -239 365 79 -9 -97 -178 153 -121 -132 -286 -3 256 -284
6555 -284 -285 -16 129 -124 182 64 139 11 107 48 -14 126 -119 -68 -75 62 35 133 117 -88 267 -41 24 -250
6579 -250 -12 -102 -134 55 -182 69 -68 -189 15 -195 -143 -97 -60 -383 28 42 -61 -31 -166 -280 168 187 -163
6602 -163 -32 -64 -170 -114 247 -172 -6 4 121 207 190 -81 -67 129 23 121 -62 -131 -45 -135 -6 -140 -155 111
6626 111 -458 -179 -52 238 -186 137 -70 164 272 -1 -127 -117 -102 138 57 116 -201 -18 -36 -61 47 185
6648 185 105 34 -94 123 46 71 224 -93 222 -52 58 -137 -178 -14 38 168 -20 101 96 -268 25 54 315
6671 315 -290 -176 46 -113 -163 -9 -102 234 -45 234 -219 68 -74 7 28 139 42 -67 327 -200 -146 -129
6693 -129 156 69 -56 222 45 149 150 -300 -23 90 -39 -18 120 -120 39 -129 -68 184 -335 98 29 169
6715 169 5 147 190 -231 -136 9 -82 17 208 248 26 -7 -65 114 -244 -4 -26 -171 260 -260 -188 -36 -154
6738 -154 198 39 -164 -39 15 221 248 314 -178 -1 70 67 2 -182 -124 -412 -8 9 56 -104 40 -91 -206
6761 -206 -69 -88 130 -63 15 -109 159 -49 -237 -113 -137 560 27 242 98 -86 93 -322 -130 -94 -134 -16
6783 -16 113 -195 -121 -101 -5 -98 -259 147 -17 -43 -194 -171 165 42 -195 -148 -134 -289 21 -67 -114 -56 46 142
6807 142 -35 -104 24 -38 -169 95 -95 19 74 52 140 -184 -133 153 107 145 16 163 236 -47 -82 497 -55
6830 -55 -142 135 4 -8 11 -147 -336 -261 193 203 -239 -97 17 -55 -25 -53 216 204 36 5 86 -121 -13 164
6854 164 -203 -21 88 107 93 -122 -112 -49 -79 120 -141 -36 -40 89 -61 185 124 42 -4 -341 56 240 -158
6877 -158 -196 -36 -41 155 50 76 29 35 -63 195 242 73 -38 -34 145 -39 -164 38 60 176 228 17 87 96 49 149
6903 149 -92 93 437 180 41 230 -155 145 140 -217 143 -31 12 370 140 370 -49 -145 -64 -21 -148 -5
6925 -5 291 -50 -77 342 28 -128 -118 150 99 -141 52 128 187 274 -223 98 238 160 -88 -126 252 151 85 -50
6949 -50 -207 -34 129 -115 -104 85 154 272 43 149 54 -135 94 -4 -305 -223 90 -78 200 140 -106 79
6971 79 -208 52 43 29 -193 -119 58 -347 -15 158 68 -114 117 30 -231 183 170 307 99 65 -124 35 178
6994 178 -68 184 -47 -220 -57 -34 -133 33 1 74 213 -70 113 -202 -32 229 -44 158 193 -227 -160 67
7016 67 -159 166 -21 154 -153 89 189 -40 87 -137 186 133 65 70 -31 184 169 -162 -7 193 -2 -146
7038 -146 -34 -77 -143 10 -40 -113 128 -165 -361 -81 -262 -62 -169 95 104 61 -96 -40 264 -5 3 -141 26
7061 26 -95 115 48 -98 35 -95 -122 136 317 74 143 -95 -40 -143 49 -184 -32 107 221 99 -296 27
7083 27 149 60 -32 49 249 190 -258 391 -253 13 -187 -216 -298 -231 97 113 -170 -85 -40 -203 1 29 284 44
7107 44 81 95 4 33 -14 -46 29 -174 87 26 -82 8 106 -84 95 71 152 -48 -58 -173 -167 128 -33 31 -132 -122
7133 -122 -85 83 -72 77 0 -58 237 -227 -29 -152 216 169 302 159 90 7 99 6 31 415 128 2 -41
7156 -41 -266 27 217 -126 70 143 -131 155 60 -145 126 433 125 -5 253 131 8 -26 68 -204 182 275
7178 275 -6 -98 -64 -34 -104 109 19 -169 -105 223 -173 67 316 -273 145 38 184 6 141 58 -41 30 -218
7201 -218 120 -73 176 233 297 -14 3 -54 118 -23 -307 -87 -77 185 6 0 -155 153 204 -103 -127 11 -71
7224 -71 32 20 -109 174 -256 -19 -86 -40 70 118 -237 94 6 131 -8 122 -126 101 68 225 51 -382
7246 -382 91 79 -257 -84 196 -93 112 74 36 3 195 88 -50 66 211 93 187 108 -215 -50 58 -25
7268 -25 63 -122 -82 62 -170 -202 111 -11 -7 73 205 36 0 299 195 -133 -69 58 -55 23 146 56 -145 150
7292 150 99 -73 120 -148 -108 87 -133 -190 -161 -1 -105 220 66 -177 59 147 148 86 -261 -52 -2 162 40
7315 40 57 -155 0 47 -196 -187 54 36 66 78 -20 48 48 152 36 -194 32 10 184 -163 -97 186 -158 -115 -82
7340 -82 -43 149 287 55 -136 -181 -218 -81 -151 109 57 0 281 174 132 -76 158 -154 79 -157 157 116 70
7363 70 -203 -154 -71 -13 306 -111 -50 158 -112 -212 27 -40 39 239 161 17 -167 167 194 -202 288 -49 -75
7386 -75 -84 138 50 -65 164 -186 256 -36 186 145 -49 -201 267 244 61 -208 2 -150 -165 270 139 155 46
7409 46 126 -9 -378 -139 -459 102 -33 -10 -115 66 120 -115 227 0 -200 -246 99 -111 -117 56 -128 -202 59
7432 59 15 36 -114 -98 -24 119 -112 -45 157 94 -142 -198 -35 -129 -47 -42 -48 117 91 -312 135 53 -143 -121 49 -114
7458 -114 -44 -12 -1 -118 303 -71 -27 -55 331 -51 94 -89 168 -10 -211 40 -97 -229 -135 -48 -73 -170 43
7481 43 -60 -31 -464 41 -49 142 218 -52 30 -130 371 78 253 -73 39 132 -212 -66 -141 -142 -97 134 -171
7504 -171 61 202 -216 122 -162 133 -169 198 -65 -276 37 -31 113 233 176 -173 -101 128 -2 87 142 178
7526 178 -275 -234 -5 93 -118 376 57 -145 131 402 -199 -33 -17 -71 123 -69 96 -73 145 111 -32 166
7548 166 72 -78 -64 -20 84 87 236 -309 -230 -20 -6 283 81 -237 69 -141 59 5 -72 -74 1 81 -97 154
7572 154 321 -38 107 53 48 -31 78 169 25 -121 -53 -18 23 97 -27 -12 -35 -208 -168 193 -524 149 -44 64
7596 64 136 124 103 29 -246 179 -16 54 -45 157 126 -59 -174 97 266 -58 141 -174 -139 -84 4 -216 -87 -216
7620 -216 194 260 75 -1 -45 -56 120 -92 -123 -11 -84 -15 -26 219 -32 -96 67 -172 180 302 -28 -13 207
7643 207 20 -172 -73 70 124 -72 -141 -100 79 183 -81 -168 -356 3 -31 199 138 -155 -27 -55 146 267 -80
7666 -80 -192 112 -76 70 -142 -70 111 -255 47 1 22 -128 72 46 -26 -101 76 28 41 -148 165 5 -46
7689 -46 33 90 11 153 157 -210 57 214 6 -74 -16 -176 31 -214 51 -192 2 99 37 -76 55 364 157
7712 157 178 -45 -191 139 -47 -201 -22 -11 -4 -97 72 -95 144 -32 4 60 -154 -198 45 -35 -7 4 116 -154
7736 -154 -175 156 -19 279 -64 -40 15 184 9 -80 70 -25 -218 17 75 -33 177 -41 -89 10 -210 -134 62
7759 62 34 50 275 -192 136 -39 -124 231 -126 -257 11 70 -205 -240 80 -26 116 -104 64 -71 -151 -62 -186
7782 -186 199 6 152 55 178 -94 115 40 31 32 -27 -107 164 109 -101 -39 71 -16 -26 -101 169 182 -150 3 -56
7807 -56 -202 152 -54 -199 127 96 -220 -34 307 310 6 -36 162 36 129 -9 32 -63 126 -152 89 -195 -35
7830 -35 75 169 57 74 99 -117 -256 93 -31 -61 202 56 -103 -218 116 159 -15 139 7 88 -134 114
7852 114 -228 187 -209 -51 173 179 -30 -237 84 -48 30 157 236 -36 79 -124 383 21 220 33 -15 -22
7874 -22 84 -201 95 56 -198 229 -96 -100 -57 65 -2 49 -290 -16 135 147 86 -112 25 -66 181 -204 4
7897 4 257 -156 0 24 15 155 -14 77 -97 -194 63 -65 166 -221 -35 19 140 42 -97 -71 23 -115 283 -36
7921 -36 -205 -154 -162 193 -34 -60 44 190 -1 -53 127 -8 84 -135 64 -55 154 79 -34 -2 265 -23 -147
7944 -147 3 -13 111 -198 -18 -66 229 -152 -171 -89 20 -29 -3 5 152 -58 -121 71 -211 172 137 -188 -72
7967 -72 250 3 83 16 -98 5 69 -240 -55 226 80 60 252 -85 -137 170 130 78 -119 60 -103 26 -85
7990 -85 48 -61 149 291 -138 152 79 121 362 61 -79 -245 32 274 30 -132 2 -73 -8 14 32 -19 -78
8013 -78 60 -51 -136 171 13 -130 235 -192 -213 209 126 -65 -58 191 -213 -116 -37 166 394 -246 84 -22 11
8036 11 190 -386 187 -75 83 -149 -80 79 -151 -96 39 33 98 34 -11 26 -50 79 128 39 68 19 -46 -88 -176 106
8062 106 174 -215 -36 -124 -200 104 28 -6 -58 27 124 204 -59 -76 -98 -34 -41 110 32 109 -179 165 49 161 -36
8087 -36 -22 150 -64 177 -228 172 -86 21 -74 -137 110 71 -41 -56 39 139 59 2 -228 -42 83 -504 180
8110 180 -3 91 4 293 -80 -77 -14 -57 75 -137 -211 -149 -56 -135 80 28 -54 92 -2 -239 124 -77 149 227 -67
8135 -67 73 -66 14 116 -215 3 183 26 -14 -244 71 323 69 7 87 8 29 -61 -16 175 -48 148 -56
8158 -56 115 110 -73 47 90 -48 161 160 141 -93 -24 -101 -26 87 -178 285 -28 107 -101 -84 -327 -209 133 252
8182 252 21 -108 -246 -362 -35 -69 -221 -22 -241
8191b41
$$ Imaginary data points
##PAGE= N=2
##DATA TABLE= (X++(I..I)), XYDATA
0 0 0 0 0 0 0 0 0 0 0 0 0 0 8 -8 8 -8 8 -16 16 -24 24 -32 38 -40 48 -56 69 -80 88 -104 120 -136 152 -175
34 -175 197 -222 248 -278 310 -349 388 -430 477 -528 584 -645 713 -786 868 -955 1051 -1157
52 -1157 1276 -1407 1557 -1724 1913 -2129 2383 -2680 3037 -3478 4032 -4752 5737 -7171 9461
67 9461 -13709 24327 -113487 -120433 49652 -28431 -54920 1614 67917 14831 -22135 24456
79 24456 100806 75384 16233 2772 43074 32662 -24767 -37890 10626 5373 -33535 -35394 -14823
92 -14823 -38922 -82277 -71689 641 33492 6265 -6100 24272 53332 59469 50665 54703 60608
105 60608 33901 -18360 -45533 -34475 -27227 -54050 -68267 -42590 -24254 -23895 -9421 10724 21190
118 21190 28882 37658 45232 44566 28344 7914 3137 14154 9202 -14097 -17584 -6174 -21061 -45605
132 -45605 -40057 -17513 -13059 -25135 -19845 4927 16721 14901 25297 42214 47542 37947 26337
145 26337 21151 6983 -18080 -31736 -28098 -26343 -39507 -46902 -26123 -6461 -12119 -6428 23266
158 23266 37131 27111 21058 27298 27285 12231 918 1873 2080 -3452 -13102 -19602 -14971 -15254 -23957
173 -23957 -17341 -5014 -8170 -14315 -7639 6452 14379 12919 21252 33456 28631 18726 14657 9966
187 9966 2951 -9871 -23581 -25141 -25044 -30249 -32183 -24311 -7401 3338 5056 18553 33374 27476
201 27476 19286 21717 20993 12881 48 -7051 -8616 -14947 -21709 -21533 -17469 -10661 -10832 -14099 -3845
216 -3845 7080 2789 2306 12361 19368 16767 11357 15049 18211 7811 -980 -693 -2933 -9181 -18755
231 -18755 -24050 -18614 -15728 -18646 -12627 394 9049 9151 9794 21210 26511 15685 11628 15042 9329
246 9329 -1949 -8928 -9541 -10741 -17098 -19533 -14456 -10112 -8152 -8229 -5038 5003 8939 5220 10214
261 10214 18532 16570 10526 9612 13058 9285 -1581 -5660 -6104 -12381 -18122 -19896 -17835 -12443 -10783
276 -10783 -8855 1111 10717 13007 12713 16313 22165 17432 7290 6883 6275 -4616 -12775 -12902 -11366
291 -11366 -12435 -15467 -12304 -5424 -2292 -1016 1534 5823 10561 8077 4458 9944 12171 5528 2341
306 2341 4529 5520 -794 -6477 -4812 -4571 -10683 -13009 -10363 -8202 -5890 -5982 -2623 5716 9634 8288
322 8288 10117 14450 15020 8059 2710 4457 966 -9277 -12138 -9518 -10715 -12364 -11374 -5419 -216
337 -216 -150 2142 6423 9545 10304 6852 6100 9666 6074 -1467 -1342 266 -3195 -8336 -8873 -4496 -5695
354 -5695 -9013 -5519 -763 257 1080 2043 5390 8928 6689 4737 7008 7312 3057 -2440 -3159 -1016
370 -1016 -6000 -10635 -6250 -3683 -5507 -5221 -1852 2180 3424 2095 4476 6906 6283 4490 2667 3308
386 3308 4284 -931 -4212 -852 -1571 -6139 -7051 -4795 -2573 -5011 -5339 -33 1964 1161 3082 5847
402 5847 7772 8404 4950 4564 5732 1782 -3344 -5561 -5248 -5789 -10170 -9661 -3771 -3038 -4295 1 4546
419 4546 6498 6432 6480 8640 7983 3886 1726 391 -683 -2738 -7255 -6889 -3791 -5424 -6746 -3593 -213
436 -213 -272 -1058 1116 5022 4189 2579 4985 5585 4406 3289 1212 1516 1292 -2599 -4713 -3929 -3570 -5668
454 -5668 -7763 -5141 -982 -3222 -2546 3400 5341 4712 5102 6348 7620 5424 2354 1892 873 -1951
470 -1951 -4567 -6527 -5172 -4352 -7443 -6637 -2239 -880 -1044 794 4174 6301 4702 4835 7144 5493
486 5493 2543 1394 -131 -845 -2401 -5645 -5355 -4303 -5452 -5676 -4223 -425 1179 -121 2385 6609
502 6609 5004 3213 4501 4118 2807 -57 -1390 -449 -1618 -3616 -3480 -3386 -2133 -2298 -3848 -1204 984
519 984 -894 -732 1823 2900 2169 1569 3098 4936 2361 1314 2113 1011 -496 -2757 -4340 -3512 -3696
536 -3696 -5510 -4176 -2057 67 528 685 4134 6276 3738 3408 4961 3174 664 -1412 -1977 -2006 -4123
553 -4123 -4973 -3470 -2617 -1898 -1307 -769 2768 3235 1108 2371 3736 2597 713 314 1492 936 -1896
570 -1896 -1478 -89 -1478 -2241 -2344 -1936 -706 -863 -1738 689 1744 920 938 1768 3436 2318 -467 1251
588 1251 2096 -409 -2098 -1266 -1067 -1867 -2856 -2257 -214 -778 -722 12 1090 2269 1286 128 2374 3216
606 3216 618 521 1421 1117 -1247 -2793 -1450 -1369 -3573 -3371 -2031 -1687 -161 -329 457 3322 3566 2421
624 2421 3238 3994 3432 378 -1163 12 -1631 -4854 -4673 -2661 -2887 -2907 -2080 337 1876 1399 1877 3457
642 3457 3353 2646 953 558 2105 175 -2076 -741 -90 -1325 -2487 -2231 -422 -967 -2982 -1177 73
659 73 -692 -508 21 1295 3124 2027 1782 3395 3423 1528 -13 -39 608 -2178 -4301 -2526 -2125 -3613
677 -3613 -3184 -1504 195 450 -165 2094 3745 3294 2299 2453 2566 2529 -543 -1807 -146 -1010 -3408 -3514
695 -3514 -2055 -1465 -2764 -2685 407 913 84 1470 2643 3068 2965 1251 1356 2286 335 -1627 -1322 -633
713 -633 -1134 -2553 -2624 -32 -620 -2244 -448 973 658 -172 78 1811 1907 -57 615 1414 1259 822 -439
732 -439 20 1355 -868 -2091 -620 -674 -1997 -2904 -1512 673 -345 -634 1600 2305 2060 1532 1076 1953
750 1953 1892 -602 -1305 -452 -780 -2438 -2995 -1352 221 -1512 -1098 1402 1542 877 1123 1836 2420 599
768 599 -765 39 74 -1032 -1405 -1355 -147 139 -1867 -1200 1338 739 -655 -54 1478 1866 -455 -627
786 -627 1363 305 -892 -698 28 638 -332 -1842 -318 878 -561 -988 -370 1138 764 -1156 -95
803 -95 1964 284 -736 34 925 990 -296 -415 1373 650 -1132 -1436 -836 -434 -1445 -2673 -391 967
821 967 -495 -435 1858 2595 2076 651 1455 2227 333 -1085 -642 -1221 -1722 -2895 -2815 -1144 -425 -1735
839 -1735 -234 1694 2485 1217 832 2420 2647 102 -643 881 207 -894 -1915 -990 0 -1242 -2135
856 -2135 -440 124 -67 -863 -714 1304 947 -1083 -100 1763 1545 413 460 1625 1740 -626 -758 316
874 316 -351 -1620 -2182 -1685 -355 -1356 -2136 -5 985 736 -8 1094 2998 2074 44 1568 2317 691
892 691 -817 -1103 -382 -560 -2220 -2770 -688 -820 -1547 -1337 206 2039 950 -76 2464 3142 1359
909 1359 226 1036 1343 -472 -2155 -1380 -251 -1338 -1572 -1093 383 609 -736 -388 1422 1407 -344
926 -344 -162 1002 1311 -173 -911 1421 1500 -434 -401 1070 870 -79 -1563 -510 -105 -1296 -2252 -1202
944 -1202 -502 210 -723 -230 2408 1861 474 973 1860 976 -564 -1285 -183 -288 -2221 -1919 -567 -285
962 -285 -294 -770 639 1922 454 -223 1102 1760 678 -920 -798 722 -142 -1831 -317 639 -254 -754
980 -754 -661 764 1052 -443 -142 861 886 134 -877 -90 1016 -484 -1509 286 788 -465 -1146 -13
998 -13 1153 302 -990 50 1019 -17 -605 -733 434 592 -950 -652 1015 479 -668 -292 303 979
1016 979 -663 -1236 450 322 -1021 -1039 -114 689 131 -612 690 1983 887 10 485 1363 365 -1189
1034 -1189 -1460 -28 -1070 -2127 -1394 -218 204 -479 -49 1429 1708 796 1198 1145 1582 491 -1094 -529
1052 -529 324 -943 -1879 -1004 -93 -488 -1349 -625 863 331 -528 550 904 919 281 -73 1124 813 -410
1071 -410 -259 437 796 -427 -1114 -176 462 -1376 -1496 -288 -313 -660 -978 -145 1120 447 199 1045 1665
1090 1665 1363 754 -41 980 768 -1022 -1165 -604 -1001 -1877 -2322 -841 -56 -961 -519 1236 1243 1252 1085 1216
1110 1216 1846 1200 -381 24 -49 -531 -1561 -1788 -599 -428 -1632 -418 663 265 81 68 769 1063
1128 1063 211 -161 583 389 117 -63 144 773 104 -969 -17 550 -431 -1177 -355 -97 -419 -1224 -373
1147 -373 465 328 -21 767 993 963 412 341 939 673 -558 -531 -624 -126 -535 -1438 -357 351 -583 -597 537
1168 537 753 917 386 435 1263 256 173 49 -185 -104 -893 -1253 -12 -7 -879 -380 394 527 372 -66 715
1189 715 976 -387 -341 171 -363 -371 -908 -907 162 -280 -706 313 870 566 437 117 545 537 -686 -234 2
1210 2 -543 -453 -425 -159 572 -229 -185 414 343 44 -93 -13 231 -311 -905 -48 538 3 110 491 1225 838
1232 838 8 489 399 -418 -541 -586 -705 -358 -1055 -882 181 410 357 151 685 1335 1115 342 870 688 -668
1253 -668 -443 -365 -667 -838 -1357 -638 -156 -202 -361 -188 499 642 124 414 1195 741 253 444 341 116 -170
1274 -170 -848 -52 -467 -1024 -690 -414 -351 -237 -674 -514 357 96 63 246 492 852 468 269 1026 615 30
1295 30 376 134 -32 -190 -640 -350 -628 -1294 -546 -267 -274 135 148 917 1480 742 778 1101 791 402 -247 -528
1317 -528 -78 -1004 -1213 -690 -692 -786 -143 -306 421 697 384 734 921 435 57 285 15 265 -654 -224 219
1338 219 -254 -381 114 -172 -257 -553 -431 222 -169 -362 -41 43 158 384 -170 229 869 261 373 356 395
1359 395 116 -71 -560 -94 -410 -696 -91 -450 -256 -217 -251 436 334 112 542 502 536 466 -142 -87 185 -614
1381 -614 -779 -147 -697 -415 -240 -52 640 272 361 437 483 435 26 -221 -169 -132 -612 -878 -237 -500 -117 -82
1403 -82 241 695 252 587 592 22 -268 25 -576 -194 -434 -629 -257 6 -110 -48 181 294 793 -60 129
1424 129 201 191 -52 -42 -315 236 -42 13 447 123 77 356 -71 -115 -236 -860 -338 -240 -392 -322 -78 -165 49
1447 49 196 371 820 466 504 609 -15 -22 -317 -501 -350 -722 -577 -520 -537 -274 61 -171 416 865 77 611
1469 611 907 501 814 405 -7 94 -502 -735 -592 -710 -508 -669 -427 -137 132 -224 564 344 226 407
1489 407 14 422 263 -136 -36 267 -92 -61 -75 -2 103 -284 -408 -12 -372 -695 -654 -527 24 120 -163 768
1511 768 544 686 642 589 604 204 -65 -192 -347 -653 -854 -606 -704 -171 -433 -90 752 394 268 540 862
1532 862 920 280 64 179 111 -646 -306 -329 -141 41 -169 -332 96 -97 -114 124 34 -75 -200 -193 445 -116
1554 -116 -256 233 -37 377 79 74 466 43 -150 -113 -158 -120 -147 -200 -187 82 -244 -214 192 13 285 79 93
1577 93 583 197 -120 33 223 -186 -237 -380 -78 -179 -538 -94 331 239 102 157 453 434 -268 -449 53 51
1599 51 -258 -390 -282 131 25 -275 294 486 339 376 270 465 224 -250 -427 -117 -500 -589 -371 -20 111
1620 111 -250 -221 385 175 267 125 463 216 210 -168 -189 241 -696 -544 -296 -48 -91 -164 102 385 169 -276
1642 -276 -178 25 73 -253 -9 321 260 -240 422 419 342 216 39 281 236 -324 -626 -509 -432 -683 -999 -295 204
1665 204 -291 -177 314 496 748 454 492 735 680 48 -533 -11 -108 -663 -975 -272 -422 -631 -335 392 275
1686 275 363 136 358 503 69 -97 39 43 -51 -171 -594 -5 -110 -51 -107 194 -90 -199 -417 31 19 -499
1708 -499 -184 79 -37 8 250 234 615 267 -3 670 570 27 -47 -519 32 -441 -905 -280 121 -406 -220
1729 -220 264 400 714 -3 390 406 434 -96 185 3 19 -338 -614 -263 -229 -463 -220 -264 584 146 -153 155
1751 155 421 -124 114 -127 -133 -125 -46 -367 -51 -98 -182 -32 69 310 144 -141 100 204 -435 -318 -80 -46 -195
1774 -195 -274 -29 428 180 -285 282 278 202 -52 -130 462 38 -424 -298 -76 -184 -304 -160 346 324 162 36
1796 36 313 82 159 -421 -141 28 -283 -227 -168 75 216 -120 290 207 158 127 121 144 -130 -97 -385 -401 -161 -546
1820 -546 -468 -45 163 23 183 129 689 451 -59 433 271 62 -259 -323 -191 -368 -558 -78 144 -6 -7 177
1842 177 96 176 -342 -215 213 87 -255 -233 112 123 73 -318 303 248 -233 -162 49 198 8 -301 -177 -107 -244
1865 -244 -389 -510 -4 -9 -118 -13 682 360 137 458 201 247 -315 -472 -285 -338 -618 -526 -332 -222 -36 -120
1887 -120 170 249 415 353 591 427 340 -42 -404 343 -306 -117 -28 -101 210 -162 -265 136 213 -247 -162 33
1909 33 182 -49 -257 11 488 -151 -10 177 379 329 247 185 87 -111 -332 -83 -230 -293 -638 -552 170 116 -190
1932 -190 -212 137 244 103 186 301 391 -43 -283 69 -221 -122 -470 -598 35 -277 -350 -48 247 207 -9 -41
1954 -41 392 -2 -223 -358 408 -229 -233 -69 -16 204 -104 38 437 540 178 -146 -292 141 27 -418 -159
1975 -159 -28 -306 -198 -80 194 544 78 264 473 115 153 39 -180 -7 -207 -385 -145 -196 -90 -175 -22
1996 -22 231 21 -37 -16 192 -6 -252 199 91 0 -25 -133 92 300 -110 270 47 358 93 -210 171 -16
2018 -16 -338 -140 -21 -89 -17 -313 161 299 97 -12 334 281 361 41 84 35 -147 -169 -254 -218 -109 -521 -348
2041 -348 -8 30 -231 -30 472 175 359 216 234 148 -315 -82 1 -105 -256 -451 -60 31 -84 53 -167 149
2063 149 -155 -217 -96 31 -150 -79 -184 -105 8 158 123 226 50 415 42 325 56 233 -359 -512 -369
2084 -369 -431 -509 -126 37 -2 -5 247 438 561 78 452 361 158 -14 -272 41 -16 -264 47 53 -80 13 -359
2107 -359 59 -80 223 -122 309 242 -551 86 -77 226 -59 -207 98 -17 301 84 135 101 -183 -334 -215
2128 -215 -198 -238 -193 -220 5 -62 -154 -62 170 159 67 7 427 192 475 -243 76 110 -233 -314 -310 -65 -123 98 -613
2153 -613 296 285 85 90 132 324 156 -108 -267 184 -131 -17 -229 -222 -143 174 -212 -22 -96 -175 -274 -120 26
2176 26 -231 -227 -44 141 40 167 -19 290 332 84 140 367 -37 -66 165 -77 182 -53 -138 -171 -24 70 -276
2199 -276 151 106 149 -137 50 266 258 28 150 131 133 194 258 185 130 19 233 96 -163 -10 -272 -88 179 132
2223 132 178 153 77 35 73 202 6 -40 130 349 331 -156 87 -181 -18 -105 -470 -30 -407 -280 -178 -77 88
2246 88 10 202 408 323 88 159 -22 149 -98 -225 -115 -368 -267 -342 -15 -356 -28 -12 -103 58 41 -105 52
2269 52 -235 21 67 -189 -81 280 92 55 -254 -68 235 -17 143 212 -304 -116 -23 -290 -187 -113 -335 83
2291 83 231 206 -12 284 126 151 -56 84 -39 4 -155 -139 -204 -401 -44 -454 145 183 52 94 51 24 -43 -119
2315 -119 5 -20 -55 -81 74 -66 42 44 230 124 -217 -266 302 101 66 47 -232 -27 46 7 -85 11 151 -88
2339 -88 -118 62 205 101 103 -82 -5 -102 121 -217 -100 -166 -176 -82 -2 -123 -67 8 271 -49 -122 230 -47 -14 398
2364 398 -81 52 -110 -194 80 -214 -111 139 53 -270 317 -107 -65 -205 -57 218 -10 -90 34 161 167 344
2386 344 20 158 231 321 92 -172 62 -106 195 83 -111 -153 -245 -52 -98 29 -63 -64 65 284 88 -193 263
2409 263 35 219 -39 -191 -13 -11 -36 109 -73 -149 98 -116 -11 50 146 84 205 194 123 100 -39 80 -244
2432 -244 247 27 163 26 137 -55 -188 -250 -361 -3 -94 -91 -43 -68 -9 -56 -149 -1 155 337 158 -18 71
2455 71 178 -66 -111 -142 18 3 -69 -231 -116 -345 39 115 148 90 318 46 77 46 -417 251 -74 -121 218 358
2479 358 -99 210 -267 37 169 176 -5 -73 98 -240 -43 -115 174 -163 56 -81 165 253 51 16 302 202
2501 202 172 287 77 -92 -16 -365 183 -88 -263 -322 171 216 115 -107 189 240 356 63 153 138 -67 -24 -204
2524 -204 -153 -20 229 -192 326 184 -59 -130 8 72 -149 118 -284 -129 -27 -154 210 221 304 -134 18 192
2546 192 198 79 211 114 -130 -19 131 -177 -263 33 -132 12 -21 115 212 207 363 36 124 -62 15 -54 17 -51
2570 -51 -32 58 -218 -124 -109 -49 -121 -210 -9 -53 -215 -161 -161 -223 -91 95 -238 -98 23 -276 287 204 88 72 57
2595 57 105 -249 -99 -49 -52 -361 -293 -234 15 252 -110 -18 127 -75 43 -252 -152 124 -107 -189 -100 -336 -246 -112
2619 -112 -387 319 -104 13 86 24 3 339 -117 136 -160 -300 68 -78 -344 -36 82 218 325 66 -57
2640 -57 -47 177 84 12 -235 -80 -383 -301 -60 25 -190 -81 38 -6 334 24 574 358 39 84 6 -118 -139
2663 -139 -353 -199 -17 -84 176 -98 83 160 102 39 57 -77 -181 -79 66 34 17 -206 182 71 31 13 71
2686 71 -42 69 -463 -49 56 -60 -54 -169 -98 176 179 122 194 50 -31 25 275 17 90 41 -101 -84 -191 58
2710 58 66 -112 15 -127 -27 -2 -102 79 283 231 293 203 -191 191 153 -41 -151 12 122 146 129 -130 -93 56
2734 56 -168 21 -25 3 -106 73 12 -8 -128 -95 54 308 587 118 135 -19 32 47 -84 -178 -361 -211 -131 4
2758 4 12 -51 187 150 295 -7 173 463 113 -2 -95 91 203 -204 -169 -57 -258 -65 -203 89 48 111 -62
2781 -62 98 129 -253 -182 -273 150 65 12 176 34 176 254 229 -78 -15 15 -99 52 -29 -113 -22 196 -81 -100 17
2806 17 -100 98 100 105 79 258 -55 170 -119 131 -75 -127 -144 -128 286 262 -66 -179 188 176 55 159 216 102
2830 102 160 101 110 -20 -49 4 -26 -101 2 -134 -66 65 121 -165 15 -274 156 78 17 -41 -154 -122 87 78 96 69
2856 69 197 184 -54 -35 44 193 -68 -67 63 -153 -355 -216 -310 -139 236 -235 326 147 -59 378 -21 108
2878 108 46 91 154 116 -71 -86 -151 -295 -46 -47 154 46 41 317 -57 -130 83 -75 -152 174 -24 145 230 -12
2902 -12 108 62 -86 56 -85 -193 -286 -107 -46 95 -283 -113 -53 62 -138 -70 108 -50 174 289 181 103
2924 103 260 -117 124 -59 240 -58 -119 -2 -70 18 -11 -4 88 244 41 -56 -125 -147 -329 -161 -67 -179 58 11
2948 11 -73 160 97 -157 -22 203 -6 -273 64 -79 -269 46 -275 -75 173 291 77 -107 234 348 18
2969 18 230 82 78 165 18 93 -195 -130 -301 83 -127 -101 230 -59 36 393 -150 136 295 24 53 196 -40
2992 -40 19 -149 -124 -44 87 69 193 -5 120 -56 -166 23 -270 92 -9 -72 -97 294 -8 20 139 105 -173
3015 -173 135 258 -123 -193 160 -1 -210 -263 -41 -55 -53 12 99 181 136 -244 191 197 -161 55 -92 -17 -157 197
3039 197 -55 7 148 186 59 261 180 -111 -47 -8 41 293 -242 -19 -189 -194 7 -155 121 -216 268 157 -120
3062 -120 359 -25 -50 96 -58 116 64 -160 -179 1 -410 -35 36 190 -139 -121 65 174 26 293 -187 -183
3084 -183 -54 -95 -104 -110 -56 16 267 -270 87 68 146 -200 31 53 -105 -25 -78 118 -159 -228 285 -28 196 -280
3108 -280 -75 114 -79 -183 -23 -107 -71 -274 11 -150 -44 163 -16 356 -46 34 -32 123 167 75 -249 -83
3130 -83 -169 -163 -163 190 -63 268 -93 140 62 -144 207 -181 83 247 121 -112 33 224 -117 -12 146 436
3152 436 10 134 140 -30 227 31 -20 -16 46 -56 -19 -78 -14 -41 49 148 150 90 179 -75 -29 160 104 13 -93 103
3178 103 -193 -66 -18 106 -81 91 10 -67 75 24 31 87 175 116 -19 -19 -148 79 36 120 4 -178 -169 -227 -172 1
3204 1 -14 -121 -283 1 -143 210 -46 327 52 421 -77 -121 -38 98 99 129 -48 86 -28 187 -20 -138 -247
3227 -247 194 204 -276 -20 -8 317 -41 55 -76 -19 -72 10 -132 43 149 -209 -216 67 -67 -56 7 -118 -39 46
3251 46 42 287 -108 319 -12 -8 233 276 131 306 6 180 272 142 146 -64 -31 8 22 99 89 48 31 -137 89
3276 89 43 -174 -151 253 186 91 351 163 79 -343 -8 68 29 -114 -41 -42 -45 -10 118 -126 189 97 -69 67 66 118
3302 118 -25 131 -170 -74 -50 -105 214 -137 101 194 -213 -193 338 -276 -132 -200 -225 223 133 -17 -268 20 -124
3325 -124 -64 86 224 143 279 173 48 -86 115 -228 -160 83 -123 -151 272 39 9 256 -51 306 201 10
3347 10 226 -221 211 -179 -25 -26 -29 -142 -142 336 -18 -188 -77 77 -200 53 -186 -31 -216 -201 -60 11 5 -251
3371 -251 51 -45 -16 -67 68 210 48 -88 11 -59 107 -105 85 158 -40 -97 275 86 275 -57 204 -321
3393 -321 137 19 -119 -12 -244 -45 188 -61 108 39 -46 -2 -49 76 109 -88 -97 -267 -115 -16 20 100 -150
3416 -150 59 340 70 93 -264 -193 -48 158 -49 180 34 -300 -137 126 -43 -98 -47 155 -140 -85 38 26
3438 26 121 152 -260 -35 56 -144 -383 43 -202 -117 -2 0 74 -88 -87 -2 26 31 66 -131 -128 -69 -17 243 178 -40 298
3465 298 -48 40 -152 -157 62 -188 -170 -166 154 -401 -168 100 -209 -77 224 30 163 -191 -21 -30 -133 60 -219
3488 -219 140 -197 96 134 32 -68 -200 -12 37 137 62 -36 -156 -261 -192 -295 26 45 -274 156 -65 58
3510 58 -16 -108 45 137 -216 -19 16 210 -74 -235 -377 -194 140 41 123 -27 120 -48 272 99 269 188 372
3533 372 -129 31 24 -248 -8 35 -173 -46 -288 67 193 134 15 -150 -39 -48 128 -49 -139 -16 -203 161
3555 161 -80 -81 173 -209 139 -110 14 206 35 -115 -123 -20 -288 -48 -55 103 16 -280 143 -3 -174 83
3577 83 -172 116 -54 -238 -145 -139 -49 -92 8 -177 128 -98 -113 320 -69 -79 -31 41 -7 68 121 177 17 -19 53
3602 53 143 -225 -96 -321 -50 -7 -177 87 339 -62 -120 19 110 -207 21 35 134 142 -34 23 179 -100 159
3625 159 -57 -208 -106 -85 105 22 -141 -208 171 34 -62 -34 -39 6 123 47 -48 -75 175 103 100 205 -69 53 -74
3650 -74 20 -201 -236 180 -299 315 130 -190 -157 -314 -31 -266 -62 -45 -99 -17 101 35 -67 -55 -5 -165 -251 -52
3674 -52 -399 -57 162 -9 1 317 -11 119 172 -87 175 -37 -19 37 179 127 -66 -99 63 56 -285 -37 109
3697 109 -100 -88 -15 -77 5 -46 4 -377 83 -385 -60 -111 118 -20 -254 163 -152 2 -90 -1 60 -151 -240 62
3721 62 203 -128 -37 -70 103 391 -229 -149 351 -47 -37 73 52 -107 -111 42 -122 -180 -102 -61 -76 139 -194 41
3745 41 63 -145 17 161 76 45 134 189 -143 -135 -95 70 -166 56 -20 31 138 54 -110 -89 -49 -60 -48 -120 77 -62
3771 -62 134 114 -11 -235 12 -139 120 68 13 64 -125 13 -29 -197 -135 28 -4 174 -142 -194 8 -24 178
3794 178 45 64 228 -107 53 -172 228 -137 -65 167 -23 82 42 126 -147 -86 96 -164 -88 104 -93 -303
3816 -303 -144 -117 -225 81 -27 257 224 -224 -103 -156 243 160 59 275 -49 -34 3 -84 -68 54 -50 -72 -52
3839 -52 68 -21 55 -84 -25 139 -119 59 -80 -155 -50 -95 -82 63 230 -128 126 -112 -78 -16 225 -42 154
3862 154 -182 76 154 179 -204 117 238 106 198 114 259 -211 -213 -55 334 -29 -3 -74 21 147 7 -129 121
3885 121 -31 174 12 225 125 129 13 70 -62 -101 151 16 -69 110 -112 14 136 121 -105 -31 -69 -201 95
3908 95 -20 -15 110 -169 -214 -241 -94 -121 162 -179 -34 200 61 -132 9 139 -109 85 -49 -61 17 167 34
3931 34 7 -138 110 100 94 -25 -29 32 -85 171 152 -177 22 -138 -110 -59 -104 254 61 189 47 -6 -42 34 -31
3956 -31 -183 -297 -76 124 143 147 10 110 -144 -3 -171 178 6 40 21 -58 -220 -58 -179 25 227 -3
3978 -3 56 -149 156 146 -69 54 6 120 250 -341 -21 -76 -183 -63 -168 163 -124 167 95 102 34 -187 165
4001 165 -132 -141 26 1 -132 -35 4 -38 46 -83 -93 -117 6 144 -18 -137 -372 -91 79 84 -107 38 221 36
4025 36 179 -41 -164 -113 -23 -15 -63 -21 -72 27 -208 -112 -263 323 -151 -75 361 20 34 -41 210 144 49 47 56 56 -181
4052 -181 -125 30 166 29 -88 24 22 -119 53 221 -53 27 -28 19 163 89 -11 -90 -331 -86 41 110 59
4075 59 383 -47 -247 -50 -53 -197 -110 6 100 -124 179 -199 -177 -59 236 107 35 126 -190 -104 -203 157 47
4098 47 -78 215 -72 114 -226 45 362 -21 140 159 476 47 -53 -80 16 12 -375 369 -389 -24 67 254
4120 254 -85 -235 44 -153 29 232 -237 150 43 -272 143 -51 -36 -83 -36 -98 176 -71 -118 -135 -178 -3
4142 -3 -96 -327 -62 -179 172 122 51 -20 173 -147 50 -318 -151 78 75 235 -163 -94 -209 108 -111 23 -109
4165 -109 52 -61 185 -79 24 -153 -5 -143 -26 317 132 -44 231 -74 120 5 74 -12 358 -184 89
4186 89 255 -318 -144 -206 11 -166 -65 42 -165 151 2 172 219 -121 -214 -118 66 -122 -33 97 59 -181
4208 -181 -22 7 -292 -328 180 161 57 44 265 -36 -286 -219 -228 0 -140 -117 148 108 -64 316 -104 43 -60
4231 -60 22 -118 -64 153 -12 -1 -8 -125 -137 65 31 -69 -63 -65 70 -129 -29 7 -112 87 169 132 43 -94 -130 -148
4257 -148 109 -117 39 -36 223 -170 114 200 51 -31 128 146 123 -49 -335 -35 -134 21 -127 -145 -19 59 -189
4280 -189 69 133 212 -16 -78 62 -95 -67 -222 133 -185 -183 209 -107 236 11 -103 -64 -87 -130 -16 -20 83 37
4304 37 -89 3 110 -100 64 -4 -286 -32 43 134 68 165 19 50 -255 -8 70 34 25 -72 -38 206 -146 131 -130
4329 -130 -92 150 -188 -264 -134 25 -9 48 102 -80 155 109 -151 112 168 -131 -82 -118 -4 113 97 205 -69
4352 -69 11 -6 94 -22 46 -83 200 121 -517 239 -130 -192 -103 -15 -142 127 95 38 -135 120 -19 32 -80 -329
4376 -329 -63 -184 81 -44 -257 -10 157 -21 14 -62 98 -96 18 -216 -42 -47 -68 -118 141 -14 -175 103
4398 103 -24 280 333 -110 -138 -171 190 -110 22 -281 -10 153 -67 11 197 143 105 88 -120 -77 75 120 130
4421 130 -25 36 -109 95 -346 24 -187 -99 119 -220 -238 196 -161 -30 -151 92 19 -80 6 -91 270 8
4443 8 -239 60 59 -105 304 -43 199 -137 17 -322 46 -69 84 -62 204 -128 70 10 -220 295 86 -51
4465 -51 -3 -69 31 276 91 80 -126 -49 143 -119 86 168 -99 54 3 -132 138 239 -224 -378 77 44 53
4488 53 -180 -2 316 -50 37 17 287 133 50 -172 67 -46 86 8 -123 7 333 107 61 -171 -226 -159 -23
4511 -23 -53 132 98 47 -60 11 -50 -51 -30 -293 177 -29 -221 218 110 -69 -137 -102 117 63 205 -89 -195 143
4535 143 -56 -413 190 12 44 98 -155 68 93 -207 -121 -42 134 -86 -238 5 55 90 -362 75 -67 20 -187
4558 -187 -63 36 424 88 32 80 -113 180 -48 -154 33 -220 10 -20 -135 134 13 -126 28 -274 -76
4579 -76 -63 54 42 -45 -358 193 -78 153 -206 -14 -21 -64 -242 -64 168 183 3 -115 7 -108 71 34 305
4602 305 39 -46 322 247 56 151 -39 -296 -65 -181 -102 123 -24 -27 101 -141 56 277 -71 -240 -275 34
4624 34 281 56 28 -89 -84 129 73 143 -47 118 -132 -184 117 -36 132 -93 -170 173 186 -130 -319 -148 16
4647 16 310 105 -173 -176 -52 -189 151 -237 -51 -7 -145 -278 -297 -119 -126 110 99 75 53 -111 -5 -115 -45 -41
4671 -41 185 15 -209 174 -63 -221 81 194 -114 135 -17 -89 -22 58 -64 -42 -56 -223 153 -112 106 -22
4693 -22 128 -66 -53 -134 -48 35 -209 -153 -188 -49 -174 -168 -181 18 136 -528 182 -106 69 97 28 -38 -26 -58 93
4718 93 -126 283 -196 -266 1 200 -114 -72 23 98 -19 97 70 322 85 68 -93 34 136 -101 225 -44
4740 -44 158 98 133 -8 135 -14 241 92 -307 -140 151 -57 139 -125 -40 54 42 -152 25 -73 350 -125
4762 -125 96 5 -36 123 -140 343 122 -133 -337 -182 31 15 -31 -80 303 12 166 161 46 -12 -348 -45 63
4785 63 46 -200 10 -136 32 -362 -100 392 -320 -102 130 -230 260 -251 -123 -206 -132 142 20 123 -288
4806 -288 98 65 -288 -59 -163 -107 -29 -173 82 -155 85 -187 53 -186 10 -350 113 47 -81 -40 88 -4
4828 -4 -46 -40 -68 -159 239 56 -58 248 -142 85 -128 -237 38 203 -67 82 -290 -64 20 -110 -40 -111 61
4851 61 130 264 -51 44 46 -116 234 -26 -126 -64 -187 -185 116 -222 22 -58 203 181 96 -153 -11 -48 -8 58 -37
4876 -37 6 87 16 115 254 -34 68 127 55 -88 -32 42 -139 291 194 -15 -171 -39 29 25 -137 -454 147 -273
4900 -273 -46 197 -34 -187 56 67 -21 20 34 248 119 -129 -35 -18 48 83 -27 -65 117 -95 272 33 -203
4923 -203 65 -107 204 126 -150 -85 -131 153 -125 16 -351 -42 141 -13 -81 243 -28 170 -130 -22 -52 -92
4945 -92 164 -54 -107 47 -310 150 -106 -42 140 -328 253 -55 77 -172 239 101 148 272 -183 -17 -161
4966 -161 30 -208 55 38 159 164 17 147 93 89 -267 -36 170 257 180 -199 -1 22 -384 232 128 87 -69
4989 -69 33 -32 -43 -81 211 130 63 -73 220 -71 -22 106 -143 124 164 -42 50 -134 15 -85 247 -84 38
5012 38 210 57 -210 268 20 49 118 3 30 -47 -18 -66 255 20 166 190 142 47 -6 -46 165 51 -96 268
5036 268 32 103 78 106 -86 243 21 186 -33 -191 177 76 294 -13 251 84 6 49 34 69 150 237 -85
5059 -85 133 213 165 -356 -103 -94 133 290 -119 140 216 145 -57 242 -117 106 26 62 -16 -239 -106 -121 8 208
5083 208 -104 235 27 -113 -41 10 9 -22 -81 -16 -74 15 139 -302 230 18 -44 228 12 37 -28 -200 126 -153
5107 -153 -154 -120 134 106 -167 -28 39 -194 -50 7 148 -86 48 -167 -14 40 140 -162 -67 153 -235 -133 22
5130 22 118 78 171 20 31 114 153 -233 146 -295 84 -33 0 5 -49 129 118 -56 92 -9 20 249 -27 80
5154 80 171 -52 46 -58 36 24 -130 266 84 15 66 106 -167 144 8 163 26 -11 0 -239 72 33 -49 -15
5178 -15 106 -58 86 12 -112 319 122 -214 136 167 13 -74 20 -123 26 -20 -81 -80 -34 -9 -126 97 242 -3
5202 -3 -373 167 284 -135 -61 184 -158 -178 -11 -50 -89 -71 -55 -121 13 104 -25 35 109 -65 80 -40 257 49
5226 49 -133 -201 43 -2 61 166 127 0 -110 127 -59 -96 216 -290 -159 -198 -44 -314 -270 -26 78 -236 -84
5249 -84 239 -43 113 -307 -168 -161 131 22 17 73 -47 66 96 69 -50 -118 100 -221 49 -37 -207 -115 -395 -48
5273 -48 165 41 -91 -30 -14 248 164 -146 52 -181 -169 -51 78 41 -116 150 129 -212 -218 8 265 174 205 69
5297 69 72 190 43 162 56 -49 -58 -44 131 66 -1 -46 -64 312 -190 181 -144 -66 221 -72 -235 166 -182 -23
5321 -23 84 121 84 316 147 22 -147 -178 -156 61 -368 -42 -219 164 225 -307 192 143 -195 -214 -130 195 157
5344 157 -109 -55 55 -30 -18 86 -45 92 7 306 85 165 76 -163 28 -102 7 -28 231 -95 -14 -217 11
5367 11 -359 42 -148 -98 -44 3 -83 130 -127 3 -32 111 -23 103 -8 105 -37 -13 21 215 4 145 -27
5390 -27 -53 164 235 229 -69 -55 -228 92 22 328 -9 -23 -297 -190 -33 -103 225 -102 -115 169 33 96 -5 124
5414 124 13 -88 -91 -201 -211 190 0 36 -156 193 -262 -58 -186 59 142 233 33 -130 151 -184 221 101
5436 101 -219 -107 -285 52 -232 -138 -118 -25 22 202 127 -31 160 158 -162 48 -240 -62 -135 -38 -238 -40 90
5459 90 351 95 28 86 56 -200 158 -66 -328 -112 -137 184 -128 -157 -195 194 -47 51 77 -29 -73 234 58
5482 58 -45 -215 -42 -38 -123 -9 50 125 -136 140 -63 -59 -256 34 51 252 -155 -17 215 13 -85 103 62 174
5506 174 252 75 8 -36 302 144 70 175 -60 14 -246 -62 -186 187 234 -16 -30 106 178 116 56 -164 240
5529 240 92 115 -162 -78 -360 175 24 -44 -173 -19 139 392 -68 132 -179 -210 -119 -312 216 -114 -3 -140
5551 -140 -126 150 186 107 -424 -95 -39 2 137 -72 -104 -54 -244 43 68 -325 -161 -113 -223 -85 26 24 78 -3
5575 -3 63 -37 -138 -244 -309 -15 -111 169 177 -12 65 -165 -196 49 -74 -24 70 37 -21 24 7 343 -123 -34 61 135
5601 135 78 -109 37 44 236 -109 128 -106 -79 -67 2 52 124 190 -205 -309 124 76 -80 69 -9 94 -129 1
5625 1 -18 9 -176 31 117 284 -142 -63 330 106 110 128 -83 59 137 -164 -247 10 -49 55 38 -4 -161 243 239
5650 239 0 218 -63 4 38 143 -80 -142 -64 230 -10 6 -70 74 -85 -243 -17 251 43 -151 -54 -83 -2
5673 -2 -160 86 -21 -180 260 18 -93 -111 -205 10 -109 -177 -20 86 270 77 7 62 -277 17 -184 155
5695 155 -230 84 -94 159 -161 38 395 88 -164 54 45 5 143 -349 -40 16 188 -6 189 -112 52
5716 52 36 101 152 -127 -135 -34 11 6 52 -69 101 -218 92 152 124 180 30 -20 194 205 -91 267 148 12 -130
5741 -130 -239 -121 -256 -138 -87 29 223 -62 115 -173 60 -68 -252 222 48 60 -225 -71 -296 -156 89
5762 89 -27 -153 -68 -116 -196 189 42 60 136 -62 121 -157 -8 378 6 -73 57 32 -111 -44 -101 19 -15 172
5786 172 91 -111 -12 187 -83 -140 -135 -206 25 67 206 -172 -17 413 76 -52 195 121 -9 -111 -212 -35 -69
5809 -69 -103 139 106 27 -130 8 24 60 6 161 -372 -186 21 137 133 -75 -198 -86 -43 -150 -27 -133 -178 -134
5833 -134 -378 -317 -139 -176 67 -53 -7 53 -283 108 -401 57 -278 5 -38 -44 57 -103 142 229 144 -153 108
5856 108 -56 -3 79 -20 170 135 10 42 139 -10 28 199 104 45 -119 -134 -20 -240 -350 160 101 63 172 14
5880 14 -24 43 185 91 120 -78 -95 113 -83 40 73 -120 -263 294 138 134 242 -268 -225 -89 16 -219 95
5903 95 -109 -15 -38 79 -40 62 -111 -144 -21 173 -204 -36 -249 -52 -21 300 264 28 82 196 72 98 -30
5926 -30 -30 -204 43 83 142 77 327 2 -6 -121 -53 122 -236 106 26 146 -68 -50 110 8 47 -94 -83 209
5950 209 -92 -21 -152 -163 -10 -71 124 -177 -180 40 -20 -197 -2 -140 -49 -67 92 79 63 174 257 311 131 95
5974 95 29 15 46 -168 -75 112 50 11 185 37 201 -247 85 -25 137 70 150 -62 -78 216 -184 -43 -45 -164
5998 -164 -365 -66 175 -373 -280 -173 -149 20 -42 58 250 -49 60 -32 -193 -96 -56 -232 -74 132 179 46
6020 46 -160 -160 -58 286 76 38 -89 1 -187 -77 65 139 -190 -224 -62 -155 -88 -162 172 -31 288 88 122 -39
6044 -39 57 -103 -126 224 186 -157 14 -186 -56 -28 -162 -22 113 203 72 8 -30 51 -334 -18 -155 -61 -54 232
6068 232 147 33 170 45 -280 -54 144 187 -119 15 -186 -38 -149 41 29 34 -90 73 6 -232 -152 -148 -182
6091 -182 -29 -220 119 -56 96 -152 -66 -208 121 -105 10 -44 132 203 -13 33 -111 -53 -68 -366 -75 27
6113 27 -46 84 186 38 -95 105 -56 -7 41 -134 -207 140 30 -54 -356 -51 -165 -51 107 -177 75 -130
6135 -130 216 -11 -120 -230 -250 -10 -126 62 19 15 164 -92 55 150 111 282 -121 123 121 97 -54 -198 127
6158 127 10 -127 -114 75 -198 -77 174 106 48 -12 -76 -254 150 120 -2 -122 114 242 94 -165 2 199
6180 199 -90 -34 -41 85 -138 100 9 311 -15 -184 -213 -279 194 129 -162 277 42 -81 18 -120 11 48 245
6203 245 -114 -62 95 58 -22 54 -72 112 138 -45 193 102 120 -69 57 100 163 -123 198 -65 -79 -75 -111 185
6227 185 -215 -152 -203 165 150 420 -25 -206 64 -139 -23 114 -78 132 57 -8 -57 399 -521 251 140 -66
6249 -66 -245 67 165 113 -34 206 142 -169 36 265 117 66 -130 -64 154 -63 -31 -103 -145 -313 21 92 -196
6272 -196 -453 -201 84 138 -22 137 -37 77 -118 -170 -258 -35 -29 167 -31 -62 -53 89 16 8 241 34 35 14 -168
6297 -168 10 371 -386 -167 -91 118 -146 42 -240 124 6 -241 165 -246 134 -154 101 -111 -159 299 19
6318 19 -22 -108 30 -44 142 172 14 179 394 -226 6 17 164 -85 -54 204 -127 235 54 -132 130 -172
6340 -172 -22 -43 -42 198 -53 19 33 -139 -27 24 -164 199 131 -280 -119 -295 34 71 -115 -20 -151 230 -54
6363 -54 205 25 -197 9 327 -182 -85 -188 20 153 61 -297 -109 -59 -82 -114 -87 233 -93 22 18 -58 -167
6386 -167 22 87 -76 -117 92 10 142 182 -38 32 -348 71 -114 45 -35 -183 4 -294 45 36 64 83 54 -245
6410 -245 162 -54 -10 9 -92 -99 147 -277 29 127 165 121 -149 -144 108 69 -259 30 -32 -191 -36 17 -120 203
6434 203 26 -85 -142 -82 123 12 -117 7 41 220 104 -23 -25 45 -77 215 110 -155 130 32 23 -368 -53
6457 -53 -185 13 -79 -63 120 19 -95 -142 -52 142 12 175 -120 18 71 -80 -66 39 -16 150 49 306 111
6480 111 276 160 -115 52 -137 163 -107 -128 -104 79 130 -13 118 134 133 -57 67 132 8 82 20 -55 -217
6503 -217 161 -94 -164 53 134 1 -101 206 -216 -278 133 -121 89 -18 160 -131 98 354 -33 84 360
6524 360 254 146 88 -195 11 185 -131 -37 29 48 71 -67 275 307 -232 -61 8 -293 9 40 17 178 121
6547 121 -147 -185 163 -143 152 78 14 70 76 -76 97 179 -387 120 -15 52 -255 92 215 -37 -198 -157 -10
6570 -10 47 35 -59 -190 65 33 -203 53 114 -225 210 -40 46 13 66 211 285 -87 -80 -45 156 50 56 -244 -92
6595 -92 -155 -71 -1 67 167 -4 62 91 21 157 124 -185 -223 -187 195 -264 -32 187 36 -25 195 66 -140 -61
6619 -61 -210 285 61 -121 120 -2 -334 -64 -89 -105 -40 152 -226 -23 -45 28 182 74 197 239 -93 91
6641 91 -22 196 152 210 -84 63 -100 10 171 -203 -190 -170 -2 -7 319 26 42 -50 120 128 119 170 -167 77 109
6666 109 99 -114 -75 -58 -72 -140 13 -74 17 -197 -40 241 -56 -172 -318 -140 -6 71 144 -42 47 -61 36 -170
6690 -170 108 -168 -85 34 2 -276 -23 114 209 305 -184 -187 -143 -274 -73 -260 -162 148 25 356 42 343 96
6713 96 176 -165 -77 169 -162 121 145 57 142 21 -3 -157 151 4 -31 41 26 338 17 17 179 -131 -109 -34 -278
6738 -278 -80 -99 31 -6 -159 -5 -45 -125 37 -64 388 103 72 -56 128 134 -44 -222 239 327 -49 167 -28
6761 -28 -7 51 -134 -251 97 -14 -82 20 -139 -194 21 188 124 -59 -108 -159 -216 8 102 -102 -23 112 443 -32
6785 -32 -16 161 232 -263 -74 92 -82 104 146 -18 -29 -24 -117 17 -249 -69 61 -104 35 183 -44 0 59
6808 59 -150 -114 124 -149 195 -124 -14 109 -7 70 63 53 117 142 258 15 177 -64 73 -132 -251 78 -206
6831 -206 -118 68 -172 -142 -100 -141 170 -83 -68 -127 -159 -13 -37 -83 -204 -190 273 -179 237 159 -115 123 51 9
6855 9 134 38 136 6 58 -16 -38 133 28 -14 -108 92 -237 -172 -64 2 133 12 64 -297 26 144 56 -124
6879 -124 -5 250 114 171 21 -189 186 -271 -22 -26 -81 -137 -63 97 -20 148 143 -142 7 4 130 -35 -109 -22
6903 -22 -210 10 -175 -41 -92 16 153 -63 -183 215 -60 194 237 -87 113 95 45 139 -249 -50 -96 -5 -15
6926 -15 98 24 105 -125 -159 335 -17 55 -219 -14 -144 175 -46 70 -156 144 199 -82 -164 112 228 22
6948 22 -251 117 105 100 13 -238 93 197 -95 84 -197 126 -51 63 93 17 332 72 -136 58 38 12 -50
6971 -50 -35 -42 -329 -152 181 -42 -24 10 -126 -93 126 -63 119 -223 -170 119 -304 61 -21 -139 2 21 -89
6994 -89 -152 114 -233 -43 -152 -69 265 51 -23 -87 1 36 321 -173 -87 -23 -294 -289 170 149 -149 -100 122 -79
7018 -79 94 42 197 53 -17 -38 87 88 272 -129 185 101 -119 14 -161 -84 74 40 -116 -184 103 326 150
7041 150 3 48 -96 -22 67 191 287 157 -166 -246 -88 -36 -235 -34 -185 6 38 -64 175 -143 -22 90
7063 90 -33 -334 129 -353 308 -64 -4 -262 39 -197 -18 -89 43 1 8 78 56 49 -132 223 -161 -146 -108 -18
7087 -18 -226 82 141 2 122 -78 -190 74 -98 -56 -72 -65 -218 46 54 -101 -27 -98 -99 249 -122 -94 140 312
7111 312 133 -198 -111 -259 75 -225 -47 237 -185 -108 -104 51 -96 207 19 -44 -93 90 231 -92 -33 127
7133 127 -69 -71 187 -78 -51 88 53 254 231 80 103 118 -160 52 -31 95 378 -105 22 57 -178 234 154
7156 154 -8 94 -2 -140 54 -67 -161 289 -108 -145 -363 97 44 19 -27 -220 43 -40 69 -366 -16 -159
7178 -159 170 1 -160 -100 55 -240 162 67 -70 22 -109 175 -7 84 42 -99 179 11 21 -35 -91 179 -189
7201 -189 -48 8 55 194 -135 220 -25 41 157 94 6 -168 112 28 69 167 170 61 96 -17 1 -61 -127 -60 -40
7226 -40 137 73 29 -77 -17 -2 -115 -37 331 215 -350 210 68 -107 -81 -18 -377 -103 -129 -146 -95 -39 26 -407
7250 -407 -13 -200 74 -93 1 67 -111 -109 -9 -64 -254 136 -32 -216 -51 -94 -11 148 -95 9 -378 -203
7272 -203 63 169 -72 -109 -257 8 -150 169 336 -3 -34 -129 -58 138 -99 -48 31 20 -117 366 -92 -47 14
7295 14 160 21 -185 49 28 -163 98 117 39 148 188 58 -180 -69 -266 118 -25 58 58 111 33 124 -8 -112
7319 -112 130 -343 -180 -193 -22 238 -111 91 -169 -114 133 -180 -186 27 -89 77 -57 19 -31 -449 -77 -17
7341 -17 -14 159 -61 267 142 -6 -22 210 -39 -150 131 -211 -320 -106 -63 -114 191 -364 117 -93 -22 187
7363 187 -215 -182 10 -82 72 236 30 10 -82 31 18 -158 -60 135 -197 -8 136 -95 119 -194 -255 -125
7385 -125 -46 95 -117 -195 -106 69 87 -62 -120 157 -136 145 146 63 -136 29 -65 -240 -83 7 -73 -44 -181 95
7409 95 59 -40 -152 -209 -231 340 -278 -94 102 -163 -255 26 398 -83 -47 -122 -208 -59 -206 -312 -93 19 282
7432 282 206 -275 -95 181 223 259 102 95 33 115 -3 -56 138 60 -149 69 62 174 -211 -61 24 -67 181 -62
7456 -62 69 -108 -370 8 -65 55 10 62 -17 108 -29 -100 52 286 -210 76 8 -60 286 -203 -33 72 130
7479 130 -128 -55 121 -163 -105 -34 -146 -72 99 60 -112 177 54 -242 -112 -220 -269 48 159 288 57 108
7501 108 160 230 -169 201 49 1 -191 -70 -63 81 38 -102 63 -38 -42 -39 68 16 91 158 -53 -230 23 71 129
7526 129 26 5 127 -116 -52 66 -127 -61 129 -26 -581 -271 23 -62 -107 -142 105 -4 243 -239 -376 62
7548 62 239 -157 -189 -27 -190 48 374 145 -121 -57 62 -109 -2 -7 -112 140 -17 48 -62 22 -21 -230 -65
7571 -65 -79 -87 -69 -277 66 -31 -169 205 57 265 -40 67 -274 -62 -11 -35 -57 -85 -302 -116 114 -61 121
7594 121 341 -189 -122 -238 -61 50 91 -170 -244 41 -35 48 -92 -2 -41 -52 -182 -40 -173 -122 -56 112 -182
7617 -182 -88 27 -91 -123 126 31 48 -195 41 -19 -27 119 -49 -38 -175 -25 12 -18 -180 160 -227 102 109 -19
7641 -19 96 46 86 51 -102 -162 104 -4 29 65 147 35 -78 -161 -88 15 204 140 141 -191 216 47 -147 -19
7665 -19 -155 -163 -30 181 7 -72 -2 -22 91 74 92 -165 137 -139 86 -131 -105 71 67 -71 59 84 76 25 -161
7690 -161 118 -96 -174 -148 142 76 -16 -126 32 -120 -223 -176 28 -48 42 -46 155 256 252 25 -122 77 -87
7713 -87 -229 -89 15 -88 -25 40 39 118 374 6 251 263 112 -146 -63 110 -43 148 200 -152 -259 69 67 -255
7737 -255 39 43 25 226 78 306 185 75 -28 9 -138 -31 28 147 148 -115 137 77 -87 99 -14 1 -20
7760 -20 -37 228 114 103 -28 92 409 -36 -12 232 -4 -118 -101 25 134 80 -70 -9 -40 68 150 -32 78
7783 78 173 54 60 19 262 -28 223 -126 -53 79 -181 -61 -14 30 -57 -109 33 -67 -106 41 -280 -22 -81 215
7807 215 60 40 -57 126 -171 -168 62 -118 -72 -155 77 -72 -82 7 217 -53 220 40 -297 172 47 47 -242
7830 -242 147 -145 -100 121 -47 -89 -84 200 -45 -110 -62 56 76 49 -263 -75 -219 42 233 -6 -265 -63 -110
7853 -110 50 128 150 -1 -20 -90 -62 44 -25 -63 37 27 -201 96 -49 64 48 98 51 73 -198 23 14 23 -164
7878 -164 19 180 111 -34 -317 40 161 310 -18 -136 -7 324 -133 -309 59 -21 -168 -110 -13 -67 -248 78
7900 78 29 146 265 254 69 -5 281 -226 -43 -189 -25 2 -207 -302 30 210 -107 398 -249 71 -101 23
7922 23 90 -33 -37 88 -1 -105 88 219 -11 270 -47 251 0 51 -187 179 192 -92 217 -49 -257 -123
7944 -123 -288 -32 204 10 -43 -150 -47 -61 -116 -35 -154 -200 59 -89 -10 -76 36 120 -74 -129 189 123 -160
7967 -160 -169 -160 104 259 -107 124 -206 -214 39 -233 -3 237 -4 -14 160 -112 -75 -7 -24 -227 -128 62 -262 124
7991 124 -31 -292 32 -23 -75 315 -6 -12 -45 77 271 123 -134 -44 -178 -232 -157 -82 96 64 -37 165 -15
8014 -15 -266 295 -149 86 7 -274 134 -171 21 281 96 -29 -49 91 -137 -85 68 56 40 114 -195 54
8036 54 -174 334 3 38 227 -167 -242 -251 -98 -24 -45 -27 162 -116 -144 -160 -102 -36 86 -96 -96 -93 164 199 243 104
8062 104 112 190 141 23 17 83 58 -37 -146 131 -210 -70 -62 53 -80 73 -225 -176 201 37 -167 11 90 32 -37
8087 -37 39 209 43 -219 -333 62 248 -314 -151 -271 116 -206 274 109 106 -54 123 23 -125 -85 219 41
8109 41 -322 -40 -205 -73 208 57 185 124 -179 -12 -149 88 286 71 -149 178 -6 -76 172 23 137
8130 137 166 -64 53 -95 88 92 65 166 -92 39 -133 102 -326 50 -146 -45 186 129 -22 16 97 179 -98
8153 -98 11 -93 -305 55 -115 -41 -96 -107 -21 17 -4 236 -211 -145 192 67 43 -34 104 27 266 45 -32 -228
8177 -228 2 -99 -40 21 -190 -4 -77 -128 44 -153 -113 176 -90 -93
8191i3
##END NTUPLES=NMR FID
##END=
