##TITLE=1H_DE-98_oil
 200.13MHz,CDCl3,
 8 sc
 
 27.6.2025
##JCAMPDX= 6.0         $$ Bruker NMR JCAMP-DX V2.0
##DATA TYPE= NMR FID
##DATA CLASS= NTUPLES
##ORIGIN= UXNMR, Bruker Analytische Messtechnik GmbH
##OWNER= pz
$$ XWIN-NMR		Version 3.5
$$ Fri Jun 27 14:09:36 2025 Russian Standard Time (UT+4h)  she@DPX200
##.OBSERVE FREQUENCY= 200.1313
##.OBSERVE NUCLEUS= ^1H
##.DELAY= (6, 6)
##.ACQUISITION MODE= SIMULTANEOUS
##.ACQUISITION SCHEME= undefined
##.AVERAGES= 8
##.DIGITISER RES= 18
##SPECTROMETER/DATA SYSTEM= spect
##.PULSE SEQUENCE= zg30
##.SOLVENT NAME= CDCl3
##.SHIFT REFERENCE= (INTERNAL, CDCl3, 0, 14.3821)
##AUDIT TRAIL= $$ (NUMBER, WHEN, WHO, WHERE, WHAT)
$$ ##TITLE= Audit trail, XWIN-NMR		Version 3.5
$$ ##JCAMPDX= 5.01
$$ ##ORIGIN= Bruker BioSpin GmbH
$$ ##OWNER= she
$$ F:/spectra/data/she/nmr/H-C/1/audita.txt
$$ ##AUDIT TRAIL=  $$ (NUMBER, WHEN, WHO, WHERE, WHAT)
(   1,<2025-06-27 14:08:05.14 +0400>,<she>,<DPX200>,
      <created by zg, POWCHK disabled, PULCHK disabled
       configuration hash MD5:
       00 E9 B6 7A A2 85 ED C7 34 08 36 98 17 FE 4E 26
       data hash MD5: 16K
       33 10 90 AE CB 69 38 A1 92 B3 28 F0 0C 03 38 4A>)
$$ ##END=
$$ 
$$ hash MD5
$$ AC A0 4D 85 83 C9 B7 CC 4D 24 2E E0 22 2F 81 DF
##$RELAX= 
##$RELAX= 
##$RELAX= 
##$RELAX= 
##$RELAX= 
##$RELAX= 
$$ Bruker specific parameters
$$ --------------------------
##$DU= <F:/spectra>
##$EXPNO= 1
##$NAME= <H-C>
##$PROCNO= 1
##$TYPE= <nmr>
##$USER= <she>
##$AMP= (0..31)
100 100 100 100 100 100 100 100 100 100 100 100 100 100 100 100 100 100 
100 100 100 100 100 100 100 100 100 100 100 100 100 100 
##$AQSEQ= 0
##$AQ_mod= 1
##$AUNM= <au_zg>
##$AUTOPOS= <>
##$BF1= 200.13
##$BF2= 200.13
##$BF3= 200.13
##$BF4= 200.13
##$BF5= 200.13
##$BF6= 200.13
##$BF7= 200.13
##$BF8= 200.13
##$BYTORDA= 1
##$CFDGTYP= 0
##$CFRGTYP= 5
##$CHEMSTR= <none>
##$CNST= (0..31)
1 1 145 1 1 1 1 1 1 1 1 1 1 1 1 1 1 1 1 1 1 1 1 1 1 1 1 1 1 1 1 1 
##$CPDPRG= <>
##$CPDPRG1= <>
##$CPDPRG2= <>
##$CPDPRG3= <>
##$CPDPRG4= <mlev>
##$CPDPRG5= <mlev>
##$CPDPRG6= <mlev>
##$CPDPRG7= <mlev>
##$CPDPRG8= <mlev>
##$CPDPRGB= <>
##$CPDPRGT= <>
##$D= (0..31)
0 0.7 0 0 0 0 0 0 0 0 0 0.03 0 0 0 0 0 0 0 0 0 0 0 0 0 0 0 0 0 0 0 0 
##$DATE= 1751018884
##$DBL= (0..7)
120 120 120 120 120 120 120 120 
##$DBP= (0..7)
150 150 150 150 150 150 150 150 
##$DBP07= 0
##$DBPNAM0= <>
##$DBPNAM1= <>
##$DBPNAM2= <>
##$DBPNAM3= <>
##$DBPNAM4= <>
##$DBPNAM5= <>
##$DBPNAM6= <>
##$DBPNAM7= <>
##$DBPOAL= (0..7)
0.5 0.5 0.5 0.5 0.5 0.5 0.5 0.5 
##$DBPOFFS= (0..7)
0 0 0 0 0 0 0 0 
##$DE= 6
##$DECBNUC= <off>
##$DECIM= 32
##$DECNUC= <off>
##$DECSTAT= 4
##$DIGMOD= 1
##$DIGTYP= 9
##$DL= (0..7)
0 120 120 120 120 120 120 120 
##$DP= (0..7)
150 150 150 150 150 150 150 150 
##$DP07= 0
##$DPNAME0= <>
##$DPNAME1= <>
##$DPNAME2= <>
##$DPNAME3= <>
##$DPNAME4= <>
##$DPNAME5= <>
##$DPNAME6= <>
##$DPNAME7= <>
##$DPOAL= (0..7)
0.5 0.5 0.5 0.5 0.5 0.5 0.5 0.5 
##$DPOFFS= (0..7)
0 0 0 0 0 0 0 0 
##$DQDMODE= 0
##$DR= 18
##$DS= 0
##$DSLIST= <SSSSSSSSSSSSSSS>
$$ [...]
##$SUBNAM0= <"">
##$SUBNAM1= <"">
##$SUBNAM2= <"">
##$SUBNAM3= <"">
##$SUBNAM4= <"">
##$SUBNAM5= <"">
##$SUBNAM6= <"">
##$SUBNAM7= <"">
##$SUBNAM8= <"">
##$SUBNAM9= <"">
##$SW= 18.0517328524113
##$SWIBOX= (0..15)
0 0 2 0 0 0 0 0 0 0 0 0 0 0 0 0 
##$SW_h= 3612.71676300578
##$TD= 16384
##$TD0= 1
##$TE= 0
##$TE2= 300
##$TE3= 300
##$TEG= 300
##$TL= (0..7)
0 120 120 120 120 120 120 120 
##$TP= (0..7)
150 150 150 150 150 150 150 150 
##$TP07= 0
##$TPNAME0= <>
##$TPNAME1= <>
##$TPNAME2= <>
##$TPNAME3= <>
##$TPNAME4= <>
##$TPNAME5= <>
##$TPNAME6= <>
##$TPNAME7= <>
##$TPOAL= (0..7)
0.5 0.5 0.5 0.5 0.5 0.5 0.5 0.5 
##$TPOFFS= (0..7)
0 0 0 0 0 0 0 0 
##$TUNHIN= 0
##$TUNHOUT= 0
##$TUNXOUT= 0
##$USERA1= <user>
##$USERA2= <user>
##$USERA3= <user>
##$USERA4= <user>
##$USERA5= <user>
##$V9= 5
##$VALIST= <valist>
##$VCLIST= <CCCCCCCCCCCCCCC>
##$VD= 0
##$VDLIST= <DDDDDDDDDDDDDDD>
##$VPLIST= <PPPPPPPPPPPPPPP>
##$VTLIST= <TTTTTTTTTTTTTTT>
##$WBST= 1024
##$WBSW= 4
##$XGAIN= (0..3)
0 0 0 0 
##$XL= 0
##$YL= 0
##$YMAX_a= 184241
##$YMIN_a= -211234
##$ZGOPTNS= <>
##$ZL1= 120
##$ZL2= 120
##$ZL3= 120
##$ZL4= 120
##$ABSF1= 10
##$ABSF2= 0
##$ABSG= 5
##$ABSL= 3
##$ALPHA= 0
##$AQORDER= 0
##$ASSFAC= 0
##$ASSFACI= 0
##$ASSFACX= 0
##$ASSWID= 0
##$AUNMP= <proc_1d>
##$AZFE= 0.1
##$AZFW= 0.1
##$BCFW= 1
##$BC_mod= 2
##$BYTORDP= 1
##$COROFFS= 0
##$CY= -3
##$DATMOD= 1
##$DC= 2
##$DFILT= <>
##$DTYPP= 0
##$F1P= 0
##$F2P= 0
##$FCOR= 0.5
##$FTSIZE= 0
##$FT_mod= 4
##$GAMMA= 1
##$GB= 0.15
##$INTBC= 1
##$INTSCL= 1
##$ISEN= 128
##$LB= 0.25
##$LEV0= 0
##$LPBIN= 0
##$MAXI= 10000
##$MC2= 0
##$MEAN= 0
##$ME_mod= 0
##$MI= 1.114404
##$NCOEF= 0
##$NC_proc= 0
##$NLEV= 6
##$NOISF1= 3.799351
##$NOISF2= 2.8
##$NSP= 1
##$NTH_PI= 0
##$NZP= 0
##$OFFSET= 14.38212
##$PC= 1
##$PHC0= -1197.556
##$PHC1= 8.39222
##$PH_mod= 1
##$PKNL= yes
##$PPARMOD= 0
##$PSCAL= 0
##$PSIGN= 0
##$REVERSE= no
##$SF= 200.129724274929
##$SI= 16384
##$SIGF1= 3
##$SIGF2= 2
##$SINO= 400
##$SIOLD= 16384
##$SREGLST= <1H.CDCl3>
##$SSB= 0
##$STSI= 0
##$STSR= 0
##$SW_p= 3205.1282051282
##$SYMM= 0
##$S_DEV= 0
##$TDeff= 0
##$TDoff= 0
##$TI= <>
##$TILT= no
##$TM1= 0
##$TM2= 0
##$TOPLEV= 0
##$USERP1= <user>
##$USERP2= <user>
##$USERP3= <user>
##$USERP4= <user>
##$USERP5= <user>
##$WDW= 1
##$XDIM= 8192
##$YMAX_p= 0
##$YMIN_p= 0
$$ End of Bruker specific parameters
$$ ---------------------------------
##NTUPLES= NMR FID
##VAR_NAME=  TIME,          FID/REAL,        FID/IMAG
##SYMBOL=    X,             R,               I
##VAR_TYPE=  INDEPENDENT,   DEPENDENT,       DEPENDENT
##VAR_FORM=  AFFN,          ASDF,            ASDF
##VAR_DIM=   8192,          8192,            8192
##UNITS=     SECONDS,       ARBITRARY UNITS, ARBITRARY UNITS
##FACTOR=    0.0002768,     1,               1
##FIRST=     0,             0,               0
##LAST=      2.2672688,     0,               0
##MIN=       0,             -211234,         0
##MAX=       2.2672688,     184241,          0
$$ Real data points
##PAGE= N=1
##DATA TABLE= (X++(R..R)), XYDATA
0@%%%%%%%%%%%%%%%qJ6j6J6j6K2l0L2l6M4m9N7p0P8q8J04j19J34j52J72j93K17
37A15k42K70l02L36l74M16m59N07n61O18o83P52q27R12j006J108j222J352j498
56g88J663j852K073k334K648l034L521m158N030o304Q347j2142K1527q9868j35563
71b11234J71675J37319k2434l6454P1541K1608o3517J1040J03851m2861j91036
82e0502r6366O3573L5187o8438n0208M2425K8006O44P6785J19404K0363n9062
94F1811p117O9508K5102o8588o1217j2047k7757l6951K983K3964j2058m1137K011
107h1493N0229J8603j8316J282K1846J7952J0397J7099K6876O004j2563N326P287
120G0529k0239l3764l1827j9861j8848k6845j1981N905Q537K2226L3103L1315
$$ plain form
0 0 0 0 0 0 0 0 0 0 0 0 0 0 0 0 0 -8 8 -8 8 -8 14 -16 16 -20 24 -25 32 -38 40 -48 56 -63 71 -81 91 -102 115
37 115 -127 143 -159 177 -197 219 -240 267 -294 324 -359 393 -434 478 -528 580 -642 710 -788
56 -788 875 -977 1096 -1238 1410 -1624 1897 -2261 2769 -3535 4812 -7330 14197 -75671 -211234
71 -211234 -39559 97760 75326 38872 110413 132021 68504 79544 183395 140534 -50502
82 -50502 -146868 -83295 -48108 -116546 -166754 -124329 -96323 -95679 -18894 100510 120873 61811
94 61811 54694 124202 149304 80716 19499 7452 -20305 -57256 -54273 -30309 -42367 -83504 -81493
107 -81493 -31264 -12661 -30977 -29695 -7849 10103 20500 37599 64475 70479 57916 63242 70529
120 70529 50290 16526 -15301 -35162 -54010 -80855 -92836 -86931 -78394 -56168 -23065 8250
132H250K9671J8949J4360J7812r24k1076k3464k2537k0996k4579k3965n724k736
145e6959q380R794K1564J3526Q077J0823J9461J1553n444N420J5163r24q599l871
159C1204n171p647j4245j1145p775k1669k0788l32Q888R422N112N896K1494K4943
173A8187J9572K0661P766j0323j0720p525n921j6200l3322k6670r125j077R334
186d5363P872J134P218J3873K3351K6717O628r871p172P39R198J520j5791j6639
200C414j3567o997P266L144j2966j6865q671R867J9114P171J918K449N342J9664
214B0283K2633Q206n790j6649j0527K393n336j7698k2640k1652o290Q760J2242
227c2065J1156K551K522K0422K3561J2171P69j0454r747k385j518k532j1446j9205
$$ plain form
132 8250 37921 56870 71230 89042 88118 67042 43578 21041 45 -24534 -48499 -54223 -56959
145 -56959 -65339 -55545 -33981 -20455 -12378 -1555 17906 29459 24015 29435 44598 43674 35075 31204
159 31204 26033 18386 4141 -7004 -14779 -36448 -57236 -57568 -48680 -39258 -34146 -28250 -6756 18187
173 18187 37759 58420 66186 55863 45143 37618 31697 15497 -17825 -44495 -53620 -54697 -45363
186 -45363 -37491 -36357 -29139 -15266 8085 34802 41430 31559 24387 25126 34324 35844 20053 3414
200 3414 -10153 -17150 -9884 -6740 -19706 -36571 -45242 -35375 -16261 -9090 -7172 -4723 619 20283
214 20283 42916 51122 45332 28683 18156 20549 15213 -2485 -25125 -46777 -53067 -44307 -32065
227 -32065 -20909 -18358 -15836 4586 28147 40318 41087 30633 20886 18501 16983 14451 3005 -16200
241a6200p925L706M529L291m833m840L957O569J0102Q087k856k337N024Q827J1041
256B6142K020o216k482n114o716l520r683j4801j2026n662O303P494L277R518
270a1466J2138R488J1808Q654L447k015j0244p860l284j0019j0640o679n966j613
284b4251O7N050J2033M315j542N511O210L349J876j603m65l508m380N303M542
299A2507n157p369m151m94J971n197m889k753m718K696J0674Q501L856j838L123
314F762J2707N655k950n247j0435r328k586j037j520q531j0859M233J3024R370
328g42N851j163j59N725N188M567j606j3361j0128J35N256M013o065q987J3L907
344g556N960N709l884o934k617M108J0149N124n687m116J294N274P263j107o792
$$ plain form
241 -16200 -24125 -20419 -15890 -12599 -17432 -22272 -18315 -11746 -1644 6443 3587 1250 6274 15101 26142
256 26142 28162 21946 19464 14350 7634 4114 -5569 -20370 -32396 -38058 -31755 -24261 -20984 -11466
270 -11466 672 10160 21968 30622 34069 32054 21810 13950 10666 647 -9993 -16672 -22638 -24251
284 -24251 -24184 -19134 -7101 -2786 -4328 1183 7393 10742 12618 11015 10550 7042 2662 7965 12507
299 12507 7350 -19 -4170 -4664 -2693 -7890 -12779 -15532 -20250 -17554 -6880 1621 5477 3639 6762
314 6762 19469 25124 22174 16927 6492 -2836 -5422 -6459 -7979 -16510 -27369 -23136 -10112 -742
328 -742 5109 3946 3787 9512 14700 19267 17661 4300 -5828 -5693 -437 3576 -2489 -11476 -11463 -7556
344 -7556 -1596 4113 229 -6705 -9322 -5214 4935 10059 4372 256 1550 6824 14087 12980 6188
359F188o490o204l42L492l030o996m641K187J1741P658J122J667J294K596N573
374A5815O99m616p940r575q58K497l064m175k470J707O146L184L539L836k387
389B338j024M915L175j127l769k712K520K58k868J32k756m673j726p1J764n06
405f130m685J840N612K555L759L151K375K142j169J278J968n974p006k763k800
420e847k658k106j389K557L83R03P226N035Q60N68q67K567J857k263m60j471n539
437f44k001J595J426r56o322l037L809R73J786K322k107j491J781N851P927M41
453A1353n576n50R93J135j07n603p092n802k733N519N890j739m067O2O489R332
469G504L673j444l427m963J397N881L72n831r054m993M617M547Q47j983m568o83
$$ plain form
359 6188 -302 -6506 -6848 -3356 -6386 -13382 -18023 -15836 -4095 3563 4685 6352 7646 10242 15815
374 15815 16514 11898 3958 -5617 -6475 -3978 -7042 -11217 -13687 -11980 -5834 -2650 889 4725 2338
389 2338 1314 6229 9404 8277 4508 1796 4316 4574 1706 1838 -918 -5591 -7317 -7388 -5624 -6130
405 -6130 -10815 -8975 -3363 -808 2951 6102 8477 10619 9450 10728 12696 6722 -284 -3047 -5847
420 -5847 -8505 -10611 -12000 -9443 -9060 -8157 -931 4104 4964 5532 4665 7232 9089 6826 6366 4895 -644
437 -644 -2645 -1050 376 -580 -6902 -9939 -6130 -5157 -3371 -1049 -3156 -4647 -2866 2985 10912 11353
453 11353 5777 5227 6220 7355 7248 1645 -5447 -11249 -13982 -8463 -2573 -4312 -8379 -8317 -1828 7504
469 7504 11177 9733 6306 1343 2740 8621 8993 3162 -5892 -10885 -6268 -1721 -874 -2857 -7425 -8108
485h108N466N433K917k161o860O95O514M827J316m776n092k09Q96J666o41p593
501e710n199N09L234M938J202k985J204L809M901N248r01l565k719j371R79o30
517B944o086l853j314j28L212J862n17N47O33L531M311l45p16M61r28R76J50j245
535C495j350l161j698J456j150j928q18j191P90P36M56L244K292J82L156L225
551G736R54k17k114j019j852m778k682j46l166j497j18P15M120J672J703L540
567B851Q36O67K187J136m76k601l481M11L17k455j107j747k206J018K83P00l57
584d024k268J485L848J830L017J103n99J930J860N07m19m791m699j638j280m92
600d630k309l905N08K399K793N570K636q90J234L188L940K67m821l142j588k113
$$ plain form
485 -8108 -2642 2791 5708 3547 -3313 -2618 3896 8723 10039 5263 171 -38 858 2524 1883 -5710
501 -5710 -10909 -10400 -7166 -2228 -1026 -4011 -2807 1002 5903 11151 10250 6685 3966 2595 3574 2944
517 2944 -3142 -6995 -8309 -8437 -5225 -3363 -3880 -3333 -2700 831 5142 4797 4081 4542 3614 4590 4740 3495
535 3495 2145 -1016 -2714 -1258 -2408 -4336 -5154 -6345 -5555 -4819 -4363 -1119 1173 1355 4511 7736
551 7736 8690 8473 6359 5340 3488 -1290 -3972 -4118 -7284 -8781 -8899 -8184 -4064 -2392 -689 2851
567 2851 3687 4354 6541 7677 7201 4600 1119 1530 1847 -608 -1715 -3462 -5668 -4650 -4367 -3667 -4024
584 -4024 -6292 -4807 -959 871 3888 4991 4392 6322 8182 8689 8270 3479 -1220 -2858 -4138 -4630
600 -4630 -6939 -10844 -10336 -7937 -5144 426 3062 2172 3406 6594 10534 10801 5980 2838 1250 -863
616h63N47n68l448k172j727L054M213p32k869P12J961L525K190P25P24j937j129
633B206M211J916l655m522l210R33K62l515q10r04k471J909N353M124J287j901
649A213K889N635N4k775j811l107k877k097J54J018l845m054L471L903N30O66
665a033R28J454Q08K13K426J103l341j629J023J001j84l027j146N04k154j502
681d556J560n34j325n57J905M314J575j04K781J156j164K01n92m39k600m489j440
698d308n7j505j63N99R61J687J125K900L752j34j625Q04J39M49j568k218m60j735
716a357j256J385j30j817j626m45K184K094p56N21J066J074K668J825P67o48k735
733B814r22J925j922l411k698k367J29R02P15J575qL13L969L649J594m07k437
$$ plain form
616 -863 -316 -884 -4332 -6504 -8231 -5177 -964 -1696 -4565 -3853 -1892 1633 3823 4548 5272 3335 2206
633 2206 6417 8333 4678 156 -3054 -2121 -1859 -5374 -6184 -7088 -9559 -7650 -2297 1827 3114 1213
649 1213 4102 9737 9791 7016 5205 2098 -779 -2876 -2722 -1704 -5549 -9603 -6132 -2229 -1699 -1033
665 -1033 -105 1349 2157 2370 4796 5899 2558 929 1952 2953 2769 -258 -1404 -900 -3054 -4556
681 -4556 -2996 -3530 -4855 -5412 -3507 807 2382 2278 5059 6215 5051 5252 4660 4221 1621 -2868 -4308
698 -4308 -4365 -5870 -6033 -5434 -4473 -2786 -1661 1239 4991 4857 3232 4036 4175 4624 3056 838 378 -1357
716 -1357 -2613 -1228 -1358 -3175 -4801 -5246 -3062 -968 -1724 -1203 -137 937 3605 5430 6197 5549 2814
733 2814 1892 3817 1895 -1516 -4214 -6581 -6452 -5550 -4835 -3260 -3268 -2955 1014 4663 6257 5850 3413
750C413k65J181q45m90k273l748o45L99J067P75k577j556J788J615J919J410j118
767E0N74J654J553K571o27k425q63o79k62o38k959l415j204m50J982J789J9J136
785b194J550K596L761K75n62m73j514k39K27k431k225j875j544J073K92m55P75
802b963l22J230K489N56N33J74q56J389R97M2J69j038r34j03j038j103j100j874
820c752q56K84o2J720J030J87K020J963J318J298o07k59k36k431r15n87k296j460
838c641r50j57J369R21R08J840J29M23J662MP71n44k208L49O22r12K84j394j476
857b000M75j71N83M19j730l25J175M56J635P78p95R50Q78J132J377j869k012j237
875b81j206K26J28k082j177J06J352K474J260K78PJ77J494J888r16j485j728j553
$$ plain form
750 3413 3148 4329 3484 2994 721 -3027 -3672 -3273 -2206 -1431 -4008 -5564 -3776 -2161 -242 1168 50
767 50 624 2278 3831 6402 5775 3350 2487 1808 1546 908 -2051 -5466 -6670 -7120 -5138 -3349 -3330 -2194
785 -2194 -644 1952 5713 5988 5426 4953 3439 3200 3427 996 -1229 -3104 -4648 -3575 -3283 -3738 -2963
802 -2963 -3285 -2055 434 990 1523 1697 841 2230 3227 3269 3438 2400 1466 1363 325 -778 -1878 -3752
820 -3752 -4608 -4324 -4386 -2666 -1636 -1449 571 2534 3852 5150 4543 4284 4048 1617 702 115 -2181 -3641
838 -3641 -4591 -4748 -3379 -2458 -1550 290 419 842 2504 2508 3279 2735 527 876 1498 586 870 -524 -2000
857 -2000 -1525 -1696 -1113 -694 -2424 -2749 -1574 -1118 517 1295 500 1450 2328 3460 4837 2968 956 -281
875 -281 -1487 -1261 -1133 -3215 -4392 -4286 -2934 -460 800 1078 1085 1262 2756 4644 3728 2243 515 -1038
893a038M51L36j461j065p97p6K428R14K48o29n57J260J852K99N10o54j033Q65
911A853R11o43q93k628q30M23p23K95o70j290J335J822J812J309n58K3J719P14
929C981P3n81k744j406k85o32J76q97j909Q57J040Q19J656k95L07Q5M62K008P12
948C427j791J03J56n32L71j130r71q68j812J63R66m80l75l3N01K098R01Q38J678
967C210l51n31J023j65o94j293k180o22n78j046Q50J06o88N78J091J063J906l12
985A367M0M56q2Q40l0j040m39j289q60J394l84j161q23p56J71J543j47N55k51
1004h96k66J737J681Q29J54j419j26P99j088o67n66k383j136K05O93J323p27p15
1022b568J889J604J286Q15r20k42n31o82J490q07k693m55MO67N67r17J96L49p03
$$ plain form
893 -1038 -587 -251 -1712 -2777 -3574 -3650 -1222 -308 -60 -689 -1246 14 1866 2165 2675 2021 988 1853
911 1853 2764 2121 1228 -1400 -2230 -1807 -2530 -2235 -2905 -4195 -2860 -1038 774 2083 1525 1548 3267 3981
929 3981 4054 3473 729 -677 -962 -1594 -1418 -2315 -4224 -3367 -2327 -1508 148 -147 160 245 707 2715 3427
948 3427 1636 1739 1895 1363 1734 604 -367 -1235 -3047 -2884 -1918 -2398 -2773 -2806 -2305 -207 694 1532 3210
967 3210 2859 2328 3351 3186 2492 1199 -981 -1603 -2181 -3227 -2377 -2271 -2959 -2381 -1290 -227 1679 1367
985 1367 1407 1863 1781 2621 2591 1551 1112 -177 -1037 357 -27 -1188 -2011 -2767 -2596 -1053 -1200 -645 -896
1004 -896 -1162 575 2256 3085 3239 1820 1694 2493 1405 738 172 -2211 -3347 -3142 -2449 -1126 -1853 -2568
1022 -2568 -679 925 2211 3026 2106 1864 1333 651 2141 1334 -1359 -1814 -1810 -1143 -576 -1493 -1297 -948 -1651
1041a651J126J799n37r07K73J029J308n97q62N96q73p80N90n71j115j630n21J535
1059a788P00p78O77Q99O97J567J105N4K65k020l34P20r86j816j398m92Q30l61
1077b459R3J486l55j38J594J087P33j89o17Q01J92r61M66q17j270Mn24j45L84
1096f35j622l61P05l76O77Q24N33J135O23N57J539j20q12k78j022j105p37j822
1114b297J08n38o41N63N67L38J400K11R30J284jQ67N11j040m33m95p03j01r34
1133d04j038J76p62P1P32j000m6O90M70J323P77QJ123K49L01O60q46j005m75j539
1153e35k94j56j391n36m77m67J961J040M95R32Q5J238J680m96l83q97j218R2m37
1172B36o06n17j505N3Q32K03O3o9j71O33J298J80J059Np59O60N8L62n6j543r11
$$ plain form
1041 -1651 -525 1274 737 -170 103 1132 2440 1843 981 1577 704 -76 514 -57 -1172 -2802 -3323 -1788
1059 -1788 -1088 -1866 -1189 -290 407 1974 3079 3133 3398 1378 1044 1764 778 -1038 -2436 -2928 -2098 -2459
1077 -2459 -2366 -880 -1235 -1373 221 1308 2041 1852 1235 2036 2228 1267 1733 916 -354 -350 -874 -1019 -635
1096 -635 -2257 -2618 -1913 -2289 -1612 -788 -255 880 1503 2060 3599 3479 2667 2389 1367 262 -475 -2297
1114 -2297 -2189 -2727 -3368 -2805 -2238 -1900 -500 -289 641 1925 1924 2791 3302 2262 1829 1334 631 530 -404
1133 -404 -1442 -1266 -2028 -1957 -1225 -2225 -2271 -1581 -1111 212 989 997 2120 2369 2670 3330 2484 1479 1004 -535
1153 -535 -829 -985 -2376 -2912 -3389 -3856 -1895 -855 -360 572 657 1895 3575 3079 2696 1799 581 673 236
1172 236 -370 -887 -2392 -2339 -1507 -1304 -1241 -1310 -1481 -848 450 630 1689 1694 935 1595 1653 2015 1959 416 -495
1193d95K6r49K33n91j054R4M11J066J554N67k40J142J27P77N54j507o97p81r93
1212g56L90o90j069N5l49K86J206L04O82M43l39J050Q43m68j73m11m29Kj92k01
1232A84k28r93n97n2j84O35l47j67J116P30M24J372J52j68M62p68N19k50j563
1251B77o44o54j290J71k67l17J093m68J240J760J99O73M77o71P53l57l75j02j145
1270C53j179L17k63n49l68r48N30N32K50J340M35o32J000O68N98Q65j127l66J42
1289A598n60m93o44j043r97p36l48J208K70l79J313M05J246J224o6K16N53p19
1307B048m5J54j409p09j005m43l8o22k07M59k50P51P81K23R81KJ67R97K94m08
1327A721K62m78l37j42r93o43o34j069M63K7j06M27L48L53J304P50K17M32k37
$$ plain form
1193 -495 -469 -1418 -1185 -1776 -2830 -2736 -2325 -1259 295 862 622 1764 1891 2668 3222 1715 1018 237 -756
1212 -756 -366 -1056 -2125 -2070 -2419 -2133 -927 -623 59 502 163 1213 2056 1588 1415 1004 575 577 385 184
1232 184 -44 -1037 -1634 -1686 -1870 -1235 -1582 -1749 -633 97 521 1893 2045 1877 2339 1571 2090 1840 277
1251 277 -367 -1021 -2311 -2140 -2407 -2724 -1631 -2099 -859 901 1100 1773 2250 1579 2332 1975 1600 1498 353
1270 353 -826 -509 -772 -1321 -1689 -2637 -2107 -1575 -1325 15 450 -182 818 1486 2084 2949 1822 1456 1598
1289 1598 1038 545 -99 -1142 -2139 -2875 -3223 -2015 -1745 -2124 -811 -406 840 2064 1998 2214 2767 2048
1307 2048 2003 2157 748 39 -966 -1409 -1447 -2069 -2276 -1817 -2067 -1316 -535 -312 669 671 838 1835 2129 1721
1327 1721 1983 1505 1168 1026 33 -610 -1244 -2313 -1850 -1823 -1929 -1502 -1154 -801 503 1253 1470 1902 1665
1346A665KL36n75m85p57j437K06r2l09L69p08j2J413J10N91L77J8K32J39L98L39
1367A820q63o26J04n67J5J40r51k27j35n80J059L89j33J99l3N48J578l46K51j96
1387A446n93m02K78o41m76r61o10O57J8J32J129n33k7J060M78L03P72j017n42
1406D71N5j11J06o58p88r4n30N54J162o79j32M2J74Q46O39l58O12p15J4P99j00
1427A309q79j35j220o7L02m50K81m20n38Q77P14N45J049r27L22N84J4J19o8r16
1447D96n78j25m99J1l88n53K72K32L08Q81j87L44K60J14O80k09Q8J7k41m76Q0
1468E27o47l48m42l43K86m02J89K62M39kR15oM32M30m50M16L93n72m15k60j016
1489f14J82k30q20R9j48L85R54j53q4Q68j67L17M28MJ8Lm76J00k80k16k01o20
$$ plain form
1346 1665 1667 2003 1428 943 186 -1251 -1045 -1137 -1446 -1077 -1785 -1797 -384 -274 317 694 712 944 1083 1481 1820
1367 1820 957 331 435 -132 -117 23 -928 -1155 -1290 -1870 -811 -422 -555 -356 -389 159 1737 1391 1642 1446
1387 1446 853 451 729 88 -388 -1349 -1959 -1302 -1284 -1152 -23 -556 -583 477 955 1258 2030 1013 471
1406 471 526 415 521 -137 -925 -1019 -1549 -995 167 -512 -644 -602 -428 418 1057 699 1311 596 610 1409 1309
1427 1309 430 295 -925 -992 -690 -1140 -859 -1279 -1817 -940 -226 319 1368 441 763 1347 1361 1480 1412 496
1447 496 -82 -207 -706 -695 -1083 -1636 -1364 -1132 -824 57 -130 214 474 588 1268 1059 1147 1164 923 447 527
1468 527 -120 -468 -910 -1253 -967 -1369 -1180 -918 -479 -481 434 428 860 1290 840 1256 1649 1077 662 402 -614
1489 -614 -432 -662 -1482 -1383 -1531 -1146 -192 -345 -429 439 272 589 1017 1021 1039 1042 566 666 386 170 -31 -651
1511f51k34L7j52L05J15k86N27K97J59N98N5P4J50k27P8L0j158N3k11m14q2PK0
1534i10L07J71J31O12l90N60K36n30L86N0j38j29k44n27K95Q2j51J25o19J51K18
1555c14j16O79k7o61P03L00J64J7j00k96J87p53J88k39l82q2k77J83N85J07k00
1576c34M64K73J99M11J45l52k93o92K68L9m01l47n61M36M70j61L06l3m15M77N82
1597D81J25k06J59m47M68K46l94j39m31m51L74o6m49K15j009O07M56j76P12O9
1617A44P1M58K43J87L76r74l08o2m49J35o19m33L30j5K8M25J13k50M62R0O11J91
1639G54k24M52j88m22J96l31l13J84p78j7O58p88l2J67m59M66N82j38N12J70k00
1660B51P57R2P5K1o70k11m50l42M56n46m47L57l29L12M75M4L09M05n09P02L45
$$ plain form
1511 -651 -885 -848 -1000 -695 -580 -866 -339 -42 117 715 770 844 994 767 845 875 -283 -230 -441 -855 -937 -930 -910
1534 -910 -603 -432 -301 311 -79 481 717 187 573 623 485 356 112 -415 -120 -38 -189 -64 -683 -532 -314
1555 -314 -430 249 222 -439 264 564 728 745 645 349 536 -217 -29 -268 -650 -732 -1009 -826 -241 -134 -334
1576 -334 130 403 602 1013 1158 806 513 -179 89 128 -273 -620 -1181 -745 -275 -436 -130 -163 -578 -101 481
1597 481 606 400 559 112 580 826 432 293 -138 -589 -215 -281 -730 -515 -1524 -917 -461 -637 75 144
1617 144 215 673 916 1103 1479 505 197 135 -314 -179 -798 -1231 -901 -916 -888 -463 -350 -600 -138 -48 563 754
1639 754 530 982 794 372 568 237 -76 108 -670 -687 -29 -817 -849 -682 -1141 -675 -93 -231 281 451 251
1660 251 1008 1100 1175 1196 526 315 -135 -477 -21 -567 -1014 -657 -986 -674 -199 -155 154 559 50 752 1097
1681A097l26l24n76J45J59J1l45M0m71j58L66J45M8k21o95J066J05J7M94j80l54
1702D3N14j18J71K99j054q6l27O2K7j32j72Q7J46J87P61J01P5k06k03M13R1m67
1724B12j65k21K3j45j28J15J49k89K60N06o43M20N2k24L01j06j26Q0L0P4K84n45
1746h6K23l65j2K07m9n50K52J32K19M03k23L98jk64K54L14n66m28l3n38M69j92
1768d36k63L00l70J33O01L20Q2R1m91M03K11l36N38m70n99M26j73J07K12q62j61
1789g37K50o0J72K21p7K96l41L53P19Q0m41J01J40L1j30j76l06o60n08L22n9k
1811h12K52k94K97O01L50L16J95l46j10M07m74L71q13l12L50m15N7K30m94m4J1
1832f77K26L63J60n82L43L61j54P09j06K35j11k72M2K12r88m3l67l42Q4j0K64
$$ plain form
1681 1097 771 447 -129 16 175 186 -159 -119 -590 -748 -382 -237 -189 -410 -1105 -39 66 83 577 397 43
1702 43 557 439 610 909 -145 -231 -558 -496 -469 -601 -773 -686 -540 -353 408 509 584 378 175 588 679 212
1724 212 47 -174 -151 -296 -424 -309 -160 -449 -189 317 -326 94 146 -78 223 117 -9 71 101 175 459 -86
1746 -86 137 -228 -240 -33 -82 -632 -380 -248 -29 374 151 549 548 284 538 852 286 -142 -175 -713 -244 -436
1768 -436 -699 -399 -769 -636 -35 285 367 458 -33 370 581 245 783 313 -286 140 -33 74 286 -576 -737
1789 -737 -487 -547 -375 -154 -231 65 -276 77 796 876 435 536 676 707 577 401 95 -565 -1073 -751 -810 -812
1811 -812 -560 -854 -557 44 394 710 905 559 449 856 382 753 -60 -372 -22 -437 -380 -150 -644 -688 -677
1832 -677 -451 -88 72 -510 -167 194 40 749 643 878 767 495 537 749 -239 -282 -649 -991 -907 -917 -653
1853f53K47j6J87N21K92L67k17j05P1J29m96K57q50k95J31k96L66J62p15L54L68
1874a91k47N41L13j23m5l7K71L32k79m55M95m46j97P0m63K99m71j48L97J30J6
1895b38L67k46K92N85l48J54L51m64j80l0o57M39p23R9K05J09k0M94m37M69K94
1916E15l44K87j18j66M2l27M8l58K06m2K57m83J83J07Q6j07J43j55N72r6j51L52
1938D51k87K76J99m03m5n3n16K04k13m11M25m65K14N77k20K00O76j33K33K80n18
1959D71L17m87n06L06m26l18K19m73J11L33O0N72j99M8J13M06k15L05m3M0J62
1980G96l73j12K09o92n01K62m87K94O7k07L80L14l57L54P51k7rK57N2K6n46J16
2002E67p50j60n5n26Q4J30k05N23K3J2M38K55k91N22K74l98M57n25p0J56l25m3
$$ plain form
1853 -653 -406 -422 -235 286 578 945 728 623 694 823 327 584 -266 -561 -430 -726 -360 -198 -913 -559 -191
1874 -191 -438 103 416 293 248 211 482 814 535 80 575 129 -68 2 -461 -162 -633 -781 -384 -254 -238
1895 -238 129 -117 175 760 412 566 917 453 273 243 -414 25 -698 -599 -394 -285 -305 189 -248 221 515
1916 515 171 458 340 174 216 -111 -63 -421 -215 -257 0 -483 -300 -193 -107 -214 -71 -226 346 250 99 451
1938 451 164 440 639 236 191 138 -378 -174 -387 -798 -373 -838 -624 -47 -267 -67 609 476 709 989 471
1959 471 788 301 -205 101 -325 -643 -424 -897 -786 -453 -393 179 -20 28 141 547 332 637 594 634 796
1980 796 423 311 520 -172 -673 -411 -898 -604 -537 -744 -364 -50 -407 -53 698 671 662 919 971 997 451 567
2002 567 -183 -343 -398 -924 -840 -710 -915 -392 -369 -357 81 336 45 567 841 443 900 375 305 461 136 93
2024I3l98l54J62n1n8m7J4J02L03J99L44K74k35l4J88L9K3K6o85k04j6l09K24
2047d00l20M0%L09M41k9J57K10K00k61L30r5m05l4k05r7Q8k20J30r4o23N32p3
2070d19L54J51m09L19J67M03m1j53J31k95L34p52M6j66k18O8j19J64P2n3K70K23
2092G7k1M49M62n03L0k8j36k2l18m29K26k01j3J90m38K35R2K6O42K3k17O46j52
2115F20k58K94l92J42l29n36R1R2k25L7k60p3L19R7J49K73J52j90N24L32L19l36
2137H42k94j86l24k11p0l64q0K78m45q3M10j83M93K91R6L89j59L17K05k36J71
2158H57l50n34J89M9p28j4k37j59R7j74K95L05K33J23K50L35K5N14r1k17j72l47
2180B49J9mo77L2l05l39N03j21J18J07R4M71M6J23K97p7J11K4k73j42p1m1m54
$$ plain form
2024 93 -305 -659 -497 -548 -606 -653 -639 -537 -234 -35 309 583 348 314 502 541 564 590 -95 -299 -315 -624 -400
2047 -400 -720 -680 -680 -371 70 41 198 408 608 347 677 582 177 143 -62 -159 -71 -291 -161 -255 -878 -346 -419
2070 -419 -65 86 -323 -4 163 566 525 372 503 208 542 -210 -164 -330 -548 -480 -599 -435 -363 -416 -146 77
2092 77 56 505 967 464 494 466 330 308 -10 -439 -213 -414 -427 -237 -675 -440 -348 -322 320 343 126 772 620
2115 620 362 656 264 406 77 -459 -368 -276 -501 -464 -724 -797 -478 -381 -232 41 193 3 527 859 1178 842
2137 842 548 362 38 -173 -243 -607 -687 -409 -854 -937 -527 -710 -217 74 170 559 400 717 922 686 857
2158 857 507 -27 162 211 -517 -531 -768 -927 -830 -1004 -709 -404 -171 -48 202 537 562 1076 985 768 596 249
2180 249 268 264 -413 -381 -686 -1025 -522 -643 -525 -418 -324 147 193 316 613 536 647 671 398 256 185 144 -310
2203c10K05n57q8L10m2l1Q9k41P21kP4M51j45J48J70k61j21o2m21Pl4l78K96n42
2227g64j33O12O8j62M08J37j00M91J8prj07m1J61m76j55k11k19K1p3L39J43k56
2250c15K42J53L32rk07L4N64n92K2O2n62J66k27m2J05J56j88o1M7L72K61l56K98
2273B55N9l83N02p2r4j27j26j82J95m34Pj27k25L16K22J13R9J48J86J32J30j29
2295D65R6m04O8j56j79r8O3l31J94m6k85L54j41R9K08J53M0N97k08r7L1M5N6j96
2319C28l70k73J93m61J98k57M0K40l7L81j58K59K29K22qm5J19m36L02l49q3Ro21
2342e78L67n4m62J96P1p4N85n7K61K78k72k4J03K00j18K12o34J90l37j24L22q08
2364g57J15K49j52J79J42K81j2m5p6K81R7K3K02r8j51j25j82k64L44k70j06K58
$$ plain form
2203 -310 -105 -662 -750 -440 -482 -513 -424 -665 56 54 128 579 434 582 752 491 370 308 -113 -106 -140 -518 -222 -764
2227 -764 -897 -285 -217 -379 29 166 66 557 575 568 559 452 411 572 96 -59 -270 -489 -468 -541 -202 -59 -315
2250 -315 -73 80 412 403 196 230 794 202 224 286 -276 -110 -337 -379 -274 -118 -306 -367 -320 52 313 -43 255
2273 255 314 -69 433 361 267 140 14 -168 27 -407 -400 -527 -752 -436 -214 -101 -2 146 332 464 594 465
2295 465 561 157 225 69 -110 -208 -145 -476 -282 -328 -613 -259 -400 -301 -93 60 100 697 489 392 423 468 524 328
2319 328 -42 -315 -122 -583 -385 -642 -602 -362 -399 -18 -176 83 312 534 526 481 600 164 466 117 34 43 -578
2342 -578 -211 -265 -727 -531 -460 -534 51 -6 255 533 261 237 340 540 422 634 0 190 -147 -271 51 -757
2364 -757 -642 -393 -545 -366 -224 57 45 0 -76 205 302 325 527 429 278 153 -29 -293 51 -219 -325 -67
2386f7l14P7K17m8K28J64j70K15k47J48J64M4j40o3k16M5M3l16q3m9r6O31l20
2409a53j49K92j69L65n3j31J76q7K2K26l97j52J37l17L69k15m52O39K62j43P3
2430A43K12n18L32O1p1L50p46L94j57R4r5J81l91K87o9m09L56K65m21J48R1q9
2452e2N00r8m3k53j83L4q2L26l9m12o9J08K47p5J63k43J83K31j80j18L07p6k5
2475A51j40J40k67Q6m21K97l51K1L03p8K6K26J32rK25k43K84m7q2K33m85J06k98
2498a91J04m6j73r3L39k12l46P32j84N5J20N7K90j28K22p9j43k67k44k4p6N7K1
2521b09r3J49r6j23J37j6L28K34m09O53p4l24L13n23L77K96o66J50j47k63Q8j03
2543c21j08K87k30M6J73L37r1l6J71M31m50O6K31m60L2o3j43J97j66l73N08k43
$$ plain form
2386 -67 -381 -304 -87 -135 93 257 87 302 55 203 367 411 271 208 -8 37 80 -236 -319 -368 -464 167 -153
2409 -153 -302 -10 -179 186 133 2 178 91 113 339 -58 -210 -73 -390 -21 -236 -688 -49 213 70 143
2430 143 355 -163 169 230 159 509 -237 157 0 94 -1 180 -211 76 7 -402 -46 219 -202 -54 37 -52
2452 -52 448 350 307 54 -129 -95 -177 149 110 -302 -371 -263 -16 -91 72 -171 12 243 63 -55 252 176 151
2475 151 11 151 -116 -30 -451 -154 -505 -484 -181 -259 -233 -7 125 116 341 98 382 335 253 486 1 107 -191
2498 -191 -87 -133 -306 -399 -60 -272 -618 114 -70 -15 105 162 452 324 546 467 324 57 -187 -211 -287 -230 -209
2521 -209 -302 -153 -249 -372 -235 -251 77 311 -98 555 481 157 470 -53 324 620 -46 104 -43 -306 -218 -321
2543 -321 -429 -142 -372 -326 -153 184 93 57 228 659 209 275 506 46 78 15 -128 69 -97 -470 38 -205
2565b05M1k13L84p0R3R8J97O3j37o1J20k14j15r7J06k88J12o2J81k61qK65j3O2
2589b2q6K16j41M37j09L8o4k66J25m76N2K12l69k5M39j19J03L25r0m3R2k19K19
2612B29J52k02K4k91M6R4m23J81m1J12K19k87j65L70M5n1N19m42l1L48j69M9k28
2635E8j14J8K8l88L01k82O0K98l26L37K79p8K06K4j5M29l12l93O0j64Rl27j1J2
2659b91J02l08K03j21J26K48n9j16P16j65N8P0r2nq0j97K01k64j02q8n8j11K1
2682c12k9J11J67j32L92j22k01O43J38l32K20k7l98q8O0l39j76M4J1P9l31M47
2704a75j31J19J90ON0L70p6n1L15m34J84q8l44j65K11l72K04n8l71K71J26L33
2726A14k74K98K38l62M86k54J69j31Q2k41k44L61m71r9j88P6J14K51L7PQ6j05
$$ plain form
2565 -205 -164 -377 7 -63 30 128 325 388 251 190 310 96 -19 -116 -10 -298 -186 -248 -67 -328 -336 -71 -84 -22
2589 -22 -108 108 -33 404 295 333 269 3 128 -348 -296 -84 -453 -478 -39 -158 -55 270 180 137 229 10 229
2612 229 381 179 203 -88 -42 52 -371 -190 -231 -119 100 -187 -352 18 63 12 531 89 58 406 237 286 58
2635 58 -56 -38 -10 -398 -97 -379 -319 -21 -347 -10 269 191 397 421 406 835 523 130 190 26 35 -292 -303 -291
2659 -291 -189 -497 -294 -415 -289 -41 -100 -216 500 335 393 463 371 366 286 89 290 26 -76 -164 -222 -333 -312
2682 -312 -341 -230 -63 -195 197 75 -126 517 655 323 543 516 118 30 90 -249 -425 -381 -370 -291 -622 -175
2704 -175 -306 -187 3 9 59 429 353 302 617 183 367 279 -65 -230 -19 -391 -187 -245 -616 -345 -219 114
2726 114 -160 138 376 14 500 246 415 284 366 125 -119 242 -229 -328 -516 -440 -326 -75 -38 -31 55 -50
2748e0M47j31r7K06k4O1m2k23k01J70k21k80L31m2m04K86l8K22q4O1J95l0o7q2
2772c7j3Q4J6r2L88k52l44L29k99L29k37j65J59R5J2J18j13M01k72l0J14o4j14
2795A3j61K00m39L12J03j80J60k49O6L00J20n4J3qj53N9J94l16L08m38L11M5l67
2818a61j75lJ6J1J55K7J31J03Q7K09j09L29n05L5JJ91k86r2j72o3N2m30L48O3
2842b38J88j27M04j57J35J9J69q8j19J19k5j33n2j29k57L33m43M7K31L8n5k5k4
2865a89K81Oq2N01k23N1L26l45j35j47N8k96L54m77j54J97R9L9J73r8K48k21J7
2888a7M31k67L1J84l34L00j73L1j93r6j97J3N6l8J38k61J42p5J50K79j78K48j29
2911D5M16n66J10j52o1J41j15M30m68j60M04k44j56L5L34J78J63J9J12k42N9k7
$$ plain form
2748 -50 397 266 169 375 351 412 370 147 -54 116 -105 -385 -54 -96 -500 -214 -252 -30 -114 -53 142 112 45 -37
2772 -37 -50 34 50 -42 346 94 -250 79 -220 109 -128 -293 -134 -39 -27 91 -22 379 107 77 191 127 13
2795 13 -148 52 -387 -75 28 -152 8 -241 -175 125 245 191 204 196 43 102 296 -20 288 -150 161 206 -161
2818 -161 -336 -339 -323 -312 -157 -130 1 104 191 400 291 620 115 150 151 342 56 -36 -208 -271 -219 -649 -301 -238
2842 -238 -50 -177 227 70 205 224 393 305 186 305 280 147 95 -34 -291 42 -401 -354 -123 -85 -140 -165 -189
2865 -189 92 98 16 517 294 345 671 326 191 44 102 -194 160 -317 -471 -274 -175 -136 37 -61 187 -34 -17
2888 -17 414 147 178 362 28 328 155 186 -7 -103 -300 -287 -231 -269 -131 -392 -250 -325 -175 104 -74 174 45
2911 45 461 -105 5 -147 -208 -67 -182 248 -220 -380 24 -220 -376 -341 -7 171 334 353 465 223 282 255
2933B55j5l61R6o5r2J0J99l37O4J72k80L26n8o1L07r6K17j96R5k01K29j3o5p5
2957E5j38P8n30N41k17L56l7j2m0k3J64j75L79l01O2m07L75k08J34m20M57l03
2979b10ML58l70J51qK38j55K98qk57R6k25K25K06m75J54l14N2m6J09m7J1J34K31
3003A52L4p7J94K7l20M76q5j81J5jj97r1J90m81K69k09M9p6J57J09L28n4J81k37
3027A72J8J93j27j35R7j63j73K12k31q6K57k28K21k51J35p8J11R6L66l54J37K61
3049D50k69K69j53k55k58L07l3K0M5j68j78J50j73K57k65J87L53j10j18K01l7
3070B22q9Lk42N3r4p9J54k41q8K29r6K80k33J11K5k10L02M1l8K13k78K60q2j69
3094d6mn4j69K50j41j9R2k46J38k33M69J01l5j62J83l6j6j45K70k06Q2q1j99r6
$$ plain form
2933 255 240 -121 -25 -90 -182 -172 27 -310 -246 -74 -354 -28 -86 -147 160 64 281 85 180 -21 208 195 130 55
2957 55 -83 -5 -535 6 -211 145 108 96 56 33 197 22 401 100 162 -245 130 -78 56 -364 93 -210
2979 -210 -206 152 -218 -67 -75 163 8 306 298 41 137 -88 137 343 -132 22 -292 -240 -286 -177 -224 -213 -79 152
3003 152 186 109 303 330 10 486 401 220 235 234 37 -54 136 -345 -76 -285 -236 -312 -155 -46 282 228 409 172
3027 172 190 383 256 121 218 55 -118 94 -137 -223 34 -194 27 -224 -89 -167 -56 40 406 52 189 450
3049 450 181 450 297 42 -216 91 58 78 123 -45 -223 -73 -246 11 -254 -67 286 176 58 259 222
3070 222 133 136 -106 -53 -147 -226 -72 -313 -401 -172 -268 12 -221 -110 -85 -295 7 48 10 223 -55 205 123 -46
3094 -46 -50 -104 -273 -23 -164 -183 -91 -337 -199 -432 37 138 103 -59 124 88 72 -73 197 -9 73 -8 -207 -303
3118c03K92k31J49J2l89M92j8k9J42q8K05l28J63l7K44m65k1J27l24M34%j01N4
3141b0k62M19K2K9n1j93K37k59K10l9k69J29j06L53j70k51J74k44K51l4J8LJ57
3164A04n1r9K68j02J77l91M4N4k82J84M5O9K15l66q3K50r6M5L55j14j87J14k15
3187f2J37pK3k52J36q1K85j02j99P8l08J36L53k83K40J9q2K11J3N7l24J27J43
3210B58j2k06P3k31K6k81K24p8m9o2K50n3L22l43M38j95L19n7k49K68j56k96L48
3233B58n76O4L38k80l41M83N0l92M78l37L87k7J85lq0p8K6o5j13L28m36J33r2
3256i0j0o4n3J15L5l7k59N12j1N4J1j3J57r2J06l62J35n8k56J29j28J80n86L96
3280a89J11j51J74M24l84l3K82j45J66j46R6J12l77J5j77r3J99N6m6P8R4K1j50
$$ plain form
3118 -303 -11 -242 -93 -81 -470 22 4 -25 117 29 234 -94 69 32 276 -189 -210 -83 -407 27 27 -74 -20
3141 -20 -282 137 159 188 137 -56 181 -78 132 93 -176 -47 -153 200 30 -221 -47 -291 -40 -74 -56 -53 104
3164 104 53 -46 222 120 297 -94 -50 4 -278 -94 -49 20 235 -131 -214 36 -60 -15 340 226 39 153 -62
3187 -62 75 68 91 -161 -25 -106 179 77 -122 -44 -352 -216 137 -146 94 113 31 242 255 312 -12 115 258
3210 258 246 40 113 -118 -92 -373 -149 -227 -276 -338 -88 -141 181 -162 276 81 400 343 94 362 206 -90 258
3233 258 -318 -254 84 -196 -537 -54 -4 -396 82 -255 132 105 290 287 207 129 155 90 -23 305 -131 2 -90
3256 -90 -100 -164 -217 -102 -67 -104 -363 149 138 192 203 190 347 255 361 -1 134 76 -180 -51 -179 1 -585 -189
3280 -189 -78 -229 -55 369 -15 -48 234 89 255 109 205 317 -60 -45 -222 -315 -116 -60 -106 -28 66 87 -63
3303f3R5j0O1j22J07j30j3J30n2M5j94L51n59J79KN9o2MK82p7Q3K88om10n8J01
3329C1l2M0k28L35j94k40M94l63O1K10J8k4J35r9j0P0K5k2l9j34m3K84m56K05
3353B4p6j21Q5J27j42j00J89j72L22j52L93l5j49m01M54o15N44k57J23j68l2k80
3375d39M38j56j44o9M01J32l70K43p9J56J04N6k11L1o4%j46Jj5%p0k4J42J12k86
3400b57L61n4Ok30R9L26k66Q8J00J85n31K99l35K86k38j82L16k36J63Q0J29k47
3422a38M04k08k0N1r2j42K68p6n1j99M3J66K5Q3J0l55K11J74j11n7j0l02L91m
3446F1K10r0j1j27o5kJ36K3l18J71j62J84K1k1j15m0K81k13N00l33J1J86j17k01
3470c1p5P9o2j09L92l33k9J3JK11j88J91Q7l57K97j84L11l8m03L08k81P6J75r7
$$ plain form
3303 -63 32 22 83 -39 68 -62 -75 55 3 48 -146 205 -354 -175 -173 -114 -176 -172 110 33 116 404 398 -12 -70 31
3329 31 -1 39 -189 146 -48 -288 206 -157 -96 114 132 108 243 144 134 204 229 207 168 34 -9 275 -181 24
3353 24 -52 -173 -88 39 -103 -203 -14 -186 136 -16 377 342 193 -208 246 -369 175 -82 41 -127 -159 -439
3375 -439 -1 -157 -301 -370 31 163 -207 36 -43 113 217 273 62 93 29 29 -117 -116 -131 -131 -201 -225 -83 29 -257
3400 -257 104 50 56 -174 -75 251 -15 73 173 358 -173 126 -209 77 -161 -343 -27 -263 -100 -20 109 -138
3422 -138 266 58 38 89 -3 -145 123 47 -4 -203 -160 6 31 114 124 -231 -20 154 43 -14 -24 -326 65 61
3446 61 271 181 170 43 -22 -24 112 135 -183 -12 -174 10 31 10 -105 -145 136 -77 423 90 101 287 170 -31
3470 -31 -106 -27 -89 -198 194 -139 -168 -155 -154 57 -131 60 147 -210 87 -97 214 176 -227 81 -200 -124 51 -46
3494d6O8J11M8j39J61l21J76K3j08N0J82k61P0j89j11L38k62P3M1j7K12J19k99
3517h1K08o6R6K00k55O5j69k40L69p4J90k90J48l1j99q4j43K33m2K64k61K63j89
3540h8R1J69j5j56J17k1K97l02l29m7M00m81K21J06j55j14J82M2M1L7J88o7k09
3563i3M56m16L61m34j46N91m22N1j67K35J6k34K04J14q6K2j13P7M2N6l3j12R9
3586F8J70l22NJ12N2j99k8L79n13K63K05l24K13j57K21jj47n1K70j31pK4j20m1
3610e9J30r8J68m7k96M06k43j52J58M0pR2j81K77k51k02M76j61k14J46q5J67k64
3633b00J85j55J99m6M1j80J60j20k4K82k90J29Oq2J71m4k59J27N0J54j37mK27
3656A90k4k65J73k45K99j90J66l18M95k59K15l55J81l0L8j48N3L07m26J65J49
$$ plain form
3494 -46 22 133 181 42 203 -118 58 81 -27 23 205 -56 14 -175 -286 52 -210 -137 -96 -113 99 218 -81
3517 -81 127 61 157 357 102 167 -2 -242 127 53 243 -47 101 70 -129 -213 -356 -123 -165 99 -162 101 -88
3540 -88 3 172 157 1 118 97 394 92 -237 -284 116 -365 -144 -38 -193 -307 -125 -83 -42 -5 183 116 -93
3563 -93 363 -53 308 -126 -272 319 -103 -52 -219 16 32 -202 2 116 30 52 -61 16 58 114 81 -31 68
3586 68 238 -84 -79 33 85 -114 -142 237 -276 -13 192 -132 81 -76 145 144 -3 -54 216 85 78 102 -18 -59
3610 -59 71 -27 141 94 -202 204 -39 -191 -33 7 0 92 -89 188 -63 -265 211 50 -164 -18 -103 64 -200
3633 -200 -15 -170 29 -17 24 -156 4 -116 -140 142 -148 -19 -13 -95 76 32 -227 -100 -50 104 -33 -37 190
3656 190 166 -99 74 -171 128 -62 104 -214 281 22 237 -118 63 33 71 -77 -24 283 -143 22 171
3677A71j30K15j43l29L21j3J0P9k13J3k14o0K05j7N5n1N6J68j54K20r1k21L01
3700A78j87P4j20K83j82j16J39J68j86j46m3J65R8N5k07M09l69PJ12J98l88L15
3722B57j67ON7K1k32J08j58j29K64M9j15K08k23J53l8Q0J4N3m99M36M6k70L19
3745B40l64n4J09K62j60N2j03L11o16J42L16k19J68j60K21k01K20j5K4l09K66
3766A30jr5m5P1j63k87N73k42k9K13r2j5J40k32J39L11k09K26n76J73m8q2N5K71
3790A86j30J6l42K35l0RPK67j3j90j55J86J3K00L0p6J6l24J51k8l82L78j96J14
3814e8J35k50L07N9k23Q9j27Q1o8P8Om1J36j68J68N5k68K05k88j15L27J82k15
3837Gm0j13j9L77j89j72P2m1J84j4J4j26O2n7J3K16m12M89k37P9q2m0J98P7k28
$$ plain form
3677 171 41 256 113 -216 105 92 102 181 -32 -19 -233 -293 -88 -105 -50 -101 -45 123 -31 189 98 -123 178
3700 178 -9 65 -55 228 46 -70 69 237 51 -95 -138 27 125 180 -27 382 13 20 132 330 -58 257
3722 257 90 96 153 174 -58 50 -108 -237 27 76 -39 169 -54 99 61 141 155 208 -291 145 191 -79 240
3745 240 -124 -178 -69 193 33 85 -18 293 -323 -181 135 -84 84 -76 145 -56 164 149 173 -136 130
3766 130 129 34 -11 60 -103 -390 183 -59 -88 125 33 18 158 -74 65 376 167 393 -183 -10 -58 -140 -85 186
3790 186 56 72 -270 -35 -65 -56 -49 218 205 15 -140 46 59 259 289 213 229 -95 56 28 -354 24 -172 -58
3814 -58 77 -173 134 193 -30 59 -68 13 -55 23 29 -12 124 -44 124 179 -89 116 -172 -287 40 222 7
3837 7 -33 -146 -165 212 23 -149 -77 -118 66 52 66 -60 2 -55 -42 174 -238 251 14 93 11 -29 169 246 18
3862A8r1J61l02K93k63K33M8k22L6j94K52m3J35k52K15Qk10K44k75N7K52k63K37
3885G4J66k06j99J23r6O6q1K28J41l71J18L0J82m7j79K1L15m30K29K4m6r0o5J73
3909H0J6l02J80J32l25J48L16j89O1Q3j39R2j63J06J86k80J59J09k53j18J53j37
3931h5KPK87o6j47J08J64m65L22m1k56QL21j72K5J20k34K57o0m09N09k53l3j6
3955a07j0J44o2O2J71N9l14L7j45L09Nk97K09L11m65k15K30oR8m3k79L24j77L46
3979A85j50JJ3J76k60n0j4K15k48K27l0R5k04p4j36K65K54n53R6J02J31m0q8q5
4003a72R6J22m4O6J07j53l14M83j90J67k86L39r3j47K3R5l1j7L0r8j44Q9L35n76
4027c13L29M7k13K00j45J84N3l54Q2K36J3kq6K8l1k9j45J07K8J8n6r2j7J75N4
$$ plain form
3862 18 -73 88 -214 79 -184 49 97 -125 -89 -283 -31 -74 61 -191 24 32 -178 66 -209 -152 100 -163 74
3885 74 240 34 -165 -42 -138 -72 -153 75 216 -155 -37 -7 175 128 -51 -30 285 -145 84 108 62 -28 -93 80
3909 80 96 -206 -26 106 -219 -71 245 56 117 200 61 153 -10 96 282 2 161 270 17 -101 52 -85
3931 -85 -83 -76 211 145 -2 106 270 -195 127 86 -170 -162 159 -13 12 132 -102 155 95 -314 195 -58 -91 -107
3955 -107 -117 27 -35 27 198 257 -57 -20 -165 144 149 -148 61 372 -93 -308 -78 -84 14 -29 -308 16 -161 185
3979 185 35 36 49 225 -35 -85 -99 116 -132 95 65 160 -44 -118 -254 11 265 -288 -192 -90 41 1 -87 -172
4003 -172 -76 46 2 68 175 22 -292 191 1 168 -118 221 128 -19 4 99 68 51 81 -17 -161 -72 263 -313
4027 -313 16 63 -150 50 -95 89 142 -212 -130 106 119 117 31 59 28 -1 -146 -39 -11 7 -49 -141 -158 17 71
4052G1q9m23N72l0n0k65J33J14N6N5M7k61K57k31n4j40L34k16J75K0r3Q4k1j34
4076h9O0QN9K61O9l63k14J11R6J94j06k11N6q9J40k7k46k7K96j9k1r4R3R4J46
4101A77n7q8p5j84M01j83N1J19q2j9j29O8l9j13l2PO5J32K36q2n1J29j10k06n4
4126a19R2L2j51n4K55N9j82r5Q1J68Qr7j51j4R9J63m8k29L73l56J3j30N0K69M3
4151G9J82m11J06j79J53J8M9O3l26M63j85L6j8O7J24l34J54j10K75j38j61J18
4173B5M8q4m4O0Pj39q9M39k21l91O84k78K3k26K44O2l82J24K12k66nM75n51L58
4197H5j12m9j25J32P3j73J87p4K15j33j65J18M4M5l1J73l48J09K22k98K15n5k0
4220C5j80K33j00j76K88l31J86J67M5r6l83M13Q9j09Q8k33n4J94n0n3L17m33K84
$$ plain form
4052 71 -18 -441 131 101 51 -214 -81 33 89 144 191 -70 187 -44 -98 -238 96 -120 55 75 -18 66 45 -89
4076 -89 -29 -21 38 299 368 5 -209 -98 -2 192 86 -125 -69 -158 -18 -45 -291 -318 -22 -41 -62 -156 -63 31 177
4101 177 120 32 -43 -227 174 -9 42 161 79 60 -69 -1 -40 -153 -185 -178 -113 19 255 173 122 251 141 -65 -119
4126 -119 -27 5 -146 -200 55 114 -68 -163 -82 86 94 -3 -154 -168 -69 94 46 -183 190 -166 -153 -283 -233 36 79
4151 79 261 -150 -44 -223 -70 -52 -3 60 -266 197 12 48 30 97 221 -113 41 -69 206 68 -93 25
4173 25 73 -11 -55 5 12 -127 -216 223 2 -389 295 17 40 -186 58 120 -262 -138 74 -192 -197 278 -273 85
4197 85 -27 -76 -201 -69 4 -169 18 -56 159 26 -139 -21 23 68 37 210 -138 -29 193 -105 110 55 35
4220 35 -145 88 -12 -188 100 -231 -45 122 167 71 -312 101 190 81 169 -64 -118 76 26 -27 290 -143 141
4243A41r5p5J60P8l29J65k74K68m13L66J60l32K07J26M4j50o6k5P0J8j95L25k41
4266f7J06p9k00K97j72O0n7R6R2nP8j30r8J20p3K59l46K31l61k0R5L43k80o5J04
4291g2j4L54l77R4J72m6m2lk77K66j4J26k93N0pJ91j9%l7q9J8j69R7J58j45O2
4317a6j08m2K55N5m41M0L44k0q9o3L4j99N48n56Q1K00Q1m1j47q7J95l07N64p2
4341B09k85L18j67J4l4Jl28L14J73k12Rj78J19o9Q0q3L23L3j10L2l6j32J04J5
4365A10P3j53J39k09R6n0J35r0k43J42J76k56L25k83J8K31j27L4k17J24n8l59
4387d42M27j85j15R5M11r4q7o0J45j22P7l5lM9j10j8L81k13p2j99K23mj9M5r1
4412a6j06J46j7O0j25r3J08N4n7J58J09j93L05n68J7J5l6L01k9k5j77L65J3k76
$$ plain form
4243 141 46 -29 131 209 -120 45 -229 39 -374 -8 152 -180 27 153 197 47 -19 -44 26 44 -151 174 -67
4266 -67 39 -40 -240 57 -115 -55 -112 -16 76 71 149 19 -79 41 -32 227 -119 112 -249 -269 -174 169 -111 -176 -72
4291 -72 -86 268 -109 -15 157 111 69 66 -211 55 41 167 -126 -76 -83 108 89 89 52 -37 -19 -188 -91 67 -78 -16
4317 -16 -124 -166 89 144 -297 -257 87 67 -22 -85 -51 -250 298 -258 -177 23 104 63 -84 -171 24 -283 281 209
4341 209 -76 242 75 89 55 56 -272 42 215 3 12 -166 -47 -116 -36 -119 204 237 127 159 123 -9 95 110
4365 110 183 30 169 -40 56 6 141 51 -192 -50 126 -130 195 -88 -70 161 34 68 -149 -25 -83 -442
4387 -442 -15 -200 -315 -220 191 97 10 -50 95 -27 50 15 12 61 -49 -67 314 101 29 -170 53 49 30 75 -16
4412 -16 -122 24 7 67 -58 -151 -43 11 -46 112 221 28 333 -235 -218 -203 -239 62 33 8 -169 196 209 -67
4436f7N8J92K38m56K15q5j95p2K76K9o0j11J9qp8K75l81J48K84l67K08J32k64
4459g0K37k24K30l22J51ll7o6J17J60o6M2j84J95m9j22nj9K88k94kK10j13N6l25
4484b15L03k09P8K70j46j08M8o7j29M63k59n8l8O6j53N10l80J89m6j56j27Q3r8
4507a79Q6J65n0L4q7K15l17K44k7k08K76k0j3k03O2PL0N6k1l3q3J04m09K28n7
4532b00J60K05j78pN4j38j15K32j95K56j8j13J0j91K82J60j91K38k54J30o7L1
4554I1K4O5l35K92N0l11J03M8J40o7j66J26K57q2J52m56K7J25Q8r8j1k8l5L8l9
4579bL9k25J02p0J94k4rK74m28k8P2R9k4j17M30k92J46k86L64k28J03n26K51J88
4603Ck7j36K78O2j76p3j81R8L01j59J92j64J33j23o6o3K18j12J0j32j19O18k81
$$ plain form
4436 -67 -9 183 421 -35 180 95 -100 -172 104 133 73 -38 -19 -27 -105 170 -211 -63 221 -146 62 194 -70
4459 -70 167 -57 173 -149 2 -1 -38 -104 13 173 107 149 -35 160 111 -11 -16 -35 253 -41 -43 167 54 110 -215
4484 -215 88 -121 -43 227 81 -27 21 -46 -175 288 29 -29 -67 -1 -154 356 -24 165 119 -37 -164 -81 -179
4507 -179 -93 72 22 56 -31 184 -133 111 84 -124 152 132 119 -84 -22 -15 15 71 50 17 -66 38 -371 -143 -200
4532 -200 -40 165 -13 -20 34 -104 -219 13 -182 74 56 -57 -47 -238 44 204 13 251 -3 127 60 91
4554 91 115 180 -155 137 187 -124 -21 27 167 100 -66 60 317 235 387 -69 -42 83 171 73 62 34 -1 37 -2
4579 -2 37 -188 -86 -156 38 14 5 279 -149 -177 -105 -6 -30 -147 283 -9 137 -149 215 -13 90 -436 -185 3
4603 3 -24 -160 118 180 4 -69 -250 -152 149 -10 182 18 151 28 -38 -101 117 5 15 -117 -236 382 101
4626A01j60r4K74k62K84k11L06k76m5J66k12L93l21P5r8K2N8q5K91j98m0j38J20
4649e0j53J76Rp5J15j49J85m3Qj15J79n09L29q9J0J25q4oL5O4m6L4l5O4K71q7
4675A63r2L0k6QK3J70l65K9r1k0K12J45j21k57K92r3k7J11j58j25L6M50l7l5m90
4700b68J18K33J76k97QK41Ql77J07n0J33P3M6J10m03k5J20p5P0P5K74l28J23r1
4724Ak79K36P3n9J37O6k72k7K9J84K27m27o7K2K33l84N04j67l4J42q5K27l57n9
4748a36N7L01n8j99L7J79p6Ql01L10Lq7l6K6j74J56n7l7n2M3l68M83J23m0l74
4773b69J63J03J47N9lj85J67l81K23J38j52j4J81k42l6M09n29J76O7J32k03l5
4795h4L00j64n1M5j02J17n8j68L9LL75l86p9K53j1L3p0J28L8K44k66k78J43k75
$$ plain form
4626 101 -59 -153 121 -141 143 -68 238 -38 -83 83 -129 264 -57 18 -80 -58 0 -85 206 8 -32 -170 -50
4649 -50 -203 -27 -18 -93 22 -127 58 15 23 -92 87 -422 -93 -182 -172 -47 -131 -137 -102 -38 -84 -50 -85 -21 250 163
4675 163 71 101 75 83 106 276 -89 -60 -151 -171 41 186 65 -192 100 7 -20 91 -67 -192 -156 294 257 222 -268
4700 -268 -150 83 259 -38 -30 211 219 -158 -51 -101 32 105 151 261 -142 -167 -47 -122 -52 23 297 -31 92 1
4724 1 -278 -42 31 -28 109 175 -97 -124 -95 89 316 -111 -178 -156 77 -307 197 30 -4 138 53 280 -77 -136
4748 -136 -79 222 164 -35 2 181 105 113 -188 122 125 38 2 28 -146 10 -47 -84 -136 -93 -461 22 145 105 -269
4773 -269 -106 -3 144 203 200 15 182 -199 24 162 10 -4 177 -65 -101 308 -221 -45 22 154 -49 -84
4795 -84 216 52 1 46 -56 61 3 -165 -126 -123 252 -134 -213 40 29 62 -8 120 158 402 136 -142 1 -274
4819b74J24j17M97Qk07N8k28Q3n7l9K49p1k28K72j32M1J9j6J7l6oJ32m2l1L0k93
4845b47K06j17K21n6Q6r4Q5L4k53K55j03K86k32j5K55j96j91K0J79k64K69j20
4867Hk5J40N6q4rJ08o5l79l5K24P6N1m8K8R5k81r2nJ55L05p1j31j0nn2J23j80
4894a03P4j40J31r5j64j02L56J19K1n27M54j88MM32p18M59J31J1m91M51j39k15
4916b39M38l27K21k21J31j02J61j58K31k35M7J71k21J22j93M07q2j89o4m0J95
4937E3j2r4j18K87j00j62P0k29M93j26M0k33J85j72pK73k24P2R3K5K4j86M6R3
4961I1l45J64J37j3j41J31J90l28K08J46j47J17m36K88j86K41J27j7m88L11l2
4982A8o9Q2k4j74K06j78K92l26K00l6J64l6m6j21J25K8k65K7J68k0n0q6J62j99
$$ plain form
4819 -274 -150 -267 230 238 31 89 -139 -56 -113 -152 97 26 -202 70 -62 -21 -2 -18 -1 -37 -43 89 47 16 46 -247
4845 -247 -41 -158 63 7 93 -1 84 118 -135 120 17 303 71 56 311 115 -76 -56 123 -141 128 8
4867 8 -17 123 179 95 86 194 129 -250 -285 -61 15 66 18 46 141 -140 -232 -237 -82 223 152 21 11 6 -46 77 -103
4894 -103 -29 -169 -38 -133 -297 -399 -43 76 97 -430 24 -164 -160 272 -446 13 144 155 -336 115 -24 -239
4916 -239 199 -128 93 -128 3 -99 62 -96 135 -100 -53 118 -103 19 -174 233 151 -38 -102 -142 53
4937 53 41 -53 -171 116 16 -146 -76 -305 188 62 102 -131 54 -118 -125 148 -76 -4 89 114 138 -48 -2 91
4961 91 -254 -90 47 34 -107 24 214 -114 94 240 93 210 -226 62 -124 117 244 227 -261 50 18
4982 18 -51 31 7 -167 39 -139 153 -173 27 -9 155 119 73 -48 77 105 -160 -133 35 15 -35 -121 41 -158
5006a58Q1M8r5l3N3J06k12N01j62k13lR9r0K59o4J0j28l5L6K14m52K80r6p7J98
5031F7j71k2J87J30l20J58L6l22M02j78L1L1P6p6k05J21J36o6j7r3J21p0N4q4
5055g4J89k26J83k25N5J6j53m7K40j41J50j27L90q2j58l8n4K02m6N8k28o9J93
5078Hl7J41l38K47k27L27j58j8J80Oj69J47J6m42J15M13j85J95k85k7K4o0N6k09
5102b80M55L9r3k68O8J64O3j41j81J11L42m49J97Jl50J33L37k34j53K10k57L15
5124B9r8P1O1o6l6K9J53j65pL3O6j19J77m2n4n7M7j32l7K65n1k8k28K78k90K51
5150E0K19k63O7n9j29K3r5K32j51J24J0l85M69k99k02M12J93k42M15n77J67P9
5172E8%j14j02M00k52k26L41l22o9M72m4j14k27K22n3R0j7j47M20n27k5J79j17
$$ plain form
5006 -158 -77 -29 -124 -157 -104 2 -210 291 129 -84 -87 12 -78 181 117 127 -1 -36 0 214 -238 42 -54 -131 67
5031 67 -104 -126 61 191 -129 29 65 -257 145 -33 -2 29 105 29 -176 -55 81 15 -2 -95 26 -44 10 -74
5055 -74 115 -111 72 -153 -98 -82 -235 -282 -42 -183 -33 -160 230 148 -10 -48 -102 100 54 112 -116 -185 8
5078 8 -29 112 -226 21 -206 121 -37 -55 125 131 -38 109 125 -317 -202 211 26 221 -64 -91 -67 -127 -71 -280
5102 -280 175 214 121 -147 -79 85 148 7 -174 -63 279 -170 27 28 -322 -189 148 -86 -239 -29 -286 29
5124 29 -69 2 63 -3 -39 -10 143 -22 -29 4 70 -49 128 86 32 -25 22 -110 -147 118 67 39 -189 89 -201 50
5150 50 269 6 73 14 -115 -92 -187 45 -106 18 28 -357 112 -187 -389 23 216 -26 389 -188 -21 58
5172 58 58 -56 -158 242 -10 -236 105 -217 -286 186 142 28 -199 23 -30 60 43 -104 316 -211 -236 -57 -174
5195a74k7K31M8K32rl05N1k06K04j30J81k50l8N0R6K68k97j68M77l82j35K70K6
5218A3m5j59M81m84NL72m6n5j39j25L91k91M7K55k68J33j0Q9n3n6K09j37j29j28
5242a30J54P9j08k0K17j7j62Q5L8mm1L4j32K54l13L%L8r4Q4P5p7J1K28J7k30K21
5269B10k70j21M19M1m33J81k31p0K17j29L98r8o5j63oJ02j23J99j14K14j58J12
5291A12j83M8K52l57MJ11J36m11K40k95J79R1J41k0k26L44j54J36q0k70JQ2M41
5314C22l32J36k52L53k72J23j29j45L94n34L94j13O8K29m43M88j47j31o8J5J19
5335G5k09L02l14L16j77j90J27J43k8l46R9K62j92J04mNJ18k71K12j22j07L60
5357A63r1k7q6p2J66j66J54P1j02L03m42J89o5J82L7q2k4M7j76p1rK95o3NP9j98
$$ plain form
5195 -174 -201 30 78 310 301 -4 47 -159 45 -85 96 -154 -192 -142 -46 222 -75 -243 234 -148 -283 -13 13
5218 13 -32 -191 290 -194 -189 183 137 82 -57 -182 209 -82 -35 220 -48 85 75 164 111 55 264 127 -2 -130
5242 -130 24 103 -5 -25 192 175 13 98 136 132 91 125 -7 247 -66 -63 -63 -25 -119 -35 40 -37 -26 202 219 -11 210
5269 210 -60 -181 238 279 -154 27 -204 -274 -57 -186 212 114 49 -114 -120 -18 -141 58 -56 158 0 112
5291 112 -71 -23 229 -128 -124 -13 123 -288 -48 -343 -164 -73 68 48 -178 166 12 148 68 -202 -201 -119 322
5314 322 -10 126 -126 227 -45 78 -51 -196 198 -336 58 -55 13 242 -201 287 140 9 -59 -44 75
5335 75 -134 168 -146 170 -7 -197 -70 73 45 -301 -202 60 -132 -28 -32 -27 91 -180 32 -90 -197 163
5357 163 72 45 -41 -113 53 -113 41 112 10 313 -129 60 -5 177 214 132 108 155 -21 -92 -101 194 131 136 215 17
5383A7j59J97j08J70q6O9q0J12J6j47Q2J00l28K23K00l21K6J34k00kJ34J4pj18
5407f2J49k36J54m08M59n7j7J9K80j15k18N9K80j44k83%J20N9o8Mj17L38J18m44
5431a30L33j65m4J5J3k01J42n8J16Jn1M8Rj83M85m07J81lj97q2J95J1n6J31k47
5456a44K10J76j77l46J82N4J3j00nk21K64K62j29n0rk3J79o0M5n8j79O7Q7r5N4
5481cj92J89M9j0k93M89p5j51r4L07j99k08K52J00o0j22N8r3j7L8P7N6k15O2j53
5506b08L24J26p1j65k56J58J97K1k75M00k43p1nk3J6j8J64k59K62j79L19p2m01
5529b59J82Q9j83J95j27J79k90L55j22j69J21O9j18J29J2o1P8K14n41N63k85J10
5551A41k29O2O7L1J11l20J42N2K9j25J08l58K79k12L53j39J4q4O5j47N31m28r
$$ plain form
5383 17 -142 55 -53 117 31 100 20 132 148 1 83 183 -145 78 278 -43 -17 117 -83 -85 49 63 56 -62
5407 -62 87 -149 5 -403 56 -1 -18 1 281 166 -52 7 287 143 -140 -140 -20 39 -29 -25 -142 196 314 -130
5431 -130 203 38 -6 9 22 -179 -37 -95 21 22 -29 19 28 -155 330 -77 104 101 -96 -178 17 28 -28 103 -144
5456 -144 66 242 65 -281 -99 -45 -32 -132 -137 -358 -94 168 39 -11 -20 -43 136 76 121 63 -116 -49 38 -57 -3
5481 -3 -195 -6 43 33 -260 229 154 3 -91 216 17 -191 61 161 101 -21 37 -56 -73 -35 42 98 -117 -55 -208
5506 -208 116 242 171 6 -250 -92 105 126 -149 251 8 -63 -68 -91 -75 -93 71 -188 74 -105 214 142 -259
5529 -259 -77 12 -171 24 -103 76 -214 141 19 -150 -29 40 -78 51 63 2 80 294 -247 316 31 141
5551 141 -88 -26 41 72 183 -137 5 57 86 -39 69 -289 -10 -222 131 -8 6 -78 -13 -160 371 -57 -66
5574f6J97k39M3J06M2j09rJ31N6j39K7o4j19K92k79P6j06J83k69J14J45M0lj64
5598a14J32O7k15k9M74l20J07j25lN0j27K34O7l38J52J34l56K88m30K99L8J6L5
5621C6J01l6o0p9J44k14M4p0K8K40j91J24j7j87L45m35J96KJ06P2P5N4k04K36
5645C10l92M9J3J9j63K4K71N7j31j31K4R5l5n8K81k19j29J59k88K46J47k47J68
5668G0m3k31J91J59L5l66Q9M9k68M44l23MK64k91M56k90J18K3R9k38J09o7j70
5691a77J46N1j15L41k83J59l83K47K03k49J40k46P5K70k98J09k46J18J57o1J17
5712G5l2j00J03J38k45K1J88N2k98K99k20J5L25l75p3J88j89N3m7j1J99N0j27
5735a1k16J95l37N57j86R2p4P3N4n92J38L58J27k5j74j29K38n9K42k74k57L60
$$ plain form
5574 -66 131 -108 -65 41 83 -26 -35 96 152 13 40 -24 -143 149 -130 -54 -160 23 -246 -132 13 53 50 -114
5598 -114 18 85 -130 -159 315 -5 102 -23 -26 24 -103 131 198 -140 12 146 -210 78 -352 -53 -15 1 36
5621 36 137 101 41 -38 106 -108 -64 -134 -106 134 -57 67 50 -137 208 -227 -31 -29 77 149 224 278 74 310
5645 310 -82 -33 -20 -1 -164 -140 131 188 57 -74 -50 45 10 -48 233 14 -115 44 -244 2 149 -98 70
5668 70 27 -204 -13 146 181 -185 -96 -47 -315 129 -194 -190 74 -217 239 -51 67 90 189 -49 60 -7 -177
5691 -177 -31 20 -95 246 -37 122 -261 -14 189 -60 80 -166 -91 179 -119 -10 -256 -138 19 -42 75
5712 75 43 -57 46 184 -61 -40 148 200 -98 201 -19 -4 321 -54 -127 61 -128 -75 -122 -133 66 116 -11
5735 -11 -227 -32 -369 188 2 94 20 93 147 -445 -307 51 178 153 -21 -150 88 29 271 -3 -260 100
5757A00q2m0J26m32N32j47p9K28k38j9J27r2M19m80J71l4M4m5%l10L96p0k53J51
5781b7L1k97J80J03l7o5K38l10L39N4j56j49oj02J56J58j12N5n0Q3j45l6j36J50
5805h1m6J02n0L45l58K54k15j49O4M9l5K93p3j44R9m7M3l4j25K18J32j5k36K29
5829B20j35l68N80n46N44m31K28p4o4N7j19J41o2p5K81j74R2r0M7J87k32J31j47
5852il5j24K13P2Pl07K31j67j87N00k12K73l75K29j29j35J20%p8k9K2L28N2l74
5876a14J98Q4Ll0m61L57j09J56N3k47o0J05J27J2n5j32J76l0J51l74L58l19K4
5899a27L15k90K34j87R8j42K8K50k16j87LJ33K21j69p7jR7j8K03p6M8J08l03q8
5923a43J29L09k67k58L23L1K11m90j28M54l7k89J31Jqr0j28L95j05J97j10J56
$$ plain form
5757 100 18 -22 104 -328 204 57 -22 206 -32 -51 76 -16 403 -77 94 60 104 59 59 -251 145 75 -178 -27
5781 -27 4 -293 -113 -10 -47 -112 126 -184 155 209 53 -96 -102 -204 -48 110 -2 53 3 86 -59 -95 -231 -81
5805 -81 -127 -25 -75 270 -88 166 -49 -198 -134 -85 -120 173 100 -44 55 8 51 17 -108 110 242 227 -9 220
5829 220 85 -283 297 -249 295 -136 92 18 -46 11 -108 33 -29 -104 177 3 95 5 52 239 7 138 -9
5852 -9 -44 -168 45 117 124 -183 48 -119 -306 194 -18 255 -120 109 -20 -155 -35 -35 -113 -142 -120 208 260 -114
5876 -114 84 168 171 141 -320 37 -72 84 137 -110 -170 -65 62 74 19 -113 63 33 184 -190 168 -151 -127
5899 -127 188 -102 132 -55 43 -99 -71 179 -37 -224 -221 -88 133 -36 -113 -114 -17 -35 168 92 140 248 -55 -143
5923 -143 -14 295 28 -230 93 124 335 -155 -283 171 134 -155 -24 -23 -31 -121 -249 146 41 238 128 284
5945B84j36k1m40J43M0J10J46l04J15Jm1j2L30k87L70M2q0k01Q2j93J22k60J82
5968hK38m52J17R5N8j13p0K11j79m4J27j51O2L3N1m26O35Oj65m5OJ45j02K27k35
5993B1P2m05J88K33j63J00n1K21j92mp1j7k73J81O5J77ql8l82L63l2n6l1j54L89
6018A33q3K1j60L69k88J43R7k13P7l09K92P1l9J18l80J24rQ9l2L9k13K01l5J77
6042A90j52J18l14K13j94l6K22j16k7J8j55M77j04j18q5J7J45jj65j6O1J09J30
6065B17k63J53k19K94j31j7J9n7k26J61P7k2O4j92P8m2M5J26J04j97m5K13j08
6088C2K19j12j45k24K03Q3k25R1k2m3K43P1p0kJ34k45l15K69p2j12M39j58q5Q1
6112C5j34J80N5k48o4J04L2j59m9K91n6J17j20m8RJ32o7J64Q6l68K32j46J63j46
$$ plain form
5945 284 148 127 -313 -170 -130 -20 126 -178 -63 -62 -103 -115 215 -72 298 340 260 59 141 -52 70 -190 -8
5968 -8 230 -222 -105 -10 48 -65 -135 76 -103 -147 -20 -171 -109 -76 -25 -451 184 190 25 -20 -14 131 29 256 21
5993 21 93 -312 -124 109 -54 46 -5 216 24 20 -51 -68 -341 -160 -95 82 74 36 -346 17 -15 -71 -102 -256 133
6018 133 50 71 -89 280 -8 135 232 19 96 -213 79 150 111 229 -151 -27 -36 53 21 60 -153 48 13 190
6042 190 38 156 -158 55 -139 -175 47 -69 -96 -78 -233 244 140 22 -63 -46 99 98 -67 -83 -22 87 217
6065 217 -46 107 -112 182 51 34 53 -4 -230 -69 8 -14 50 -142 -64 -106 -61 65 169 -28 -73 140 32
6088 32 251 139 -6 -230 -27 56 -169 -78 -100 -143 100 171 101 99 233 -12 -327 -58 -130 -242 197 39 -46 35
6112 35 -99 81 136 -112 -176 -72 -40 -199 -248 43 -13 104 -16 -64 -55 77 10 174 260 -108 124 -22 141 -5
6136ep1L41j59n6j78K85j12K3K25m23K97m03K59k80L99P7q2r0o6o6N2l1j26L71
6160A81j92Q1M1L0K00l75K82k16j42J27P3j25j43K33k5J05r1j29L9J1N8J73o55
6183d59N22k19K24J47o5k88L39j33q2L8j55K84q8ok31J41j66L12k48K66o2k50
6205a79N5J90M1p3j54L01J2k18M6q9n4j72M32J30j91k09J31P4n0J09q5l1k55L16
6229G7mj99L94p9k52K99j42L0j91K01J31j7l92K07j38J28J49j77n4k08L70K30
6251C63l03j00k51J83M16j71L3J31k78j25J28k83J51m0K0K51r0k16J64L3O5M04
6273D85l59r2j45J27o7K7l7J53j53j7L5J43k12R7j44L23k11mJ19J51k01j09J99
6296A08k36J19J32n6o2P6j93J73OK38l63J35j12K56n73L69Lp0K6J01m8j50K5Q7
$$ plain form
6136 -5 -76 265 106 50 -128 157 45 68 293 -130 167 -236 23 -257 142 219 137 47 -19 -85 -33 -64 -190 181
6160 181 -11 70 111 141 341 -34 248 32 -110 17 90 -35 -178 55 30 135 44 -85 -46 -35 23 196 -459
6183 -459 63 -156 68 215 150 -138 201 68 -14 24 -131 153 65 59 -172 -31 -197 115 -133 133 71 -179
6205 -179 -124 66 107 34 -120 181 193 -25 21 -68 -122 -294 138 268 77 -132 -1 73 23 132 47 16 -239 77
6229 77 73 -126 268 189 -63 236 94 124 -67 134 265 248 -144 63 -75 53 202 25 -29 -237 133 363
6251 363 60 -40 -291 -108 308 137 170 301 23 -102 26 -257 -106 -146 -126 125 35 -181 -17 16 81 485
6273 485 126 34 -111 16 -51 -24 -61 92 -61 -78 -43 100 -112 -15 -159 164 -47 -51 68 219 18 -91 108
6296 108 -128 -9 123 67 5 81 -112 61 67 305 -58 77 -35 221 -352 17 20 -50 -24 77 29 -121 -96 -9
6320iK7p2J72k54K19k13K59k36P2k27J90J41j10q5j22L2o3J60j82K65P3m7K61
6343B51k07Q1r2J24r2k14K49M2J26l48l20M13o1k2j44J54J7J15M1k32L27o5j63
6366b0j6j20J07j7L50l58L9Q8k11J91k02J72p9J27m6j34O5K63j37l16K10J46j05
6389cK76m45q0R3K37j75K6K75k64J67J3l2j21J08p5J12k15J43j01M2K27l76L02
6412A34O7m87J00J96l3k10K96l0j55K58l32K88j76L09r2j24J13J44o2k94J72k59
6434a77M53kn4n73K48J02J38j13j84J50r9J62l07L50j59J85l09M3K18J9j52J26
6456F5r0k0K92k4q9mj91O7K58l09J15o8K12n6p3k78M76l78K04k61M8K42j01J44
6480A81j32P5j25j40J74l6J67j82j12J05N0k61K46J88l00K92j68m1jJ73k03O5
$$ plain form
6320 -9 18 -54 118 -136 83 -130 129 -107 -35 -262 -72 69 -41 -126 -248 -216 -279 -119 -301 -36 37 -10 251
6343 251 44 125 33 157 65 -149 100 142 268 -80 -400 13 -48 -70 -214 -60 -43 72 113 -119 208 143 -20
6366 -20 -36 -156 -49 -66 284 -74 -35 53 -158 33 -169 3 -76 51 5 -129 -64 199 62 -254 -44 102 -3
6389 -3 273 -172 -252 -159 78 -97 -71 204 -60 107 120 88 -33 75 0 112 -103 40 -61 -19 208 -168 134
6412 134 201 -286 -186 10 -23 -233 63 33 -122 136 -196 92 -84 225 133 9 122 266 204 -90 82 -177
6434 -177 276 274 220 -353 -105 -3 135 22 -162 -12 -111 51 -256 94 -65 120 -189 -146 72 91 -61 65
6456 65 -25 -45 247 223 134 130 -61 6 264 -45 70 2 214 158 85 -193 283 -95 109 -152 -104 138 37 181
6480 181 49 124 -1 -141 33 -3 164 -18 -130 -25 25 -236 10 198 -102 190 22 -19 -20 153 -50 15
6502A5m6p7O4m8J8K68j87m1o3J99p5Nl43J97L22q3l33QO8J01m2J03k20M3K15k55
6528a87J1N5L31n98M67k89L8M5J42Q1j73Q0q9J61j50j2K30Pk03N4K4k07K25j22
6552g9J44R4k80j9k5J82J45l05J61j18L70k5l39J73j26N9K50k42j79L36q0j56
6574e9J08j45K40J50l16L6k7O2k3J34j94M0K22j65R2m45L09j82J83k69L00J50
6596B01L6j97K02k74J24K7k83L79J9k28L66n57K62Qj06J8J5k7k8j55K35j07P6
6619FM1K82k77Nj16L54l30k5J01r8m2P7r2J14J46k4k17K90%M6r3k34L4J64j31
6644a9K4or2o1N1k36M31j34k60J36K12Rj26K23P7l67O6L42k87j4J70j43K00l81
6668a85P0j56J13J30R6j17M9k2m9n4M8L3J23J11k60m0q2M39j43j42pJ50n8j08
$$ plain form
6502 15 -31 -108 -44 -92 -74 194 7 -34 -97 102 27 32 -311 -114 208 125 -208 -200 -132 -31 -73 30 -190 -147 68 -187
6528 -187 -176 -121 210 -388 79 -210 -172 -127 15 96 -77 3 -86 75 -75 -87 143 150 -53 1 25 -182 43 -79
6552 -79 65 159 -121 -140 -165 17 162 -143 18 -100 270 245 -94 79 -47 12 262 20 -159 177 97 -59
6574 -59 49 -96 144 294 -22 14 -13 49 26 160 -34 6 228 63 155 -290 19 -163 20 -249 51 201
6596 201 237 40 242 -32 92 119 -164 215 234 6 372 -185 77 85 -21 -3 12 -15 -43 -198 37 -70 6
6619 6 47 329 52 57 -59 295 -35 -60 41 -57 -99 -22 -114 0 146 122 -95 195 195 241 148 -86 -52 112 -19
6644 -19 5 -1 -93 -154 -103 -339 92 -42 -302 -166 46 55 -71 152 229 -138 -72 270 -17 -31 139 -4 196 -185
6668 -185 -115 -271 -158 -28 68 -49 0 -22 -71 -125 -77 -44 79 190 -70 -110 -192 247 104 -38 -45 105 47 -61
6692f1P2k2J14k63J67j20L02j69m7Q5l4P1J25m99M15j77P2J34n7j62k8L2j00Q1
6716f9J65J52l73L55l58L6J31k69J03m8J16J44k10K43j42j1r9j99K62K7J61o2
6738E5J76r7j47j0Q5J65l08L44j57j70R2j51Q6j32M5R6l0R7j06L88l00L1K4k00
6762a24K02r0j38K95n70J84L42q2O6L4Jj69Q1l38J19K08p1J80k63r7L46k67J61
6785A0jk0M3o6K50o1M0l03j6L06j12m62J91J87q9r0J01J87j15l9k3K15m5o5n6
6810c3K6j40J75O3l2k07NP4J27K21j08J06K9o12K64K24l68J60k16j3L54j67k84
6833c52N40j28J73m08L27q1L7nl82K96J31Mk38L37l87O4j23J65L20k00J45k65
6855c0r5J83M1j39o9oJ22J17ok11M23j95M0l38J81P2j39L3J99l2o8k6O5nk48J39
$$ plain form
6692 -61 11 -11 103 -160 7 -113 189 20 -27 58 24 95 220 -279 136 -41 31 165 108 -54 -82 -50 -150 -69
6716 -69 96 248 -125 230 -128 -92 39 -230 -127 -175 -59 85 -125 118 -24 -35 -134 -333 -71 -44 117 55
6738 55 231 134 -13 -23 62 227 -81 263 106 -64 28 -123 -37 -169 -124 -28 -58 39 -67 321 21 52 76 -124
6762 -124 78 -12 -150 145 -425 -241 101 19 85 119 120 -49 32 -306 -187 21 -50 130 -133 -230 116 -151 10
6785 10 9 -11 32 -34 216 155 195 -108 -124 182 70 -392 -201 -14 -103 -193 -92 95 -20 -59 -82 133 88 23 -33
6810 -33 -7 -147 28 91 59 -148 -143 -69 58 279 171 277 306 -306 -42 182 -186 -26 -242 -255 99 -68 -352
6833 -352 188 60 233 -175 152 71 108 103 -279 17 148 152 -86 251 -136 -72 -195 -30 290 90 235 -30
6855 -30 -125 58 99 -40 -109 -115 7 124 118 -93 330 135 175 -163 18 90 -49 -16 183 151 83 57 122 117 -131 8
6881Hj19k0J48J21k70J59l7n7J00j97J99Q4J8k04J25l6j24O5J98l54M10k19J26
6904A24J65m10J55l47L99j41J19K1l5k64L13K49l90J3L7J10j66m9J63J34l01J30
6926B9l2J18j03O1m9l0j59j07J03l16M75k5J28p8P2j31j19j89R1M27P6k57j57
6949a72K75j39J84j41j55L37j00j02L9N1j20j32K77l95L01K68j39Q9j77j99K30
6970H0l00J94K53j44p4q0k1kL38l39J73n6j1M7K6k5J60l93K01o5M1j0k27L00q8
6995b2K02P0j71J8J92k48RK68m33L08j21k8k05K21k8l2k2k34K24k12K85j41J02
7018BJ93Ol22M18l53j51L40l05K57k82K26K3m8J85j65k97L57r1o4O7o8K79l34
7041a27K64k1j76L70k52N5J11rj63K45k32j58J98l58P6M01Mj85j38M00k30J68
$$ plain form
6881 8 -111 -131 17 138 -132 27 -10 -67 33 -164 35 119 137 -67 58 22 -102 -37 161 -193 217 -2 124
6904 124 289 -121 34 -313 86 -55 64 85 50 -214 99 348 -42 -29 8 118 -48 -97 66 200 -101 29
6926 29 -3 115 12 73 24 -6 -165 -272 -169 -485 -10 -35 93 15 87 -44 -163 -352 -261 166 242 -15 -172
6949 -172 103 -36 148 7 -148 189 89 -13 26 77 -43 -175 102 -293 8 276 137 226 49 -150 80
6970 80 -220 -26 227 83 9 -71 -92 -94 244 -95 78 22 11 58 84 59 219 -174 27 -38 3 -7 -234 66 -22
6995 -22 180 250 79 97 289 41 50 318 -115 193 72 44 -161 60 32 0 -22 -256 -32 -244 41 -100 2
7018 2 195 201 -121 297 -56 -207 133 -172 85 -197 29 52 4 189 24 -273 84 -7 -71 -4 -72 207 -127
7041 -127 137 116 -60 310 58 113 224 215 52 297 65 -93 105 -253 -177 224 228 43 -95 305 75 243
7063B43k89j50q5N57m03K30j71J42N9j25L8r4K07j45R8q7j52o4k8J25%P1k82M56
7087A51l78K59K48j94L8K94l62m6j36Q1j6J19r4L8K09P1n49N30m3j50k40P3K6
7110g1k02L18rj51l6k03K44R7j99K19k4J26k54J64k16K59k16l6L13M0j04M6L35
7133D40m89j43O1p1L10l8l26K74N8n3n0O8k44K83j51M7k00J62N3q8k15M04m30
7156c38K05poK05k08L9J72j74J72j36K87j79R1j53q1K41R8m06KK85J16k52j80
7179b07J19O7M7Ll7K05k61q5J59mj61q8K02p9N1J84R9k79Q5j10L05r4K6j60pQ0
7205F0k07J97j7j60nJ33K65k30j72k6K30K6k74N4k21N24j67o0K46Jp3J25k64p0
7229h5Q6K61j4j53j16k23N25m99L56Rm80L35K88Kj94o5k09K34O9J24j40M1J9o
$$ plain form
7063 243 -46 -196 -281 276 -127 103 -68 74 133 8 46 -48 159 14 112 25 -127 -191 -219 -94 -94 -23 -305 151
7087 151 -227 32 280 86 124 418 56 10 -126 -45 -61 58 -36 2 211 282 -267 263 220 70 -170 -97 -71
7110 -71 -273 45 36 -115 -151 -354 -110 -13 -212 7 -17 109 -145 19 -197 62 -154 -190 123 163 59 105 440
7133 440 -49 -192 -131 -202 108 70 -256 18 76 23 -27 41 -203 80 -71 -24 -224 -62 -9 -97 -312 92 -338
7156 -338 -133 -140 -146 59 -149 -110 62 -112 60 -76 211 32 123 -30 -111 130 228 -178 -176 109 225 -27 -207
7179 -207 -88 -21 26 29 -8 197 -64 -149 10 6 -155 -243 -41 -120 -69 115 214 -65 20 -90 215 121 147 -13 -20 60
7205 60 -147 50 33 -127 -132 1 266 36 -136 -162 68 94 -180 -126 -347 177 10 -50 196 197 124 249 -15 -85
7229 -85 1 262 248 95 -21 -244 281 -218 138 147 -333 2 290 292 98 33 -176 58 127 251 111 152 171 165
7253A65j34j14N3K26k11R0m0k11K62q6j64K04o1J28m2j31Q9n4j27K18n8l6K28
7276A94j64j41K74l76L35l8J2j05J09k4n9J65j46l4J95k46k32K90j23K13q8k5
7298a4k28M27m0k40J68k0k35J35N9J58Rk05K21k59j99L27J46l01J5j7k12J99R1
7321a5O4k85J24K15P4j70j14J63j43L00n13L83pr0J01j21J81j20l6J18j78J16
7343D7mM1j82j21M72k10j20P9m4J4J66j87J39J6j98n9J01K22k47J93j3OM5k47
7367i1j05J4K53r1N6j06J62J36n54L94M8R4K2k5n8k55P3K6j32M0K12J24o17J08
7391b72M87m75N04n8l24R6J11k25m7N7J19J26O1k86j45P7K20j62m0j60M58M5k07
7414d0j88L80k95R6l3k23N52k90j30P9j61J25Q9J15m23K05K6K45l87j80M66l33
$$ plain form
7253 165 31 -83 -30 196 -15 75 35 -176 86 0 -164 40 -21 107 65 -66 23 -31 -158 60 2 -34 194
7276 194 30 -111 163 -213 122 84 96 -9 100 76 17 182 36 2 197 -49 -281 9 -114 99 11 -14
7298 -14 -242 185 145 -95 73 53 -182 -47 12 170 179 -26 195 -64 -263 64 210 -91 -76 -93 -305 -106 -15
7321 -15 49 -236 -112 103 177 7 -107 56 -87 213 -300 83 76 -14 87 -34 147 27 -9 109 -69 47
7343 47 43 84 -98 -219 253 43 -77 2 -42 -28 138 -49 90 106 -92 -151 -50 172 -75 118 105 111 156 -91
7367 -91 -196 -182 71 -20 36 -70 92 228 -326 68 116 210 232 207 149 -106 -33 -7 -139 -99 113 237 -380 -272
7391 -272 215 -260 244 186 -138 -42 69 -156 -203 -146 -27 99 160 -126 -271 -194 26 -136 -176 -336 122 167 -40
7414 -40 -228 152 -143 -47 -80 -303 249 -41 -171 -92 -253 -128 -39 76 -347 -142 -116 129 -258 -438 28 -305
7436c05J72L4N2%K52n0k80K27j13J74J21j19j26m3m6P6R3J25j95K63l76pj2J9
7460f4M9N1N8m27K35L6N0l87K21Q9J92k49K44n0R4N7k55mJ64l90M61l38J91j07
7484g9%RR9P4l06Q0r2N15l60Q1N7j55p2oK6lK18j95J33K34j74j64J69k66K65O9
7510A57l7j38J50k33o1R5K87j60r6n0K8K07J05j63Q6k82q7K22p6R7j25J44l57
7533b87J46L90l06K32l25J33l04M85N3j67n9j60K75k2k25M43q0k37o5qL48j35
7555A25j81K29k01k11K96L7j41J37l8j65Q5o0J65l7l9J88o3l67J50P8K53m84L55
7578A11J14l89J1J82o2l7j17j90K42J86n3k3J71k65j8L1L4n4J30o1K5j8R8j04
7602e6j06J35m7%J05K0J03o7k5j18n3J95M9j41J46jm9k23M34k39l41K34J13Kj42
$$ plain form
7436 -305 -133 -99 -47 -47 205 155 -125 102 -11 163 284 165 39 -4 -50 26 119 244 49 312 -64 -71 -83 -64
7460 -64 -15 36 94 -333 -98 -62 -12 -399 -178 -89 103 -146 98 48 142 199 -56 -60 104 -286 175 -163 28 -79
7484 -79 -79 -70 29 103 -203 -123 -215 300 -60 21 78 -77 -149 -155 -129 -132 86 -109 24 258 84 -80 89 -177 88 157
7510 157 120 -18 132 -101 -162 -67 220 60 -36 -86 -58 149 254 91 177 -105 -192 30 -46 51 -74 70 -287
7533 -287 -141 249 -57 175 -150 -17 -321 164 217 50 -9 -169 106 84 -141 302 222 -15 -80 -88 260 125
7555 125 -56 173 -28 -239 57 94 -47 90 52 -113 -28 -88 77 40 1 189 126 -241 -91 -13 240 -244 111
7578 111 225 -164 -153 29 -33 -70 -187 -377 -135 51 -2 -25 146 -119 -137 -106 -72 -126 4 -57 -32 -50 48 -56
7602 -56 -162 -27 -74 -74 31 51 154 87 62 -56 -109 86 135 -6 140 139 90 -133 301 62 -279 -45 68 70 -72
7627g2L82n36j9J97L70j53j09k00K52j04k2J96k3K3n13K34k29N27m0m60J07M43
7649B51l92J96J0m3j14N1K3K3R1o0J67k77j9K26P7j87K6p0L13n06N8L24r6J31
7673B03l65J68j50K32r0j9k39K33K3K8j36K51k25L12m80L18N1J41j59R9m50L42
7695H8L9j22J41l8l78O9Q0J44J41l68L95Rj34j88K40j85J52n6j50J41J61k19m1
7718g9J77p3J1K87m89L68j58O5L8l5q3j36J59k39J59J25j74q9J28K04j84j27K22
7741G7n5j38K86l80K11O3k32j86K76L46k43r7J59j22K04J38k53J06Pk31RK73K0
7764B38j66q5j36M3J63n5P8j06M5nJ55k6M3j62j21K2Q2Q6L6j89K28k48K85l35
7788a30L38o8j69M27l16j08l1pj08nP6L12k31k74N09k15r0J46K73k3k39l11J09
$$ plain form
7627 -72 310 -226 -245 -48 322 169 60 -140 112 8 -14 182 159 182 -331 -97 -326 201 161 -299 -192 251
7649 251 -141 55 65 22 -92 -41 -18 5 96 36 203 -74 -93 133 210 23 49 -21 292 -214 -156 168 72 203
7673 203 -162 6 -144 88 -2 -21 -260 -27 -4 24 -112 139 -86 226 -254 64 115 256 97 196 -254 88
7695 88 127 5 146 108 -270 -201 -121 23 164 -204 191 200 66 -122 118 -67 85 29 -121 20 181 -38 -79
7718 -79 98 25 36 323 -166 202 44 109 147 112 29 -107 52 -187 -28 97 -77 -166 -38 166 -18 -145 77
7741 77 22 -116 170 -210 1 64 -168 -354 -78 268 25 -72 87 -35 169 307 54 160 167 -64 -55 218 238
7764 238 72 -13 -149 -106 57 2 80 -26 19 14 169 143 186 24 -97 -75 7 93 129 -60 168 -80 205 -130
7788 -130 208 140 -29 398 82 -26 -57 -64 -172 -177 -101 211 -20 -294 215 0 -90 56 329 306 67 -244 -135
7811a35j56J87o2N9J24K16m16J69m0j4J23k38J28KK7n4K43l1l21K57q7j45J23
7834d1k81L23P4k03N6m8J89k13J39j40L20j46j20Q1q5K94r2n2l8Q0j04n5k8J51
7858F1j23jJ78l43l9L07M2J9k64k5K11j49K41q6j35J16j92J91p0J71j77q3K3p3
7882b00J15p3K97L7j92K07l65kK69j93J66j49K2J45k74n6K27L2P3N9N7j76k25
7905a99M21j61j95r3Q0L23l02L37o0k7N4Nm02J03K41j72l0n8O8R7M7l60K11J33
7929F1k27J10m6j23J54M4N4l6j64K06m2j54J81k31J0K72J80k58p9R9J92r6j05
7952BL6L4l9K78k71k51Q0J45J0J19k55lkQ8J33k27J55J66j99j88p1K76q3K5Q9
7977D7k99K46kN2k91K93K08m3l71J60R6j14j32K78k36J85Q9k18M3K52k43o4J27
$$ plain form
7811 -135 -291 -104 -166 -107 17 233 -183 -14 -54 -68 55 -183 -55 -53 -26 -80 163 132 -189 68 -19 -164 -41
7834 -41 -322 1 75 -128 -72 -120 69 -144 -5 -145 175 29 -91 -10 -95 199 107 55 17 97 -7 -62 -90 61
7858 61 -62 -63 115 -228 -267 40 82 101 -163 -188 23 -126 115 29 -106 10 -182 9 -61 110 -67 -150 -127 -200
7882 -200 -85 -158 139 176 -16 191 -174 -176 93 -100 66 -83 -61 84 -190 -246 -19 13 86 145 202 26 -199
7905 -199 222 61 -134 -227 -147 176 -126 211 151 124 178 183 -219 -116 125 -47 -77 -135 -67 30 77 -283 -72 61
7929 61 -166 -56 -102 -225 -71 -27 27 -9 -173 33 -9 -163 18 -213 -203 69 249 -9 -88 11 203 107 2
7952 2 38 72 33 311 40 -211 -131 14 24 143 -112 -115 -117 -29 104 -123 32 198 -1 -189 -260 16 -67 -42 47
7977 47 -252 -6 -8 44 -247 46 254 211 -160 0 96 -18 -150 128 -108 77 166 -52 -9 243 0 -64 63
8000F3M4m21O8K47J96l9k95O8J47j86m2O7J29j13j46J92Q1k2R3M6j87j11Q3J8
8024b0k59K4J14J73MJ1j14j20J38O0J21p1j8m4j27J65m0j03J3m5K37r0n4q0J46
8049B1k1o7J91q0j01j35K73j20K92j10m8j97k29M04M7l96R8k7O5M5j26N10k42
8072D7M7NQ9q4k19LJ44j72R7J22N8K9o6J34n23K31r7K7m8J48O2q6J15j64J88o1
8098B6m1j87K61Ol26M24k44P7N4r8K31j05l8j73M1K57m7j56R2j4j7K47k6l68K26
8123A02P6nJ24m00J49m12N20k47k39M82Q7r3l24M00l71K62J24q7l23O3K40j67
8145c9k2J65J6l70l8L18j46K62j80M5Qo0j13m1K79k6j33j30J04k4L39j30k90K71
8169F5l1J20K50l60R3l7j48j29K2L22k78o7J9J58K42j78J9j6l48J67j83R9
$$ plain form
8000 63 107 -314 -246 1 197 158 -137 -69 78 -108 -150 -83 46 -67 -213 -21 60 38 131 177 -10 -121 -38 -20
8024 -20 -279 -255 -141 32 36 47 -67 -187 -49 11 132 61 43 -1 -128 37 -3 -106 -93 -138 99 9 -45 -125 21
8049 21 0 -67 124 44 -57 -192 81 -39 253 143 95 -102 -331 73 120 -276 -178 -205 -140 -95 -221 289 47
8072 47 94 99 188 104 -115 -112 32 -140 -43 79 137 166 100 234 -289 -58 -155 -128 -176 -28 34 -52 63 -101 87 26
8098 26 -15 -202 59 65 -261 163 -81 -4 50 -48 183 78 40 -133 -92 165 118 -38 54 40 23 270 244 -124 102
8123 102 178 173 297 -103 46 -366 154 -93 -332 150 237 144 -180 220 -151 111 235 148 -175 -112 128 -39
8145 -39 -61 104 120 -250 -288 30 -116 146 -34 11 19 -41 -154 -195 84 58 -75 -205 -101 -125 214 84 -206 65
8169 65 34 154 404 44 137 100 -48 -177 -155 167 -111 -178 -159 -1 241 63 82 66 -282 -115 -298 -199
8191a99
$$ Imaginary data points
##PAGE= N=2
##DATA TABLE= (X++(I..I)), XYDATA
0@%%%%%%%%%%%qJ6j6J6k4L2l2M0m8N6p2Q8j04J20j36J58j83K10k42K79l19L62
33A93m10M64n26N90o62P42q27R20j022J136j260J394j541J701j877K070k279K509
51A315k765L050l366L715m107M553n062N653o347P172q172R417j1019J3170j6223
66i016K0930k9229M8226j76739l8075K00424q6869k6079P3839Q9794k7070M4982
78H5118R9123j6971j63661l4025J06984M7679j00006p7039J5386J3762m3762J2684
90e4728M6600l4164q7913M007Q9176N2479l4159q016O0884M6999R043K7096K2182
103A39486l0058o6059l3391M346l1888p1719l5217O613J0983J1876K6705M2011
115b6312L3238J7725L3769L5266J000j7160j2673r125j5790l0905k5069r716j2326
$$ plain form
0 0 0 0 0 0 0 0 0 0 0 0 0 -8 8 -8 8 -16 16 -16 24 -24 32 -40 48 -56 64 -72 86 -97 113 -129 150 -169 193
33 193 -217 247 -279 311 -351 391 -436 484 -538 598 -662 732 -809 892 -985 1085 -1194 1315
51 1315 -1450 1600 -1766 1949 -2158 2395 -2667 2986 -3361 3811 -4361 5056 -5963 7207 -9016
66 -9016 11914 -17315 30911 -145828 -183903 16521 -70348 -96427 -22588 67206 40136 85118
78 85118 184241 167270 3609 -30416 76568 124247 24241 -52798 -37412 -23650 -67412 -54728
90 -54728 -8128 -42292 -130205 -126198 -37022 15457 -18702 -26718 34166 81165 90208 117304 139486
103 139486 109428 43369 9978 14324 -17564 -89283 -124500 -117887 -106904 -95028 -68323 -26312
115 -26312 6926 24651 58420 93686 94686 77526 64853 55728 39938 9033 -16036 -25752 -38078
128c8078q934J268j710o2K343N178J7581J3097L136J2750J9921J7366J0674K003
142E6533N643p24k1172j7961j1205k5191l0217j9765o206J16m177J3732L3779
155b6815K2730J5553K4605K1467J1332P22o934q739k3632k9667j2262o684j4183
168c2507j5467j0578O926J6877J0317J2415R940QP583J6502J4121K547j2220p653
182A8811P784M660k963j0641k1757j6605o462j856L81j0179j4787M048K1377K7075
196a114K0529M445L846J0951Q523Q718l336k5293k8478j6424l151J776j1780j5562
210d6350k907P446K0016K3226P857j427l94Q317J7867O607j2037j4015r291o3
224D852P325j397j0146j5062j2960M072Q298m040q358m907M554J7992J7816J2900
$$ plain form
128 -38078 -47012 -45744 -47454 -47516 -45173 -39995 -22414 -9317 -6181 6569 26490 43856 54530 56533
142 56533 62176 61452 40280 22319 11114 -14077 -44294 -64059 -70265 -70149 -74326 -60594 -26815
155 -26815 -4085 11468 36073 57540 68872 69594 62660 53921 30289 622 -11640 -18324 -32507
168 -32507 -47974 -58552 -51626 -34749 -24432 -12017 -2077 -2069 5514 22016 36137 38684 26464 18811
182 18811 26595 31255 28292 17651 -4106 -20711 -27173 -29029 -28648 -38827 -53614 -49566 -28189 -1114
196 -1114 19415 23860 27706 38657 47180 55898 52562 27269 -1209 -17633 -20784 -19008 -30788 -46350
210 -46350 -49257 -41811 -21795 1431 9288 7861 7467 15784 33651 40258 28221 14206 4915 4852
224 4852 12177 10780 634 -14428 -27388 -23316 -15018 -19058 -27416 -32323 -27769 -9777 8039 20939
238B0939O278k330M713J1053J65j0262j8618k0331r385n491o052l692p541j262
252d1816J3384J8107J7220R325J685O470O148l93j555p603j4323r600m727O38
266g040m33p809k650L045o46K924M084J198J066r3M328J1233M567N41L555R25
282A8795Jj389l683l104j0021j5505n950j279k701Q0J487N800Q514P799J4358
297A3202J2613q57l815o10q07k417j0264j2193o666o814j424P004K788j881k075
312a4216M336J3669P477l760k406j004l41N402L755j590p217q436L181Q463j443
327E870p369r213n522L841L771J756L35n013P32J2960J3477N689l902q216M94
342I690L048j943m793j1681j3110k668M744P706L514n571j99R405J0730Q674l88
$$ plain form
238 20939 27217 24887 29600 40653 40818 30556 11938 -8393 -17778 -23269 -29321 -33013 -40554 -41816
252 -41816 -28432 -10325 6895 16220 17905 24375 30523 30130 28575 20972 6649 -2951 -7678 -7040
266 -7040 -7473 -15282 -17932 -14887 -15533 -12609 -8525 -7327 -6261 -6354 -2026 9207 13774 14315 17870 18795
282 18795 18796 17407 13724 10620 599 -14906 -20856 -22135 -24836 -24756 -23269 -17469 -8955 -1156 13202
297 13202 25815 24958 21143 20533 19726 17309 7045 -5148 -11814 -18628 -20052 -13048 -10260 -12141 -14216
312 -14216 -9880 3789 11266 7506 5100 4096 3755 9157 12912 11322 4105 -4331 -1150 7313 5870
327 5870 -1499 -10712 -16234 -12393 -8622 -6866 -6531 -11544 -10812 2148 15625 21314 17412 9196 9690
342 9690 12738 10795 6002 -5679 -18789 -21457 -16713 -9007 -5493 -11064 -11263 -1858 8872 17546 17158
357A7158p202l093r09M21K221o691r856m051K484O599K328n393j701J202K485
372c998N481K232k937j365l79N408Q010q11m862k133q59J173k800n751l360n505
388a2456l577M765M542Q5R29L226Q575N781l28J289l60m450j936j544l143m619
404c221p061j637L951j25j84K482J593K787J722K465M905j616l531K251K122k90
420F613l59k209r49k278l854P81q43n544k748j47K862M807Q18K595M563K83K413
437F804N583J025k722o210m139J470j777m338k003m305l107L017N881N978M7m189
453b985K950O335K992O66l740n154j057Q01L871K196p003p544k38L768M886j926
469a182n590j984J7N197R334J890m360l226Q30P741N002l914o421o589k872K832
$$ plain form
357 17158 9956 6863 5954 6375 8596 1905 -7951 -12002 -9518 -2919 -591 -5984 -7685 -6483 -3998
372 -3998 1483 3715 778 -587 -966 4442 12452 11641 6779 4646 3787 4960 2160 -3591 -6951 -12456
388 -12456 -16033 -11268 -6726 -6641 -5712 -2486 6089 11870 11542 12831 12471 8021 6085 4541 1398 -3221
404 -3221 -10282 -11919 -7968 -8093 -8277 -5795 -4202 -1415 307 2772 7677 6061 2530 4781 6903 6613
420 6613 6254 4045 3096 818 -3036 -2255 -3098 -8642 -11390 -11537 -8675 -3868 -3050 -455 4108 4391 6804
437 6804 12387 13412 10690 4480 341 1811 34 -4304 -6307 -10612 -13719 -10702 -4821 1157 1204 -2985
453 -2985 -35 6300 9292 9958 6218 1064 7 808 4679 6875 -128 -7672 -7910 -4142 744 -1182
469 -1182 -6772 -8756 -8739 -3542 5792 7682 3322 96 926 8667 13669 9755 3334 -3255 -6127 -3295
485c295J140k747m653m970L361J0606N191L46k356j352L761M447O02k159o981
500I41n189K117J912K1k734n137o90M042L546K342j126k775J025K663L299K386
516F643l099j493J645Q46J266q05n157l172j929n29J304k359j885K039K537L617
532e31M369J030R68Q40m73K325j351m419k162k761j722p28k030O63J158j296J946
549d174L709O19J082M20J248J595n82K38K026j361k459k78j161m30k263k912o76
566e359j404j451J886J744R49J515J464M224M672Q0L38m4k875j014j503l596l617
583c991m505j013K488K90L54J341Q23L276M436J718J253j593j850K290J215o41
599E891k472m384j059R27j107m8j388l849k28K923K510R05j969L91M361L117L225
$$ plain form
485 -3295 -2155 -4902 -9555 -14525 -11164 -558 4633 4979 2623 1271 5032 9479 10081 7922 941
500 941 -4248 -2131 -219 -198 -2932 -8069 -8759 -4717 -1171 1171 45 -2730 -1705 958 4257 6643
516 6643 3544 2051 3696 4542 5808 5003 -154 -3326 -5255 -5784 -4480 -6839 -8724 -6685 -4148 -531
532 -531 3838 4868 5836 6676 6203 8528 7177 2758 596 -2165 -3887 -4615 -6645 -5982 -4824 -6120 -4174
549 -4174 -465 154 1236 1656 2904 4499 3917 4155 6181 4820 2361 2083 922 492 -1771 -4683 -5359
566 -5359 -6763 -8214 -6328 -4584 -3635 -2120 -656 3568 8240 8320 8658 8614 5739 4725 3222 -374 -3991
583 -3991 -8496 -9509 -7021 -6731 -6377 -5036 -4213 -937 3499 5217 6470 4877 3027 5317 6532 5891
599 5891 3419 -965 -2024 -1097 -2204 -2252 -3640 -7489 -7717 -4794 -2284 -1379 -3348 -2957 1404 4521 7746
616G746J770k178k198m99K35M73n366o995j747O46J307R08k00P96J528K430N973
633D629M538k497k706N29K316K09m442l348j041k718l60L120L8k475k483J723
649d968N075K95k417J145J479Q68K268K611J218k794l630J687J749l524l888k270
665e096j060l27o98J929K544j139J246N195L576J378j288q80Q65k014l339m23
681D69j918l281j348J66K599N75j651K529K006m43J649J345J147j97k108Q75J898
698D312j354j429k53j582o42j519j001M71j592j895J709K427J692J704L65K512
714C925J674k46J730n91l538k477j781k35n47l069j932J144Q13K364K445M51N79
731G09L37J860L373k53l015q40o14K63K20j682j288k103k195K014J130j646j123
$$ plain form
616 7746 9516 7338 5140 4641 4876 5349 -17 -7012 -8759 -8113 -6806 -5898 -6098 -5302 -3774 -1344 4629
633 4629 9167 6670 3964 4493 6809 7018 2576 -772 -1813 -4531 -4891 -1771 -1733 -4208 -6691 -4968
649 -4968 107 402 -2015 -870 609 1477 3745 6356 7574 4780 1150 2837 4586 1062 -2826 -5096
665 -5096 -6156 -6483 -7181 -5252 -2708 -3847 -2601 2594 6170 7548 6260 5380 6245 4231 892 469
681 469 -1449 -4730 -6078 -5912 -3313 -2738 -4389 -1860 146 -297 1352 2697 3844 3647 1539 2414 4312
698 4312 2958 1529 1276 -306 -948 -2467 -3468 -2997 -4589 -6484 -4775 -2348 -656 1048 1413 3925
714 3925 5599 5353 7083 6492 2954 477 -1304 -1539 -2086 -5155 -7087 -5943 -5130 -2766 -321 130 709
731 709 1046 2906 6279 6026 3011 2171 1557 1820 2040 358 -930 -3033 -5228 -3214 -2084 -3730 -4853
748d853m54J396M294J866P95J325o64R50K279n21j431l969l387m34k76j309r43
765e336j870m0K891K675K852J132o79J564K215M23L79k834k658O0q05N4m80k582
783c039j025m8O78J289n75p01P97J240J700K713K27p6N98P8J169k32k557j679
801E57j809j879L36j485j543L91j60K443K752J204J763J006K6J654j39j727o88
818B702k156j396J72j276o81J35j342N99J188M31J409L7j69J188L58P9J786o72
836B392o01jk79N18m01j789m90j707j464O57J29N1N09M7J909K884N62O55K87r10
856B958K61l36j203r05k837j782P79R5M10J55j008J476K473J165J834q25j983
873G27O42N19J44K91k470j180M92J34R09n92k045j20j01J135K048j032n32O40
$$ plain form
748 -4853 -5307 -3911 383 2249 3044 4369 3705 4655 6934 6413 4982 1013 -2374 -2808 -3084 -4393 -5336
765 -5336 -7206 -7246 -4355 -1680 1172 2304 1625 3189 5404 5827 6206 3372 714 774 -31 23 -457 -3039
783 -3039 -4064 -4112 -3434 -2145 -2720 -3421 -2624 -1384 316 3029 3256 3180 3778 3856 5025 4793 2236 557
801 557 -1252 -3131 -2795 -4280 -5823 -5432 -5592 -3149 -397 807 2570 3576 3602 5256 5117 3390 2702
818 2702 546 -850 -678 -1954 -2635 -2500 -3842 -3243 -2055 -1624 -215 -178 -347 841 1199 1278 3064 2392
836 2392 1791 1790 1511 2029 1628 -161 -651 -2358 -3822 -3165 -3036 -2985 -2476 -2429 -520 2364 2926 3581 3868 2958
856 2958 3219 2883 1680 775 -2062 -3844 -3065 -2970 -2560 -2405 -3413 -1937 536 1701 3535 2710 727
873 727 1369 1888 2032 2323 -147 -1327 -835 -701 208 -384 -2429 -2549 -2650 -1515 533 -499 -1031 -391
891c91Q45J935J837j306q18o45k90Q63j261k049k134r49M40J883K1l4P35M66K799
910A947J842k03p48q56k78R69p80j637r01j908r3J310l40r9j134r2K102J242L12
929F55L50j44j68J551Q56M08n29k370K05J86j210n76j507j872K07K06J630J386
947g36q51Q91K492O86J052N0p00l96p57r55P23j741k082l23l77M51M48KM87K79
967a357k80J728J316N6K83n27O63P75n48M66m84j916q54r6o06P2j740r85J045
986b989R21J113J268R9J061N28L93J806P6k357j095q48p90L82j257j094O1r11
1004c633J645J835K85j03n15P87J638N04m78j47j183k60R33L8n15j725j641R52
1022a583R94j036J77k66l15Q22J020J883P19j886O24J500K61K8j745j312o66q58
$$ plain form
891 -391 454 2389 4226 2920 2102 1457 1167 2030 769 -1280 -3414 -4363 -3923 -2040 -2019 -2053 -1318 -852 1947
910 1947 3789 3586 2838 1982 1704 2673 1893 256 -645 -2553 -2646 -1336 -1676 -1775 -2909 -3001 -899 343 655
929 655 1005 861 693 2244 3100 3508 2979 609 814 1000 -210 -786 -2293 -4165 -3958 -3752 -2122 -736
947 -736 -1587 -696 1796 2482 3534 3584 2884 2488 1731 776 1499 -242 -2324 -2647 -3024 -2573 -2125 -2123 -1636 -1357
967 -1357 -1637 91 1407 1463 1746 1219 1882 2657 2109 2575 2091 175 -679 -775 -1381 -1309 -3049 -4034 -2989
986 -2989 -2068 -955 313 412 1473 2001 2394 4200 4276 1919 824 -24 -814 -432 -1689 -2783 -2722 -3633
1004 -3633 -1988 -153 132 29 -486 301 1939 2443 1965 1818 635 375 1308 1346 831 -894 -2535 -1583
1022 -1583 -589 -1625 -1448 -1714 -2029 -1207 -187 1696 2415 529 1153 2653 2914 2942 1197 -115 -781 -1639
1040a639n69Q23j124j305J332J245K005M09o85J151O81l36J046o06j544j086n98
1057h00Q36j84j986k62M61K91O48O21l8M60q06J032J641J30o78j61K59O29J08
1076B201j448k24j299j507L40K23q22j12k55J228J798OJ153J269k10N08N38l16
1094C071n30k027j262k09r81q48L13n29P04M85M80J385N33J43P84K99J64L27j81
1113B121l71j9j246J42m26j242p8r92o04N39n8j23Q12J83Q12J618N90J098N30
1132C286n56O62o33r21n14k012j488m87l57L4P52o00Q39J123J025J533j51n2Q00
1151B283N4L6L59j623q13k96p70K64k83j145j67k79L08J162m25p1P17M10J469
1170A190J355J03J62n20o71M22o00j399q90j566o89J103m66J37L75L2J327K109
$$ plain form
1040 -1639 -2208 -1385 -2509 -3814 -2482 -1237 768 1177 492 1643 2324 1988 3034 2428 884 -202 -800
1057 -800 36 -148 -2134 -2396 -1935 -1644 -996 -375 -413 47 -759 273 1914 2044 1366 1205 1464 2093 2201
1076 2201 753 529 -770 -2277 -1937 -1714 -2536 -2648 -2903 -1675 123 129 1282 2551 2341 2849 3387 3071
1094 3071 2541 514 -748 -957 -1938 -2786 -2473 -3002 -2298 -1813 -1333 52 585 728 1512 1811 1975 2302 2121
1113 2121 1750 1731 485 627 201 -1041 -1119 -2111 -2715 -2176 -2234 -2357 -1545 -1362 -550 1068 1658 2756 3286
1132 3286 2730 3392 2759 1838 1324 -688 -2176 -2663 -3020 -2986 -2234 -2834 -1995 -872 153 1686 1535 1483 2283
1151 2283 2337 2373 2732 1109 296 0 -770 -506 -789 -1934 -2101 -2380 -2072 -910 -1335 -1406 -689 -279 1190
1170 1190 2545 2648 2810 2290 1619 2041 1441 42 -848 -2414 -3103 -2000 -2466 -2329 -1954 -1922 -595 1514
1188A514J78P52o93j2P38n28o61n64j582n12K60l3N19q43o53P26O91K85Q50k24
1208B08j68Q68K92P42P43j437m08qq44M54r50p72q02o46O67R80m68L69R03O18
1228C41J201J118l53O94j248j191P47j006j132o97o92J08N32j96O75L21l08N12
1246e74J401K75J016o88j02M18n46k87n6r54m58n72k79P46q52o26J18K19K94J420
1266h7M27P33P02k56J114M56r46n43r09o58l65r26n09l28j147L15J054O91R52
1285b30J84M01J403P83k06K40j020l52q8n82M7n05j778l96N48o88M77m33J48R97
1305a050J5J361J385k23J44L15R2L55j40j244m56q43r24j28r44l64m5L50P20J137
1325d87p9R93N74M91J120n68j59m33o28q9J40j369m50m02q34P12K34l44K89L07
$$ plain form
1188 1514 1692 2444 1751 1739 2477 1949 1288 724 -858 -1370 -1110 -1143 -624 -1467 -2120 -1394 -703 -418 432 208
1208 208 40 908 1200 1942 2685 1248 840 832 -12 442 -508 -1280 -2082 -2728 -2061 -1081 -1549 -1180 -277 341
1228 341 1542 2660 2307 3001 1753 562 1309 303 -829 -1526 -2218 -2110 -1578 -1774 -1099 -778 -1086 -574
1246 -574 827 1102 2118 1430 1328 1746 1200 913 857 -97 -555 -1127 -1406 -660 -1512 -2138 -2020 -1801 -1507 -87
1266 -87 340 1073 1775 1519 2633 3089 2143 1600 691 33 -332 -1258 -1767 -2095 -3242 -2927 -1873 -1182 -230
1285 -230 -46 355 1758 2541 2335 2575 1555 1203 1115 533 580 75 -1703 -2099 -1551 -2239 -1762 -2195 -2047 -1050
1305 -1050 -1035 326 1711 1488 1632 1947 2039 2394 2254 1010 554 -289 -1213 -1341 -2285 -2649 -2694 -2344 -1624 -487
1325 -487 -566 427 1001 1492 2612 2044 1885 1452 824 735 875 -494 -944 -1346 -2180 -1468 -1234 -1578 -1289 -982
1345i82M73J117L10O3K53k20N17M06l88l12r41n48J56o42o53M5n87jJ095J83J038
1366C82jj37P61P45O2N5o27r47k26q9m44K25j126k75L70n0J255K36l35N66l25
1387G5J80J012n4M5n78q38K69N32r39J57m19q06K51P9L96K28n78O76Q31K18L10
1408A047K41k69l47P4K3M51j252o75l92l95N32L34l92J63L41K66J455R1m54K95
1428A137n35K83N05p11l01q08q39L65P06o60Q1l68m53J083O15l10Q77l17K88M73
1448A111J90J87n03r28N10n51l83j5r90j19J42RO60M15k83P71L85J35O82o6p5
1469A284J11m37l66l59o97m02L4l57Q4q2k53M23R5M62P11J38L2N14m0M89L24p98
1491I10m7m00o79J97o71o83J30k52J22N09J30N42Q6K52P17P5O1L18l14n69L53
$$ plain form
1345 -982 -509 608 918 981 1234 1014 1531 1937 1549 1237 296 -252 -96 -738 -1391 -1346 -1933 -1934 -839 -656 382
1366 382 381 244 1005 1750 1812 1867 1240 293 67 -22 -466 -241 -1367 -1642 -1272 -1322 -67 169 -166 400 75
1387 75 255 1267 1213 1258 680 -158 111 643 -296 -139 -558 -1364 -1113 -1034 -638 -410 -988 -312 519 737 1047
1408 1047 1288 1019 672 746 769 1220 -32 -707 -1099 -1494 -962 -628 -1020 -857 -516 -250 1205 1296 842 1137
1428 1137 602 885 1390 679 378 -430 -1269 -904 -198 -858 -777 -1145 -1598 -515 100 -210 667 350 638 1111
1448 1111 1301 1488 985 57 567 16 -367 -382 -1372 -1491 -1349 -1340 -680 -265 -548 223 608 743 1425 1359 1284
1469 1284 1395 958 592 233 -464 -866 -832 -1189 -1105 -1187 -1440 -1017 -922 -460 251 389 421 935 895 1384 1708 910
1491 910 863 463 -216 -19 -690 -1373 -1243 -1495 -1373 -864 -734 -192 -106 146 863 938 999 1317 1003 434 787
1512G87o12m01k47m02q6M05n80L96K40O1N04k06K43L84k21Q1O23p74N35L5n98
1533A67j28l09o33N22l93l04P93n56J70P33k70M60O13o00Q24O1q15L73o58k37
1553a87Lk47j51J57o16M07M54j15O44J52m26N07j06j72L92n28l63J41N8J26l19
1574a89m70k6K43n9P96m27k03L97r9O56L70n35R4J41l91K51j11p17k3n49n22R91
1596c82m64j68K99P7Q91P60n50L54n6l01M77j75k48k59r18j76O03k13m01N7l61
1617a154Q80K87j90O96m59j25N84K12JJ18m56J54J06n98K34j05j261K72q2K65
1637f21m4k18M50L81PN13N08j00K29p8n40N65o06m44j03p77J23j26p0M54k20J1
1659g06N07L11l4M64m21pM79j18N59nr17R4k4j96J05l63m67L4k24L47L58m13J42
$$ plain form
1512 787 175 -226 -473 -875 -961 -556 -1136 -740 -500 -439 65 -141 102 486 265 346 969 195 730 765 167
1533 167 39 -270 -903 -381 -774 -1078 -285 -841 -671 62 -208 252 865 265 1089 1150 335 708 50 -187
1553 -187 -184 -431 -582 -425 -1041 -634 -180 -295 349 501 75 582 476 304 696 168 -195 -54 4 130 -189
1574 -189 -659 -685 -442 -501 295 -132 -335 62 -37 619 989 454 548 689 298 549 438 -279 -302 -851 -1373 -382
1596 -382 -846 -1014 -715 -638 253 1013 463 817 761 460 937 762 514 255 -663 -839 -236 -449 -850 -793 -1154
1617 -1154 -274 13 -177 519 60 -65 519 731 732 850 394 548 654 56 290 185 -1076 -804 -886 -621
1637 -621 -665 -883 -433 -52 -45 468 976 876 1105 1027 487 1052 446 2 -101 -878 -755 -881 -951 -497 -717 -706
1659 -706 -199 112 78 542 121 114 593 475 1034 1029 112 206 182 -14 91 -272 -739 -705 -929 -582 -224 -637 -495
1682d95L93J62N57L46m28M45n95o7J25m26j92l75o36N97M16n56M86l9j92L73O15
1703E14k96L72m74M0L3J01K07l48m58K61K70k46m4m9m36K38j96oL39N7K35L08
1725D22l73L56K33l79K57q50K95k67m6m9j83j95O53L0m60N49L68j0L54L1m49J66
1747D53o68M81n1p46k70O13j36L08r6l20L23l5K56N41l53l68O9O8M72J23n93J50
1769B21k76l05N25k29L4n67k02K45L73k08L14J77j10M98N47N7j97k10n16L05m82
1790fl93K59q06M8j01K53N98Q8n58P90l0O12N4m6k66p6m88O25j6l84m72O6ll6
1814b88n7m40R0j57L7N83j85Q07m3L2O84J14k02n9l96p10L21n98k2j12m57J61
1836h97j20L25M73J5R5M12o4L42N65p07k84K75l45K33l00j85j30n48P7M07P9k91
$$ plain form
1682 -495 -102 60 617 963 535 980 385 318 443 17 -175 -550 -1186 -589 -173 -729 -243 -282 -474 -101 514
1703 514 218 590 116 156 189 290 497 149 -309 -48 222 -24 -68 -117 -553 -315 -511 -517 -178 -121 114 422
1725 422 49 405 638 259 516 -334 -39 -306 -352 -401 -584 -779 -126 -96 -556 -7 361 351 705 736 287 453
1747 453 -215 266 215 -531 -801 -188 -324 -16 -112 -432 -109 -144 112 653 300 -68 1 69 541 664 71 221
1769 221 -55 -360 165 -64 -30 -597 -799 -554 -181 -389 -75 102 -8 490 1037 1094 897 687 171 476 -6
1790 -6 -399 -140 -946 -898 -999 -746 -148 -60 -618 172 142 754 808 762 496 420 -68 557 541 157 -315 -249 -252 -288
1814 -288 -345 -785 -695 -852 -815 -232 -417 390 347 379 1063 1177 975 916 520 -190 131 -467 -489 -601 -1058 -897
1836 -897 -1017 -692 -219 -204 -109 303 239 581 1146 439 155 430 85 318 18 -167 -297 -845 -768 -361 -282 -573
1858e73J5K49P5M55n7Q0L17k32M85j62j16j7l05l61K05n65j2l3l18K39J83P5M87
1881A14J28j40M31k3L1P5l97n5J90m36j56N6m14M48j64j80M59k12L33J60r3J58
1903C13nr8J92Q2o96M15P9m90K26l58j98M50l74k00L21k49M43R11m78K61k74J41
1925D14J61k83l11J73m32k32q4k02Q7K00l9N28J96N8o3K93m5R0l49L08k63k62
1947e7N3l84j57L51j55r3k11K01L07l5rL65K67l11M62J41j27J2q8m00L20l81l16
1970b45l86o6k75M37k12K64J86J10N48P4K43M31k87m03K25j60j56k26q89K61J4
1991e12l90J24J4R4O6pL12Q93l52J45K76k30J08j03J95p1l28k65J51n18m56Q2
2013g72j75K12N62k14O16q8L9N44R7k52J49l22J03n9l36m69lk71j7L03m71N93
$$ plain form
1858 -573 -558 -309 -234 221 164 244 561 329 814 652 536 519 214 -147 58 -507 -519 -552 -870 -631 -448 -373 114
1881 114 242 102 533 510 541 616 219 164 354 -82 -238 -182 -596 -148 -312 -492 -33 -245 88 248 155 313
1903 313 308 210 402 484 -212 203 282 -208 18 -340 -538 -88 -462 -662 -341 -590 -147 764 286 547 273 414
1925 414 575 292 -19 154 -278 -510 -594 -796 -709 -509 -548 -20 176 234 171 464 419 509 160 468 205 -57
1947 -57 -4 -388 -545 -194 -349 -442 -653 -452 -145 -180 -189 176 443 132 594 735 608 620 532 132 452 71 -245
1970 -245 -631 -697 -972 -535 -747 -483 -297 -187 361 435 678 1109 822 419 644 484 328 102 -787 -526 -512
1991 -512 -902 -778 -764 -670 -604 -611 -299 594 242 387 663 433 541 438 633 562 234 -31 120 -398 -854 -772
2013 -772 -947 -735 -173 -387 229 141 180 724 821 569 718 396 499 440 104 -365 -368 -639 -656 -353 -824 -231
2035b31l04K28O33j44J05K69n00L80L43o75K93m6m94j99m2lj50L2J21R4J01J42
2057d7K74j5j71O08k92M19j76l14K4l84p8r7l03J76k02J7L13K11M8K09j12R2J95
2080C95J15J57j30k05m26Q0m02p5M4Jj27J76o6J59J90L0K16j97O16K05n54O55
2102H57m48k49L47l74l65O6o97K73J09l24K67Q2l2N22K96q1N17k15j96M18l10
2123D63m20L20o61J18k70m96M12j26R2J04K04Q2N57l90K55K85M5J00R8l26J51
2144E97o78K44pn36l76j2k91M15k0r9K33L63K29K88L88J55K74n22K72k01m08j37
2166A71j30l13m44j71J43J48q9J45K31J41L29L05o3L83K02n08J71q2m54N8k27
2187e4k84l6m22Q8K00j89P3L95k62O89L15l31N49k74k66O18l55r5j09m76p7j23
$$ plain form
2035 -231 -535 -307 326 182 287 556 56 436 779 104 397 351 -143 -342 -384 -387 -537 -505 -384 -290 -189 -47
2057 -47 227 212 41 649 357 776 600 286 310 -74 -152 -249 -552 -376 -578 -561 -248 -37 11 220 108 200 395
2080 395 510 667 537 332 -94 -14 -416 -491 -447 -446 -573 -397 -463 -304 -114 -84 132 -65 551 756 202 857
2102 857 409 160 507 133 -232 -166 -863 -590 -481 -805 -538 -456 -488 34 330 249 766 551 355 773 463
2123 463 43 363 -298 -180 -450 -946 -534 -660 -568 -464 -260 -178 379 -11 244 529 574 674 772 446 597
2144 597 -81 163 156 -380 -756 -768 -1059 -644 -664 -763 -530 -167 62 350 738 893 1167 645 917 716 308 171
2166 171 41 -272 -716 -887 -744 -596 -685 -540 -309 -168 161 466 403 786 988 480 651 569 115 173 -54
2187 -54 -338 -374 -796 -708 -508 -697 -624 -229 -491 198 513 182 731 457 191 809 454 359 250 -226 -303 -426
2209d26m13M09rl26M20q2p5N49J48J06M91k87J26l7k54j29K33n92L61l05k21j09
2231d22Q1k6j79L94j18M64j53L47P8P8r1l18J17J19j53p9k08l51L4k9j65K03M0
2254c37J13J45L25k14L87n8L7n9l36K63p6l11j41k76J13J80rq2K48n9J97M1J42
2277B33j34J77K32l1j29Kj90o9l03o3R7n03N15n62M03p0K2M13m1k48M91L08O2
2300F12j65j28q0o7j12j68k63k07K36k04J40L45n8KJ88rP6L57q1L2l0Nr3j65k04
2325d1j36l52K7N14n93J10j43L7L29M43m06N44m6k2M93q2l15K39o37j67K49k76
2347b31n8k5l0M8l58N63K7p1J45K72N4P6J46j19j53r0j89J35o5l26K1k37QR7j38
2372d98J59K13n6L70l09L41J3J61o5L75m29k79L27l10j71J22j70k58K83k54K46
$$ plain form
2209 -426 -839 -430 -439 -765 -345 -427 -502 47 195 301 792 505 631 594 340 211 444 -148 213 -92 -313 -422
2231 -422 -341 -367 -546 -152 -270 194 41 388 466 544 453 135 252 371 218 139 -69 -420 -386 -415 -580 -377 -337
2254 -337 -224 -79 246 32 419 361 398 339 3 266 190 -121 -262 -538 -425 -245 -254 -336 -88 -147 50 91 233
2277 233 99 276 508 477 348 350 160 91 -212 -275 -178 -681 -166 -728 -325 -395 -373 40 -1 -249 242 550 612
2300 612 447 319 239 172 60 -108 -371 -578 -342 -546 -406 -61 -119 -117 71 62 138 495 414 446 416 421 328 163 -41
2325 -41 -177 -529 -502 12 -581 -471 -614 -577 -248 195 -211 333 287 265 758 676 361 600 -37 -204 45 -231
2347 -231 -289 -314 -344 -296 -654 -91 -64 -135 10 282 336 412 558 439 286 196 7 142 77 -249 -228 -465 -457 -360 -498
2372 -498 -339 -126 -182 188 -121 220 233 394 329 704 275 -4 323 13 -158 -36 -206 -464 -181 -435 -189
2393a89J20j61L58oj83N24l24K7l0J29P8O5m67J23k66J59O5j85k58L79r1k97M66
2416C6l60N33N1l27L19k26l4L08k29N9k03l9k4r7q4N8K26l19M24k3k70M34O9m87
2440b05N67l27q0M0j73J80k4l15L58k52Q5J31J00j33K26l23j70P62n1n07K23K50
2462C62l91J42l98K41k17k84M97l84M11j67J38L13q9j16K80K5j05j74J79l12n8
2483a07P7j54j09j10J0p5L86j23J97Q9J59j97K45L38l05n2k8k14n0k77P7M54m22
2506a91k81K04R1k7N7k57M41K16l15O52j96j8J22j25J06k52j7k68Q1q04O03k16
2528c94K32L9k69J18K89j43M9M99K6l05J47J6j09L69m49p7j05k31L20m52J95j16
2550c51k73N24J23l08J73J50k2K84J67j00J88j38o04J84l86L26J2m48L69k71L6
$$ plain form
2393 -189 -69 -230 128 122 -61 463 139 166 136 265 343 408 -59 64 -202 -43 22 -163 -421 -42 -133 -430 36
2416 36 -324 209 260 -67 252 26 -8 300 71 130 -73 -112 -136 -233 -317 -259 -33 -352 72 49 -221 213 282 -205
2440 -205 362 35 -45 -5 -178 2 -22 -337 21 -231 -146 -15 85 -48 178 -145 -315 447 396 -111 112 362
2462 362 -29 113 -285 -44 -261 -545 -48 -432 -21 -188 -50 263 174 58 338 363 258 84 263 -49 -107
2483 -107 -30 -184 -293 -403 -393 -468 -82 -205 -8 81 240 43 288 626 321 269 241 27 -23 -300 -223 231 -191
2506 -191 -472 -268 -177 -204 -147 -404 37 253 -62 590 394 376 498 373 479 227 210 -58 23 -781 -178 -394
2528 -394 -162 -123 -392 -274 15 -128 -79 420 446 141 288 304 195 564 115 38 -67 -298 22 -430 -235 -351
2550 -351 -624 -100 23 -285 -112 38 16 300 467 367 555 417 -187 -3 -389 -63 -51 -499 -130 -401 -365
2571c65K22j43L29J17J4q3n5K42j00J03j87m2j67k29J92Q7j66J74K48l76K40j18
2593f3N6K32m51L08O9m1J22k08Or6Pk41K80k37L56p9l4Qj11N4K47n8J24j28l6
2618H6M11j61q7k66n3l50m9J9M41J4j03J59M9j83K14J81p4j95L08k79p0J57M3
2641B12l85J06j55j67j12L96J16k07L00O4k14N26j57J29pj45k7J33l35k88l02
2662e19N9j04L83l42J55j51M26M1Q5k51N54Q1k89M16r0R2k92k65Rj59j27K64k1
2685d5m79K42j84K53K33k63K81K29l50L08L26l19M97o49M7P2k55J94j19n84K28
2706c37M8j06k0KJ10J10J93R1J84P4q9J11N8l84Q5j49k77N5j24m0K76k20J66k94
2730d77L99NK26N0O7j02l3LJ96m7j66j26J22k15k86r2Q1p9L88j52j18K26J00K86
$$ plain form
2571 -365 -143 -286 43 160 174 91 36 278 178 281 94 52 -115 -344 -152 -65 -231 -57 191 -185 55 -63
2593 -63 -7 225 -226 82 151 110 232 24 30 -66 -59 -300 -20 -257 99 20 -14 -6 -117 -63 184 126 250 122 86
2618 86 497 336 249 -17 -70 -420 -469 -450 -9 5 -98 61 110 -73 141 322 248 53 361 82 12 169 212
2641 212 -173 -67 -222 -389 -501 -105 11 -196 104 168 -46 480 323 452 445 300 273 406 71 -217 -519
2662 -519 -460 -564 -181 -523 -368 -519 -93 -52 33 -218 336 417 128 544 454 546 254 -11 -2 -161 -288 -24 -45
2685 -45 -524 -282 -466 -213 20 -243 38 267 -83 225 551 232 729 80 127 199 -56 138 19 -565 -337
2706 -337 -289 -395 -415 -413 -303 -193 0 91 275 349 260 371 429 45 130 -19 -296 -241 -365 -405 -129 -349 -183 -477
2730 -477 -78 -73 153 203 270 168 135 138 334 287 121 -5 117 -98 -384 -476 -395 -474 -86 -238 -356 -130 -30 256
2754B56j2k26K78r1k21L85L3j88l41p5J67j58J49k01J26j92M50n64O00l2j81M54
2776D16k70J01k12J30m11j16N48k04j01K1mM5m8o7K47l1j44K68Q1J32j7l41K16
2799B39j2p5k16j40r1O8k05K92j2k74K70K13K09j78J46J95j91k38L90m8j68l67
2821a93N7j3M49p17N5L97n23M81K9L30k36J83j79M26k53j55J14j72R5k43k0j41
2843b29k2r3j83L84P2l2j16L08m7K27O7j00n6J08J43m2j87j90l54J99R0j23Nj61
2867c32K9K6K4L93J54q6J81k02m2L3j01R7L6k15m57M63l27L50k50k55N51k54O7
2890a17K73j19R1J68k1j4Mr5L25m60j88K63k60j23J32J9l25K57K93m98N58n6J83
2913B90O6j90K27k04o5N53m36k65j18j5k76K35j00K69j55m1K64jq5L87j89J70
$$ plain form
2754 256 244 18 296 205 -16 369 402 214 -127 -202 -35 -193 -44 -245 -119 -311 139 -425 175 143 -38 416
2776 416 146 247 35 165 -246 -362 186 -18 -119 -98 -102 -57 -105 -172 75 44 -100 168 249 381 364 23 239
2799 239 227 152 -64 -204 -295 -227 -432 -140 -152 -426 -156 57 266 88 234 429 238 0 390 342 174 -193
2821 -193 -136 -149 300 -417 -362 35 -488 -7 22 352 116 299 120 546 293 138 252 80 175 -68 -88 -229
2843 -229 -251 -344 -527 -143 -71 -103 -219 89 42 269 336 236 180 288 431 389 202 12 -342 -143 -53 -176 -171 -332
2867 -332 -303 -277 -253 140 294 208 389 187 145 178 77 174 210 -5 -462 1 -326 24 -226 -481 70 -184 -117
2890 -117 156 37 128 296 275 261 265 170 495 35 -153 110 -150 -273 -141 -122 -447 -190 103 -395 163 107 290
2913 290 356 166 393 189 124 677 241 -24 -142 -157 -433 -198 -298 -29 -184 -225 39 38 -47 340 151 321
2935C21l71K52j73J24j42j69J45j49J99k11k5R2J15j41Qj4K65L97m02p2Pj93N48
2958D11m98K9j25L20l42R4k4q8L40n4j04J96r4R2j48Q6p3K14j37L0mj70J33j1
2982G3k50o8k18K79K1J78j41J71q5J03K30j19j6o2n2P1l35K88k48R9n5j1k64K05
3006b06J7J88R8j59L36K03k67J70l43K13k29J34r0l6j42m5k51K70J12m66M17K00
3028A24Q2l19M09m61M82m6J38l29L59k13j96J21j12n91K48j9m0N3m2K66J1J60
3050H5j24K09J37p0k39K90j17M5M1l60l97M83l58J80q7o2M67o2j59R3R9m0K45
3073B99L4j02N7P8l03M8j72K07k33j34K38r3R1n5KP1p6j23J89O2OK65l29l3K8
3098B2m5J49l35O4j17q1K30q4J10j63J35L85l63O4L21j14R9n7j07J40m18j15J28
$$ plain form
2935 321 -50 202 29 153 11 -158 -13 -162 37 -174 -199 -107 8 -133 -125 -139 126 523 121 49 56 -137 411
2958 411 -87 -58 -183 137 -205 -111 -135 -223 117 63 -41 155 61 153 5 91 18 232 95 125 121 -49 84 73
2982 73 -177 -245 -463 -184 -163 15 -126 45 -40 63 293 174 158 96 44 115 -220 68 -180 -81 -136 -147 -411 -206
3006 -206 -189 -1 97 -62 274 477 210 380 37 250 21 155 65 29 -113 -158 -409 -139 -27 -493 -76 124
3028 124 206 -113 296 -165 317 271 409 80 439 226 30 151 39 -552 -304 -323 -363 -310 -352 -86 -75 85
3050 85 -39 170 307 237 -2 288 171 216 257 -103 -500 -17 -375 -195 -282 -344 123 61 -98 -5 94 54 299
3073 299 333 231 288 366 63 111 -61 146 -87 -221 17 -76 15 -40 -38 33 -43 -166 23 85 91 356 27 -6 22
3098 22 -23 126 -209 -145 -262 -343 -113 -197 -87 -250 -115 270 -93 -29 292 178 277 220 113 253 -165 -280 -152
3121a52r8n2M08j35J17j43P8K20nj29J45q8j9O6r1n0J33l93J83O2k63L14k53l0
3145a75J46j04J54O0j03k5J38kj58K7j4J94j7l20L34k79N6l17K55J7j18K82j25
3168i4M2J22J73pJ23j28j11j5J2l86K09l9j80K52j60m3L72m88L66O3k72M06J50
3191C67l38J79q2j60K68l60L0N8Pn8o6r5j3P7j48M76n1R8J74K4k98L83m57J28
3215A43R9k15j8%Q3k51j01o4J87n5K0J90N6J84k8k77J74j12J69J79n4l92M1o3
3239a05K6j3k17o9N5l2k07O46j71J32j31N07k65K78q1r4m2k14J07j07k49K15m93
3262e24O80l93n8J87k9K65J00m5P8Q0l30l2J09j9JJ64k31m6J55l7L2j72r3K6p2
3287b04K88R2o9P6j42j51N25m30j9R4k61K68j64p3O1O7l1J21j71Q2j27J60J86
$$ plain form
3121 -152 -250 -302 106 -29 88 -55 23 243 238 109 254 166 147 213 122 72 205 -188 -5 57 -206 108 -145 -175
3145 -175 -29 -133 21 81 -22 -47 91 89 -69 -42 -56 138 121 -199 135 -144 -88 -405 -150 -133 -251 31 -94
3168 -94 -52 70 243 236 359 231 120 105 117 -269 -60 -99 -279 -27 -187 -230 142 -346 20 83 -189 217 367
3191 367 29 208 126 -34 234 -126 -96 -38 -31 -89 -155 -250 -263 -186 -334 142 91 189 363 387 89 472 15 143
3215 143 242 27 9 9 92 -159 -260 -324 -137 -192 -172 18 74 258 230 -47 127 15 184 363 309 -83 -42 -105
3239 -105 -79 -92 -309 -378 -323 -355 -562 84 -87 45 -86 421 156 434 353 259 217 3 110 3 -246 -31 -524
3262 -524 156 -237 -295 -108 -137 128 228 183 261 341 11 -21 88 69 70 234 3 -43 112 75 107 -65 -158 -132 -204
3287 -204 84 176 107 183 41 -110 415 -15 -34 60 -201 67 -97 -170 -109 -42 -73 48 -123 -41 -168 -8 178
3310A78L02k48J51k93m63J30J12L10l05J48k7j93R6k6j17L03P3J39l58K01L16
3331D29l42Q6j75q7l4r1k9M48m83K32r2K8J23k7J1j26J06L08k26R6L66m49k10
3354a38J21k04m0O2M5O8P8k21J26j51J58J29J24P9J35kj86Q8O1l3Mm35k66M59
3378F1k81K77k06L1J19ok69K48J23j29L92p8k91K79l20j14L76j74K06l40m0M9
3400h7k43J13j22L91m8k4k08J43J88O3o3K74l83J47j24p2Kl3m2OJ96l49j41J78
3424b38K55j41J21R7Q3K5P9k21j22L3M5k39J97j26M20l58m79N41j27J51j96J37
3446f3J21j31j7J95J7J46j00l4K2Q9l03l45M39l4J58k1j85Q8J99j64j34N67o57
$$ plain form
3310 178 480 232 383 90 -373 -243 -131 179 -126 22 -5 -198 -102 -128 -245 58 131 270 -88 113 429
3331 429 87 173 -2 -89 -123 -214 -243 205 -278 -46 -138 -110 13 -14 -3 -129 -23 285 59 155 521 72 -138
3354 -138 -17 -221 -261 -199 -154 -86 -8 -229 -103 -254 -96 33 157 236 371 369 183 271 332 299 303 -132 -398 61
3378 61 -220 57 -149 -118 1 -5 -274 -26 97 -32 360 282 -9 270 -50 -164 212 38 244 -96 -136 -87
3400 -87 -330 -217 -339 52 4 -20 -228 -85 103 166 103 377 -6 141 17 -55 -53 -86 -128 -122 74 -275 -416 -238
3424 -238 17 -124 -3 94 177 202 281 60 -62 -29 16 -223 -26 -152 268 -90 -569 -28 -155 -4 -200 -63
3446 -63 58 -73 -90 105 122 268 168 134 156 245 -58 -403 36 2 160 139 -46 42 241 77 -57 510 -147
$$ [...]
8191A82
##END NTUPLES=NMR FID
##END=
