##TITLE=1H_DE-98_2_oil
 200.13MHz,CDCl3,
 8 sc
 
 1.7.2025
##JCAMPDX= 6.0         $$ Bruker NMR JCAMP-DX V2.0
##DATA TYPE= NMR FID
##DATA CLASS= NTUPLES
##ORIGIN= UXNMR, Bruker Analytische Messtechnik GmbH
##OWNER= pz
$$ XWIN-NMR		Version 3.5
$$ Tue Jul  1 15:48:17 2025 Russian Standard Time (UT+4h)  she@DPX200
##.OBSERVE FREQUENCY= 200.1313
##.OBSERVE NUCLEUS= ^1H
##.DELAY= (6, 6)
##.ACQUISITION MODE= SIMULTANEOUS
##.ACQUISITION SCHEME= undefined
##.AVERAGES= 8
##.DIGITISER RES= 18
##SPECTROMETER/DATA SYSTEM= spect
##.PULSE SEQUENCE= zg30
##.SOLVENT NAME= CDCl3
##.SHIFT REFERENCE= (INTERNAL, CDCl3, 0, 14.3821)
##AUDIT TRAIL= $$ (NUMBER, WHEN, WHO, WHERE, WHAT)
$$ ##TITLE= Audit trail, XWIN-NMR		Version 3.5
$$ ##JCAMPDX= 5.01
$$ ##ORIGIN= Bruker BioSpin GmbH
$$ ##OWNER= she
$$ F:/spectra/data/she/nmr/H-C/1/audita.txt
$$ ##AUDIT TRAIL=  $$ (NUMBER, WHEN, WHO, WHERE, WHAT)
(   1,<2025-07-01 15:46:16.78 +0400>,<she>,<DPX200>,
      <created by zg, POWCHK disabled, PULCHK disabled
       configuration hash MD5:
       00 E9 B6 7A A2 85 ED C7 34 08 36 98 17 FE 4E 26
       data hash MD5: 16K
       EB D9 51 E1 12 31 AB 8B CA E0 D2 92 0D 74 AD BF>)
$$ ##END=
$$ 
$$ hash MD5
$$ 55 6E F9 81 D5 5B 19 3A 2F 12 94 F7 AA FA 89 B6
##$RELAX= 
##$RELAX= 
##$RELAX= 
##$RELAX= 
##$RELAX= 
##$RELAX= 
$$ Bruker specific parameters
$$ --------------------------
##$DU= <F:/spectra>
##$EXPNO= 1
##$NAME= <H-C>
##$PROCNO= 1
##$TYPE= <nmr>
##$USER= <she>
##$AMP= (0..31)
100 100 100 100 100 100 100 100 100 100 100 100 100 100 100 100 100 100 
100 100 100 100 100 100 100 100 100 100 100 100 100 100 
##$AQSEQ= 0
##$AQ_mod= 1
##$AUNM= <au_zg>
##$AUTOPOS= <>
##$BF1= 200.13
##$BF2= 200.13
##$BF3= 200.13
##$BF4= 200.13
##$BF5= 200.13
##$BF6= 200.13
##$BF7= 200.13
##$BF8= 200.13
##$BYTORDA= 1
##$CFDGTYP= 0
##$CFRGTYP= 5
##$CHEMSTR= <none>
##$CNST= (0..31)
1 1 145 1 1 1 1 1 1 1 1 1 1 1 1 1 1 1 1 1 1 1 1 1 1 1 1 1 1 1 1 1 
##$CPDPRG= <>
##$CPDPRG1= <>
##$CPDPRG2= <>
##$CPDPRG3= <>
##$CPDPRG4= <mlev>
##$CPDPRG5= <mlev>
##$CPDPRG6= <mlev>
##$CPDPRG7= <mlev>
##$CPDPRG8= <mlev>
##$CPDPRGB= <>
##$CPDPRGT= <>
##$D= (0..31)
0 0.7 0 0 0 0 0 0 0 0 0 0.03 0 0 0 0 0 0 0 0 0 0 0 0 0 0 0 0 0 0 0 0 
##$DATE= 1751370375
##$DBL= (0..7)
120 120 120 120 120 120 120 120 
##$DBP= (0..7)
150 150 150 150 150 150 150 150 
##$DBP07= 0
##$DBPNAM0= <>
##$DBPNAM1= <>
##$DBPNAM2= <>
##$DBPNAM3= <>
##$DBPNAM4= <>
##$DBPNAM5= <>
##$DBPNAM6= <>
##$DBPNAM7= <>
##$DBPOAL= (0..7)
0.5 0.5 0.5 0.5 0.5 0.5 0.5 0.5 
##$DBPOFFS= (0..7)
0 0 0 0 0 0 0 0 
##$DE= 6
##$DECBNUC= <off>
##$DECIM= 32
##$DECNUC= <off>
##$DECSTAT= 4
##$DIGMOD= 1
##$DIGTYP= 9
##$DL= (0..7)
0 120 120 120 120 120 120 120 
##$DP= (0..7)
150 150 150 150 150 150 150 150 
##$DP07= 0
##$DPNAME0= <>
##$DPNAME1= <>
##$DPNAME2= <>
##$DPNAME3= <>
##$DPNAME4= <>
##$DPNAME5= <>
##$DPNAME6= <>
##$DPNAME7= <>
##$DPOAL= (0..7)
0.5 0.5 0.5 0.5 0.5 0.5 0.5 0.5 
##$DPOFFS= (0..7)
0 0 0 0 0 0 0 0 
##$DQDMODE= 0
##$DR= 18
##$DS= 0
##$DSLIST= <SSSSSSSSSSSSSSS>
$$ [...]
##$SUBNAM0= <"">
##$SUBNAM1= <"">
##$SUBNAM2= <"">
##$SUBNAM3= <"">
##$SUBNAM4= <"">
##$SUBNAM5= <"">
##$SUBNAM6= <"">
##$SUBNAM7= <"">
##$SUBNAM8= <"">
##$SUBNAM9= <"">
##$SW= 18.0517328524113
##$SWIBOX= (0..15)
0 0 2 0 0 0 0 0 0 0 0 0 0 0 0 0 
##$SW_h= 3612.71676300578
##$TD= 16384
##$TD0= 1
##$TE= 0
##$TE2= 300
##$TE3= 300
##$TEG= 300
##$TL= (0..7)
0 120 120 120 120 120 120 120 
##$TP= (0..7)
150 150 150 150 150 150 150 150 
##$TP07= 0
##$TPNAME0= <>
##$TPNAME1= <>
##$TPNAME2= <>
##$TPNAME3= <>
##$TPNAME4= <>
##$TPNAME5= <>
##$TPNAME6= <>
##$TPNAME7= <>
##$TPOAL= (0..7)
0.5 0.5 0.5 0.5 0.5 0.5 0.5 0.5 
##$TPOFFS= (0..7)
0 0 0 0 0 0 0 0 
##$TUNHIN= 0
##$TUNHOUT= 0
##$TUNXOUT= 0
##$USERA1= <user>
##$USERA2= <user>
##$USERA3= <user>
##$USERA4= <user>
##$USERA5= <user>
##$V9= 5
##$VALIST= <valist>
##$VCLIST= <CCCCCCCCCCCCCCC>
##$VD= 0
##$VDLIST= <DDDDDDDDDDDDDDD>
##$VPLIST= <PPPPPPPPPPPPPPP>
##$VTLIST= <TTTTTTTTTTTTTTT>
##$WBST= 1024
##$WBSW= 4
##$XGAIN= (0..3)
0 0 0 0 
##$XL= 0
##$YL= 0
##$YMAX_a= 51989
##$YMIN_a= -99965
##$ZGOPTNS= <>
##$ZL1= 120
##$ZL2= 120
##$ZL3= 120
##$ZL4= 120
##$ABSF1= 10
##$ABSF2= 0
##$ABSG= 5
##$ABSL= 3
##$ALPHA= 0
##$AQORDER= 0
##$ASSFAC= 0
##$ASSFACI= 0
##$ASSFACX= 0
##$ASSWID= 0
##$AUNMP= <proc_1d>
##$AZFE= 0.1
##$AZFW= 0.1
##$BCFW= 1
##$BC_mod= 2
##$BYTORDP= 1
##$COROFFS= 0
##$CY= -3
##$DATMOD= 1
##$DC= 2
##$DFILT= <>
##$DTYPP= 0
##$F1P= 0
##$F2P= 0
##$FCOR= 0.5
##$FTSIZE= 0
##$FT_mod= 4
##$GAMMA= 1
##$GB= 0.15
##$INTBC= 1
##$INTSCL= 1
##$ISEN= 128
##$LB= 0.25
##$LEV0= 0
##$LPBIN= 0
##$MAXI= 10000
##$MC2= 0
##$MEAN= 0
##$ME_mod= 0
##$MI= 1.114404
##$NCOEF= 0
##$NC_proc= 0
##$NLEV= 6
##$NOISF1= 3.799351
##$NOISF2= 2.8
##$NSP= 1
##$NTH_PI= 0
##$NZP= 0
##$OFFSET= 14.38212
##$PC= 1
##$PHC0= -1196.362
##$PHC1= 26.1922
##$PH_mod= 1
##$PKNL= yes
##$PPARMOD= 0
##$PSCAL= 0
##$PSIGN= 0
##$REVERSE= no
##$SF= 200.129724274929
##$SI= 16384
##$SIGF1= 3
##$SIGF2= 2
##$SINO= 400
##$SIOLD= 16384
##$SREGLST= <1H.CDCl3>
##$SSB= 0
##$STSI= 0
##$STSR= 0
##$SW_p= 3205.1282051282
##$SYMM= 0
##$S_DEV= 0
##$TDeff= 0
##$TDoff= 0
##$TI= <>
##$TILT= no
##$TM1= 0
##$TM2= 0
##$TOPLEV= 0
##$USERP1= <user>
##$USERP2= <user>
##$USERP3= <user>
##$USERP4= <user>
##$USERP5= <user>
##$WDW= 1
##$XDIM= 8192
##$YMAX_p= 0
##$YMIN_p= 0
$$ End of Bruker specific parameters
$$ ---------------------------------
##NTUPLES= NMR FID
##VAR_NAME=  TIME,          FID/REAL,        FID/IMAG
##SYMBOL=    X,             R,               I
##VAR_TYPE=  INDEPENDENT,   DEPENDENT,       DEPENDENT
##VAR_FORM=  AFFN,          ASDF,            ASDF
##VAR_DIM=   8192,          8192,            8192
##UNITS=     SECONDS,       ARBITRARY UNITS, ARBITRARY UNITS
##FACTOR=    0.0002768,     1,               1
##FIRST=     0,             0,               0
##LAST=      2.2672688,     0,               0
##MIN=       0,             -99965,          0
##MAX=       2.2672688,     51989,           0
$$ Real data points
##PAGE= N=1
##DATA TABLE= (X++(R..R)), XYDATA
$$ [...]
1822b8M7j64rP3m5N2K29r3k7Q9k10R5J22O0n53N22K36j81N5l33j07K22l25J72
1846a01J42J32k6O1l64R5P7Q5K8k91R8j3j6qO7j48Q8l30K46J03J68j59j36J50
1870e2O2p8J17JK11k19J66j98R5q3k0J13l7j00J29l33L83l08J11K23k34J45k20
1893a26L69k42R3L94o14j7J58j10K52k39K88l81J29J43k49l5K94l89L89j58J59
1914A08j48N4n0M04n32K52k77L32Nm6j24n6k12M14j27J3n4l9L1j00j6K68j34o1
1938i5q2r5K21o6O8l9L63k47J05o4J7j22j1O4O4L2p6k55J71j08mK51n2J04j30
1963A4P3n3J25j76J72j0l1k51r5J34K95r9j37r7J09M8k97M34j69j40m9J45O4k07
1987a98J23K85j52l21L16N1k57K39J23k12K6J9N1J83k47k1p9Q7k71J59K72l80
$$ plain form
1822 -28 19 -145 -154 -81 -126 -74 155 62 35 124 -86 9 131 191 -362 160 396 215 270 -63 -170 52 -273 -101
1846 -101 41 173 147 208 -156 -61 16 101 129 -162 -64 -77 -93 -101 -34 -182 -94 -424 -178 -75 93 -66 -202 -52
1870 -52 10 -68 49 50 261 42 208 10 105 22 2 115 78 -22 107 -226 157 -151 -40 183 -51 94 -126
1893 -126 243 1 94 488 -126 -143 15 -95 157 -82 206 -175 -46 97 -152 -187 107 -282 107 -51 108
1914 108 -40 14 -36 368 -164 88 -189 143 148 102 -22 -78 -290 124 -3 10 -44 -83 -52 -152 -168 100 -34 -95
1938 -95 -177 -272 -51 -117 -49 -88 275 28 133 69 86 -36 -47 17 81 113 37 -218 -47 -155 -159 92 40 144 14
1963 14 87 34 159 -17 155 145 114 -137 -232 -98 197 98 -39 -136 -27 21 -276 158 -11 -151 -200 -55 9 -198
1987 -198 -75 210 58 -263 53 104 -153 86 209 -3 23 42 93 276 29 8 -71 16 -255 -96 176 -204
2009b04M33k19k1J47q9K6j94J05k7J7k20K55J31j45l9n9Q3J9j61M52k92j3j2o6
2033i3Q8k16L39j4R2q0kl46M69k70K17l00n6K24j41l3nN8J74k96N0j6K60j28R2
2058F7j67J21j13j22K08k13L09q1K4P4j5j72J85k35j0j71N16k28K78l09k08J20
2080a42L99k44J77m2J9l75L84j56J24j71%J82j29k3k11L22m05K16J63m6j6J78
2102B04j14J27l61J99j22P1j33L95m69K76p2O0j63J76N8j32J07Rj55Q9j53J09
2124FJ1J46l48J03J71n8J07j02r3J57L1k04M4r0J20j1J9JJ7j13L01j01l57L54
2148A11j22K10m15K75m08J61J21M0L4k25K98jk86K12Q0k86K56j25J02P9k11K96
2170A96k59J72k4k95L47N3k01j02J14J66J4j15l0j26l8r1J22J18L1K81l90o5o
$$ plain form
2009 -204 229 10 -11 136 47 73 -121 -16 -43 -26 -246 9 140 -5 -44 -103 -20 -1 -162 290 -2 -15 -27 -93
2033 -93 -5 -221 118 104 196 116 114 -232 237 -33 184 -116 -172 52 -89 -122 -127 -69 105 -191 -141 -157 103 -25 67
2058 67 -100 21 -92 -214 -6 -219 90 9 33 107 92 -80 105 -130 -140 -311 205 -23 255 -54 -262 -142
2080 -142 257 13 190 148 167 -208 176 20 144 -27 -27 155 26 3 -208 114 -291 -75 88 42 26 204
2102 204 90 217 -144 55 -67 4 -129 266 -203 73 1 61 -102 74 132 0 107 116 -39 50 -103 6
2124 6 17 163 -185 -82 89 31 138 36 -57 100 131 -73 -29 -119 1 -10 9 10 27 -86 215 114 -243 111
2148 111 -11 199 -216 59 -349 -188 -67 -27 7 -218 80 79 -207 5 85 -201 55 -70 32 111 -100 196
2170 196 -63 109 85 -210 137 190 -11 -113 1 167 181 66 36 -90 -128 -219 -97 21 52 333 -57 -122 -128
2193a28n4L37o9n6o8n5N6P7J45l38O02m51r1K62m42nL98k25K31Pj86o9J14M0j2
2218B0N8j42K42l40K58j21k2J5J71m8j71J31j48j43J88K49j06K4j20J40m45L11
2240AK0r1J27Q6m08N59j79k21J63q3kJ29r4J38p9m9J97k04K11r1j79K18l14K0
2264a25n3L92j72O2l9P2k51j3N2k28N01l98J23J09Q7j1j23K07o26L78J56k6j99
2287a25Q5O1k35K82j82L00j52L2j42j5J42J35L5j66j47J42J85j89J77k75O2l82
2309c72L67Qj06J20J95l22K11K39k62R2l10J11j61J68J07j54L56k17P4k40J81
2330H5R4j63j21L11m4k9M8k53K29N3j90j13j75R8M74N8k55qJ70ko0k59r8j0K16
2355E6J46m52K02j73J09rJ06k39M16j71lj88J71mJ82k2j47K18j69j67K51j32k2
$$ plain form
2193 -128 -182 155 86 30 -38 -93 -37 40 185 -153 449 -2 -93 169 -273 -278 120 -105 126 133 -53 -122 -8 32 20
2218 20 78 -64 178 -162 96 -25 -47 -32 139 91 -80 51 -97 -240 -52 197 91 115 -5 135 -310 1
2240 1 21 -70 57 143 -265 294 115 -106 57 -26 -28 101 7 145 66 17 214 10 221 130 -49 169 -145 -125
2264 -125 -178 214 42 104 65 137 -114 -127 -75 -303 198 -200 -77 32 119 108 -15 192 -434 -56 100 74 -125
2287 -125 -40 21 -214 68 -114 186 34 66 -76 -91 51 186 221 55 -92 50 235 46 223 -52 10 -372
2309 -372 -5 3 -103 17 212 -110 101 340 78 170 -140 -29 -190 -22 85 -69 287 70 144 -96 85
2330 85 179 16 -105 206 162 133 181 -72 157 210 20 -93 -268 -170 304 362 107 99 269 267 207 -52 -150 -160 56
2355 56 202 -250 -48 -221 -112 -121 -15 -254 162 -9 -12 -200 -29 -33 149 127 -20 198 29 -138 113 -19 -41
2378d1j41m2L59R7p8k72o1O6J58l05L18j67J62j15L93k12P5Q1j57M0k39p7O10
2401D52o05R0nJ59P8k32k19K48o7K37k66J07M8K6rQJ34Pk16O0L7j58K17m52K60
2426f1Q7L0k32L56k16J33l23M8r1J37K44j60J49j85j65n9L96Pj54l8j61J83Q9
2449A4L13j84j02J34k98J30l19J59Nk58L83R4Mj29P0j20j61J59j56K97K17m75
2471b23K30m2N4Nq8J97K0j05j73o2M6J82J08J04m12K69l25J81J8QJ3j70K01m8
2495a2L5q2K7r4J73K6j14Q4k46J84R4l4m95N21J05l97R9J57j56J65j83K54j34
2518b3M4rk67L48J16j86OJ42j99j03J11l3J63p4j69j06p4J85J05k1J23j87O1O4
2542A7J01j12K3R5J04j60j04J5J00J2j03R2j07n0R2K37k94J06k3o3J56J04J06
$$ plain form
2378 -41 -182 -224 135 232 154 -118 -179 -113 45 -260 58 -109 53 -62 331 119 194 275 118 158 -81 -158 452
2401 452 -153 -63 -68 91 169 -63 -282 -34 -101 136 -130 -23 25 51 42 50 184 191 -25 35 72 -86 131 -321 -61
2426 -61 26 56 -176 180 -36 97 -226 -178 -269 -132 112 -48 101 -84 -249 -308 88 95 -59 -97 -258 -75 14
2449 14 327 143 41 175 -123 7 -312 -153 -148 -406 -23 71 75 -54 16 -104 -265 -106 -262 35 252 -223
2471 -223 7 -35 19 24 -64 133 153 48 -125 -187 -141 41 149 253 -159 110 -215 -34 -16 -8 5 -165 36 -12
2495 -12 23 -59 -32 -126 47 73 -41 43 -203 -19 75 41 -454 67 172 -225 -126 31 -125 40 -143 111 -23
2518 -23 21 12 -255 93 209 23 29 171 -28 -131 -20 -53 110 36 -133 -239 -313 -128 -23 -44 79 -108 -47 17
2542 17 118 6 29 124 228 68 -36 -21 79 91 -12 80 -27 -77 15 252 -42 64 41 -22 134 238 344
2565C44l57Pp5R8k6j1J09j61J66l34L17J07k42J45q5J93J50k34m16j1K31L16l07
2588g6J37j3j68J56j6nj79L16j93K8J42rJ72l48q8J59k54J56n8P0n3K05o2K85
2612C04k83j64K80L0k78K18k64R5P7j23J7K05j95K29K5j41o9J08j38J39r1R6m0
2635C7J7J0k17N98l82j26K8R4j21p4M05k65n3K54m17L7L62j24j25j02qJ37P8J16
2659A59o6j95J64l7M29m67O3J8j7j82K03j97J60o1k70L39Q3j73K08j42P0p2p9
2682f2K26j37j00N0p8l9K85k83K34P8l94K04j79M83m97J44J1J4J27j89j05M97
2704B90k60J29r5K52j45K0l46J08QJ33r7J12r5j49J21j3l44J74L7K31j03q2J36
2727B2p9L40k87J54l00J78L58m71K18j93j3J9J19P9M8k80J4j17J23J72j54J52
$$ plain form
2565 344 -13 -6 -81 17 -9 -20 89 -72 94 -240 77 184 -58 87 2 195 345 111 -305 -316 -85 231 -76
2588 -76 61 48 -120 36 20 15 -164 152 -41 -13 129 120 292 -56 -144 15 -239 -83 -141 -71 -124 81 19 304
2612 304 21 -143 137 167 -111 107 -157 -62 15 -108 -91 114 -81 148 173 32 -37 71 -67 72 -19 77 37
2635 37 54 64 -153 445 63 -63 -35 59 -62 -136 269 4 -49 205 -212 -175 187 63 -62 -164 -172 -35 43 159
2659 159 93 -102 62 25 454 -13 50 68 51 -131 72 -125 35 -26 -296 43 126 -47 161 19 89 17 -62
2682 -62 164 27 -73 -23 -101 -140 145 -138 96 174 -220 -16 -195 288 -209 -65 -54 -40 87 -102 -207 290
2704 290 30 159 64 316 171 191 -155 -47 -39 94 -3 109 14 -135 -14 -27 -371 -197 -160 71 -32 -114 22
2727 22 -57 283 -4 150 -150 28 386 -85 133 -60 -73 -54 65 144 192 -88 -74 -191 -68 104 -50 102
2749A02L1M0O5r1j62j57L7O6k26L65n8Rj51Q2J19k53J50K51M9j96l66J08K28j52
2773a10k1J31k2r2J85p4O1K18j42m12M95l39J57j8o8K11k94L49rk96n2j57L70
2796G1J39m17L06J20p0k63J50l75L01j8J17J0q3m0J82k03J77j06J06k6Ml07L20
2819I5J6K13n43M05j61m0N6k26J39N8l08K44j9j40K1p3K67P5j86N1p9J58l7L3
2843A9k61L83k09k6J93k03K55j63J01j41J16q7JN2o0J17L7j04k94K64l5j7l3P2
2867b3J05j40L9J02O1r2m7J93n20M92m82N07k73J77L2r4j14J21j72N4k3K53l23
2890a67K89L3k64M67n42K43m9P5j37K17p7j13Q1n9l0L4p4J03J35l40qM18n31J55
2914a41m5J45M6J15j15r2n2J43k15L10r8n1k35L46k04j3K03m1K72k00j17L9j49
$$ plain form
2749 102 133 173 238 147 -15 -172 -135 -69 -295 70 12 21 -130 -48 71 -182 -32 219 268 72 -294 -186 42 -110
2773 -110 -131 0 -22 -114 71 -3 58 276 134 -278 217 -122 35 17 -51 160 -134 215 206 -90 -142 -299 71
2796 71 210 -207 99 219 149 -114 36 -339 -38 -56 61 71 -12 -52 130 -73 104 -2 104 78 82 -225 95
2819 95 111 324 -219 186 25 -15 41 -185 -46 12 -296 -52 -71 -211 -190 -263 4 79 -107 -56 -135 23 -14 19
2843 19 -242 141 -68 -94 99 -104 151 -12 89 -52 64 -23 -22 30 -30 87 124 20 -274 -10 -45 -62 -95 -23
2867 -23 82 -58 -19 83 144 52 5 198 -322 170 -312 195 -78 99 131 37 -77 44 -128 -74 -97 156 -167
2890 -167 122 155 -109 358 -184 59 10 85 -52 165 88 -25 56 -3 -33 1 -73 30 165 -175 -183 235 -296 -141
2914 -141 -186 -41 5 120 5 -87 -139 4 -211 99 1 -50 -285 61 -143 -156 47 6 278 78 -39 0 -149
2937a49K16k07J15Q9P4l87L45p2j48Mo8L00j17k8j12J92N3k10m9M34j92j80J67
2960G0r1j6L27j58j59l00L50n6R6o3k21K01m3J19k62L25l29J22J49k51J05K03
2982A18k58L25o9J14k73J44j61J98k08p2jL66l26k9m9L72l13J33K41k17J54l91
3004b02K04j83J05M7J92k1qr8q0j54K28k42J42j74L18j12K10k84J89K38k21k44
3026a50j32k7K62Q1p8J07J29J9l01o2P0j11J68P8K6r8K7K7L1j05M0Q9m4M3k04
3051a15p9J22j37L48j95M0k84J60J59l96O44j96j25r0J02J7Q1k81k0M39k57Q5
3073B2p7n4K81p4k16NP3j16J18mj16K92n5k26K26j37N9R0R5k12k64K27L02j53
3097H6n2j30J28l6l35K30K01j66Q2J90j56j8J4K4O7J41l59Q1J97k02m9J83k13
$$ plain form
2937 -149 67 -140 -25 64 138 -249 96 24 -124 -120 -188 112 -5 -33 -145 47 100 -110 -159 275 83 -97 70
2960 70 -21 -37 290 132 -27 -327 23 -33 63 0 -221 -20 -63 56 -206 119 -210 -88 61 -190 -85 118
2982 118 -140 185 116 230 -43 101 -60 138 -70 -142 -143 223 -103 -132 -181 191 -122 11 252 35 189 -202
3004 -202 2 -181 -76 -29 163 142 134 36 -44 -198 30 -212 -70 -244 74 -38 172 -112 77 315 94 -150
3026 -150 -282 -309 -47 34 -44 63 192 211 -90 -152 -82 -193 -25 53 79 -19 8 35 66 -39 1 90 46 89 -115
3051 -115 -194 -72 -209 139 -56 -16 -300 -140 19 -377 267 71 -54 -144 -42 -25 56 -225 -245 194 -63 22
3073 22 -55 -109 172 98 -118 -113 -40 -156 -38 -42 -158 134 79 -147 79 -58 1 91 186 -26 -290 -63 239 86
3097 86 34 -96 32 -4 -339 -109 92 -74 8 198 42 24 38 62 129 270 -89 -8 189 -13 -62 121 -92
3120i2K84k53R7n7Q9p9J58k16L19l34N7J74k30j15L96k39j31O9K4Q3K6j92J31
3143c1R6lK12l55J76K11m00OP9r6J53r1k53L94j59J16j27L0J05j25j01K78j27
3166a2K76k94J50k18K28m0o7k2K03j54J20J40k47r3l18O61k28k2K7k25K32p6j54
3189a33K97l65K40qj29K00k79J56m9K18J6O3l34J75J19j88j16Mm0J10J02m2k99
3212b82L81j82J20k1J47k09K16k65j34J18L8K02l1j02N0k31K21j14J39O1j01J68
3234A89k45n6N7J84kj36n7J92k01K93k47M3j26P3l3m7L50m22Q5P7N3J16j95J57
3258A02j28J53j90Q3o2j94J83J99j38n8O1j69J59j0J25k81K04q0l1j84L64J77
3280B85m49K37j82K15k41J99q2o8J72o5O8J0k22N8j10J96p6K6n0R8Q0l7J47j37
$$ plain form
3120 -92 192 -61 36 -21 68 -11 147 -69 250 -84 -27 147 -83 -198 198 -41 -172 -103 -79 4 30 -162 -31
3143 -31 65 62 274 -81 95 306 -94 -88 -9 -105 48 -43 -296 98 -61 55 -72 -42 63 -62 -163 115 -12
3166 -12 264 -30 120 -98 130 90 23 1 204 50 170 310 63 -30 -348 313 85 63 90 -135 97 21 -133
3189 -133 164 -201 39 31 -98 102 -177 -21 -70 148 164 227 -107 68 187 -1 -117 -113 -153 -43 59 17 -282
3212 -282 99 -83 37 16 163 -46 170 -95 -229 -111 -73 129 98 -4 46 -185 36 -78 61 122 21 189
3234 189 -56 -112 -55 129 127 -9 -66 126 -75 218 -29 14 -112 -39 -72 -119 231 -191 -106 -29 24 140 -55 102
3258 102 -26 127 -63 20 -42 -236 -53 146 8 -50 11 -158 1 -9 116 -165 39 -41 -72 -256 108 285
3280 285 -164 73 -109 106 -135 64 -18 -86 86 21 89 99 -123 -65 -175 21 -55 -29 -79 19 99 62 209 72
3304G2o6O8j06j6j02M3J64oj81R1n0j1J38Q4j04j47J74L2M7N5m53L85r4J30j95
3329d8J03j18O8j60L45p1o5o9j70R3K4N1R0m2j78J59J27L0l60K57j08J6J55or7
3354B6R6l84K07J16j15J54P3j63J85j32j3n8j76M6o0M09M9k18j61M53j85K8k72
3377i5J70O2j48o0L50k57M3q3M7J36j47k17L85j23q9K3j76k5K77L59m37k95L32
3400C2qj55J2j8O5j21L44j12L7k93K59j92L3K2J97j66k10K55p8k8J63j20RJ99
3424A26m3m5lL0p4k9L79l82R4n7K3K80l57Q9m7jk5J52m2O0j88K14j46K25j65J84
3450B52k58p5J68j55L6j30J32o7L52n03J04P7J35j10J43P5m06J44L55k39j4k74
3472b58jJ53J99k45R8m5J22K90k37j1r0K6L0J25j96K42o6j96r1K17r4q4K6K1J95
$$ plain form
3304 72 6 74 -32 -48 -150 -107 57 51 -130 -39 -89 -100 38 122 18 -129 45 77 124 179 -274 111 17 147 -48
3329 -48 55 -63 5 -155 190 119 54 -15 -185 -92 -68 -17 73 31 -147 12 139 169 -191 66 -42 -26 129 123 26
3354 26 122 -262 -55 61 -54 100 173 10 195 63 50 -8 -184 -138 -198 211 260 42 -119 334 149 177 -95
3377 -95 75 137 -11 -71 279 22 65 -18 29 165 18 -199 186 63 -26 -3 -179 -204 73 432 -5 -300 32
3400 32 24 -131 -119 -137 -72 -193 151 39 76 -217 42 -150 -117 -95 102 -64 -274 -19 -97 -125 38 -82 -73 126
3424 126 83 38 35 65 -9 -38 341 -41 53 -4 19 299 -58 31 -16 -17 -42 110 68 128 -60 154 8 233 68 252
3450 252 -6 -81 87 -68 -32 -162 -30 -97 255 -248 -144 -67 68 -42 101 176 -230 -86 269 30 16 -258
3472 -258 -259 -106 93 -152 -54 -99 23 313 76 65 -25 1 31 156 -40 202 136 -60 -151 66 -28 -112 -86 -65 130
3497A30l73j68M16L80l51j89j84L12o1K76k01j6j19p3K09J12k85K01m7J23j98
3518a06J87Q9l10M4j02L60R4m49L82J30j43j7j38m2k11L50k07P1J87j29j01J64
3540A03r4Q7K4o1o8j49m0K99Q7p4j62j3kj44O0K45l73L97J0j86j04J52O6K09l02
3565c3R0NP1r1j17J64k3m9j98n1K31MK3o5L14l87q8K99m1j33J35p3j88p0K28K13
3591A70m06L37k9k26J33P3n0Q9o0p1j45L21l54L24k52K23J70j70n7Lj85R1k20
3614b91K54p2M6K19k52J23M5j9Oo9J09j56j64O41k27k44k25M07l82J60L2n0J07
3637bM7l8l30L27L2j78L20m6j77q0J29J11j23j03L4j13L94j93j08M29m62P8J42
3660I0n0j15L62l02Q3j85K14j28k91J91L10k48K00k09K61j49p6q1K30K46o34K85
$$ plain form
3497 130 -243 -411 5 385 34 -155 -339 -27 -88 188 -13 -29 -148 -221 -12 100 -185 16 -31 92 -106
3518 -106 81 170 -140 -96 -198 162 256 -193 189 319 176 159 21 -21 -232 118 -89 -18 169 40 -61 103
3540 103 9 96 120 59 -9 -158 -198 101 188 114 -48 -61 -63 -207 -147 98 -275 122 132 -54 -158 -6 60 269 -33
3565 -33 57 62 133 42 -75 89 66 17 -181 -232 -1 3 26 -39 275 -112 -200 99 58 -75 60 -13 -201 -271 -43 170
3591 170 -236 101 72 -154 -21 52 2 91 31 -40 -185 136 -218 106 -146 77 247 77 20 23 -162 -71 -291
3614 -291 -37 -109 -63 156 -96 27 72 53 59 -10 99 -57 -221 420 193 -51 -276 131 -251 -91 -59 -109 -2
3637 -2 45 7 -323 4 36 -142 178 132 -45 -125 4 115 -8 -111 -77 -190 204 11 -97 332 -130 -52 90
3660 90 40 -75 287 -15 68 -117 97 -31 -322 -131 179 -69 131 -78 183 34 -42 -123 107 353 -281 4
3682DN4j65J25L9O2j18N5j04R1j89p2K63k61J73j19J00J53j20k73K39M1j58M8
3705a32K2J66k34K71k76J27L6K01p6J8j35Q5k7J74m58J91J04J59k05R6J70Qj36
3728A49J84l24m6m4q3K42k72L28k08K21j16N1j01J09M8j69M6K36j72r9pK11r6
3751H8j28j12K73jk37j12L75k54kk16N89l54J12j0K6k30j05O15j09j49n7O6j01
3774c3j32J44j66L39m4j15J00K7L4j81o7R2o4L8k10K24J17k38K1J11j95O33l34
3797A01j27j65L42j52m23M48J67j69k05J84r5P5K15m1k28J71j42m5J65Qj15k31
3819b62K76q2K10j29Q9k30J15r5j00K78j96q0J19M16n25j03M48j03k4m7K4j3q6
3842a00L81m47J12rj28Q1K67j93j08L49M5j49k21J26k31K53k46pL74p9j80j9M36
$$ plain form
3682 4 58 -107 18 57 119 1 56 -48 43 -146 -218 45 -216 -43 -162 -62 91 -29 -302 -63 -22 -180 -132
3705 -132 -110 56 -178 93 -183 -56 -20 181 105 123 -12 73 46 220 -238 -47 57 216 11 107 277 285 149
3728 149 333 9 -37 -81 -164 78 -194 134 -74 147 31 82 -19 90 138 -31 15 251 79 -20 -27 184 88
3751 88 -40 -152 121 120 -117 -229 146 -108 -110 -326 263 -91 21 11 37 -193 -298 317 208 59 2 68 -33
3774 -33 -165 -21 -187 152 108 -7 93 120 154 -27 -94 -2 -66 -28 -238 -14 103 -135 -114 -3 -198 435 101
3797 101 -26 -191 151 -1 -424 24 191 22 -183 1 -94 -19 196 155 -73 98 -44 -89 76 84 -31 -262
3819 -262 14 -68 142 13 102 -128 -13 -108 -208 70 -126 -206 -87 329 -196 -299 149 46 22 -25 -1 -14 -100
3842 -100 281 -166 -54 -63 -191 -110 157 -36 -144 205 250 101 -120 6 -225 28 -218 -225 149 70 -110 -129 307
3865C07m3j94j22J2k34J06M49l29k97M36Lk01n5Q4O9M8k12K57J13j62J82l60J37
3888fk26J55J99p3l8J0N1K33Om16K23j3k31J88J6J15r8L2J94m77N1J83mq1K4j8
3914aMP1k36L22k12j0M3j22K02J1k90J49j28P8J83P4k92K04k77N21l14j52J8J30
3938b4J94j74J30m4j00L07k66l4n4p9p2J56K59j28m7k30K43J4j63L12j52q7K57
3961B18k7m69K28J08P5p2j4l24J06j06L23k6j45P2P8j21R9j59J57k05R9j27K17
3984a5O2L50k13J37j55r9j49M8K30m08Q8m2K45l11L12j47j2K1O3k71N54l56P0
4007Bj35ln9N7K02k9k15M26j03K42m67k15M42k84L29k04J17m59K63Q5J48pj79
4030d6K12j80J01kJj56J7Q4K2k32J59Q0J64m13L12n7k28K52j53J97j1p9J82k42
$$ plain form
3865 307 264 70 -52 -40 -274 -168 281 -48 -345 91 94 -107 -162 -78 -9 39 -173 84 197 35 217 -143 -6
3888 -6 -232 -77 122 49 11 21 72 305 311 -105 118 105 -126 62 78 193 95 127 321 -156 -105 78 74 -7 17 -1
3914 -1 3 74 -162 160 -52 -62 -19 -141 61 72 -218 -69 -197 -119 64 138 -154 50 -227 294 -20 -172 -154 -24
3938 -24 170 -4 126 82 -18 289 23 -11 -65 -144 -216 -60 199 71 24 -206 37 51 -112 200 48 -39 218
3961 218 191 -278 -50 58 133 61 47 -277 -171 -277 46 20 -125 -53 25 -96 3 -156 1 -204 -105 -232 -15
3984 -15 47 397 184 321 166 67 -82 -34 196 -212 -124 -166 79 -232 80 -67 -79 -58 5 -266 288 -68 2
4007 2 -133 -136 -195 -138 64 35 -180 246 143 385 -82 -297 145 -139 190 -14 103 -356 -93 -8 140 133 -46
4030 -46 166 -14 87 85 86 -70 -53 31 53 -179 -20 60 224 -189 123 66 -162 90 -63 134 123 44 226 -16
4054a6j3J35k1j31J65j2J03k74R6j81J43k53N9J35N7M0K5k80K40p6P8L56m25j88
4078b38J52J46j32k3j84L15k38K60L2k3q5k72J3J00l6K69R4k6L1l46K7L05l31
4101a90M52j30k4k47M%J05j52K00J73l92K31j26K04j25m0R3j62N0J41j36j4j13
4124a98J08j89N74l15O1J32j28L1p2K77J7l83K50l45J86P6Q7l69K89l8k8m11K48
4147a40K62J3k28j72K64P5J34j85q4M4J64j68O8Q7j23J57L7m11K07J35l12L73
4169A97l11L45l27l6Q7J01L12l32l5j91J50k8m2j4K75j32P1j80K21j85q2J19j80
4192a97K49k60L05l66K29N2J01Q4k91K44m4q7R3J38k57j37K22j98K67k32j09K08
4214A4Q8j77J36j1p2n0J01K7l4O1j57R5m8Jk21J73K06J4j36M10o11K48j5k47J95
$$ plain form
4054 -16 -29 106 85 -46 119 107 210 -64 32 -149 -6 -259 -200 -65 -8 32 57 -223 17 -59 19 375 -50 -238
4078 -238 -86 60 -72 -95 -279 36 -202 58 90 67 -18 -290 -277 -177 -213 56 150 124 155 -191 -164 141 -190
4101 -190 262 132 108 -139 -135 -135 -30 -182 18 191 -201 30 -96 108 -17 -57 36 -126 -76 65 -71 -85 -198
4124 -198 -90 -279 295 -20 41 173 45 76 4 281 298 -85 165 -180 6 82 169 -200 89 51 23 -388 -140
4147 -140 122 135 -93 -265 -1 74 208 23 -61 -17 147 -21 47 134 11 168 205 -206 1 136 -176 197
4169 197 -114 231 -96 -132 -45 56 368 36 1 -190 -40 -68 -110 -124 151 19 90 -90 131 -54 -136 -17 -197
4192 -197 52 -208 97 -269 -40 12 113 197 -94 150 106 19 112 250 -7 -144 78 -120 147 -85 -194 14
4214 14 102 -75 61 50 -22 -72 29 56 22 83 -74 21 -27 -26 -247 -74 132 146 10 420 -191 57 42 -205 -10
4239a0j16J13J03mK32l17o0O6qp8L9M5k00L39j14n9J56Q3j9k61N7Q8r8k62L01
4264A6J81k29Q4k06R7K66O6j85k64J88P8l29K74J29o4J8k22J21q7K12k27Q8K16
4287B21l97L49m84K60K88k65K3q4J32R2j4Pl76M19j34o5m1K75l66K17j86k9K84
4310A26j73j9J58j21O0K6j49J8p2n6K06R6m0n0J03J76j75j01n7r5J62k4Q4j05
4334b2j01J35l0K52j95P1j5J31k12J27J38k46j56Q4j09K68k38oj4L2P2K33k13
4357a4Q5k06K32j8m7q7P1J39J56l31j9l3o9J21J29j73J13k08K22Mo7J38j48j5
4381b5oj1J66k47J06m0J42J1l84K91K7j83K51j91J91R3k48M6l39K11L66j39mj32
4405d8M39l83K1p8J91j54j21J20J52p9m9j4N8m8J18j04Jj34M68n25J57J97l99
$$ plain form
4239 -10 -126 -13 90 86 318 1 -59 7 -1 -79 -40 5 -195 144 30 -29 127 210 191 -70 -13 75 -23 -285 16
4264 16 197 -32 52 -154 -57 209 275 90 -174 14 92 -237 37 166 102 120 -102 19 -68 144 -83 5 221
4287 221 -176 173 -311 -51 237 -28 -5 -89 43 135 121 128 -248 171 37 -28 -69 206 -160 57 -129 -158 126
4310 126 -47 -66 92 -29 31 57 -92 -74 -146 -202 4 100 60 10 113 289 114 13 -44 -139 23 -1 83 -22
4334 -22 -123 12 -18 234 39 110 95 226 14 141 279 33 -123 -39 -148 120 -118 -124 -138 -106 -34 199 -14
4357 -14 71 -135 97 79 32 -55 16 155 311 -20 -39 -72 -141 -20 109 -64 49 -159 63 67 0 138 -10 -25
4381 -25 -31 -42 124 -123 -17 -57 85 96 -288 3 30 -153 98 -93 98 191 -57 -11 -350 -139 227 88 84 -48
4405 -48 391 8 29 -49 142 -12 -133 -13 139 60 11 -3 55 7 125 21 22 -112 356 -169 -12 185 -214
4428b14K16R2j31P8K28l42J23J7j06j11J05J80j5o7m4J67k75o8J51K31l27K24
4450A12m16k9J23K96k51J69J18j49JR6k41q4L20j89q8J05pK32J15k54j14L4P7
4473b4l56K38L17q9q1j20O1KJ02o6J32J41k01K31l98J84k9NN2k19R4q4J2J98J08
4498B10l25J35j43K3J25Q0q0K7J19r6J9l84K19j64J80R4O5j0pm6q6K42m85N81
4522B93k30k53L31P5l07M1R0j15R1j55L04j2J25k33J08k09J15K2m7J16m07M26
4544A69m94L19K77n26K51K4k1j19J69J13j40L1N0j65J57j48K67j38j52J31K05
4565B60m78L74j1j97K12j15j18J20k69J56k66L99m2j37J05N8K6l8qJ86j13n7J75
4588B22k31J0N0q2J25nj96J27k23L98n66K97M6k32L05j2M9k79M15n52L38n9j0
$$ plain form
4428 -214 2 94 -37 41 269 -73 50 67 -39 -150 -45 135 120 53 9 176 -99 -167 -16 215 -112 112
4450 112 -304 -333 -210 86 -165 4 122 -27 -26 70 -171 -255 65 -124 -212 -107 -114 118 233 -21 -135 -101 -24
4473 -24 -380 -142 175 86 5 -115 -54 -52 50 -16 116 257 56 287 -111 73 44 49 101 -118 -24 -108 -96 102 210
4498 210 -115 20 -123 -100 25 105 25 52 171 75 94 -290 -71 -235 -55 39 104 94 87 41 -45 197 -288 293
4522 293 63 -190 141 216 -91 -50 40 -75 16 -139 165 153 278 45 153 -56 59 81 34 150 -257 169
4544 169 -325 -6 271 -255 -4 20 -1 -120 49 162 22 53 103 -62 95 -53 214 76 -76 55 260
4565 260 -218 156 145 -52 160 45 -73 47 -222 -66 -332 67 25 -112 -7 51 77 39 31 217 104 47 222
4588 222 -9 1 51 -31 94 89 -107 20 -203 195 -371 -74 -28 -260 45 33 82 -197 218 -334 4 -55 -65
4611f5K59k13K1k16J70j04K93Mk66q2N85l89r0O2L73m75M8L04r8mj24m3j21K2
4635a49K92j34j62K24L08n16J51L8n6jp0K72l56M00K5m79K90J20l26R8r9n6L08
4658A22j44O0l9j39P1L28m72J89K5j75RK40k15L02J03l97J99j02J61k11j12K75
4680G8P6j69J97k75j44r6J90J78p1J36J0m39M17M6j05j19r6L19j6K58k55j54K15
4703A81l71J08Q8k4j26K82j16j60J24k9j60L24j14K46n10L34j3j01O9k84L13J6
4725G7k57L51j97K22j20k99J76MM5N6j4k05J62L18k25l48M12oj68M6K6p3K50k35
4749bL8N5j28M1M9Q6Jl11K93k06N6m1j04K08k68N7L12j20j63L12%j73P2k45J01
4774h0j59L20j09m2M19k99j96N6K8Q0j14o8j5K5L15l01K55j7k34J51K73l09J1
$$ plain form
4611 -65 194 -19 2 -214 -44 -148 145 149 -117 -199 386 -3 -93 -31 342 -133 -85 219 121 117 -7 -50 -171 -149
4635 -149 143 9 -153 71 379 -137 14 52 -4 -5 -75 197 -159 241 266 -213 77 197 -129 -31 -130 -186 122
4658 122 -22 38 -1 -140 -69 259 -213 -24 1 -174 -165 75 -140 162 265 -132 67 -35 126 -85 -197 78
4680 78 154 -15 182 -93 -237 -333 -143 35 -36 100 110 -329 88 134 29 -90 -186 133 117 375 120 -34 181
4703 181 -190 -82 6 -18 -144 138 22 -138 -14 -43 -203 121 7 253 -257 77 64 -37 32 -252 61 77
4725 77 -180 171 -26 196 76 -223 -47 -43 2 58 44 -161 1 319 94 -254 158 152 -16 30 56 -17 233 -2
4749 -2 36 91 -37 4 53 139 140 -171 122 -84 -28 -69 -173 35 -233 -176 136 16 -147 165 165 -8 64 -181 -80
4774 -80 -239 81 -28 -70 349 50 -146 -90 -62 18 -96 -164 -179 -154 161 -140 115 98 -136 15 288 -21 -10
4797a0o1Q1o4K83l52K87k83M9J21N1o9k58J08N7jnk07J77L87l32k45K72J6J46
4821A48k38%K5k55J90m3J83J57j3l32L33n6k28q3L44j61o7KP6m9J80j89r2L04
4845A36L34j57l21P4j86K1p7j50L24m3J31k4N6O4j34J02j40J5K29l41O8j91O1
4868a49M28m67L16q3j73J04L5j4k34n2M52j88j83K77K0k25K05k47J86r4l9K73
4890A48j61j29Q3J6rJ48j11k96M01n3k96J18J34k37L08j18K20o9k73q0K72K80
4912B96j7R3k25r1L8J52m52K24pk2p6K17P5k75K44k54J14J5M4k28K37l8K4k93
4936b05K35L15l36J43j28K19k69l5J41j65J07j36j89K77K21k14j67M54k15J98
4956B51k38j40M2J99l34L68p0j93J49p0K68l08j09M97l68j21j68J3M47j62J31
$$ plain form
4797 -10 -71 10 -54 229 -123 164 -119 -70 51 102 33 -225 -117 -60 -61 -66 -273 -96 291 -41 -286 -14 2 148
4821 148 -90 -90 -65 -320 -130 -173 10 167 154 -178 155 99 -129 -212 132 -29 -96 -94 -18 -67 113 -76 -168 136
4845 136 470 313 -8 66 -120 -99 -176 -326 -2 -45 86 62 118 182 48 150 10 25 254 -87 -19 -210 -149
4868 -149 279 -188 128 45 -128 -24 11 -3 -237 -289 163 -25 -208 69 89 -136 69 -178 8 -86 -125 148
4890 148 -13 -142 -59 -43 -52 96 -15 -311 90 37 -259 -141 -7 -244 64 -54 166 97 -176 -256 16 296
4912 296 279 372 147 56 94 246 -206 18 11 -11 -87 130 205 -70 174 -80 34 49 93 -135 102 64 88 -205
4936 -205 30 345 9 152 24 243 -26 -61 80 -85 22 -114 -303 -26 195 -19 -186 268 53 251
4956 251 13 -127 -85 114 -220 148 78 -115 34 -36 232 -76 -185 312 -56 -177 -345 -332 115 -47 84
4977H4j43K33j19P5j20j10J35J04k98J80j32J47kj65K04j70j4J79J83k70K0r4
4999i3q1P2L1pM8j28J57l4n5J9J71k26R1j64J12K72l47L52j90o8M0L9j44K96k06
5024d3j55K84p2j12J9j0L9j31q1M09j69l2p5K31p0J48j26R4J49l20O0k9m4M15
5048C79l45q6k7P2q1q7L22k85Q1l4j2K80k56n0R9j52J07R6r7jK52m9m03L41j34
5073g0J17K09m59N71n75M24j97J24j72j8J64m47L22np0J39j68Q4P0k94N45N6l84
5096c4Pm4J61J54j62O8rk14K5N7p3M27m47J73J2K1r4p3k59K02r4kM22l02n2k6
5122a56M97o08K45j4m39M43l9PK18J8j46j21J42k12K12j64J45j6r2p5J94m7m4
5145e2q5m8K68k12M6j23K08L3NNoK37j40l34M6J43k7J69o8n8j09n1K58j48J11
$$ plain form
4977 84 -59 174 55 130 10 -100 35 139 -159 21 -111 36 34 -131 73 -97 -111 68 251 -19 1 -93
4999 -93 -174 -102 -71 -78 -30 -158 -1 -35 -90 -71 100 -126 -35 -199 -87 185 -162 190 0 -68 -28 11 -133 163 -43
5024 -43 -198 86 14 -98 -79 -89 -50 -181 -262 147 -22 -54 -129 102 32 180 54 148 297 -23 37 8 -36 379
5048 379 34 -52 -79 -7 -88 -175 147 -138 -57 -91 -103 177 -79 -129 -30 -182 -75 21 -76 -77 175 126 -277 64 -70
5073 -70 47 256 -203 368 -207 217 20 144 -28 -46 118 -329 -7 -12 -82 57 -111 -27 43 -251 294 350 -34
5096 -34 -27 -71 90 244 82 150 141 -73 -48 9 -64 363 -84 89 101 122 28 -45 -304 -102 -196 -198 224 -78 -130 -156
5122 -156 341 -267 -22 -36 -475 -32 -71 -64 154 172 26 -95 47 -165 47 -117 28 12 -80 -155 39 -8 -52
5145 -52 -137 -185 83 -129 -83 -206 2 35 40 45 39 276 136 -198 -152 -9 -36 133 65 7 -102 -153 105 -43 68
5170F8j03j29J39K6J01j54l3m3J48O2j3r0r5j23M16j98J7k6m8J37j09K46n3K7
5194A70k05k70L27j17j3N1K9J8K61q5j74j92K54j29L12M5p8r6R7m94M85k50L95
5217C41n11n5J11J53L8r5J75k32L31m30M04m06J07J66j49p6J01J21K5m15M28l78
5239b46r1M27k70L14k51J82K0k08J33n4J09R0k81J83k0P9k35L36j33J21K18m54
5261c1J63l85K37P7n2m1l8J42l00M07J56n27k2J45j08J22m7Q8l9l32N29J8k25
5284f3q4J89L02m87L9j58K26K52k02J52l41L61q1k90ML04k57m0k0L71r6j67N5
5307c1J33k27P2J51l23J20J94l0j24J82o2L33m43K70l14J19lJ92j63j15K85k15
5329AL6o5J26n6q2J17PJ2l12K68j29J38k45K71q9J40j28J81j46j27j3N5M2n0k2
$$ plain form
5170 68 -35 -164 -25 1 102 -52 -85 -128 20 82 69 -21 -116 -239 177 -21 -4 -30 -78 59 -50 196 143 170
5194 170 -35 -305 22 -95 -108 -57 -28 -10 251 166 -8 -200 54 -75 237 282 204 108 205 -289 196 -54 341
5217 341 -170 -225 -114 39 77 -18 157 -75 256 -174 230 -176 -69 97 -52 -128 -27 94 119 -296 132 -246
5239 -246 -337 90 -180 134 -117 65 85 -123 10 -44 65 155 -126 57 37 116 -119 217 84 205 423 -31
5261 -31 132 -253 -16 61 9 -32 -70 72 -228 179 335 -192 -214 -69 -177 -55 -102 -14 -53 -385 144 162 -63
5284 -63 -147 42 344 -143 -104 -262 -36 216 14 166 -175 186 105 -185 -181 123 -134 -174 -194 177 81 -86 -31
5307 -31 102 -125 -53 98 -225 -105 89 59 -65 117 55 388 -55 215 -99 20 17 209 46 -69 216 1
5329 1 37 -28 98 42 -40 77 84 96 -216 52 -77 61 -184 87 -2 138 10 191 45 -82 -95 -40 2 -48 -70
5354g0l9q7K98j0N0l30K2K13j89j8J70j32L5N0j48K71k02J02K1j53j09K71J55
5377A71j31M4Q2J06j51j81L4J86k46J74m8J72k31q3K29n0Q3k40J46j37K44N8l33
5400a02O9r9L32j08k42j2o3K7K62P7j11Q2k49J5J83m3k37J70J19J8n3k7k4J48
5424A32l1J1j44O7j82M8j81K9J71j30K23j7J35k01l6J36J54j20p8j0n2L12k58
5447b2K06m6J9j16k90L28J3r0k0j53K07K2lO9j17j35L25k44k2j1J48r9j70K48
5471D7p0j46J32L45l84r5j45J91J4K23j42oK8J76k82J66J70j57k65J04N0j85J42
5494h9j46L74l38k3K30m5p3m2Q5J1J09K2Q4l19M8R9j89J03L2J12Ql7k4k3L61o01
5520b71K77q9j06N3K54L3l88M3K82J6O5l16R9O5K0n6j80K53j04Q7p0J15J00l12
$$ plain form
5354 -70 -109 -196 102 92 142 -188 -166 47 -142 -160 10 -122 -87 -37 -185 86 -116 -14 7 -146 -255 16 171
5377 171 40 84 166 272 121 -60 -26 160 -86 88 40 212 -19 -102 127 77 160 -80 66 -71 173 231 -102
5400 -102 -33 -132 200 92 -150 -162 -225 -198 64 141 30 112 -137 -122 61 18 -219 -49 70 88 35 8 -16 132
5424 132 101 112 -32 35 -147 -99 -280 -251 -80 -210 13 -4 131 -70 -106 30 184 64 -14 -24 -76 236 -22
5447 -22 184 138 157 41 -249 79 92 2 -18 -171 36 58 55 124 7 -128 197 -47 -69 -80 68 -31 -201 47
5471 47 -23 -169 -37 308 -76 -171 -316 -125 -111 112 -30 -36 -8 168 -114 52 222 65 -200 -96 -46 -231 -89
5494 -89 -235 139 -199 -222 8 -37 -110 -152 -67 -56 53 75 159 -160 -112 -13 -202 -99 -67 45 53 16 -8 -31 330 -271
5520 -271 6 -83 -189 -136 118 151 -237 -194 88 104 169 -147 -48 17 37 -19 -199 54 -50 37 -33 82 182 -130
5544a30Q8N7k17M46k29j84N7K37o7j16J22j85K01o3k15O07n75K3J40MN2j01O3
5567A5J03m6l65M53j7j94K01j36j20J61O1r8k3J69k44j27K23j73K80L3k93J29
5589hk16J42k2m3R7N5Qk36K54k9J04j42N8P5nl7j11K38l76K48r8P6MJ28k13L6
5615a3j76J10J53l43M40m4m0NMkj33R1l0j37J16j18j1K67l91J39K52k12J64q1
5639A0K31j17k33K54k38N0j32L14M7J5l98L87j55j52k5n2J71p7j20L5J21Q7K15
5662B38l77K18Mj60j43K70j51O7J6q1L17m45L20K9r8r1N2k77K31K07j45J33L7
5685A71n4k2N2j8J94l55O5j17J26l0n1J49l14L25p5j47l0K28l33l8P5K47lr4j33
5710a82J18q0l8n2L88l09m6n2K64J95jm86M82j54j31J30J01k87K95j71L7P4L14
$$ plain form
5544 -130 -42 15 -202 244 15 -169 -112 125 58 -58 64 -121 80 17 -198 409 -166 -143 -3 1 53 -48 15
5567 15 118 72 -293 160 143 -51 150 14 -106 55 116 18 -5 164 -80 -207 16 -157 123 156 -137 -8
5589 -8 -224 -82 -104 -147 -50 5 13 -223 31 2 106 -36 22 97 92 55 -56 182 -194 54 -44 32 36 164 -49 -13
5615 -13 -189 -79 74 -269 171 127 87 92 96 94 -39 52 22 -115 1 -117 -128 139 -252 -113 139 -73 91 10
5639 10 241 124 -109 145 -93 -43 -175 139 186 201 -197 190 35 -117 -142 -194 -23 -100 -220 -185 -64 23 238
5662 238 -139 79 83 -77 -220 50 -101 -34 -18 -99 218 -227 93 122 24 -67 -15 -292 -61 146 1 134 171
5685 171 117 95 147 129 323 -32 33 -84 42 12 -39 110 -204 121 46 -101 -131 97 -236 -274 -199 48 45 -49 -182
5710 -182 -64 -144 -182 -234 154 -155 -201 -253 11 206 205 -281 201 47 -84 46 147 -140 155 -16 21 95 409
5733D09n07o5L06k62j4n5j1J33K22r0q7J43l00J69o6J76L7j92J23j38J99J38k48
5756B0o3O0j3M8l2l8j61J00j8K43k62J93j46k6k15J17J89k85M23j97j5%K9j13
5780a62k39L05q6J15M63p20L65QJ56k40J85m27K25j41j8L75k74Q5K1J20k37J95
5802G4Oj14J43j88m7q5J50J93r2m61J76K06K74k67J38p5q3K5k06L51k57Q1L21
5825B63m9j13k08R5R3o7K6l5j84J22K60m69L67r6J41j42j07J19l20K15k5m7J83
5848B2N4L3j00Nj62K42j38j66o0L44j33J96j04O0k44J36O3k59M51o8l25N9J47
5871E3J77j56j92L27k48l5K52l76L88k79j87K96K6o9j89N9J90n5J70l25M14j80
5893F1l70n6J62L34j36m9k8n3O7K43n8j79O0j01K50j74j63Q3M8J32j72K6K13q
$$ plain form
5733 409 -98 -163 143 -119 -133 -188 -199 -66 156 66 -21 122 -178 -9 -75 101 138 -54 69 -69 130 268 20
5756 20 -43 17 4 52 20 -18 -179 -79 -97 146 -116 77 -69 -95 -310 -193 -4 -289 134 -63 -78 -78 -49 -162
5780 -162 -401 -96 -182 -67 396 -324 41 49 205 -35 150 -277 -52 -193 -211 164 -110 -25 -4 116 -121 74
5802 74 80 -34 109 -79 -126 -211 -61 132 40 -421 -245 -39 235 -32 106 31 -52 -27 -233 118 -139 -58 263
5825 263 214 101 -107 -12 81 14 40 5 -179 -57 203 -266 101 5 146 4 -103 16 -304 -89 -114 -161 22
5848 22 76 109 9 14 -148 94 -44 -210 -270 74 -59 137 33 93 -151 -15 48 -211 240 172 -153 -94 53
5871 53 230 74 -118 209 -39 -74 178 -198 190 -89 -276 20 46 -23 -212 -153 37 -18 152 -173 241 61
5893 61 -309 -365 -203 131 -5 -54 -82 -135 -68 175 117 -62 -2 -103 147 -27 -190 -107 -59 73 -99 -73 140 132
5917A32n4j22L0l4K55k49J30j11J15ro5j38K35k76J53o2l3J13Q3p3l01J94K20
5940A33l07Q3o4L67J16k05k03M7J56J04j48N8J37k31j27rK61m22M46q2l16K98
5962I2k91K49J68k54OJ38j48J29J16n60L74J99k80k23L15R7p2k94L73O4j78n6
5984c6K18l98J31m4L27k87N8J6l0J65O4n8l47o2J63J71k14n2O00l54k01l9K89
6007H0K1Np5qj20J67j70qJ38L3j25j37L56j98K82k33k0j4j03K08N3k6j71J88l35
6032b12J50Q3K05l71L97k93R7j9j35J52l9j23K32m64N20J56l89k5J04N4Q4m13
6054b49N30l21j28J63J69k69p7J25k35J43o2L85j44k08K3K66j36J72k3L4j68Q9
6076G9%j37L6o6N5n3j35K10j32K2J96j86m3K69j61K90n00J25K20j91L50j91J4
$$ plain form
5917 132 78 -44 -14 -48 207 -42 88 -23 92 83 18 -120 115 -161 -8 -70 -103 10 93 20 -281 -87 133
5940 133 -174 -91 -155 212 328 123 -80 -33 123 227 79 137 274 43 -84 -93 168 -254 192 110 -206 92
5962 92 -199 50 218 -36 -30 108 -40 89 205 -355 19 218 -62 -285 30 127 55 -239 134 198 20 -36
5984 -36 182 -216 -85 -129 198 -89 -31 -15 -45 120 184 126 -221 -283 -120 51 -163 -215 385 31 -170 -209 80
6007 80 101 106 31 23 -97 70 -100 -108 30 63 -62 -199 157 -41 241 8 -12 -26 -129 79 132 106 -65 123 -212
6032 -212 -62 21 226 -145 252 -41 56 37 -98 54 15 -108 124 -340 180 336 -53 -78 26 80 164 -249
6054 -249 281 -40 -168 -5 164 -105 -182 -57 -292 -149 -211 174 30 -178 -155 111 -25 147 124 158 -10 79
6076 79 79 -58 -22 -88 -33 -86 -221 -11 -143 -121 75 -111 -154 115 -46 244 -256 -131 89 -102 248 57 71
6099G1R3l51P4K18k15k14K33J23j57K02k69L24j96l6p4K37J4K3j19l6J42j88J56
6122E5J17j0l3k1p6n2O4M3k45R0J51j56P7n2K57m6P6j50j5q5Q5n5l1J81M5k31
6148a7K47j88l27O7Q0L12k93J33m3j46K53j54OqO1J62k75K6M38k76j35Q1N6k06
6172a46K40Jk76J41k08J82J85j92M6m3K12l11M61k72o6J23l48L39N2M5k69J38
6194C4k86K39O1J72l79K58l07Q7P4%n1J65j33k4J05l4J23J19p3Lk85J86n0j23
6218a19K81j79J15J74k31j42O1kL6Mj03J58K01q4P4j33k78m3J23j9N6k20Q9L33
6242A52j64l27L31M3k3K4J61P9k40p9j24k7K44m9J3p8J47m16L92k40J12J21K48
6265C00m11L5j54K11P1k4o4p3K3K89p5%Qk19K27k14pM24k45j31p7k20L33j90L08
$$ plain form
6099 71 164 -187 -113 105 -110 -324 -91 32 -125 77 -192 132 -64 -100 -174 63 77 100 -19 -55 87 -101 55
6122 55 172 162 129 108 32 -20 44 87 -158 -68 83 -73 4 -48 209 163 239 89 74 -11 74 19 -12 169 214 -17
6148 -17 230 42 -285 -218 -138 174 -119 14 -29 -175 78 -76 -70 -78 -17 145 -130 -104 334 58 -77 4 60 -146
6172 -146 94 95 -181 -40 -248 -66 119 -73 -27 -70 142 -169 292 20 -46 77 -271 68 120 165 -104 34
6194 34 -252 -13 48 220 -159 99 -208 -121 -47 -47 -98 67 -66 -90 15 -19 104 223 150 153 -132 54 4 -119
6218 -119 162 -17 98 272 41 -101 -40 -42 -6 -2 -105 53 254 170 244 111 -167 -210 -87 -106 -50 -270 -181 152
6242 152 -12 -339 -8 35 12 36 197 276 36 -43 -167 -194 50 1 14 -64 83 -333 59 -181 -69 52 300
6265 300 -111 -76 -230 -19 52 28 -36 -109 -86 203 128 128 136 -83 144 -70 -77 347 102 -29 -106 -326 7 -183 125
6290A25j40L5k8l4MRK69l87K48L4m7j0r8K24k50n1K09Nn5m7L6j96J27K28j30k66
6316a86n7K13l52K38L08o4r0j93J36J56lj76j56J90m3J71j13j0LP9j1M7k41L07
6340A53j94R0j11K29l3n5l5j58p2J74%K6k02L34k84P0L15l76O2J15j95K30l14
6363b31N17m62R2K2k0N4J67l68J92P9K27p3m83P8K03k03O4MJ86k18K9K39k67L09
6387A37k50J46Q2p4p4O1Q2J7l25L62lm7o7j82J52K99l33O5r0p8L48m35J1J45J41
6412I0k48R9o0K51P0o1l37K94r5l69L1Q0L63k44L01o6q9J52l97L64k04J00J46
6435A71j5k67K73j44Mj37J98j86K41J67l74O6j23M84k54l48K26j7P8p3L4J68l44
6458a72L36k24l0P6j40P5L9L3J42j11P3q2j47J92j67L79j32q8j34n8J68L3l37
$$ plain form
6290 125 -15 20 -8 -42 -38 -29 240 -147 101 135 88 78 -20 204 -46 -97 112 117 62 15 51 -145 -18 210 80 -186
6316 -186 -243 -30 -382 -144 164 100 10 -183 -47 109 106 -70 -226 -36 -79 92 -21 -31 -28 51 40 87 -154 153
6340 153 -41 49 -62 167 134 79 44 -114 -186 -12 -12 14 -188 146 -138 -68 247 -129 -67 48 -147 83 -231
6363 -231 286 -176 -84 -62 -82 -28 139 -229 -37 42 269 196 -287 -209 -6 -209 -145 -141 45 -173 -144 95 -172 137
6387 137 -113 33 115 41 -33 28 110 127 -198 164 161 114 47 -135 17 316 -17 48 -42 -120 228 -207 -196 -51 90
6412 90 -158 -59 -119 132 202 141 -196 98 3 -366 -335 -255 108 -136 165 99 10 162 -235 129 -75 25 171
6435 171 156 -111 162 18 22 -115 83 -103 138 305 -69 -3 -126 358 104 -244 -18 -35 43 -30 4 172 -172
6458 -172 164 -60 -90 -14 -154 -79 -40 -7 135 24 97 15 -132 60 -107 272 140 52 -82 -140 28 61 -276
6481b76L61o3O1k25L12l43K2R5jJ44j32J04Rj41k97M93j1j90K12n47K39K14l6
6504DN6k25K20j41O6r6J56Q8j12o1O2j24j1q7J28m7K37k25M5J16o2q2J53j13j64
6529b19L19k35K35j5J5k9NK1p8o9J21M7J0k92k7J50j28L25j88J53k65J01N1K90
6553B98l72j50M23l12M9M5j5k5J5O4K3j85K37j99J72K5l00L08j8k65J66J14j56
6576e8K56J02l75J70l4j91J94q8K37j33k42k47L41J67l15j28L76M9m13M05q9L7
6598B1J08j29J7K1j85J13J34j13m1J2N3j65J49K46j85J53j31j40o0J40j11K5l11
6621c79N58k26j94M12K5k57L97o50L69K38l12j7j57J27p2K03j85J80j26J7p1k6
6643a46K11p4J40J11k1j41J17k4L0m42J39jm6M0K52O0N5l26Q9N0j45N8l3k3N5
$$ plain form
6481 -276 85 22 83 -142 170 -173 -151 -56 -57 87 -45 59 68 -73 -370 123 112 -78 134 -413 -174 40 4
6504 4 60 -165 55 -86 -20 -116 40 128 16 -45 17 -107 -118 -205 -77 -124 113 -112 -67 49 -13 -95 58 -55 -219
6529 -219 100 -135 100 85 100 71 76 97 19 -50 71 118 128 -164 -191 -41 -169 156 -32 121 -144 -43 8 298
6553 298 -74 -224 199 -113 -64 -19 -34 -59 -44 20 43 -142 95 -104 68 93 -207 101 83 -182 -16 98 -58
6576 -58 198 300 -75 95 61 -130 64 -24 213 80 -162 -409 -68 99 -216 -344 32 81 -332 73 -16 21
6598 21 129 0 17 38 -147 -34 100 -13 -54 -42 11 -154 -5 241 56 209 78 -62 -122 18 -93 -68 -379
6621 -379 179 -47 -241 171 196 -61 336 -314 55 293 -19 -36 -193 -66 -138 65 -120 60 -66 -49 -120 -146
6643 -146 65 -9 131 242 221 80 197 173 203 -239 -100 -101 -147 -107 145 205 260 -66 23 73 -72 -14 -47 -70 -15
6668a5J26j37j40J14L9p3q5Q7R6n2J05p1k01N1K23L52m24J14O0m5K4O2k66J72
6692A16Q8J08k07L7j20l26M69k17K10k69n6Q6M5L0J88k54K1J20M7k20K65k59M38
6715C40n55J81q0J16j53p7J73P6N7M1p5k16L23k25LR7p1L07m56J81L82n53K93
6738A09j23K45k17l6O4R7j11J76N6k22K5m5J81j25j59p9K25l88N51l02J98k84
6760a64K12j37L5j12K24j08O4l4L2K19j10N8Po9O4j16j94J60j58k7o3M08J4j64
6784D1j8m4J73j00j44J47j90L27l90l1L47j22J29j39lJ16k00J19J51j74p3K17
6806A39j7r5L02j3p4k82j65J70k1J28k83L75k2J22k28k89J56L4p9m8L34j74J29
6829I9j21MM6n1q6q6J02K9J31l59J99K68m69j07L38M7p3L36j97l87P67m03J75
$$ plain form
6668 -15 111 -26 -166 -52 -13 -86 -171 -84 12 -40 65 -6 -207 -156 67 419 -5 109 169 124 148 210 -56 116
6692 116 204 312 105 142 22 -304 165 -52 158 -111 -167 -81 -36 -6 182 -72 -51 69 116 -104 161 -98 340
6715 340 -215 -34 -114 2 -151 -228 -55 21 78 119 44 -172 151 -74 -71 26 -45 262 -194 -13 369 -184 109
6738 109 -14 231 14 -22 42 139 28 204 260 38 63 18 199 74 -85 -164 61 -327 224 -78 120 -164
6760 -164 48 -89 -54 -166 58 -50 14 -20 12 231 121 179 186 117 181 65 -129 31 -127 -154 -217 191 205 41
6784 41 23 -21 152 52 -92 55 -135 192 -198 -229 118 -4 125 -14 -17 99 -101 18 169 -5 -78 139
6806 139 122 27 329 316 242 -40 -205 -35 -56 72 -211 164 142 264 36 -253 -97 -63 -142 -190 144 -30 99
6829 99 -22 -18 28 -23 -109 -195 -93 -64 67 -292 -93 175 -294 -401 -63 -16 -89 247 50 -337 430 27 202
6852B02k28j68L40O8Nj34r6P5nR9q2r2P8j04R5l7J87p6q1o1J46j47J32l16P2K38
6878A10l12K40j83j28J86l3K88k61j0j90K13m4R2K10k38Rj55L6L88j51j02l0R9
6901C4j10j29J80n5P6N0r3r9K91j90J97m79K21JJ30J63l48P5k12L48l42L14j53
6924a30l9K90k18O4J36j54k9j45L91m92L45P3k43J59J07Oj50K76l84M02l67N1
6946e1K18j96J72O9q4k01P4l2k1J61J04k40M8K10n25K09J32Nj12L1Lk4K29k60
6970h1O7J25Q7j6j26j48R8R9k50r7J28J64k97L19K03l84J01j5q9N31m17j4o7R5
6994A6m0r7K34J28l49K57l57J19M4n7J76k43NJ96k14K08j91K27j77L16j80q6P9
7017A4j99J37k76J12J52J87j47J73k2j44L02k28k42J58o1J88q4k35K84Qj99J71
$$ plain form
6852 202 -26 -194 146 214 219 85 -11 64 59 158 76 -16 62 -42 53 16 203 127 46 -15 131 -16 116 -200 -128 110
6878 110 -202 38 -145 -273 -87 -120 168 -93 -103 -293 -80 -124 -32 178 -60 -51 -206 -170 218 67 -35 -65 34
6901 34 -76 -205 -25 -80 -4 46 -47 -146 145 -45 152 -327 -106 -105 25 188 -160 -85 -297 51 -291 23 -130
6924 -130 -169 121 -97 -33 103 -51 -80 -225 166 -326 19 92 -151 8 115 121 -29 247 -137 265 -102 -51
6946 -51 167 -29 143 212 128 -73 1 -31 -52 109 213 -27 21 231 -294 -85 47 52 -60 -29 -26 -50 179 -81
6970 -81 -14 111 198 182 56 -92 6 105 -145 -242 -114 50 -247 72 275 -109 -8 -23 -112 419 2 -12 -79 16
6994 16 -24 -121 113 241 -108 149 -208 -89 -45 -102 74 -169 -164 32 -182 26 -165 62 -115 201 21 -65 14
7017 14 -185 -48 -324 -212 -60 127 -20 153 131 -13 289 61 -181 -23 -84 104 20 -215 69 77 -122 49
7039D9m8M1P0l9m20L1M44k13O0m3p0O4K20j40j54L1L82r1j50K43j61J8j10k26
7063b12K56K14l82J71O0j94J43lj18n2K08j89R1j14n7o9L79l62Q7J05J9l1K62
7086B12k53j15j6L69k87M67n26L4K52j85j82K22K75j87k02K97k03k14K56q2J41
7107G3J1K1K1K32k28K9L3Q2j72M0p3J35j19k48L57J47m22j47K12n3J73j93R5m0
7131c4N4L9k9J26J7j95J41j28l27L89j19lO2J68k07K77l05K8K07j88L9p5J10K24
7155B71l42K56q7o1J06k58K55j6j54j24J33k54P6n3K04k87M67k37m6J47J08N0
7177A54k43l3n3K92j87K08J01k81K1L20k44o1J13k92N1K94l83L80j09K98l25p4
7199e3J5k56L26o3J54j91N0J0k15K51p9J21p6J37k4j40j02K66p7l69N68k97L02
$$ plain form
7039 49 1 42 112 73 -347 -316 128 -85 -25 -68 -138 -74 146 6 -148 -117 265 174 24 267 106 124 14 -212
7063 -212 44 258 -124 47 107 -87 56 53 -65 -117 91 -98 -7 -121 -178 -247 132 -230 -143 -38 -19 -50 212
7086 212 -41 -156 -172 197 -90 377 -149 -115 137 -48 -230 -8 267 80 -122 175 -28 -242 14 -68 73
7107 73 84 105 126 358 130 159 192 274 102 142 69 204 85 -163 194 341 -81 -228 -16 -69 104 -89 6 -34
7131 -34 20 59 30 156 173 -22 119 -9 -336 53 -66 -69 -7 161 -46 231 -74 -46 161 -27 12 -63 47 271
7155 271 -71 185 98 37 143 -115 140 124 -30 -154 -21 -275 -199 -252 -48 -335 132 -105 -151 -4 104 154
7177 154 -89 -122 -175 117 -70 138 239 -42 -21 299 55 -6 107 -185 -134 160 -223 157 48 346 21 -53
7199 -53 -38 -294 32 -31 123 -68 -18 -8 -223 28 -51 70 -6 131 107 -33 -135 131 54 -315 253 -44 258
7222B58k98J52k07K57j04j97K05j53J12p9Rj34J49P3J54k72j62R5J24r6Q8J12
7244H6j78J71m9j71J90K54k36J05j43k8l09K05K93j17N3k20L53k06k5j14j06J90
7266bj59K42k65K03J06k23K00K6l11J38pL09l24o9J56J27q6m0J46j44J36p4k62
7289a77K48O6k25J80k67M7q0J17R4k60L12Q0l2j32K26l35k4N0J83k98M20j32O2
7312A23m31M40k17R8j94oK89K6l19J07l0J77q1K03l72K83l29K30k26J52n3J54
7334B4K49j38j62Q7KJ13M1k7j95q2L35n5k33p8J60Jo3O3p0K3j73K68r2p3M03m12
7360h4L04q5k91J70K16m16N6L0l9K98j3j64p2J59j13K15Kn6L5k75K50n5K28l87
7384h7K27l31P2K16k24M29m68J60M1r4J04R2k93L3K76Rj48j46J13l1L5k8P9j80
$$ plain form
7222 258 -40 112 -95 162 58 -139 66 -87 25 -54 -45 -179 -30 43 197 -75 -237 -142 -18 -114 -26 86
7244 86 -92 79 30 -141 49 303 67 172 29 1 -308 -103 190 73 126 -94 259 53 28 -86 -192 -2
7266 -2 -161 81 -184 19 125 -98 102 128 -183 -45 -52 257 -67 -136 20 147 61 21 167 23 159 85 -177
7289 -177 71 137 -88 92 -175 -128 -208 -91 3 -257 55 135 103 -29 197 -138 -162 -112 71 -227 193 61 123
7312 123 -308 132 -85 13 -181 -187 102 128 -191 -84 -114 63 -18 185 -187 96 -233 -3 -229 -77 -130 24
7334 24 273 135 -27 60 62 175 216 189 -6 -88 247 192 -41 -119 41 42 -21 42 -28 -5 -178 90 -2 -75 328 -84
7360 -84 220 135 -156 14 230 -186 -130 -100 -139 159 146 -18 -90 69 -44 171 173 117 152 -123 127 72 300 -87
7384 -87 140 -191 -119 97 -127 302 -166 -6 35 -59 45 137 -156 -123 153 162 14 -132 -19 -50 -15 -43 36 -144
7408a44l5K71K5k12P5J99j50j85L50m16L36k7j41O8l28L99l6M9pk49L12J05k42
7431A7m7j43O3Q5L86k92l30L84J9k3M4k30j47J99j0r6lK02r4Q3J08m64K33ol6
7456i8K70jj74j32J37R3j99K55p6jJ98o08M02j64j48K71j29j14K19K1O1O1q0o7
7480ck3J52k33K13o1J43ml91M58k57k3O3K70k51K1j62m5P2K54j46q2J00J43k64
7504e6o5J85n3r4Q1j6r2K0J11j25K63j55J44J4l03q7K25Q9m9j18J68m1oL3K71
7529C44n08K96m5o2J04j29J04k41K21j32J84k68R4j12L64qk08j3K34l01Q2jJ59
7552A58L6l69K84k93L70j45k36J46L65k26O8j39Jj06Q5j26PJ19OJ46L0o9l41Q6
7576a43L87k80P1L7R3j84K05j36k57L62j38%q6M0j59N33k72j66J25m2J55j15k87
$$ plain form
7408 -144 -179 92 117 -95 -20 179 29 -156 194 -222 114 87 -54 14 -314 85 49 98 91 -158 154 259 17
7431 17 -30 -173 -110 -25 361 69 -261 123 142 119 163 -67 -214 -15 -25 -121 -124 78 -16 67 175 -289 -56 -62 -98
7456 -98 172 171 -3 -135 2 95 -104 151 75 74 272 -336 66 -98 -246 25 -104 -218 1 22 83 144 64 -3
7480 -3 -26 126 -107 106 45 188 184 -207 251 -6 -29 34 304 53 74 -88 -133 -61 193 47 -35 65 208 -56
7504 -56 -121 64 11 -83 -2 -18 -110 -90 21 -104 159 4 148 162 -141 -228 -3 86 37 -81 87 46 40 73 344
7529 344 -164 132 87 25 129 0 104 -137 84 -48 136 -132 -38 -150 214 206 -2 -15 219 -82 0 -1 158
7552 158 194 -175 109 -184 186 41 -195 -49 316 90 158 19 20 -86 -1 -127 -120 -1 5 151 181 112 -229 -143
7576 -143 244 -36 35 72 165 -19 186 50 -207 155 17 17 -69 -29 -188 345 73 -93 32 -10 145 30 -257
7599b57K44k25K97k20L12q3j55j51J90J63l70L92j46j66K00j55K41k03J82J25
7619B15m29L79l26J51p4J40k44N22m84K69k32m0K62j62L01k58n8l9K12j73L24
7640B56k74k63K00K15r1j18K09j08j3qJ6j9M8J8k8R7k73j4L96j79l5M5M2o8j22
7665g1q3K68k53k82O14k33K2j63K34J90k05j80K45k42q2M3J33k7Q0m9j77Pkk7
7689b40L92J5N9j04j78P1L5J50r7Q8l26R3J4%M2N2j44J78k91L73k35j19K81l39
7713b30J94m8p4J92n4l5rm1P8J0R3J82k86N9o6l80M61J38k40o6r8K80n9p6R3q
7739A0J95k50j20K41k02J97M0M7k39L14N6l70mP9J58l27L86k05J06m9l4N7m45
7762c59L72k07R8Q1l8j27R9j2K84k80k53K69LK70n6j10J12k55P8K45l30m0K36
$$ plain form
7599 -257 -13 -238 59 -161 151 68 -87 -238 -48 115 -255 137 -9 -175 25 -130 111 -92 90 215
7619 215 -214 165 -161 -10 -84 56 -188 334 -150 119 -113 -153 109 -53 248 -10 -68 -107 105 -68 256
7640 256 -18 -281 -81 134 43 -75 134 26 13 5 21 2 50 68 40 137 -136 -150 246 67 32 77 119 51 -71
7665 -71 -154 114 -139 -421 193 -40 -18 -181 53 243 38 -142 103 -139 -221 -178 -45 -72 8 -41 -218 -211 -213 -240
7689 -240 152 167 226 122 -56 15 50 200 103 191 -135 -42 -28 -28 14 66 -78 100 -191 182 -53 -172 109 -230
7713 -230 -36 -84 -158 34 -20 -55 -64 -105 -27 -17 76 258 -28 31 -35 -415 46 184 -56 -122 -220 60 1 -75 18 10
7739 10 205 -45 -165 76 -126 71 111 158 -81 233 289 -81 -85 -6 152 -175 211 6 112 63 29 86 -359
7762 -359 13 -194 -96 -15 -53 -180 -81 -93 191 -89 -342 -73 -70 200 144 34 146 -109 -31 214 -116 -156 80
7785H0p1N6j8k11Q4J46K29m75J22J23o5k88K02KK36O2j44j18j76k26N13K16k45
7808C4l0K06l6j14l13K62j21K02m0k48L11M5K5k01L7k6N0L3j60J66M4k13P7j96
7832b06K20J40j77j71J21J19k61k3J98J23r2k74K62j40K64J10k16O4k7J05l08
7853a69j2L58k10m9M2p7L37j22k44K26l7o6j1J69o8k38K84j85N3K19k05K52l02
7876e5L6J54j44J29j09k50L8J08J01j35J7j12J95k58L81j18Q5R3j25q9R2J38j75
7899cQ6r2J70o5Rk21J38m0k8J18l32J28K87j9m3l10R2r1K50q6M8j69qK2K98l7
7925A02Ll09L06j73K67j41k0k80J79N37m55K0j50L81k26k10J85j1j4j51L12j97
7947d5k9O3n2j1K67j22K23k18j62J99m1p9J37j71j90O4K33N7k27N6J69o8j01J66
$$ plain form
7785 80 9 65 47 -164 -80 66 295 -180 -58 65 0 -288 -86 -84 152 214 70 -48 -224 -450 63 279 34
7808 34 4 210 174 60 -253 9 -112 90 50 -198 113 158 183 -18 19 -7 43 76 -84 82 126 -87 -10 -206
7832 -206 14 154 -23 -194 -73 46 -215 -238 -40 83 -9 -283 -21 -161 103 213 -3 61 34 139 -169
7853 -169 -181 177 -33 -82 -40 -117 220 98 -146 80 43 -23 -34 135 67 -171 113 -72 -19 200 -5 247 -55
7876 -55 -19 135 -9 120 11 -239 -201 -93 8 -127 -110 -222 -27 -285 96 -22 63 156 31 -58 34 172 -3
7899 -3 83 -9 161 96 105 -116 22 -18 -46 72 -260 -132 155 136 93 -217 -125 -216 34 -52 -4 -173 -181 -159 139 102
7925 102 105 -204 102 -71 196 55 35 -245 -66 471 16 36 -114 267 41 -169 16 5 -9 -160 152 -45
7947 -45 -74 -11 -63 -74 193 71 294 76 -86 113 72 -7 130 -41 -231 -167 66 123 -104 -48 121 53 -48 118
7971A18j34n7Q4K30j63l09R1R4n0N9K55j07j16j4J60j98J94k20J1p0R0r4m7J93
7995@m54M36n4J51J47m71K91KKqnk52Q1M96k73l32K24O9r9l8J34k70L06j7k65
8020a99m4K80p5k26o8L67j04r6K97Kj12r0J08j57M9r2j06K89K81l74j19Q7J82
8043H0q3k8j57P0N6n1J05q0J91j56q2J70K0K44m01K5P1N0kp5J54j9J56k05l54
8068c01M9L77l62P4J19J54J23m34J83L73K3m41L39j11o4J2K0m54M25q5m9J72j89
8091d7pO7N4Rm4j19N7L8j46K04k17Q2j93K11J48k08j06K82j60P4J77j06m3K1n0
8116b2m4q4L55j91J16k46nR9l1J53k27j09K61J43k93L22n0j03M19l89Kj01J41
8139A16k70p1L06k00K8K28j77j8K27n90M85M3k15q6K70j44Q0q1r6J82J41j04p5
$$ plain form
7971 118 -16 -73 11 241 78 -231 -140 -46 -96 -37 218 111 -5 -19 141 -57 137 -83 -72 -142 -52 -146 -193 0
7995 0 -454 -18 -72 79 226 -245 46 48 50 42 37 -215 -134 362 89 -243 -19 50 -49 -87 47 -223 83 66 -199
8020 -199 -243 37 -38 -264 -332 35 -69 -165 132 134 22 -68 40 -117 -68 -160 -266 23 304 -70 -189 -102 80
8043 80 -3 -31 -188 -118 -62 -113 -8 -88 103 -53 -135 35 55 299 -102 -77 -6 44 42 -33 121 102 258 53 -301
8068 -301 -252 125 -237 -163 -44 110 233 -201 -18 355 378 -63 276 165 101 113 133 -321 104 19 -30 142 -47
8091 -47 -54 13 67 76 32 -87 -30 8 -138 66 -151 -69 -262 -51 97 -111 -217 65 -95 -21 156 50 7 28 -22
8116 -22 -66 -150 205 14 130 -116 -121 -22 -53 100 -127 -236 25 168 -125 197 147 44 463 74 76 -25 116
8139 116 -154 -225 81 -119 -91 137 -40 -58 169 -421 64 107 -108 -194 76 -68 12 -69 -165 17 158 54 -21
8162b1q3R7j08p4Q2J15K01k22Q5p7j09L86l52J12P1l08O3M5j59J50j17K10P3j8
8186D2M6qL2k26J76
$$ plain form
8162 -21 -104 -7 -115 -189 -107 8 209 -13 72 -5 -114 272 -80 32 103 -205 -142 -97 -256 -106 -223 -13 60 42
8186 42 88 80 112 -114 62
8191F2
$$ Imaginary data points
##PAGE= N=2
##DATA TABLE= (X++(I..I)), XYDATA
0@%%%%%%%%%%%%%%Qj6J6j6J6k4L2l2M0m8N6o5P3q8J04j20J36j53J76k00K25k55
36a35K87l21L57l98M44m93N48o10O75p46Q24r07R98j101J213j335J472j624J793
55I41j983K199k445K731l066L464l947M549n326O369p853J0147j4206K3586r0269
70g5109k4856R9214j2383l101J6555L8216o039n092J0729J3855k9280k7846l185
83h322J1836r498j4738m542Q613k457J73J1770J3322k841m820L956J0006l89o460
98E609m85M023k938l719j93J092l788o206n86K712j497k089J119K673K025J690
114e58K143L204J118l55M96L29j898k609j799j304j294j142o18N26N29J085N87
131a560J048Q47P98%Q39J90o10j26j64n28k14j95K24l99m45K0n0n14m13k43J3
$$ plain form
0 0 0 0 0 0 0 0 0 0 0 0 0 0 0 0 8 -8 8 -8 8 -16 16 -16 24 -24 32 -33 40 -48 56 -64 72 -81 95 -105 120 -135
36 -135 152 -169 188 -210 234 -259 289 -321 354 -392 432 -475 523 -578 635 -700 772 -852 941
55 941 -1042 1157 -1288 1443 -1623 1841 -2106 2443 -2883 3486 -4367 5780 -8426 15160 -75109
70 -75109 -99965 -751 -13134 -16235 320 38536 32497 27405 38134 51989 22709 -5137 -8322
83 -8322 3514 -5984 -20722 -25264 -16651 -19108 -18935 -7165 6157 3316 -1504 2452 12458 12069 5609
98 5609 5124 9147 6209 2490 2297 3389 -399 -6605 -7191 -4479 -5976 -8065 -6946 -4273 -2248 -558
114 -558 1585 4789 5907 5552 6048 6377 4479 1870 71 -1233 -2527 -3669 -4287 -3761 -3232 -2147 -1560
131 -1560 -512 335 1133 1133 1972 2162 1552 1426 1262 734 520 325 549 150 -295 -275 -325 -839 -1252 -1495 -1482
152a482K77K24M25K62L54J092j06M04j90J61R4q68n97j68l07k88m64n35J71M90
172a051L80m2N41M0M75J47M27M75n01L1q0j12R3m92k49o61n41J24k3l48koKQ05
196e68J089M41K40M73p0J53k98l95q60m01n21j85n51l21N71k29P48N15L28P06
216H65kJ57J51J33o28J20l40n00q3j77J6k46j23O1q7K85k8J22j50N08J89N72p5
239G40L8J80j96j90j96l76k65p2k98l38R2Jr2P09q0M85M77j54K76L0j66K13l12
262E06j59m92J63o60L24j81J11M9K22j09J82L1pO9j20K69Q8l6J6L12k99J66j18
285C27j63k50k36j5j21j26O8J44l3P5K87l9N49r9N4J33q2j11l07k01L5m6r9R2
309a64j91J95l09j28K65M97j45%K47J2j70j6L32j76l99K24M5k61R8j62l09N6J40
$$ plain form
152 -1482 -1205 -981 -556 -294 60 1152 1046 1450 1260 1421 1515 647 50 -118 -425 -713 -1177 -1712 -1541 -1051
172 -1051 -671 -713 -172 -132 343 490 917 1392 891 922 842 730 823 331 82 -579 -1120 -996 -1019 -1367 -1369 -1375 -1373 -568
196 -568 521 962 1202 1675 1605 1758 1460 1065 205 -196 -717 -902 -1453 -1774 -1203 -1432 -684 -169 159 865
216 865 863 1020 1171 1304 676 796 456 -44 -127 -304 -288 -534 -657 -596 -683 -398 -426 -304 -454 54 243 815 740
239 740 778 958 762 572 376 0 -265 -337 -635 -973 -881 -880 -972 -263 -343 142 619 465 741 771 605 818 506
262 506 347 -145 18 -642 -318 -499 -388 -339 -117 -226 -44 -13 -20 49 -71 198 286 250 266 578 279 445 327
285 327 164 -86 -322 -337 -458 -584 -516 -372 -405 -330 -43 -82 467 368 422 555 473 362 55 -146 -111 -157 -256 -164
309 -164 -355 -160 -469 -597 -332 165 20 20 267 279 109 93 425 249 -150 74 119 -142 -44 -206 -515 -459 -319
332c19m6K70j46J00j0O08J7J17m71M23j39j63k02L6l40k59M48j87L39l20M39j67
354B8Q2J55K49l41rk21K6J08k00k64J55j45J51m4K16j16O9K5j24L44j21K31k61
377gK41j2l0k64J04m6Q4O7Q7ol21j32J00P8j33M26m10M16J08j55r5k11L02j57
401C4P1k37J87j02K92l48j4k02L71J16j72n5L8K02n0r7%k22L12j7j75K24j55j2
425a1j41J29r7L58l95R4J41q4p5L27l52K65j25J19K3j46J56JM1n82M75P6m91K78
449a6N4J68k21j33L58j92j16j6J34N0l4j34J68n1J30n8j88K18j3j07l17K57j45
472b04j12N03j00k39L62j97O6M44m07O0J30m74M2J60k35q2J34M3Q6J6p8K27k05
495f0J26p1l4M04n70P9K79l84P7J96r6n4J47k18J06JN8j07K27j01q4J38K02m52
$$ plain form
332 -319 -365 -95 -241 -141 -151 457 474 591 120 543 404 241 39 75 -265 -524 -76 -263 76 -244 195 28
354 28 110 265 514 173 164 -57 -31 77 -123 -387 -232 -377 -226 -270 -54 -170 -101 -76 -200 144 23 254 -7
377 -7 234 222 192 -72 32 -14 70 137 224 218 -103 -235 -135 -57 -190 236 -174 242 350 195 100 -111 191 34
401 34 105 -132 55 -47 245 -103 -117 -319 52 168 -4 -59 -21 181 131 34 34 -188 124 107 -68 156 1 -11
425 -11 -152 -23 -120 238 -157 -63 78 -6 -81 246 -106 159 34 153 176 30 186 187 228 -354 121 197 -294 -16
449 -16 38 206 -15 -148 210 18 -98 -114 20 70 36 -98 70 19 149 91 -97 121 108 1 -316 -59 -204
472 -204 -316 187 87 -152 210 13 79 523 116 176 306 -168 -126 34 -201 -283 -149 -106 -20 -4 -82 145 -60
495 -60 66 -5 -39 365 -205 -126 153 -231 -154 42 -54 -108 39 -179 -73 -72 -14 -121 106 5 -79 59 261 -191
519a91L10L8k00J04j96J53q5P7J4j0m5k50J10lK8J58j2N8L0K03J74k90l55J27
543e3NJ01k4K81l16q7J13P6N2Q8l22M2J43l09K76o6J43k19j48J04L21k35m2J29
567E3j66M5p2L6j7K0j24K73K57j41R9k80q4QR8j43J23kj91J31j20p8L82M6p0M7
593A30r2O6n6j55J20M14n93J05K26k22K90j99J7k96RJ92p9J65J12R9k74P8N4n9
617E2q2K50j23J04k74J02m4j23J89j41m0K29k78K16q1J49M3k46J42J38j07r2L7
640B0K4Oj71N6J63k92J44J36j94Jq8L60l32M9J31Mj1q2Q5J31j12o6j02K13j2j83
666a22K20M3j1j56O3n8j67L06j8J40l73K24K0k78K70O9l14m1J09M1M46m02j8K09
690B02j30j10R9J57k20k1M7J39j41k3N6l7J1r5j72J12j60L72j33lK30p0n3J28
$$ plain form
519 -191 119 157 -43 61 -135 18 -67 10 24 14 -31 -281 -171 -174 -146 12 0 58 88 291 465 175 -180 -53
543 -53 -48 53 29 310 -6 -93 20 96 148 236 -86 -44 99 -210 66 0 143 -76 -224 -120 201 -34 -76 53
567 53 -113 -68 -140 -104 -121 -101 -225 48 305 164 263 -17 -101 -93 5 -138 -15 -17 -208 -77 -197 -275 107 153 83 130
593 130 38 104 48 -107 13 427 -166 -61 165 -57 233 34 51 -245 -236 -44 -123 42 154 253 -21 57 111 52
617 52 -30 220 97 201 -73 29 -15 -138 51 -90 -130 99 -179 37 -44 105 148 -98 44 182 75 -17 20
640 20 44 50 -121 -65 98 -194 -50 86 -108 -107 -195 165 -167 -118 13 17 6 -76 9 140 28 -38 -140 73 61 -122
666 -122 98 141 130 -26 37 -21 -188 118 100 240 -133 91 111 -167 103 172 -142 -183 -74 -33 413 11 -7 202
690 202 72 -38 61 218 -2 -23 24 163 22 -1 55 18 29 -66 -238 -126 -286 86 -47 -50 180 110 57 185
714A85j41K12j66k01j39J19K30j41J43j21P3J2j54K16J1k97J53N9PPl11M27P1
737B54k1k77J0N0j11J10N9k38K31q7rj21L18L4l69L12j67K42l27J96j93o2J0J24
761c2P3J36m30N4N7J84J0k36K97om4q3L02k35k69K40j60NJ09P8J27j93J29q5K9
786E7M6J8J17l23M8P4M7j24j52J22J9J03k36L22q2j71J9o6K79j51N2JN6l32J71
811h6K60k25k07J13K77J08k73j40K06j87P1M8j58J62j48K19K52j94M6k6J44j26
833A36k89K89k94L40K0r0k29r8K99J8J02l75J25K54j90j19K56k3j05o7K13j79
855fJ10n8M0k2r9J95j49M1P8l32K59k2J82k92R4p4m0j6J29l3j55j51M56q0o5P2
881F2r1j32L70j89j13L8p1J78k44J58j66L22j13J39O0l52K9J54n6j4j26J4P3J50
$$ plain form
714 185 44 256 90 -111 -250 -131 99 -42 101 -20 53 65 -89 127 138 -159 -6 53 60 67 -244 183 254
737 254 233 -44 -34 16 -95 15 74 -164 67 -20 -29 -150 168 202 -167 145 -22 220 -107 89 -104 -166 -156 -32
761 -32 41 177 -253 -199 -142 42 52 -184 113 107 63 -20 282 47 -222 18 -142 -137 -28 50 177 -16 113 28 57
786 57 103 121 238 -85 -37 37 84 -40 -192 -70 -51 52 -184 138 56 -115 -96 -162 117 -34 18 19 75 -257 -86
811 -86 174 -51 -258 -145 132 240 -33 -173 33 -154 -83 -35 -193 -31 -179 40 292 98 144 118 262 136
833 136 -153 136 -158 182 202 112 -117 -215 84 102 204 -171 -46 208 18 -101 155 132 27 -40 173 -6
855 -6 104 46 86 64 -35 160 11 52 130 -202 57 35 217 -75 19 -55 -95 -111 18 -15 -170 -321 135 55 -10 62
881 62 -29 -161 209 20 -93 -55 -126 52 -192 -34 -200 122 9 148 208 -144 -115 39 -17 -31 -157 -143 -70 80
905H0L8m29L21J36k30o5J86m5J02n0m6J30k12J05p4k04K8q2M10l2r1O3n0K25k05
930IJ38J16k95J3j54j56K09M3K8l4K33R1l47N31k74j38J49k96O9N3J16j35k9Q6
954B6j39L29l40R1l7J10l71N88j55j11KM9O5k01n9J77P4m5j39N9J56k68L17k10
978c2Q1j07J31J6k74K5M3J55k26J19J65Nj22j25J31L6K88n35J0K73r5J76j38J48
1002A48j3j07R7j24K48j52j73L16k57K3j43P4K22k42m3J71j10K02M51m12J30l38
1024c2K4P5k14L05j28N6j02J3J2K9J98k21n3k44M86k42Q4n1n1l7K18j3j39J20
1048I3k55J57J69j72%J4K76m0k64P8j05M2J16j96J10j2n5J10l43M56k93K11l5
1071F2J47J41k35k65KM09j30l15K60k40J47k19L46k42J45J1R0qj48J23P7l61K45
$$ plain form
905 80 118 -311 10 146 -84 -149 37 -8 94 44 -2 128 -84 21 -53 -257 -229 -311 99 67 -24 39 -11 214 9
930 9 147 263 -32 -19 -173 -329 -120 -77 -49 -83 150 241 -106 425 151 13 162 -134 -65 -12 104 -31 -60 26
954 26 -113 216 -124 -33 -70 40 -331 257 102 -9 -7 42 107 -94 -153 24 98 53 -86 -27 129 -139 178 -32
978 -32 49 -58 73 89 -185 -160 -117 38 -188 -69 96 101 -21 -146 -15 21 309 -226 -216 57 -38 138 0 148
1002 148 135 28 125 1 249 97 -76 240 -17 6 -137 -63 159 -83 -126 45 -65 137 588 176 306 -32
1024 -32 -8 67 -147 158 30 86 -16 -3 9 38 236 15 -38 -282 204 -38 46 -5 -56 -93 125 112 -27 93
1048 93 -162 -5 164 -8 -8 6 282 242 -22 56 -49 -7 109 -87 23 11 -44 66 -277 179 -114 97 62
1071 62 209 350 115 -150 -148 261 131 -184 76 -164 -17 -236 110 -132 13 24 114 106 -42 81 158 -203 42
1094D2K1k06K56j54l3M05m86L54m07K26J0k0J10r0Q8j27J3L1j88P6J79n3Mj21
1118g0J34j7k2j14K13j17k05L76k74k01L99jk15K46r5l2R2k75L84j88R8j03J62
1141A75j82N1j87K94k16K61l30M3j58L20j21m4q2L11Q7O3l24Q9n7j2J5J43o1O3
1165A41n9r6j73qK78m00J60J45J53k74N9j69N5L72k80L41k06J43k93J70j72L42
1187B29j88J52q6j18p8mJ98j30J37l96K75k31M02J42n0p1j61M7%k62K23j84K24
1210G0p5k95K45L78l00J45k89J04j40J18J55J8k00L61j3n85M20M1R9j36j11r8
1232h8q8K34k7K78m32j6K6j37L71k10K45k38K31k88O4k3j01L26K3m9P7r1pp0O4
1257G4j03J03k02L46K4r0P4m03L03j15k4J85k02O3J35q8j41j1K38j96Jj77J40
$$ plain form
1094 42 63 -143 113 -41 -74 331 -155 199 -208 18 28 8 118 28 116 -11 2 33 -155 -79 100 47 51 -70
1118 -70 64 47 25 -89 124 7 -198 178 -96 -297 102 101 -114 132 37 5 97 -178 206 18 116 13 175
1141 175 -7 44 -143 151 -65 196 -134 -91 -249 71 -50 -94 -176 135 222 285 -39 50 -7 -19 -4 139 78 141
1165 141 82 -14 -187 -195 83 -317 -157 -12 141 -133 -74 -243 -188 184 -96 245 39 182 -111 59 -113 229
1187 229 41 193 107 -11 -89 -93 105 -25 112 -284 -9 -240 162 304 254 183 22 69 69 -193 30 -154 70
1210 70 -5 -300 -55 323 23 168 -121 -17 -157 -39 116 134 -66 295 282 -303 117 158 257 121 10 -88
1232 -88 -176 58 31 309 -123 -139 -113 -250 121 -89 156 -82 149 -139 -75 -98 -199 127 150 101 178 87 80 10 74
1257 74 -29 74 -128 218 242 152 226 -177 126 11 -13 172 -30 33 168 80 -61 -72 166 -30 -29 -206 -66
1280f6J39j18J40k3j26j15J00K11Rj26j23K90k80K05j72m2O1oK01r1j18q9K28
1303H9J64j69j02q0K11k23J86K72K2l32Q4l5J0K5%j11j10M22l68j8K78m04J09
1326h0j02K64k32pR6J55j72r6J74k12L36j90K38j42J06J17l32NJ29K0J15j46p3
1349b9n3J5%K10k11J98k8k61K38m2N3J4k04j11L68n46M85p3K20m8j29J5k11L82
1373B52l46K48j46j01M9K4K5j65J31J70m13P1K7K14P1j04j33kM9L58o0m40J06
1396a15j5J17l1kJ81k28O0k0J42j29Q3k22J66n0O1j6k2K50l47L63l37K82k93K53
1420A31k60J47Q1K2k64j43n6K70J0n9M72k40j77p8J51r0K96j27l5R9k24J41mj15
1444e2P1j6n3j57L51j22j10J3J81J97k83j09J78o4r9J02o8J11m2j5K17j36O9k62
$$ plain form
1280 -66 73 -45 95 72 -54 -169 -69 142 151 25 -98 192 -88 117 -55 -97 -36 -42 159 68 -50 -139 89
1303 89 253 84 -18 -98 113 -110 76 348 370 38 122 87 97 122 122 11 -99 323 -45 -63 215 -189 -80
1326 -80 -182 82 -150 -157 -61 94 -78 -174 0 -212 124 -66 172 30 136 253 -79 -74 55 75 190 44 -29
1349 -29 -82 -67 -67 143 -68 130 102 -159 79 37 90 104 -100 -211 157 -389 96 23 243 195 66 81 -130 252
1373 252 -94 154 8 -93 -44 -20 5 -160 -29 141 -272 -201 -174 40 111 7 -126 -128 -79 279 219 -221 -115
1396 -115 -130 -13 -44 -46 135 -93 -33 -53 89 -40 43 -179 -13 -63 -2 -18 -40 210 -137 226 -111 171 -122 131
1420 131 -129 18 99 121 -143 -286 -342 -72 -62 -121 351 111 -66 -144 7 -83 213 86 51 150 -74 67 63 -52
1444 -52 19 3 -50 -207 144 22 -88 -75 106 303 20 -89 89 25 -74 28 -40 71 29 14 231 95 164 -98
1468i8K87l64K22j29r2L69l92K59L5j55K75l36j5K86k77Q3J42L4j52lL4n9J8o7
1492i5J68m5m0m3j73K76j92J31r5J50k41J35M7J66j38K07l49N8lK48l05J48J48
1515A63j91Q8k1N4q7K20k14j2M2J26k5o1m12K84j02L7L23k46K6j98R3PJ68j48
1539h6k16M90k71J28r9m0J2O0MPJ26J55j16L8l96K01j1n9J45j4M7J53k54J49j05
1564D8L4j6J51J11l54k22K68M1n4JO2q4J3O4j69J83l13R2j6M4J04k44L21l6l0
1589ar4M36k94k02Q3L6P9j13J37l59K86J2l53J93Q9L46j70j6j71L9J73l05J80
1612A1j61J37J7K18l90m6K31K49k49L0K6k67J70Q4J97m3k06l6M7K9q9L5K2oj13
1637a03J36l7k21K37J23k9k14K79k07M2k34J32J97K0K0L3j39R7J6k21J22j54k51
$$ plain form
1468 -98 189 -175 47 -82 -174 195 -197 62 97 -58 217 -119 -134 152 -125 -42 100 134 -18 -21 13 -46 -28 -95
1492 -95 73 28 -12 -55 -228 48 -144 -13 -108 42 -199 -64 -17 149 11 218 -131 -73 -76 172 -133 15 163
1515 163 -28 60 39 93 6 226 12 0 42 168 143 82 -330 -46 -148 -111 212 -34 -8 -206 -113 -106 62 -86
1539 -86 -302 188 -83 45 -54 -94 -82 -22 -18 -11 115 270 154 192 -204 -3 -14 -73 72 58 105 258 4 153 48
1564 48 82 66 217 328 -26 -248 20 61 7 8 70 -14 -1 63 -106 77 -236 -144 -160 -116 -12 -256 65 29 -1
1589 -1 -95 341 47 -155 -72 -36 43 -70 67 -292 -6 6 -347 -154 -65 281 111 95 -76 -37 136 -169 11
1612 11 -150 -13 4 222 -168 -214 17 266 17 47 73 -194 -24 60 257 214 8 -28 19 48 -41 -6 16 10 -103
1637 -103 33 -4 -225 12 135 106 -108 171 -36 6 -228 -96 101 121 141 174 35 132 148 -73 49 -105 -356
1660c56M47nl06N45j12j29j15J00J7j17j27N7K41k71K23Q0P3l32J31j0j00L38
1682B72l16J33j9j75J54j55J14k06K09J38l82J08Q4k30K23M6J96k91R9J05j90
1703h3R1K3P5K7k40j24K76k14M02k67l11N61k16l7m4J07j11J20k2J59N7k29r3
1726i3Q7j32M31l20J30l95K79Q3l71L6J66J92J06k56J39l24j0L22l5j61J40P9
1748I3l6M8oJ54j47q8j35L7J24j10J77o1p8r7R6j52M6R3Lj00K63M7j91J31j52
1773d1pQ9K85k42l8M1k27K67O1k22l1K5J41m01K91r1J13j35nM2K11o6k28J05M9
1798a4J91m38L33l41L31j32p6K50k16K32k54J14K71n41Q9M20j76k05p1O47m28
1819a4J97j08nk54L86m13N1n7K41J0j47J47O5j40l9J37mp3NK62j40k49L09k64
$$ plain form
1660 -356 91 86 -220 325 213 84 -31 69 86 -31 -158 -101 140 -131 92 172 245 -87 44 34 -66 272
1682 272 -44 89 70 -105 49 -106 8 -198 11 149 -233 -125 -41 -271 -48 -2 194 -97 2 107 -83
1703 -83 8 31 106 133 -107 -231 45 -169 233 -34 -345 216 0 -37 -81 26 -85 35 13 172 229 0 -93
1726 -93 -6 -138 293 -27 103 -292 -13 70 -301 -265 -99 93 199 -57 82 -242 -252 70 35 -126 14 93
1748 93 57 105 99 253 106 18 -117 -80 44 -66 111 50 -28 -125 -29 -181 -135 -42 -39 -139 124 171 -20 111 -41
1773 -41 -48 41 326 84 46 87 -140 127 188 -34 -65 -40 101 -300 -9 -100 13 -122 -127 -85 126 60 -168 -63 -14
1798 -14 177 -261 72 -269 62 -70 -146 104 -112 120 -134 -20 251 -290 -201 219 43 -162 -233 414 -14
1819 -14 183 75 70 -184 202 -211 -160 -217 24 34 -113 34 99 -41 -80 57 53 -20 -15 247 107 -142 167 -97
1843i7P8j79K73j68n9L42j24P9j20j7P4K68l14j34KL3J14k69K75L4P7j68o4N7
1867gj64J47L25k72J53k49qj85L0j3L10o1J61j70J24k54L61l41L42Qn82L87l48
1890c06K11M31l53j90K23L34o09r3L03R6j10j16L57k84Q7m9Q8j1O9q2J6K46k51
1913Gj23K45l73M00q4j41j93K20L5N4M4lJ69k90j4J0J11k08K04j00r2J9O4j0K3
1938b6j42L28j83j17M2K21k05l2L02l04K24j12J48j43J38j15q0P4k0k12L29j04
1960A1K2j16rK33j96J07j5pk28J33o0K55q4K10m07L81l19K30q2m9j39j29R0J71
1984Cjj65L72k84R5J89l32P0K0j55J82P9R5j79pq5J28J08k38j23J11J30J52l8
2008A27j48l41M30R8n27N84m89l1M65j53l6K01k27R1j69J30J28k31J70j75O2j48
$$ plain form
1843 -97 -19 -198 75 -93 -152 190 66 145 25 8 82 350 36 -98 -96 -63 51 -218 57 91 168 0 -64 -7
1867 -7 -171 -24 301 29 182 -67 -75 -260 -230 -243 67 6 167 -3 121 -133 228 -113 229 237 -345 42 -306
1890 -306 -95 336 -17 -207 16 350 -259 -352 -49 47 -63 -179 178 -106 -19 -68 20 9 78 -4 12 258 7
1913 7 -116 129 -244 156 72 -69 -262 -42 -7 47 91 88 257 -33 -47 -37 74 -134 70 -30 -122 -103 -39 -49 -26
1938 -26 -168 160 -23 -140 -98 123 -82 -114 188 -116 108 -4 144 1 139 24 -56 18 -2 -214 115 11
1960 11 33 -83 -92 141 -55 52 37 30 -198 -65 -125 130 46 256 -151 230 -89 141 59 10 -129 -258 -168 3
1984 3 2 -163 209 -75 20 209 -123 -53 -33 -188 -6 73 168 -11 -18 -103 25 133 -105 -228 -117 13 165 127
2008 127 -21 -362 68 166 -361 223 -266 -297 168 15 -21 180 -47 44 -125 5 133 -98 72 -103 -41 -189
2030a89J15K11n5m1J6J04j44K55k88m9R1k96J38J48k6J03j74j40L62n1Jk28l7
2053a74J10K16J35l67N3J26m22L85o1J8P2Lj20k3m7L5M1J49L1r0R7k96K11J18
2077B00r7p0j73J65j34R0j29L08L8l14N4O0J36m68M52k32J80L4J40k86Q1m38N32
2100A29j24m8K22m81K99L7j00R5m2K8j21j67L22k8ok02J00L1j92J60K05kj01j26
2124a12j73K48K33n7l22K90j5M7k47J62J56l82K94n7k3J56j92L0m4LR6o9r0K68
2148B00j51o5J05j51J21j42J69j13l89O84l01k3N4k31J32j06L38m4j31K1K7q5
2170h1L8o7M6J22J15k07k06L03j70L26k0j24J72j92j41L7K64j13n5J23O8m34K37
2193D1o3j1j14M83k83j78O4J0N8K2j84K51m16K74J67j84P9M6k8l10K14M3j9J45
$$ plain form
2030 -189 -74 137 82 41 57 161 17 272 -16 -65 26 -270 -132 16 -10 93 -81 -221 141 90 91 -137 -174
2053 -174 -64 152 287 -80 -27 99 -323 62 1 19 91 94 -26 -49 -96 -61 -20 129 160 70 167 -129 82 200
2077 200 103 33 -140 25 -109 -19 -148 160 198 -116 -62 -2 134 -334 118 -114 66 100 240 -46 35 -403 129
2100 129 5 -43 179 -302 -3 34 -66 29 -13 15 -106 -273 49 21 15 -187 -87 -56 -248 -88 117 115 14 -112
2124 -112 -285 -37 196 139 -183 107 92 139 -108 54 210 -172 122 65 42 198 6 36 -8 -5 91 22 -68 200
2148 200 49 -16 89 -62 59 -83 86 -27 -416 268 -33 -56 -2 -233 -101 -207 131 87 -44 -23 4 -81
2170 -81 -43 -110 -64 58 173 -34 -240 63 -107 219 199 75 247 55 -86 -49 215 102 47 170 238 -196 41
2193 41 -22 -33 -147 336 53 -125 -61 -51 7 29 -155 96 -320 -46 121 -63 16 62 34 -276 -62 -19 -38 107
2217A07j39J72r1j57J89m83M58j92N4L27k75L46k99O5l1o7rJ50j56J15j66J63
2239H1m1r2J86J0j72J02k18K52k81N9J79R1rj9o5r7J51p1N3O6j46L06l63o3j04
2264b05K50k81J96J5j74K18n0l1N4j46J69L2l1J80O8J7k37j25L16k18l5q6M03
2287B99j50jj73k24K00N9K45l73j7J60Q9j02rm8J01K8k41K19j0o7lJ71m0q6j08
2312h1M2K65j46j74J67K57k29k24m1N7L7j60K94J40k29Q6j6j8K9j26M4q9q8M81
2336B78l14j66K42J2j00J81l88L32j45J39k47J18K05j76J71k40K08J33k67K42
2356B18k27M46k94n2J7j85J56j83L7j28K39J94j27k68lJ04J08j21K6J86k52J29
2378B0k07J92k04J29k8Q1j6j85L06O3l2k94K81R3k67J21k42J88J27m17L56j06
$$ plain form
2217 107 -32 140 49 -108 81 -402 56 -136 -82 245 -30 316 17 82 51 -16 -25 125 -31 84 -82 81
2239 81 40 -52 134 144 -28 74 -144 108 -173 -114 65 156 147 128 63 -34 117 46 99 165 19 325 -38 -101 -205
2264 -205 45 -236 -40 -25 -199 19 -31 -62 -8 -154 15 47 16 196 264 281 44 -81 235 17 -18 -104 299
2287 299 149 148 -25 -249 -49 10 255 -118 -135 25 114 12 3 -45 56 84 -157 62 52 -15 -18 153 113 27 -81
2312 -81 -39 226 80 -94 73 330 101 -123 -164 -107 -70 -230 64 204 -25 61 45 27 56 -70 -26 -115 -203 278
2336 278 -36 -202 40 52 -48 133 -255 77 -68 71 -176 -58 147 -29 142 -98 110 243 -24 218
2356 218 -9 437 143 91 108 -77 79 -104 -67 -195 44 238 111 -157 -160 -56 52 -69 -43 143 -109 20
2378 20 -187 5 -199 -70 -98 -17 -33 -218 88 151 119 -175 106 199 -68 53 -189 -1 126 -291 65 -41
2400d1m4J00O5k91K68Q3k60J52k00J98m3J85o9l41K45L2K2j14J45l54L45j14O6
2423C5K33k35J05k9J60o00L82j05r3M06j40L8j40l10P1L44l53K33j46L81k38K24
2445B23l55K72k81n1L60l88O5J19J2q3M9j1j27J50n9J34J23j94j47M9L32j56k2
2468A4P5jp7J4l6r0j40L13K00m50L90j02j56J01j93lP0J29l37Q8J50M4j01K98
2492B00r3k25J85j54J47m08M01L4Ml35j3L08J5M5rk85j2K91QJ18k96J3J59J66
2516B64j91M7l59M80l48p4Q6Q7o6P9j10J26N4J01j67r6J06J55k42K03k72R0l8
2539h5l3J78J6K9q8J85r9q0p2j6K7K63l31r3K91J46m18M20l41J73k5j10M2K56
2563B35J9k74j55K45K8j44j12j48J68j52L50K7o8k7r6L35k53j5k0J84Ll8j52j27
$$ plain form
2400 -41 -85 15 80 -211 57 140 -120 32 -168 30 -13 172 103 -238 7 39 61 -53 92 -262 83 -31 35
2423 35 268 33 138 109 269 -331 51 -54 -147 259 119 157 17 -293 -222 122 -231 2 -144 237 -1 223
2445 223 -132 140 -141 -192 168 -220 -155 -36 -24 -107 -58 -69 -196 -46 -105 29 152 -42 -189 -140 192 36 14
2468 14 89 88 11 25 -11 -101 -241 72 272 -178 212 110 -46 55 -138 -141 -71 58 -279 -191 -41 3 -98 200
2492 200 107 -118 67 -87 60 -348 53 87 91 -244 -257 51 66 111 102 -183 -195 96 104 222 -74 -61 98 264
2516 264 73 120 -239 241 -107 -181 -95 -8 -74 5 -105 21 75 176 9 -87 19 174 -68 135 -137 -47 -85
2539 -85 -118 60 76 105 17 202 103 23 -49 -65 -38 225 -106 -199 92 238 -180 240 -101 72 47 -63 -21 235
2563 235 254 -20 -175 70 98 -46 -158 -306 -138 -290 60 87 19 -8 -104 231 -22 -37 -57 127 130 92 -60 -187
2587a87J00J98k7j02J25k27J58N4k14J37rj39n0J85L7J60k09j36N9J41j54J40
2609D0j05j92L9J36L83k07j8k00j7k8J7L26j16l52L49j01J89m16P4L5J01LJ84
2632A24L6k77L47k78L47m32L15j75j3K17k5O0j69M3l24J47j29J92Jj43K44q7l71
2655c50K74j04J49J72k85J15O7j36J5K26m1j91N7K1K71l08R1N9j29j09mK89P5
2678B24j80J90k75l0K60l3j70J96l45K17K2J70j14l56L27k01L27l00l9R9P5J90
2700B54k05k09R1q4J75J16j97m4K15o5j07J41k13o6J47K31Mj01OKj04r5L00k2
2724A70j83K28m49K34q9K0J5J49k60J28n2m0J70l4K95k36J06r3lj53Q7j24L86
2747B72l34j7J79k17J07K4J01j05M3m4j27Q9JJ55n3k18K28k20o9J49n6M19l59
$$ plain form
2587 -187 -87 111 84 -18 107 -120 38 92 -122 15 6 -133 -183 2 39 199 -10 -146 -87 54 -100 40
2609 40 -65 -257 -218 -82 301 94 76 -124 -141 -169 -152 174 58 -294 55 -46 143 -273 -199 -164 -63 -60 124
2632 124 160 -117 230 -48 299 -133 182 7 -6 211 186 246 77 120 -204 -57 -186 6 7 -136 108 21 -350
2655 -350 -76 -180 -31 141 -144 -29 38 -98 -83 143 102 -89 -32 -11 260 -48 43 102 -27 -136 -140 149 224
2678 224 44 234 -41 -71 189 156 -14 182 -163 54 76 246 132 -224 103 -98 229 -71 -110 -11 64 254
2700 254 49 -160 -69 -153 22 138 -59 -103 112 47 -60 81 -132 -198 -51 180 184 83 89 91 -13 -108 192 170
2724 170 -13 215 -234 0 -89 -69 -54 95 -165 -37 -89 -129 41 7 302 66 172 79 76 -77 10 -114 272
2747 272 -62 -79 100 -117 -10 14 115 10 53 9 -118 -29 -28 127 74 -144 84 -136 -205 -56 -112 307 -52
2770e2M3q5K24%K00l75K9j36J86QM4n1k12L65k63Q7l2j9M2lL9m9Q0j52L24r1o3
2797H8j53n5K39m0%k08M1J21n7M36m63J30J1J0pOk31m0O3J58N9j86L93j18j91
2822FL9J1l3J59k64k52L16l0J4J83k65J15o4n4K33JJ32k38k57M68l96k23L09J61
2846G1p9q8q1K44k85K42J8k0J58k58q6r7M12J21j06j71r4J04q5L39q0k5j57L8
2870C5J50k85J71J21l41K33Q7j65M2r2j60L1J72J6n9O9n3Q5j57R9J8j7M0l20K99
2895A9K1Qk5K56n8k02J14l61K80j38O1J05j66K5JK55k4j53j41J73Nk01J24P1K12
2920B61k66k21J62J54n7mp7R0l6k47K83kk37K51N6k7l9n3L5k55L64j10J66q7j43
2945c9L83k52L7m6j45K1K28k50LK22p9p5q9L5J77j45N9j91J27j35j33K66K71k89
$$ plain form
2770 -52 -9 -94 130 130 330 -45 -16 -152 34 42 86 35 -177 188 -75 12 -20 -39 3 0 39 -10 70 -82 242 151 88
2797 88 -65 -120 119 79 79 -129 -88 33 -24 412 -51 79 90 100 93 99 -132 -172 -109 49 108 -78 315 197 6
2822 6 45 56 23 182 -82 -334 -18 -48 -34 149 -116 -1 -65 -119 114 115 247 9 -248 220 -176 -399 -90 71
2846 71 -8 -96 -177 67 -218 24 42 22 180 -78 -164 -261 151 272 166 -5 -99 5 -80 259 179 154 -3 35
2870 35 185 -100 71 192 -149 84 171 6 48 -44 -204 -173 -1 15 -44 25 -28 57 -100 -1 17 0 40 -280 19
2895 19 40 48 23 279 221 19 133 -228 52 -86 -25 80 -86 -61 -60 195 171 18 -123 50 55 -146 -22 49 261
2920 261 -5 -226 -64 90 33 29 -48 42 6 -241 42 40 -197 54 110 83 44 -9 26 -229 135 25 191 104 -39
2945 -39 344 92 129 83 -62 -41 187 -63 -60 162 83 8 -81 -46 131 -14 45 -146 -19 -154 -287 -21 250 -39
2969c9J89m06M01l22K07qN4K8k89K86nl59J24J09J23J39l98J88J56l12m4K88J39
2992B49l84J18j77j2K72l0N6j54K8J30j07p4j0K35jl96K34k67L71l1j41M5R9N5
3016A08J11j52J6J99n9j95k58L39k01L80j76j72j49J72j4p4J80j90K5o7L1Q0M52
3039C86l68N9k34L16L1l15O7j3k95M27k4j91J00K38k76K1J81j82J09q1K03j96
3061c7K64j90j97L09k05m9j39K28n2J40j74J91j1l01M31k49J37k48J91k0J41j38
3083B2l6J79k2k27k3K30j83j03K26j63R2R0k49jL50k77L23J10n77K75o8J59m8
3106G9j95K08j22n5M19k6m84O6K11p5j46J62K18k96q5J61K94k63k51j34K90r8
3128a22N2j47K86O7N5l27J95J40j03m9l8j6K42l7j38p1N1j06j25n3K72J82o4j15
$$ plain form
2969 -39 150 -256 145 -177 30 22 76 104 -185 101 96 -263 -139 -30 93 232 -166 22 178 -134 -178 110 249
2992 249 -135 -17 -194 -206 66 36 92 -62 -34 96 -11 -85 -95 140 139 -257 -23 -290 81 50 -91 -46 53 108
3016 108 219 67 83 282 223 28 -230 109 -92 288 112 -60 -209 -37 -51 -125 55 -135 -110 -177 -146 -66 386
3039 386 18 77 -157 159 190 -125 -58 -71 -366 61 37 -154 -54 184 -92 -71 110 -72 37 -44 159 -37
3061 -37 227 37 -160 149 -56 -105 -244 -16 -68 72 -102 89 78 -223 208 -41 96 -152 39 19 160 22
3083 22 -14 165 143 -84 -107 123 -60 -163 63 -100 -8 82 -167 -168 182 -95 228 338 -239 36 -32 127 79
3106 79 -116 92 -30 -85 334 308 -176 -110 101 26 -120 42 260 -36 -121 40 334 71 -180 -314 -24 -122
3128 -122 -70 -217 69 136 191 -136 59 199 96 47 9 -7 235 198 60 -11 40 -66 -191 -244 28 210 146 31
3152C1J38P2J4j72Q1k09j97L08j96Q8K06m49M15r2k81J93M3N1j07K54Lq1J8k71
3176a40J96l90L74k11j62L62K28j29k6L8r0K25r3k0j78k85K58n3K09J19j17L1
3198A46l12K63j93J74j57K37n9j49K8K1J2jR7M8k43L28l38J77r1k17L92j43O5
3221H5K04l46J9J74L3m87N67k22J4l6l4j66M19r7k12K25lm09L61Mj09j17O5n8
3245a26m6L13k06K15k00K00m20K72j02K02j16n7o7K84o1n6J5J06N8l18K41o3m14
3268c46K69K40q1R4k12o0K86l61K22o9r1M9K55k58N8lm8r8L41l2m07K3K26k44
3292b47K13K62j53l94Q2m2L00lj9J93l02J56kk80K23R5l16K24l9J62k98K55O1
3315A31j65q0n4K26k26N12m21K70j83J2P5j28J36k09P7k5K46k27L28k67R4n0j89
$$ plain form
3152 31 169 241 255 83 164 -45 -242 66 -130 -42 164 -285 130 38 -243 -50 -7 44 -63 191 194 113 131 -140
3176 -140 56 -334 40 -171 -333 29 257 128 102 140 50 275 182 162 -16 -301 -43 -96 113 232 115 146
3198 146 -166 97 -96 78 -79 158 99 -50 -22 -1 11 10 107 155 -88 240 -98 79 -12 -229 163 20 85
3221 85 289 -57 -38 136 169 -318 249 27 41 5 -29 -195 224 127 -85 140 137 -272 89 93 -16 -133 -68 -126
3245 -126 -172 141 -65 150 -50 150 -270 2 -100 102 -14 -71 -138 146 85 29 44 150 208 -110 131 68 -346
3268 -346 -77 163 82 176 -36 -96 190 -171 51 -18 -109 -60 195 -63 -5 -8 -56 -154 187 155 -252 -229 -3 -247
3292 -247 -34 228 75 -319 -237 -279 21 18 -1 192 -110 46 44 -236 -13 82 -234 -10 -49 113 -185 70 131
3315 131 -34 -114 -168 58 -168 344 -77 193 10 22 97 -31 105 -104 -27 -52 194 -33 295 28 122 72 -117
3338a17J37N2j71K23r4J3j33j19J85n5R1l4j60K27O1K6j65k50N44m46K47J05j56
3361A1M2J70p0j27k36l5L38l31K9J74M1n5j01L00j43J01J77m01l0J36J18j3j64
3384f9j02K39nl48K73J88k1l72L30j85J40J72l71o6K83qJ8j77L28j94j48k77L85
3407A3j02N5M7l5K92k86k9L72m06p7jJ68J5j12L35l08J33K0O4j19k8J68k25Q7
3431D1j2j24J67j21p6M1K86j70J35l68L45k38J77j19MJ46o3n6j49K55q4l09L11
3454A9J29l73L01j55J26q6J33m3k49J87q2J33l17K17Q2j9o1J65p1k48J80P6J58
3477B02j39k02J92%l4j73j39K17o4K45o9o1k39J61Q2J07k37J37J78j86K13j8j93
3500b0K07n9j26j35J49j11K04k55J22J02j33J43L8l7O4j42R4j79r9K63L23m45
$$ plain form
3338 -117 20 72 -99 124 30 43 -90 -209 -24 -79 12 -22 -182 45 106 132 -33 -283 261 -185 62 167 11
3361 11 53 223 153 26 -210 -245 93 -238 -209 -35 6 -49 -150 150 7 108 285 -116 -146 -10 108 95 -69
3384 -69 -171 68 63 -285 -12 176 155 -217 113 -72 68 240 -131 -197 86 78 96 -81 247 53 -95 -372 13
3407 13 -89 -34 13 -22 270 -16 -45 327 -79 -156 -157 11 26 -86 249 -59 74 94 158 39 11 179 -46 41
3431 41 29 -95 72 -49 -125 -84 202 32 167 -201 144 -94 83 -36 -32 114 51 -5 -154 101 17 -292 19
3454 19 148 -225 76 -79 47 -39 94 51 -198 -11 -93 40 -277 -60 22 3 -58 107 36 -212 -32 44 202
3477 202 63 -139 53 53 19 -154 -293 -76 -140 105 36 -25 -264 -103 -21 86 -151 -14 164 -22 191 173 -20
3500 -20 187 128 2 -133 16 -95 109 -146 -24 78 -55 88 126 89 153 11 105 -74 -173 90 413 -32
3522c2M3j25J42J83j03l2l8j79K99j65J14k98K56m12L98l8j69K56j53O4k59L81
3544A33K8j71j2K50m18M6J5r6Q3P7J25k94J59j96L92k56K75j75K4K22j94M5J84
3567B46m6M2l55lJ16j88J26rj70M8J57mK48j73l23m3K33J58j38K35l27J10K51
3590A91m07K26j53K51r6N0j42J30r2l4Kr1M00j28o9J22p5k08K19J09j94K24k39
3613dK04j23j09r2kK06j27O8k94K80k8nj60K27K14k29M9j67K15o2K9j30J73k18
3637h5QmQ6l9R6L09k58O9l20J95j13r6L47j74O4j41r2J60r6J79k39J98k07L21
3661A68q0j58K05k76L48l15J95l16J69J39m8k72j81M51l01K37O5J79k36r4j1K22
3683I0NJ2J65j28k67K77j87J06M3j54K3n6q3K92n19K39K02k07L09k28o4J72j26
$$ plain form
3522 -32 11 -114 28 211 108 76 38 -141 158 -7 107 -191 65 -347 51 13 -156 100 -53 11 -248 133
3544 133 161 -10 -22 228 -190 -144 -129 -225 -142 -65 60 -234 -75 -271 121 -135 140 -35 -11 211 17 62 246
3567 246 200 242 -113 -116 0 -188 -62 -71 -241 -193 -36 -40 208 35 -288 -331 -98 60 -78 157 -170 -60 191
3590 191 -216 10 -143 108 12 62 -80 50 -42 -76 -74 -165 235 107 38 160 85 -123 96 205 11 235 -4
3613 -4 200 77 -32 -124 -126 80 -47 21 -273 7 -21 -26 -186 41 255 26 75 -92 123 61 90 -40 133 -85
3637 -85 -77 -81 5 -34 62 371 113 182 -138 57 -56 -152 195 21 85 -56 -148 12 -84 95 -144 54 -153 168
3661 168 88 -70 135 -141 207 -108 87 -229 -60 79 31 -241 -422 29 -272 -35 30 209 -27 -121 -132 90
3683 90 95 107 272 144 -123 154 -33 73 116 -38 -15 -71 -154 138 -381 -142 60 -147 162 -66 -130 42 -84
3706h4r9N8K00j72R8J3o9p8O8p7Q8R4J49k05j21J01l6M5K34j65J10l01M04k15
3730D0p3q3J94j3k0j74J11q3J64k04r8J60R5l57N36j73j56r3M43R0j55j56Q3j72
3754i4K58k71j4L75q7rl09K93j40kJ23j13k25rK23K08m73M16k18J06L3j36o3K05
3778G7j00m7J10n5j27R5J71J79l20J85j86J06k65J48O9k26P0m7L49l45J19J07
3800F7Lj09K06j7l53O0J24M9J96j37k44J74K5J10k73Q3P2K36l15M82n15J12K7
3823F3j12P0J20j24j0M2j56J05J99j95k16J05K71m9P2L6k14k3O6p0K38j51k30
3846a63Q6L81k53M4l6l42J87n7M66l53K63j97r3J3R9j31M3J0M4M2qj88M5j0L13
3871B05j06qJ2j27L3J95l97K77L0J37k9k63M4m5K51k13L6k27J43l1k04L29j09
$$ plain form
3706 -84 -183 -125 75 -97 1 14 -55 -133 -65 -142 -54 40 189 -16 -137 -36 -72 -27 207 42 152 -149 255 40
3730 40 -33 -116 78 65 45 -129 -18 -101 63 -141 -239 -79 16 -341 195 22 -134 -227 216 306 151 -5 78 -94
3754 -94 164 -107 -121 254 167 158 -151 142 2 0 123 10 -215 -224 -1 207 -266 150 -68 38 71 -65 -128 77
3778 77 -23 -70 40 -15 -142 -47 124 303 -17 168 -18 88 -177 -29 40 -186 -116 -163 186 -159 -40 67
3800 67 70 -39 167 150 -203 -143 -19 30 226 89 -155 19 44 154 -119 -36 36 272 -43 439 -76 36 63
3823 63 -49 21 141 17 7 49 -107 -2 197 2 -214 -109 162 113 185 221 7 -16 50 -20 218 67 -163
3846 -163 -77 304 51 95 59 -283 -96 -153 313 -40 223 26 -67 -54 45 -86 -43 -33 11 53 45 -143 -98 -108 205
3871 205 99 91 103 -24 9 204 -193 84 114 251 222 -41 3 -42 209 -4 32 -195 -52 -83 -287 42 -67
3894f7L15k54L10k33m17K59K53J14l31K45j9j75l48K22J45q5J17j56M7j1q4J74
3916B1j7K99j42k17J50j46J7m8K23j58M9n07N30j17R5j56l6J31J27k55J53O6k60
3939a98J8J20R4j13j22K63N1k91K61K7k13K51k25K68j58j31N0K7jr6J48j84q0
3962b34K68j20N4j79J62j60J98p3J95k09R0j46J70j80M05m20J99K46l34J17Q4
3983A33r6L9l56M8K06J89L8M4j68j64L32m67M27k84j07J92N6j80R9K14J35l56
4005b6J21j19Lk87K17P7p1o2J58k68jL05K13o2j90l6O5J00k1k71j1K49m5j92R6
4030e8J32k67O0k18L57q1K07j41P5n7k60L47n6j49j6M5L32k21j74l9L33j64nJ56
4054A38j8l8K80m92o7J33n4L46k03M3N7L3j58r8j3K9L04l90M2K28mo1J71p9l61
$$ plain form
3894 -67 248 -6 304 71 -346 -87 166 280 -51 194 175 0 -348 -126 19 -66 51 -105 -58 -69 -153 21
3916 21 4 303 161 -56 94 -52 -35 -83 140 -18 31 -476 54 -63 32 -124 -160 -29 98 -157 -4 62 -198
3939 -198 -180 -60 34 -79 -201 62 113 -178 83 110 -103 148 -77 191 33 -98 -48 -21 -22 -118 30 -154 -234
3962 -234 34 -86 -32 -211 -49 -209 -11 -84 111 -98 -8 -154 16 -164 241 -179 20 266 -68 49 133
3983 133 37 76 -280 -232 -26 163 201 245 77 -87 245 -222 205 -79 -186 6 62 -118 -19 195 330 -26
4005 -26 95 -24 -21 -308 -91 -14 -85 -147 11 -257 -258 47 260 198 8 -28 37 137 116 -155 -166 83 38 -154 -58
4030 -58 74 -193 -133 -351 6 -75 132 -9 66 9 -251 96 40 -109 -125 -80 252 31 -143 -182 151 -13 -18 138
4054 138 120 82 362 -130 -197 -64 -118 228 25 68 125 158 0 -98 -111 -82 222 -168 -126 102 98 37 208 129 -232
4079b32J13K61j32J66l04j70K64L6J96l86M39l06J55pj69L3M8j46L27k81K49k19
4101f5Q8j13K11j01j4j78J53j85J87m2j20K41J10m38M27O3j19m25L81J09k77K70
4123A63n3j60J22Mm98N15N8O5l92L15J18j50k66l1K53P5k6j02M8J4R1k27M37m26
4147e3R6j44n9J51j5J66r2J0j86R0q9j23K81m3l06M57j49K49k03k16L47k95L02
4170A76j71P4q9k49K99j78k54O65j20k29o7L5K67l96M01j16j74O9J46j79L4j67
4192b23K14j33j06M45q4j49l0r9KP3L5j5p5J87J83m06J06K02k49n0J53P0k8J26
4216A49Q8k00J25Km61R0K59q8J29j35L8J63k55J95J11k73K98j94J98p8m09K97
4238D9J3P8P3j55j58J48l46M6K06M9J09o7n8O6j5r2l3ML26j94j64K71l48K75k07
$$ plain form
4079 -232 -119 142 10 176 -128 -298 -34 2 198 -188 251 -55 100 93 -76 -43 5 -141 186 -95 154 -65
4101 -65 23 -90 121 20 6 -172 -19 -204 -17 -59 -179 62 172 -266 161 224 105 -320 61 170 -107 163
4123 163 110 -50 72 76 -422 93 151 216 -176 139 257 107 -159 -190 63 138 112 10 58 72 163 -64 373 -53
4147 -53 43 -101 -160 -9 -24 142 50 60 -126 -36 -125 -248 33 -10 -316 141 -8 241 38 -178 169 -126 176
4170 176 5 79 -10 -259 40 -138 -392 273 153 -76 -143 -108 159 -237 164 48 -126 -57 89 -90 -56 -223
4192 -223 -9 -142 -248 197 113 -36 -66 -165 -163 -90 -55 -70 -145 42 225 -181 -75 127 -122 -172 -19 51 23 149
4216 149 237 37 162 164 -297 -207 52 -36 93 -42 -4 159 -96 99 210 -63 235 41 239 161 -248 49
4238 49 62 140 213 58 -100 48 -298 -252 -46 3 112 45 -13 53 38 -54 -87 -83 243 49 -115 156 -192 83 -124
4263a24K47k06K47J4j39j02l6K13k04L25l42K82r3o1O8j29J40k20JJ35P3R1k01
4286b1N7J66k15J53Q3m9qj88l38K26k7L31j57K9K37l75K32k11N8j06P3j94n0M20
4310A26O3m6l3P3k44M1k3N7J34j04j89L04j92J39j38P3Q7j27j16K23M0j09NN4
4334I8m9k3j77L32QRm36O16k83l10J26L58k32k67M80j34q9K67k31M6j87m0L70
4357B52l49K3K31J14k15j41J30k72K03J87j52J20L8j90J01r3K02k85j48J4N11
4378B81l37K0K04Nm44J48L81k80J03k43r3K98O7o5j42J33K11l27K91j77k57L18
4400I5J19q4R4k20J47k48K27l6l08M25j92j28n7M88k48j69k56M04J16o4q7j58
4422a40K8J87j43l0K5m9J78j80P5K74j30j01p9J05M3j04K3K30k71k0K61n6k11
$$ plain form
4263 -124 123 -83 164 178 39 -63 -99 114 -90 235 -107 175 82 21 89 -40 100 -120 -119 16 89 180 -21
4286 -21 36 202 -13 140 223 174 166 -22 -360 -134 -161 170 13 42 279 -96 136 -75 -17 -123 -50 -244 -294 126
4310 126 189 143 110 183 -61 -20 -43 14 148 44 -145 159 -33 106 -32 41 128 1 -115 108 148 39 44 98
4334 98 49 26 -151 181 189 198 -238 378 95 -215 -89 269 37 -230 250 116 27 294 63 109 -78 -118 252
4357 252 -97 -74 157 271 56 -85 45 -227 -24 163 11 131 169 -21 80 -13 189 -96 -244 -230 281
4378 281 -56 -36 168 173 -271 -123 258 -22 81 -162 -255 43 110 45 -97 36 247 -80 211 34 -223 95
4400 95 214 130 224 4 151 -97 130 94 -214 211 19 -109 -166 322 74 -95 -351 53 169 105 18 -140
4422 -140 -112 75 -68 -98 -73 -122 56 -124 -49 225 95 -6 -85 20 63 -41 -18 212 -59 -79 182 126 -85
4445h5NL15j36O8p1k16J96J6q0J22k77M5m0K25l20J69J01k14l7k6M39j58K36n58
4469b81L97j54N0j50J12k85O7K96K0J15k27L23l16lK04N0j02k29K94j65K47l62
4491i9L46m88J23L43l60J70L00n88J44R0J92N0p6j50k72K42L1j73L16K38l43m9
4513a3l13N23j01j98o3J37K23j27l9ok7lK6K7J60j62O2r1J8J00j04L48m23k72
4537c18M73J0q1l01J04K32j19l3p5R2j04K22l51J10r8J87j5P3Q5n4k35L7K76j42
4561b5J05Q7j94K71j42j80J98k00J20l73K17K4K12n3N8k62K79k36k06K3L48r9
4583b8J19j21j52L75j11P6j66j02L50m96K10J0N8j85K66m82O67l00j16L07k38
4604e9K39k44N0j15J29J07l39K72JR5j3k53J72MP6k06J46j64K22j89q7K34k15
$$ plain form
4445 -85 -80 235 99 167 96 -120 76 92 12 134 -143 -98 -138 87 -233 -64 37 -177 -214 -240 199 41 277 -281
4469 -281 116 -38 12 -138 -26 -311 -244 52 72 187 -40 283 -33 -36 168 218 116 -113 181 16 263 -99
4491 -99 247 -241 -118 225 -135 35 335 -253 -109 -19 173 223 147 -3 -275 -33 -2 -175 141 379 36 -13
4513 -13 -326 197 96 -102 -165 -28 195 68 29 23 -4 -7 19 46 206 44 106 15 33 133 29 377 -46 -318
4537 -318 155 165 84 -217 -113 119 0 -33 -108 -16 -120 102 -249 -139 -237 -50 -65 8 93 39 -196 -159 117 -25
4561 -25 80 167 -27 244 102 -78 120 -80 40 -333 -116 -92 120 67 125 -137 142 -94 -300 -277 71 -28
4583 -28 91 -30 -182 193 82 158 -8 -110 240 -256 -46 -36 22 -163 103 -379 288 -12 -128 179 -59
4604 -59 180 -64 -14 -129 0 107 -232 40 41 136 123 -130 42 46 122 -84 62 -102 120 -69 -156 78 -137
4627a37J1J2K04L9n7j33J00j06Pp5P7Q3o0P0Q6p8k5m3J41r4o9J53k69P0L03j27
4653H3k56n4j36L55j74M7L00j07n1r7J73j18k0K34m04K39J3k84K66p5Q6n9j41
4676a80L11k70M4J35j24q6K32O1r7k14K62j35MP6j53K21J44n1k87P9K8j58j49
4699c07K69J5J91l59L95l32j3K48j91j58L69O0l44K99j82K11k14P1K61j42l03
4720a56L15l63K6J39K46l95J45k9j6m0K0P0J25m6J16j28l35N30m39J75J70l75
4742b45J73J15j27NK48j64J91k00K3Jj74K47J1o9l04K39J38k0Q8k50K80k24k3
4765d1K36l40P3L9K2j53J17j62J85P8J9j89J75j15j45K60j07J72l18J17K57m34
4787b54L87k22L69j20j81j62M75l19l21N03l24n5L85l9R6k29k13J84j3PJ38j39
$$ plain form
4627 -137 -126 -114 90 129 72 -61 39 -67 -60 -135 -58 25 -35 35 121 43 18 -25 116 22 -47 106 -163 -93 210 83
4653 83 -173 -227 -363 -8 -182 -135 165 58 7 -90 83 -35 -55 179 -225 14 27 -257 9 -66 20 -39 -180
4676 -180 131 -139 -95 40 -84 -170 62 123 26 -188 74 -61 -57 19 -134 87 231 180 -107 -28 0 -158 -307
4699 -307 -38 -23 168 -191 204 -128 -141 107 -84 -242 127 187 -157 142 -40 171 -43 28 289 147 -156
4720 -156 159 -204 -178 -39 207 -188 -43 -72 -88 -128 -108 -38 87 41 157 29 -306 224 -215 -40 130 -245
4742 -245 -72 43 -84 -79 169 5 196 -4 19 20 -154 93 104 35 -269 -30 108 88 176 -74 206 -18 -41
4765 -41 195 -145 -72 -33 -11 -164 -47 -209 -24 54 73 -116 59 -56 -201 59 -48 124 -194 -77 180 -254
4787 -254 133 -89 280 160 -21 -183 292 -27 -348 155 -169 -224 161 122 218 -11 -224 -40 -53 -46 92 -47
4809d7O9j0J20k63K33No0l28K21K18j30k76J60O8LK9K36n73K97J27j21J6r1j39
4833b36K17K03j34l5K6n3N5l86N39j39q9J05K32m19Q7K9j42J87J55L0m46J63M19
4856C68m53J70q3O1q8o6J26j4J16R1n2q4L0j1k30j5L31q7k79m4K40j83K06r8j
4881d9K86k05j05Q9j50P4Q8k87L37k01J19J84k18j24lR3j40J80R2j56n9K74j65
4904d6j7J5j43K14j02N1K02k04j22K34J0k99K55o2K31l27K48n1j8j34J46j43l4
4927i6K84l32O5j25J95K7k3J44p5o8j83M43k21M2j73L1N8j15L38k84J69N6j7M4
4951A84j58k64M89l30J81j49O2J13k06J05k55K44j13O8J89k84K62K5K7j86Q4P7
4973A65p2k01J38pj07J60L0Jj75K96j88k39K73r0p3M8K31l40o7L92N4k91J63N2
$$ plain form
4809 -47 22 12 132 -131 102 107 47 -281 -60 158 28 -248 -88 -20 -17 12 248 -325 -28 99 -22 -6 -97 -236
4833 -236 -19 184 50 15 41 -12 43 -343 196 57 -32 73 305 -114 -27 2 -140 47 202 232 -214 -51 368
4856 368 -85 85 2 63 -25 -91 35 21 137 228 176 92 122 111 -119 -134 197 110 -169 -213 27 -156 50 -48 -49
4881 -49 237 32 -73 16 -134 -60 28 -259 78 -123 -4 180 -38 -162 -165 -72 -212 -32 60 -96 -155 119 -46
4904 -46 -63 -48 -191 23 -79 -28 174 -30 -152 82 92 -207 48 -14 217 -110 138 87 69 -65 81 -62 -96
4927 -96 188 -144 -79 -204 -9 18 -5 139 64 -4 -187 256 35 77 -96 -65 -7 -122 216 -68 101 157 140 184
4951 184 26 -238 251 -79 102 -47 15 128 -78 27 -228 16 -97 -29 160 -124 138 163 190 4 88 165
4973 165 93 -108 30 23 -84 76 106 107 -68 228 40 -199 74 -16 -89 -41 190 -150 -217 175 229 -62 101 153
4997A53k10l8L79k12P3k57J53j47J33Kk75L13K5k6k56J91r6P3K02j95M9J09k32
5020h9Q5p4j00J44R6k7J22j68n0K2K15k6j21j04j91K71p9J01k8J8m0r6J32n2K50
5045B11k47n9O2k60K42j11K34o4j79n7J1J17q2M4K34k13J62l31KJ78J11k5k49
5068b69M02j02k27J69O4P7j74O6O3J14J14m22L28k33r0J13j39L58l63l5R8R9k56
5091b45K17j0j44K25J35r8o9K86l60J51l05J11K22p0J10k0k65P6J35J03k27j1
5113e3K43k65J78m7j27R5J57j76JJ9l15J60L80j28k36K0J78k5k19J67Kn7O5r7
5137h0L64k96j5j57N1M7P7k08K86q8J2j96J83l8J24m7r1j11L53K6l1mOj60m0M3
5163A0L3k4J79q4k53K32r7Q0j00N1J38j69J99j83j25O9K41R8k7m59J47O2J7J24
$$ plain form
4997 153 -57 -95 284 72 145 -112 41 -106 27 29 -246 67 92 66 -190 1 -95 -22 180 -15 34 143 -89
5020 -89 -4 -78 -178 -34 62 35 157 -11 -61 -39 176 150 29 -75 -266 5 -74 27 -1 17 -23 -119 13 -39 211
5045 211 -36 -95 -33 -293 -51 -162 72 8 -171 -228 -217 -100 -182 -138 96 -117 45 -286 -284 -106 5 -20 -269
5068 -269 133 31 -196 -27 37 114 -60 6 69 183 297 -125 203 -30 -120 -7 -146 212 -151 -186 -88 11 -245
5091 -245 -28 -38 -182 43 178 80 11 297 -63 88 -217 -106 116 46 156 136 -129 -53 82 185 -42 -53
5113 -53 190 -75 103 56 -71 24 181 5 6 25 -290 -130 250 122 -114 -94 84 59 -160 7 9 -48 17 -80
5137 -80 284 -12 -27 -184 -133 -86 -9 -217 69 -19 -7 -203 -20 -58 66 19 -72 -183 170 196 165 161 167 7 -33 10
5163 10 43 19 198 114 -139 93 -4 76 -24 27 165 -4 195 12 -113 -44 197 295 268 -191 -44 18 35 159
5187A59k78MK18p2qL82j94n72M61J4k28J10J38l7m5J82j82j3J7P1j24J99l90K00
5211A2k93J32J69l25M38j73k92N61k84O1L54l18M6n9j26m5J44jj74J11q8j8J31
5234c7qM6J23p6j10J78j10n5J21j12k7j72K63k26K29O7j64k45K80J57j83K97l34
5257i8Kj42J95Q1j14q3o9K82j10j90j22M26k4j08l0K15J32j73n2k61K06J68O8
5280A99m79K77K7M4R3l13J33J09K11pk57ORl2Q1J83l23j29K79j03n2j61K92J5
5304A02P9m00N9J64j20k25K14R4J5J83k72r0J67L07l24K4R4J6j00N7K4n8mkJ14
5329A18k21k11L29J64k6Rk08R9k03K02L54l32P9j68K25n2j82n1M9L9J16r5k30
5352a96K82%j27q3J35l26M98j13k25M2K47j67l9J86l70N08k53m4K6L65l87J18
$$ plain form
5187 159 -119 -115 103 31 23 405 211 -361 100 114 -114 -4 134 97 52 234 52 39 56 127 3 202 -188 12
5211 12 -281 -149 20 -305 133 -40 -332 229 -55 6 360 42 88 29 -97 -142 2 1 -173 -62 -150 -168 -37
5234 -37 -45 1 124 48 -62 116 6 -49 72 -40 -67 -239 24 -202 27 94 -70 -315 -35 122 -61 236 -98
5257 -98 -96 -238 -43 38 -76 -159 -228 54 -56 -246 -368 58 34 -74 -104 111 243 70 18 -243 -37 131 199
5280 199 -280 -3 24 68 161 -152 -19 90 301 294 37 43 52 20 101 284 -39 -168 111 8 -44 -205 87 102
5304 102 181 -219 -160 4 -116 -341 -127 -33 -18 165 -107 -197 -30 277 -47 -23 71 87 -13 44 68 10 6 4 118
5329 118 -103 -314 15 179 153 162 -46 53 -150 52 406 74 153 -15 210 158 -24 -75 -26 13 129 34 -196
5352 -196 86 86 -41 -124 11 -315 183 70 -155 -113 134 -33 -72 114 -256 252 -1 -45 -19 346 -41 77
5374G7j18K02r6k4k8R2j30p9P2M5P9l51J91j81L65k00J90J23k10k8J60k87J82
5397D6K05m89J68J36p1J45jL6o5J0j20j20L7L6J49k8k27K90r6n8J51k53K79j84
5421b4j8K42l44l5K17k26J17l8J63k91pQ6L12j97m1L70l86K70K8L4m19K47M8O0
5445A68k3P9l39K79j08J14l02P0J74J1K20k22k5j36K93k48j49N5P0k12J52K53
5467A74l58j6K26N1k2j16L64j95L7k68M9lO2K26k42K60l98N7J24J27n1m1m8J18
5491A17l49N64k89j87M44j13q4Opk14L7J80j70R2k7M4k53K13p0k70M37k55K32
5514G8K50l24o9K10p0k39K00o4J44j23J4l0K98l16K50l35L7J0Q3j13J34O6q3p7
5538f9j36K10j07O0N7J46k77J2L09m20L87j3l46K99k20RK45j94L37m94M84k43
$$ plain form
5374 77 -41 161 65 41 13 105 -25 -104 -32 13 92 -259 -68 -249 116 -84 106 229 19 -9 151 -136 46
5397 46 251 -238 -70 66 -5 140 139 175 110 120 0 -120 -83 -47 102 74 -153 137 41 -17 134 -119 160 -24
5421 -24 -42 200 -144 -179 38 -188 -71 -109 54 -237 -244 -158 154 -43 -84 286 -100 170 198 232 -187 60 108 168
5445 168 145 224 -115 164 56 170 -132 -62 112 123 343 121 96 -40 253 5 -144 -89 -19 -231 -79 174
5467 174 -184 -200 26 77 55 -61 303 108 145 -123 -74 -77 -15 211 -31 229 -169 -112 12 139 88 47 -1 117
5491 117 -232 332 43 -144 300 187 103 109 102 -112 -75 105 -65 27 0 44 -209 4 -66 -336 101 -154 78
5514 78 328 4 -65 145 75 -164 36 -28 116 -7 7 -23 275 -41 209 -126 -89 -79 4 -109 25 91 8 -69
5538 -69 -205 5 -102 -42 15 161 -116 -104 205 -215 172 159 -187 112 -108 -99 146 -48 289 -205 279 36
5560C6j20K24l21L27r7j16L0r6J27m5J7L29k85J44o4J23j1k46L5K00k68K9L69
5583C21k44j18L82k91M8Kl68K46r3L39k58J35k26k3L07l95J22K8L88m24M8L81
5605C07l05J45j72JK09j3k09p4K69j03l97L76k09L04j03L09n21L22l75M50n5j13
5627D3k9P7r6K57j04l90L91m4l8N8j07j83K01J77k42j32J0rN8K39m7j14j28J44
5651hK75k06n2N4J19j35k09K80J47m6j23k96O1Q1M8J69O7j0l42J16J32k96K47
5674G3k63K61j09j91R0K38K0j32j45J71k63K86j2J37j07K4j29KJ64j18O1j56J82
5697H4j12o9J17k77J96K58j09k53K8J79r2j12M0J74K19n10M20r7K02j24j39J03
5719A26r7k32O8J05j44L14j11j20l5J65j05J31k63K75j84Q8Q9k56J56K92m44M4
$$ plain form
5560 36 -84 140 -181 146 49 -67 -37 -133 -6 -51 -34 295 10 154 90 213 202 -44 -9 191 -77 -48 321
5583 321 77 -41 341 50 98 100 -268 -22 -115 224 -34 101 -125 -148 159 -236 -114 -86 302 -122 -74 307
5605 307 2 147 -25 -24 185 172 -37 -111 158 55 -342 34 -175 129 26 335 -186 136 -239 211 156 43
5627 43 14 91 -5 252 148 -242 149 105 67 125 18 -165 36 213 -29 -161 -151 -160 -102 137 90 -24 -152 -8
5651 -8 267 61 9 63 182 47 -162 118 265 219 96 -200 -139 -58 -10 159 226 216 -126 -10 122 -174 73
5674 73 -190 71 -38 -229 -139 99 119 -13 -158 13 -250 36 24 161 54 78 -51 -49 115 -3 58 -98 84
5697 84 -28 -97 20 -257 -61 197 88 -165 -137 42 -50 -162 -122 52 271 -239 181 84 286 162 23 126
5719 126 29 -203 -135 -30 -174 140 29 -91 -126 39 -66 65 -198 77 -107 -19 70 -186 -30 262 -182 -138
5741a38K90N3k69K94k15P8p3k20R3K54j09n8j19p7L13k09J60j76k4K14p6Km0l1
5765h3J09rm6j32J98k02K53Q2k77M1L0J53j67J41k09Q6K30j31L0n2k84J38Q9m8
5789f0K14k66K4k7K15j28J9n2K5J98j90J22j21L34l58k02K72j3N7j68R1O9j23
5812f8k13K90J73k32N4M0J72j84m2M6J07l83J81KR0l46M19j58L4J83k94Q9J98
5835A58j65j08K49l23M8Rq0K13J19j33J37l79N9J76J5k6K3K76o2k98K33k43J18
5858A6N5k16L01q1J6j68P4K39n34J20J5Q5J31J42q1p9j47L10m01J15K28j29J89
5881B00L7j84q4L9P4j10M5j76O4M31l80j29K39j20K39j53J55j24j75J4J62J56
5903B20m6r7Q6j89J51P2k35R0j20J43j92J7L1J33j26J97k84N9J97k32K86l50J03
$$ plain form
5741 -138 152 205 -64 230 15 93 20 -200 -107 147 38 -20 -139 -216 97 -112 48 -128 -152 62 -14 -12 -52 -83
5765 -83 26 17 -29 -161 37 -165 88 170 -107 -66 -36 117 -50 91 -118 -32 198 67 97 45 -239 -101 -12 -60
5789 -60 154 -112 -88 -115 100 -28 -9 -61 -36 162 -28 94 -27 307 -51 -253 19 6 63 -105 -14 55 -68
5812 -68 -281 9 182 -50 4 44 216 32 -10 36 143 -240 -59 -57 33 -313 106 -52 -18 165 -129 -40 158
5835 158 -7 -115 134 -189 -141 -132 -212 1 120 -13 124 -255 -196 -20 -5 -31 -8 268 206 -92 141 -102 16
5858 16 71 -145 156 75 91 -77 -3 236 -298 -178 -163 -78 53 195 114 35 -112 198 -203 -88 140 11 200
5881 200 237 53 -31 8 82 -28 17 -159 -95 336 -44 -173 66 -54 185 32 187 63 -112 -98 64 220
5903 220 174 77 163 -26 125 197 -38 52 -68 75 -117 -100 -69 64 -62 135 -149 -90 107 -125 161 -189 -86
5926h6Q9p8K20j31k44K87j0j16J11J88k02r3P3J75Q4l71J67l3K49l14K37k51n4
5949a03K39j15kJ02j03k16J43O5J12q4o6J67k83K92k3k88J67j01M07l90J38k76
5971b18J65M9J23m44L49K30k02o7K31m18J12Q0J56j25K9k17J00J49m49L13r0J82
5993C8K12k25j18N5K27ql21M56l76o2J49L37m74N7J36k0m9Q9j70k36J82J62j4
6016B7k82K90j23J06J36l29K15k42o4K06L71l03k60K03J71j57N3Q4N6j38J12j24
6038HK07l58J65k27l2J32K05q1j87K66o5J16j95K17k03J1J85l25J61R6r8J93j99
6061hp6J09j26l8J36q8p7R1j6Pjj00J56L5j12K4J53j84J48j42K27J14j44k1j77
6086a10j05P7R3j2J51k60r3L08O5J19J6k52L2j01J27k89Q6J53Rk28K13j53M19
$$ plain form
5926 -86 3 -75 145 14 -230 57 47 -69 42 230 28 -65 8 183 267 -104 63 30 279 -35 202 -49 -103
5949 -103 136 21 19 121 18 -198 -55 10 122 38 -28 139 -144 148 125 -163 4 -97 310 -80 58 -218
5971 -218 -53 -4 119 -325 24 254 52 -15 216 -202 -90 -10 146 21 50 -167 -67 82 -367 -54 -144 38
5993 38 250 25 -93 -38 189 181 -140 316 -60 -122 27 364 -110 -53 83 63 14 103 -67 -303 -121 41 27
6016 27 -255 35 -88 18 154 -175 40 -202 -266 -60 311 8 -252 -49 122 -35 18 102 158 20 132 8
6038 8 215 -143 22 -205 -237 -105 100 19 -168 98 33 149 -46 171 -32 -21 164 -161 0 96 -2 191 -8
6061 -8 -84 25 -101 -139 -3 -91 -168 -77 -93 -86 -87 -187 -31 4 -108 -84 69 -115 33 -109 118 232 88 67 -110
6086 -110 -215 -138 -45 -57 94 -166 -259 49 114 233 249 -3 29 -72 55 -234 -148 5 14 -214 -1 -154 265
6109B65k62j56M3l4j59N4L98k03K11m6q1J5l72P0L10j98K5J6J63J05j80P2J0j30
6133f4l8L9j34Q7Q5J24j38Q2j40J93r1o6J38J19j53j94L56K76m29l9J20k41m1
6156a49M0O7J4N2j29K69k72J62j86o7K67q0j44N4J26O4j38K54l04K85j78o1q9
6179a43%J36J3j08L5K18l53Q8L5K72k21N8j02N4j04J17K12k63K19k94N2O0K23
6202B04o7j56N2J03k13q7J10j73J50P6J21l61M85n7q6j59r6P7o8J58p4p2L00j84
6226a7J4L56l83P8R0j07k4k94L24P2l08L59m2j71K0K31j02J20j49p8J20j03J1
6249A7j8K0J27m5j48R4P7l00o5L21k1j44J52j9J55l68M65j46r1j3n8J55n52K51
6273a54L15j01J30j14j41K08q9q2p9R7l0J07l16M60l11k3K27j30k2l5R2l29M30
$$ plain form
6109 265 3 -153 -110 -144 -303 -249 149 -54 157 111 30 45 -327 -257 53 -145 -120 -104 59 164 -16 56 66 -64
6133 -64 -102 -63 -197 -110 -25 99 -39 43 -97 96 5 -61 77 196 43 -151 205 481 52 13 133 -108 -149
6156 -149 -109 -42 -28 24 -105 164 -108 54 -132 -199 68 -12 -156 -102 24 88 -50 204 -100 185 7 -54 -143
6179 -143 -143 -7 6 -102 -67 151 -202 -114 -79 193 -28 30 -72 -18 -122 -5 207 -56 163 -131 -79 -19 204
6202 204 137 -19 33 136 -77 -164 -54 -227 -77 -1 120 -241 244 187 101 -58 -154 -77 -145 13 -61 -133 167 -17
6226 -17 -3 353 -30 48 138 31 7 -287 37 109 -199 160 118 -53 -33 198 96 216 67 -11 109 6 17
6249 17 -1 19 146 101 -47 47 124 -176 -241 80 59 -85 67 48 203 -165 300 154 63 50 -8 147 -405 -154
6273 -154 161 60 190 76 -65 143 54 -28 -107 -10 -40 67 -249 211 -100 -123 104 -26 -48 -83 9 -320 110
6296A10pj94j6R7J45Nl15M2R4n4M1p9K21P4k07nr5N6qN5n8J47k0K51j73l50K77
6323C4k59K60K8j29J69l92Q0K67k03J5J7O9K0j01K09N9j77kJ15J57k61K04k91
6346a12J25k93M72j79j60Q8o3j1J34j18Lj45J98m9j34K33j67J12K25m3p6K14k38
6369A6q0R3l37K45J07m9J28k32j1L80m53K90j92K91j74j14N1j02K43j3p4L2N9
6392A04k28J05L74k39p2q5r7L53j27p3l01L39L5j3j64J03J57j83O4j31M1J1Ln0
6416g4l9n2L06k04p7L89o35L11kL09k56n2J09q7J81k09l3j36J70L56k07r8M5J06
6440A21k24p3J34L63l51NK43M1k89J48p8j75P8O9l3R0J63k53N2O6j95K32n7j72
6464i5J29Nn7m9J00L3kMj14j6Q5J00J03k66J16j22M6l77L37j40J47K89p3r3k13
$$ plain form
6296 110 103 -91 -107 -10 135 140 -175 -133 -39 -93 -52 -131 90 164 -43 -48 -143 -87 -95 -40 -98 49 29 280 107 -243 34
6323 34 -225 35 63 -66 103 -289 -209 58 -145 -130 -113 -44 -24 -125 84 143 -34 -36 79 236 -25 179 -112
6346 -112 13 -280 192 13 -147 -59 -122 -133 1 -117 -114 -259 -61 -110 -244 -11 -178 -66 159 116 40 254 16
6369 16 -64 29 -308 -63 44 -5 123 -109 -120 260 -193 97 -95 196 22 -92 -41 -143 100 87 13 45 104
6392 104 -124 -19 355 116 44 -41 -138 215 88 15 -286 53 88 75 -89 14 171 -12 52 -79 -38 -27 -24 -74
6416 -74 -113 -165 141 -63 -140 249 -386 -75 -77 232 -24 -76 33 -54 127 -82 -115 -251 -81 275 68 -30 15 121
6440 121 -103 -176 -42 321 -30 -25 218 259 -30 118 40 -135 -57 12 -21 69 232 -21 31 97 -98 134 77 -95
6464 -95 34 39 -18 -67 33 66 64 68 -46 -62 23 123 226 -40 76 -46 0 -377 -40 -180 -33 256 183 90 -123
6489a23J3J30J44K9l6j35M2j77J81ll37N11k34p1J03j37J26o4J88l47M77k54k9
6512cP8p6J16l7L1l28M72l28R9m1R7j23K42l57K87m1O7k78o2L8L94n36M85j8j64
6537A4K58m66K02j1m3M4r9J15P3n4k12L14j58l14L69m1K23m5j16j59k0L25m38
6560b39O8K03j46J5K83k29j02K17J9m22L65m1p9L30k26k4k7M6l5J03j93J32K4
6583D2m4J98l22J74k57J07j29L17n8J01k69K75j33J21l19k50K79J99j57R9R6k63
$$ plain form
6489 -123 -110 20 164 193 157 22 64 -113 68 65 -272 239 5 -66 37 -100 26 -38 150 -197 280 26 -3
6512 -3 75 -1 115 78 109 -219 253 -75 24 -17 80 -43 199 -158 129 88 155 -123 -185 -147 247 -289 196 178 14
6537 14 272 -194 8 -3 -46 -2 -101 14 87 33 -179 135 -23 -337 32 -9 214 169 53 -106 -126 199 -239
6560 -239 -171 32 -114 -99 184 -45 -147 70 89 -333 32 -9 -88 242 16 -8 -35 11 -24 79 -114 18 42
6583 42 -2 196 -126 48 -209 -102 -231 86 28 129 -140 135 2 123 -196 -446 -167 32 -125 -26 70 -193
$$ [...]
8191a34
##END NTUPLES=NMR FID
##END=
