##TITLE=1H_DE-98
 200.13MHz,CDCl3,
 8 sc
 
 26.6.2025
##JCAMPDX= 6.0         $$ Bruker NMR JCAMP-DX V2.0
##DATA TYPE= NMR FID
##DATA CLASS= NTUPLES
##ORIGIN= UXNMR, Bruker Analytische Messtechnik GmbH
##OWNER= pz
$$ XWIN-NMR		Version 3.5
$$ Thu Jun 26 13:50:24 2025 Russian Standard Time (UT+4h)  she@DPX200
##.OBSERVE FREQUENCY= 200.1313
##.OBSERVE NUCLEUS= ^1H
##.DELAY= (6, 6)
##.ACQUISITION MODE= SIMULTANEOUS
##.ACQUISITION SCHEME= undefined
##.AVERAGES= 8
##.DIGITISER RES= 18
##SPECTROMETER/DATA SYSTEM= spect
##.PULSE SEQUENCE= zg30
##.SOLVENT NAME= CDCl3
##.SHIFT REFERENCE= (INTERNAL, CDCl3, 0, 14.3821)
##AUDIT TRAIL= $$ (NUMBER, WHEN, WHO, WHERE, WHAT)
$$ ##TITLE= Audit trail, XWIN-NMR		Version 3.5
$$ ##JCAMPDX= 5.01
$$ ##ORIGIN= Bruker BioSpin GmbH
$$ ##OWNER= she
$$ F:/spectra/data/she/nmr/H-C/1/audita.txt
$$ ##AUDIT TRAIL=  $$ (NUMBER, WHEN, WHO, WHERE, WHAT)
(   1,<2025-06-26 13:49:18.54 +0400>,<she>,<DPX200>,
      <created by zg, POWCHK disabled, PULCHK disabled
       configuration hash MD5:
       00 E9 B6 7A A2 85 ED C7 34 08 36 98 17 FE 4E 26
       data hash MD5: 16K
       64 2B 85 ED 75 24 FC 05 08 6D 62 80 C0 03 7D 52>)
$$ ##END=
$$ 
$$ hash MD5
$$ 8D F9 84 51 28 0D 56 D3 C2 F3 69 BA 51 86 B8 40
##$RELAX= 
##$RELAX= 
##$RELAX= 
##$RELAX= 
##$RELAX= 
##$RELAX= 
$$ Bruker specific parameters
$$ --------------------------
##$DU= <F:/spectra>
##$EXPNO= 1
##$NAME= <H-C>
##$PROCNO= 1
##$TYPE= <nmr>
##$USER= <she>
##$AMP= (0..31)
100 100 100 100 100 100 100 100 100 100 100 100 100 100 100 100 100 100 
100 100 100 100 100 100 100 100 100 100 100 100 100 100 
##$AQSEQ= 0
##$AQ_mod= 1
##$AUNM= <au_zg>
##$AUTOPOS= <>
##$BF1= 200.13
##$BF2= 200.13
##$BF3= 200.13
##$BF4= 200.13
##$BF5= 200.13
##$BF6= 200.13
##$BF7= 200.13
##$BF8= 200.13
##$BYTORDA= 1
##$CFDGTYP= 0
##$CFRGTYP= 5
##$CHEMSTR= <none>
##$CNST= (0..31)
1 1 145 1 1 1 1 1 1 1 1 1 1 1 1 1 1 1 1 1 1 1 1 1 1 1 1 1 1 1 1 1 
##$CPDPRG= <>
##$CPDPRG1= <>
##$CPDPRG2= <>
##$CPDPRG3= <>
##$CPDPRG4= <mlev>
##$CPDPRG5= <mlev>
##$CPDPRG6= <mlev>
##$CPDPRG7= <mlev>
##$CPDPRG8= <mlev>
##$CPDPRGB= <>
##$CPDPRGT= <>
##$D= (0..31)
0 0.7 0 0 0 0 0 0 0 0 0 0.03 0 0 0 0 0 0 0 0 0 0 0 0 0 0 0 0 0 0 0 0 
##$DATE= 1750931358
##$DBL= (0..7)
120 120 120 120 120 120 120 120 
##$DBP= (0..7)
150 150 150 150 150 150 150 150 
##$DBP07= 0
##$DBPNAM0= <>
##$DBPNAM1= <>
##$DBPNAM2= <>
##$DBPNAM3= <>
##$DBPNAM4= <>
##$DBPNAM5= <>
##$DBPNAM6= <>
##$DBPNAM7= <>
##$DBPOAL= (0..7)
0.5 0.5 0.5 0.5 0.5 0.5 0.5 0.5 
##$DBPOFFS= (0..7)
0 0 0 0 0 0 0 0 
##$DE= 6
##$DECBNUC= <off>
##$DECIM= 32
##$DECNUC= <off>
##$DECSTAT= 4
##$DIGMOD= 1
##$DIGTYP= 9
##$DL= (0..7)
0 120 120 120 120 120 120 120 
##$DP= (0..7)
150 150 150 150 150 150 150 150 
##$DP07= 0
##$DPNAME0= <>
##$DPNAME1= <>
##$DPNAME2= <>
##$DPNAME3= <>
##$DPNAME4= <>
##$DPNAME5= <>
##$DPNAME6= <>
##$DPNAME7= <>
##$DPOAL= (0..7)
0.5 0.5 0.5 0.5 0.5 0.5 0.5 0.5 
##$DPOFFS= (0..7)
0 0 0 0 0 0 0 0 
##$DQDMODE= 0
##$DR= 18
##$DS= 0
##$DSLIST= <SSSSSSSSSSSSSSS>
$$ [...]
##$SUBNAM0= <"">
##$SUBNAM1= <"">
##$SUBNAM2= <"">
##$SUBNAM3= <"">
##$SUBNAM4= <"">
##$SUBNAM5= <"">
##$SUBNAM6= <"">
##$SUBNAM7= <"">
##$SUBNAM8= <"">
##$SUBNAM9= <"">
##$SW= 18.0517328524113
##$SWIBOX= (0..15)
0 0 2 0 0 0 0 0 0 0 0 0 0 0 0 0 
##$SW_h= 3612.71676300578
##$TD= 16384
##$TD0= 1
##$TE= 0
##$TE2= 300
##$TE3= 300
##$TEG= 300
##$TL= (0..7)
0 120 120 120 120 120 120 120 
##$TP= (0..7)
150 150 150 150 150 150 150 150 
##$TP07= 0
##$TPNAME0= <>
##$TPNAME1= <>
##$TPNAME2= <>
##$TPNAME3= <>
##$TPNAME4= <>
##$TPNAME5= <>
##$TPNAME6= <>
##$TPNAME7= <>
##$TPOAL= (0..7)
0.5 0.5 0.5 0.5 0.5 0.5 0.5 0.5 
##$TPOFFS= (0..7)
0 0 0 0 0 0 0 0 
##$TUNHIN= 0
##$TUNHOUT= 0
##$TUNXOUT= 0
##$USERA1= <user>
##$USERA2= <user>
##$USERA3= <user>
##$USERA4= <user>
##$USERA5= <user>
##$V9= 5
##$VALIST= <valist>
##$VCLIST= <CCCCCCCCCCCCCCC>
##$VD= 0
##$VDLIST= <DDDDDDDDDDDDDDD>
##$VPLIST= <PPPPPPPPPPPPPPP>
##$VTLIST= <TTTTTTTTTTTTTTT>
##$WBST= 1024
##$WBSW= 4
##$XGAIN= (0..3)
0 0 0 0 
##$XL= 0
##$YL= 0
##$YMAX_a= 210437
##$YMIN_a= -244639
##$ZGOPTNS= <>
##$ZL1= 120
##$ZL2= 120
##$ZL3= 120
##$ZL4= 120
##$ABSF1= 10
##$ABSF2= 0
##$ABSG= 5
##$ABSL= 3
##$ALPHA= 0
##$AQORDER= 0
##$ASSFAC= 0
##$ASSFACI= 0
##$ASSFACX= 0
##$ASSWID= 0
##$AUNMP= <proc_1d>
##$AZFE= 0.1
##$AZFW= 0.1
##$BCFW= 1
##$BC_mod= 2
##$BYTORDP= 1
##$COROFFS= 0
##$CY= -3
##$DATMOD= 1
##$DC= 2
##$DFILT= <>
##$DTYPP= 0
##$F1P= 0
##$F2P= 0
##$FCOR= 0.5
##$FTSIZE= 0
##$FT_mod= 4
##$GAMMA= 1
##$GB= 0.15
##$INTBC= 1
##$INTSCL= 1
##$ISEN= 128
##$LB= 0.25
##$LEV0= 0
##$LPBIN= 0
##$MAXI= 10000
##$MC2= 0
##$MEAN= 0
##$ME_mod= 0
##$MI= 1.114404
##$NCOEF= 0
##$NC_proc= 0
##$NLEV= 6
##$NOISF1= 3.799351
##$NOISF2= 2.8
##$NSP= 1
##$NTH_PI= 0
##$NZP= 0
##$OFFSET= 14.38212
##$PC= 1
##$PHC0= -1197.631
##$PHC1= 8.192197
##$PH_mod= 1
##$PKNL= yes
##$PPARMOD= 0
##$PSCAL= 0
##$PSIGN= 0
##$REVERSE= no
##$SF= 200.129724274929
##$SI= 16384
##$SIGF1= 3
##$SIGF2= 2
##$SINO= 400
##$SIOLD= 16384
##$SREGLST= <1H.CDCl3>
##$SSB= 0
##$STSI= 0
##$STSR= 0
##$SW_p= 3205.1282051282
##$SYMM= 0
##$S_DEV= 0
##$TDeff= 0
##$TDoff= 0
##$TI= <>
##$TILT= no
##$TM1= 0
##$TM2= 0
##$TOPLEV= 0
##$USERP1= <user>
##$USERP2= <user>
##$USERP3= <user>
##$USERP4= <user>
##$USERP5= <user>
##$WDW= 1
##$XDIM= 8192
##$YMAX_p= 0
##$YMIN_p= 0
$$ End of Bruker specific parameters
$$ ---------------------------------
##NTUPLES= NMR FID
##VAR_NAME=  TIME,          FID/REAL,        FID/IMAG
##SYMBOL=    X,             R,               I
##VAR_TYPE=  INDEPENDENT,   DEPENDENT,       DEPENDENT
##VAR_FORM=  AFFN,          ASDF,            ASDF
##VAR_DIM=   8192,          8192,            8192
##UNITS=     SECONDS,       ARBITRARY UNITS, ARBITRARY UNITS
##FACTOR=    0.0002768,     1,               1
##FIRST=     0,             0,               0
##LAST=      2.2672688,     0,               0
##MIN=       0,             -244639,         0
##MAX=       2.2672688,     210437,          0
$$ Real data points
##PAGE= N=1
##DATA TABLE= (X++(R..R)), XYDATA
0 0 0 0 0 0 0 0 0 0 0 0 0 0 0 0 0 -8 8 -8 8 -8 16 -16 16 -24 24 -32 32 -40 47 -49 56 -64 73 -87 96 -107 120
37 120 -136 151 -168 187 -207 231 -255 281 -312 344 -377 417 -458 505 -556 614 -679 751 -833
56 -833 924 -1033 1159 -1309 1492 -1719 2010 -2396 2942 -3763 5136 -7861 15347 -82778 -244639
71 -244639 -65392 96752 106047 78222 86896 38935 28438 145838 210437 27422 -163992
82 -163992 -128957 -17257 -15123 -55196 -90496 -148338 -156351 -7035 147515 95528 -37802 -19268
94 -19268 74220 100252 93606 75037 -10440 -84912 -9458 120594 74613 -85959 -129044 -70208
106 -70208 -41456 -17151 16930 -27675 -117810 -81408 71048 114603 16068 -19140 41484 75428
118 75428 92841 122530 74081 -61191 -116860 -28842 26287 -46267 -104723 -86984 -70946 -39496
130 -39496 38111 67871 1305 -38265 40081 120275 88714 27402 2807 -29177 -39575 20598
142 20598 64117 4073 -76774 -62192 -1344 -3701 -35568 -41435 -60726 -70594 -3345 81932 76383
155 76383 8696 -3002 51621 79056 68237 56243 6265 -68423 -72435 -15124 -4201 -62796
167 -62796 -96300 -55882 -4978 26690 56757 41689 -22323 -33304 35534 86034 56785 2061
179 2061 -13451 -5882 5842 34217 28498 -42823 -87614 -45556 13898 13850 -30134 -57029 -52426
192 -52426 -23567 40150 85457 49562 -5199 6327 58284 75006 36846 -14052 -48971 -59934
204 -59934 -25269 17720 -8305 -75420 -86365 -27868 33681 49277 29679 1591 -17400 8748
216 8748 66800 68251 2500 -40116 -17460 28455 45586 23014 -23245 -70346 -68528 -7053 27332
229 27332 -12575 -59007 -53203 -6595 40018 57976 42999 5341 -6343 41615 84966 52420
241 52420 -17750 -58574 -53987 -23546 757 -3368 -40292 -68621 -33364 33202 48111 12587
253 12587 -19764 -18896 12663 49675 60486 25531 -27383 -29046 23269 51129 25162 -20883 -52079
266 -52079 -49563 -19723 6677 -5074 -51358 -64272 -11355 45498 58009 36410 7346 -2114
278 -2114 21256 55857 56714 3279 -49822 -45107 -10809 4797 -5429 -33677 -53683 -36847 10962
291 10962 44972 25724 -20995 -29494 1943 33553 45044 26681 -6423 -16941 9207 44750
303 44750 38217 -11626 -46882 -41126 -17105 2199 -2817 -33394 -53611 -31929 21409 54277 35729
316 35729 4473 507 17558 39969 43959 11483 -32312 -45617 -16356 17503 9449 -24095 -41109
329 -41109 -32395 -1712 28836 24372 -9459 -31206 -12653 27255 40533 19264 -5009 -13335 3606
342 3606 35214 40301 6366 -34257 -43790 -16780 5495 -2498 -25019 -39873 -29243 10673 42632
355 42632 36369 5611 -11682 7250 35728 36415 11705 -21367 -38866 -19708 12452 18074 -8586
368 -8586 -36302 -30453 1520 22535 18677 -4788 -29071 -20189 16293 38882 26388 -5005 -16914
381 -16914 1705 26066 32399 12376 -25395 -41199 -20431 5439 6717 -17429 -37425 -25870
393 -25870 6116 33733 38276 12467 -11225 -2675 22581 33632 14028 -18830 -31897 -18139
405 -18139 5542 18294 1290 -27681 -31666 -7170 18873 19892 -3915 -22745 -17448 6623 31878
418 31878 30949 3573 -14056 -2733 21827 31022 10966 -19779 -35191 -26851 -1899 8871 -10300
431 -10300 -31045 -26535 1137 29673 33210 13889 -4794 -5702 14682 31518 17931 -11899 -27699
444 -27699 -18497 5585 16829 3508 -18754 -30407 -16095 10613 15921 -2942 -20916 -18838 5149
457 5149 28044 29017 12199 -6744 -5882 17603 30490 14731 -14141 -32531 -25520 -4868 4612
470 4612 -5281 -25156 -30411 -5059 25136 30378 14064 -6136 -8284 10233 26572 22965 -766
483 -766 -23897 -18425 5430 17733 8579 -14038 -28454 -18027 3230 13803 1510 -21792 -25595
496 -25595 -2401 22722 30201 16056 -3054 -4867 11874 27074 21284 -7006 -29821 -25210 -6203
509 -6203 6487 265 -19747 -27511 -12086 14688 28801 15031 -8052 -11889 3859 21696 23702
522 23702 3951 -16174 -16153 3160 21308 14857 -10821 -25673 -19535 -86 12143 2531 -18728
535 -18728 -25634 -9625 17138 28291 14643 -2571 -4677 9221 25304 21115 -3346 -24126 -24757
548 -24757 -6027 9859 3349 -15361 -24041 -12851 10377 22356 11510 -6225 -13115 170 19958
561 19958 21215 3332 -13946 -15159 2398 19549 14698 -4463 -21128 -18881 302 10531 1066
574 1066 -15614 -22486 -8643 14775 24029 13913 -2766 -7844 6764 21749 17808 -1057 -20523
587 -20523 -22222 -5969 7226 5160 -9103 -19395 -10470 9542 18196 10129 -5653 -12813 -2147
600 -2147 13934 18929 8451 -9231 -13483 200 12702 11849 -1865 -16452 -16382 -4534 6137 3945
614 3945 -10759 -18865 -7645 10415 21048 17445 3234 -4516 1191 12399 14900 1291 -16368
627 -16368 -18909 -8793 2345 4600 -5373 -15500 -12313 2161 16065 14516 -317 -9397 -4700
640 -4700 7196 16342 11792 -1596 -8935 -3901 9157 12400 -1073 -15664 -18752 -10851 1841 5919
654 5919 -4021 -14480 -12023 4568 20105 18583 6638 -749 -58 9609 15116 5776 -11773 -21593
668 -21593 -13158 3097 7242 -1774 -12215 -15496 -4842 10896 13971 2346 -9836 -7556 8024
681 8024 18169 13718 2008 -8583 -5527 9359 16360 5695 -13516 -23319 -14165 -87 3828
694 3828 -2032 -12755 -13911 2058 18712 19914 6514 -5933 -2439 10086 16395 11203 -5100
707 -5100 -19768 -14525 1476 9020 1095 -12821 -15377 -4706 7460 11527 1786 -12844 -12504 4449
721 4449 18603 17751 3955 -6583 -4020 6462 14514 8816 -9834 -20462 -12501 588 5087 -3886
735 -3886 -14356 -13656 -1141 14831 20003 7538 -6218 -5017 6017 14664 10124 -3489 -12613 -10539
749 -10539 1000 9925 2383 -11592 -15021 -6006 6432 10489 1892 -9615 -11726 -1544 13103
762 13103 14674 3745 -4024 -1861 7184 13277 6941 -7154 -17230 -13944 -101 7481 -432 -10279
776 -10279 -11631 -3091 9946 14828 7184 -3629 -5847 4314 13349 8569 -3338 -11890 -10528 617
790 617 9379 5924 -6010 -13957 -8568 4230 8285 2360 -6075 -9747 -1374 10720 13632 5520 -5298
805 -5298 -5720 4722 11473 8097 -2706 -14406 -15119 -4151 4785 2478 -7052 -10800 -1731 9099
819 9099 13327 8536 -2942 -7948 311 10721 11715 665 -10671 -10656 -2022 5287 6168 -2998 -12625
834 -12625 -9355 1621 8390 3746 -6172 -8950 -1703 8767 15226 10185 -2125 -6180 666 8380
848 8380 7723 -3244 -12536 -12852 -6111 3038 3667 -5816 -11010 -4873 7631 14493 9513 -260 -4980
863 -4980 -2211 6616 11793 3289 -7803 -9016 -1293 6520 4850 -4464 -12057 -11909 -2796 7444 5540
878 5540 -4494 -8807 -3007 8301 13948 9701 1707 -3839 -229 9055 9144 -1919 -12732 -14227 -5907
893 -5907 2587 2894 -3340 -9913 -8742 3531 12511 9209 14 -5115 -1442 7423 10608 5646 -4121
908 -4121 -9242 -2567 7632 7507 -1872 -11341 -12685 -5141 2264 3764 -1956 -9336 -5122 7379 13626
923 13626 9823 1451 -3836 -22 7322 10215 3549 -8998 -14211 -6596 1508 3180 -2665 -8971 -8057
938 -8057 812 9366 9612 161 -7606 -3175 5790 10680 7638 -1197 -6444 -2779 4602 8527 1472
953 1472 -9372 -11578 -5135 1824 3369 -2425 -8513 -6440 2462 12228 12099 2086 -3805 -1363 4820
968 4820 8487 3744 -5637 -10955 -7106 1719 5567 -1240 -8590 -7765 -1048 6916 8596 1341 -5613
983 -5613 -5555 2774 10148 6987 -1291 -5240 -2818 4289 7970 2786 -7271 -11993 -6782 2518 4440
998 4440 -1580 -6502 -6229 912 10417 11037 3893 -3476 -3458 4088 8221 3468 -4472 -9954 -8137 551
1014 551 5824 1622 -6406 -9159 -1876 6059 7378 2989 -3767 -5591 1697 9346 8334 678 -6254
1029 -6254 -4182 2956 6458 3092 -5032 -12029 -8518 798 4529 920 -6106 -6042 1536 8918 11396
1044 11396 5991 -2759 -4276 2185 7079 4845 -3748 -10092 -7740 -1473 3634 2607 -5197 -9264 -3638
1059 -3638 4300 7286 3402 -2924 -3921 1776 8030 10225 3634 -4675 -4273 1223 5197 2615 -5210
1074 -5210 -10032 -8995 -2615 3629 1441 -5381 -5916 -14 7806 11027 6226 -141 -2704 897 7087
1089 7087 6258 -2284 -8465 -7412 -1712 3211 1362 -4539 -8842 -6759 1317 6335 2825 -2932 -3358
1104 -3358 803 7962 10297 5619 -1140 -4330 202 5816 3587 -4078 -9331 -9841 -3793 1699 1390
1119 1390 -3361 -7139 -2960 6359 10155 6558 955 -2410 574 6011 7348 1724 -6390 -7871 -1595
1134 -1595 3248 2425 -2613 -8276 -8065 -1175 4494 3922 -2177 -5587 -413 6926 9727 7163 533 -3867
1150 -3867 -699 4438 5506 -1092 -8767 -9430 -4152 630 1777 -1759 -6899 -4617 2904 9001 7701
1165 7701 392 -3235 -485 4365 6721 3627 -3952 -7049 -2625 3262 4376 -1538 -7339 -6823 -2512
1180 -2512 3283 4656 -1506 -5825 -2524 5002 9658 6667 142 -2916 -1518 3459 5527 205 -7700
1195 -7700 -8987 -4075 2339 3249 -1783 -5216 -4506 1673 8518 7224 328 -3741 -1793 4061 6815
1210 6815 2685 -3005 -6319 -3873 3243 4731 -951 -6887 -7101 -1968 4129 4102 -114 -4191 -3533 3581
1226 3581 9195 6557 642 -3558 -1783 3256 4191 284 -6293 -9624 -5095 2017 3721 -520 -4466
1241 -4466 -4154 1598 6566 7135 2493 -3074 -2351 3524 6638 3565 -2471 -6398 -4277 715 3257 358
1257 358 -5903 -7758 -2715 2389 3943 1188 -3022 -2289 3051 7808 8020 2743 -2842 -1971 1909 3253
1273 3253 765 -4859 -8517 -6065 -829 2920 699 -4206 -4065 724 5259 6536 2641 -1587 -1884
1288 -1884 2301 6951 5438 -1077 -5080 -3867 -483 2231 39 -5015 -7458 -4556 1112 4129 586
1303 586 -2896 -2249 2233 7045 8442 4004 -860 -2319 870 4165 1387 -3939 -7372 -6046 -1405
1318 -1405 2248 710 -3579 -5679 -2340 4460 6388 2833 -1042 -2151 1253 6072 6204 1430 -3620
1333 -3620 -3941 597 3089 263 -4328 -7642 -6535 -712 3318 1963 -2078 -3908 552 6494 7378
1348 7378 4420 -331 -2408 670 4424 3387 -1881 -7010 -6296 -1096 1943 1562 -2129 -5418 -3380
1363 -3380 1921 4999 3331 -1692 -2678 1048 4829 5997 3209 -2303 -3807 -594 2819 2349 -2299
1378 -2299 -6700 -5536 -1628 1811 2109 -1614 -3678 -299 4502 6896 3814 -1195 -2748 -60 2912
1393 2912 3719 -235 -5470 -5437 -1726 2086 1931 -1803 -4217 -2357 1445 4710 3769 -1337 -3482 -892
1409 -892 3901 6116 2481 -1780 -2818 -1575 2319 2562 -1894 -5938 -5289 -1222 2837 2422 -927 -2592
1425 -2592 -1455 3379 6543 4241 -278 -2734 -1239 2292 3032 -443 -4065 -5538 -2783 2124 2563
1440 2563 -1182 -3786 -3234 1448 4618 3857 766 -2412 -1485 3091 5153 2846 -1080 -3712 -1593 1748
1456 1748 1870 -1081 -5361 -6461 -2379 2430 3115 490 -2117 -1031 2718 5612 5023 1130 -2928 -1719
1472 -1719 2237 2981 547 -3705 -5651 -3153 389 2057 316 -3954 -4099 352 3590 3892 1329 -1375
1488 -1375 -625 2821 5003 4190 -724 -3419 -2017 411 1881 -609 -4334 -5806 -3377 641 2712
1503 2712 426 -2418 -830 2480 5240 5161 1339 -1824 -1563 1347 3748 1697 -2797 -4469 -3226 -177
1519 -177 1484 -798 -3487 -4299 -1540 3015 4023 790 -1467 -888 2282 5333 4811 688 -2537 -2699
1535 -2699 934 2379 -504 -3882 -5086 -3673 318 2530 374 -2165 -2970 887 4949 4647 1472
1550 1472 -1217 -2203 841 3521 2390 -960 -4237 -2972 388 2096 -110 -2732 -4567 -2572 1529
1565 1529 3333 1832 -1347 -2263 1431 4417 4036 1600 -1739 -2552 500 2281 1077 -2455 -5197 -3615
1581 -3615 474 1850 1163 -1132 -2852 -303 2899 4106 1681 -1706 -2064 463 2526 2390 -265 -3454
1597 -3454 -3131 90 2488 1496 -2593 -4002 -2176 773 2511 2017 -1126 -2007 382 3529 4618 1174
1613 1174 -2040 -2265 -925 1309 1616 -1828 -4191 -3037 -44 2226 1633 -1258 -1666 -414 2580 4367
1629 4367 2191 -1301 -2675 -886 2195 2404 -239 -2693 -2853 -1027 1872 1638 -1442 -3517 -2587 1137
1645 1137 3291 2086 -160 -1554 -257 3145 4651 1536 -1936 -3034 -1171 1441 974 -1302 -3408
1660 -3408 -4229 -770 2405 2191 12 -2118 -682 2394 4083 3110 161 -2488 -1263 2025 2563 -93
1676 -93 -2603 -3504 -1291 1051 1009 -878 -3362 -3228 389 3015 2580 494 -843 132 2618 3958 2664
1693 2664 -779 -3059 -1391 1004 987 -1265 -3587 -3839 -1582 1229 1895 -130 -2489 -876 1931 3759
1709 3759 2893 749 -1134 -52 1647 3052 1296 -2471 -3262 -1426 287 657 -954 -3296 -3192 -592
1725 -592 2231 2553 359 -1211 282 2576 3898 2813 -114 -1860 -1244 703 1797 -869 -3111 -3382
1741 -3382 -1592 621 1632 -369 -2133 -2180 822 3276 2765 533 -486 -170 1642 3450 1819 -1112
1757 -1112 -2902 -2049 388 1183 -759 -2555 -3026 -1410 1345 1937 543 -1352 -1050 1700 3747 2775
1773 2775 923 -1166 -1415 722 1874 377 -1950 -3268 -1776 465 1200 220 -1680 -2586 -169 2091
1789 2091 2217 1022 -982 -947 1495 2747 2254 -24 -2394 -1730 73 981 -41 -2315 -3114 -1280 534
1806 534 1800 940 -993 -1485 1085 2858 2633 694 -1309 -1522 182 1483 1120 -1499 -3169 -1829
1822 -1829 347 1447 700 -1228 -1663 -435 1420 2647 709 -1078 -1065 786 2166 2247 -366 -2062
1838 -2062 -1893 -577 1437 526 -2228 -2716 -1252 900 1775 831 -598 -1070 284 2647 3161 497 -1201
1855 -1201 -1473 -313 1484 1047 -1327 -2716 -2106 -88 1550 344 -1219 -2013 -1058 1411 2496 1397
1871 1397 -229 -1174 481 2700 2145 482 -1476 -2123 -736 880 -24 -1360 -2999 -2369 328 1776
1887 1776 1102 -231 -1150 298 2488 3056 1653 -613 -1152 255 1532 756 -741 -2675 -2616 -692 674
1904 674 227 -1521 -2328 -1267 1073 1851 1588 367 -731 692 2366 2904 1399 -1352 -1332 -612 319
1921 319 315 -1340 -3226 -2763 -690 1101 1120 -413 -1102 320 1652 2376 2009 174 -485 36 1698 1991
1939 1991 -103 -2053 -2268 -1271 -3 227 -1420 -2321 -1764 104 1732 1379 -346 -329 265 2107 3194
1956 3194 1633 -418 -1066 -323 876 974 -928 -2465 -2655 -1063 637 879 -756 -1540 -1199 897 2515
1973 2515 1870 199 -668 -269 1662 2383 601 -939 -1816 -1274 502 346 -787 -1885 -2576 -542 1385
1990 1385 1010 -159 -1158 -366 1510 2546 1959 307 -1055 -691 873 1152 -307 -1719 -2355 -1040 370
2007 370 603 -200 -1623 -1285 424 1613 1515 345 -615 -88 1554 1854 1230 -799 -1617 -869 663 722
2025 722 -481 -1978 -2102 -649 452 1326 284 -1082 -394 1145 1950 1663 30 -1173 -522 569 1221
2042 1221 88 -1351 -2178 -858 512 1031 126 -1372 -1252 19 1493 1643 143 -764 -90 1372 1429
2059 1429 1175 -606 -1835 -1045 242 971 -409 -1764 -1975 -751 1030 1346 385 -650 -435 771 2328
2076 2328 1997 241 -976 -1047 322 959 231 -1317 -2034 -1533 219 921 -166 -1318 -923 -89 1642
2093 1642 1894 849 -480 -696 777 1642 1182 -393 -1302 -1382 -131 735 -290 -1442 -2158 -1138 469
2110 469 955 460 -206 -775 816 2157 2235 832 -622 -890 559 923 276 -997 -2092 -1827 -308 450
2128 450 -64 -1130 -1421 31 1364 1443 1100 -239 -155 587 1442 1714 282 -981 -963 -287 326 -130 -1320
2147 -1320 -2596 -1455 -55 850 407 -637 -491 729 1561 1985 1216 -595 -259 406 1300 861 -470
2164 -470 -1599 -1394 -497 368 -170 -1363 -1594 -799 547 1573 926 -72 -355 424 1829 1890 605 -1178
2182 -1178 -1082 -342 813 346 -1112 -1726 -1533 -468 517 446 -617 -1196 -326 1242 1688 1186 -173 -768
2200 -768 -27 1173 1470 -80 -1180 -1429 -397 354 8 -1167 -1602 -1329 97 1123 726 -5 -500 261
2218 261 1320 1774 826 -361 -1153 394 725 646 -483 -1604 -1612 226 771 656 -283 -1029 -363 844 1294
2237 1294 1116 -91 -615 189 865 1231 130 -1013 -1168 -408 520 277 -831 -1646 -1069 419 855 998
2255 998 -164 -412 150 871 1343 639 -507 -1035 -199 403 574 -396 -1123 -1277 -297 770 958 -187 -461
2274 -461 -335 692 1411 1243 -198 -944 -196 545 946 173 -1203 -1363 -582 331 843 -348 -962 -1174 -20
2293 -20 1133 1170 9 -368 60 1013 1405 844 -297 -1077 -1044 338 499 -631 -1225 -1620 -778 489 585
2312 585 -209 -374 -339 716 1567 1360 585 -398 -400 576 1117 303 -590 -1655 -1079 37 235 -113 -982 -1414
2332 -1414 -486 971 859 651 -297 108 1189 1601 1168 188 -1029 -867 177 8 -224 -1327 -1801 -1041
2350 -1041 -14 462 229 -795 -489 394 1108 1518 615 -259 -32 545 1230 886 -356 -1534 -905 13
2368 13 149 -285 -1367 -1633 -434 439 605 490 -660 -20 639 1278 1262 606 -596 -437 22 856 210
2387 210 -963 -1704 -888 -420 501 -112 -859 -923 -275 800 1134 349 -167 -14 371 1421 1042 -157 -853
2406 -853 -681 -220 555 -65 -922 -1217 -838 381 735 385 -290 -290 391 1357 1159 295 -261 -382 22 611
2426 611 394 -104 -1131 -868 136 613 76 -591 -938 -671 808 903 273 -233 -244 426 996 712 205 -641
2446 -641 -689 33 742 190 -483 -1061 -729 274 659 335 -38 -499 198 564 1088 578 -494 -807 25 573
2466 573 335 -364 -1062 -956 -6 553 388 -472 -610 -518 673 1062 541 -356 -558 -21 773 628 231 -883
2486 -883 -1080 -468 82 474 -471 -998 -724 171 527 763 -337 -320 -47 630 1433 805 -372 -854 -429 441
2506 441 490 -382 -1208 -1057 -351 445 513 -474 -777 -397 479 967 493 195 -126 69 694 1321 135 -671
2526 -671 -1102 -369 257 227 -608 -1200 -956 -15 802 586 -118 -209 30 772 1363 866 -38 -378 -499 624
2546 624 399 -275 -544 -1147 -507 131 280 -373 -1025 -649 267 815 935 140 -433 337 993 980 662 -6
2566 -6 -870 -213 210 -75 -490 -1082 -954 -461 425 312 31 -441 -18 534 1017 863 -80 -309 -172 464 782
2587 782 306 -971 -1046 -429 -388 390 -183 -1008 -887 52 480 760 36 -257 227 498 1103 762 -175 -362
2607 -362 -45 226 499 -222 -1115 -841 -675 485 548 -152 -486 -497 77 750 1031 60 -196 -213 467 951 198
2628 198 -104 -928 -118 67 470 -176 -740 -983 -149 509 379 -77 -319 -586 164 929 926 200 -526 -295 360
2649 360 464 252 -725 -787 -302 162 585 -219 -341 -672 141 382 669 307 -156 -340 497 600 472 -560
2669 -560 -872 -469 274 411 -109 -497 -709 -102 451 639 305 -336 -84 165 558 418 99 -664 -504 -173
2689 -173 332 186 -337 -913 -402 168 594 486 -407 -301 -59 592 696 64 -137 -457 181 181 573 -322 -1072
2710 -1072 -659 -109 291 260 -473 -574 147 469 816 617 12 -99 90 798 800 96 -562 -628 -322 366 367 -651
2732 -651 -813 -640 95 607 489 -226 -36 -46 571 882 580 -304 67 -48 238 353 -45 -695 -666 -36 -160
2753 -160 -86 -346 -639 -172 324 864 488 71 -54 130 781 637 201 -148 -616 -241 197 -74 -147 -762 -814
2774 -814 -335 219 178 58 -260 114 457 760 636 -154 -180 54 639 627 177 -423 -781 -334 257 161 -428
2795 -428 -877 -535 70 450 502 -36 -329 69 682 631 279 -252 -403 -48 288 302 -223 -623 -476 -171 184
2816 184 132 -283 -811 -362 197 668 449 -93 -292 316 449 726 61 -340 -605 -353 489 281 -493 -475 -421
2837 -421 -112 479 517 -2 -244 -208 246 498 117 48 -224 -82 296 631 86 -612 -654 -338 295 111 134 -344
2859 -344 -317 112 276 474 -136 -278 -167 131 430 380 -113 -404 -451 99 228 -124 -416 -280 -70 246 263
2880 263 176 -369 -187 257 287 212 -74 -608 -296 246 158 61 -48 -795 -74 284 363 147 -275 -226 215 452
2902 452 525 194 -472 32 284 389 336 -270 -714 -333 54 311 200 -484 -228 -94 401 666 252 -113 -352
2923 -352 534 314 399 188 -582 -36 -192 386 -254 -627 -428 -304 -73 431 -204 -185 -255 24 714 646 190
2944 190 -53 -38 -8 207 322 -240 -414 -201 -275 121 18 -297 -450 -155 28 316 180 -16 87 392 687
2965 687 574 -152 -204 -117 22 239 -126 -298 -419 -567 8 410 -338 -222 -171 -74 448 563 268 -132 16
2986 16 454 651 326 -182 -236 -206 -47 215 -125 -195 -518 -168 39 409 53 -105 -177 136 321 743 0 -394
3008 -394 -229 209 552 -15 -24 -513 -194 -112 53 137 -302 -835 -53 560 327 237 -207 -304 288 226 417 141
3030 141 -424 -339 -68 329 -48 -211 -564 -146 -198 230 13 -253 -326 -159 262 672 120 -371 -207 146 666
3051 666 291 0 -341 -136 -165 100 66 -185 -298 -166 119 515 150 0 5 -272 103 527 89 -386 -337 -72
3073 -72 268 200 -136 -385 -197 292 226 171 -63 -107 -18 347 332 24 -115 -441 -247 175 328 -229 -294 -42 -133
3096 -133 402 -21 31 -217 -443 253 321 94 -236 -97 206 278 342 -227 40 -549 -12 86 -110 51 -552 -317
3118 -317 144 484 256 -111 -137 -37 207 483 195 -16 -367 -96 248 203 59 -275 -594 22 109 128 -68
3139 -68 -201 -182 74 338 267 76 -162 -208 97 343 278 -34 -152 -106 -12 33 -53 -717 -274 -177 57 346 -168
3162 -168 -184 -21 295 245 343 273 -120 105 28 286 -83 -363 -406 -315 -283 213 -42 -78 -192 40 -25 268 79
3185 79 -134 107 328 419 185 166 -44 -201 63 78 -138 -264 -557 -400 269 -84 -177 -225 -143 318 449 26
3207 26 125 -113 14 616 271 147 -156 -415 -227 -28 -155 -572 -262 -571 -120 49 289 -24 -70 -241 579
3228 579 394 240 124 -207 144 165 432 -67 -545 -433 79 -40 141 27 -296 -378 -46 0 205 270 -533
3249 -533 -53 510 400 371 -1 -199 -105 149 -13 124 -167 -91 -225 -6 357 99 -358 -45 156 137 253
3270 253 -79 -263 217 -96 266 4 -111 -152 -24 -36 242 290 94 -13 -68 178 276 -61 320 28 -81 386
3292 386 19 39 -169 -193 56 315 -22 -109 -53 -9 287 137 410 -247 -135 49 488 134 -38 -138 -116 55
3314 55 146 -5 -203 -351 -176 112 145 -23 -82 -227 66 215 392 195 -145 -115 22 12 69 -182 -443 -56
3336 -56 16 54 -113 -209 -521 -88 90 350 167 135 -18 42 211 246 42 -71 -376 -54 -167 98 -28 -450
3358 -450 -194 -262 -94 113 23 -224 191 267 528 519 -211 -173 41 473 283 -51 -326 -122 -262 -66 -6 -127
3380 -127 -264 -171 185 334 270 -176 -91 -275 63 441 104 -1 236 -128 330 163 -347 -318 -102 -420 257
3401 257 -158 -193 -273 -413 29 360 224 23 271 -47 303 250 208 -133 122 -247 38 -55 -150 -273 -532 -18
3423 -18 217 18 -115 -276 -27 316 361 293 -5 -264 -69 316 295 37 -147 -327 -171 95 36 -208 -169 -189
3445 -189 279 105 323 -32 -20 -205 93 66 80 -143 -188 -179 290 -34 -14 -90 -316 141 97 316 -218 -195 -214 266
3469 266 405 140 -89 -192 101 241 243 256 -69 210 -65 -4 357 -5 -254 -318 36 293 7 -185 -138 -62
3491 -62 -128 42 4 -305 -162 -17 -26 102 103 -57 54 86 186 671 237 -42 147 -11 -22 218 183 128 -345 116
3515 116 183 -110 -203 -263 -138 458 228 118 45 -279 6 182 173 -74 107 37 -8 358 -255 -420 -460 -144 -61
3538 -61 -25 24 -165 -357 -145 -42 196 205 -56 -85 107 290 279 -76 -220 -154 19 -100 -61 -90 -409 -236 70
3561 70 -60 -16 -185 -165 318 338 261 61 27 151 225 151 489 15 -366 -75 -184 63 207 -215 -138 -237 -156 130
3585 130 40 -174 25 170 210 394 108 49 -47 -32 89 16 -22 -323 -149 -194 90 -80 -378 -19 103 -10 174
3608 174 193 172 -19 -116 61 169 -34 -158 -156 128 36 371 -219 -393 -181 -129 54 -69 -218 -276 18 -37 24
3631 24 59 37 -299 -34 457 179 -52 -179 -103 87 295 34 -208 -428 -248 147 -281 -201 -289 177 -41 75
3653 75 58 -72 145 -318 180 -187 94 40 -75 -296 264 79 -109 30 -347 -73 -58 329 -59 24 -218 -75
3675 -75 198 32 -41 -279 -449 -208 -55 314 113 -297 89 -174 -24 104 34 -274 -152 91 55 129 56 -256
3697 -256 129 213 -193 26 47 -234 244 182 483 -42 -107 -194 234 187 -69 -227 194 -242 -15 210 58 -177
3719 -177 -75 -69 217 136 -89 50 28 47 284 -50 -12 28 -240 228 283 -159 -137 18 -270 46 146 78 -371
3742 -371 -42 -57 196 343 45 -31 163 108 241 173 -102 -112 26 198 230 -162 44 -331 -94 -292 -226 -96
3764 -96 -493 67 -48 460 66 -63 -241 234 212 279 222 -95 -114 -150 95 -140 -354 -254 -367 87 -204 174
3786 174 -79 -179 -101 107 75 315 86 -133 -37 -72 369 47 -188 -164 -151 37 325 61 -207 -260 -199 -267 459
3809 459 44 -187 -81 -23 -172 -111 -81 -144 291 -112 111 -116 -119 -33 -119 -260 -35 -24 -285 -316 -46 71 -13 154
3833 154 -266 204 45 72 76 -41 91 -157 -70 229 -310 103 -230 -137 -84 141 -69 25 -375 85 403 173
3855 173 15 -27 -100 125 264 212 -40 -278 -201 -132 99 -227 13 57 -88 -7 33 -54 0 66 39 147 301 187
3879 187 -51 38 -115 217 61 -268 129 -260 -142 253 -126 -260 -185 -9 312 51 131 -327 -126 231 -43
3900 -43 254 26 156 -94 324 211 381 -221 155 89 162 153 -49 6 -77 -81 -154 -267 -83 -234 -93 145 204 66
3924 66 48 221 50 150 138 -270 -210 31 -318 45 28 354 -283 -134 -55 311 -187 -157 -133 78 -29 -92 66
3947 66 -36 144 -1 211 91 30 -32 5 -149 130 1 -176 -154 -192 -184 133 -82 -268 -240 -53 -143 236 169 213
3971 213 255 -327 -15 213 305 -68 -210 197 26 -6 -68 -334 -161 -192 58 90 -52 -169 -116 -199 -42 329 180
3994 180 110 63 118 -7 288 -147 -9 85 234 16 -73 -197 -21 166 -9 12 -270 -87 -85 188 88 265 -36
4017 -36 -34 -74 179 205 225 -265 -40 -134 287 8 78 -118 -243 24 53 3 270 36 65 389 121 97 73 112 -135
4042 -135 -29 223 -51 -234 -37 34 -110 -19 156 170 274 184 254 66 -164 72 -161 116 143 -328 -130 -46
4064 -46 169 158 377 -169 280 -264 -293 186 -201 71 -163 -47 270 357 301 -230 -97 -18 -63 100 251 37
4086 37 207 103 126 -175 59 232 -278 28 -10 177 -90 -114 -70 -6 29 137 -2 215 -14 -179 -135 -13 -185
4109 -185 0 25 139 128 -420 -25 -17 48 136 14 -120 -117 -72 -99 35 252 -202 -168 -64 -144 136 131 172 -214 30
4134 30 220 47 123 -158 -119 265 243 48 -137 -170 -249 102 243 185 41 67 96 105 182 295 -114 -160 139 124 75
4159 75 143 -54 -147 -76 81 17 -190 -51 -232 80 278 -85 -53 -140 130 349 212 83 312 -151 -33 188
4181 188 89 -77 90 -188 -187 65 -231 124 -256 -58 241 -17 -100 66 63 13 60 -137 163 29 -93 71 2
4204 2 132 202 -14 -97 187 -256 -226 -69 -232 -201 131 72 229 -228 159 227 95 -23 264 -151 -18 56 -265
4227 -265 22 -166 65 -142 185 183 -21 96 13 58 354 -224 11 14 150 -35 56 48 66 -27 -293 -73 218 -68
4251 -68 -104 -44 6 150 27 53 132 57 34 130 -24 -105 -178 99 71 180 73 -167 -140 -74 -74 -143 -14 -133 -93 91
4277 91 -100 -43 1 -247 41 -28 -220 137 179 -37 7 -78 101 -45 -10 -272 -212 -97 249 21 -120 -23 -41 169
4301 169 288 140 19 11 254 14 -215 -63 -8 19 -60 -5 -63 0 -126 143 -17 331 80 -147 -170 -309 3
4324 3 -107 -66 72 -2 -45 37 242 34 6 106 92 237 159 -47 -130 -24 -81 -99 -1 -184 150 -170 -19 190
4348 190 66 19 9 47 247 42 -192 -109 -57 -1 159 -6 -79 -151 -193 -66 121 -66 -115 -22 226 61 48 -176
4372 -176 -108 -60 165 185 -78 -211 170 12 243 8 166 -67 85 -44 -46 90 -229 114 -98 54 -8 216
4394 216 -78 -218 -401 -132 17 307 150 160 -42 134 2 -28 -151 62 -265 161 -114 -75 -151 -165 15 25
4416 25 206 -19 17 -7 201 115 19 -7 37 69 18 84 39 38 -20 -36 203 -21 168 -49 28 80 257 42 -2 -125
4442 -125 -50 238 153 -9 -261 -4 1 -31 52 -259 -183 -169 -313 21 105 -215 -105 -62 -94 -364 -18 -36 -118 129
4466 129 75 135 145 -146 51 47 23 167 -28 -321 -211 57 -217 -30 -202 38 24 32 -172 167 -227 189 -198
4489 -198 17 -33 27 -137 -126 -72 68 51 -312 -14 -51 114 180 156 -173 -69 -96 56 223 34 -178 135 -87
4512 -87 -46 -12 -25 126 222 -143 203 127 37 -343 -66 -69 108 -86 -293 162 -39 103 17 -4 3 -155 -122 -77 0
4537 0 60 -34 280 82 43 -270 -88 -154 32 52 24 -207 321 153 134 7 100 47 -67 217 -75 -179 -181 -25
4561 -25 80 -300 -239 -6 57 76 -85 -127 -63 -209 195 -112 -31 98 50 122 -98 -32 -157 29 65 122 172 52
4585 52 -55 -7 171 -54 93 -39 91 -64 267 150 332 -217 4 101 -70 168 -132 -174 130 337 86
4606 86 -35 -158 -46 70 -70 2 -139 -4 -254 -219 300 183 -113 -39 19 271 243 -2 132 -121 -90 255
4628 255 199 69 340 207 51 -274 -37 54 -133 -81 -20 322 206 105 -308 104 -45 -29 -19 -144 25 -115
4650 -115 45 -92 -8 63 -82 123 212 40 -41 -47 -307 277 115 91 75 -120 -160 101 89 31 -59 46 92 -244
4674 -244 2 -280 -171 -423 -5 27 187 -124 -30 61 -7 36 62 -44 -341 197 -128 95 -167 -32 -113 -14 54
4697 54 -81 163 49 -228 -125 -37 -13 -77 -452 96 79 -102 -148 -59 133 -150 -122 156 -263 24 -273 147 70
4720 70 -21 32 -136 65 -105 192 -58 58 -279 -155 228 -32 -73 142 -83 -43 34 -149 160 -107 100 99 134
4743 134 -239 -59 -73 -102 -44 -20 -259 46 86 60 156 35 -53 294 31 -617 -121 399 -168 -149 -145 43 -378 -142
4767 -142 104 -159 -15 92 38 169 -68 -51 -104 147 187 206 117 -34 286 72 -23 -17 -15 -47 -240 101 -153 -144 -156
4792 -156 135 20 -112 -24 -188 -27 149 -210 -131 -28 -12 149 250 370 28 -183 -198 -144 -220 -145 261 -148
4814 -148 13 14 -159 -69 65 -130 -61 190 182 -195 -180 -46 -92 -44 17 -108 -122 -162 -149 18 -18 108 -148 14 -118
4839 -118 -209 155 1 -166 -160 73 339 310 -143 78 -60 290 113 123 -3 -120 -37 -72 187 63 164 -8
4861 -8 77 221 1 102 99 -25 -52 -95 135 -157 -309 -114 212 -13 40 199 -2 41 -108 71 -29 -83 -36 -114
4885 -114 -179 25 49 39 46 53 27 -121 226 -9 58 174 -315 -88 -61 109 -129 29 201 -87 -185 128 -92 -100
4909 -100 220 8 -108 70 -256 -136 -43 -48 -236 290 -242 -86 108 -42 60 -196 -222 -97 94 126 -12 -79
4931 -79 95 -18 5 97 -86 -62 373 6 3 170 108 122 183 138 5 65 -286 -136 -66 -214 116 -238 49 41 17
4956 17 -403 -110 -127 -134 -14 -107 45 348 8 69 196 -73 72 -169 -88 -148 113 -51 -95 131 -183 -112 -77 183
4980 183 105 -203 -61 32 166 228 10 -84 57 -55 -173 241 -264 -222 -55 -24 -18 170 151 33 125 89 80 50 49
5005 49 43 196 -35 -21 -22 46 287 345 214 -5 -267 -43 4 -262 -176 14 -180 134 317 -223 234 -139 175
5028 175 92 275 -149 155 13 -3 -153 243 -58 193 -91 68 -26 76 79 -235 252 225 91 110 -158 -72 69
5051 69 29 154 -71 33 -228 68 -142 12 109 379 34 -54 67 -269 -81 -120 -212 -23 117 -244 272 -11
5073 -11 69 44 239 286 -43 -162 -326 -29 94 -101 -151 -11 -180 -77 73 243 28 -279 -5 222 92 101
5095 101 -372 -48 -86 139 152 12 88 -169 14 -113 -41 14 -105 -333 29 46 268 31 -57 337 28 90 80
5118 80 -10 10 -182 -196 -193 2 32 -228 -173 -63 286 -181 -199 -96 -67 302 -247 -149 -56 -55 96 -162 -300 -38 -223
5143 -223 -169 254 -29 -82 -25 -124 201 -102 66 -105 -40 43 196 219 101 -156 -93 153 94 13 -136 -187 -27 -49
5167 -49 86 8 110 27 109 212 52 -140 -40 -28 164 -59 155 -19 -56 -340 92 141 -51 -38 -196 48 16
5190 16 114 -350 -116 -323 234 6 -170 -177 164 50 -15 -130 -159 -9 122 83 135 143 -93 69 86 -54 -100 -271
5214 -271 -29 -36 -229 70 109 -318 148 -41 -75 25 332 -57 87 -139 133 115 -128 176 -240 77 33 -24
5236 -24 -202 -172 -119 -37 14 -18 276 -269 -27 287 144 127 -66 -17 148 206 -148 -42 91 -336 251 48 30
5259 30 57 -60 74 141 188 78 -185 -48 -52 -198 -55 114 56 286 73 -56 438 123 37 -19 -318 -117 -293
5282 -293 -116 -117 -36 -130 27 89 -61 38 264 118 274 -13 25 128 271 27 -68 52 131 129 -205 -30 32 9
5306 9 -81 21 -53 20 2 49 -6 -77 -228 -29 -194 -54 -229 -182 -388 -143 36 -110 -212 224 105 -31 116
5329 116 -93 43 -261 15 -54 -38 -100 3 81 154 -99 -26 36 166 44 -20 -183 21 -222 -13 -62 53 54 -218
5353 -218 58 -142 -13 106 -84 -99 28 62 257 144 252 50 -41 163 -41 -207 112 92 31 60 122 90 -100
5376 -100 233 234 -30 155 34 68 -110 -142 48 24 -111 199 189 18 12 166 -191 -202 29 118 -57 174 103 70
5400 70 113 -168 47 -9 209 -2 -17 -72 -25 -26 52 -415 296 -2 -80 70 -185 -7 -5 -44 107 64 -184 -366 -221
5425 -221 -348 42 74 82 45 -34 37 -243 168 138 -63 -114 -209 -98 50 -135 -136 -288 58 8 330 24 -79 263
5449 263 311 -80 29 -224 164 -175 -46 32 -263 -94 124 -222 -167 54 26 280 37 10 161 180 -17 -32
5471 -32 -155 -70 26 -101 -16 164 -11 11 88 -41 -188 55 105 -21 -287 -190 160 -152 -204 -174 210 25 -276
5494 -276 23 -2 69 -162 -101 -118 -4 188 140 72 134 294 18 -137 -95 -134 -249 106 -8 3 28 -107 -21 85
5518 85 204 96 124 214 -101 -183 -40 -62 85 -180 -287 75 106 85 -158 55 37 275 -220 115 -267 -102 221
5541 221 13 -281 80 159 214 198 44 10 390 220 -37 -235 5 -106 -62 223 81 -302 -46 61 -157 135
5563 135 -89 82 247 7 -331 77 -98 -105 -226 -210 -34 78 -227 -213 -18 -352 -210 8 145 -56 6 -332
5585 -332 34 -199 -126 54 -330 -17 59 73 -187 -226 69 175 -271 -197 75 -290 34 -202 -147 -34 70 -244
5607 -244 -40 -91 -17 173 -95 -17 39 -116 -205 -195 -253 -131 -243 151 -76 -112 -42 -196 -32 -26 121 103 -7 -64
5631 -64 -71 -116 -53 118 -125 -108 232 199 69 -99 -97 -107 343 -383 62 23 92 101 -170 -187 -147 -13 247 179 -20 -38
5657 -38 72 -97 268 208 74 118 -314 13 -303 -332 112 18 54 30 10 82 -71 -174 36 -52 -144 -7 132 65
5681 65 78 98 -50 42 11 -58 -105 -370 -150 -98 -173 -52 -62 202 52 143 53 19 -100 188 -134 73 -45 -170
5705 -170 -17 67 -167 -49 -220 90 -54 -82 355 149 -160 6 -38 65 -195 -111 14 108 3 69 55 85 -9
5728 -9 -63 5 -107 330 37 59 -52 -30 24 220 -166 79 -232 15 89 -25 -98 68 -28 287 269 -177 74 -37
5752 -37 -238 -53 38 -58 443 -53 61 -73 -301 -134 -106 -199 120 251 -35 -54 53 -108 73 171 -139 42
5774 42 24 33 -127 -42 -60 116 28 -197 -212 -173 -31 -31 89 -31 -200 153 103 -163 -216 -110 36 88 71 -16 -141
5799 -141 -83 -311 -163 170 -82 -75 177 133 31 168 103 -114 -258 152 -78 -14 110 -15 -60 -175 186 -213
5821 -213 -74 63 -84 -23 77 26 48 -36 44 54 -17 155 -128 -94 9 67 -270 161 -169 143 13 -167 -4
5844 -4 -166 44 68 -58 -258 255 -151 154 168 51 -74 -58 115 245 77 -30 71 -92 -57 36 -208 -207 -54
5867 -54 -97 -47 93 -280 126 -236 -50 183 28 227 182 51 35 -127 -24 41 -21 -70 -358 93 194 -218 -1
5890 -1 -169 -4 -135 -228 -54 -121 251 89 90 274 -90 -45 167 196 -104 -37 106 -285 8 265 33 122 97 -100
5914 -100 199 -75 -167 76 22 -54 307 70 -92 32 112 87 -244 -127 -59 8 3 38 114 70 129 -181 170 -291
5938 -291 -184 -43 9 249 150 26 -354 295 -36 -7 124 2 -161 169 -204 -284 -89 -155 -26 -124 -92 -234
5960 -234 -88 49 248 302 -51 158 89 -114 -8 189 7 -46 -235 -55 94 150 32 138 -96 -292 75
5981 75 -29 242 130 -2 83 -122 347 124 -4 -93 -130 78 77 24 102 -4 -47 -4 17 62 -205 -22 -83 -161 59
6006 59 78 48 -122 -197 -269 145 81 0 58 -48 260 -44 91 -21 29 221 235 -221 -28 -258 84 -166 62
6029 62 -88 58 -37 220 -50 -128 26 103 43 -26 118 -123 -90 -89 -6 141 -77 -110 199 278 -28 -109 27 120 -167
6054 -167 231 166 -92 147 -101 65 -36 145 -119 60 -106 -32 215 -141 347 -228 134 -15 275 -72 -113
6075 -113 -109 2 -172 212 -38 -8 -277 146 42 17 -119 -15 -344 145 -220 -63 194 -12 -355 -125 -77 -126
6097 -126 38 -77 145 21 -23 133 -148 -20 -3 34 -6 179 -67 -66 -214 -85 206 182 109 118 14 -97 266
6120 266 -126 -57 -69 132 -192 -86 -74 -139 -49 25 -73 -162 189 -114 -282 92 -86 13 279 250 -222 59 188
6143 188 -52 29 60 215 164 153 -13 10 265 226 0 -152 -32 172 -24 -30 261 -34 71 -69 -82 104 -112
6166 -112 -205 -14 167 58 -46 -63 134 -203 107 -32 -179 -93 -173 -24 -38 -48 -301 -20 -178 181 -48 -64
6188 -64 -238 -236 31 -146 116 -42 0 91 -263 114 73 -257 -27 -218 157 -222 -176 -126 40 -198 41 52 -41
6211 -41 36 87 23 -36 86 -26 -247 -67 23 -251 133 -174 0 232 -121 -50 -201 274 -80 -20 54 109 -110
6234 -110 269 13 110 142 20 17 -128 -373 127 -122 -255 29 -265 40 -151 -190 220 190 -48 -149 -112 87
6256 87 -22 234 -440 80 298 17 158 144 -47 81 97 -45 -247 -139 -40 333 -83 45 115 -156 197 217
6278 217 244 368 23 178 -24 -94 26 161 -216 57 55 -235 -23 -211 -293 -132 -59 -104 -21 -94 -158 131 -40
6301 -40 -13 -36 237 -40 119 -241 52 55 -344 -167 -185 -24 -25 -48 20 3 -29 73 -234 47 170 -146 75 118
6325 118 -162 72 -106 283 179 -18 264 369 -112 -96 -80 -64 -340 126 -65 -168 41 -377 181 -180 -233
6346 -233 128 -235 425 184 -31 215 -63 90 50 24 42 129 -92 240 125 241 -204 152 -205 -161 -4 44
6368 44 207 -80 48 -120 -50 -5 -11 -169 139 -72 -36 -63 129 -340 34 -25 -99 93 41 83 -104 -10 -300 37
6392 37 -84 273 -56 10 -171 68 -77 -110 -101 -51 -15 -314 -65 382 264 29 57 -175 163 99 -26 -94 77
6415 77 281 -87 -39 190 -41 -46 84 95 -68 -79 -134 74 49 -94 142 39 18 48 -124 -176 432 -42 78 210
6439 210 145 106 29 -226 96 -47 -52 39 -157 232 112 -77 44 4 87 51 -69 122 20 -25 -31 -145 -64 -29 176
6464 176 -90 65 8 -160 39 -41 -122 56 -13 -83 267 -74 -92 -76 -274 -244 -188 228 96 -17 -11 34 44 -100
6488 -100 -42 101 15 -36 -78 -218 26 111 9 -42 -127 -79 63 -20 -65 6 34 -120 -15 34 -33 96 -151 -108 132
6513 132 60 -96 21 -22 131 147 -57 43 180 22 -61 94 388 29 -228 64 5 158 87 51 109 52 -145
6536 -145 45 85 4 -95 -145 52 203 192 115 29 -115 61 210 23 -35 80 52 -215 -151 267 -192 66 -96
6559 -96 225 38 66 -77 302 34 -132 -78 -69 62 -109 167 -356 165 7 -203 76 59 20 -162 266 50
6581 50 137 -32 -139 104 -114 -11 115 -253 -4 -124 -106 -354 119 -4 15 -69 -151 -35 25 -77 -6 74 116
6604 116 -149 124 138 56 -143 25 -199 49 8 -279 -74 -52 40 151 -98 -31 180 -51 80 16 -125 263
6626 263 117 -130 28 -18 492 -120 176 -26 221 -94 -68 29 -28 -4 -57 107 13 -99 -95 119 -29 119 -48
6649 -48 121 355 -116 -44 -20 -104 -48 -53 -154 80 -30 -230 -148 28 -149 224 338 -4 -191 258 -239 -1 37
6672 37 48 96 -185 -43 -162 -142 -307 81 187 192 -88 -84 -79 -215 -58 32 -129 -14 20 -87 -46 226 22 -253
6696 -253 -67 0 -231 -122 -50 94 -221 -41 154 250 -43 -79 40 -92 -42 -75 -46 109 79 2 64 -48 129
6719 129 -126 -24 -90 122 -112 -81 -120 168 -53 211 196 73 44 127 -76 88 227 -104 81 -60 146 252
6741 252 -122 -82 -198 -223 68 -47 28 -144 -182 85 -95 144 62 197 -5 105 84 -214 -316 81 -198 -165
6763 -165 46 -255 -77 16 144 27 -21 51 -134 144 -257 247 79 -90 -124 -92 149 103 11 85 162 153 -34 -132
6787 -132 309 -145 94 -151 -193 -66 187 -35 114 16 -2 -160 -139 -45 26 188 284 -58 -79 -250 88 -137 15
6810 15 58 -119 26 253 -181 -51 -191 -214 34 -59 -73 -59 -70 40 236 -36 -44 -137 32 51 250 -369 13 -98
6834 -98 -10 85 -20 76 115 -169 160 69 77 241 -137 -74 49 -74 -20 -113 -67 -40 -51 -347 -239 -52 -92 115 -224
6859 -224 110 -74 153 -53 145 -45 318 36 -179 -52 44 -198 -93 165 252 -71 -1 20 27 54 40 -317 58
6882 58 -163 -87 -42 42 123 -54 35 250 208 67 134 17 68 -53 -208 1 139 52 -103 -41 -78 -48 162 54
6906 54 -133 183 121 80 -255 -33 117 116 -74 -27 -44 -309 -107 147 -257 -142 -70 -193 -179 -211 25 -38 201 -15
6930 -15 61 60 -35 30 80 -98 -147 -37 179 -155 169 -254 -87 2 -160 236 -60 -54 -42 16 -174 110 269 -122
6954 -122 112 295 226 374 -132 -139 23 -47 53 -67 46 -56 -52 47 45 -56 116 113 118 -48 396 45 123 -50 94
6979 94 -44 410 -70 102 -132 121 78 -291 129 95 110 -258 159 -86 -63 254 30 -82 -285 -305 -263 24
7001 24 136 -374 53 94 -77 19 -114 -192 303 -193 401 79 -63 -123 -215 -26 -91 124 20 238 14 311
7023 311 107 48 273 21 -101 -47 156 -20 104 -105 131 -299 -49 -34 33 85 -66 96 -69 -63 50 -425
7045 -425 -19 -148 169 205 -232 90 176 21 -25 -133 135 -172 -150 -148 -146 98 158 -8 154 -68 9 131 191 44
7069 44 113 -99 -123 -146 96 -52 252 48 -7 -42 -120 196 -140 -209 -18 103 206 288 28 216 102 -1 -114
7092 -114 -118 140 -93 -89 -39 197 -366 -152 8 71 -68 100 -14 -255 73 122 185 -60 -284 49 -162 112 91
7115 91 119 65 44 148 326 -107 -189 263 29 -277 -93 -178 -20 224 -103 44 -156 88 25 -142 -44 -72 -117
7138 -117 -20 140 -116 -57 -87 -72 -61 100 -121 -119 -99 262 9 4 26 86 187 26 161 77 -107 75 -260 -210 25
7163 25 -21 261 -73 -445 94 59 -202 -113 53 -92 -70 -37 -265 151 -13 -224 27 -70 62 133 -151 -3 -74
7186 -74 56 -168 190 -23 18 20 35 57 -99 18 70 124 100 302 195 326 87 -1 114 6 -108 68 -118
7209 -118 -110 -52 -183 128 36 -167 247 -110 -149 159 15 -104 29 -130 312 385 -9 -44 -139 58 143 315 237
7232 237 -10 -31 -150 234 -57 133 -64 -321 -48 176 -3 -132 -16 157 65 42 -225 124 52 37 120 -30
7254 -30 -21 -42 179 80 -242 148 -79 93 -267 -193 132 320 114 104 192 121 207 -5 -180 -219 -81 -52 173 -398
7278 -398 -102 -29 315 -10 123 306 -329 -13 -81 143 -39 235 -125 138 9 270 32 148 76 -109 -26
7299 -26 -72 104 -22 109 25 240 -123 -122 -284 55 -133 -18 -88 24 -41 61 -241 71 110 -183 -254 87 -173
7322 -173 -243 -79 -391 -162 213 134 -242 -24 2 47 340 115 73 -18 202 -127 51 70 14 -5 59 120 44 21
7346 21 85 -61 -183 -111 -107 -271 -90 -206 11 114 48 -209 -23 -214 9 -49 -66 -15 73 -212 -6 -78 0 105
7370 105 88 -93 -51 -151 -119 -175 13 126 -324 189 -93 58 69 166 -145 106 -32 -307 215 16 -190 -166
7392 -166 -160 -66 283 -159 -40 -241 -120 42 45 125 -26 -176 -439 -64 -55 -33 -4 129 52 223 -86 44 -192 381
7416 381 173 -46 20 -275 143 -160 60 -80 107 154 85 173 147 -139 387 112 148 69 134 -193 -104 -242 132
7439 132 -183 25 -165 -106 -69 -11 97 206 241 -28 71 130 -199 -154 131 -162 161 -243 -42 -269 -84 -122 -266
7462 -266 103 14 -38 313 52 68 118 -166 31 -87 -73 -95 -45 80 210 -66 -9 -296 117 -30 -55 280 -153
7485 -153 -113 24 -48 54 40 110 34 -281 -225 -196 319 21 -201 21 -260 -229 57 -242 -35 -231 -83 93 -132
7508 -132 -11 503 145 -54 64 57 -123 18 -59 93 103 -97 -80 161 106 -73 -132 -71 -27 29 361 19 158
7531 158 25 242 10 -69 56 156 -243 -109 -62 -43 -213 -147 -67 -62 -77 77 103 177 51 159 80 -14 -122 -69
7555 -69 108 427 -2 138 -149 -18 -351 -58 11 82 -59 -108 -202 -50 -244 -199 4 -262 37 89 166 138 282
7578 282 35 -89 -81 83 214 12 -57 -275 -14 -189 -64 -21 -308 -64 -141 45 -51 -126 33 185 44 167
7600 167 101 -66 17 -62 31 140 114 -22 -71 -206 38 -17 -11 -178 -18 265 -6 51 0 -121 -94 -27 -139 1
7624 1 -46 -155 160 -104 174 6 -321 -11 -233 -271 -159 134 140 -299 77 12 87 -127 156 92 -70 -251 57
7647 57 36 148 159 203 73 49 -3 -122 -113 -89 332 -309 -319 -130 -137 110 188 -240 -19 -248 104 145 -80 50 38
7672 38 135 -16 8 1 34 -94 21 -173 54 -49 126 -264 -75 138 -114 67 -176 -83 15 -92 3 -69 94
7695 94 -6 118 206 -190 -106 242 15 47 -19 -209 -123 -216 86 -8 -32 243 121 -71 -23 -15 -63 111 -59 -125 -143
7720 -143 82 128 -159 -75 -73 -262 -131 44 213 70 -22 -174 11 -84 -65 224 -85 80 69 -11 -30 146 -146
7743 -146 159 -125 -216 -21 141 25 -356 -13 -112 263 39 37 -210 134 298 90 -134 250 16 1 111 100
7765 100 -131 -66 -44 182 73 2 -103 51 -192 -32 -47 140 -53 -111 -30 103 172 181 -163 57 -33 153 -89
7788 -89 -155 197 -140 -97 52 191 39 66 -131 165 110 296 106 -80 -176 139 -71 -56 138 -169 11 159
7810 159 146 -2 71 97 110 -237 -90 -352 3 -199 -225 43 56 4 81 -19 -18 87 -46 23 205 -51 52 -228
7834 -228 -58 160 10 -65 -122 -72 -144 28 -121 -169 -246 20 75 35 -175 278 99 21 1 -99 -83 5 -44 85
7858 85 -189 107 -257 -78 28 -87 350 -69 -143 -146 -138 55 -298 55 -6 52 -91 -167 -1 28 -4 -23 92 141
7882 141 -163 -101 -144 65 211 -136 256 311 77 -186 -165 71 20 104 9 18 48 97 66 -99 -121 57 15 -124 7
7907 7 -136 18 -79 -117 -89 146 -80 259 99 -65 108 -125 -48 303 7 226 50 -231 -364 -300 272 -74
7929 -74 48 -59 -211 232 -125 -175 -184 -77 -135 100 38 195 166 -11 -191 -139 -181 -209 -108 -11 -92 -35 16 11 3 101
7955 101 86 78 -174 212 183 90 71 213 217 231 148 -84 58 60 -256 152 282 -321 -301 -165 72 116 139 -93 -134
7980 -134 -33 -45 187 194 49 -68 46 22 -4 -162 89 89 -86 -168 -19 -233 92 330 -89 -53 -87 188 74
8003 74 -193 161 -34 73 87 -152 -124 -109 -89 43 -122 -149 -228 -123 -195 -266 -91 170 -38 231 30 -87 153
8026 153 -72 -93 58 -78 129 91 -6 39 -352 -24 -98 167 137 47 -60 -52 227 30 -83 171 61 -185 296
8049 296 -52 118 -147 202 -164 -44 111 -101 -193 241 29 -246 165 71 115 21 247 -138 -105 -181 60 140
8071 140 -250 -103 -268 82 -97 -262 -183 199 -22 -73 27 -59 -125 -75 41 -63 112 -60 -266 71 97 -6
8093 -6 44 -49 185 57 -4 9 -18 -10 25 -20 -317 127 -292 -155 107 -9 9 188 -7 -171 -211 -43 106 234
8117 234 -35 -192 13 -232 24 415 251 -205 57 199 312 -205 -57 -66 49 103 100 -76 90 69 -459 -101
8139 -101 -14 177 213 -13 -77 223 -179 -12 -92 -208 -224 -142 26 3 -18 8 189 -185 -82 360 -59 -40 -266
8162 -266 173 209 288 123 -164 -85 -173 -49 20 -250 -3 10 168 -217 26 179 129 1 256 172 57 -106 -4
8185 -4 166 247 -46 196 -6 -149
8191a49
$$ Imaginary data points
##PAGE= N=2
##DATA TABLE= (X++(I..I)), XYDATA
0 0 0 0 0 0 0 0 0 0 0 0 0 -8 8 -8 8 -10 16 -16 24 -25 32 -40 48 -56 64 -73 85 -97 113 -129 149 -169 193
33 193 -218 246 -278 311 -350 390 -438 487 -541 599 -663 734 -810 895 -988 1087 -1198 1321
51 1321 -1452 1605 -1769 1955 -2163 2403 -2674 2992 -3367 3815 -4366 5060 -5966 7203 -9001
66 -9001 11873 -17199 30495 -141284 -144294 85514 2354 -49812 -44302 -10876 5131 125279
78 125279 166956 21330 -116715 2624 153378 131702 25575 -23787 -64066 -62805 26024
89 26024 92941 -32653 -193087 -158604 -23856 4814 -16992 -16133 -27648 -23184 89656 208007
101 208007 144808 -21259 -40641 51732 69831 28025 -1480 -69282 -150889 -114550 13235
112 13235 26672 -89513 -112484 -4367 61735 66037 77269 45076 -36575 -35868 80517 132840
124 132840 35889 -44757 -19709 1905 -4178 12714 -4638 -88625 -124059 -41209 34692 -5795
136 -5795 -63662 -40867 -580 33789 101528 134743 67412 -10008 8162 59997 28831 -43652
148 -43652 -68192 -74663 -78885 -28185 27574 -2495 -70224 -59139 23476 64450 44569 29983
160 29983 10909 -19586 6843 72790 71867 -202 -38833 -2225 29967 11616 -15606 -52789
172 -52789 -105430 -94566 -9822 40341 7141 -31188 -9407 38741 65459 80115 65124 2183
184 2183 -28965 16919 55497 16442 -55257 -83822 -63383 -29663 8553 24157 -20911 -63225
196 -63225 -24694 45856 61392 22180 -10761 -6466 18065 53139 73473 27651 -45139 -48928
208 -48928 6795 36453 5007 -47480 -75759 -70843 -31372 22666 23850 -26359 -33615 27512 85097
221 85097 86381 44306 -929 -24985 -10618 35056 38966 -28005 -81632 -63330 -13461 13831
233 13831 4376 -22774 -43128 -29205 29452 68861 31710 -25052 -27324 14820 55562 62692 33835
246 33835 -11717 -36775 -10063 29780 7965 -53530 -81944 -59562 -14650 17869 17545 -8880
258 -8880 -29458 819 67001 87019 42794 -4051 -17222 -995 21840 22635 -10734 -57917 -63171
271 -63171 -10473 28692 10209 -28177 -46534 -31842 8479 42382 37253 -4466 -29512 4336
283 4336 53337 57628 27191 -6872 -22704 -6638 20120 19063 -25728 -74018 -68182 -19725 12092
296 12092 12281 -3988 -18071 -2870 38017 66323 48650 -1234 -23684 -145 24415 23770 -1110
309 -1110 -36355 -49029 -22468 17285 24722 -12234 -44625 -32206 761 23183 23123 -1757 -22681
322 -22681 -6920 35872 61301 37039 -6629 -20316 -5559 13032 16874 -9804 -50163 -59663
334 -59663 -28086 12148 17641 -8366 -20613 -5055 25081 50970 44003 5848 -23161 -14953 16599
347 16599 29157 4179 -25678 -33539 -17723 11490 22389 -2530 -34559 -37716 -6398 24537
359 24537 20523 -3680 -18260 -10520 21379 49307 39427 2213 -22433 -11937 14313 17308 -8211
372 -8211 -37242 -49280 -28211 10094 23122 2615 -20715 -14699 18234 42014 35493 9126 -18023
385 -18023 -19379 8816 27217 12051 -19812 -34676 -16774 11252 20245 4913 -24144 -37618
397 -37618 -15063 16550 23071 3676 -16725 -9710 18561 39446 36608 9710 -19638 -18649 5082
410 5082 15946 -942 -31347 -43751 -25263 3074 19378 10738 -13431 -16459 9153 35115 35558
423 35558 9488 -15418 -15558 3250 21532 18712 -9382 -30647 -19796 5144 17595 4041 -22020
436 -22020 -32317 -18824 6920 22055 8341 -12719 -9601 14151 37093 37537 12757 -11971 -17065
449 -17065 -2887 12546 3223 -25769 -39415 -26934 59 16902 8878 -9089 -15201 -432 26448
462 26448 34389 12378 -11237 -14534 2983 21907 20016 -882 -20699 -21476 393 17653 5533
475 5533 -20922 -34234 -23846 2110 17628 10730 -6523 -13067 6576 33805 37350 16697 -7459
488 -7459 -16272 -2958 12051 7362 -14850 -35263 -30498 -2641 16192 11014 -6773 -18670 -7744
501 -7744 15961 27261 16079 -7357 -16946 411 22080 24465 7007 -14785 -18979 -2358 13738
514 13738 10524 -13142 -34404 -27181 -2854 13209 10758 -5571 -13674 1167 25599 35865 20448
527 20448 -6869 -15806 -2591 11921 11738 -7712 -29268 -27844 -6270 14325 13885 -6251 -19506
540 -19506 -10410 9743 22082 13223 -8179 -15918 -2179 19625 27277 10497 -11837 -16138 -3049
553 -3049 11596 10277 -10636 -27520 -24320 -4978 13293 10143 -7269 -13509 -975 20432 31038
566 31038 18020 -4391 -14718 -5633 10892 11953 -6101 -22734 -21824 -4834 13580 12603 -4719
579 -4719 -16955 -12228 7272 20646 11324 -6727 -14660 -4464 15335 22982 10743 -6881 -14330
592 -14330 -4478 9891 7626 -8821 -23102 -22322 -4557 11338 11511 -90 -10130 -4258 14721
605 14721 24444 15658 -496 -11200 -6501 5149 8167 -2001 -17164 -21195 -6344 9713 11339
618 11339 519 -12180 -12604 926 13432 13543 1260 -9509 -3175 11861 18181 11382 -3425
631 -3425 -13318 -8476 2796 6796 -2913 -19631 -22307 -8885 5457 11565 5817 -3718 -2839 8924
645 8924 20272 18398 1950 -10711 -7356 1998 8220 3358 -11250 -19950 -13369 2307 11241 3021
659 3021 -9997 -11314 -2590 9058 13506 4707 -6770 -5845 8141 21671 17663 331 -11066 -11229
673 -11229 -2608 5958 -75 -15658 -23415 -14131 4503 12559 4153 -4710 -5355 5560 20410 21959
687 21959 6530 -10265 -12060 829 12130 7094 -6094 -15794 -14214 221 10245 3009 -12518
700 -12518 -18352 -6670 10403 14551 6630 -4975 -8793 3671 20520 20596 5438 -9398 -9821 213
714 213 5902 140 -13240 -23731 -16553 3543 13960 6867 -6021 -9158 1989 14896 18030 8751
728 8751 -6894 -10866 1580 12241 8937 -4636 -15092 -11111 1458 9563 5288 -9820 -19455
741 -19455 -10388 5536 11902 6110 -4266 -5991 3985 15282 18157 6132 -9305 -9365 1043 7990
755 7990 3035 -10156 -19728 -15053 -1512 10352 8513 -4022 -7345 1489 11543 14222 5045 -7011
769 -7011 -9349 -701 11766 12523 -1125 -12460 -10136 -866 7494 5013 -6390 -14109 -10092 3145
783 3145 11212 4907 -5394 -6090 1841 13510 17154 7246 -6618 -11025 -3438 6453 4182 -7095
797 -7095 -14352 -12186 -1859 8955 7577 -2137 -8119 -2478 10467 14889 6522 -4097 -9583 -4632
811 -4632 7251 11083 2671 -8515 -10669 -1571 6104 3221 -5179 -12454 -11301 1501 11944 9402
825 9402 -582 -6819 -493 10604 14049 8487 -2632 -10323 -5564 3750 4075 -4892 -14652 -13087 -1174
840 -1174 7590 8558 1648 -7474 -5862 6129 13282 9268 -1778 -7202 -2254 5441 8952 4152 -7426
855 -7426 -12314 -4546 4880 4914 -4099 -13129 -11370 -2593 7073 10660 3024 -4369 405 10373 14582 8145
871 8145 -3522 -9171 -5855 1572 6069 -1371 -13329 -14254 -4816 5468 7381 231 -6014 -4738 3021
886 3021 11986 10711 -834 -6877 -2081 7286 11711 5442 -4821 -10336 -7433 1880 5253 -3692 -12993
901 -12993 -12718 -3871 6224 8019 2555 -2661 -1974 7584 16342 11187 -1165 -8599 -6518 1224 5240
916 5240 746 -7975 -12761 -7235 4577 6745 -593 -7726 -7247 1174 9742 10056 2999 -5610 -4952 5787
932 5787 12344 7557 -1831 -8098 -5986 1045 3853 -1236 -11146 -14914 -5989 5421 7937 3128 -2880
947 -2880 -2734 4897 11989 11720 2412 -7314 -6415 1990 5666 2046 -5976 -10798 -6516 2139 6949 2702
963 2702 -7415 -9493 -1095 6247 8299 2963 -3840 -3784 3340 10360 9296 -639 -8152 -5262 1081
978 1081 4266 565 -8392 -12811 -7496 2719 8591 3837 -3370 -3156 3480 9768 10311 2328 -6498
993 -6498 -7249 -456 6603 4256 -5176 -9663 -6171 937 6838 3542 -4776 -8481 -3690 6030 9159
1008 9159 2839 -3431 -3811 1509 9186 9861 880 -7326 -7868 -1082 4659 772 -6303 -10470 -7645 1773
1024 1773 8127 5254 -1836 -4324 1952 9921 10290 3515 -4180 -7662 -2267 5014 4452 -3321 -9705
1039 -9705 -7916 479 5428 3285 -2836 -8175 -4705 4721 9456 5521 -1449 -4046 1709 8497 8499 2963
1055 2963 -5915 -8899 -2933 2344 1133 -5466 -10718 -7225 815 6338 6465 146 -4221 601 8219
1070 8219 10154 5352 -2608 -5148 -1511 3340 4634 -1379 -9585 -8777 -1803 3340 2538 -3761 -7833
1085 -7833 -5019 1813 8523 7294 -53 -2556 2532 8197 9577 3840 -4462 -7644 -4547 976 1934
1100 1934 -4800 -10867 -8046 -784 5288 5331 354 -3276 -1157 5695 11080 6704 -1301 -4429 -1473
1115 -1473 3705 5684 759 -6158 -8968 -4835 2580 2688 -3899 -7911 -6773 -635 6616 6721 1483
1130 1483 -2062 27 7638 10609 5179 -1945 -6728 -5529 448 2265 -2474 -8669 -9828 -2558 4825
1145 4825 4863 716 -3519 -3341 3314 8775 7478 879 -4485 -2295 4219 6069 2721 -3435 -8094 -5077
1161 -5077 1435 3148 -1358 -7769 -8261 -1453 4912 6115 3048 -2231 -1299 5256 9560 6962 -1260
1176 -1260 -6387 -4194 469 2364 -6 -6851 -9399 -3377 3840 5959 1064 -4364 -3361 1657 6538
1191 6538 7429 983 -4950 -2818 3163 6765 3369 -3726 -6938 -4665 531 3855 69 -7087 -7756
1206 -7756 -1549 5022 6637 2067 -1820 -1524 2946 8545 6820 -1152 -6320 -4795 147 3195 -44
1221 -44 -5824 -7761 -4466 3003 6709 2052 -3556 -3738 1321 6617 6462 1327 -3700 -3918 1655 6632
1237 6632 4013 -2983 -7203 -5563 -286 2529 -84 -4960 -6959 -2458 5123 6957 3027 -1283 -1864
1252 -1864 2652 7051 6484 1224 -4948 -6194 -1075 2400 -124 -4887 -7362 -4726 1324 4730 3222
1267 3222 -1488 -4143 487 6297 6731 2891 -1638 -2884 1101 4732 4131 -757 -6942 -6337 -1331 992
1283 992 -381 -4571 -6741 -3152 3146 6770 5167 -248 -1860 2680 6186 6254 2050 -3736 -5092 -1669
1299 -1669 1656 1100 -4218 -8031 -5206 -87 3547 3104 -1588 -3875 -1029 3884 7340 4424 -1013
1314 -1013 -1775 1398 4846 5086 157 -5731 -6883 -3244 1471 949 -4633 -6703 -4261 591 5552 4949
1330 4949 677 -1459 872 5803 7333 2443 -2720 -4376 -2214 2243 2779 -1772 -6188 -6928 -1699
1345 -1699 3296 2015 -1614 -3893 -2589 2533 6488 4531 -82 -2671 210 5224 5759 1805 -3319
1360 -3319 -5965 -3659 860 1079 -2822 -6176 -5294 418 4705 4000 1349 -2070 -743 4327 6533 3949
1376 3949 -1669 -4779 -2144 1935 2625 -111 -4284 -5507 -1602 2469 2581 -1277 -4802 -3102 2005
1391 2005 5271 4935 842 -3054 -756 3722 5214 2339 -3136 -4952 -2329 315 1416 -1310 -5945
1406 -5945 -5194 -122 4302 5008 1373 -1686 -822 2658 5158 3647 -1510 -4275 -2387 1396 3013 68
1422 68 -4325 -4840 -2065 1973 3720 -23 -3530 -3224 1095 4867 4604 1121 -1703 -929 2089 4785
1438 4785 2260 -3025 -5499 -3666 312 1878 -837 -4173 -4811 -1416 3755 5350 2119 -1180 -951
1453 -951 2329 4856 3619 -613 -3964 -3790 228 3159 472 -3355 -5305 -3508 842 2656 531
1468 531 -2228 -2982 405 5141 4885 1988 -1129 -1407 1730 3970 2841 -1318 -5134 -4828 -477 1131
1484 1131 -926 -3302 -4481 -1643 2536 4355 2703 -746 -1433 2111 4872 4083 860 -2736 -2980 -194
1500 -194 2085 1658 -2748 -5309 -3626 312 1565 40 -2531 -3625 -290 3815 5818 3488 -725
1515 -725 -1176 1785 3665 3099 -645 -4373 -4106 -1479 1295 351 -3886 -5201 -1901 1563 3828 2618
1531 2618 -719 -1549 534 4383 4934 1170 -1918 -2183 -37 2628 2379 -1840 -4989 -4323 -713 2155
1547 2155 580 -2492 -3779 -1514 2361 4932 3351 30 -779 812 4051 3972 -242 -3487 -4027 -1814
1563 -1814 1544 1155 -1872 -4396 -3226 828 3489 1945 -744 -1856 -766 3006 4291 1889 -1371
1578 -1371 -2573 -182 2718 2352 -441 -3268 -4152 -1237 1922 823 -1490 -3650 -1768 1764 3725
1593 3725 2715 169 -1566 27 3235 3315 693 -3157 -3783 -1454 1204 939 -446 -3106 -2947 656
1609 656 3334 2435 -381 -2525 -591 2243 3419 2621 -1021 -3184 -1097 1639 2325 116 -3427 -3289
1625 -3289 -882 1611 2079 -308 -3221 -2305 1374 3860 3038 185 -1248 -302 1514 2961 892 -3334
1641 -3334 -4452 -1818 778 1556 -762 -3053 -2623 -178 2905 3441 446 -1928 -1291 1960 3914 2382
1657 2382 -889 -2273 -1847 777 2278 -94 -3530 -4046 -1831 1170 1799 -148 -1814 -2239 441 4154
1673 4154 4182 1046 -866 -596 1907 3008 1310 -1613 -4030 -3208 114 1273 -624 -2761 -3009 -771
1689 -771 2405 2463 1184 -1100 -1268 1784 4152 2811 125 -1434 -1323 1001 1992 630 -2552 -4419
1705 -4419 -2624 614 838 -276 -2168 -2201 533 3079 3833 1824 -897 -216 1892 3085 1644 -969
1721 -969 -3090 -2553 -321 834 -293 -2884 -3709 -1115 981 1901 974 -1069 -1342 1067 3330 3887 844
1738 844 -1192 -464 1081 1914 725 -1742 -3840 -2886 -279 1101 -150 -2525 -2091 -125 2384 3262
1754 3262 1616 -660 -710 1406 3104 2576 -451 -2214 -2102 -487 1363 681 -2381 -3164 -2117 381
1770 381 2040 339 -1084 -1501 -252 2710 3286 1186 -737 -985 814 2529 1454 -993 -2919 -3073
1786 -3073 -954 1242 212 -1689 -2239 -1076 1841 2607 1436 -85 -1341 148 2476 2646 187 -2000
1802 -2000 -2000 167 1419 667 -824 -2922 -2341 282 1781 835 -891 -1708 -157 2009 2655 1783 -398
1819 -398 -1085 321 2150 1494 -370 -2681 -2745 -953 736 813 -914 -2146 -662 1566 2462 1897 -477
1836 -477 -1213 -87 1762 2241 663 -2083 -2319 -405 900 946 -775 -2883 -2107 -181 1672 1613 -903
1853 -903 -1957 -401 1790 2875 2177 -280 -1220 -218 1334 1861 -176 -2895 -2700 -1322 408 534
1869 534 -919 -2344 -1618 748 2873 2100 -34 -563 14 1577 2729 1137 -1280 -2230 -917 905
1885 905 1147 -1177 -2576 -2499 -1072 1153 1209 -332 -1362 -990 1589 3144 1981 364 -515 -142 1402
1902 1402 2017 182 -2039 -2885 -1597 417 140 -1113 -1954 -2188 77 1990 2047 674 -497 -22 1875
1919 1875 2637 1675 120 -1484 -923 648 1031 -572 -2677 -3024 -1076 105 396 -155 -1610 -997 935
1936 935 2685 2481 699 -637 332 1717 1844 1216 -1027 -2600 -1533 -29 155 -767 -2691 -2277 -379
1953 -379 1012 1900 326 -1113 -404 1559 2700 2295 59 -636 -386 720 1426 466 -2192 -2950 -1501
1970 -1501 -276 454 -900 -1879 -1489 150 2197 2646 795 -541 -170 1219 2289 1379 -551 -1647
1986 -1647 -1090 81 1036 -404 -2513 -2445 -995 535 1203 201 -1190 -933 248 2249 1889 390 -511
2003 -511 -263 1221 1805 904 -917 -1996 -1739 41 479 -492 -1359 -1764 -294 1451 1668 759 -379 -659
2021 -659 950 1922 1462 -411 -1751 -1028 480 892 231 -1017 -1999 -1211 634 907 326 -1075 -1069 803
2039 803 1802 1927 541 -1232 -792 1086 1462 838 -841 -1903 -1207 -138 193 40 -1243 -1805 63
2056 63 1406 1831 979 -681 -606 476 1378 1388 -128 -1647 -1413 70 607 442 -1275 -2278 -1045 354
2074 354 1483 725 -817 -1099 156 1459 2047 970 -477 -594 242 1095 1094 -1041 -1939 -1755 -450 344
2092 344 46 -1313 -1688 -801 829 2245 1076 -150 -362 511 1578 1458 150 -1088 -1401 -765 780
2109 780 325 -1205 -1940 -1736 -288 943 336 -415 -738 -110 1874 2073 1007 66 -620 219 1227 738
2127 738 -281 -1603 -1907 -1094 462 -355 -814 -1451 -875 683 1777 1260 429 -248 606 1781 1752 645
2145 645 -661 -1253 -287 510 261 -754 -2279 -1910 -393 541 37 -415 -988 -131 1675 2093 1623 286
2163 286 -627 333 1287 1068 274 -1204 -1557 -859 -47 -145 -1333 -1918 -1500 203 963 1217 112 -753 406
2182 406 1164 1858 1159 -546 -748 -196 610 743 -490 -1913 -1733 -662 118 378 -660 -1385 -917 598
2200 598 1866 1501 376 -415 147 1171 1358 408 -965 -1477 -709 536 413 -677 -1697 -1537 -564 1095
2218 1095 974 -50 -237 -183 943 1856 1286 -138 -969 -396 1102 708 -588 -1143 -1770 -627 754 470
2236 470 -404 -916 -822 194 1418 999 121 8 -347 788 1379 529 -644 -1481 -800 331 668 -57 -976
2255 -976 -1432 -269 939 1088 24 -840 -671 693 1249 1098 -23 -1071 -672 643 618 174 -1105 -1498
2273 -1498 -534 358 755 319 -770 -1034 516 1220 1198 549 -794 -371 254 911 507 -871 -2044 -1129
2291 -1129 -47 487 235 -1050 -1205 -485 878 1145 635 -689 -234 360 1163 1548 235 -712 -648 -144
2309 -144 570 309 -1300 -1705 -1262 23 746 -98 -799 -825 -184 1299 1896 810 -21 -23 409 1507 832
2328 832 -452 -1399 -1174 -253 543 63 -905 -1147 -830 318 965 269 -30 -382 558 1430 1319 702 -238
2347 -238 -382 243 564 129 -839 -1800 -1403 -94 139 -150 -802 -960 -383 1038 917 776 -107 -334 811
2366 811 1192 941 6 -1093 -861 -268 201 -114 -910 -1693 -816 307 353 320 -241 -441 485 1124 1290 1156
2386 1156 -295 -565 619 601 607 -409 -1331 -1243 -318 475 83 -910 -1356 -336 518 1236 814 -170 -416 247
2406 247 818 1322 89 -615 -662 -43 716 400 -480 -1378 -1073 -97 693 417 -683 -623 -71 888 1280 441
2426 441 -286 -682 60 865 779 -269 -1249 -1170 -639 330 360 -433 -906 -709 289 960 377 -162 -371 -273 738
2447 738 834 407 -501 -669 -63 601 354 -435 -868 -748 -82 665 410 -129 -474 -256 796 1034 589 -288
2467 -288 -703 -132 733 458 -201 -985 -1391 -379 639 407 -168 -824 -547 519 969 895 91 -539 38
2486 38 590 814 537 -408 -928 -316 260 350 -177 -1107 -888 -371 677 649 195 -543 -250 541 974 1097 44
2507 44 -509 -92 352 852 45 -850 -1189 -565 79 461 -53 -595 -619 17 898 1024 75 -506 47 243 845
2528 845 912 -428 -491 -746 -296 386 -197 -1287 -969 -548 255 705 -117 -348 -282 129 1095 731 408 -140
2548 -140 -194 589 796 105 -428 -915 -1139 -51 41 -555 -846 -1287 -68 754 933 334 130 -202 657 1608
2568 1608 441 273 -574 -289 432 297 -72 -625 -1319 -614 156 310 -40 -235 -605 245 842 926 567 -79
2588 -79 -93 492 997 361 -271 -921 -534 -258 398 -280 -895 -1175 -556 461 641 225 -173 -435 440 1009
2608 1009 778 185 -260 -213 82 467 117 -326 -870 -704 67 299 256 -743 -538 -159 754 1105 375 -290
2628 -290 -275 134 961 720 -117 -623 -192 -172 648 133 -681 -1074 -415 7 841 333 -373 -350 -202 648 912
2649 912 -28 -367 -565 -64 528 257 -243 -659 -501 75 421 -159 -434 -398 -119 386 806 467 -246 -102
2669 -102 -386 728 575 -153 -538 -483 -58 427 246 -464 -743 -655 406 757 134 -245 -404 -181 346 470
2689 470 287 -406 -507 139 212 111 113 -759 -643 -401 438 390 -156 -340 117 759 805 322 -84 -610 140 555
2711 555 149 234 -847 -375 -182 -51 470 -72 -744 -245 194 617 945 43 -361 238 696 786 612 -515
2731 -515 -456 -257 -39 299 -151 -814 -876 -326 227 393 1 -265 -281 548 895 414 -229 -128 166 702 503
2752 503 31 -489 -694 -161 33 -23 -529 -651 -682 -155 373 578 -246 -174 2 554 751 273 62 -175 -38
2773 -38 363 245 51 -244 -765 -476 211 -21 -334 -506 -269 288 710 726 -45 -172 204 532 660 256 -400
2794 -400 -452 -66 73 154 -138 -614 -1022 -193 337 97 64 -324 -101 391 800 388 100 -101 22 388 316
2815 316 39 -678 -749 -309 20 24 -339 -548 -658 -222 292 295 -144 -436 -119 123 693 569 -51 -646 -118 -22
2837 -22 445 81 -689 -527 -492 155 309 9 -278 -77 364 482 703 41 -294 -124 362 182 150 -213 -761
2858 -761 -231 -200 366 48 -429 -443 -210 423 412 -143 -111 -66 -38 740 201 -317 -85 -449 -184 383 96 -317
2880 -317 -302 4 200 390 167 -319 -170 158 566 186 196 -330 -446 179 309 86 -461 -97 -622 163 192
2901 192 -220 5 -420 40 616 407 250 -188 -127 62 247 293 -207 -491 -700 5 322 147 -178 -484 -146
2922 -146 330 164 360 -10 -121 259 422 354 414 -116 -473 -45 248 126 -174 -483 -401 -190 98 168 -72
2943 -72 -180 -24 77 518 471 -164 -101 45 560 389 104 -534 -133 -106 26 -8 -262 -279 -135 -88 84 266
2965 266 -4 -70 18 395 714 425 62 -191 246 300 54 -366 -703 -328 -275 385 51 -380 -330 -376 301 386
2987 386 305 -70 -173 148 457 371 216 -76 -355 -14 182 130 -357 -513 -83 48 281 66 -210 -173 -336
3008 -336 511 506 126 52 -289 322 611 397 110 -206 -597 111 451 -43 -497 -439 -278 15 363 -140 -353
3029 -353 -717 121 467 595 507 -179 -425 47 240 205 -12 -355 -533 -37 58 153 78 -451 -438 186 398 142
3051 142 -213 -181 135 504 398 184 -358 -177 -231 -100 506 20 -421 -165 -68 227 296 -182 -292 -136 196
3072 196 513 235 -290 103 -362 -86 418 114 -370 -223 63 338 498 -271 -309 124 226 -24 153 -315
3092 -315 -200 -11 -14 199 107 -197 -325 -196 350 354 -201 -172 53 213 574 10 -188 -229 -33 30 142 114 -382
3115 -382 -191 -273 308 -86 -76 -84 -344 -157 347 78 206 -103 -250 358 353 512 161 5 -236 418 334 72
3137 72 -52 -449 -364 49 482 -143 -436 -473 -12 402 384 211 -208 -37 169 104 261 47 -327 -294 29 220
3159 220 -106 -590 -763 -394 151 45 321 -167 -101 -16 286 343 20 -98 173 0 65 171 98 -299 -155 -114
3181 -114 -142 -184 -470 -364 -165 125 241 228 24 -10 121 471 337 140 -166 -58 181 63 -70 -312 -468
3202 -468 -426 -62 103 -66 -412 -109 -61 466 664 86 -71 -66 -41 491 406 -52 28 -27 -32 -15 -18 -218 -463 -156
3226 -156 345 75 -40 -146 -143 -6 627 482 86 -13 -178 110 177 260 -324 -267 -418 -120 179 122 -387 -501
3248 -501 -107 264 271 17 -3 0 66 164 311 100 -113 -103 -163 -86 312 -173 -324 -175 121 101 -63 -180 -398 -44
3272 -44 192 390 142 -354 -22 71 145 361 -158 50 -93 -215 150 133 5 -64 90 -51 190 56 -212 -64
3294 -64 -13 -46 195 86 -293 -271 -202 147 345 -244 -290 -181 131 454 -60 313 -55 -34 93 456 6 -220
3316 -220 -225 144 29 -3 -113 -61 -276 -48 246 23 -405 -311 41 87 367 88 -146 3 -78 412 -48 -144 -60
3339 -60 -278 -418 250 -230 -186 -48 -366 -142 58 156 45 -154 -55 168 379 113 -155 17 -124 443 12
3360 12 -126 -384 -541 -270 228 -32 -75 -101 1 293 128 150 55 -284 282 170 -123 76 -227 -146 -163 -200 -115
3383 -115 -62 -171 -179 23 119 218 -98 -101 -288 123 98 206 75 -171 -145 330 132 -143 -109 -163 -94 -367 -80 47
3407 47 -96 -319 94 184 279 134 -22 -61 104 149 436 -104 -424 69 -60 255 -80 -246 -489 -178 -17 394
3429 394 -117 -263 -50 9 228 326 -155 -142 8 234 367 72 94 -308 -182 255 91 -65 -129 -460 -266 199
3451 199 80 169 -105 -159 -22 15 77 115 -384 -21 328 126 37 -253 -97 -293 188 77 59 -288 9 -41 70
3474 70 426 -27 266 -37 -22 197 215 140 -321 -186 66 442 130 -216 -53 -69 348 179 -59 -81 -54 -97 -28
3497 -28 210 -199 -530 -11 -19 110 136 -29 -216 -143 -52 59 -102 -17 -113 -10 98 431 39 -443 -89 -82 -134 -166
3521 -166 -104 -215 -169 -288 389 -197 -56 -431 128 -25 211 122 117 217 187 360 55 -5 -162 -229 292 -54 -242
3544 -242 -191 -454 -90 -176 572 78 233 119 156 136 263 124 -48 -14 -43 293 188 -186 -265 -582 -18 68 5
3567 5 -24 -95 -393 321 389 24 105 -131 105 529 342 330 174 -282 -242 104 38 -34 126 -213 11 230 207 212
3591 212 -307 1 257 305 252 238 -66 350 125 214 0 60 -156 -221 125 40 -78 -277 -301 121 52 119 -39
3614 -39 -16 -140 154 49 -104 -29 30 179 -282 42 -175 -59 -141 -245 -78 -205 -221 50 -156 329 328 101 -228
3637 -228 -13 114 59 179 -14 -83 -345 65 -84 -90 -266 -156 -197 -247 309 78 -248 15 -110 198 99 -194
3659 -194 75 -144 -27 239 88 101 -316 -247 24 89 220 -279 -334 33 91 265 278 -188 -143 -87 -35 28 209
3682 209 119 -207 -29 205 -35 85 -172 -182 56 -82 -26 408 4 -20 -26 0 -7 230 -468 -219 14 -158 -81
3705 -81 -76 -247 -119 247 33 36 -243 -52 143 255 36 -111 205 -253 151 31 227 -22 -368 -203 -12 119
3727 119 -52 41 -185 -234 279 278 -101 281 -106 14 297 -21 89 -114 -134 -199 107 -160 -380 -201 -171 39
3749 39 194 -65 -123 36 130 103 356 136 -30 265 188 161 152 -117 -174 -246 116 -25 -238 -19 -63 18 -33 100
3773 100 152 46 282 -69 380 352 135 173 -157 -258 172 -90 -92 -149 -321 1 215 -318 -211 -90 28 447
3795 447 -51 50 3 191 328 195 193 -34 -28 -100 46 -6 -135 -248 -292 -193 -182 112 52 19 57 244 191 144 -57
3820 -57 116 123 83 51 283 -118 -94 -38 248 209 24 -163 133 -3 68 158 -167 -58 234 246 247 271 -21 -62 -249
3845 -249 104 95 211 -161 -84 -71 -14 195 115 64 -60 -200 238 307 164 -122 -28 16 327 328 -263 25 -278 -47
3869 -47 158 302 -156 -157 -54 -34 193 119 -22 -189 -108 -11 112 -14 83 -350 133 400 282 279 -155 -280 164
3892 164 318 -102 -109 -80 85 6 206 -262 -341 -188 -110 44 80 100 -223 -222 -190 -44 87 -109 151 166 139 80 264
3917 264 -205 -58 -40 -107 -71 58 -543 -25 112 8 150 108 49 56 259 67 146 -186 163 251 296 151 -53
3940 -53 -170 -48 5 112 40 -104 -98 -61 -75 90 76 -233 12 -36 260 215 219 -10 142 64 -107 -25 -2 -277 -222
3965 -222 -195 46 -57 -148 -190 -61 5 2 65 -127 -110 224 -254 101 202 162 0 148 46 186 37 22 -200
3988 -200 165 -70 -294 -59 -93 -69 7 -156 142 50 -122 -34 -42 103 28 -148 -41 82 116 -143 -100 -3 -263 12
4012 12 -238 10 180 40 -219 -110 201 116 122 45 -6 21 115 50 -48 -217 -66 83 29 353 -297 -10 78 25
4036 25 -130 -246 -40 -16 346 104 128 322 -35 -128 34 -20 415 62 -121 -145 -145 83 96 -171 -13 112 47
4059 47 152 149 -56 43 127 -98 95 248 -102 29 -178 152 29 2 -2 -192 63 97 -116 -79 -106 14 162 -70
4083 -70 -39 117 -14 -97 235 -149 143 35 3 83 178 -158 -271 -40 -120 -143 67 187 10 -219 -161 -75 181
4106 181 63 -172 311 -18 306 -70 -131 -111 -195 129 12 170 37 -25 275 213 -26 188 67 40 168 -58
4128 -58 -30 237 147 -400 -155 143 54 202 -36 -81 152 5 -75 -277 4 202 -102 4 97 -28 -177 -79 -46
4151 -46 178 123 -145 48 -109 207 86 13 -95 42 14 183 -2 -84 55 -157 -30 49 37 -1 12 -162 46
4174 46 103 26 59 -30 155 611 41 227 246 159 160 80 35 -169 -58 -97 -118 55 88 109 281 -104 117 174 14
4199 14 25 -45 253 -247 -57 -9 -20 134 -210 -32 80 5 -175 -130 -23 -96 -1 -15 29 -176 3 243 -58 200
4223 200 -89 -6 102 21 -72 148 -177 -116 24 161 -5 -265 73 -55 -234 -49 -165 -163 50 -130 -2 10
4245 10 254 208 175 43 334 -79 -119 -233 -184 -103 119 -123 0 216 -84 -78 -19 -80 63 47 -239 56 -113 177
4269 177 98 15 9 -131 23 216 54 141 0 154 -113 -402 238 -133 17 -153 145 26 54 247 90 -88
4291 -88 -70 201 -186 -78 84 -64 91 106 143 23 87 177 -2 56 294 -47 -161 -51 -49 224 256 117 -151
4314 -151 -61 187 213 -32 136 193 -122 -161 -192 93 -86 -123 -142 101 144 -116 -125 -400 4 185 -44 384 6
4337 6 -157 -30 155 120 -151 -188 -352 100 -62 -46 -177 -213 -242 51 -289 -317 90 -275 106 188 -125 -109 155
4360 155 92 213 -150 265 275 -234 -36 -186 -381 -237 -85 -36 113 -76 209 176 -58 73 97 -21 484 -35
4382 -35 -180 31 -187 181 62 -122 -187 86 -43 -284 263 -395 -214 -239 -121 280 -127 90 19 179 43
4403 43 260 -25 -98 241 171 245 280 -89 -51 -3 -32 30 314 -108 -201 -203 68 -30 39 -9 40 -273 118 154 60 169
4429 169 21 207 69 69 135 -96 -118 -178 -40 -28 279 -143 177 -266 53 222 -119 142 -50 110 191 -105
4451 -105 154 -21 -130 -203 -40 136 -173 -88 -12 54 -142 141 33 86 5 -118 -113 -294 -196 64 228 109 132
4474 132 -173 25 27 -242 76 -161 139 -119 94 4 -150 -107 152 -13 64 -49 44 -29 167 100 27 74 224
4497 224 -128 225 -34 48 -93 -92 -205 -53 27 124 -108 46 -107 -122 74 66 231 -135 -106 -92 -4 66 -190 214
4521 214 134 -119 145 101 -42 -144 82 -215 30 -99 -56 12 -25 116 -15 -72 116 77 -38 96 -11 141
4543 141 -88 -121 -69 -37 33 -104 -260 -74 -124 -182 44 572 -77 242 -172 78 176 127 133 42 142 -209 0 -272
4567 -272 34 -93 120 75 -216 -138 -138 -112 -83 46 44 99 22 -66 123 199 67 -10 -78 48 -296 -163 -147 8 -36
4592 -36 -141 68 -284 -229 162 156 45 -46 -59 24 224 -115 286 276 176 90 234 189 39 -118 -123 10 95 -7
4616 -7 -194 -163 -106 93 290 155 -191 -199 10 198 321 131 99 112 228 -59 186 -5 -96 3 -147 15 -4 31
4640 31 161 113 101 16 183 106 203 -87 -37 117 135 387 49 -164 332 152 -182 -57 -277 -254 64 -15 -92 -103
4664 -103 27 83 145 -68 95 -23 98 388 90 -9 156 154 -73 39 166 -147 -229 -116 -196 274 -67 -246
4686 -246 7 -141 -74 16 73 11 118 43 -190 199 308 179 -23 -58 142 -69 178 99 -181 77 -39 113
4708 113 -203 -105 -84 -97 35 -158 121 -172 -80 -149 122 84 91 106 143 205 39 3 -40 -98 149 38 166 115 -190
4733 -190 34 45 37 -42 34 220 119 207 15 313 -55 -218 -114 -50 -41 -317 -165 75 17 105 -138 113 -59 -75
4757 -75 -136 322 97 -55 -65 -280 146 22 -16 32 -145 55 -174 -84 -2 145 -221 -78 98 121 -246 -10 -53
4780 -53 18 100 -185 -22 73 -171 -333 131 -18 -108 -100 90 -39 68 -343 64 -161 -111 -130 152 163 -24 145
4803 145 -80 -12 104 257 -109 62 -2 -49 198 -92 -42 117 -113 -90 210 -301 -170 137 39 90 -36 -263
4825 -263 323 -71 174 194 143 -78 -56 61 -201 -176 -25 88 -183 -93 -81 -64 169 384 18 22 178 93 97 22
4849 22 121 -54 62 -2 77 -126 110 -185 -64 74 -166 41 -44 -461 -329 -22 -105 123 -58 168 99 31 98
4872 98 -17 -31 -88 -361 -180 148 83 110 70 86 -48 92 95 11 156 68 2 42 47 163 67 0 9 3 59 144 -19 -22
4900 -22 17 39 -75 -230 2 -28 -87 -134 -28 114 -91 45 -55 -1 115 130 -91 71 116 -167 -51 265 -67
4923 -67 -146 126 -317 155 65 -60 3 3 -186 -325 -109 150 -36 114 8 -15 -153 -5 474 20 -238 -247 28
4946 28 -235 57 233 139 -104 -26 157 -160 -125 50 -126 -70 -200 330 284 39 211 -115 60 -71 32 74
4968 74 -109 47 117 117 7 277 -179 141 32 15 97 -88 -20 103 -1 -101 130 169 22 105 118 -116 120
4991 120 -75 -73 -73 -86 174 -169 -411 177 -83 -100 -44 -146 -22 -79 -102 41 260 -97 34 -56 206 -261 -8
5014 -8 -185 130 132 -16 79 69 -181 127 -52 -26 30 -18 33 32 111 -202 165 -48 146 -230 217 19 -200 -76
5038 -76 -101 20 44 30 -78 -193 -104 -216 -39 119 -144 181 52 -138 131 -300 -98 128 -208 61 -196 -17
5060 -17 61 31 303 19 -116 -6 91 -160 11 42 -47 32 -11 116 69 -137 -113 88 -77 144 71 -100 -103 6
5084 6 -164 11 -196 -80 -269 239 99 174 229 -9 -247 83 83 13 -182 -68 162 -70 -2 217 -63 -78 -69 318
5108 318 138 -12 -105 182 55 98 141 65 -14 119 49 -53 259 104 -244 -44 142 63 117 147 -53 -6 128
5131 128 -321 78 -93 -166 52 37 -120 -45 -170 -21 -150 219 79 -14 76 51 -107 -55 -170 -11 -143 -6
5153 -6 -21 -126 -143 4 -181 -66 153 105 191 -50 59 -185 30 223 -124 -226 49 -199 -33 -208 119 101
5175 101 110 8 -71 -254 148 15 -122 139 100 42 38 -86 145 29 93 23 -80 238 -176 -96 320 -253 164
5198 164 -61 -159 5 -203 -309 -69 -132 -228 22 -80 -218 52 -94 37 249 -42 103 89 -63 -256 173
5219 173 -163 97 -175 -34 -485 96 -169 -189 -42 11 206 -147 44 -98 -41 -218 4 254 31 -122 -195
5240 -195 163 198 63 -174 77 5 -170 8 -392 44 39 187 123 37 279 81 -223 86 144 -378 -259 151
5262 151 65 277 -211 -207 -186 -213 78 34 27 50 202 266 131 93 94 -288 -20 -259 227 62 32 163 134 -64 -99
5287 -99 -79 -196 -177 -105 24 130 -117 90 186 -64 -11 -73 67 63 9 -239 122 -148 117 -281 -11 -131 -132 -21
5311 -21 -179 22 33 -36 59 -170 143 -251 -5 114 -92 123 83 125 102 -94 -53 -74 -232 8 45 122 -20 54
5335 54 113 11 29 60 79 -35 100 95 207 -285 -225 8 -250 -30 -146 -45 22 75 -59 -166 205 19 21 145
5359 145 217 35 -300 166 75 104 -236 -23 166 122 -134 68 -122 -17 -8 -15 -84 -91 184 -118 122 -329 -144 -263
5383 -263 -4 112 -73 -89 73 82 120 47 13 12 107 26 115 135 -72 -67 213 214 -68 69 -185 -99 -65 72 118 118 147
5410 147 11 -41 44 90 -181 -174 -286 268 51 -170 -100 -111 194 61 55 80 33 -42 66 -16 -162 64 62 59 -90 31
5436 31 34 9 -71 106 149 -71 -40 -32 65 264 15 57 -62 -89 262 193 -142 -140 174 -10 10 304 -282 41 366
5461 366 45 107 -181 80 -143 -71 62 29 108 -115 69 288 107 69 52 -76 47 -87 97 -214 433 213
5483 213 79 62 120 -67 71 38 -94 -128 96 -87 17 92 -7 -68 77 -195 108 -6 -8 141 -222 39 174
5506 174 111 97 -259 74 -77 -312 319 -46 224 -62 -191 139 64 -187 49 119 -39 -4 -2 224 155 -157 -37
5529 -37 355 70 121 109 -81 69 234 290 -184 -140 68 410 -65 76 -210 -111 201 -132 305 388 -161 -97 232
5552 232 99 47 -14 -170 215 101 -166 110 -93 33 -69 15 -125 -33 224 -77 131 79 -589 139 -174 -30
5574 -30 -83 8 -63 35 -46 -230 -78 79 -143 -457 149 -190 140 -233 -168 84 32 5 -70 -253 -8 264 183 117
5598 117 292 137 -81 57 111 -89 -22 -273 -256 -19 99 -58 150 -9 -26 67 -203 10 -88 212 -82 77
5620 77 -236 -304 -73 -259 147 -144 220 -162 104 86 -102 -376 -44 79 140 139 249 140 200 -74 -93 256 106
5643 106 95 161 -13 75 40 -34 94 -114 -26 64 64 -3 48 -20 152 -62 259 15 -132 103 351 243 -8 196
5667 196 -33 -183 -16 56 -62 26 36 -362 -118 88 0 152 -156 249 -180 -65 -381 80 -87 -86 46 217
5689 217 -70 -168 -204 -29 26 107 -78 -316 -59 -150 140 111 131 122 -92 -133 -27 -255 -3 271 -260 44 -46 -252
5713 -252 77 -231 24 -73 44 52 -283 129 149 60 -71 65 444 -30 -55 144 71 169 -54 28 -18 -54 -68 -31
5737 -31 264 -304 106 161 144 1 -144 180 -107 217 -20 -30 -246 -133 -75 -64 -111 -92 189 117 117 192 9 75
5761 75 -61 71 75 77 -49 66 56 158 -59 -129 2 41 -38 167 53 -2 161 -50 -103 -206 67 60 -121 -78 203
5786 203 -281 117 42 -106 161 80 -15 244 354 -13 36 93 -28 238 -37 -56 -208 55 222 175 159 -76 -235
5809 -235 -225 -150 156 96 59 6 -8 394 -142 -45 -243 85 -207 -10 81 0 -167 133 74 23 -204 -7 -243 -19
5833 -19 143 64 129 267 37 -35 217 -10 103 -172 -68 29 188 -277 202 3 -88 -261 403 -231 42 -98
5855 -98 9 87 28 98 71 33 64 178 -122 43 -251 230 -41 -185 -59 68 -87 -149 -215 -212 -128 -241 -187 165
5879 165 186 126 195 -126 62 -40 -142 98 165 -105 -196 -102 -230 104 -110 -175 -209 -117 72 51 -129 -318 -125
5902 -125 107 40 13 32 351 175 142 60 122 154 -105 -78 -139 -189 -183 30 76 -201 -158 107 -185 201 -91 45 32
5927 32 -35 -35 9 119 -75 94 98 39 -29 -53 -24 36 208 70 -214 83 33 29 -29 1 -207 -5 221 -293 94 -113
5953 -113 37 297 -159 113 177 -201 107 85 -6 -18 314 -191 161 102 -30 8 -64 -109 102 -160 46 -5 -2 73
5977 73 -31 78 127 -58 163 181 -81 175 203 -104 119 -89 -21 86 -44 117 -69 -80 -81 0 111 -186 -105
6000 -105 53 135 -186 -229 -218 -216 102 9 75 -223 -229 6 -185 40 235 -161 20 212 95 272 -70 132 -166
6023 -166 130 159 -146 -77 25 150 77 138 -28 -132 122 308 5 -110 148 -160 169 183 -11 -41 -177 74
6045 74 36 -176 75 120 -272 119 45 -71 195 -15 233 -73 172 33 59 5 306 -33 191 -246 25 182
6067 182 -9 0 6 157 -196 -214 -332 -156 -113 50 7 130 131 107 -32 129 -27 166 15 -181 165 103 -37 -220
6091 -220 -111 -272 -15 45 -353 112 -21 50 -158 194 322 144 245 103 -209 149 -26 -378 16 94 105
6112 105 -185 139 74 40 -25 133 -169 -7 -149 -118 -62 -213 -139 -243 110 4 91 271 22 -323 106 44 101
6135 101 174 396 15 126 38 222 -97 170 -11 73 455 34 -3 174 198 126 -47 100 345 57 221 -93
6157 -93 -50 71 276 153 -165 -137 -15 12 -142 222 56 -15 165 -62 207 30 305 -158 -49 -25 372 -25
6179 -25 50 8 127 -22 -173 185 -212 -29 -62 122 194 -378 42 -19 -155 34 -109 152 -15 34 -170 -128 -7
6202 -7 131 -148 -281 52 -150 30 42 -73 164 112 -86 45 98 62 84 -166 -24 -50 24 126 182 38 98 -104
6226 -104 113 226 106 -62 -66 79 142 43 6 128 -91 -109 153 197 159 98 86 291 -154 228 -146 -127 72 102
6250 102 -134 -19 144 55 105 -85 113 -4 172 -9 -133 308 -1 92 123 142 32 114 385 70 141 251
6272 251 -29 119 -193 -19 -70 -125 -29 158 -203 10 62 2 -55 -27 -73 251 79 -46 32 -36 -137 122 81 21
6296 21 52 304 19 99 217 -73 34 137 -58 6 -9 -126 -136 -29 224 137 -33 -62 -31 -261 -5 242 77
6319 77 -131 102 -385 68 152 104 -77 -94 -120 185 125 -53 51 -5 229 105 112 28 97 -101 -160 397 -41 -62
6343 -62 137 65 -126 -47 116 -11 38 62 -7 6 -218 -98 -30 140 30 232 -51 -274 -133 85 -87 -176 157
6366 157 -308 -69 -58 34 160 -125 -14 195 -12 7 18 176 -59 84 121 93 172 -164 -67 112 -65 118 -112
6389 -112 182 -117 22 177 66 -158 -178 93 -6 -49 -173 -65 17 223 -166 353 196 17 100 60 -8 -125
6411 -125 13 14 -155 4 -107 29 -140 -156 -2 285 318 -220 -112 181 158 -104 162 -55 -199 -213 41 118
6433 118 -89 27 40 56 -148 -167 114 -81 228 -5 -30 56 -62 24 -74 -244 6 125 -16 41 -5 128 67
6456 67 -48 -256 5 -66 237 7 -105 -33 302 75 -123 389 -4 157 220 -102 58 -222 146 -4 -51 31
6478 31 -164 87 -57 -264 -62 267 -234 -11 -63 329 160 102 182 -108 -105 -240 194 -60 -415 21 115 -62
6500 -62 -226 25 -3 54 -66 95 -38 -41 -91 -5 119 -4 -15 204 36 -215 111 -129 110 28 -163 -250 260
6523 260 26 151 -101 -271 65 -288 103 -85 -59 60 46 7 98 12 -189 -36 109 99 0 -229 -321 75 -131
6546 -131 52 70 64 -86 30 157 -164 -11 164 245 69 -315 149 -216 245 -164 30 123 3 163 -34 -4
6568 -4 -169 -12 -24 28 73 193 -3 149 115 153 -71 -352 -86 43 139 4 -15 0 -203 -22 140 197 204 -61
6592 -61 -157 -210 225 -16 -56 -42 149 340 165 -24 -194 75 -15 49 -16 -74 68 -174 -55 -48 -36 89 16 -172
6616 -172 132 81 -43 152 451 -112 144 27 -3 -59 -211 193 -344 169 -63 193 -171 187 -98 90 -141
6637 -141 -149 -78 130 20 -205 -17 90 -13 -177 -25 80 19 -58 -14 -31 -206 -123 -242 117 -20 -126 -152 -80
6660 -80 -147 36 127 65 298 -130 31 96 201 126 58 181 -125 7 32 248 162 209 132 52 -62 58 -27 -43 -109
6685 -109 -288 59 142 -196 -26 -69 48 51 -112 79 -115 28 16 184 67 -88 -222 -17 -177 366 139 41
6707 41 114 -89 49 102 -55 -106 21 140 129 -167 146 -42 -198 -109 -206 41 55 0 256 -16 78 -218 116
6730 116 64 -100 109 68 -44 148 -76 41 -126 -5 -77 -52 -225 137 -60 33 -50 58 85 -61 -24 -123 -86
6753 -86 -54 50 -101 125 -321 156 160 -18 -185 -259 64 10 11 -250 -232 -88 -59 1 -6 -97 -18 239 -196 85 1
6778 1 49 -231 14 -319 -33 -153 -123 15 13 36 -6 -44 30 -278 99 289 63 130 47 -84 -22 -15 -108 34 -204
6803 -204 -169 42 398 25 55 4 -203 52 166 -207 -71 142 273 -51 -150 -165 11 -148 -167 109 358 47
6825 47 -12 -48 3 15 214 -29 -183 -150 131 174 -44 -352 205 202 13 -75 -223 185 5 -17 -184 -59 -147 6
6849 6 136 148 57 -171 -218 317 -237 -69 74 57 4 18 285 -209 50 -20 221 -253 -188 32 17 -50 -92 196
6873 196 9 70 207 31 -23 -38 -36 91 180 -25 -32 288 -112 -137 67 -28 -375 477 112 106 132 48 86 191 -44
6898 -44 -34 43 37 7 -250 -108 -138 21 -234 231 214 89 35 -35 338 204 38 -36 26 67 360 -53 -157 -89 -177
6923 -177 113 -106 -36 -130 126 -87 -43 140 -56 -130 -11 -10 -135 186 174 -97 -106 20 -3 68 -202 -145 -11 91
6947 91 -148 -58 115 -129 -18 -329 58 160 25 125 -92 111 19 -87 -122 -203 -45 11 -245 169 -244 -67
6969 -67 310 41 -78 195 63 -206 -17 127 270 259 -78 -129 -48 -8 72 105 -132 -179 -43 -18 23 305 196
6992 196 38 66 -155 306 75 -126 151 -37 -4 -2 193 -30 219 -131 58 -168 -316 90 -83 45 154
7013 154 287 -32 -175 25 -102 -66 63 96 -25 145 118 42 137 146 144 92 192 50 -18 -118 -49 386 111 -29
7037 -29 -29 44 -348 -68 -46 217 307 51 -163 -134 162 78 74 74 -51 -93 -100 75 65 104 55 28 -100 178 -95 -100 -391
7064 -391 -145 -32 32 227 -29 100 32 -244 -73 -394 -1 -69 -369 192 95 -178 22 51 140 98 -78 24
7086 24 -35 -107 20 -44 -82 -171 69 -103 -44 -18 -7 -4 -178 -234 189 -152 -145 -20 -37 57 -13 -80 256 -110 2 -216
7112 -216 -31 337 -45 -60 68 -307 63 256 47 31 -18 -233 -96 -66 -15 259 36 -248 141 -133 41 -155
7134 -155 -272 -258 -178 39 80 2 23 -20 -38 66 43 253 -173 -42 104 16 27 -202 101 198 254 -308 104 -115
7158 -115 12 -39 101 226 34 -152 -232 -132 -78 -141 -52 31 77 -121 170 59 66 -99 192 22 253 -103 -83
7181 -83 -20 -184 25 101 -62 60 -139 -34 121 187 78 -2 -201 -97 313 -56 -204 52 -371 16 226 101
7203 101 71 22 38 -5 -74 -73 -17 -80 37 94 95 80 3 -9 7 50 -46 75 4 212 115 -28 77 -4 -117 4 207
7230 207 42 63 -169 209 -196 -61 17 -10 21 118 -87 -178 107 -143 198 152 239 84 192 -153 -47 -75 -127
7253 -127 75 54 -97 -162 19 45 -85 25 -207 -80 -191 -112 -236 95 43 -81 123 -160 240 115 -120 161
7275 161 -81 99 228 -39 -141 60 94 -135 -259 -280 33 -95 -185 52 -26 297 256 -213 58 -121 193 -33
7297 -33 203 -148 -125 -146 -173 42 -176 -116 -86 187 -26 113 209 31 -32 161 -20 281 -1 59 -205 280 200
7320 200 -67 -20 -157 -232 -289 124 131 -159 -84 75 159 9 -27 -37 -60 236 -131 -62 238 89 -90 -2 3 -336 -119
7345 -119 32 -49 -23 -112 156 -98 -175 17 216 -155 -61 -250 -30 -35 131 -53 -193 47 -160 58 -49 -20 -190
7368 -190 24 -69 101 -111 -15 -238 360 -120 -63 32 88 85 151 28 -173 -139 17 102 -203 89 67 -100 -90 80
7392 80 -133 -30 -1 -240 -178 -172 -71 -70 30 -38 -114 55 147 9 -126 109 178 21 -42 82 -51 160 10 -51
7416 -51 163 -166 -50 -40 35 176 131 45 -65 147 -86 145 -13 234 120 -156 -240 28 -187 59 -258 -31
7438 -31 3 227 -145 -43 -77 -402 -180 -28 31 29 -29 6 -103 -18 -106 38 39 57 27 -41 -20 13 -23 -206 54 153
7464 153 -186 117 198 19 111 170 -19 -9 110 -17 60 47 -56 -66 -319 79 183 -58 -103 -15 -245 -42 -101
7487 -101 -83 43 -85 170 -207 67 -142 163 -26 66 174 103 62 -55 50 -15 61 -27 196 -172 -175 142 63
7510 63 -75 -117 -192 41 332 -4 -3 32 -185 -96 88 -242 -13 289 249 -82 -69 -108 -61 -101 -138 -135 -383 60 267
7535 267 -145 106 10 207 374 -65 -26 52 64 78 -30 60 -21 -139 -17 59 -27 -252 -88 -3 -21 188 -202 -303
7559 -303 153 -237 82 178 295 192 -128 -78 204 -124 159 -192 -109 -272 -55 25 -65 -1 -134 278 -42 -8
7581 -8 -116 54 -74 -130 -279 189 23 -60 2 21 -25 -5 74 -98 -237 -83 220 199 -176 52 123 -49 -55 -201
7605 -201 -85 147 119 -154 46 -66 175 -122 -27 -63 -18 173 29 -321 181 -3 -49 -428 -36 -44 -80 -197 287
7628 287 121 96 49 -48 42 -3 48 -267 116 55 -53 -27 -121 35 -48 -204 29 -337 -206 -214 -87 -17 44 -110 -173
7653 -173 -35 271 23 -10 67 -322 206 93 -67 -87 -92 2 -29 -11 -44 265 34 71 120 -95 81 101 -135 -53
7677 -53 -333 100 -427 -8 165 -277 192 -57 167 -11 -5 159 -169 6 -263 -19 -13 278 180 183 -229 -17 202
7700 202 -99 35 248 198 248 -24 22 193 -173 -39 -70 230 -217 -41 -76 -121 90 -211 -50 -310 266 -59
7722 -59 57 65 -7 109 -60 100 -77 77 138 -221 -250 79 386 182 195 15 223 -122 76 132 12 18 201
7745 201 -31 14 121 -23 -176 411 -124 178 50 -76 8 -3 292 8 -127 -48 -94 100 17 16 20 29 58 37 -32
7770 -32 -215 27 -161 135 -11 -106 182 44 25 429 -28 377 -61 -32 -188 -11 197 181 -107 -319 -137 -105
7792 -105 -49 -39 84 -145 61 69 133 -47 60 -131 68 -132 45 87 1 112 -103 275 -29 -23 118 -106 63
7815 63 -127 -124 -127 50 -139 189 164 -9 -2 85 -13 -76 -169 -191 -157 55 254 295 -70 17 18 163 -193 -74 21 -20 6
7842 6 -225 -23 26 135 200 105 -213 393 -77 -54 109 200 -257 -194 -247 15 -17 -142 143 -1 -33 -207 117 -126
7866 -126 -207 54 -67 -6 -127 105 -207 -124 64 -42 13 201 -311 -5 -36 -32 104 22 -1 -15 94 -72 100
7889 100 100 5 284 289 171 -225 -126 -221 88 333 186 180 276 229 -164 -124 -13 -127 -74 -103 62 245 -234 -136 -125
7914 -125 -197 -155 -43 311 -297 -203 -377 242 229 83 10 -49 120 100 243 -50 307 82 -151 8 -11 -2 85 68
7938 68 -242 69 -276 -67 21 52 -135 19 229 201 -14 -136 -97 119 77 -141 -81 12 42 -25 69 11 51 55 -94
7963 -94 -16 -73 105 244 124 -301 -116 135 -205 184 -71 -75 -23 -265 -69 -28 204 71 22 187 -18 1 73
7986 73 -124 167 205 -74 30 68 -339 16 15 -105 110 -28 -356 -232 -6 136 124 -62 -98 -132 113 10 9
8009 9 13 -122 46 -77 17 24 187 -20 142 -171 -223 -16 49 -6 -51 -82 -129 -74 61 -65 134 -208 218 -77 -70
8034 -70 92 -190 -7 219 -268 -128 -170 -71 -148 165 -139 71 3 -16 88 -79 113 -71 -153 27 193 -190
8056 -190 -186 -67 110 231 97 159 -75 -43 -222 -202 -225 115 213 -308 -126 53 205 2 7 97 149 171 220 337
8080 337 -96 137 -50 -164 -111 42 22 -377 -167 208 431 166 132 95 -73 13 117 258 52 -66 -37 -69
8102 -69 128 -87 64 4 -142 -60 381 33 76 39 -5 -45 79 39 -176 -237 -240 22 -70 -140 183 -5 -75 -9 -328
8127 -328 -42 75 -23 -258 188 -143 -43 136 -65 -88 128 -188 7 15 -53 139 64 -70 -68 211 -349 57 233
8150 233 27 -79 101 52 -12 84 5 -50 62 -198 -296 179 -53 -5 67 100 -315 -5 -278 155 -41 206 286
8173 286 -63 45 135 -235 -195 -244 -134 -225 -103 -71 24 255 -257 -150 -76 151 114 61
8191F1
##END NTUPLES=NMR FID
##END=
