##TITLE=1H_DE-97m2_TFA
 200.13MHz, CDCl3,
 8 sc
 
 21.8.2025
##JCAMPDX= 6.0         $$ Bruker NMR JCAMP-DX V2.0
##DATA TYPE= NMR FID
##DATA CLASS= NTUPLES
##ORIGIN= UXNMR, Bruker Analytische Messtechnik GmbH
##OWNER= pz
$$ XWIN-NMR		Version 3.5
$$ Thu Aug 21 14:22:16 2025 Russian Standard Time (UT+4h)  she@DPX200
##.OBSERVE FREQUENCY= 200.1313
##.OBSERVE NUCLEUS= ^1H
##.DELAY= (6, 6)
##.ACQUISITION MODE= SIMULTANEOUS
##.ACQUISITION SCHEME= undefined
##.AVERAGES= 8
##.DIGITISER RES= 18
##SPECTROMETER/DATA SYSTEM= spect
##.PULSE SEQUENCE= zg30
##.SOLVENT NAME= CDCl3
##.SHIFT REFERENCE= (INTERNAL, CDCl3, 0, 14.3821)
##AUDIT TRAIL= $$ (NUMBER, WHEN, WHO, WHERE, WHAT)
$$ ##TITLE= Audit trail, XWIN-NMR		Version 3.5
$$ ##JCAMPDX= 5.01
$$ ##ORIGIN= Bruker BioSpin GmbH
$$ ##OWNER= she
$$ F:/spectra/data/she/nmr/H-C/1/audita.txt
$$ ##AUDIT TRAIL=  $$ (NUMBER, WHEN, WHO, WHERE, WHAT)
(   1,<2025-08-21 14:20:44.79 +0400>,<she>,<DPX200>,
      <created by zg, POWCHK disabled, PULCHK disabled
       configuration hash MD5:
       00 E9 B6 7A A2 85 ED C7 34 08 36 98 17 FE 4E 26
       data hash MD5: 16K
       73 95 4A 38 41 D5 90 57 15 9F 2B 5F 44 12 C9 D3>)
$$ ##END=
$$ 
$$ hash MD5
$$ 47 E2 C3 4E CE 13 B0 AA 41 68 94 E3 FA 59 85 DE
##$RELAX= 
##$RELAX= 
##$RELAX= 
##$RELAX= 
##$RELAX= 
##$RELAX= 
$$ Bruker specific parameters
$$ --------------------------
##$DU= <F:/spectra>
##$EXPNO= 1
##$NAME= <H-C>
##$PROCNO= 1
##$TYPE= <nmr>
##$USER= <she>
##$AMP= (0..31)
100 100 100 100 100 100 100 100 100 100 100 100 100 100 100 100 100 100 
100 100 100 100 100 100 100 100 100 100 100 100 100 100 
##$AQSEQ= 0
##$AQ_mod= 1
##$AUNM= <au_zg>
##$AUTOPOS= <>
##$BF1= 200.13
##$BF2= 200.13
##$BF3= 200.13
##$BF4= 200.13
##$BF5= 200.13
##$BF6= 200.13
##$BF7= 200.13
##$BF8= 200.13
##$BYTORDA= 1
##$CFDGTYP= 0
##$CFRGTYP= 5
##$CHEMSTR= <none>
##$CNST= (0..31)
1 1 145 1 1 1 1 1 1 1 1 1 1 1 1 1 1 1 1 1 1 1 1 1 1 1 1 1 1 1 1 1 
##$CPDPRG= <>
##$CPDPRG1= <>
##$CPDPRG2= <>
##$CPDPRG3= <>
##$CPDPRG4= <mlev>
##$CPDPRG5= <mlev>
##$CPDPRG6= <mlev>
##$CPDPRG7= <mlev>
##$CPDPRG8= <mlev>
##$CPDPRGB= <>
##$CPDPRGT= <>
##$D= (0..31)
0 0.7 0 0 0 0 0 0 0 0 0 0.03 0 0 0 0 0 0 0 0 0 0 0 0 0 0 0 0 0 0 0 0 
##$DATE= 1755771644
##$DBL= (0..7)
120 120 120 120 120 120 120 120 
##$DBP= (0..7)
150 150 150 150 150 150 150 150 
##$DBP07= 0
##$DBPNAM0= <>
##$DBPNAM1= <>
##$DBPNAM2= <>
##$DBPNAM3= <>
##$DBPNAM4= <>
##$DBPNAM5= <>
##$DBPNAM6= <>
##$DBPNAM7= <>
##$DBPOAL= (0..7)
0.5 0.5 0.5 0.5 0.5 0.5 0.5 0.5 
##$DBPOFFS= (0..7)
0 0 0 0 0 0 0 0 
##$DE= 6
##$DECBNUC= <off>
##$DECIM= 32
##$DECNUC= <off>
##$DECSTAT= 4
##$DIGMOD= 1
##$DIGTYP= 9
##$DL= (0..7)
0 120 120 120 120 120 120 120 
##$DP= (0..7)
150 150 150 150 150 150 150 150 
##$DP07= 0
##$DPNAME0= <>
##$DPNAME1= <>
##$DPNAME2= <>
##$DPNAME3= <>
##$DPNAME4= <>
##$DPNAME5= <>
##$DPNAME6= <>
##$DPNAME7= <>
##$DPOAL= (0..7)
0.5 0.5 0.5 0.5 0.5 0.5 0.5 0.5 
##$DPOFFS= (0..7)
0 0 0 0 0 0 0 0 
##$DQDMODE= 0
##$DR= 18
##$DS= 0
##$DSLIST= <SSSSSSSSSSSSSSS>
$$ [...]
##$SUBNAM0= <"">
##$SUBNAM1= <"">
##$SUBNAM2= <"">
##$SUBNAM3= <"">
##$SUBNAM4= <"">
##$SUBNAM5= <"">
##$SUBNAM6= <"">
##$SUBNAM7= <"">
##$SUBNAM8= <"">
##$SUBNAM9= <"">
##$SW= 18.0517328524113
##$SWIBOX= (0..15)
0 0 2 0 0 0 0 0 0 0 0 0 0 0 0 0 
##$SW_h= 3612.71676300578
##$TD= 16384
##$TD0= 1
##$TE= 0
##$TE2= 300
##$TE3= 300
##$TEG= 300
##$TL= (0..7)
0 120 120 120 120 120 120 120 
##$TP= (0..7)
150 150 150 150 150 150 150 150 
##$TP07= 0
##$TPNAME0= <>
##$TPNAME1= <>
##$TPNAME2= <>
##$TPNAME3= <>
##$TPNAME4= <>
##$TPNAME5= <>
##$TPNAME6= <>
##$TPNAME7= <>
##$TPOAL= (0..7)
0.5 0.5 0.5 0.5 0.5 0.5 0.5 0.5 
##$TPOFFS= (0..7)
0 0 0 0 0 0 0 0 
##$TUNHIN= 0
##$TUNHOUT= 0
##$TUNXOUT= 0
##$USERA1= <user>
##$USERA2= <user>
##$USERA3= <user>
##$USERA4= <user>
##$USERA5= <user>
##$V9= 5
##$VALIST= <valist>
##$VCLIST= <CCCCCCCCCCCCCCC>
##$VD= 0
##$VDLIST= <DDDDDDDDDDDDDDD>
##$VPLIST= <PPPPPPPPPPPPPPP>
##$VTLIST= <TTTTTTTTTTTTTTT>
##$WBST= 1024
##$WBSW= 4
##$XGAIN= (0..3)
0 0 0 0 
##$XL= 0
##$YL= 0
##$YMAX_a= 93438
##$YMIN_a= -120405
##$ZGOPTNS= <>
##$ZL1= 120
##$ZL2= 120
##$ZL3= 120
##$ZL4= 120
##$ABSF1= 10
##$ABSF2= 0
##$ABSG= 5
##$ABSL= 3
##$ALPHA= 0
##$AQORDER= 0
##$ASSFAC= 0
##$ASSFACI= 0
##$ASSFACX= 0
##$ASSWID= 0
##$AUNMP= <proc_1d>
##$AZFE= 0.1
##$AZFW= 0.1
##$BCFW= 1
##$BC_mod= 2
##$BYTORDP= 1
##$COROFFS= 0
##$CY= -3
##$DATMOD= 1
##$DC= 2
##$DFILT= <>
##$DTYPP= 0
##$F1P= 0
##$F2P= 0
##$FCOR= 0.5
##$FTSIZE= 0
##$FT_mod= 4
##$GAMMA= 1
##$GB= 0.15
##$INTBC= 1
##$INTSCL= 1
##$ISEN= 128
##$LB= 0.25
##$LEV0= 0
##$LPBIN= 0
##$MAXI= 10000
##$MC2= 0
##$MEAN= 0
##$ME_mod= 0
##$MI= 1.114404
##$NCOEF= 0
##$NC_proc= 0
##$NLEV= 6
##$NOISF1= 3.799351
##$NOISF2= 2.8
##$NSP= 1
##$NTH_PI= 0
##$NZP= 0
##$OFFSET= 14.38212
##$PC= 1
##$PHC0= -1562.508
##$PHC1= 10.79229
##$PH_mod= 1
##$PKNL= yes
##$PPARMOD= 0
##$PSCAL= 0
##$PSIGN= 0
##$REVERSE= no
##$SF= 200.129724274929
##$SI= 16384
##$SIGF1= 3
##$SIGF2= 2
##$SINO= 400
##$SIOLD= 16384
##$SREGLST= <1H.CDCl3>
##$SSB= 0
##$STSI= 0
##$STSR= 0
##$SW_p= 3205.1282051282
##$SYMM= 0
##$S_DEV= 0
##$TDeff= 0
##$TDoff= 0
##$TI= <>
##$TILT= no
##$TM1= 0
##$TM2= 0
##$TOPLEV= 0
##$USERP1= <user>
##$USERP2= <user>
##$USERP3= <user>
##$USERP4= <user>
##$USERP5= <user>
##$WDW= 1
##$XDIM= 8192
##$YMAX_p= 0
##$YMIN_p= 0
$$ End of Bruker specific parameters
$$ ---------------------------------
##NTUPLES= NMR FID
##VAR_NAME=  TIME,          FID/REAL,        FID/IMAG
##SYMBOL=    X,             R,               I
##VAR_TYPE=  INDEPENDENT,   DEPENDENT,       DEPENDENT
##VAR_FORM=  AFFN,          ASDF,            ASDF
##VAR_DIM=   8192,          8192,            8192
##UNITS=     SECONDS,       ARBITRARY UNITS, ARBITRARY UNITS
##FACTOR=    0.0002768,     1,               1
##FIRST=     0,             0,               0
##LAST=      2.2672688,     0,               0
##MIN=       0,             -120405,         0
##MAX=       2.2672688,     93438,           0
$$ Real data points
##PAGE= N=1
##DATA TABLE= (X++(R..R)), XYDATA
0 0 0 0 0 0 0 0 0 0 0 0 0 0 0 0 0 0 7 -7 7 -7 7 -12 14 -14 17 -21 21 -28 31 -35 42 -49 55 -61 69 -77 86 -96
38 -96 109 -121 135 -150 166 -184 204 -226 249 -274 302 -334 366 -406 446 -493 543 -600 667 -743
58 -743 828 -933 1056 -1206 1393 -1635 1967 -2439 3186 -4538 7824 -36635 -19262 11649 10069
73 10069 91891 71118 -55016 -83092 -1603 -28552 -88154 -13331 73551 21860 -11021 46252
85 46252 32837 -61003 -59661 -2224 -20577 -42993 20708 63261 35078 28603 40415 -12835 -65885
98 -65885 -33668 7734 -5910 5396 60147 59248 1224 -9433 16286 -3769 -36353 -16340 8634
111 8634 960 11404 41542 26295 -12406 -12258 -8312 -33829 -29232 14868 23781 -2748 -1041 9811
125 9811 -11318 -27538 -10189 -1302 -12841 -6444 10252 6560 -1544 5104 1408 -19059 -22220 -2820
139 -2820 6002 2176 10425 21565 8205 -12034 -9631 -1361 -5475 -1552 12753 12337 4020 10235
153 10235 13282 -1293 -9011 -1987 -4205 -9737 4297 18372 11993 3042 3547 -3004 -13714 -12256
167 -12256 -3845 221 2883 5996 3753 -1113 -2199 -1709 -5873 -11403 -8826 -1377 1640 1985 6228
182 6228 6833 -2293 -7939 -4231 -3387 -4635 1683 7718 4142 1029 3236 139 -3387 595 2412 -1745
198 -1745 -54 6381 5813 1916 1418 -570 -3922 -2765 697 3158 4141 4072 2342 38 -3578 -7149
214 -7149 -5601 -1628 145 2306 4157 2514 -479 -493 -3862 -8518 -7138 -3590 -2008 2801 9082 6810
230 6810 32 -2019 -3666 -7313 -6893 -2352 1344 5405 9063 7219 3440 1148 -2732 -6784 -6162 -2492
246 -2492 1136 5048 8648 8457 5762 982 -5110 -7197 -4680 -3194 -2225 3711 7800 6335 4023 382
262 382 -4473 -7084 -5771 -5404 -3093 2319 5194 4064 3461 1336 -4038 -7370 -6038 -4066 -1683 1649
278 1649 2949 3575 4645 2536 -2276 -4277 -3625 -3334 -1173 2326 3403 3448 4441 2612 -286 -1361 -2627
295 -2627 -2929 -274 2661 1992 2177 3969 2785 31 -642 -1991 -2904 -1108 865 791 1016 2367 1183
312 1183 124 395 -1645 -3302 -1725 -62 -443 48 702 155 375 714 -1275 -2966 -1667 -1558 -2019
329 -2019 419 1273 -4 557 1186 328 -793 -917 -2117 -2016 340 1152 402 1485 2430 939 146 -90
347 -90 -1608 -1804 71 720 777 2314 2486 1006 1021 644 -2009 -2291 -466 285 615 2134 1951 1003 1324
366 1324 387 -2058 -2549 -1518 -1360 260 2439 1487 224 629 -97 -1935 -2402 -2509 -2415 -109 2344 1510
384 1510 756 997 -333 -2017 -1484 -1536 -1788 -299 1821 1613 1599 1368 -613 -860 -404 -1140 -1637 313 2051
403 2051 1673 1495 1683 314 -433 160 -996 -1086 442 998 758 1657 1518 -534 -962 -409 -836 -1281 -320
422 -320 -17 217 1380 761 -1045 -1152 -758 -1562 -942 299 -443 -704 386 419 -206 -383 -796 -1657 -517
441 -517 315 -498 -305 1038 847 -42 537 290 -813 -287 320 -148 206 1191 406 894 1869 399 -498
460 -498 -379 158 -161 -227 634 448 341 1391 344 -721 -330 -995 -1740 -731 -115 -492 85 1400 551
479 551 -357 -609 -1834 -1976 -566 -726 -574 404 1608 858 621 241 -1255 -2043 -1428 -684 111 1703 1979
498 1979 1262 1887 850 -1129 -2068 -745 -482 -13 1261 1801 2063 2201 1318 -1340 -1650 -1449 -1450 -794 1442
517 1442 1737 1435 1625 846 -1189 -1778 -2221 -2603 -878 543 741 586 1374 703 -724 -1654 -2280 -2536 -1163
536 -1163 214 1088 1636 1574 407 -791 -642 -1055 -1988 -646 432 805 1798 2065 1280 659 303 -943
554 -943 -1569 -488 616 807 1922 2148 911 233 40 -970 -900 -505 -207 -78 1161 1455 527 64 -101
573 -101 -1063 -1432 -1206 -924 -481 686 814 -409 -262 -698 -1283 -555 -104 -731 -701 41 34 234 597 -21 -449
594 -449 -170 -61 -119 185 676 545 341 719 325 169 665 620 200 280 72 -34 656 886 453 -14 292
615 292 148 -345 -9 132 -830 -233 472 38 112 350 0 -430 -277 -726 -1402 -444 -58 162 481 439 -137
636 -137 -750 -426 -554 -859 -221 -69 -80 781 1242 129 -77 28 -662 -1227 -123 377 824 1533 1330 131
656 131 210 -271 -723 -628 25 -62 186 1170 1263 781 105 -661 -1400 -1084 -499 -545 208 1177 958 336 -346 -683
678 -683 -1648 -1184 -658 -480 289 772 443 388 504 -494 -1653 -1439 -683 -284 599 1288 1148 776 392 -606
698 -606 -1271 -814 -574 -505 718 1512 1279 1029 1006 49 -642 -866 -879 -353 497 1159 869 1031 579 -496 -516
719 -516 -803 -1041 -865 339 782 487 375 401 -898 -966 -477 -1130 -965 -67 514 524 619 -4 -686 -499 -354
740 -354 -929 -352 339 55 64 577 604 134 57 -304 -524 -197 201 411 609 932 351 61 311 -137 -153 150
762 150 394 -416 175 578 104 100 259 14 -733 -35 -196 -519 -398 22 -10 132 126 -265 -332 -31 -325 -948
784 -948 -422 -414 -214 206 385 5 -66 -182 -584 -699 -403 -32 -41 563 622 401 177 271 -440 -444 104 -239 189
807 189 761 1106 765 657 251 -458 -254 -150 -288 -51 660 754 657 654 317 -785 -814 -581 -884 -182 457 140
829 140 297 545 90 -768 -840 -888 -894 -275 524 665 806 694 382 -270 -553 -965 -839 -125 360 597 868 1090
851 1090 448 93 -230 -761 -919 291 407 473 718 1007 340 -187 -484 -928 -748 52 89 587 532 591 129
872 129 25 -312 -1051 -961 -194 -46 98 692 392 -150 -138 -212 -936 -702 -46 -288 88 845 488 81 89 188
894 188 -572 -182 -330 -232 396 615 527 464 494 -90 -520 -306 94 11 256 717 390 231 311 15 -377 110
916 110 -244 -333 -9 365 98 60 180 -201 -97 -201 -373 -362 -227 -234 -504 149 190 -99 -267 8 -489 -132
938 -132 -360 -674 -136 109 354 -173 368 225 -412 -171 -209 -112 -347 197 215 266 518 299 -68 -113 246 -324
960 -324 -407 327 157 608 712 258 3 -304 -191 -581 -419 36 23 162 604 428 -320 -366 -215 -584 -620 -135
982 -135 -231 350 455 242 -13 -379 -361 -639 -398 -456 -37 143 699 491 314 179 -235 -759 -342 112 36 456
1004 456 668 699 534 202 -528 -444 -401 -103 -144 537 798 486 438 267 -582 -655 -422 -629 -596 74 366 242
1026 242 196 203 -449 -700 -697 -795 -157 107 513 155 292 151 -542 -267 -492 -576 -263 424 402 601 595 216 -297
1049 -297 -219 -305 -187 84 161 203 488 565 248 134 97 -221 -369 -144 21 352 398 418 105 -185 157 -207 -416
1072 -416 -335 -204 -128 370 311 -76 -83 101 -198 -394 -306 -461 -279 0 56 -396 135 287 -117 -316 -5 -137
1094 -137 -167 79 44 -21 350 128 31 -210 202 -141 -150 -155 341 141 376 527 111 14 -69 -56 -248 172 -295 -161
1118 -161 594 432 177 132 -90 -263 -486 -34 -362 68 319 244 -189 125 -169 -356 -225 -419 -645 -171 251
1139 251 287 304 198 29 -311 -54 -287 -288 -70 285 240 397 469 165 -176 -1 -337 -208 201 359 267 322 260
1162 260 -75 -84 -54 -156 -253 18 -35 130 191 206 -154 -253 -236 -255 -620 -67 64 149 404 131 -197 108 -219 -689
1186 -689 -309 -220 119 57 586 337 -170 -36 -19 -203 -255 -34 -94 158 239 350 2 94 -23 -236 -210 -23 -127
1209 -127 371 535 266 106 344 -82 -202 -9 38 74 17 345 -2 61 117 -261 18 -165 -191 -385 -139 95
1231 95 -8 63 -19 4 -146 73 -382 -507 -240 -210 -326 146 267 95 63 100 -183 -238 11 -92 -68 654 400
1254 400 150 92 451 226 -89 -44 -84 -186 412 120 169 447 318 -208 -68 -167 -158 -186 3 189 -1 308 116
1277 116 29 -100 -242 -302 -178 -52 117 405 248 -23 -33 -223 -401 -605 -132 -26 275 244 348 22 -84
1298 -84 -104 -510 -465 75 -20 370 188 684 526 72 322 -287 -284 -337 -147 170 324 160 249 109 -166 139 -342
1321 -342 -38 -284 -163 240 315 160 252 244 -702 -413 -269 -422 -104 342 145 229 47 217 -312 -239 -339 -66
1343 -66 -26 195 464 201 455 206 -246 -376 35 -422 -22 330 195 76 505 35 -212 61 -291 -117 213
1364 213 322 -88 94 330 148 -30 54 -274 -371 -137 -148 218 479 144 5 195 -171 -255 -205 28 -174 24
1386 24 58 -264 -149 323 255 -24 -98 -92 12 59 25 -34 -48 146 -44 -124 -116 26 -182 -136 60 56 -111 521 263
1411 263 -35 -60 59 -94 -198 121 -187 184 367 315 112 -7 -152 -102 -422 -115 -476 -54 291 255 -206
1432 -206 113 59 -379 -74 -36 -66 176 272 254 -103 203 -212 -176 132 -209 -317 -180 93 241 280 287 -103 -222
1455 -222 -137 -399 21 9 324 97 471 305 75 -346 -133 -279 -259 133 139 262 309 79 17 -138 -308 -247 -100
1478 -100 138 307 159 251 162 -178 -48 -395 18 -206 -285 239 122 135 183 64 -171 -545 -454 16 -84 -35
1500 -35 95 205 156 120 58 -163 -354 105 178 2 160 47 101 -113 -29 -232 -74 74 -216 -71 434 183
1522 183 -5 380 35 -130 -193 -195 -148 -35 110 172 -114 330 -36 -268 -503 -165 -147 -313 -131 5 -168 216
1544 216 217 47 -49 -357 -120 -108 -15 112 131 111 520 342 -208 -138 24 -168 80 -297 215 192 124 318 -36
1567 -36 -196 42 48 -339 -143 -126 264 -3 11 -103 85 -210 114 11 -320 -29 145 198 292 195 139 -160 -383
1590 -383 13 -341 -78 9 229 132 245 0 -10 77 -235 -222 174 71 73 322 227 128 -72 50 79 -227 229
1613 229 -88 105 423 625 9 -28 -48 -270 -297 -40 -182 25 211 136 420 -109 -144 -21 -356 -195 -310 -128
1635 -128 349 27 60 149 -69 -252 -300 -294 -83 -95 37 48 -66 155 48 -330 54 27 -263 -252 -46 93 109
1658 109 151 215 -76 -278 -47 -134 250 237 175 94 396 52 3 -114 -181 -257 -117 101 -122 98 56 -102 -281
1681 -281 -33 -34 -370 97 161 -36 24 174 240 7 -70 9 -98 -17 -10 138 195 52 -131 -78 81 108 -189 255
1705 255 -16 276 315 380 58 400 178 103 -256 -222 -328 85 32 170 -43 187 286 -38 -34 -46 21 -6 -28 73
1729 73 -210 219 81 -162 -36 18 -230 -268 -24 -114 -50 306 166 -160 -116 -172 50 -265 -73 157 198 519 112
1752 112 4 -21 -110 -366 -241 -24 232 144 213 158 73 -33 259 -116 -163 -65 19 270 53 -189 63 456 3
1775 3 57 -323 -569 179 -163 170 134 43 -8 -182 -99 -599 -244 28 -23 32 269 140 42 27 -236 81 -188 -59
1799 -59 117 -12 86 3 292 99 -76 -332 -148 268 90 119 313 48 97 128 312 -61 -53 154 104 148 222 110
1823 110 44 81 -136 -86 -156 -32 30 62 73 120 165 139 164 2 -50 -195 -50 18 370 207 99 84 177 -66 93
1848 93 -115 -412 -83 10 -2 -326 360 16 -162 -36 -237 -164 -9 -98 29 -83 178 110 -206 10 139 -41
1870 -41 30 -199 -54 31 153 -396 -172 82 -141 -109 43 38 -132 92 178 145 62 107 -161 -161 -137 60 -56 111
1894 111 128 -37 -39 212 -179 -139 -160 -258 -1 12 -95 26 91 120 244 12 121 -177 244 -23 73 99 -15 98
1918 98 -221 207 -63 -97 -154 -161 -63 377 -174 142 143 -13 91 -43 -262 93 9 305 250 -95 30 210 205 -284
1942 -284 -272 -250 -107 148 310 136 -175 166 -216 10 -131 38 -31 215 119 315 342 42 142 -163 58 -86
1964 -86 153 524 172 -3 279 221 238 -265 -85 -119 11 -127 -56 215 85 -73 30 111 -74 -279 -111 -230
1986 -230 162 -31 258 144 128 -111 25 107 -202 -106 278 -29 1 206 -222 115 -204 -130 -44 33 -178 -85 379
2009 379 17 -207 327 -46 2 108 -65 -9 218 123 12 7 217 144 122 -243 -15 191 132 255 328 397 124
2032 124 -43 15 -12 -223 -160 207 -154 145 210 190 104 193 0 -134 -149 -62 -85 -136 -98 14 355 -2 465 210
2056 210 51 -25 -146 65 133 -96 265 21 -191 -45 -116 -143 152 155 128 -111 176 131 -116 -14 130 -125 20
2079 20 -170 16 39 112 -48 117 171 -82 -103 -317 154 -18 -26 -173 -165 38 64 102 4 -151 49 -51 -103 -146 139
2104 139 81 -7 52 34 39 272 149 -225 143 104 41 -269 18 274 -108 47 -78 112 9 -96 75 -17 -128
2127 -128 -253 -174 -7 -153 -147 196 100 -281 54 230 -281 -126 -77 -19 -42 244 -242 -83 -245 -90 16 -19 37
2150 37 84 -84 -62 -105 133 100 -10 -133 5 44 -147 118 63 -85 -299 288 70 120 -82 114 6 45 -28
2173 -28 122 48 -204 14 90 -37 13 -70 -188 119 -180 -302 124 -28 33 96 -140 -1 52 -51 -99 51 89
2196 89 -72 130 142 177 208 104 -168 -11 -103 34 29 98 185 -169 -90 -172 15 -96 233 -34 27 203 7 173
2220 173 -135 -366 -163 -79 60 -119 -33 69 -6 88 -16 -98 -255 67 305 404 -12 86 104 -4 108 51 -234
2243 -234 -165 -6 -111 19 266 46 121 -122 -194 -221 -58 -64 -142 52 14 37 29 124 -52 90 39 -115 -54 -74 166
2268 166 -36 -100 72 2 153 -30 -85 30 270 61 -32 -56 -60 -268 18 29 -126 262 184 96 256 34 -27 -102
2292 -102 -121 -9 -372 7 -77 -134 209 93 37 -98 51 97 -142 131 171 -64 12 -2 104 75 -3 -35 -292 -168
2316 -168 39 75 -8 231 24 69 107 -149 -48 -15 -49 35 -143 24 -75 26 118 21 180 -82 -185 -2 -93 -38
2340 -38 -36 -142 24 147 170 13 -153 -61 1 -17 -199 -49 9 -285 -49 15 -99 -151 -175 -191 -5 -71 51 58 72
2365 72 -42 -47 33 -206 76 19 -93 262 171 -102 69 -156 44 74 36 -260 180 53 -125 -143 -109 -90 -272 -120
2389 -120 216 85 -137 104 52 106 -149 -38 -24 -54 -95 86 47 225 302 357 46 -16 61 314 -130 3 173
2412 173 -116 -33 51 11 -136 -46 64 -377 6 -189 105 28 3 3 -105 132 55 -24 -147 18 -214 -167 131 -70
2436 -70 62 104 -67 -25 -220 119 -191 38 -214 -54 -7 26 -65 333 -59 -214 -101 111 -224 -262 47 -130
2458 -130 -148 -112 -111 92 -66 255 -44 -32 -123 -223 218 77 210 -52 108 90 89 -85 -67 -260 38 -264 47
2481 47 199 -48 14 -48 -128 -20 -160 -90 181 -145 -239 -145 371 22 -160 161 121 25 13 -323 -19 239 426
2504 426 -46 -99 -131 -58 -2 219 175 13 -8 80 -37 54 -113 24 -95 174 -67 -160 91 -284 217 -130 122
2527 122 218 -90 222 -131 -5 273 52 54 -48 12 -19 -130 -30 -256 -138 -36 95 45 78 24 -142 50 77
2550 77 -253 -23 64 112 -225 47 63 11 37 39 -58 17 246 188 -428 -112 -18 -142 14 -230 53 142 45 -20 48
2575 48 -64 -71 -36 185 -7 54 107 131 -112 101 227 66 -148 286 -62 -22 151 123 -162 -98 23 65 192 233
2599 233 88 -198 198 220 78 97 -154 35 80 -159 -21 29 86 -298 -24 309 -207 -159 -42 8 23 143 83
2622 83 84 120 -157 -278 135 -184 -181 -350 -328 -86 -175 -286 -39 -100 -262 -157 -112 247 -64 -125 -32 47 92 46 178
2647 178 -43 -227 -226 146 -150 85 47 -15 152 -134 238 56 50 146 -507 -123 278 65 -153 -87 137 2 95
2670 95 8 6 102 -55 -54 40 117 -33 -146 75 -83 -42 -178 -50 -20 71 -97 -193 -130 -182 214 13 241 -78 105
2695 105 32 162 -75 -148 -13 24 202 184 -180 90 98 -122 76 37 -122 168 -100 54 80 -9 -25 1 89 4
2719 4 -25 -161 457 247 -370 -185 -12 -233 30 13 45 -134 45 125 89 -69 -95 117 121 -11 -220 83 25 -41
2743 -41 37 45 174 -326 67 253 -205 -103 -67 -74 14 10 -14 -101 -46 -46 339 -3 99 177 39 99 51 343 274 141
2769 141 -87 14 122 -21 158 139 2 -33 126 -54 12 -215 107 119 -38 -88 48 43 95 68 206 107 -83
2792 -83 -112 -50 51 13 -38 -299 -87 112 0 110 4 -67 -245 77 109 129 -83 -108 -129 -80 -47 -100 3 -265
2816 -265 -119 227 -123 -292 0 84 188 268 -47 -136 110 58 112 96 -29 -167 -33 187 35 344 -132 -60
2838 -60 -142 -90 -156 57 438 109 57 115 -83 -97 -47 23 66 268 -35 -119 -48 -59 -281 -23 37 26 -126 -270 26
2863 26 186 10 -43 87 12 9 -149 -86 -10 -16 -265 -237 -62 0 -101 76 -62 -312 317 -24 -155 -10 -223 -17
2887 -17 -23 77 -92 232 -103 100 196 -82 -51 124 222 -4 3 -501 -120 -61 -44 -97 245 -21 25 309 27 55
2911 55 -139 91 -152 103 92 -19 244 -57 -102 -72 -79 212 -54 41 -58 -41 1 -54 -80 -9 98 -36 219 102
2935 102 -88 -195 30 -294 -129 170 9 -188 144 112 -16 -221 -36 -116 19 -401 118 -84 185 -34 111
2956 111 167 245 270 167 28 176 251 158 -89 -391 -85 -297 179 -185 30 236 -180 256 -2 -81 71 54
2978 54 399 164 -124 -310 34 -124 229 24 -102 -36 -70 -115 -77 162 -205 -50 -4 71 55 12 -72 -121 -21 125
3002 125 262 293 -76 119 -75 -78 170 29 227 96 55 379 136 258 84 52 -142 1 65 -84 220 -117
3024 -117 -83 -153 -22 -161 41 51 107 33 -9 -332 29 -42 49 -312 213 -91 -163 -312 -106 118 93 -113 -68 382
3048 382 -316 -13 33 70 23 -94 114 16 47 -164 48 -197 -134 -67 11 97 -82 140 -157 -109 170 -259 42
3071 42 -294 -89 106 65 -31 -80 129 -59 -106 113 101 146 -208 11 13 54 142 -60 -90 -147 85 215 267 -81 -98
3096 -98 -235 -62 -27 46 181 -320 -345 43 189 171 -61 -47 -119 -195 102 153 108 20 -260 -189 59 -102 -309 -82
3120 -82 -35 94 43 198 54 98 -206 282 -68 168 264 68 -97 -226 22 48 -61 90 -159 -42 -40 -109 118
3143 118 3 -238 -107 -36 294 -109 -106 106 229 43 57 -65 -7 -109 -54 -154 -111 54 -160 182 -218 -49
3165 -49 -149 -54 -114 -109 88 63 -219 107 132 -203 -154 186 3 -8 -149 354 -31 1 189 -209 239 -290 -156
3188 -156 -23 112 138 -22 -17 -74 131 324 123 -178 126 1 -209 31 183 61 -92 166 111 143 128 -17
3210 -17 -8 184 151 -119 -52 131 -40 -190 198 216 64 19 -240 -4 -71 -14 -111 -101 -40 0 276 205 -18 155 -107
3235 -107 -97 -292 212 -176 -12 3 169 83 93 -5 -315 -230 -141 -125 60 28 86 -303 75 -207 -122 167 -99 181
3259 181 298 88 192 -46 43 -108 28 115 -233 -33 -294 -210 39 56 41 201 370 175 -205 -202 42 48 -210
3282 -210 25 84 108 271 -27 94 47 -46 552 -119 165 -160 36 63 230 -1 -126 -46 -104 -39 -80 -48 188
3305 188 57 52 -31 -26 32 -60 10 21 87 -157 35 310 124 -39 237 -143 29 3 -240 144 113 153 -139 29
3329 29 179 -37 128 -176 -45 72 102 -121 250 -98 -19 46 124 -7 152 164 -71 26 -130 82 -183 -143 59
3352 59 173 47 158 -20 -52 59 0 -146 74 -122 -299 -4 222 0 -160 -132 268 88 240 88 116 56
3374 56 120 32 -93 -329 73 120 -164 31 92 22 -68 13 -102 78 82 193 -30 21 -106 -154 -83 62 174 -50
3398 -50 -137 -31 1 -65 -166 -29 280 -171 226 -154 -175 -48 -89 167 -204 21 -69 124 -23 283 -58 -297
3420 -297 -134 -75 -106 98 -39 -98 -47 -5 -91 138 133 -142 14 -77 1 66 -100 225 255 -2 -182 14 -98 81
3444 81 -147 48 14 271 -104 -52 46 164 -76 -87 217 -178 -109 187 16 -219 3 -61 121 19 -58 -172 218
3467 218 -14 -172 -56 125 -8 -180 -59 -237 13 -66 117 147 -59 39 -17 -33 102 -117 -158 -145 -167 -44 -281
3490 -281 -41 190 -28 -145 43 -87 -24 -123 104 -126 -323 -73 22 -132 53 -40 -16 45 -226 211 146 -31
3512 -31 20 -60 154 -62 -60 -229 128 83 -164 -192 2 212 8 102 -41 -186 -315 -256 14 30 -16 -20 252 17
3536 17 127 24 85 155 -131 156 13 -194 134 165 62 -155 8 57 149 -52 73 182 105 18 100 102 59 -63
3560 -63 -2 -43 -124 -120 -201 -198 -27 -9 166 -138 92 -139 -112 113 -274 101 -22 118 94 72 148 46 27 85 -39
3585 -39 -124 281 -128 -72 -6 17 -9 124 118 -263 -13 -108 174 146 -126 -140 60 261 -254 -5 -46 83 -123 -101
3609 -101 -118 -33 -39 247 265 111 -67 136 89 180 96 -297 -12 -87 -9 -106 72 -29 19 -172 96 -29 -64 110
3633 110 250 -249 -234 167 118 -95 -230 26 15 -134 -39 209 -50 -20 46 -25 -86 12 -127 -22 148 -100 245
3656 245 11 63 105 119 8 143 -13 -135 -142 -100 280 -144 -73 152 274 -311 131 -51 30 71 -210 247 -9
3679 -9 -144 -37 97 139 37 56 -165 -173 -128 -4 -48 -17 -24 -22 -89 -48 38 87 23 29 104 249 31 333 108 -44 315
3706 315 -162 86 45 142 -3 81 261 -336 66 -136 218 33 121 46 0 -119 -172 89 -66 -93 -151 -90 218
3729 218 -178 -56 228 -54 -116 130 183 -143 119 3 274 76 334 -76 118 53 70 71 -245 220 -140 -102
3751 -102 -26 -84 -64 304 37 17 -22 -40 62 54 21 -34 46 72 164 48 -387 -45 123 119 130 -41 160 87 159 -189
3777 -189 123 1 64 -134 -139 111 -91 26 -185 -71 -176 -63 171 15 -4 100 255 -95 -295 124 99 53
3799 53 -31 -67 -205 -46 -170 -220 158 125 15 266 -24 -104 130 19 -109 -82 -90 35 -322 114 91 68 -35 -79
3823 -79 -41 -223 -107 84 0 89 -46 -102 71 -129 11 -87 109 217 202 130 -84 164 -150 -99 50 272 -106
3846 -106 106 160 -43 237 -119 -81 128 62 53 -69 -49 -130 132 56 -12 142 122 2 -12 -153 174 36 -170 39
3870 39 -247 155 -21 -214 183 83 -130 157 -140 -27 -4 -114 -137 -74 182 -11 0 355 173 -203 81 -95
3892 -95 279 153 85 -11 277 29 50 172 -50 68 -118 259 -96 278 -104 -78 -124 -23 249 -200 260 -26
3914 -26 -252 438 -6 147 219 -100 -10 -251 181 63 132 -220 129 223 91 -180 -35 -122 -7 245 -223 -139
3936 -139 60 131 190 325 133 134 278 -300 -219 -131 74 95 -114 -118 -126 84 -50 31 -9 -20 -33 132 197 -251 -143
3961 -143 64 167 -104 95 37 194 74 123 -132 74 -34 -216 -247 63 4 94 56 -32 48 -260 86 18 -164
3984 -164 -196 -45 175 -317 -101 211 64 17 -121 -181 7 218 -117 -198 -57 -11 90 -64 -57 32 20 -32 -114 134
4008 134 -150 68 62 153 65 80 -4 -153 46 -193 -42 -4 -80 -263 101 -71 -76 -224 84 43 166 -65 -206 157
4032 157 183 -285 -100 49 -165 194 -60 255 -44 120 80 -279 143 -90 126 33 235 112 -15 158 -66
4053 -66 30 -143 -146 37 -89 -113 -77 -159 174 23 -49 225 -8 92 -31 221 -109 7 -175 -208 -59 66 215
4076 215 -81 183 134 -39 -129 -35 -274 21 -66 242 132 259 23 -67 -147 -31 -55 41 197 23 104 -288 -51
4099 -51 -75 57 -132 -55 77 -74 95 -43 12 -121 -127 48 90 38 19 84 -23 19 -2 -24 148 -43 -132 2 -15
4124 -15 -153 127 -46 146 -25 -21 154 111 58 -148 37 -10 108 47 118 -17 -111 -150 -180 140 47 177 218 -21
4148 -21 12 88 101 7 -14 -295 96 -193 -136 -23 150 324 80 -37 -46 151 40 12 127 -243 -22 -68 50 17
4172 17 -228 241 -63 -230 182 43 -186 108 -189 -6 -16 30 257 109 -195 -92 242 128 60 52 -34 64 26
4195 26 -103 71 -164 -19 -157 -151 -110 -68 90 -19 262 30 -15 -183 -306 335 -102 305 250 9 -259 20
4217 20 169 24 23 -4 -70 74 -11 97 -143 -39 26 -54 152 8 -428 119 -52 18 -103 43 14 61 -152 48
4241 48 63 86 -167 -57 -210 -152 14 -199 334 -116 24 91 -236 -235 -6 16 -120 -104 253 49 -103 39 97
4264 97 -3 97 -1 -193 26 -166 294 206 -214 113 219 45 -138 74 65 -75 40 157 116 -66 -40 152
4286 152 -90 150 -132 -197 -39 147 -232 172 -36 39 -241 -132 14 130 12 -80 -112 -20 5 -267 164 -84
4308 -84 -67 -84 10 -86 38 130 -159 202 81 -201 -75 -166 -133 -123 283 -77 -38 -25 -59 181 -65 158 45 -77
4332 -77 40 170 12 54 121 -292 -18 37 264 -46 45 -40 -136 5 161 -182 -181 61 -16 -89 -31 -92 54 54 -344
4357 -344 165 44 91 71 144 59 -358 -59 245 -83 103 -47 -108 26 188 227 -245 80 32 -144 50 -45 10
4380 10 111 -108 -31 94 189 193 -140 -110 60 356 -34 -68 95 -26 282 -62 -176 -73 -335 94 68 -267 -234
4403 -234 133 -94 -12 -55 2 124 -182 91 -205 -46 131 14 269 28 -51 -207 -77 91 -70 -104 11 -300
4425 -300 23 58 84 262 77 354 -161 -55 -169 82 -36 -133 119 -105 -166 -106 -30 -56 203 -67 -14 108 118
4448 118 52 -339 -55 -170 82 -93 242 -133 -148 153 -45 -136 -167 125 -274 -243 -63 -132 -119 -28 -140 353 -173
4471 -173 -188 -34 -81 75 110 -4 341 280 -271 195 73 -155 -55 69 24 -82 26 78 43 -257 -101 -17 -117
4494 -117 -107 59 190 -151 -82 -113 5 33 101 -75 130 -144 314 -131 136 -253 -128 76 72 -98 215 131 40
4517 40 224 -7 196 -197 -172 -3 212 -157 -96 74 -223 -51 290 -198 226 127 122 -12 68 173 31 -64 -58
4540 -58 77 -109 92 49 -129 38 -61 -133 23 205 42 145 104 27 -89 -108 -220 -112 240 256 -16 -121 -238
4563 -238 30 47 -130 -29 99 -342 -53 34 -2 -62 -265 195 -85 6 120 -105 35 183 -171 -61 16 61
4585 61 136 -304 -82 -46 -178 175 -50 61 -65 88 -272 400 84 -84 14 -105 -17 -1 158 107 4 -70 55
4608 55 402 214 222 -177 -64 88 34 257 -192 223 -248 -171 -57 109 -67 -179 -364 -151 -302 79 -28 74
4630 74 28 -8 -115 58 -130 167 -78 223 -65 -33 -473 186 -176 21 193 -102 101 43 332 48 -43 -103
4652 -103 235 45 37 -229 -28 98 125 -9 -141 -86 -214 88 -30 32 -167 78 -222 -165 -157 8 -180 -8 85
4675 85 -212 -131 -162 10 67 -283 -150 -250 -71 64 11 82 -227 -100 -8 -296 223 374 54 47 -236 92 -201
4698 -201 62 203 -82 104 -302 -6 -112 158 -217 182 470 54 70 -62 -177 46 230 131 99 -253 -106
4719 -106 -42 -260 15 -131 75 34 -15 252 147 202 -15 -129 154 -315 -124 -49 -35 5 269 -175 78 0 56
4742 56 -119 -98 -40 128 33 -58 288 241 95 20 247 -19 -87 92 33 -45 161 -40 245 46 89 69 -157 -139
4766 -139 107 -90 396 -83 110 -141 105 -133 95 -298 -67 -79 -116 -6 -52 -120 -57 -48 82 178 215 50 -79
4789 -79 -213 271 146 97 -93 3 -140 -117 110 -25 -125 -205 -62 -209 101 -202 83 -136 27 47 185 46
4811 46 101 -146 49 116 59 241 -154 -108 62 -32 -122 -17 154 96 71 -316 102 28 143 -69 67 -196 -105 -4
4835 -4 12 60 -38 61 -176 177 -60 -19 193 130 -154 -26 6 94 -13 114 -220 217 31 -207 117 101 -98 -324
4859 -324 -56 -36 44 72 -116 100 215 -31 -87 -94 -130 -159 44 -74 -41 178 -291 61 -48 -18 199 -211 -74
4882 -74 25 -188 11 8 -65 -15 26 97 109 189 -72 -37 194 -246 18 131 67 198 20 -30 52 -16 19 8 109 142
4908 142 7 -42 101 -154 189 147 -144 -97 78 233 7 16 -100 219 364 203 -124 180 84 -382 285 114
4930 114 211 156 2 107 253 -28 252 104 100 22 86 -116 136 38 105 174 -4 -160 -94 -113 163 106 -38 -1
4954 -1 24 159 89 86 -73 134 4 53 141 10 -33 -112 -87 -163 165 -61 79 -20 126 -256 27 -84 -26 -17 61 -116
4980 -116 -203 -90 56 3 12 -158 225 -10 115 310 79 56 -56 -91 -166 99 64 330 54 12 76 -12 -33 -59
5004 -59 369 27 -99 45 5 149 -155 -147 175 302 -507 -89 -28 145 -276 -164 -98 188 -185 -53 31 133
5026 133 21 -4 -119 92 -166 -116 88 -102 -41 24 105 -165 -9 -128 177 -146 168 -59 368 170 -84 14
5048 14 -111 147 -37 -114 74 186 29 130 98 -156 228 185 -116 63 31 -52 -312 8 188 273 213 32 118
5071 118 -18 -65 234 57 213 -39 370 223 -105 107 -49 122 -276 7 -169 98 49 -52 113 -78 7
5092 7 -92 60 -94 -137 -225 218 107 -14 225 117 -155 1 72 9 -74 30 -50 63 -307 168 -290 118 -20
5115 -20 110 148 -221 21 -150 34 285 265 97 -136 34 -74 76 -64 -91 -48 124 -39 -3 -91 97 119 -76
5138 -76 -92 0 -128 61 246 23 73 197 -10 6 142 87 41 221 134 -382 -54 -174 -1 -35 236 -139 336
5161 336 -202 83 -74 37 64 183 222 -177 120 25 135 16 28 -118 -164 146 -88 -204 -4 255 110 -5
5183 -5 -30 -75 247 0 94 178 180 -157 131 -222 281 -29 92 46 249 -4 74 117 -255 -111 -146 26 0 232
5207 232 90 -76 14 -189 -93 -209 5 137 93 92 -66 -127 100 -124 -144 -75 30 -209 135 -72 71 58 -167
5230 -167 -63 79 41 -13 -84 183 -16 100 -57 -146 207 0 59 -322 -37 17 68 -142 -34 73 -115 21
5252 21 -116 17 55 168 57 461 125 272 -233 9 14 2 -54 -19 -72 -112 -155 -124 -45 -54 120 95 -24 86 50
5277 50 -150 8 -49 -285 -20 120 -76 -131 357 -53 143 38 -138 -374 126 -61 -36 -22 -405 36 -233 20
5299 20 -22 52 151 -88 4 115 -161 -45 -45 183 -132 185 35 -22 -104 40 -17 33 -135 192 202 81 144 -155
5323 -155 71 -75 154 -12 -23 147 -195 186 -129 -98 21 -206 -275 -196 43 -4 37 -256 -12 -22 203 323
5345 323 -115 219 -130 -27 74 133 89 -39 -180 93 -115 131 19 38 -202 -73 122 -3 165 48 -207
5366 -207 201 -40 163 218 325 53 -38 -55 109 -48 -119 39 -129 -32 -70 -39 -80 52 -223 24 291 -73 -81
5389 -81 102 -124 -323 -258 105 129 91 -40 -170 178 17 15 78 254 -172 -50 198 89 176 76 -70 -119 -111 -7
5413 -7 -67 153 -6 61 -294 25 -112 -93 -34 -114 -140 -119 96 26 -104 -244 -370 -99 122 -66 207 -167 62
5436 62 -69 165 -248 -106 -139 -63 -285 -255 -102 -40 -161 4 52 -24 13 -153 -11 43 -19 -114 -60 40 -74 6
5460 6 68 60 -175 75 -137 -53 45 105 -150 57 -39 123 176 -60 -79 33 163 -174 30 33 32 18 -78 -12 -203 9
5486 9 -206 -117 27 -135 -4 -19 -84 150 41 -130 -52 135 268 51 -148 -115 310 -235 85 16 -122 -112 -131
5509 -131 -115 -39 2 -160 -77 -133 92 -36 -137 -112 82 122 119 -22 99 65 -190 -141 -145 -29 -31 4 -144 -41 -194
5534 -194 259 -1 -187 93 30 -57 -95 116 25 -154 -220 204 -8 -77 83 109 -274 -85 -110 -54 86 -52 216
5557 216 -18 51 65 82 -118 128 48 -212 -95 67 35 -44 -347 83 -316 -62 76 138 -170 -5 149 -233
5579 -233 288 1 -35 -32 290 -144 -94 -40 -318 -136 95 -194 221 9 160 -39 24 -1 -65 -80 24 -60 33 186
5603 186 88 8 -144 149 95 -244 -108 90 114 -9 121 -232 32 53 43 300 45 84 -159 41 195 52
5625 52 122 -89 84 -75 25 -185 -18 50 -111 6 33 -154 82 182 94 140 137 -270 17 -402 168 -58 -159
5648 -159 -146 10 -225 261 -8 -62 -40 51 22 19 132 -200 268 -242 349 5 45 25 -57 164 124 -15 -252 -135
5672 -135 -145 -113 -174 -125 184 50 -124 -121 197 -419 -22 -133 58 42 -64 36 -299 -65 11 -107 29 -40 113
5695 113 277 72 24 -41 -153 -43 -204 17 83 86 -81 307 -22 -165 -20 40 -323 -74 -86 -1 249 -22 -197
5718 -197 144 128 96 65 -119 132 1 290 -1 73 -218 215 -132 -90 240 83 180 -29 46 107 -355 -97 152
5741 152 -42 -94 110 58 -5 31 -124 28 166 134 -77 -194 -125 -4 208 148 -5 129 -219 -327 -114 2
5763 2 79 -139 -81 -62 -157 5 10 218 -192 36 -185 -176 34 -91 -71 105 -207 -40 -89 -35 -6 314 -120 89 -40
5788 -40 -7 -141 -44 -88 -5 42 138 -157 -49 -22 -10 -120 157 182 322 62 17 255 -39 -50 238 -17 303 -80
5812 -80 200 -98 -12 135 -149 -19 87 1 -35 -90 -54 54 192 -89 -117 37 140 0 -45 -213 83 17 -82
5835 -82 -35 168 59 155 69 87 0 -32 89 -114 -60 -27 -13 -248 156 21 -223 9 -169 24 65 172 183 190 11
5860 11 114 -53 170 165 -64 -11 -37 43 111 -196 -175 -396 -16 -9 -51 -393 21 -343 94 192 -1 42 71 62 254
5885 254 -9 -64 41 -174 -54 140 -182 152 -63 98 -195 -99 -81 -137 -150 -9 -85 -173 -79 -58 237 -22 -202
5908 -202 45 -214 -37 -9 -122 65 -171 -19 -27 93 -19 348 90 79 164 1 20 -55 -15 -395 -155 221 -164
5931 -164 152 212 -9 129 219 -172 202 -12 166 -139 -31 -178 22 65 221 160 -274 238 81 143 108 78
5953 78 -31 150 121 23 -97 48 -63 -10 -80 -297 51 57 71 178 -210 -188 -23 -1 -135 193 6 131 83 30
5977 30 42 -103 6 -310 234 72 -86 13 -170 58 25 64 112 -117 -27 -1 16 -77 3 -313 -30 -125 -283 108
6001 108 100 -201 -121 -234 -87 17 139 -28 87 -93 -58 43 100 -186 128 -146 -92 -176 62 183 29 297
6023 297 38 -207 -141 -15 -67 -58 -198 107 228 -47 -86 69 150 188 -151 220 93 276 -26 -27 88 27 -137
6046 -137 -136 119 -101 58 -104 154 85 21 118 -24 20 -36 20 211 14 179 -275 109 219 -116 -137 -73 -126 -208
6070 -208 200 -207 -236 44 -118 63 87 -33 -39 -8 -69 208 -137 264 116 -506 -165 198 -169 -157 -28 99
6092 99 6 -38 3 -126 -40 68 -239 -43 -35 -164 188 248 -184 -2 301 -83 144 88 -104 38 128 75 171 81
6116 81 -33 -172 47 -57 -214 48 112 -129 -76 -222 46 -193 163 -299 116 26 -58 155 -29 -31 -12 -13 -104 -174
6140 -174 -62 164 237 -152 -212 108 130 78 6 57 21 -2 -133 -96 12 112 -148 22 -176 -77 150 36 231
6163 231 -22 86 -19 -175 -146 71 -15 128 -56 6 4 35 20 101 -256 -2 -86 4 34 125 143 -72 -98 123 -94
6188 -94 -145 -5 21 44 7 21 104 178 -144 -40 28 8 29 209 76 165 -41 233 45 -127 29 146 -43 -204
6212 -204 36 7 236 -55 239 -118 89 -114 102 83 90 143 17 166 -189 23 81 15 -22 -343 32 58 90
6235 90 99 -44 -142 114 254 2 195 70 -12 54 254 45 95 27 -8 198 35 52 -40 -124 -34 143 -183 -3
6259 -3 31 -257 -14 220 56 149 57 -167 -202 358 -118 5 -109 -104 -82 -63 -211 109 -113 -47 79 94 341 -162
6283 -162 15 65 -250 216 247 -156 -41 153 66 -130 -36 121 189 -262 21 202 -28 -220 -102 211 599 -83
6305 -83 -216 245 -255 -53 174 -72 -16 54 93 3 151 113 -101 88 70 -237 -40 76 123 -227 -84 228 55
6328 55 -17 203 57 2 148 210 -287 35 -28 272 -90 0 -116 145 -183 -239 24 -147 -61 -58 -39 127 -111 246
6352 246 -108 185 241 -16 -130 -69 213 62 255 -46 128 113 -98 224 -95 54 -24 66 -158 48 -255 -102
6374 -102 141 -72 121 71 131 -263 -177 51 94 -245 98 33 -87 231 26 -93 -211 -64 -138 54 -118 -96
6396 -96 129 -193 162 -75 46 42 271 -65 -145 35 -119 118 -22 -323 235 -195 -94 154 -12 -32 143 -1
6418 -1 187 118 9 9 -68 -89 -8 -239 132 -411 204 18 -173 -20 -113 48 65 194 60 -21 -6 208 -20 -215
6442 -215 -76 56 158 51 57 130 -137 -50 264 194 133 244 -19 42 46 20 -18 -211 146 -142 -22 159 233 -63
6466 -63 144 312 -5 234 -68 -75 202 -1 -32 -232 228 -183 -8 56 4 184 -166 -145 14 117 -131 -172 29
6489 29 34 80 90 -122 -310 -388 35 -257 229 -27 -296 -7 27 35 99 -403 -222 110 75 231 -32 -86 394 -145
6513 -145 65 -264 11 25 318 71 -110 -56 -383 -38 189 -3 -9 -189 -152 -260 196 59 -170 62 133 123
6535 123 -174 111 -216 -48 -158 -79 98 104 81 245 -201 -98 189 -320 -44 92 -61 -127 183 60 -131 -42
6557 -42 -225 -35 -49 108 30 52 -116 -17 -17 77 196 -53 81 -77 93 -84 37 -105 228 -332 -181 -119 -45
6580 -45 157 101 329 -311 -150 -168 235 -138 -185 130 -46 -12 -384 20 46 -149 -48 98 111 -120 -20 83
6602 83 213 -253 -114 89 -6 -24 48 29 -3 -164 101 -138 -114 91 36 140 -42 -153 107 25 -150 -26 -320
6625 -320 165 -17 -212 12 84 -96 -46 -144 -1 -69 -25 -63 42 53 -63 317 245 143 -10 -108 -30 -66 285 -38
6649 -38 9 51 211 -12 -326 -17 -85 96 2 97 -179 33 44 129 98 -10 -44 -122 151 -57 -19 80 103 -162 108
6674 108 166 278 -170 -114 122 243 -71 8 77 234 213 47 -51 -100 -327 -104 -135 -65 78 -15 -203 -186 121 -23
6698 -23 54 103 146 -154 15 -35 291 -137 56 47 2 -112 -171 213 -9 -91 41 109 99 -5 -25 -259 147 -17
6722 -17 192 -9 7 247 -226 24 49 202 -209 190 -171 -143 206 149 -159 -78 -73 22 246 -46 379 240 -71
6745 -71 -68 93 44 222 58 -33 46 -74 -11 -50 31 124 -175 -90 7 141 -33 32 296 -55 -25 77 -45 50 -34
6770 -34 200 -83 -259 -242 301 26 -17 -190 -44 -47 -27 156 -61 12 61 -6 111 -134 -95 -56 -76 289 -58 45
6794 45 -77 -199 69 -78 -83 213 -111 111 113 -40 209 49 -54 43 -390 -77 28 94 5 -59 1 66 -118 24
6818 24 11 222 159 328 13 225 62 -124 197 22 -280 62 -105 -111 -67 -24 -110 20 -82 6 -34 114 292
6841 292 106 -160 152 45 107 -29 32 -106 51 -78 143 -153 147 104 250 101 31 193 -125 -89 -30 -76
6863 -76 -134 -16 49 81 20 -148 172 -193 105 24 -74 -256 -110 -92 -15 179 104 89 -30 0 39 295 84 -30
6887 -30 18 -278 -176 54 113 60 -278 -84 156 192 -4 -31 352 116 92 155 -240 41 15 -2 78 24 90 94 -66
6912 -66 133 186 -164 230 13 -149 63 -194 -171 -128 38 30 -40 203 323 258 -140 29 71 -154 22 5 50 70
6936 70 -35 113 206 35 -20 16 4 -39 10 -163 269 -120 -196 -12 -87 -2 -265 332 -420 21 94 77 -154 87
6960 87 -30 -110 5 -131 -198 -65 25 -25 -54 68 -82 -144 -35 -250 -276 127 -116 -11 257 203 -21 7 3 158
6984 158 -65 279 144 -119 -15 -29 6 -96 -54 214 80 67 -131 16 -172 32 -45 79 -137 169 -172 -35
7006 -35 70 -45 106 -268 -26 80 -177 -103 -107 -3 29 -21 372 114 -147 -8 -1 -157 -141 22 10 360 -155
7029 -155 -224 173 216 64 -83 -137 97 -187 120 -95 98 66 22 -35 62 -117 -176 82 -27 -32 -107 -37 137 106
7053 106 -153 -32 -91 -183 186 18 33 166 183 8 118 -83 -16 -53 -24 -121 105 -171 -95 -84 -20 -3 166 -29
7077 -29 5 -38 -279 -248 68 136 -74 199 69 58 -49 116 12 -89 221 122 -94 31 -174 -49 -46 -66 11 71
7101 71 -59 198 -115 197 70 -160 -117 -205 -84 -36 69 85 -61 -239 122 -33 68 -88 101 282 -99 70
7123 70 -301 -173 261 227 98 67 208 215 -189 -88 -82 -140 36 -54 -5 -84 -94 -234 179 -160 -87 -157 -4 -290 -39
7148 -39 24 45 265 -29 21 9 -264 -101 -232 53 -74 45 -66 26 14 -94 -80 120 -103 -68 -50 -15 9 -173
7172 -173 -83 -184 -65 -206 241 -15 25 -50 61 310 -136 -78 122 17 66 -11 85 -56 -31 47 116 28 83 -90
7196 -90 -65 -1 87 -163 -9 25 -34 -129 187 -253 -122 16 -56 -198 -194 -22 -117 12 1 271 -37 -208 39 -130
7220 -130 48 110 -354 106 100 58 -238 -206 22 38 64 227 148 15 -66 -219 -28 77 -99 24 -114 38 -23
7243 -23 61 -108 0 -13 -277 -129 75 108 93 124 -15 -4 74 37 235 -173 15 -12 -32 350 -208 253 50 309
7267 309 -118 20 84 -85 277 67 231 -68 -19 -19 59 95 -176 -72 212 -127 -159 29 122 -174 -78 -27 -84 -46
7291 -46 13 33 -65 -144 -29 21 -41 400 -86 -21 -60 -155 89 -206 111 129 -78 62 -134 -139 176 -77 -29 273 -172
7316 -172 -26 -3 185 214 5 -171 -91 48 -20 -44 -148 16 -269 44 -69 -90 -40 174 57 117 119 -85 -91 -170
7340 -170 48 30 -109 405 -38 232 144 -40 -2 -324 -152 -86 -226 46 -78 92 191 65 -132 -147 -78 -139 -150
7363 -150 116 36 -16 -9 64 37 108 -97 224 6 41 -239 -217 -124 -121 64 159 137 54 -94 -186 128 -12 30 63 -157
7389 -157 -3 159 19 -160 -293 -42 -88 -102 122 0 -314 16 -237 216 -24 91 -251 50 8 -188 -132
7410 -132 -68 219 -47 -52 -156 150 -14 -122 -39 12 513 -152 -135 -179 275 -27 -1 -224 65 157 78 -186 -204 152
7434 152 -72 36 70 -224 -124 -115 -74 58 87 -27 115 43 144 -37 258 218 -105 32 -225 -112 78 -92
7456 -92 -313 111 -242 -89 -58 147 346 15 60 -18 102 -216 -65 -133 143 125 184 88 -25 -38 72 -139 117
7479 117 -125 -17 -200 50 118 -5 -1 157 101 -96 -114 67 -295 -135 194 -274 23 49 90 -116 129 -44
7501 -44 -63 -145 -278 59 -216 -108 -33 124 276 -33 -146 -160 -34 249 85 -168 -131 -108 107 -170 301 -207
7523 -207 -81 -94 -78 -30 -85 -64 -268 -33 92 118 -51 -4 68 1 -134 -10 -7 -135 259 140 56 -236 -109 45
7547 45 -204 -85 123 190 67 255 111 151 13 -113 91 -77 -263 -32 -8 -84 167 -75 -146 -269 -143 10
7569 10 3 151 -137 176 -51 -54 190 -96 -293 -218 -42 -100 95 13 47 -138 120 -132 341 -141 -37 -363 261
7592 261 -341 160 -262 -331 -135 -252 -21 79 48 54 255 -290 125 82 -75 33 118 -341 -24 105 211 41
7614 41 -223 24 -65 -293 1 163 200 29 -110 -147 -88 27 75 35 221 -76 4 -88 309 -209 91 378 -236
7637 -236 -142 -69 -69 -3 86 101 -18 19 -69 161 80 -8 -227 -113 -37 326 -76 -62 74 9 173 -97 -72 -51 -247
7662 -247 22 15 78 -172 -72 -46 251 -32 20 6 175 333 -67 184 14 70 146 51 -18 -28 162 5 18 175
7686 175 -110 -69 -241 91 -114 36 26 97 163 73 -262 226 118 -141 20 18 41 -296 98 -53 146 -86 20
7709 20 105 10 -30 72 207 -124 0 -100 -84 -246 53 -64 -94 -25 -87 157 71 -77 152 238 30 45 -83 190
7733 190 45 63 -47 -29 -48 214 -59 -50 -72 24 46 23 82 -235 -31 53 -8 60 27 -77 45 106 -223 -64 137
7758 137 59 206 83 -296 47 75 -310 150 41 34 244 163 -294 112 27 211 -60 35 50 -195 57 -22 -117
7781 -117 93 185 -106 -60 57 124 -114 283 82 54 -173 154 258 95 -47 -71 55 -326 121 1 292 300
7803 300 44 77 24 241 23 -122 31 -9 -240 39 -172 124 -57 29 -56 90 1 235 -18 -378 -119 -57
7825 -57 132 202 -18 161 12 -366 -26 -118 -131 -271 58 -142 -115 -159 117 76 -45 82 -15 81 -109 -34 -222
7848 -222 -58 -76 -43 53 -206 7 -93 -123 -71 182 26 -244 175 -65 -10 50 -167 -161 -249 -70 -90 -185 -173 -161 -125
7873 -125 -219 -56 -44 -56 23 49 -55 -15 0 221 -80 105 -205 115 41 -109 174 155 32 -67 105 -58 -100 131
7897 131 116 0 370 144 -10 166 -157 -45 46 -83 -6 72 90 -28 -145 -253 65 -211 -318 -56 -161 305
7919 305 60 -298 108 -116 33 -69 188 166 -138 -228 277 -187 -65 -58 45 -161 36 6 -219 138 -250 -132
7941 -132 -161 208 3 -248 109 5 159 -3 -207 -24 22 -319 -181 123 -80 164 71 133 -95 -102 -129 98
7963 98 -150 -53 -252 49 -99 56 23 124 -74 87 8 -47 -18 -46 12 81 36 197 -292 -203 -175 21 -160 37
7987 37 -305 139 -81 -161 150 -197 13 -49 181 199 208 -47 -162 69 -80 -142 101 -333 -7 253 98 -4
8009 -4 61 60 108 -242 -287 190 -272 -88 158 -146 1 -197 -56 97 37 53 -154 -371 250 -140 -46 28 -37 -298
8033 -298 -109 -174 -118 131 -119 194 50 104 43 69 121 95 280 238 89 142 199 -178 -163 27 -111 63 4 79
8057 79 -187 -152 55 -89 -95 40 -312 -17 186 -53 -189 181 -2 -218 34 -36 -58 -166 -156 -148 -254 222 -101
8080 -101 -100 -64 -122 68 122 155 32 -181 -133 119 -41 -2 97 15 235 -120 81 -48 78 -41 71 169 -199 -46
8104 -46 -147 254 78 -253 197 -79 46 -136 -291 -30 113 -237 -250 2 12 -154 4 -295 -34 216 -15
8125 -15 55 16 30 -144 -173 120 3 -186 93 -26 94 -189 142 190 187 -17 197 24 18 -88 88 -68 -60 -205
8149 -205 87 73 -85 246 -198 -81 374 9 23 221 109 9 -125 74 -77 99 148 113 -87 388 -135
8170 -135 -197 -26 -237 67 88 47 -27 34 247 24 13 -126 -88 296 -6 12 334 203 -154 -135 -165
8191a65
$$ Imaginary data points
##PAGE= N=2
##DATA TABLE= (X++(I..I)), XYDATA
0 0 0 0 0 0 0 0 0 0 0 0 0 0 7 -7 7 -7 9 -14 14 -21 21 -28 29 -35 42 -49 57 -70 77 -91 105 -119 133 -151 170
35 170 -192 215 -241 269 -299 334 -371 412 -456 505 -557 616 -679 747 -822 906 -999 1099
53 1099 -1213 1342 -1486 1651 -1838 2058 -2317 2628 -3011 3494 -4126 4995 -6261 8300 -12112
68 -12112 21737 -103093 -120405 74492 9315 -41637 36716 93438 4490 -17352 12482 -30492
80 -30492 -92362 -30787 26331 5732 13341 79152 58652 -13749 -15258 8999 -40615 -54472 23092
93 23092 58902 5434 1579 48315 27944 -25597 -10237 8066 -25840 -31259 13988 21417 5379
106 5379 26046 30961 -22471 -46782 -10937 711 -22430 -8186 24267 11805 -12805 -756
118 -756 9567 -12287 -23189 -9059 -8798 -15540 5069 25921 11026 -6483 1884 -805 -21849
131 -21849 -12668 17070 15337 -730 8315 15412 -1192 -6849 5561 1407 -7578 3881 13634 4937
145 4937 4536 13948 4455 -14824 -14241 -2279 -633 1797 11545 13888 1594 -7297 -7178 -8396 -11829
160 -11829 -7385 390 481 573 8182 7392 -4230 -8030 -4721 -10837 -15177 -1214 11303 8178 5025
175 5025 6363 -1090 -8696 -4843 -1009 -2237 1529 7648 6746 3776 5206 3295 -2525 -4295 -1989
190 -1989 37 1777 4933 7796 6241 -377 -5575 -3887 -2361 -1825 1915 4314 860 -898 750
205 750 -2761 -7005 -4265 -1519 -2311 1009 4874 1817 -1794 -964 -3052 -8463 -7001 -975 2538 5581
221 5581 7724 4970 -184 -3369 -5203 -5489 -2349 375 2711 7102 9019 7116 2803 -2048 -6331
236 -6331 -6076 -3193 -1871 2498 9544 9854 4783 1692 -1373 -7584 -8872 -4911 -1637 1150 5730 6117
252 6117 4472 2879 -1794 -8491 -9268 -5513 -3302 -411 3968 6062 5126 2475 -2277 -6383 -6632 -4915
268 -4915 -3544 1144 5161 4914 4041 4155 748 -3014 -4468 -4745 -3280 2002 5348 4069 4300 4629 1152
285 1152 -2173 -2508 -3189 -3058 476 3270 3112 3083 2998 427 -1068 -1495 -3463 -3750 -559 1535 1188 1945
303 1945 1519 -262 -1276 -1511 -3141 -3487 -1373 -556 231 1976 1221 -522 -372 384 -1636 -2667 -1119
320 -1119 -991 415 2181 1226 121 1043 1110 -857 -677 75 -1181 -1092 1394 1880 1338 2030 1087 92 610
339 610 -237 -2050 -1186 826 1009 1104 2426 1635 321 -14 -864 -2292 -1628 -96 -210 1521 2530 887
357 887 -121 290 -1058 -2657 -2411 -1520 -704 1019 2197 873 95 395 -1546 -2242 -2087 -1767 -1737 910
375 910 2630 1646 956 213 -1421 -1759 -631 -1363 -1161 1085 2489 1796 1969 1464 -1003 -1456 -743 -878
393 -878 -454 1025 1829 1573 2262 1122 -1042 -1109 -184 -1279 -764 393 1135 1044 1779 245 -1212 -1104 -1314
412 -1314 -1800 -621 439 -60 -20 1110 464 -812 -1345 -1439 -1439 -225 361 -614 68 1073 553 -73 171
431 171 -875 -1250 182 671 420 893 1155 230 559 1151 -261 -924 182 271 -232 1149 1420 478 534
450 534 835 -240 -880 -65 -722 -768 623 454 -617 115 775 -410 -1072 -1169 -1425 -1248 -19 -237 -216 729
470 729 625 -455 -214 -782 -1950 -1402 -393 -154 109 834 1293 772 759 -267 -1714 -1334 16 -61 659
489 659 2066 2058 1051 918 179 -1288 -949 -619 -854 855 2347 1552 1095 1610 100 -1673 -2116 -1719 -1073
508 -1073 671 1710 1493 1015 1195 -654 -2224 -1900 -2547 -2127 -653 1051 1648 1698 1193 -546 -1299 -1569
526 -1569 -2480 -2349 -489 1613 1677 1925 1507 -80 -655 -771 -1456 -1016 -22 886 1597 2887 2428 539 -600
545 -600 -583 -1350 -1172 39 848 1719 2241 1300 26 -142 -630 -1650 -1102 -439 -199 231 1444 1083 -106
564 -106 -628 -1486 -2050 -1239 -342 -727 69 1133 300 -139 -157 -633 -1292 -315 -291 -545 197 728 432 625 821
585 821 -327 -839 -280 -117 155 763 984 428 593 827 335 -246 627 67 -139 374 206 -143 626 648
605 648 87 -158 -66 -463 -285 247 -381 -769 -8 181 -270 244 101 -670 -503 -385 -726 -747 27 148 -135
626 -135 414 156 -588 -265 -38 -442 -469 243 222 323 997 1114 196 -168 -154 -717 -51 904 480 595 1152
647 1152 787 -35 -240 -221 -1137 -470 28 -58 453 1475 665 -73 -281 -1136 -1836 -993 -133 -120 288 877 213
668 213 -162 -45 -1358 -1541 -845 -268 -231 822 1306 565 355 -30 -1047 -1481 -790 -364 577 1658 1564 548
688 548 614 224 -553 -736 -639 -116 363 1160 1648 994 909 293 -1026 -884 -718 -901 -164 1067 1021 857 474
709 474 -205 -958 -923 -1106 -1365 -264 488 821 491 331 -584 -1079 -739 -1027 -940 -102 359 817 1107 806 -10
730 -10 -561 -472 -382 -678 181 489 623 706 1093 250 -313 -146 -624 -388 320 650 265 608 689 312 -220 12
752 12 -410 -434 285 -139 -287 322 383 -84 9 -157 -862 -481 135 -573 -347 85 -268 -72 204 -14 -623 -319
774 -319 -61 -628 -271 -190 193 -78 520 400 -237 -45 -290 -735 -120 292 258 236 663 792 291 511 -4
795 -4 -508 -496 344 -3 215 967 570 195 482 -186 -702 -504 -354 -375 4 456 307 345 134 -426 -1184 -664
817 -664 -711 -613 -96 405 235 532 518 -323 -937 -598 -704 -548 148 360 341 807 808 -140 -174 -367 -635 -303 503
840 503 813 615 1184 393 11 -272 -453 -647 -303 119 283 889 962 661 -58 -47 -604 -932 -540 -256 277
861 277 424 754 548 -227 -400 -820 -1149 -621 -272 66 352 649 287 -131 -321 -626 -808 -402 -261 63
881 63 596 476 376 146 8 -557 -684 24 -159 -22 669 725 384 468 233 -368 -305 -60 -84 -104 414 601
903 601 195 273 63 -452 -329 -216 -359 -480 -4 202 27 322 -2 -433 -330 -344 -596 -365 167 -48 -71
924 -71 183 103 -393 -21 -219 -111 -292 -238 -86 -109 456 429 28 204 -64 -8 97 125 -172 -19 561 550 176
947 176 537 260 -176 -52 -250 -344 10 183 45 425 369 -105 -539 -192 -274 -384 17 81 234 132 365 94
969 94 -486 -421 -579 -811 -98 -126 -152 389 700 128 -127 -354 -722 -638 -155 -12 194 799 696 263 372 32
991 32 -641 -444 -157 -175 710 725 743 647 333 240 -444 -216 -392 0 341 683 375 354 318 -42 -508 -884 -392
1014 -392 -631 165 593 317 27 231 -54 -656 -678 -790 -685 99 554 219 455 427 98 -410 -314 -19 -413
1035 -413 204 557 520 427 404 213 -276 20 -115 -484 193 438 268 673 526 -315 -43 -135 -217 -456 97 -133
1057 -133 -25 307 462 39 -432 -138 -479 -466 -339 28 -1 330 213 113 -95 -195 -385 -162 -158 -50 -56 326
1079 326 54 186 314 2 -475 -17 -41 -236 252 273 217 -29 387 181 -247 107 -12 -352 150 409 252
1100 252 82 473 27 253 109 -300 -123 -97 -151 -113 161 546 220 -33 -154 -529 -248 -58 -147 -418 -105
1121 -105 68 65 -80 -87 -442 -355 -367 -224 -246 -100 227 198 416 419 -170 -239 -69 -93 148 307 512 439 289 268 -320
1146 -320 -173 -2 -302 79 187 400 678 666 259 -95 -160 -430 -466 -267 185 96 271 372 235 -251 -534
1167 -534 -360 -623 -154 -99 -57 73 482 59 13 -234 -553 -576 -221 329 -10 155 541 164 -159 161 -179
1188 -179 -365 -431 112 221 357 671 122 125 275 -260 -355 -66 -90 -44 520 319 -25 172 58 -203 -330 197
1210 197 -146 -110 444 269 -84 223 -40 -380 -412 -327 -414 -182 305 -3 -197 9 -11 -29 -268 -132 -493 -128
1232 -128 181 126 358 83 219 79 -100 70 -301 98 34 -6 44 427 127 56 98 271 -103 -160 94 -263
1254 -263 48 271 327 188 146 -19 -245 -198 -391 -514 -57 177 354 -230 -31 -42 -219 -327 -366 -664 -271 79
1276 79 354 67 297 -132 -343 -417 -248 -180 26 10 -96 596 361 42 -161 53 -238 -255 105 -62 263 373
1298 373 354 174 231 -73 -567 -108 -208 -19 256 277 339 188 23 38 -665 -177 -88 -39 28 489 236 69 -291
1321 -291 -298 -480 -272 -92 -286 -31 188 120 386 193 -119 -351 -390 -196 -249 453 312 47 93 108 135 -194 -269
1344 -269 -110 -99 -54 185 447 162 89 -83 -292 -374 -202 -328 143 601 -57 257 322 -178 -114 -230 -171 -22
1366 -22 167 148 121 286 172 -173 61 -419 -429 -142 53 -121 -21 249 60 -197 -36 -58 -263 -18 216 -164
1388 -164 57 286 100 72 140 -112 31 -138 -45 -45 14 225 -93 236 187 -367 -38 -106 -132 47 -224 217 -140
1411 -140 320 350 331 -247 165 -360 -223 -14 -29 35 219 151 -127 -88 28 -131 -60 -49 -226 96 25 352 -66
1434 -66 -89 44 -37 -239 -305 -213 10 240 542 413 197 30 -103 -164 27 27 145 359 295 489 297 24 -493
1457 -493 -29 -161 -258 -163 267 293 302 202 -290 -191 -97 -280 -351 94 -28 81 402 271 77 -227 27 -541 -159
1480 -159 178 3 177 251 135 192 -50 -207 -363 58 -28 -15 75 359 332 206 105 -175 -191 -316 45 172
1502 172 170 214 289 5 171 51 -169 -201 -135 -291 -45 365 -164 71 -297 -285 -473 -382 -33 -165 68 -5 58
1525 58 -166 403 -115 -372 -189 27 -80 -21 -11 -20 205 58 -138 -340 -65 -22 -222 232 52 170 292 160
1547 160 141 -146 88 -116 -77 92 -101 -1 493 259 133 -171 -48 -278 -124 -179 -300 73 -251 240 162
1568 162 74 28 10 -216 -225 -233 -143 -170 107 -97 180 31 -129 26 -238 -166 4 42 -2 65 103 71 -109 -144 -122 -163
1594 -163 -82 149 32 174 338 96 -341 -90 -275 -381 -208 -47 -48 481 545 272 -180 36 -127 -175 -269 -191
1616 -191 58 271 420 -82 36 131 -170 -393 122 -216 -269 -37 351 -186 147 77 -398 -193 -90 -144 -67 49
1638 49 352 568 249 -63 -213 77 -7 -362 -249 45 296 -79 125 307 -19 -187 80 -37 76 -126 165
1659 165 -55 197 -30 -64 -251 -214 -238 117 -87 212 222 62 104 143 -59 -100 -212 83 215 -14 -45 85 152
1682 152 38 62 -6 -199 -368 -43 23 -124 46 56 228 66 -171 -46 -107 152 -62 91 -138 450 11 34
1704 34 -244 -96 30 139 -200 -15 296 82 25 97 -118 -9 -485 -330 -276 243 58 -100 79 289 -91
1725 -91 -166 -40 -175 -303 35 -34 40 460 109 91 176 79 -128 -245 -161 -134 80 267 74 111 267 -237 59
1748 59 69 142 -77 334 44 260 11 0 -202 -230 -128 -66 100 65 110 110 32 -68 114 -148 -52 28 -369 273
1772 273 104 -174 227 108 -112 -383 16 -100 -119 -201 -77 117 199 80 54 -130 -264 -396 -312 19 328 120
1794 120 139 259 224 32 -29 38 -226 346 -44 134 -35 206 62 -147 -210 -219 -109 101 113 -40 385 17 -84
1817 -84 207 -116 -227 2 62 -188 -266 318 -78 -231 140 -53 -86 63 -138 -222 143 252 -14 87 379 -42
1839 -42 -51 -6 -10 3 -16 53 41 257 100 95 -52 81 66 -58 -72 87 -140 58 268 -8 -149 -86 -46 -60 -25 170
1865 170 27 271 204 65 -207 150 -239 -159 -260 -149 -6 116 137 -73 168 89 -118 -324 -139 -13 89
1886 89 61 -42 245 89 351 123 -30 -215 -218 117 -12 226 99 355 123 -80 142 -138 -151 266 143 -11
1908 -11 23 140 -61 102 -207 -183 153 121 102 177 274 153 70 96 -321 -189 -129 83 -109 287 -198 50 -90
1931 -90 261 473 -212 -299 -53 -85 -48 367 220 -87 -102 -238 101 14 124 -3 -160 171 234 82 108 66 -161
1954 -161 -189 -189 -96 -75 28 263 -42 358 103 -13 -33 -61 -107 -42 -38 67 -31 -7 28 -141 -62 155 -189 -258 74
1979 74 -52 135 163 -160 97 -3 -210 -20 -282 157 -243 203 293 161 178 -85 -232 -192 -209 -163 145 -84
2001 -84 18 132 54 153 92 -114 302 114 -98 204 161 38 62 -51 9 -133 32 -213 -104 -49 -43 -40 -138 125
2025 125 -234 27 -32 -197 -130 -160 101 -58 397 -138 6 159 -10 -86 -70 -49 46 134 -75 199 -128 -356 75
2048 75 -91 174 -130 226 -43 7 -112 52 326 61 -47 -170 72 131 49 84 -2 271 -78 -153 -347 74
2070 74 -227 5 -86 95 89 -41 198 -258 76 80 14 -204 239 262 85 -27 148 -73 -166 -176 -241 56 67 104
2094 104 36 -75 -94 102 -4 80 10 -17 -188 28 116 183 -342 104 17 92 -327 -81 -192 108 -59 -149 318
2117 318 -382 173 -184 -119 -155 126 36 80 22 -81 -206 192 -29 -244 -50 -74 -294 -31 -25 112 66 -55 -16
2140 -16 -174 -32 115 107 -4 -170 19 -83 -56 96 -123 209 81 153 316 172 -52 215 -84 -110 -85 -74 -36
2163 -36 -26 85 92 360 81 150 316 185 10 -114 -112 -16 -66 -65 -88 -216 -4 67 -91 -123 -4 -147 -269 -373 114
2188 114 237 39 56 40 -206 128 92 -163 -7 -154 -18 62 131 138 117 9 -8 74 -175 -134 112 -52 40 238
2212 238 62 1 -225 -128 -198 -140 67 -78 247 68 56 -115 -101 -124 -265 -259 19 -20 131 23 37 150 143 -137
2236 -137 16 75 -43 -102 -49 -82 69 -64 33 156 233 52 48 58 346 -105 172 89 -77 -73 68 -14 191 218 -174
2261 -174 227 59 -291 -146 209 16 192 -38 243 7 113 205 -49 -249 136 29 -95 96 20 178 135
2282 135 48 63 -168 84 37 -56 -282 10 -88 178 269 155 -290 327 -2 -132 67 -162 -5 202 161 -194
2304 -194 -56 204 -98 -88 147 -251 -58 -119 -330 -21 210 100 40 148 -187 108 14 154 27 205 -35
2325 -35 -39 -14 19 -86 156 220 -44 120 75 50 -100 245 -28 247 51 -60 119 48 -240 142 43 18 -137 41
2349 41 -40 -34 -136 91 174 66 9 -158 -39 17 -167 -153 200 198 68 -235 160 186 75 -114 -390 120 70 157
2373 157 -42 -84 21 113 164 -207 -46 -44 -15 -68 -70 260 -4 13 -285 110 58 -38 4 312 67 -25 89 63 -203
2398 -203 -14 107 107 143 -175 -52 127 64 120 -79 -21 -162 77 176 -143 62 116 11 188 -6 88 -147 16
2421 16 -245 -284 -119 225 -85 230 -229 -317 -10 -353 -30 -393 -151 -131 195 62 -26 -219 -124 -78 -57 105 -54
2444 -54 -65 275 -83 128 -57 -118 4 -303 -126 -120 -238 73 212 111 218 37 -113 -8 -107 -62 -184 -196 42
2467 42 12 -17 56 56 83 -87 -61 -104 21 189 256 117 -28 15 3 -213 -64 -79 30 -147 -252 110 12 44 8
2492 8 3 122 195 124 -105 -151 22 -148 14 89 -24 156 -231 -201 72 74 26 -95 -173 11 -23 158 -74 -37 -143
2517 -143 -110 140 0 -153 59 -109 -26 308 -64 -158 5 149 32 17 208 -34 283 -57 -65 -205 -82 32
2539 32 -38 -3 -108 -210 146 123 10 -89 -89 -8 -64 92 -294 92 -123 -40 -69 -302 -208 -208 45 28 -262 112 166
2564 166 -16 -223 230 -61 135 -8 -390 48 52 -167 285 -85 -19 43 -94 44 -44 235 94 29 -237 188
2586 188 152 -14 95 -63 -107 -119 233 -206 -61 45 -180 -122 25 79 -252 -140 16 -39 -114 -32 67 -326 -136
2609 -136 -81 -140 -80 -86 230 212 67 -67 66 -55 -258 390 36 145 -142 61 62 -68 62 -94 40 -232 -77
2632 -77 242 57 232 -80 85 -51 -90 55 54 188 69 -23 -304 -76 -186 -11 -49 -268 -160 -60 208 -17
2654 -17 261 119 17 28 -7 199 -200 -38 18 12 23 169 310 -155 94 -119 -115 -146 -22 -176 -7 -121 28
2677 28 -111 -3 -346 436 296 48 -126 237 146 -23 132 -36 187 -320 1 -10 190 -15 -82 80 -92
2698 -92 -194 -19 -269 111 -213 -20 100 -145 -209 -146 -43 40 191 -56 -217 -49 -86 134 -42 -16 -157 -112
2720 -112 -96 119 -59 -42 74 129 183 -76 -38 -225 -189 -22 -59 -109 -36 138 207 -3 127 16 -159 -73 -54 46
2744 46 -79 -86 209 114 211 -11 -209 -247 -70 83 -133 -5 27 28 141 -69 80 180 68 -60 153 350 56
2767 56 -7 75 118 106 -274 14 209 -194 31 -122 -55 200 308 -85 -36 110 -63 -255 -16 201 -58 -90 30
2790 30 161 214 61 -68 -101 -2 -302 -22 78 158 -9 -47 -87 -50 -163 -141 -167 53 -125 52 201 -128 -3
2813 -3 -25 -32 -25 81 -162 69 -54 87 27 -250 302 -196 66 158 54 181 -55 -113 131 -99 116 169 230 -155
2837 -155 97 3 -83 -303 -43 -103 187 -54 154 -87 -209 -193 -147 93 275 -48 -151 -47 22 29 -229 -59 -89
2860 -89 169 56 178 7 16 19 -141 270 10 -442 31 187 93 -63 -345 -115 226 31 -99 -294 197 -60
2882 -60 30 -243 -79 133 -5 16 -172 176 53 220 -79 -68 -59 -109 -78 130 -47 55 187 -20 112 -157 71
2905 71 -22 130 59 59 -105 -91 61 24 228 56 114 -107 -313 212 22 33 -178 -47 -175 120 -162 -233 -66
2928 -66 -76 246 -218 176 -112 -134 119 259 -3 -209 238 -164 33 -145 94 93 126 128 -66 -182 -24 -6 -139
2951 -139 -116 11 334 120 128 -81 293 103 58 -166 -22 -134 -88 128 169 107 106 -119 69 -101 10 57 -83
2974 -83 -137 177 138 -29 -44 113 148 -40 58 -4 -64 -92 39 146 -127 249 211 -269 215 -28 29 3 163 -133
2998 -133 -206 -106 -260 111 29 55 40 -88 -166 -10 -208 5 36 -331 -181 -30 140 -4 -62 -18 -76 -117 -55 -42
3022 -42 -29 94 -4 -29 26 -206 -87 -145 88 123 -171 -4 49 29 184 92 41 93 24 92 28 224 -294 -23 12
3047 12 -32 30 107 -70 -207 -163 24 20 -163 -264 77 -9 -45 99 -187 -168 -11 19 74 -41 70 -107 -5 -110
3071 -110 -104 11 -125 -155 -132 164 29 68 -2 -57 -158 177 171 -106 -43 -88 -92 44 109 -220 -115 334 -226 128 37
3096 37 -78 -101 -274 41 -163 100 103 15 80 -161 -72 43 -135 -188 4 95 20 77 83 60 -39 -56 -145 35 -210 261
3122 261 7 323 -24 2 -52 264 -83 54 -134 -319 -99 15 102 4 -177 -101 -138 -141 -140 -332 160 -59 32 -66
3146 -66 -162 -192 -63 -158 83 44 -171 5 194 -234 -166 11 -50 -120 -91 107 194 -94 -159 -64 21 -17 278 -49 -44
3171 -44 -88 53 133 -68 -114 216 -104 80 12 97 -10 -8 7 -31 -27 -41 99 196 97 -23 -148 68 -60 158 -112
3196 -112 -128 -65 22 10 58 84 28 295 192 -128 -311 -189 -67 102 262 -98 19 -49 7 48 -34 61 -80 -52
3220 -52 -77 -23 26 84 -157 -91 38 -80 175 -100 -175 17 2 24 -5 231 215 -54 -152 -28 27 47 8 156 -2
3245 -2 56 169 -14 -8 100 -200 37 66 123 -48 163 -309 -3 -274 -289 -49 225 348 189 -85 -122 28 -151
3268 -151 -98 -47 97 -86 219 -130 -49 4 238 45 -66 74 -272 -73 -58 -75 -57 179 -1 -120 -207 -28 54
3291 54 204 -145 -88 -235 -72 -174 205 55 -157 -320 -204 208 59 67 178 65 93 25 36 121 69 -304 -303 -117
3315 -117 25 3 -50 -138 -67 -165 87 51 -18 83 -97 46 -224 148 48 44 103 -20 -9 56 156 40 259 -210
3339 -210 9 -28 57 -116 -13 253 -38 -221 90 107 -58 269 -114 -250 -19 116 -352 1 -31 -262 35
3360 35 332 -32 -120 -189 12 -145 -326 -69 154 -95 179 219 202 111 27 -9 161 -152 -50 -123 13 79 257
3383 257 84 196 89 -89 -48 21 -254 -240 78 -11 117 -37 -160 82 -47 -80 106 -158 -197 120 -180 81
3405 81 43 -39 182 70 -25 38 7 -54 47 -136 -23 -30 50 -81 91 118 -35 -197 -106 -63 110 57 140 158 54
3430 54 22 3 188 316 54 -165 -20 -48 73 32 -74 28 -101 429 -6 -129 87 90 -146 -145 165 -54 99
3453 99 22 -194 70 -194 54 50 7 25 185 -69 -62 -15 208 32 -301 50 -123 -38 67 14 -45 -148 97 -60
3477 -60 32 -163 10 246 -63 54 109 143 -125 -139 99 75 -91 81 14 86 -17 -34 -150 -56 117 -119 -75 -150
3501 -150 -95 -94 -144 56 85 -75 -71 89 0 -300 -207 -115 -91 222 21 321 208 -194 -46 226 165 -58 65 101
3525 101 -110 58 50 81 20 -28 165 71 -19 26 10 133 -153 -114 -53 -5 -109 -32 -135 -54 103 -15 -10 182 -91
3550 -91 -55 346 84 88 -257 -106 238 -146 202 97 55 -66 -115 126 291 -260 -111 -120 -204 172 -18 52 135 -74
3574 -74 -46 -60 -35 71 18 -19 8 -148 -8 -146 -30 21 -196 -181 46 124 -354 -54 16 -49 94 -3 28 -132 271
3599 271 -98 26 -112 -22 -102 -40 100 97 17 65 40 78 -53 -113 -120 80 -125 -113 -54 -46 -32 124 -199 179 -272 -184
3625 -184 -77 -186 -40 -74 -48 -87 60 -114 -12 -97 159 -41 138 -174 124 -99 69 73 274 94 -45 151
3647 151 18 240 33 -45 -268 57 -192 -3 -111 -13 -125 87 -219 -222 73 19 84 338 -51 -228 84 7
3669 7 131 -36 212 330 -290 45 -41 -168 -166 120 300 150 177 160 -267 75 240 9 -31 -350 -25 -94 -38
3692 -38 20 -146 -89 -219 143 -85 7 -166 -19 -213 -96 89 -304 30 222 -66 -84 -117 -51 -33 -31 -118 158 162
3716 162 100 289 -100 76 -114 102 -33 0 47 36 -101 10 -191 -219 -166 170 -205 -17 90 159 -382 -125
3738 -125 -20 -59 -63 -27 189 103 20 -38 71 181 26 -251 -6 153 -26 72 -39 -5 -109 -45 -74 44 -191 -192
3762 -192 237 -179 -372 6 240 18 -104 -27 -21 106 105 18 61 -79 78 69 163 58 255 103 69 138 34 37 129
3787 129 364 -43 139 129 65 85 -92 -170 -13 73 -225 10 241 -308 -89 -164 48 -47 47 -75 83 -117 188
3810 188 124 108 63 128 -220 -67 54 20 51 261 36 -129 -59 -158 -73 -248 -44 -95 -20 64 -33 -6 -2 -55 -214 -71
3836 -71 -31 56 -34 -16 25 179 132 27 -127 -126 -134 -12 -70 -20 -84 -34 176 17 244 -80 -31 -216 -45 24 -180 -5
3862 -5 36 25 -50 -206 111 25 -91 45 283 -12 -43 -90 -133 277 -246 267 -137 238 31 -17 -52 -158 -78 -400
3886 -400 141 109 44 155 -220 -134 47 46 -345 37 85 253 -77 182 -121 64 209 84 59 -22 -304 -67 249
3909 249 -69 11 156 30 -131 55 -58 -98 -41 -340 122 59 -137 138 -152 -36 -215 -122 -178 252 61 -263
3931 -263 213 5 30 123 91 -129 45 -79 -145 34 -286 138 4 79 -128 53 120 18 -61 2 136 -277 -108
3954 -108 39 99 184 -37 -129 -332 -166 134 -22 61 253 -21 -212 -39 -82 241 20 -110 309 52 -3 24
3976 24 351 -49 -154 -120 -227 18 161 79 117 -57 -3 -126 -102 312 38 -23 45 298 -153 301 -227 -209 138
3999 138 58 110 -126 170 279 13 107 -27 -213 291 -65 93 236 -206 -35 -207 -411 -333 177 -27 149
4020 149 -198 168 243 -20 -93 13 270 -167 -110 -64 -81 -56 22 94 -11 -225 -35 71 -6 209 35 -46 -159
4043 -159 -132 151 -174 -95 -114 140 3 40 98 158 -28 98 148 -88 -222 104 175 -98 198 117 -91 -224 -112
4066 -112 -176 -415 -106 159 -50 111 185 328 115 229 94 100 -35 165 -44 -190 -225 46 93 -108 45 19
4088 19 129 7 128 74 -208 -214 42 77 -56 0 -82 -49 -148 -94 52 37 -320 -196 -151 274 425 -37 -127 55
4112 55 133 37 -58 -169 42 -63 118 -194 -86 227 -242 66 -5 102 249 45 -329 -24 83 -60 -52 42 -103
4135 -103 87 196 -30 -129 -33 -95 26 -39 -8 209 -176 291 11 -82 222 182 -208 -169 -62 -207 38 86 91 -45
4159 -45 -6 18 -105 -198 -265 -235 102 -273 96 -128 -180 188 62 141 -109 45 -25 107 -8 257 110 -232 -111
4182 -111 278 176 38 132 -245 -32 -80 257 196 174 250 233 -38 95 139 119 37 -379 122 245 -41 31 45 40
4206 40 139 -118 20 -185 -151 -117 -72 -240 111 -208 -101 154 1 103 -246 12 -289 -46 -222 -98 40 -31
4228 -31 94 24 165 -149 -44 -44 29 116 2 108 -255 -68 13 -146 5 15 28 5 -19 68 188 -156 80 -73
4252 -73 -174 159 65 45 -189 -96 33 19 93 -102 158 24 134 -99 57 -119 458 121 22 156 7 -154
4274 -154 -85 275 93 42 -357 128 80 59 -80 -179 -167 -361 48 305 35 123 -288 -230 35 102 191 164 -63 -354
4298 -354 244 -189 149 -8 145 11 8 -135 253 -155 -103 35 -53 214 -118 98 34 207 -72 -265 -145 -114
4320 -114 130 113 -214 94 9 -106 232 39 69 127 -60 114 28 120 124 130 144 250 -259 6 -194 -13 66 -155
4344 -155 18 -64 46 228 156 -109 -53 -15 -62 -95 254 20 -252 361 -165 49 15 -200 114 43 144 -102 -43
4367 -43 -115 10 -9 72 192 -53 -71 -43 -44 -82 -39 -192 86 153 -82 -205 -5 30 4 94 -269 -22 -70 -74 10 102
4393 102 378 153 -50 135 269 76 309 39 -13 -185 -103 82 10 98 -99 -192 81 -55 -228 -9 31 -115
4415 -115 59 -145 54 -1 141 56 -148 -59 194 -28 82 -21 202 148 46 -30 -5 21 -114 -36 -141 280 62
4438 62 17 -106 56 -31 -178 78 -11 150 -199 -1 71 1 82 -189 -64 139 43 -236 -148 -191 -107 117 -175 111
4462 111 46 1 156 244 -133 -394 -238 -48 74 -19 81 -99 82 19 -76 24 -84 167 129 194 -19 -12 30 37
4486 37 -1 -101 64 117 -310 277 -32 109 -59 82 -16 -31 42 -18 -157 -1 225 50 133 -75 -15 -19 -75 122
4510 122 272 287 -39 180 -169 -42 -41 117 -170 -65 -14 0 181 -104 128 -234 -132 6 221 -137 101 -184
4532 -184 1 -21 40 172 -87 152 -206 -198 93 33 29 -55 -80 162 200 -28 61 -75 -318 -280 105 -270 47 23
4556 23 37 132 -11 -62 -42 -152 150 172 111 146 -7 82 -89 239 123 4 -112 -181 43 316 61 98 83 -72
4580 -72 55 -4 -79 0 -168 80 -265 -222 -50 14 180 -100 235 -139 -178 210 85 -139 178 -186 -144 61 49
4603 49 93 99 337 79 121 -56 177 4 -47 155 -20 90 139 186 -124 159 188 42 139 0 201 238 -15 102
4627 102 11 -102 95 133 -13 -58 1 289 -25 -1 76 -104 42 63 135 -190 -22 -234 79 -206 -59 48 239
4650 239 -89 -6 54 -84 97 128 -162 -91 122 120 -90 -31 285 47 19 15 103 -11 -60 -42 -255 -78 -29 -131 126
4675 126 -325 146 259 -118 93 -107 -18 131 36 165 -61 311 -293 -87 6 -154 -57 87 -273 81 -157
4696 -157 236 -65 38 -175 -59 137 -32 46 39 29 199 15 78 315 133 421 78 154 -208 -241 100 -79
4718 -79 -2 132 169 -84 -105 266 61 -134 41 106 153 123 -33 -204 1 -146 206 13 -220 256 93 166 86
4741 86 -78 415 -100 119 13 24 -142 -293 91 -65 29 139 7 129 174 156 223 -78 37 -27 134 -1
4763 -1 -56 -124 -23 14 147 -44 -90 -371 32 -71 -125 -138 90 -174 -1 174 417 52 -77 -11 -207 -98 -242
4786 -242 52 33 91 173 -201 111 129 -97 -80 -173 -65 -100 -76 144 0 210 156 131 64 -145 -162 122 91 202
4810 202 -57 -82 52 -194 70 44 109 -180 -224 1 -169 -280 119 125 54 96 -68 -270 32 6 120 147 -86
4833 -86 -48 168 156 -195 -130 18 0 59 -62 -141 -100 73 -69 -307 -18 -35 -61 173 308 -29 85 -6 -177 -186
4857 -186 -237 124 142 -93 199 102 154 -57 108 77 147 115 -68 83 -179 -74 232 25 -120 -261 214 -71
4879 -71 -78 -118 87 -53 58 308 323 13 35 185 -340 138 161 142 55 105 45 51 101 -447 106 210 299 9 -90
4904 -90 -147 93 -58 -178 79 160 -65 154 -68 -26 18 -8 127 -157 -293 17 12 137 -91 -18 67 -215 -14
4927 -14 -56 131 -120 107 -258 -160 46 130 -83 84 -89 9 -110 76 -30 -216 60 -115 -140 141 -137 -62
4949 -62 50 300 20 87 -165 -83 -2 43 -151 78 -99 -34 -91 -213 -12 38 -36 236 162 56 173 -160 92
4972 92 91 -68 10 106 -67 101 -163 179 -144 -200 -83 -79 55 243 123 -227 -277 101 -62 47 41 70 131 -11
4996 -11 -114 -19 66 156 117 -47 -45 -242 -154 -162 -59 -202 88 44 -136 346 30 75 40 103 -35 -59 46 378 -32
5021 -32 135 353 -102 163 120 125 83 -5 -55 -107 -16 -47 176 52 -24 77 -139 -246 100 137 208 -232 111 375
5045 375 -131 -52 -284 73 163 -267 3 7 -30 -9 107 -76 -21 63 168 121 -122 55 31 157 92 134 318 -217
5069 -217 156 40 259 -428 216 -143 -67 126 182 -124 20 68 16 -35 120 72 225 -129 -120 -1 166 209 -56
5092 -56 -181 -183 -51 -88 170 -3 136 13 -156 -90 30 -11 -6 147 -83 139 146 131 -30 -71 126 24 -5 39 -23
5117 -23 -166 -5 -41 -67 217 -11 -4 48 -40 34 -71 67 -22 -124 -35 144 -84 107 191 87 -70 47 -197 82
5141 82 -100 234 62 -27 -53 -104 110 196 128 -56 -50 -50 -76 54 -191 81 50 192 70 -65 -58 65 128 26 -117
5166 -117 82 -213 52 -168 -105 30 -101 -68 167 -114 -24 -19 9 -142 -125 -412 -66 18 101 50 217 -129 -70 46
5190 46 -189 -105 188 141 228 215 18 152 -101 202 84 274 122 -232 15 210 8 -2 87 -12 162 178 202
5213 202 37 160 -115 -69 46 22 -25 -4 46 122 -108 138 -202 138 -79 153 101 -116 -24 -116 -92 175 60
5236 60 9 -142 16 324 -111 32 139 46 -24 -204 169 148 -11 -22 -96 45 -292 -149 206 58 -276 -50
5258 -50 -9 172 -165 -32 -33 33 -154 36 -55 23 -125 -49 -225 -19 -77 29 -147 -68 183 58 10 -110 -287 307
5282 307 50 -54 206 -101 9 114 139 141 -154 147 96 -103 -6 -77 -84 242 100 -114 158 119 22 18 170 40
5306 40 -218 83 -92 -34 -303 43 252 173 44 157 -5 -109 13 -75 61 -177 228 -259 -9 -94 53 -234
5328 -234 -64 -266 21 165 282 -172 55 106 3 31 -243 -42 47 -38 129 -131 -18 -9 166 28 22 -49 -142
5351 -142 159 -39 57 -158 -180 120 -77 -96 -129 112 -229 -84 12 5 64 -234 110 -76 -55 114 -108 -213 126
5374 126 -123 184 -269 40 -73 89 -187 -205 36 27 -87 -149 -298 -67 215 206 -61 80 124 -64 -130 -184 27
5397 27 -130 73 135 191 18 -114 78 -83 -303 -30 5 -134 262 -131 -53 -13 139 -26 -269 -124 -75 106
5419 106 -37 -180 -54 13 -108 -179 -136 -8 35 -118 -50 -66 -285 205 257 -127 -198 158 4 -5 5 -120 118 132
5443 132 -74 5 76 -303 0 -44 26 175 48 -62 -102 -198 75 355 -187 -58 -29 -106 148 135 -32 137 194
5466 194 3 -182 -2 173 -164 -174 -78 -137 -184 -34 -34 -314 -7 -29 -32 36 -157 67 -60 28 -213 -101 -4 140
5490 140 -38 -1 -22 96 -316 28 -81 11 -93 -93 62 -6 -161 -72 58 72 10 -266 -130 8 38 38 -27 -175
5514 -175 -169 35 -60 48 182 67 316 107 -182 -173 -66 -74 165 -48 -99 -210 -76 -334 351 89 -190 149 63
5537 63 -212 39 -344 -116 156 -157 78 99 -86 25 -94 -46 -170 182 -135 -170 205 -118 48 257 384
5558 384 -18 -179 167 -284 -116 5 -42 -173 -151 -20 201 82 -105 -3 41 -191 69 41 11 -61 17 118
5580 118 -36 210 -45 172 42 -182 230 158 308 24 -98 42 -44 -22 -66 -108 -7 -235 -75 -97 22 184
5602 184 23 -139 -104 3 -145 -22 -6 93 207 -149 -8 -83 -37 128 -111 -63 255 -119 -101 -6 -179 123 66
5625 66 -91 -212 -2 10 -258 -60 -243 113 208 278 131 -158 -16 -52 223 364 -182 136 -170 144 44 18
5647 18 -25 164 126 -324 275 -158 114 -86 -98 129 -37 96 114 197 -122 -123 76 -167 -73 105 -153 21 32
5670 32 -141 178 85 114 171 90 85 185 226 114 -66 6 57 155 145 -94 17 -40 259 -12 -39 166 403 122 46
5695 46 -11 265 194 83 68 34 -171 104 92 165 160 67 241 146 -79 58 56 -83 -59 -127 -175 -74 -51 47 -16 -176
5721 -176 163 345 -33 107 139 -45 44 -101 235 337 -80 -58 -183 -239 63 -21 -24 145 95 -115 27 -21 -127
5744 -127 -309 81 -232 228 97 4 21 -58 -82 155 -123 233 -55 214 -114 -303 -67 -12 86 -9 -67 -169 202
5767 202 32 -269 155 18 4 42 119 47 -237 -70 -135 -141 -174 83 -192 106 303 10 -220 44 86 -138 268
5790 268 55 118 59 -161 -216 84 140 2 -117 -9 40 -57 124 -90 159 5 158 -220 78 -13 140 99 68
5813 68 -21 214 -31 106 -238 162 -40 -149 -98 -7 53 -130 146 64 -47 -163 -74 111 21 171 344 -146 -132
5836 -132 63 172 -12 236 -215 70 183 -161 73 -13 -10 -208 99 -11 63 127 81 69 -6 124 289 172 2
5859 2 198 -14 312 -80 143 23 -181 186 -75 17 -74 273 -33 274 -89 102 30 257 65 286 -133 -47
5881 -47 -81 128 -116 164 92 -137 -5 40 30 -400 312 162 -57 177 -216 26 120 52 -147 -130 -12 5 -295
5904 -295 146 63 -15 126 -155 8 171 92 11 -17 80 -20 158 183 -69 -95 138 40 24 119 -29 194 -36 -2
5928 -2 -41 28 -47 55 -55 74 21 -143 64 -103 124 -191 158 295 155 -40 221 85 -85 49 -56 -32
5950 -32 -266 -13 131 -130 -199 57 8 166 -66 -3 121 -144 -42 265 -101 26 -108 -145 -106 52 -76 -254
5972 -254 -152 383 225 9 16 -10 -17 197 204 -24 -183 -267 159 103 188 -62 -128 -165 -60 -69 211 184 81 66 -234
5997 -234 18 85 130 127 92 18 -89 34 36 -20 -130 26 -110 -50 -90 61 -76 20 -35 79 -100 69 68 -27 94
6022 94 161 -232 -28 349 107 -199 246 0 101 87 295 -336 137 99 -56 83 30 175 -200 -136 -41 194
6044 194 64 250 57 174 39 -160 115 47 -145 142 -94 -186 -50 -296 -98 -106 -72 -52 -171 -25 -7 -18 -21
6067 -21 -12 -162 -74 106 -43 -132 -190 99 -47 -10 -66 -88 -117 -160 -118 -169 -209 -53 -117 -47 160 147 -186 -225 -223 -124 201
6094 201 -129 136 99 37 -312 -122 127 -203 67 -7 -86 156 9 -67 231 11 -53 45 60 80 236 -73 79
6117 79 60 16 4 -200 176 141 139 59 -19 83 -76 308 -347 36 10 39 -6 53 80 65 104 215 4 248 138
6142 138 -173 -18 64 406 154 -220 66 52 149 22 62 -116 -76 63 -19 -189 92 -197 -15 191 -147 231
6164 231 -176 52 155 132 147 149 207 190 314 -45 -123 46 187 64 81 101 -17 48 -29 43 -101 289 -171 260
6188 260 -44 323 119 188 -50 2 166 146 16 63 16 -57 134 -26 -186 97 11 241 -62 -2 1 155 21
6211 21 -34 -10 118 51 10 -22 -29 -4 -115 127 -98 -285 -74 156 -227 70 96 -19 -108 -8 -408 -268 -38 -185
6235 -185 30 131 23 126 20 213 -36 -25 16 90 -71 -78 77 -201 288 38 168 -102 44 -328 -154 -263
6257 -263 -66 -27 -43 -174 78 -122 -267 6 184 105 -65 151 -65 -18 -211 -43 -152 -139 22 154 -96 288
6279 288 217 -124 -254 55 20 81 -48 -52 13 -95 342 143 -100 -123 -78 -125 147 226 -117 -175 -210 -90 134 204
6303 204 247 -190 -39 154 -196 -13 89 211 -176 52 -151 9 -27 -59 -105 -195 219 -4 46 31 43 -113 297
6326 297 -8 -204 143 81 152 88 -48 14 -109 103 146 63 -278 -49 -143 -44 -138 -42 73 149 74 274 -162 -209
6350 -209 -87 -211 4 -75 -115 -60 -14 42 -164 -117 -48 107 116 95 -38 -56 -40 -185 -72 -6 100 -123 57 -184
6374 -184 -121 -72 72 98 210 11 54 176 -153 102 20 153 19 -173 37 -22 152 144 328 -56 -109 51 317
6397 317 -49 251 60 156 -203 35 -170 -96 -247 -103 -45 -204 -40 -307 -39 106 53 -241 124 -43 43 -146
6419 -146 -97 -143 -64 143 156 307 149 -94 405 -188 -37 342 35 -122 160 -166 99 40 222 -104 6 -260
6441 -260 -156 -175 138 -174 118 12 121 19 72 204 -85 -7 -194 -218 -49 -22 -137 64 22 -64 91 127 -8
6464 -8 -58 -348 -205 -52 -107 130 9 125 -93 -9 289 -171 18 102 -118 -20 -52 228 171 138 11 4 -252 -126
6488 -126 -86 60 -112 193 184 -91 49 -75 -147 -54 245 -74 -63 -105 -55 71 16 9 6 92 -86 90 -92 97 -238
6513 -238 -87 95 -248 139 45 -225 -209 51 -31 -98 85 80 92 -99 -24 51 -208 56 210 107 -228 116 -140
6536 -140 242 55 -202 -229 -55 86 170 -91 125 153 -13 185 -6 66 199 -68 -33 118 -37 -42 124 -166
6558 -166 285 115 -97 75 -90 80 -36 -93 -171 14 -72 57 34 147 117 -17 -6 -186 56 195 -67 112
6580 112 9 68 308 -57 -16 147 96 215 -3 -76 -214 10 54 148 -39 -144 29 245 -72 124 -122 -79
6602 -79 58 76 53 -22 37 17 -66 38 -25 -110 41 20 -110 215 -193 -73 112 -60 -114 -155 -110 217 -153 188
6626 188 -15 -214 5 -73 -196 95 51 309 -73 -9 39 -50 4 -77 -3 -167 7 -83 196 74 256 -186 75
6649 75 -82 182 173 13 -34 -100 -148 25 2 -109 -356 86 167 166 -122 -78 52 189 15 64 2 118 121 -10 -41
6674 -41 -132 -102 279 316 258 -20 -150 -47 155 114 -468 -232 8 -47 211 34 -73 40 -147 10 25 -68 84
6697 84 -178 -222 71 114 185 -278 -24 -120 -61 -84 -190 202 32 73 116 -175 8 269 -45 -81 10 253 181 57
6721 57 95 -129 130 5 -99 -90 39 12 -130 42 143 75 58 42 -171 158 7 47 -26 -166 209 262 70 194
6745 194 147 -108 135 102 17 -63 57 191 8 -117 174 340 153 45 30 161 208 -322 34 -26 -4 -155 71
6768 71 0 83 196 -6 -265 54 98 134 213 -35 187 313 238 194 -32 -346 -37 -248 189 -123 56 -81 179
6791 179 -68 222 -211 -284 45 118 56 -59 -145 131 251 43 58 -353 -126 90 79 -65 -34 -63 261 66 -1
6814 -1 16 151 -53 231 127 124 -488 -10 58 -48 38 -295 217 -261 -111 279 -268 13 194 -192 297 -108
6836 -108 -153 73 -36 94 -113 89 79 -53 -134 -48 60 513 36 375 -393 -67 402 -57 -58 8 226 56
6858 56 142 50 183 -190 113 9 211 25 -35 43 -63 -68 -58 -228 1 -54 12 -26 58 147 295 128 53 -70 -89
6883 -89 -35 41 -136 -125 207 -9 -165 35 39 -28 -20 39 -51 -252 -96 84 -245 -183 -141 -24 -325 182 -9 -349
6907 -349 -53 44 128 189 61 301 232 132 -248 43 -78 -29 -133 -228 -30 -13 119 0 -289 -58 244 41
6929 41 188 122 77 134 93 -155 88 126 23 -185 83 16 -180 206 -170 -107 -21 146 -61 -10 -153 103 22 -19
6953 -19 -153 -213 48 302 70 -20 -142 -211 -131 21 158 -77 4 123 82 -218 153 -139 198 -255 -187 3 -160
6976 -160 -145 41 179 -99 87 -25 174 120 90 16 37 8 -153 -227 188 143 -118 117 -168 -114 -133 18 101 0
7000 0 -203 -72 42 -160 -20 37 151 17 -84 105 57 -433 -101 62 -95 266 -80 -197 -208 4 73 67 30
7023 30 144 -53 -301 87 -60 -144 -192 43 126 -68 -6 -24 43 -19 -211 9 -277 -27 22 92 -150 -117 426 -83
7047 -83 -29 -284 -63 -16 -24 82 -88 143 22 9 50 -94 -69 -69 -75 -72 89 -255 -50 -11 -196 -21 -20 -73 -28 75
7073 75 -295 144 64 -19 39 153 -456 163 74 99 -107 118 -117 247 114 -39 -171 164 -188 -5 -58 -18 254
7096 254 -19 2 -123 35 -92 106 -153 269 -140 -148 -69 130 40 236 -105 84 16 108 180 45 -25 -88 194
7119 194 349 -189 -182 27 -372 97 182 -16 -74 55 128 -14 -49 -302 -189 243 -82 -215 -189 -12 14 23 -134
7142 -134 -59 96 -73 -38 -91 -186 -59 57 139 200 8 305 31 -92 43 112 -2 -159 -73 -72 1 125 25 180
7166 180 7 205 -87 -206 -41 -28 -2 -238 189 360 298 -31 138 104 12 -76 95 56 -228 254 -99 102
7188 102 -64 -87 -192 271 -138 150 144 -45 20 -168 243 -43 -251 130 -119 32 66 -121 119 71 -12 -74 170
7211 170 21 -236 18 -58 168 -206 160 42 20 -112 -213 -91 -70 -19 -161 -104 107 -10 -3 16 113 -110 100
7234 100 -65 137 -40 -236 101 -25 -31 -123 145 -150 8 -23 -107 68 -111 74 -145 -117 -59 -11 -70 197 -189
7257 -189 -194 72 -142 -103 87 -15 141 159 119 134 53 -264 -112 58 116 -246 -169 62 110 128 -70 -150 -343 -92
7281 -92 -49 -43 -20 -51 -52 -66 35 170 -99 -68 -185 -148 -173 -271 40 85 94 -56 197 -105 130 -41 -75 80 -23 9
7307 9 311 -153 82 -121 -93 0 -81 -80 10 -153 -51 -283 -283 -212 322 284 14 38 -96 -216 -94 -187 -19 90 -188
7332 -188 118 11 60 147 -25 -99 86 -39 -90 19 35 42 144 133 144 167 150 -112 -55 89 194 -20 -11 160 214
7357 214 151 54 -35 50 -425 -204 20 -144 -88 -278 -237 -188 122 148 91 -342 91 166 -263 -163 32 17 -157 -43
7381 -43 -59 -132 -85 -3 282 -239 66 15 16 -92 7 129 13 101 15 -94 -318 -267 112 -119 23 -20 49 82 -153
7406 -153 -151 -42 -45 43 110 -95 -53 -101 -58 -45 -91 110 71 -135 -60 276 61 -8 2 -143 214 309 -56 72 140 -77
7432 -77 4 12 219 -78 -160 283 108 -20 -22 -179 19 -23 67 -100 -59 -51 11 -111 21 35 223 -125 -44 202 23
7457 23 -242 11 133 -88 -58 146 47 6 6 -273 -74 -286 -174 -200 18 -232 65 -143 158 44 -200 25
7479 25 -18 -390 368 112 123 -126 -61 7 -136 50 -55 230 87 -73 67 -144 243 95 49 304 62 -165
7501 -165 86 243 -12 -3 -49 96 -146 109 -252 -44 324 -95 -103 32 -118 110 126 -40 54 37 -33 167 137
7524 137 116 182 -176 5 234 -201 161 -150 160 189 206 -28 -443 168 88 192 -19 251 48 -264 177 72
7546 72 62 -197 -11 20 -164 277 64 -178 -280 -145 255 226 120 -215 28 -32 -200 117 -243 -70 62 -210
7568 -210 -12 53 -44 -124 -53 -22 274 181 -146 235 -185 20 151 11 -49 214 107 98 177 -4 114 -196 202
7591 202 266 24 282 46 61 -409 -253 -65 -62 -268 65 193 -80 272 72 -2 -336 31 169 236 -98 -89 210
7614 210 69 123 -76 255 78 74 71 180 -92 96 -49 6 -187 253 15 87 71 61 68 -151 -280 -168 -47 -133
7638 -133 85 -26 -53 54 -182 -230 -80 92 118 -46 17 -24 13 -165 -172 -5 190 -74 -29 247 -136 100 70
7661 70 -340 28 114 141 -232 73 59 -30 260 5 11 -60 102 -217 -189 -133 111 106 -115 142 -170 -85 42 170
7685 170 96 84 167 112 210 -42 108 229 -321 71 -71 -132 197 -207 95 84 -33 103 63 -156 139 135 4
7708 4 90 78 -139 24 -257 196 89 58 -265 50 68 -175 27 148 268 -76 -350 210 86 -33 97 90 -127
7731 -127 39 -142 -23 29 78 -78 -133 162 87 134 116 49 -18 -184 -55 -188 -137 99 -91 -27 67 148 -70 -32
7755 -32 85 -70 -154 191 94 -256 57 12 -262 92 -140 69 142 6 81 -183 85 148 253 22 219 -122
7777 -122 -108 53 -117 29 21 -209 158 52 -104 -42 -34 -10 -38 -162 24 -117 -182 -66 -44 78 -31 -58 108 -10
7801 -10 -106 113 10 60 178 58 111 -222 -70 11 -26 -288 82 79 -149 41 -2 -197 254 -115 -290 120 6
7824 6 -43 69 91 168 112 -64 71 -16 -260 -36 -184 19 246 -170 -79 60 -107 -65 -195 -92 -86 -73 167 -433
7848 -433 -66 -123 -283 42 163 39 -70 -157 215 231 -17 -144 32 50 -30 -105 3 324 -63 -37 243 160 223
7871 223 172 38 -126 17 -92 -41 -27 228 -187 1 183 -297 84 -108 -1 9 99 81 -115 84 67 -51
7893 -51 -135 126 -142 163 -50 48 78 144 14 -355 10 -75 -138 -78 -148 -110 49 -120 -14 94 1 -259 192 223
7917 223 -52 -78 -167 -480 -69 79 -137 87 -68 269 -37 -111 228 28 -19 -155 208 69 -53 -129 138 -167
7939 -167 -53 -142 -228 10 -125 -5 -111 34 215 91 -220 223 -29 -83 151 23 73 182 -63 -139 -77 62
7961 62 -60 44 63 94 -71 66 258 133 -31 -91 -93 -161 22 106 104 -100 135 -258 -239 -268 71 -112 118 -75
7985 -75 16 -247 250 -74 302 -106 -96 19 -44 -195 -123 99 -192 133 143 -60 -19 -81 55 -3 59 397 -240
8008 -240 -151 203 101 130 128 -49 142 8 -81 -22 -62 -29 -32 -237 3 231 -225 -224 69 -248 -404 105 -105 185
8032 185 54 196 164 40 320 -146 18 -512 -8 -134 -282 -36 103 216 -81 36 175 214 -235 160 -98
8053 -98 39 -120 -274 18 50 5 -82 -187 93 43 134 -14 -178 -227 -135 -14 169 -9 -17 -187 21 -112 -180 108
8077 108 27 -13 81 108 296 177 40 -60 42 -99 -10 23 -134 341 130 -207 -188 -313 96 64 56 194 30
8100 30 80 74 54 -63 -69 -521 13 108 -358 108 -20 44 69 242 41 89 -12 -13 -3 288 42 -135 -94 -125 281
8125 281 40 298 -10 37 -188 281 -130 27 7 150 91 -30 -34 -165 -209 43 -178 57 -52 122 83 -84
8147 -84 41 134 -247 17 128 -13 58 7 169 93 182 -2 118 -48 -70 119 -101 -17 -176 -3 -48 277 56
8170 56 -45 -104 -53 145 -113 -252 -96 -140 -68 18 294 -95 159 33 127 -128 7 -4 37 39 -151
8191a51
##END NTUPLES=NMR FID
##END=
