##TITLE=1H_DE-97k2_TFA
 200.13MHz, CDCl3,
 8 sc
 
 21.8.2025
##JCAMPDX= 6.0         $$ Bruker NMR JCAMP-DX V2.0
##DATA TYPE= NMR FID
##DATA CLASS= NTUPLES
##ORIGIN= UXNMR, Bruker Analytische Messtechnik GmbH
##OWNER= pz
$$ XWIN-NMR		Version 3.5
$$ Thu Aug 21 14:14:17 2025 Russian Standard Time (UT+4h)  she@DPX200
##.OBSERVE FREQUENCY= 200.1313
##.OBSERVE NUCLEUS= ^1H
##.DELAY= (6, 6)
##.ACQUISITION MODE= SIMULTANEOUS
##.ACQUISITION SCHEME= undefined
##.AVERAGES= 8
##.DIGITISER RES= 18
##SPECTROMETER/DATA SYSTEM= spect
##.PULSE SEQUENCE= zg30
##.SOLVENT NAME= CDCl3
##.SHIFT REFERENCE= (INTERNAL, CDCl3, 0, 14.3821)
##AUDIT TRAIL= $$ (NUMBER, WHEN, WHO, WHERE, WHAT)
$$ ##TITLE= Audit trail, XWIN-NMR		Version 3.5
$$ ##JCAMPDX= 5.01
$$ ##ORIGIN= Bruker BioSpin GmbH
$$ ##OWNER= she
$$ F:/spectra/data/she/nmr/H-C/1/audita.txt
$$ ##AUDIT TRAIL=  $$ (NUMBER, WHEN, WHO, WHERE, WHAT)
(   1,<2025-08-21 14:12:54.78 +0400>,<she>,<DPX200>,
      <created by zg, POWCHK disabled, PULCHK disabled
       configuration hash MD5:
       00 E9 B6 7A A2 85 ED C7 34 08 36 98 17 FE 4E 26
       data hash MD5: 16K
       C0 35 4D 35 27 BF D5 13 8D C8 4A E5 5E AD 66 D3>)
$$ ##END=
$$ 
$$ hash MD5
$$ EE 2E 0F 0A 6B 3D 99 67 90 84 1B 77 89 70 29 83
##$RELAX= 
##$RELAX= 
##$RELAX= 
##$RELAX= 
##$RELAX= 
##$RELAX= 
$$ Bruker specific parameters
$$ --------------------------
##$DU= <F:/spectra>
##$EXPNO= 1
##$NAME= <H-C>
##$PROCNO= 1
##$TYPE= <nmr>
##$USER= <she>
##$AMP= (0..31)
100 100 100 100 100 100 100 100 100 100 100 100 100 100 100 100 100 100 
100 100 100 100 100 100 100 100 100 100 100 100 100 100 
##$AQSEQ= 0
##$AQ_mod= 1
##$AUNM= <au_zg>
##$AUTOPOS= <>
##$BF1= 200.13
##$BF2= 200.13
##$BF3= 200.13
##$BF4= 200.13
##$BF5= 200.13
##$BF6= 200.13
##$BF7= 200.13
##$BF8= 200.13
##$BYTORDA= 1
##$CFDGTYP= 0
##$CFRGTYP= 5
##$CHEMSTR= <none>
##$CNST= (0..31)
1 1 145 1 1 1 1 1 1 1 1 1 1 1 1 1 1 1 1 1 1 1 1 1 1 1 1 1 1 1 1 1 
##$CPDPRG= <>
##$CPDPRG1= <>
##$CPDPRG2= <>
##$CPDPRG3= <>
##$CPDPRG4= <mlev>
##$CPDPRG5= <mlev>
##$CPDPRG6= <mlev>
##$CPDPRG7= <mlev>
##$CPDPRG8= <mlev>
##$CPDPRGB= <>
##$CPDPRGT= <>
##$D= (0..31)
0 0.7 0 0 0 0 0 0 0 0 0 0.03 0 0 0 0 0 0 0 0 0 0 0 0 0 0 0 0 0 0 0 0 
##$DATE= 1755771174
##$DBL= (0..7)
120 120 120 120 120 120 120 120 
##$DBP= (0..7)
150 150 150 150 150 150 150 150 
##$DBP07= 0
##$DBPNAM0= <>
##$DBPNAM1= <>
##$DBPNAM2= <>
##$DBPNAM3= <>
##$DBPNAM4= <>
##$DBPNAM5= <>
##$DBPNAM6= <>
##$DBPNAM7= <>
##$DBPOAL= (0..7)
0.5 0.5 0.5 0.5 0.5 0.5 0.5 0.5 
##$DBPOFFS= (0..7)
0 0 0 0 0 0 0 0 
##$DE= 6
##$DECBNUC= <off>
##$DECIM= 32
##$DECNUC= <off>
##$DECSTAT= 4
##$DIGMOD= 1
##$DIGTYP= 9
##$DL= (0..7)
0 120 120 120 120 120 120 120 
##$DP= (0..7)
150 150 150 150 150 150 150 150 
##$DP07= 0
##$DPNAME0= <>
##$DPNAME1= <>
##$DPNAME2= <>
##$DPNAME3= <>
##$DPNAME4= <>
##$DPNAME5= <>
##$DPNAME6= <>
##$DPNAME7= <>
##$DPOAL= (0..7)
0.5 0.5 0.5 0.5 0.5 0.5 0.5 0.5 
##$DPOFFS= (0..7)
0 0 0 0 0 0 0 0 
##$DQDMODE= 0
##$DR= 18
##$DS= 0
##$DSLIST= <SSSSSSSSSSSSSSS>
$$ [...]
##$SUBNAM0= <"">
##$SUBNAM1= <"">
##$SUBNAM2= <"">
##$SUBNAM3= <"">
##$SUBNAM4= <"">
##$SUBNAM5= <"">
##$SUBNAM6= <"">
##$SUBNAM7= <"">
##$SUBNAM8= <"">
##$SUBNAM9= <"">
##$SW= 18.0517328524113
##$SWIBOX= (0..15)
0 0 2 0 0 0 0 0 0 0 0 0 0 0 0 0 
##$SW_h= 3612.71676300578
##$TD= 16384
##$TD0= 1
##$TE= 0
##$TE2= 300
##$TE3= 300
##$TEG= 300
##$TL= (0..7)
0 120 120 120 120 120 120 120 
##$TP= (0..7)
150 150 150 150 150 150 150 150 
##$TP07= 0
##$TPNAME0= <>
##$TPNAME1= <>
##$TPNAME2= <>
##$TPNAME3= <>
##$TPNAME4= <>
##$TPNAME5= <>
##$TPNAME6= <>
##$TPNAME7= <>
##$TPOAL= (0..7)
0.5 0.5 0.5 0.5 0.5 0.5 0.5 0.5 
##$TPOFFS= (0..7)
0 0 0 0 0 0 0 0 
##$TUNHIN= 0
##$TUNHOUT= 0
##$TUNXOUT= 0
##$USERA1= <user>
##$USERA2= <user>
##$USERA3= <user>
##$USERA4= <user>
##$USERA5= <user>
##$V9= 5
##$VALIST= <valist>
##$VCLIST= <CCCCCCCCCCCCCCC>
##$VD= 0
##$VDLIST= <DDDDDDDDDDDDDDD>
##$VPLIST= <PPPPPPPPPPPPPPP>
##$VTLIST= <TTTTTTTTTTTTTTT>
##$WBST= 1024
##$WBSW= 4
##$XGAIN= (0..3)
0 0 0 0 
##$XL= 0
##$YL= 0
##$YMAX_a= 122609
##$YMIN_a= -119045
##$ZGOPTNS= <>
##$ZL1= 120
##$ZL2= 120
##$ZL3= 120
##$ZL4= 120
##$ABSF1= 10
##$ABSF2= 0
##$ABSG= 5
##$ABSL= 3
##$ALPHA= 0
##$AQORDER= 0
##$ASSFAC= 0
##$ASSFACI= 0
##$ASSFACX= 0
##$ASSWID= 0
##$AUNMP= <proc_1d>
##$AZFE= 0.1
##$AZFW= 0.1
##$BCFW= 1
##$BC_mod= 2
##$BYTORDP= 1
##$COROFFS= 0
##$CY= -3
##$DATMOD= 1
##$DC= 2
##$DFILT= <>
##$DTYPP= 0
##$F1P= 0
##$F2P= 0
##$FCOR= 0.5
##$FTSIZE= 0
##$FT_mod= 4
##$GAMMA= 1
##$GB= 0.15
##$INTBC= 1
##$INTSCL= 1
##$ISEN= 128
##$LB= 0.25
##$LEV0= 0
##$LPBIN= 0
##$MAXI= 10000
##$MC2= 0
##$MEAN= 0
##$ME_mod= 0
##$MI= 1.114404
##$NCOEF= 0
##$NC_proc= 0
##$NLEV= 6
##$NOISF1= 3.799351
##$NOISF2= 2.8
##$NSP= 1
##$NTH_PI= 0
##$NZP= 0
##$OFFSET= 14.38212
##$PC= 1
##$PHC0= -1560.452
##$PHC1= 9.79229
##$PH_mod= 1
##$PKNL= yes
##$PPARMOD= 0
##$PSCAL= 0
##$PSIGN= 0
##$REVERSE= no
##$SF= 200.129724274929
##$SI= 16384
##$SIGF1= 3
##$SIGF2= 2
##$SINO= 400
##$SIOLD= 16384
##$SREGLST= <1H.CDCl3>
##$SSB= 0
##$STSI= 0
##$STSR= 0
##$SW_p= 3205.1282051282
##$SYMM= 0
##$S_DEV= 0
##$TDeff= 0
##$TDoff= 0
##$TI= <>
##$TILT= no
##$TM1= 0
##$TM2= 0
##$TOPLEV= 0
##$USERP1= <user>
##$USERP2= <user>
##$USERP3= <user>
##$USERP4= <user>
##$USERP5= <user>
##$WDW= 1
##$XDIM= 8192
##$YMAX_p= 0
##$YMIN_p= 0
$$ End of Bruker specific parameters
$$ ---------------------------------
##NTUPLES= NMR FID
##VAR_NAME=  TIME,          FID/REAL,        FID/IMAG
##SYMBOL=    X,             R,               I
##VAR_TYPE=  INDEPENDENT,   DEPENDENT,       DEPENDENT
##VAR_FORM=  AFFN,          ASDF,            ASDF
##VAR_DIM=   8192,          8192,            8192
##UNITS=     SECONDS,       ARBITRARY UNITS, ARBITRARY UNITS
##FACTOR=    0.0002768,     1,               1
##FIRST=     0,             0,               0
##LAST=      2.2672688,     0,               0
##MIN=       0,             -119045,         0
##MAX=       2.2672688,     122609,          0
$$ Real data points
##PAGE= N=1
##DATA TABLE= (X++(R..R)), XYDATA
$$ plain form
0 0 0 0 0 0 0 0 0 0 0 0 0 0 0 0 0 0 7 -8 8 -8 8 -8 13 -16 16 -21 24 -24 32 -37 40 -48 54 -61 69 -77 86 -99
38 -99 109 -122 134 -149 167 -185 203 -225 249 -275 302 -334 368 -406 447 -491 544 -600 666 -742
58 -742 829 -931 1053 -1199 1385 -1624 1944 -2402 3106 -4364 7289 -32207 11932 25855 -25709
73 -25709 63238 100196 -33237 -118973 -8802 34042 -71772 -72378 74797 84269 -35023 -26539
85 -26539 66513 5735 -104395 -46658 53274 -2314 -60700 34298 109042 23824 -41192 13543
97 13543 16627 -71888 -58968 50448 54328 -17650 13349 70928 4117 -61581 6076 49589
109 49589 -35021 -67063 33018 71548 -11232 -31810 38789 27990 -57045 -45430 32169 17992
121 17992 -35061 4686 50624 -10035 -59259 -1097 31667 -28105 -38383 31301 31318 -34884 -17505
$$ packed form
0@%%%%%%%%%%%%%%%%Pj5J6j6J6j6K1k9L2l7M5m8N6o9P7q8J02j15J30j46J63j85
38i9K08k31K56k83L16l52L88m28M74n24N77o36P02p74Q53r38J035j144J266j408
58g42J571j760J984k252K584l009L568m346N508p470J1653l9496M4139J3923n1564
73b5709Q8947L6958j33433q5736J10171M2844j05814o06J47175R472j19292Q484
85b6539R3052o0778j10130N7737R9932n5588n8386R4998P4744q5218o5016N4735
97A3543L084q8515J2920J09416L880p1978L0999N7579o6811o5698O7657M3513
109D9589q4610l2042J00081L8530q2780k0578P0599j0799q5035J1615P7599j4177
121A7992n3053L9747M5938o0659m9224N8162L2764n9772j0278O9684J7o6202J7379
$$ plain form
134 -17505 46238 12358 -56050 -23230 34946 1737 -34851 16465 50495 -6019 -38084 11536
146 11536 25593 -26482 -23900 35108 27369 -25486 -6245 39125 5018 -37645 749 31276
158 31276 -14108 -31841 24958 41046 -13406 -25474 17596 11397 -34732 -19436 29237 13418
170 13418 -25504 -327 32177 -3394 -33881 1421 20916 -19060 -27047 19348 23198 -18036
182 -18036 -10482 26458 5990 -33227 -9774 25223 1944 -21388 9255 27445 -7689 -22325
194 -22325 12239 19368 -16532 -16007 21056 15311 -19006 -5615 25012 3207 -25890 -855 22154
207 22154 -4603 -18372 12226 19164 -13772 -17654 11209 8188 -18306 -7375 19782 5884 -19039
220 -19039 -2422 17116 -5999 -23678 2681 16686 -8989 -13679 16438 16589 -14711 -13108 11959
$$ packed form
134a7505O3743l3880o8408L2820N8176l3209l6588N1316L4030n6514l2065M9620
146A1536J4057n2075K582N9008p739n2855J9241M5370l4107m2663L8394L0527
158C1276m5384j7733N6799J6088n4452j2068M3070o199m6129J5296M8673j5819
170A3418l8922K5177L2504l5571l0487L5302J9495l9976p987M6395L850m1234
182a8036P554L6940k0468l9217K3453L4997k3279k3332L0643J8190l5134j4636
194b2325L4564P129l5900N25L7063n745l4317J3391L0627k1805k9097K5035K3009
207B2154k6757j3769L0598O938l2936l882K8863l021k6494J0931K7157j3898k4923
220a9039J6617J9538k3115j7679K6359J4005k5675m690L0117J51l1300J603K5067
$$ plain form
233 11959 2569 -19274 -2774 20402 5782 -9955 6852 15340 -7455 -16169 5075 9198 -10095
246 -10095 -5941 18555 13517 -9762 -2868 14225 -2831 -21104 -2249 14949 -1592 -9627 11477
259 11477 15390 -8254 -12815 4741 1728 -15530 -7708 11533 5844 -7834 1996 12177 -4210
272 -4210 -16437 -1528 6446 -8606 -9422 11565 12354 -6867 -5047 10054 1037 -14973 -4094 10199
286 10199 801 -6907 7014 13553 -1928 -8327 3868 5165 -8829 -6615 9470 7816 -5104
299 -5104 194 11460 757 -11570 -1249 7694 -4166 -8600 6115 9654 -4302 -5252 6222
312 6222 2092 -10043 -5075 6367 825 -7471 1025 8734 -1024 -8524 1104 5382 -5819 -7446
326 -7446 5196 6086 -5484 -2725 7967 2408 -8110 -1357 6454 -1084 -6340 2956 7319 -2094
$$ packed form
233A1959r390k1843J6500K3176j4620j5737J6807Q488k2795q714K1244M123j9293
246a0095M154K4496n038k3279O894J7093j7056j8273J8855J7198j6541q035K1104
259A1477L913k3644m561J7556l013j7258P822J9241n689j3678R830J0181j6387
272d210j2227J4909P974j5052q16K0987P89j9221J820J5101r017j6010J0879J4293
286A0199r398p708J3921O539j5481o399J2195J297j3994K214J6085j654j2920
299e104N298J1266j0703j2327J0321Q943j1860m434J4715L539j3956r50J1474
312F222m130j2135M968J1442n542q296Q496P709r758p500R628M278j1201j627
326g446J2642Q90j1570K759J0692n559j0518O753P811p538n256R296M363r413
$$ plain form
340 -2094 -4305 4515 4720 -4556 -3831 5353 2892 -5636 -1113 7052 1197 -6251 771 6164 -2307 -5932
356 -5932 2911 4247 -4700 -4045 4720 2272 -5167 -1705 5002 149 -5525 -343 4150 -1647 -5074
371 -5074 1856 4937 -2092 -3780 3769 3266 -4594 -2990 4266 1091 -4623 725 5744 67 -3543
386 -3543 2025 3836 -2885 -3836 2826 2956 -2496 -1275 4664 2354 -3841 -1522 3404 -582 -4810 426
402 426 4346 -802 -3033 2724 2971 -3553 -3211 2262 599 -3908 -529 3807 643 -2831 281 2672
418 2672 -1788 -3934 829 2580 -1696 -2040 3114 2544 -2671 -1653 2818 234 -3820 -78 3733 85
434 85 -2140 1919 2811 -1894 -2424 1658 1308 -2001 -692 3098 1546 -2016 -571 2211 -447 -3084
450 -3084 62 2625 -872 -1799 2313 2176 -2516 -2273 1585 356 -2876 -488 2836 644 -1772 494
$$ packed form
340b094k211Q820K05r276P25R184k461q528M523Q165n855p448P022N393q471l625
356e932Q843J336q947O55Q765k448p439L462O707m853n674N182M493n797l427
371e074O930L081p029j688P549n03p860J604P256l175n714N348N019n677l610
386c543N568J811o721r51O662J30n452J221N939k310o195K319M926l986m228N236
402D26L920n148k231N757K47o524L42N473j663m507L379M336l164l474L112K391
418B672m460k146M763J751m276l44N154n70n215J018M471k584m054L742L811l648
434H5k225M059Q92m705n30M082l50l309J309L790j552l562J445K782k658k637
450c084L146K563l497r27M112j37m692K43L858j229l232K388L324k192k416K266
$$ plain form
466 494 2011 -1252 -2439 -83 1058 -1150 -963 2293 1803 -1462 -813 1534 -375 -2888 -226 2422
482 2422 97 -906 2027 2196 -1392 -1548 942 250 -2259 -1138 2154 1484 -726 261 1857 -220
498 -220 -2436 -693 871 -1300 -1367 1691 2079 -700 -494 1525 -342 -2619 -977 950 -404 -1110 1286
515 1286 2323 51 -1033 204 247 -1723 -1441 1003 1184 -482 387 2081 736 -1343 -420 490 -1135
532 -1135 -1639 951 1570 -199 1 1645 689 -1718 -1016 383 -57 -1124 235 1504 593 -604 464
549 464 905 -1216 -1679 -11 543 -745 -3 1604 613 -793 -87 810 -855 -1253 113 760 -268 -419
567 -419 1071 1154 -285 -594 330 -46 -1111 -554 972 535 -497 347 902 -184 -996 290 510 -922
585 -922 -534 873 670 -273 92 1100 -205 -1018 -323 233 -170 -558 291 985 -147 -749 436 314 -641
$$ packed form
466D94J517l263j187K356J141k208J87L256m90l265O49K347j909k513K662K648
482B422k325j003K933J69l588j56K490o92k509J121L292o70k210R87J596k077
498b20k216J743J564k171o7L058L88k779K06K019j867k277J642J927j354p06K396
515A286J037k272j084J237M3j970K82K444J81j666Q69J694j345k079R23R10j625
532a135n04K590O19j769K00J644r56k407P02J399m40j067J359J269r11j197J068
549D64M41k121m63J668N54j288P42J607r91j406P06Q97j665l98J366O47j028j51
567d19J490Q3j439l09R24l76j065N57J526m37j032Q44N55j086q12J286K20j432
585i22L88J407k03r43L65J008j305q13O95N56m03l88Q49O94j132o02J185j22r55
$$ plain form
604 -641 -608 455 262 -818 283 1003 -43 -627 377 247 -751 -503 527 498 -263 -126 538 392 -480
623 -480 -326 358 15 -640 73 819 163 -411 393 441 -621 -531 503 206 -337 190 463 -106 -348 -25
643 -25 542 -262 -569 108 428 -165 -308 534 436 -570 -454 332 -49 -469 26 568 -51 -488 257 331 -333
664 -333 -605 91 -17 -176 -230 366 314 -187 -113 133 -15 -529 235 433 -139 -395 357 661 -332 -137 340
685 340 -234 -446 -122 269 88 -199 268 256 -161 -325 -73 168 -43 -123 438 304 -135 -61 303 140 -436
706 -436 -144 55 -58 -149 241 324 -122 -163 5 -212 -365 -60 162 -46 -129 32 429 173 -181 -86 -6 -31 -292
729 -292 349 470 -98 -77 344 -50 -460 -266 243 -99 -215 121 240 45 45 220 173 -123 -146 -105 12 37 5
752 5 281 131 -171 -107 117 -266 -271 60 195 -170 21 182 213 -187 47 28 -26 -280 -78 313 -59 -166 91
$$ packed form
604f41L3J063j93j080J101P20j046n84J004j30r98K48J030k9p61J37O64j46q72
623d80J54O84l43o55P13P46o56n74Q04M8j062R0J034k97n43N27K73n69k42L23
643b5N67q04l07O77L20n93j43Q42r8j006J16P86l81m20M95N42o19m37P45P4o64
664c33k72O96j08j59n4N96n2n01P4K46j48n14P64J98n72k56P52L04r93J95M77
685C40n74k12L24L91j81k87M67j2m17j64K52K41k11q0N61j34m39P4L64j63n76
706d36K92J99j13r1L90Q3m46m1J68k17j53L05K22k08q3J61L97k56l54R5Q0k5k61
729b92O41J21n68K1M21l94m10J94N09l42j16L36J19j95%J75m7k96k3M1J17K5l2
752EK76j50l02O4K24l83nL31J35l65J91J61L1m00K34j9n4k54K02L91l72j07K57
$$ plain form
775 91 168 -166 -177 212 218 -173 -207 282 161 -33 135 315 -210 -191 179 151 -69 -181 241 115 55 -52 26 -14
799 -14 -162 -164 119 -55 -162 -8 154 50 -194 87 77 -324 -155 272 173 -209 139 51 41 -200 -61 -62 -153 91
823 91 -114 69 -24 -99 41 -111 -117 -219 -55 107 28 97 260 -108 -89 42 69 -193 77 229 74 18 144 26
847 26 -220 -187 -94 9 -108 -72 47 45 187 3 83 116 -184 -164 8 4 -180 103 177 15 -19 -15 -97 -117 -115 -88 11
874 11 66 63 66 29 -133 -164 -68 102 25 3 199 -61 143 206 70 -159 -66 -43 -146 -70 -8 -36 35 88 20 12 -128 -13
902 -13 -104 65 -47 -24 -47 92 -57 -167 -51 -46 -129 49 62 -21 -42 33 -3 -190 37 -166 -43 3 110 113 122 -6
928 -6 -51 -30 91 -64 26 -35 -19 -25 78 1 -16 46 30 -180 -121 54 54 13 34 51 -36 58 -174 -167 -49 -121 -110 211 -111
957 -111 -45 147 3 223 -267 -95 102 -83 -28 102 -24 84 2 34 -10 89 -118 -15 132 -57 -41 169 119
$$ packed form
775I1P7l34j1L89Ol91l4M89j21j94J68J80n25J9L70k8k20j12M22j26o0j07P8m0
799a4j48kK83j74j07J54J62j04k44K81j0m01J69M27r9l82L48q8j0k41J39jr1K44
823I1k05J83r3p5J40j52oj02J64J62p9O9J63l68J9J31K7k62K70J52j55n6J26j18
847B6k46L3R3J03j17L6J19kJ42j84Q0L3l00K0J72mj84K83P4j62l4Mq2k0KK7R9
874A1N5lLl7j62l1R6J70p7k2J96k60K04O3j36k29R3K3j03P6O2k8P1N3o8qj40J15
902a3r1J69j12K3k3J39j49j10J16Nq3J78J3q3k1P5l6j87K27k03J23M6J07LRj28
928fm5K1J21j55R0o1J6oJ03p7j7O2j6k10N9J75%m1K1J7q7R4k32PJ18p2J1L21l22
957a11O6J92j44K20m90J72J97j85N5J30j26J08q2L2m4R9k07J03J47j89J6K10n0
$$ plain form
980 119 26 -60 -21 -20 -255 1 -3 -137 5 146 60 -87 -147 -160 -21 162 -32 64 29 -64 -58 18 -91 -226 -40 -80
1006 -80 -160 -59 81 215 -74 -18 -155 160 -70 -172 -23 -226 50 4 33 -6 67 162 63 -204 -128 94 -11
1029 -11 48 74 231 151 109 16 91 54 27 -109 18 29 -37 35 -144 -73 -57 -39 -107 44 39 136 148 -123 -37 -32 156 -123
1057 -123 -86 -76 -101 -75 30 223 -141 145 -19 -284 -31 4 68 7 -24 -79 99 -63 56 -73 34 173 14
1080 14 88 124 -95 9 107 -142 82 94 10 117 101 186 117 209 8 -43 40 -27 -33 -109 71 -67 60 44 -32 24
1106 24 -47 28 -61 125 85 -20 90 173 62 133 -96 13 -17 69 -16 58 272 254 -33 -131 -96 123 9 -99 -26
1131 -26 77 4 -42 -57 96 235 22 62 -30 -97 -30 169 60 224 -6 136 65 -23 -45 -75 172 -13 -58 -14 -110
1156 -110 115 -109 -126 23 16 -64 -36 -20 -52 11 128 40 58 50 -20 -54 -63 -20 -13 141 42 -101 -83 55 1 108 152 17
$$ packed form
980A19r3q6L9Jk35K56mj34J42J41q6j47o0j3J39J83j94R6l5r3OP6j09j35J86m0
1006h0q0J01J40J34k89N6j37L15k30j02J49k03K76m6K9l9P3R5r9k67P6K22j05
1029a1N9K6J57q0m2r3P5l7k7j36J27J1o6P2j79P1J6J8o8J51nR7J2k71Q6NJ88k79
1057a23L7J0k5K6J05J93l64K86j64k65K53L5O4o1l1n5J78j62J19j29J07J39j59
1080A4P4L6k19J04R8k49K24J2q4J07j6Q5o9R2k01n1Q3o7op6J80j38J27j6p6N6
1106B4p1P5q9J86m0j05J10Q3j11P1k29J09l0Q6q5P4K14j8k87r8L5K19j14j08P3
1131b6J03p3m6j5J53J39k13M0r2o7O7J99j09J64k30J42p1q8k2l0K47j85m5M4r6
1156a10K25k24j7J49pq0K8J6l2O3J17q8J8qp0l4rM3PJ54r9j43J8J38n4J07M4j35
$$ plain form
1184 17 30 12 173 -41 -100 54 160 -59 31 135 101 35 -18 80 42 82 -22 -72 43 -26 28 161 76 144 67 48
1210 48 94 11 -20 71 36 15 59 114 10 -54 -177 94 37 76 48 23 -65 -23 -175 -36 -119 9 90 -51 -58 -4 -28
1237 -28 125 176 -91 49 -88 -35 -187 16 107 87 -93 134 146 61 -182 -68 -13 -14 -31 -47 -65 97 7 -20 6
1262 6 6 -51 142 -86 40 18 -3 47 -66 107 -38 105 -19 82 95 68 -21 172 -83 -17 24 -80 6 33 -185
1287 -185 54 5 73 49 -60 -88 -225 220 -21 -85 55 6 118 -80 -44 -85 74 -170 -60 -44 68 -125 -104
1310 -104 136 17 11 -110 8 -14 21 119 27 -41 -15 -7 -183 -83 44 -40 55 67 55 -93 13 -87 147 -45 -236
1335 -236 85 -28 25 53 -18 -6 -104 15 124 -43 -27 38 -4 -17 -31 100 68 -57 60 -6 0 8 11 142 206 155 13
1362 13 70 110 -106 -155 -4 148 23 -47 -110 34 131 -57 29 80 -82 -3 -145 -90 -98 -118 81 -64 -133 -140 -18 -85
$$ packed form
1184A7J3j8J61k14n9J54J06k19R0J04l4o6n3R8l8M0j04n0J15o9N4J33q5O8p7j9
1210D8M6q3l1R1l5k1M4N5j04o4j23K71n7L9k8k5q8M2j52J39q3J28Q1j41pN4k4
1237b8J53N1k67J40j37N3j52K03R1k0j80K27J2q5k43J14N5jj7j6j8J62r0k7K6
1262F%n7J93k28J26k2k1N0j13J73j45J43j24J01J3k7q9J93k55O6M1j04Q6K7k18
1287a85K39m9O8k4j09k8j37M45k41o4J40m9J12j98L6m1J59k44J10J6J12j93K1
1310a04K40j19oj21J18k2L5R8r2o8K6Qj76J00J27q4R5J2j2j48J06j00K34j92j91
1335b36L21j13N3K8p1J2r8J19J09j67J6O5m2j3j4J31l2j25J17o6OQLJ31O4n1j42
1362A3N7M0k16m9J51J52j25p0o3J44R7j88Q6N1j62P9j42N5qk0J99j45o9pJ22o7
$$ plain form
1388 -85 100 61 79 64 -1 -43 -109 -22 217 -40 159 -61 0 97 -75 28 -82 -105 8 -101 -196 146 63 143 -63
1413 -63 72 -24 -30 28 3 53 -147 -75 77 53 -47 49 -35 -116 -153 58 -54 -16 83 -16 22 -23 43 7 1 -121 -83 49
1441 49 -14 18 -101 16 95 99 -24 109 134 156 -257 -79 74 17 19 -5 -100 -216 -139 170 131 -57 -89 131 74 49
1467 49 205 16 -11 172 74 -43 -78 114 65 7 -41 6 -60 -48 88 43 179 -41 -38 -14 4 -14 -182 77 -30
1492 -30 -184 139 -34 -79 60 54 58 -59 -86 -34 70 74 60 70 -101 50 23 53 79 -176 -29 34 -87 -9 26 -123
1518 -123 38 -39 23 35 5 54 -47 41 -9 -164 208 -123 11 -75 157 -40 -42 -46 88 301 66 148 139 -24 190
1543 190 -83 -29 -146 59 22 -90 -150 59 -76 -25 -70 -25 163 132 -55 -38 72 -98 -83 51 156 -42 43
1566 43 128 -30 8 18 39 -2 72 -42 158 -130 -24 0 -53 -50 184 -41 24 65 37 4 32 134 87 75 -177 -6
$$ packed form
1388h5J85l9J8j5o5m2o6Q7K39k57J99k20O1R7j72J03j10k3J13j09r5L42q3Q0k06
1413f3J35r6oN8k5N0k00P2J52k4j00R6q4q1l7K11j12L8R9r9L8m5O6l6oj22L8J32
1441D9o3L2j19J17P9Mj23J33K5K2m13J78J53n7Kk4r5j16P7L09l9j88l2K20n7k5
1467D9J56j89k7J83r8j17l5J92m9n8m8M7o6J2J36m5J36k20LK4J8j8j68K59j07
1492c0j54L23j73m5J39oMj17k7N2J04Mj4J0j71J51k7L0K6k55J47O3j21P8L5j49
1518a23J61p7O2J2l0M9j01Q8n0j55L72l31J34q6K32j97kmJ34K13k35Q2rj63K14
1543A90k73N4j17K05l7j12o0K09j35N1m5M5J88l1j87J7J10j70J5J34J05j98Q5
1566D3Q5j58L8J0K1m1P4j14K00k88J06K4n3LK34k25O5M1k8l3K8J02m7j2k52J71
$$ plain form
1592 -6 -63 -25 -86 86 113 77 21 93 159 -47 -1 -1 -90 116 30 -13 172 -26 205 14 12 0 -3 67 179 -86 98
1619 98 -135 14 53 -179 -99 -91 -39 -71 -18 -31 122 -88 16 22 -72 -42 143 -52 -29 -144 23 -101 101 -64 -128
1644 -128 -81 113 -89 -22 54 -33 98 39 15 -63 71 -180 -61 56 77 -62 96 56 -147 -46 48 -48 137 152
1668 152 41 -43 29 -2 46 -32 14 -165 49 38 226 19 -90 132 -88 81 1 36 -50 123 -17 -14 -204 -245
1692 -245 -109 16 -83 83 -43 -33 61 -51 246 103 -114 29 -247 6 91 63 21 -89 -15 1 -78 -106 -114 -90
1716 -90 -25 52 30 47 154 -107 0 95 -27 -9 13 50 -43 33 99 35 228 -65 -94 -101 -42 -62 91 83 -53 2 60
1743 60 114 -7 -162 81 -5 24 14 -25 -14 112 104 107 -40 -181 7 15 10 9 -36 29 27 36 -71 40 -82 10 7 64 105
1772 105 -65 -27 -39 209 -161 -20 15 193 -129 86 -115 -85 -90 -75 102 27 -237 -51 36 -62 -80 -70 -18 62 74
$$ packed form
1592fn7L8o1J72K7l6n6P2O6k06M6%q9K06q6m3J85j98K31j91kj2lP0J12k65J84
1619I8k33J49L9k32Q0QN2l2N3j3J53k10J04Or4L0J85j95K3j15J67j24K02j65o4
1644a28M7J94k02O7P6q7J31n9k4p8J34k51J19J17K1j39J58m0k03J01R4r6J85J5
1668A52j11q4P2l1M8p8M6j79K14j1J88k07j09K22k20J69q0L5q6J73j40Lj90m1
1692b45J36J25r9J66j26J0R4j12K97j43k17J43k76K53Q5k8m2j10P4J6p9k8qK4
1716i0O5P7k2J7J07k61J07R5j22J8K2L7r3P6O6o4J93k93k9pN9k0J53qj36N5N8
1743F0N4j21j55K43q6K9j0l9J1J26qLj47j41J88Qnjm5O5kRj07J11j22R2lN7M1
1772A05j70L8j2K48l70J41L5J78l22K15k01L0nJ5J77p5k64J86Q7r8j8J0N2Q0J2
$$ plain form
1797 74 -170 -127 11 -65 -1 135 82 98 148 -66 -27 -5 -145 15 43 -24 -25 -24 94 30 -63 109 0 -32 110 -32
1823 -32 88 146 10 -10 71 119 -18 32 -6 -59 -219 -30 -84 89 4 -95 3 99 -75 25 -57 -4 2 38 -95 -161
1849 -161 -237 -77 142 23 47 200 87 -134 39 -103 -107 253 -64 126 -102 150 38 27 -17 -169 92 -33
1871 -33 94 -55 144 102 -53 248 101 98 52 -87 95 -84 78 80 37 140 117 195 57 -55 -29 15 -47 110
1895 110 -14 -106 -246 -116 -38 13 56 48 94 -54 5 43 -48 -69 -178 -145 -131 -30 93 -25 -125 -62 -46 102 -169
1920 -169 -125 104 -118 11 -5 -7 83 -58 27 -54 9 50 3 -126 2 99 -36 150 -9 -55 99 -25 182 -37
1944 -37 -48 83 -98 48 8 57 113 -87 -45 -7 -35 -84 -124 78 -67 -68 -101 -35 -31 3 -27 31 6 208 6 80 -182
1971 -182 69 -96 -14 -183 -92 -18 33 145 0 -71 162 17 -75 -74 15 29 93 -81 21 257 16 22 56 -47 -180
$$ packed form
1797G4k44M3J38p6O4J36n3J6N0k14L9K2j40J60K8o7jJJ18o4r3J72j09l2J42j42
1823c2J20N8j36k0Q1M8j37N0l8n3j60J89n4J73q5r9R8R6j74J00q2N3OL6j33o6
1849a61p6J60K19j19K4J53j13k21J73j42mL60l17J90k28K52j12j1m4j52K61j25
1871c3J27j49J99m2j55L01j47lm6j39J82j79J62Km3J03k3P8j38j12K6M4o2J57
1895A10j24r2j40J30P8N1M3qM6j48N9L8r1k1j09L3J4J01J23j18j00O3J6J48k71
1920a69M4K29k22J29j6kR0j41Q5q1O3M1m7j29J28R7j35J86j59m6J54j24K07k19
1944c7j1J31j81J46m0M9N6k00M2L8k8m9m0K02j45jl3O6ML4l0N8k5K02k02P4k62
1971a82K51j65Q2j69R1P4N1J12j45p1K33j45r2JQ9J4O4j74J02K36k41OL4j03j33
$$ plain form
1996 -180 -182 -104 -129 -133 -84 -12 7 66 -110 161 -146 -10 109 -5 -72 -5 124 -30 -63 -44 93 85 -45 62 178
2021 178 -91 135 -141 44 39 13 -28 -96 -33 41 -3 -122 30 -97 -19 -119 21 23 114 -2 132 124 117 -41 96
2046 96 77 -86 -34 138 -178 3 -122 96 -115 -119 -91 -65 150 83 22 -83 7 59 66 -20 -30 -104 61 -57 34 88
2072 88 106 -51 72 -108 -15 -63 -37 -194 25 -94 -10 141 28 90 -42 11 144 -224 118 -12 68 0 119
2095 119 -15 85 -53 19 45 105 -116 -110 -33 -28 -115 -114 -215 46 8 59 175 13 52 31 74 110 95 -115 126 -17
2121 -17 51 -144 36 -5 3 -206 26 110 36 -94 40 15 -54 81 -65 -11 -59 14 48 26 0 35 -206 53 -73
2146 -73 152 -85 -49 82 80 3 -3 -177 -102 -96 -42 94 -24 -111 -152 -11 -30 65 8 -14 57 -180 -18 36 -47 72 21
2173 21 -30 98 70 38 -44 -106 104 -156 -68 -6 70 122 -95 133 99 80 -106 -76 22 180 123 58 -130 65 84 -96
$$ packed form
1996a80kP8k5mM9P2J9N9j76K71l07J36J19j14o7O7J29j54l3J9J37qj30J07J16
2021A78k69K26k76J85nk6m1o8O3P4m4j19J52j27P8j00J40KR1j16J34qpj58J37
2046I6j9j63N2J72l16J81j25K18k11mK8K6K15o7o1j05R0N2Pq6j0p4J65j18R1N4
2072H8J8j57J23j80R3m8K6j57K19j19Q4J51j13O2j32N3J33l68L42j30Q0o8J19
2095A19j34J00j38P2K6O0k21OP7Nq7Jj01K61l8N1J16j62L9k1M3L6j5k10K41j43
2121a7O8j95J80m1Qk09K32Q4p4j30J34k5o9J35j46N4m8P3L4k2k6L5k41K59j26
2146g3K25k37L6J31kp7oj74P5ON4J36j18q7m1J41j9R5n7k2P1k37J62N4q3J19n1
2173B1n1J28k8l2q2o2K10k60Q8O2P6N2k17K28l4j9j86L0R8J58n7o5j88J95J9j80
$$ plain form
2199 -96 -35 25 25 14 -18 116 -33 91 61 24 -176 -124 68 -25 161 9 39 5 96 28 63 42 65 -97 86 -7
2225 -7 96 -16 -22 -25 -5 87 -21 -113 153 -48 81 51 64 -9 -53 -163 212 -69 -133 -24 168 29 -94 51 -142
2250 -142 5 -123 -26 -70 103 -60 18 -37 -1 75 -66 -11 -34 -68 -80 -196 -18 72 55 -28 -14 4 98 16 -2 -8 -33
2277 -33 106 17 -23 59 11 24 -80 -44 45 10 -66 -99 -94 -108 39 -51 2 -107 -92 117 14 -135 -22 44 -55 -45 98
2304 98 63 -67 153 -75 33 44 -20 -49 -103 -55 -67 89 -20 -5 26 -115 -165 -104 16 -19 -71 -134 -103 -4 -56 182
2330 182 -67 -19 56 5 -245 18 32 -169 89 -133 -67 -56 70 68 24 -113 92 -9 -65 -119 48 58 77 104 -133
2355 -133 -53 104 -57 188 71 16 34 -10 70 -15 -82 -103 -26 -153 7 -109 -129 -65 23 38 -246 -3 -45 -174 174
2380 174 56 38 43 -127 -26 -35 -57 32 17 127 54 20 -47 -31 -163 -16 77 154 164 102 95 -24 32 -91 18 142
$$ packed form
2199i6O1O0%j1l2J34j49J24l0l7k00N2J92r3J86j52L0l4R1o8L5k1K3j62J83r3
2225gJ03j12olK0R2j08r2K66k01J29l0J3p3m4j10L75k81o4J09J92j39j23J45j93
2250a42J47j28R7m4J73j63P8n5L6P6j41N5k3l4j2j16J78R0j7q3J4J8R4q2j8ok5
2277c3J39q9m0Q2m8J3j04L6Q9l5p6l3Nj4J47r0N3j09J5K09j03j49J13O6r9J0J43
2304I8l5j30K20k28J08J1o4k9n4M8j2J56j09J5L1j41n0O1J20l5n2o3L1R9n2K38
2330A82k49M8P5n1k50K63J4k01K58k22O6J1J26km4j37K05j01n6n4J67J0J9K7k37
2355a33Q0J57j61K45j17n5J8m4Q0q5o7k1P7j27J60j16k0O4Q8J5k84K43m2j29L48
2380A74j18j8Nj70J01rk2Q9j5J10p3l4o7J6j32J47R3P7J0o2pj19N6j23J09J24
$$ plain form
2406 142 181 -20 -44 -20 65 -4 96 39 -51 81 37 151 42 31 237 -92 47 60 -10 20 69 -129 4 42 27
2431 27 -18 -50 23 -36 135 126 7 3 -103 -47 -12 176 29 -119 133 60 -69 51 7 -110 54 106 48 82 49 -35
2457 -35 -152 243 43 81 -12 60 -44 45 278 43 -46 -48 0 111 125 27 -60 -35 94 10 188 39 -49 21 88 79
2483 79 69 -68 110 38 205 56 8 -177 141 -101 -44 -18 26 -124 6 9 195 22 40 92 139 -110 -33 -78 -55
2508 -55 -27 131 -68 81 39 28 79 61 97 -91 76 -40 -75 -114 -162 -101 -96 -118 -51 -67 106 -34 9 72 2 -219
2534 -219 24 -156 65 16 0 199 52 43 -58 -27 65 -29 -43 -181 62 -73 -107 38 2 12 -59 -21 -125 49
2558 49 54 2 -120 -86 176 5 9 -107 99 39 81 -73 33 98 164 -19 25 -126 -36 -35 20 94 -118 9 -62 14
2584 14 37 67 56 26 108 170 32 119 176 -15 56 102 90 122 31 72 -54 1 76 -30 -27 42 -88 77 -74 -39 -56
$$ packed form
2406A42L9k01k4K4Q5o9J00n7r0J32m4J14j09j1K06l29J39J3p0L0M9j98J33L8j5
2431B7m5l2P3n9J71rj19mj06N6L5J88j47j48K52p3j29J20m4j17J64N2n8L4l3q4
2457c5j17L95k00L8r3P2j04Q9K33k35q9kM8J11J4r8q7K5J29q4J78j49q8P0O7r
2483G9j0j37J78p2J67j49m8j85L18k42N7K6M4j50J30LJ86j73J8N2M7k49P7m5K3
2508e5K8J58j99J49m2j1N1j8L6j88J67j16l5l9m8O1Nk2O7j6J73j40M3O3p0k21
2534b19K43j80K21m9j6J99j47rj01L1R2r4j4j38K43j35l4J45l6J0p1L8j04J74
2558D9Nn2j22L4K62j71Mj16K06o0M2j54J06O5O6j83M4j51R0JN5P4k12J27p1P6
2584A4K3L0j1l0Q2O2j38Q7N7j91P1M6j2L2r1M1j26N5P5j06LO9j30J65j51L5j7
$$ plain form
2611 -56 156 86 66 97 -99 -68 -33 -39 -40 -69 103 85 -82 131 51 147 -164 -77 -15 11 121 -55 23 -33 61 8 36
2638 36 -61 140 155 18 -21 -36 -20 80 -175 57 -142 12 -210 -29 -26 -14 17 -85 73 9 -32 -165 81 114
2662 114 -215 -27 88 -186 49 80 -47 56 -18 65 -45 -60 -10 -172 -48 67 -78 -14 96 53 2 13 -110
2685 -110 -121 -41 -25 143 14 37 -289 148 56 -66 78 36 119 -5 137 21 83 153 267 108 123 -51 17 22
2709 22 -29 141 29 87 -66 217 -118 -20 134 -32 146 -58 66 111 -159 89 39 34 -74 207 -147 68 13
2732 13 -8 -105 109 26 -137 135 34 112 47 83 79 -66 163 155 132 -53 -67 88 137 69 -74 211 90 -90 -32
2757 -32 -79 10 224 2 43 -38 -46 43 181 -11 -26 134 -24 -59 -78 -53 -73 108 50 1 62 -1 152 53 -170 -92
2783 -92 -35 -101 -67 -152 -4 271 -69 114 -60 70 -171 91 112 -42 46 -28 -30 50 22 -8 94 -67 -73 -72 226 -43
$$ packed form
2611e6K12p0k0L1j96L1L5ojk9J72j8j67K13q0R6l11Q7O2K6J10j76P8n6R4n3K8
2638C6r7K01J5j37l9j5J6J00k55K32j99J54k22J81LJ2L1j02J58o4m1j33K46L3
2662A14l29J88J15k74K35L1j27J03p4Q3j10j5N0j62J24J15j45O4J10m3n1J1j23
2685a10j1Q0J6J68j29K3l26M37r2j22J44m2Q3j24J42j16O2P0J14j59J5j74O8N
2709B2n1J70j12N8j53K83l35R8J54j66J78k04J24M5k70K48n0nj08K81l54K15n5
2732A3k1r7K14q3j63K72j01P8o5L6mj45K29qk3j85j4J55M9o8j43K85j21j80N8
2757c2m7Q9K14k22M1q1qQ9J38j92j5J60j58l5j9K5k0J81n8m9O1o3J53r9k23P8
2783i2N7o6L4q5J48K75l40J83j74J30k41K62K1j54Q8p4kQ0k8l0J02j61oJK98k69
$$ plain form
2809 -43 39 -120 3 -126 -63 177 171 -27 -14 2 58 129 114 6 -56 40 52 60 -112 10 -142 23 -73 111 123 -29
2835 -29 148 -48 -85 13 11 148 74 113 213 41 -123 -114 -114 -35 1 -289 -15 84 -37 104 39 -43 -92 -15 -35 -105 -24
2862 -24 124 33 -15 15 200 33 70 219 65 4 76 -47 -97 -179 0 28 117 82 208 -97 23 40 21 93 79
2887 79 59 -166 -101 24 -61 -47 -10 -37 -53 -90 97 -11 140 25 119 -26 -140 26 168 43 100 22 -5 30 -136
2912 -136 -1 82 19 -122 -117 79 10 76 -78 87 160 61 12 4 67 -84 21 97 -63 110 85 -26 7 106 -158
2937 -158 -28 -57 -68 -93 205 -5 -27 -82 -4 -86 -84 -11 19 5 -194 7 -42 -47 -125 27 -128 48 2 -131 -39 247
2963 247 -9 213 -37 -5 213 16 140 -39 19 41 81 -90 -60 39 171 -54 119 72 -125 -24 14 94 61
2986 61 -183 -28 -47 62 -14 -86 74 -49 120 22 -100 -257 -59 -45 -145 -13 1 110 42 -24 93 -1 23 -51
$$ packed form
2809d3Q2j59J23j29O3K40oj98J3J6N6P1j5j08o2R6J2Qj72J22j52J65r6J84J2j52
2835b9J77j96l7R8kJ37p4L9J00j72j64R%P9L6k90K74R9j21J41o5q2m9P7k0p0Q1
2862b4J48r1m8L0J85j67L7J49j54o1P2j23n0q2J79K8Q9l5J26l05J20J7j9P2j4
2887G9k0k25O5J25q5J4L7k7j6l7J87j08J51j15R4j45j14J66J42j25N7p8k7L5j66
2912a36J35Q3o3j41NJ96o9O6j54J65P3r9m9qO3j51J05P6j60J73k5j11L3R9k64
2937a58J30k9j1k5K98k10k2n5P8q2KP3L0j4j99K01m9np8J52j55J76m6j33R2K86
2963B47k56K22k50L2K18j97J24j79N8K2M0j71L0R9J32k25J73m7j97J01L8Q0l3
2986F1k44J55j9J09p6p2J60j23J69r8j22j57J98J4j00J32J4J09o8o6J17r4K4p4
$$ plain form
3010 -51 147 33 -116 -108 63 120 116 51 62 -38 34 -192 -72 -80 14 103 72 18 -26 -76 74 -7 -39 -23 29 -94 57
3037 57 79 -116 -23 43 77 34 -88 31 136 36 -45 -84 115 -7 26 26 -21 -135 -251 -5 -11 -78 53 -8 -110
3062 -110 -106 34 143 21 85 -2 -32 63 -67 -45 171 6 -51 60 -47 -5 -16 -43 72 4 71 -106 -58 96 26
3087 26 27 49 14 125 87 -24 -5 6 -46 -45 153 -14 -134 -41 40 118 102 40 -114 26 -15 104 -24 1 58 85 43
3114 43 126 -37 0 -65 -178 -49 98 15 60 -44 100 168 -29 -62 100 -115 -26 20 146 67 86 -15 110 149
3138 149 -60 -97 -47 -24 168 66 -62 58 -209 -24 176 50 -147 -157 -109 123 105 68 -73 49 -68 19 -142
3161 -142 20 41 -111 32 -22 12 -95 -9 9 60 27 -45 89 -26 44 39 172 -48 175 -13 129 -84 5 -67
3185 -67 -188 86 65 22 49 111 -19 -8 14 -77 -30 -24 -24 54 -64 67 41 -10 -68 124 -43 6 -33 113 99 -48 -36
$$ packed form
3010e1J98j14j49QJ71N7mo5J1j00P2k26J20qR4Q9l1n4m4n0J50q1l2J6N2j23J51
3037E7K2j95R3O6L4m3j22J19J05j00q1l9J99j22L3%m7j14j16K46oo7J31o1j02
3062a10MJ40J09j22O4q7l0R5j30K2K16j65n7J11j07M2j1k7J15o8O7j77M8J54p0
3087B6JK2l5J11l8j11J9J1n2JJ98j67j20R3Q1P8j6o2j54J40m1J19j28K5N7K7m2
3114D3Q3j63L7o5j13J29J47q3M5j04J44O8j97l3J62k15Q9M6J26p9J9j01J25L9
3138A49k09l7N0K3J92j02j28J20k67J85K00j26j97j0M8K32j8l7j41J22j17Q7j61
3161a42J62K1j52J43n4L4j07Q6J8N1l3p2J34j15P0nJ33k20K23j88J42k13Q9p2
3185f7j21K74k1m3K7O2j30J1K2r1M7O%P8j18J31k6n1n8J92j67M9l9J46j4j47J2
$$ plain form
3212 -36 -31 37 19 -97 -33 36 15 -154 45 -6 -2 -1 -92 171 44 -135 -92 116 -7 -154 -78 -93 -113 -35 0 60 -154
3239 -154 -101 86 -101 -91 -35 -19 -20 -152 -24 -83 18 -16 -127 62 14 -46 71 -25 96 7 -36 -34 -79 2 -29 -81
3265 -81 -127 86 -192 40 -172 6 126 -11 73 -132 -11 -77 122 28 -140 -16 74 -11 -62 -80 -126 -44 46 -53
3289 -53 -78 -29 -64 -28 156 -48 65 -13 98 92 41 115 -42 -115 -39 -51 -57 -136 35 -1 -48 -28 114 148 50 -82 134
3316 134 74 -43 100 -74 27 -8 -70 -92 -8 -82 -76 -90 17 -15 -120 -171 -54 26 53 45 126 13 -59 107 15 -67
3342 -67 21 -11 21 -149 -34 -27 54 -5 -39 -302 23 -74 79 209 -148 -47 -67 137 -39 72 -35 25 -119 17
3366 17 53 -168 153 68 -124 145 -7 -13 -9 -61 -98 -47 30 -38 173 -6 54 174 -72 -59 -149 91 -175 107 -107
3391 -107 -86 7 -22 33 -82 -60 -80 -35 -176 -106 -27 -127 19 -53 143 125 -20 -14 98 29 -38 107 20 -260 -14
$$ packed form
3212c6NO8j8j16O4O9k1j69J99n1MJr1K63j27j79M3K08j23j47P6j5k0P8L5O0k14
3239a54N3J87j87J0N6J6jj32J28n9J01l4j11J89m8o0J17r6J21q9m3Km5Q1l1n2
3265h1m6K13k78K32k12J78J20j37Q4k05J21o6J99r4j68J24R0q5n1j8m6Q2R0r9
3289e3k5M9l5L6J84k04J13p8J11on1P4j57p3P6j2op9J71l6m7K0J42L4r8j32K16
3316A34o0j17J43j74J01l5o2k2Q4p4Oj4J07l2j05n1J17Q0K7qQ1j13p2J66r2q2
3342f7Q8l2L2j70J15PQ1n9l4k63L25r7J53J30l57J01k0K04j76J11j07O0j44J36
3366A7L6k21L21q5j92K69j52oMn2l7N1P7o8K11j79O0J20k46J3r0K40k66K82k14
3391a07K1R3k9N5j15K2k0M5j41P0P9j00J46p2J96j8j45OJ12o9o7J45q7k80K46
$$ plain form
3416 -14 46 -66 -89 -115 -49 -20 68 192 54 -84 89 -85 157 22 -47 -78 -87 -26 -173 100 -218 9 -114 -14
3440 -14 -81 -30 -89 -14 -6 95 82 -222 107 -120 66 -122 112 136 50 -19 43 -14 -100 26 68 -32 10 -31 -81 165
3466 165 -97 -287 38 -55 50 -3 38 -50 -41 -26 -34 -184 26 -107 -12 -34 -26 -63 -97 39 101 -34 63 74 -2 40 -89
3493 -89 14 -55 48 120 36 43 61 62 -79 36 136 12 -75 -97 -56 -21 -115 -59 -56 153 -78 -26 -26 -97 -14 61 7 -137
3521 -137 73 -67 7 -10 105 -9 -17 117 -63 67 -143 -40 60 -59 12 79 -44 37 42 -128 9 60 82 102
3545 102 -11 83 238 -8 -57 -7 36 -46 -5 38 -147 31 29 -169 -144 -42 -39 8 -2 9 -7 7 -112 159 71 59
3571 59 161 74 26 18 9 1 -51 73 165 -62 -23 30 23 25 21 -30 80 84 -176 26 -80 35 23 -43 -78 20 -44 -8 72 -119
3601 -119 -175 157 13 93 -74 192 -86 -27 3 -157 102 36 -11 29 78 53 43 60 193 -17 19 34 92 -4 112
$$ packed form
3416a4O0j12k3k6O6K9Q8J24j38j38J73j74K42j35o9l1rO1j47K73l18K27j23J00
3440a4o7N1n9P5QJ01j3l04L29k27J86j88K34K4q6o9O2n7q6J26M2j00M2m1n0K46
3466A65k62j90L25r3J05n3M1q8RJ5qj50K10j33R5k2Ql7l4J36O2j35R7J1p6M2j29
3493h9J03o9J03P2q4PJ8Jj41J15J00j24q7k2M1L5r4N6LK09k31N2%p1Q3P5n4j44
3521a37K10j40P4j7J15j14qJ34j80J30k10J03J00j19P1O7j23Q1Nj70J37N1K2K0
3545A02j13R4J55k46m9N0M3q2M1M3j85J78kj98K5J02LM7j0J1j6J4j19K71q8j2
3571E9J02q7m8qrqn2J24R2k27L9N3pKmn1J10Mk60K02j06J15j2o6l5R8o4L6Q0j91
3601a19n6L32j44Q0j67K66k78N9L0j60K59o6m7M0M9k5j0J7J33k10L6J5N8r6J16
$$ plain form
3626 112 26 78 74 -2 54 15 -91 162 160 151 103 -18 34 -64 29 -16 -37 -20 132 47 65 93 148 71 -103 32 79 12
3654 12 -222 -12 -115 37 -96 -53 -10 89 -44 -58 -125 -41 -39 175 20 -79 37 -7 54 -224 2 -108 151 -48
3678 -48 73 -46 -47 -73 -31 145 22 86 -84 6 -93 -76 6 11 -54 -54 -86 47 -23 57 160 107 21 138 69 -84 -91 -82
3706 -82 48 67 -51 100 -60 -71 -102 -55 48 -102 -66 -70 -132 13 63 -78 -72 -63 95 -22 17 41 -152 31 106 60
3732 60 -72 21 62 -143 62 120 17 36 38 72 32 59 132 -47 6 126 -72 10 61 158 35 24 52 -88 -58 -41
3758 -41 -157 160 155 -46 59 -90 61 -169 24 16 -58 -44 88 8 45 22 51 126 -118 102 -79 7 37 43 87 -96
3784 -96 12 41 -3 46 163 126 -121 -179 142 16 49 -38 -53 80 2 -15 137 40 17 86 -100 92 89 -39 -18 47
3810 47 148 -63 -33 -67 -8 53 7 32 1 -160 -71 -7 -2 43 50 -41 -49 -90 42 -39 -143 132 105 15 8 68 26 29 2 93
$$ packed form
3626A12q6N2mp6N6l9j06K53krm8j21N2r8R3m5k1J7J52q5J8K8N5p7j74J35M7o7
3654A2k34K10j03J52j33M3M3R9j33j4o7Q4KK14j55r9J16m4O1k78K26j10K59j99
3678d8J21j19jk6M2J76j23O4j70R0r9J7Q2No5%l2J33p0Q0J03n3q6J17o9j53pR
3706h2J30J9j18J51j60j1l1M7J03j50L6mo2J45N0j41ORJ58j17L9K4j93J83P5m6
3732F0j32R3M1k05K05N8j03J9KL4m0K7P3j79N3J20j98Q2N1R7j23j1K8j40L0J7
3758d1j16L17nk01J05j49J51k30J93qp4J4J32q0L7k3K9P5k44K20j81Q6L0OM4j83
3784i6J08K9m4M9J17l7k47n8L21j26L3q7j5J33p8j7J52r7k3O9j86J92lj28K1O5
3810D7J01k11L0l4N9O1m6K5l1j61Q9O4NM5Pr1qm1J32q1j04K75k7r0pO0m2Lk7R1
$$ plain form
3840 93 26 -28 39 -74 79 133 -126 -33 -30 -166 -64 106 -62 -44 2 43 177 219 22 9 33 -49 87 59 -122
3865 -122 65 76 224 -66 130 -33 1 -27 -97 90 99 29 -95 92 -91 114 64 -160 -63 -70 -12 106 -69 105
3889 105 35 -176 -24 85 86 -194 -32 43 -178 -73 -154 -120 -86 58 84 -149 -52 -3 75 156 -116 81 123 20
3913 20 17 -3 12 29 -67 28 -115 -20 48 54 127 114 91 11 133 -54 78 -129 -88 167 -21 50 91 59 -105 -146 167
3940 167 10 -102 77 -38 52 -11 138 21 34 56 50 -150 42 -30 -90 -4 69 -6 -126 -120 74 91 152 -94 8
3965 8 102 41 24 -5 -53 51 48 -38 148 97 -2 -89 -63 -90 101 -180 -29 -147 96 107 73 16 -75 -55 44 0 71 108
3993 108 -69 -32 -28 76 87 68 -10 -106 84 127 120 15 119 -8 143 81 40 -76 20 207 -175 -78 -23 -165 65
4018 65 -24 169 87 5 -18 55 25 -100 -141 -59 -155 -53 -94 176 -82 23 111 106 76 41 41 -42 53 -29 20 -117 -51 34
$$ packed form
3840I3o7n4O7j13J53N4k59R3Lj36J02J70j68J8M6M1J34M2j97j3K4q2J36k8j81
3865a22J87J1J48k90J96j63L4k8p0J87Rp0j24J87j83K05n0k24R7pN8J18j75J74
3889A05p0k11J52J09Jk80J62P5k21J05q1L4L4J44K6k33R7M9P8Q1k72J97M2j03
3913B0lk0J5J7r6R5j43R5O8OP3j3k3q0J22j87J32k07M1K55j88P1M1l2j64m1L13
3940A67j57j12J79j15R0o3J49j17J3K2ok00J92p2o0Q6P3p5j20OJ94J7O1k46J02
3965HR4o1j7k9m8J04lq6J86n1r9q7K6k7J91k81J51j18K43J1l4n7r1K0R9m4P1L7
3993A08j77L7MJ04J1j9p8r6J90M3pj05J04j27J51o2m1j16R6J87l82R7N5j42K30
4018F5q9J93q2q2k3P3l0j25m1Q2r6J02m1K70k58J05Q8nl0l5%q3R5q2M9j37O6Q5
$$ plain form
4046 34 -60 -68 57 -54 218 17 99 71 -89 114 -17 -44 8 -103 -138 82 120 -109 38 3 70 -128 -43 6 167
4071 167 242 50 53 -38 173 69 73 -22 43 74 -129 45 -51 37 -44 -62 176 9 -186 -142 80 -24 -265 49 96
4096 96 30 96 1 -69 11 72 22 -47 -164 67 -67 -66 -48 39 -58 6 -36 48 63 77 169 93 -39 -109 -46 -10 170 112
4124 112 45 28 56 51 51 -59 -7 -51 142 -79 -106 -141 -175 23 -93 -59 -30 73 -167 39 70 63 17 21 157 -126 -165
4151 -165 124 -46 -28 103 216 -50 195 22 38 -149 160 -63 -61 -24 154 28 27 37 -117 88 -58 150 -25
4174 -25 -49 -17 38 45 15 -8 -84 36 -235 -68 -40 101 -11 -147 93 -199 -63 1 54 -35 211 106 84 -125 23
4199 23 24 -129 53 -18 -96 53 -19 -125 -160 -136 -75 32 158 -116 -34 -227 79 65 -107 127 11 -15 76 -5 -55
4224 -55 76 76 -28 88 94 6 68 -58 -69 29 84 133 23 -80 16 32 -103 -29 -46 -5 113 92 -18 -24 -26 -96 -43 -67
$$ packed form
4046C4r4qJ25j11K72k01Q2k8j60K03j31k7N2j11l5K20L8k29J47l5O7j98Q5M9J61
4071A67P5j92Lr1K11j04Mr5O5L1k03J74r6Q8q1j8K38j67j95M4K22j04k41L14M7
4096I6o6O6r5p0Q0O1n0o9j17K31j34JJ8Q7r7O4m2Q4J5J4R2p6j32p0O3L6J80n8
4124A12o7j7K8n%j10N2m4J93k21k7l5l4J98j16L4K9J03k40K06L1pm6MJ36k83l9
4151a65K89j70J8J31J13k66K45j73J6j87L09k23KL7J78j26jJ0j54K05j46K08j75
4174b5k4L2N5Pl0k3p6J20k71J67K8J41j12j36K40k92J36O4N3q9K46j05k2k09J48
4199B3Jj53J82p1p8J49p2j06l5K4O1J07J26k74Q2j93L06j4j72K34j16k6R1q1n0
4224e5J31%j04J16Oq8O2j26j1R8N5M9j10j03R6J6j35P4j7M1J18k1j10okp0N3k4
$$ plain form
4252 -67 -42 -55 -110 -227 80 -19 22 72 61 -1 -44 38 132 -41 52 145 73 32 -13 -61 4 25 -78 136 81 10 68 -26
4280 -26 107 32 -39 -107 -132 -64 -156 24 -84 73 -177 100 81 135 136 36 75 21 9 -136 44 -64 -142 28 27 -17
4306 -17 5 -21 -18 -13 -201 -138 69 -163 -61 95 -15 -2 -17 106 64 -107 24 107 19 34 76 -37 105 -14 96
4331 96 -166 74 -201 62 -49 4 -36 60 52 49 -177 -68 52 -134 55 81 14 35 -80 -91 27 -142 29 -31
4355 -31 117 -10 -103 32 -95 120 -91 -102 -54 169 -135 -79 76 47 97 -20 -66 -32 -18 219 -82 115 121 -200
4379 -200 41 -3 6 91 105 -65 7 -163 83 22 -96 23 50 -290 47 43 -74 -111 21 -65 -61 29 26 -66 8 17 143
4406 143 53 -88 104 79 -12 -5 -32 -68 109 -61 126 -49 199 -8 -55 106 -108 -112 -115 -31 -58 83 30 25 -29 -38 -20
4433 -20 -4 -136 -114 -157 47 -73 -87 -37 109 -53 -5 89 128 -18 95 -83 -27 -4 4 -154 80 -159 -20 -20 -8
$$ packed form
4252f7K5j3n5j17L07r9M1N0j1o2m3Q2R4j73R3R3p2m1m5m8O5K1j03K14n5p1N8r4
4280b6J33p5p1o8k5O8r2J80j08J57k50K77j9N4Jj00L9n4j2j45J80j08p8J70jm4
4306a7K2k6LNj88O3K07k32J02J56j10J3j5J23m2j71J31Q3q8J5M2j13J42j19J10
4331I6k62K40k75K63j11N3m0R6qlk26J09J20j86J89K6o7K1j15j1J18j69J71o0
4355c1J48j27r3J35j27K15k11j1M8K23l04N6J55k9N0j17m6L4J4K37l01J97Ol21
4379b00K41m4RQ5J4j70P2j70K46o1j18J19K7l40L37mj17l7J32q6MR0lr2P4RJ26
4406A43r0j41J92k5r1Pk7l6J77j70J87j75K48k07m7J61k14mlQ4k7J41n3nn4rJ8
4433b0J6j32K2m3K04j20j4N0J46j62M8R4L9j46J13j78N6K3Qj58K34k39J39%J2
$$ plain form
4458 -8 -62 -203 192 112 10 -31 31 -21 90 63 -95 76 -53 -18 -27 -55 153 -40 -15 22 -179 -14 70 -202 -38
4483 -38 -13 -68 -31 132 22 13 -175 -134 -76 -37 -52 55 -54 50 -85 -84 38 6 -11 95 -88 -154 -96 -70 -37 -52
4509 -52 18 -115 94 -116 146 117 -113 161 -9 14 54 148 -186 -10 -86 34 123 88 -131 -98 -180 101 -34 8
4533 8 29 95 -8 187 -27 -42 60 -175 -32 -132 44 -128 -60 -91 131 -5 12 -87 -73 4 -26 -63 -28 28 -68
4558 -68 122 149 195 6 44 69 -48 96 -27 -39 17 -24 -42 0 -30 19 -85 -153 -79 -5 -180 29 83 -17 49 52
4584 52 63 104 103 78 55 -28 30 80 -73 -114 44 7 -21 40 -1 124 25 -21 105 -65 -168 -7 -42 8 -135 40
4610 40 85 -188 77 -49 -175 96 -34 100 82 81 255 104 17 -22 66 12 -78 66 152 -11 -79 -1 -11 2 -23
4635 -23 -62 32 -36 29 -91 -13 31 27 -28 103 -42 87 -78 8 17 -17 -96 140 31 150 94 -94 44 -56 15 -6
$$ packed form
4458hn4j41L95q0j02m1O2n2J11k7j58J71j29L5rk8K08j93K5L7k01J65Q4k72J64
4483c8K5n5L7J63j10rj88M1N8L9j5J07j09J04j35JJ22l2j7J06j83o6N8K6L3j5
4509e2P0j33K09k10K62k9k30K74j70K3M0R4l34J76p6J20Q9l5k19L3q2K81j35M2
4533HK1O6j03J95k14j5J02k35J43j00J76j72O8l1K22j36J7r9J4P7l0l7L5N6r6
4558f8J90K7M6j89L8K5j17J44j23j2N6m1j8M2l0M9j04o8P4P4j75K09N4j00O6L
4584E2J1M1jk5k3q3N8N0j53m1J58l7k8O1m1J25r9m6J26j70j03J61l5N0j43J75
4610D0M5k73K65j26j26K71j30J34j8jJ74j51q7l9Q8n4r0J44Q6j63o8P8j0J3k5
4635b3l9R4o8O5j20P8M4mn5J31j45J29j65Q6Rl4p9K36j09J19n6j88J38j00P1k1
$$ plain form
4661 -6 114 196 42 21 59 19 8 -44 158 -83 25 33 41 120 50 19 78 44 -10 0 44 50 -79 -97 33 3 -32 -163
4689 -163 -40 -64 66 -81 -134 -64 -174 -56 2 7 -139 -7 -100 9 -12 -28 52 106 185 24 103 51 -56 -13 -19 -48
4715 -48 -99 167 182 -141 3 66 -17 117 102 52 150 -111 -111 -137 -101 -15 -66 72 146 -77 25 59 8 150 -156 154
4741 154 -45 -93 -42 -260 33 -128 -100 -3 -12 50 -111 52 -100 -14 -99 -106 -28 106 -82 -34 -112 -75 112 -122 57
4766 57 -94 11 -14 131 47 -66 110 -72 59 38 28 -64 -22 -75 88 23 -73 84 -81 -53 43 -1 -96 94 -19
4791 -19 -127 -107 49 14 74 -6 142 165 -82 29 74 2 -15 18 30 135 -62 56 67 -26 102 38 -134 -50 -95
4816 -95 60 -29 -132 -5 -14 -134 -109 -47 158 -119 131 -65 -214 -39 81 116 -26 -54 -72 86 4 -19 -112 146
4840 146 -211 -56 28 46 148 76 55 90 -39 -96 -133 -147 -59 -71 -36 -6 67 -17 -71 126 -33 38 105 89 57 -23 13
$$ packed form
4661fJ20Q2j54k1L8m0j1n2K02k41J08QQP9p0l1N9l4n4J0M4Oj29j8J30l0l5j31
4689a63J23k4J30j47n3P0j10J18N8Nj46J32r3J09k1j6Q0N4P9j61P9n2j07M3ok9
4715d8n1K66J5l23J44O3q3J34j5n0R8k61%k6L6Q6n1J38P4k23J02L4n1J42l06L10
4741A54j99m8N1k18K93j61K8R7rO2j61J63j52Q6q5pP8J34j88M8p8L7J87k34J79
4766E7j51J05k5J45q4j13J76j82J31k1j0r2M2n3J63o5r6J57j65K8R6m4r5J90j13
4791a9j08K0J56l5O0q0J48K3k47J11M5p2j7L3J2J05j97J18J1r3J28o4j72Q4m5
4816i5J55q9j03J27rj20K5O2K05k77K50j96j49J75J20L5j42k8j8J58q2k3r3K58
4840A46l57J55Q4J8J02p2k1L5j29n7l7j4Q8j2L5L0P3q4n4J97j59P1O7j6l2q0L6
$$ plain form
4867 13 -172 203 70 -45 12 -67 -96 -20 -45 -113 142 -19 -33 51 -94 16 84 41 58 -32 87 50 108 81 4 -164
4893 -164 -13 8 -190 -77 -115 38 -32 -89 128 -42 98 1 54 154 -49 4 201 4 -153 -120 71 -132 -95
4916 -95 26 -63 -81 -89 111 -110 -158 -34 81 -71 -63 63 21 57 -8 -24 56 46 45 47 -75 -214 -143 48 39 60 -105
4943 -105 1 26 -29 -133 -93 -116 -149 -48 92 -2 22 -13 -200 73 51 41 -50 -88 -38 18 13 -67 44 99 -86 -189
4969 -189 -48 12 -17 -130 103 52 -23 -102 -22 57 45 -32 27 -22 -64 -49 154 75 -70 16 -206 -67 -125 -43 -114 -103
4995 -103 -128 -43 21 -26 -2 46 28 -38 130 -168 13 117 65 91 70 -133 79 -36 -104 -67 -83 36 -26 -105 77
5020 77 -3 -28 -25 -10 -24 41 -99 -49 205 55 66 -16 -17 84 12 37 -151 -5 28 26 9 -48 3 211 48 170 -8
5047 -8 91 -96 25 70 124 16 -158 -94 -27 13 -97 162 -76 -199 -72 39 -46 -20 129 27 -109 -51 -43 -52 -73
$$ packed form
4867A3j85L75j33j15N7p9k9P6k5o8K55j61j4Q4j45J10O8m3J7r0J19l7N8k7p7j68
4893a64J51K1j98J13l8J53p0n7K17j70J40r7N3J00k03N3J97j97j57L3J91k03L7
4916i5J21q9j8qK00k21m8J24J15j52QJ26m2L6o5j6Q0j0jKj22j39P1J91rK1j65
4943a05J06K5n5j04M0k3l3J01J40r4K4l5j87K73k2j0r1l8N0N6nq0J11N5j85j03
4969a89J41O0k9j13K33n1p5p9Q0P9j2p7N9m9m2J5K03p9j45Q6k22J39n8Q2p1J1
4995a03k5Q5O4m7K4M8j8o6J68k98J81J04n2K6k1k03K12j15o8L7j6J19o2p9J82
5020G7q0k5LJ5j4O5j40N0K54j50J1q2jJ01p2K5j88J46L3kj7n7N1K08j63J22j78
5047hR9j87J21M5N4j08j74O4O7M0j10K59k38j23J27J11q5K6J49j02j36N8Qrk1
$$ plain form
5072 -73 104 -100 20 39 55 17 18 85 -5 9 1 66 -32 231 170 -160 -19 -26 -43 -44 -94 -41 24 100 -132 37 52 129
5100 129 -15 -67 -11 80 -135 -100 -185 18 78 -158 -58 92 -126 -15 -75 -179 -22 155 -16 81 165 -46 -34
5123 -34 49 72 -14 82 110 116 167 -71 170 9 171 -100 39 94 -40 145 -153 -38 60 -83 -73 -95 68 27 46
5148 46 -126 154 -64 38 59 115 22 -85 178 15 27 33 31 -31 -62 65 -51 -59 -122 -20 111 -1 -163 20 -21
5173 -21 15 87 -40 -118 -6 96 -5 -74 -128 164 -10 39 4 6 44 75 27 70 100 -32 -82 73 -81 -5 -83 -143
5199 -143 -124 -3 7 216 50 -30 115 -48 64 -72 87 54 -6 182 -12 -18 43 -57 67 -97 -47 96 41
5222 41 171 54 -193 61 -90 69 63 39 -166 127 32 19 113 -17 102 92 -187 -27 -41 -119 67 -21 133 22
5246 22 -171 98 52 59 100 77 -2 -67 -14 -17 31 -84 -88 103 71 128 71 22 -95 118 -44 -32 -48 35 -165 -63 51
$$ packed form
5072g3J77k04J20J9J6l8JO7r0J4qO5r8K63o1l30J41pj7jn0N3O5P6k32J69J5P7
5100A29j44n2N6R1k15L5q5K03O0k36J00J50k18J11o0j04J57J77j71R7Q4k11J2
5123c4Q3K3q6R6K8ON1k38K41j61J62k71J39N5j34J85k98J15R8j43J0k2J63m1J9
5148D6j72K80k18J02K1N6r3j07K63j63J2Oko2l1J27j16qo3J02J31j12j62J83m1
5173b1L6P2j27p8J12J02j01o9n4K92j74M9l5KL8L1m8M3L0j32n0J55j54P6p8o0
5199a43J9J21J0K09j66q0J45j63J12j36J59l3o0J88j94oO1j00J24j64N0J43n5
5222D1J30j17k47K54j51J59ok4k05K93r5j3R4j30J19j0k79J60j4p8J86q8J54j11
5246B2j93K69m6PM1k3p9o5N3lM8j15mJ91l2N7n7m9j17K13j62J2j6Q3k00J02J14
$$ plain form
5273 51 -59 161 77 86 133 -36 -36 5 7 -40 -4 79 -107 -56 -1 -2 86 62 -147 1 54 -128 -39 -132 59 -30 -18 -183
5301 -183 68 -148 -57 -124 50 110 -124 -40 50 -89 -13 38 77 291 -128 -67 40 142 -109 -74 9 103 -105 24
5325 24 3 128 -153 -146 185 -104 -170 30 75 -6 -14 41 34 -4 86 -169 -81 -36 -90 -93 -100 117 -168 200 -43 -103 15
5352 15 -47 -77 -7 38 100 -7 67 -76 69 -27 -35 58 165 106 122 15 -70 154 -128 -8 -12 -73 -16 -43 28 -109 89
5379 89 78 -68 -82 -51 -52 -15 -6 122 144 16 -29 -98 20 -41 -62 -71 67 65 -39 209 -32 -21 -96 13 -84 31 -31
5406 -31 -141 -58 73 -67 98 -125 20 -141 197 110 -213 147 -8 120 5 -65 1 159 -72 5 156 17
5428 17 -78 -24 -73 87 -42 -52 -195 82 27 -21 23 -32 -58 78 44 113 -181 -78 -59 113 -30 86 18 -16 71
5453 71 2 122 -132 106 35 152 -45 -31 -2 26 243 -26 18 10 -127 53 -26 -95 -69 10 116 -86 -1 -68 -94
$$ packed form
5273E1j10K20q4RM7j69%M1Km7L6Q3j86N1N5jQ8k4k09J48N3j82Q9r3J91q9J2j65
5301a83K51k16R1o7J74O0k34Q4R0j39P6N1L9K14m19O1J07J02k51L5Q3R4k08J29
5325B4k1J25k81PL31k89o6K00M5q1qN5pl8R0k55Q8M5n4lpK17k85L68k43o0J18
5352A5o2l0P0M5O2j07P4j43J45r6qR3J07n9J6j07q5K24k82J20mo1N7k7P1j37J98
5379H9j1j46j4L1jL7RJ28K2j28m5o9J18o1k1rJ38kj04K48k41J1p5J09r7J15o2
5406c1j10Q3J31j40J65k23J45j61L38q7l23L60j55J28j15p0O6J58k31P7J51j39
5428A7r5N4m9J60j29j0j43K77n5m8M4n5k6J36l4O9k94J03J9J72j43J16o8l4Q7
5453G1o9J20k54K38p1J17j97J4K9K8K17k69M4qj37J80p9o9K6P9J06k02Q5o7k6
$$ plain form
5478 -94 -94 -10 -68 -30 -49 67 69 15 109 -21 20 47 -176 80 23 2 119 120 -68 126 17 -30 -71 148 15 162
5504 162 112 25 -7 -15 86 108 68 67 -101 -114 131 36 112 -2 -129 122 72 -15 9 -64 -143 169 -13 -116 -17 -54
5530 -54 56 -64 1 55 149 -146 95 124 59 26 63 46 116 -93 -141 22 -38 20 96 -58 79 46 150 -3 82
5555 82 81 38 172 79 -299 -13 -17 136 106 -153 -99 -87 -13 -65 28 -41 54 50 149 130 6 -42 -83 -63 13 -49 -3 83 -53
5584 -53 1 88 37 154 109 62 -213 66 -59 13 164 -217 -69 44 81 -77 -134 37 110 6 -113 157 -19
5607 -19 132 131 140 174 -91 -100 -34 220 -96 -6 -70 8 -113 133 -17 -10 83 -13 -29 73 71 -189 106 189 -24 12 196
5634 196 -74 1 -76 -52 -43 -69 -80 -62 -42 -67 -3 -10 190 174 47 -59 -164 71 24 -20 62 -29 86 -19 47 119 -118
5661 -118 77 -54 79 157 126 -11 91 -73 19 -15 137 51 59 68 61 -82 -53 -6 -59 -38 -65 -34 -3 148 -110 167
$$ packed form
5478i4%Q4n8L8j9J16Kn4R4j30M1K7k23K56n7k1J17Jj88J94j09m7m1K19j33J47
5504A62n0q7l2qJ01K2m0jj68j3K45r5P6j14j27K51n0q7K4p3p9L12j82j03R9l7
5530e4J10j20O5N4R4k95K41K9o5l3L7j7P0k09m8J63o0N8P6j54J37l3J04j53Q5
5555H2jm3J34r3l78K86mJ53l0k59N4J2P4n2R3o9R5mR9j9j24m8m1K0P6o2M6Q6j36
5584e3N4Q7n1J17m5m7k75K79j25P2J51l81J48J13L7j58n7J71P3j04j19K70j76
5607a9J51jRL4k65rO6K54l16R0o4P8j21K46j50PR3r6j6J02kk60K95Q3k13L6J84
5634A96k70P5p7K4Rk6j1J8K0k5O4pK00j6j27j06j05K35m7m4Q2r1J15j05O6P2k37
5661a18J95j31J33P8l1j37J02j64R2l4J52q6QRpj43K9M7n3K1k7L1L1J51k58K77
$$ plain form
5687 167 -20 90 64 -93 -23 28 46 -15 19 46 -5 -154 17 127 -54 -57 -101 -33 195 72 -47 -19 -57 -73 -119
5712 -119 96 -63 -44 65 -5 -130 11 63 -28 -89 -157 -88 -80 86 -62 -210 -19 -56 -99 -29 -81 9 189 -25 4
5737 4 40 -155 12 -139 6 -63 -53 119 -28 -124 -41 38 55 -109 75 126 -16 -127 71 53 -71 -84 59 -17
5761 -17 -97 -44 32 55 -8 9 -22 -111 9 -38 102 16 8 -53 22 -70 3 -17 -108 172 -110 131 39 41 -29 23 -22 -26 170
5790 170 98 -21 39 5 -142 105 -62 207 -123 19 163 157 122 203 22 -78 -49 51 -47 91 180 -246 -33
5813 -33 30 35 -155 74 -94 137 -70 53 -10 142 -144 -88 9 -11 -12 -26 -14 111 95 -105 137 71 -9 -2 34 -86
5839 -86 -91 23 85 19 -130 -136 -34 -98 88 7 110 -38 -123 25 28 -7 -62 56 17 195 -22 -77 -84 -37 15 95 -73
5866 -73 -35 189 -4 9 0 97 142 18 74 76 57 -55 9 24 -128 -52 -149 -163 7 -104 -51 -15 -58 -72 -17 -105 -85 -56
$$ packed form
5687A67j87J10k6j57P0N1J8o1L4K7n1j49J71J10j81lm4O8K28j23j19K8l8j6m6
5712a19K15j59J9J09p0j25J41N2r1o1o8O9QJ66j48j48J91l7m3P0n2R0J80k14K9
5737DL6j95J67j51J45o9J0J72j47r6Q3P9J7j64J84N1j42j11J98j8j24j3J43p6
5761a7q0N3P6K3o3J7l1q9J20m7J40q6qo1P5r2P3k0r1K80k82K41r2Kp0N2m5mJ96
5790A70p2j19O0l4j47K47j67K69l30J42J44ol5Q1j81j00K9J00r8J38Q9m26K13
5813c3O3Nj90K29j68K31k07J23o3J52k86N6R7k0jj4J2J25j6k00K42o6q0PL6j20
5839h6nJ14O2o6j49oJ02o4J86q1J03j48q5J48Ll5n5J18l9J78k17n5pM7N2Q0j68
5866g3L8K24j93J3rR7M5j24N6Kj9j12O4J5j52P6r7j4J70j11N3L6m3j4N5q8K0K9
$$ plain form
5894 -56 -4 -32 5 -14 9 -127 -60 -109 83 -48 23 -77 -58 -46 100 1 27 70 171 171 80 48 -73 -19 -44 -35 191
5921 191 150 75 49 115 36 -134 -42 46 -151 -17 67 83 61 -43 -95 -36 -20 -34 17 77 180 25 0 108 61 -8
5947 -8 -147 -46 -91 -23 -37 93 29 -40 -55 -56 42 -94 -49 -41 -8 -91 -11 -70 -190 -7 -213 0 -122 -139 -30 -172
5973 -172 114 -38 -14 -16 89 20 30 114 -144 -25 84 -24 -56 -55 4 114 115 44 -151 57 -130 -51 -22 57 8 -54
5999 -54 -126 -55 87 -44 38 139 17 11 156 95 57 121 103 -140 153 -13 69 -113 142 -126 -70 117 78 54 -174
6024 -174 -27 22 9 80 156 5 -37 -51 59 79 104 5 -138 30 -15 53 64 49 44 13 -40 41 117 36 -9 -61 77
6051 77 -150 -11 24 -82 -86 -167 67 62 69 -65 -1 -53 238 -33 9 17 13 -110 184 -154 -45 82 109 151 70 -15 -25
6078 -25 1 -110 -115 65 1 -19 42 109 12 -3 -59 -66 -1 -18 70 158 -63 168 -12 -74 96 118 -45 -22 -56 91 26
$$ packed form
5894e6N2k8L7j9K3j36O7m9J92j31P1j00J9J2J46r9K6M3J01%r1l2j21N4k5RK26
5921A91m1p5k6O6p9j70R2Q8j97J34Q4J6k2j04n2N9J6j4N1O0J03j55k5J08m7o9
5947hj39J01m5O8j4J30o4o9j5jR8j36M5QL3q3Q0n9j20J83k06K13j22j7J09j42
5973a72K86j52K4kJ05o9J0Q4k58J19J09j08l2JN9J10Jp1j95K08j87P9K9P9m9o2
5999e4p2P1J42j31Q2J01j22oJ45o1l8O4j8k43K93j66Q2j82K55k68N6J87l9k4k28
6024a74J47M9j3P1P6j51m2j4J10K0K5r9j43J68m5O8J1j5nl1n3Q1P6q1m5n2J38
6051G7k27J39L5j06mq1K34nPj34O4n2K91k71M2Qmj23K94l38J09J27K7M2q1q5j0
6078b5K6j11nJ80o4k0O1O7r7j5n6pO5j7Q8Q8k21K31j80o2J70K2j63K3l4J47o5
$$ plain form
6105 26 12 30 70 17 65 93 40 19 -86 32 75 52 -83 -31 -96 -67 72 -67 -4 -80 -12 -43 -78 -23 -6 121 74
6132 74 106 -141 62 -63 5 -106 -105 -8 -106 -78 10 48 19 70 59 -86 -26 -78 111 -41 61 -57 -88 101 -111
6157 -111 -15 -58 67 48 103 60 108 -54 -13 -93 23 2 -20 -34 53 119 -71 -51 -13 107 27 142 -13 -73 -48 -5
6183 -5 -47 127 -83 -17 -93 -183 -2 236 89 -10 -35 5 61 22 162 -29 -41 8 -17 168 108 167 20 6 49 -64
6209 -64 -46 150 218 -77 58 126 -59 41 38 102 44 34 220 39 8 -175 0 58 82 -106 97 53 -55 38 66
6234 66 72 87 47 -28 -196 27 53 -49 -81 -200 -57 88 -35 -123 91 77 -42 97 99 90 16 4 15 78 -58 -86
6260 -86 51 74 -58 81 67 -56 2 138 70 74 -178 55 -90 -24 -22 66 -60 -196 143 -23 74 -13 110 11 -52
6285 -52 5 -91 -93 -84 229 -8 18 85 23 26 -9 76 -105 -32 27 -205 5 -167 -84 118 53 -40 -4 -32 142 -3 -15
$$ packed form
6105B6j4J8M0n3M8K8n3k1j05J18M3k3j35N2o5K9J39j39O3p6O8l1l5N5J7J27m7
6132G4L2k47K03j25O8j11JR7r8K8Q8L8k9N1j1j45O0n2J89j52J02j18l1J89k12
6157a11R6m3J25j9N5m3M8j62M1q0J16k1k2j4Q7O6j90K0L8J20q0J15j55o0K5M3
6183em2J74k10O6p6r0J81K38j47r9k5M0N6l9J40j91j2M9k5J85o0N9j47j4M3j13
6209f4J8J96O8k95J35O8j85J00lO4n8j0J86j81l1j83J75N8K4j88K03m4j08R3K8
6234F6OJ5m0p5j68K23K6j02l2j19J43J45j23q8K14j4j19J39Krp4j2J1O3j36k8
6260h6J37K3j32J39j4j23N8J36o8Mk52K33j45O6KQ8j26j36L39j66R7q7J23r9o3
6285e2N7r6kRL13k37K6O7o2Ll5Q5j81P3N9k32K10j72Q3K02o5r3L6k8J74j45j2
$$ plain form
6312 -15 54 114 128 -70 86 -149 269 170 -129 -50 -114 54 100 3 -26 117 94 90 162 74 -138 -78 116 83 111 132
6338 132 -25 106 36 238 -79 93 142 -100 178 24 15 151 -70 4 -20 -121 58 55 101 -35 1 148 -59
6361 -59 -97 8 69 120 -30 -92 103 21 -48 -63 -85 -67 96 -114 -52 57 28 -5 -24 -12 113 173 -32 -153 74
6386 74 32 -48 139 -8 22 -25 113 6 104 -19 126 84 44 137 70 -38 22 62 82 -140 67 183 49 113 -111
6411 -111 -48 -5 58 -79 -65 -19 25 18 38 45 -119 -129 88 69 -69 26 100 -170 233 152 -64 25 41 -133 136 109
6437 109 -19 62 -32 14 -19 30 -162 -81 -120 -27 126 108 179 193 7 -147 -52 -44 12 85 68 54 239 109 -38 -195
6463 -195 100 97 -176 72 23 -30 87 101 -54 -155 -96 87 -71 238 -58 -144 -66 -117 9 -26 12 5 -123 52
6487 52 -64 3 -54 -87 -49 53 70 10 -165 -125 28 188 -52 108 -42 44 130 105 81 -152 -14 -153 101 -73
$$ packed form
6312a5O9O0J4j98J56k35M18r9k99P9o4J68M6r7k9J43k3mP2q8k12O0J94l3K8K1
6338A32j57J31p0K02l17J72M9k42K78j54rJ36k21P4k4j01J79lM6j36L6J47k07
6361e9l8J05O1N1j50o2J95q2o9j5k2J8J63k10O2J09k9l3j9J2J25O0k05j21K27
6386G4m2q0J87j47L0m7J38j07R8j23J45m2m0R3o7j08O0M0K0k22K07J16j34O4k24
6411a11O3M3O3j37J4M6M4pK0Pj64j0K17j9j38R5P4k70M03q1k16Q9J6j74K69k7
6437A09j28Q1r4M6l3M9j92Q1l9R3J53j8P1J4j86j54R5QN6P3j7j4J85j30j47j57
6463a95K95lk73K48m9n3J17J4j55j01N9J83j58L09k96q6P8n1J26l5L8pj28J75
6487E2j16O7n7l3L8J02J7o0j75M0J53J60k40J60j50Q6Q6k5k4k33J38j39K54j74
$$ plain form
6511 -73 -74 16 61 95 107 -52 -198 -66 179 -6 -116 206 -128 36 68 244 -48 6 -31 91 -15 -80 12 -46
6535 -46 -23 45 91 15 46 -21 -116 11 -74 -129 -44 -45 9 25 39 47 15 -102 -122 64 -83 82 18 -30 98 3 -174 -27
6563 -27 -58 180 -101 86 5 84 -63 -209 28 -73 76 -121 -13 68 -18 85 80 -10 -126 -71 -36 -39 57 99 80
6588 80 4 11 41 -18 -20 114 -19 8 -3 66 -48 -38 189 -140 -109 40 34 81 57 9 26 42 15 69 92 -52 -43 174
6616 174 77 -128 74 109 135 12 -49 -112 -157 111 -14 -48 -4 -57 62 29 185 15 115 24 -145 55 151 66
6640 66 0 -2 -221 -24 -78 -143 59 29 10 -47 -24 -62 -90 -60 50 49 -13 62 33 -26 -37 114 -9 16 -41 6 14 -66 -100
6669 -100 82 86 32 -89 47 63 208 -62 30 40 159 -66 9 32 41 239 -159 39 32 136 128 94 -119 -191 68
6694 68 -44 -35 -62 -63 110 26 2 -113 80 -118 1 120 7 209 -3 118 52 77 163 -84 -167 94 14 -154
$$ packed form
6511g3jR0M5L4J2j59j46J32K45j85j10L22l34J64L2J76k92N4l7J22j06o5R2n8
6535d6K3O8M6p6L1o7r5J27q5n5Q5jN4J6J4Ql2j17k0J86j47J65o4m8J28r5j77J47
6563b7l1K38k81J87q1P9j47j46K37j01J49j97J08Q1q6J03nr0j16N5L5lR6M2j9
6588H0p6PL0n9kJ34j33K7j1O9j14J0K27l29L1J49oM7k4m8J7J6k7N4K3j44RK17
6616A74r7k05K02L5K6j23o1o3m5K68j25l4M4n3J19l3J56j70J00r1j69K00R6q5
6640F6o6kk19J97n4o5K02l0j9n7K3l8k8L0J10jo2P5k9n9j1J51j23K5n7M7Qq0l4
6669a00J82Mn4j21J36J6J45k70R2J0J19k25P5K3RJ98l98J98pJ04ql4k13p2K59
6694F8j12Rk7jJ73q4k4j15J93j98J19J19j13K02k12J21o6K5Q6k47q3K61q0j68
$$ plain form
6718 -154 -22 15 -1 161 46 86 0 -73 -20 120 -81 -8 -12 1 71 -248 21 17 78 -82 -53 -40 92 -78 -134 82
6744 82 95 89 -86 10 -83 73 -84 24 94 6 38 -41 -194 1 35 -60 -156 132 -78 142 47 17 1 127 -58
6769 -58 -24 70 -38 -1 -4 139 -54 -20 -82 -106 37 -65 -49 132 4 151 68 -51 89 43 40 -68 -48 -140 -108 206
6795 206 24 110 14 55 85 79 -77 -26 43 -59 39 114 2 132 33 -25 51 -121 -91 130 45 -15 71 36 -18 8 12
6822 12 -8 102 66 3 67 -12 -37 20 53 11 76 182 -15 19 30 -94 69 15 6 -29 3 44 132 -110 -71 -95 -6 45
6850 45 117 56 -111 -76 -37 -6 -6 18 208 -80 25 -3 42 106 -184 98 276 200 76 -22 -1 166 -132 83 71
6875 71 5 73 -113 46 -73 -145 -102 56 52 24 86 143 -18 40 -98 77 -9 111 36 86 27 -24 -13 119 109 -116
6901 -116 25 55 79 83 -127 97 61 23 10 -70 10 29 -1 74 49 -27 59 -32 -186 -25 22 -166 -74 16 -23 -178 37
$$ packed form
6718a54J32L7j6J62j15M0q6p3N3J40k01P3mJ3P0l19K69mO1j60K9J3J32j70n6K16
6744H2J3oj75R6r3J56j57J08P0q8L2p9j53J95L4r5r6K88k10K20r5l0j6J26j85
6769e8L4R4j08L7lJ43j93L4o2k4J43j02J6J81j28J47q3j19J40m6lj08K0r2L2L14
6795B06j82Q6r6M1L0oj56N1O9j02R8P5j12J30r9n8P6j72L0K21q5o0Q6l5n4K6M
6822A2k0J10l6o3O4p9k5N7L3m2O5J06j97L4J1j24J63n4rl5L2M1Q8k42L9k4Q9N1
6850D5P2o1j67L5L9L1%K4J90k88J05k8M5O4k90K82J78p6j24r8K1J67k98K15j2
6875G1o6O8j86J59j19p2M3J58mk8O2N7j61N8j38J75q6J20p5N0n9n1J1J32j0k25
6901a16J41L0K4Mk10K24l6l8j3q0Q0J9l0P5k5p6Q6r1j54J61M7j88R2R0l9j55K15
$$ plain form
6928 37 44 -128 -79 10 61 -83 -143 -84 -26 0 13 -68 10 13 -66 -108 -153 59 58 31 112 -1 -52 14 -147 -76 -71 -63 -10 -135
6958 -135 37 113 -70 20 -105 0 -182 17 -16 -11 -48 86 -104 57 48 -66 60 -64 7 -80 -65 92 -89 85
6982 85 -120 10 131 -33 89 27 -17 118 85 79 -13 -32 23 -8 -148 -33 51 -45 68 -23 227 -126 96 -33
7006 -33 -19 -164 75 -126 -113 69 -149 15 29 92 -96 34 -136 -65 28 53 -45 -96 -10 45 63 38 -20 67 27 -133
7032 -133 45 57 -11 1 -114 -10 -20 -22 -31 -138 69 87 150 55 -22 150 -79 47 -86 -26 60 18 127 -162 49
7057 49 10 102 -15 -116 16 -65 54 -10 35 -50 88 -53 -47 -47 89 -73 -33 -158 9 -14 -51 59 157 -117 105
7082 105 -148 -67 -38 76 -66 -39 47 -21 142 4 -29 -29 -107 -62 165 -205 -89 -8 -38 59 -38 -108 117 39 -35 56
7108 56 -9 142 91 108 11 119 54 105 113 1 -55 -18 21 -60 -18 -198 180 157 -7 2 71 54 -112 -14 9 31 -4 -209
$$ packed form
6928C7Pj72M9Q9N1j44o0N9N8K6J3q1P8Lp9m2m5K12jk7Q1j13n1O6j61P1NQN3j25
6958a35J72P6j83R0j25J05j82J99l3Nl7J34j90J61rj14J26j24P1q7J5J57j81J74
6982H5k05J30J21j64J22o2m4J35l3or2j9N5l1j40J15Q4r6J13r1K50l53K22j29
7006c3J4j45K39k01J3J82k18J64J4O3j88J30j70P1R3K5r8n1Q6N5J8k5n8Q7m0j60
7032a33J78J2o8J2j15J04j0krj07K07J8O3r5p7J72k29J26j33O0Q6m2J09k89K11
7057D9l9R2j17j01J32q1J19o4M5q5J38j41O%J36j62M0j25J67k3l7J10R8k74K22
7082A05k53Q1K9J14j42K7Q6o8J63j38l3%p8M5K27l70J16Q1l0R7r7p0K25p8p4R1
7108E6o5J51n1J7r7J08o5N1Qj12n6L7L9q1M2j80L78k3j64RO9j7j66R8K3K2l5k05
$$ plain form
7136 -209 -106 43 80 21 28 -16 20 92 22 71 -63 33 -7 -16 12 -50 -22 11 -26 98 65 -144 -66 -79 11 -148 115
7163 115 0 -61 79 67 -118 -173 -13 197 75 -132 -153 -21 189 -268 -20 -99 32 -24 53 96 -86 -30 48
7186 48 139 36 108 -2 -46 -80 9 -95 119 46 -10 5 90 -60 39 136 75 -55 26 -18 -32 -35 110 -9 -68 2 41
7213 41 -46 108 36 -14 46 107 -66 -48 -18 23 -79 25 -94 -56 84 -35 -43 23 23 16 71 86 26 -6 -32 -65 156 11
7241 11 -111 -9 26 -4 50 10 215 -60 31 101 -42 -58 43 -63 91 -62 157 -106 74 -62 -120 131 -147
7264 -147 52 -28 157 -80 -80 178 5 -220 -41 -59 64 -8 -59 -15 -33 -41 25 35 -56 -9 164 4 -72 -25 -27 17
7290 17 78 39 48 43 -78 60 -111 44 -70 -26 35 2 75 -55 -142 49 191 27 -47 31 67 -58 -10 45 74 -54
7316 -54 51 -31 -146 43 5 3 -26 9 -94 -17 -41 -2 7 39 26 34 -53 60 40 -73 216 89 -144 48 -67 146
$$ packed form
7136b09J03J49L7n9Pm4L6P2p0M9j34R6m0rK8o2K8L3l7J24l3k09P8j3R0j59K63
7163A15j15o1J40j2j85n5J60K10j22k07k1J32K10m57K48p9J31n6P7M3j82N6P8
7186D8R1j03P2j10m4l4Q9j04K14p3n6J5Q5j50R9R7o1j30Q1m4j4lJ45j19n9P0L9
7213D1q7J54p2n0O0O1j73J8L0M1j02J04j19L8J40j19qO6%pN5J5o0l2k6l3K21j45
7241A1j22J02L5l0N4m0K05k75R1P0j43j6J01j06J54j53K19k63J80j36n8K51k78
7264a47J99q0J85k37%K58j73k25J79j8J23p2n1M4j8qO6J0r1M7J73j60p6M7kM4
7290A7O1l9Rnj21J38j71J55j14M4O1l3P3j30q7J91J42j64p4P8L6j25M8N5K9j28
7316e4J05q2j15J89l8kk9L5j03P7k4L9RL2j3Qq7J13k0j13K89j27k33J92j15K13
$$ plain form
7342 146 110 -73 58 98 45 -36 10 -123 64 57 75 -36 5 -80 91 82 -132 -15 -63 122 8 91 101 -21 216
7367 216 -67 49 96 -74 108 -49 -24 -92 -116 55 16 -169 53 -46 -139 -139 -2 -22 1 -209 44 3 -127 -57
7391 -57 -129 -118 27 -101 58 17 -114 -88 -39 186 170 43 -160 25 130 177 48 -28 107 -67 121 -176 -72
7414 -72 -50 113 -138 -159 132 176 167 72 -78 -56 3 -14 -24 92 -86 81 21 66 -3 -56 -112 -73 38 171 171 -13
7440 -13 -1 120 -83 73 -29 44 84 73 159 -81 59 185 54 27 16 164 -1 117 13 36 -107 116 -134
7463 -134 115 -70 -38 -84 -42 57 -38 97 -203 -51 43 9 -6 -38 -126 0 -79 -97 195 11 0 128 76 42 130
7488 130 -24 32 -130 -166 -52 -68 -83 34 -22 41 30 1 86 10 216 55 -3 8 -84 35 -17 16 13 24 67 5 4
7515 4 130 18 -9 74 -23 -98 41 -17 6 -25 61 101 13 84 41 -180 -190 62 145 -111 -46 -19 -47 -207 54 89 -25
$$ packed form
7342A46l6j83J31M0n3q1M6j33J87pJ8j11M1q5J71rk14J17m8J85j14Q3J0j22K37
7367B16k83J16M7j70J82j57K5o8k4J71l9j85K22r9r3%J37k0K3k10K53m1j30P0
7391e7p2J1J45j28J59m1j31K6M9K25j6j27k03J85J05M7j29p6J35j74J88k97J04
7414g2K2J63k51k1K91M4rr5j50K2N9j7j0J16j78J67o0M5o9n3n6L9J11J33%j84
7440a3J2J21k03J56j02P3M0j1Q6k40J40J26j31k7j1J48j65J18j04K3j43K23k50
7463a34K49j85L2m6M2R9r5J35l00J52R4l4j5l2q8J26p9j8K92j84j1J28n2l4Q8
7488A30j54N6j62l6J14j6j5J17n6O3j1k9Q5p6K06j61n8J1r2J19n2L3lJ1M3o2j
7515DJ26j12k7Q3r7p5J39n8K3l1Q6M0q8P1m3k21j0K52Q3k56O5K7k8j60K61L5j14
$$ plain form
7542 -25 -34 -78 46 139 -173 75 61 6 -158 -68 -105 6 68 -146 -18 33 46 -61 -80 -4 222 210 106 25 -82
7567 -82 -98 -31 -92 57 88 -116 80 -25 119 -78 124 80 67 -10 -82 7 30 -102 -17 -141 -149 -93 142 -158 26
7592 26 -16 -20 -41 -6 34 124 58 38 65 -48 -15 91 37 -46 60 50 22 -302 16 23 -33 -53 41 -4 190 4 17 -36
7620 -36 91 -31 69 -22 -90 -81 -255 29 62 124 9 -135 43 -7 -168 -19 174 -94 54 91 21 -38 122 84
7644 84 29 -56 -74 -77 8 100 -69 -134 2 -82 55 151 -35 10 -126 -120 -106 -192 -33 9 -95 -30 65 -97 -54 9 -81
7671 -81 44 13 104 84 167 -182 -100 64 3 52 94 -30 -35 -7 76 -190 13 -84 -102 -8 18 -43 126 84 68 -73 76
7698 76 0 -48 37 -201 -159 58 59 -215 89 -17 14 113 -48 72 69 103 -2 84 120 43 136 -177 -191 60 117 256
7724 256 -274 95 40 26 -101 93 68 86 285 21 44 183 186 -169 94 8 -85 76 100 134 32 -113 21 34
$$ packed form
7542b5rm4J24R3l12K48j4n5j64R0l7J11O2k14J28N1J3j07j9P6K26j2j04q1j07
7567h2j6O7o1J49L1k04J96j05J44j97K02m4j3p7p2Q9K3j32Q5j24qN6K35l00J84
7592B6m2mk1L5M0R0o6k0K7j13L3J06n4q3J06j0k8l24L18Pn6k0R4m5J94j86J3n3
7620c6J27j22J00r1o8Rj74K84L3O2j15j44J78n0j61J49J93k68J48L7p0n9J60l8
7644H4n5q5j8lQ5R2j69o5J36q4J37R6j86M5j36OJ4q6J59M2j04O5R5j62M3O3r0
7671h1J25l1R1k0Q3l49Q2J64o1M9M2j24nK8Q3k66K03r7j8R4K6o1J69m2j6j41J49
7698G6p6m8Q5k38M2K17Jk74L04j06L1R9j61J20lL4j05Q6L6p7R3l13j4K51N7J39
7724B56n30L69n5j4j27J94k5J8J99k64K3J39Ll55K63q6r3J61K4L4j02j45J34J3
$$ plain form
7748 34 5 49 -100 -139 30 36 -72 52 -72 57 71 14 -103 39 40 148 -36 -102 75 -128 -138 215 -35 119
7772 119 -5 61 4 -46 -28 -146 16 175 9 -14 -8 -67 -99 37 8 58 12 -66 -55 6 26 -131 71 -119 -53 36
7798 36 -177 3 -126 -36 -23 -189 88 -18 -48 -245 -157 5 48 -7 150 11 -33 4 -10 -133 -120 -139 -37 -16
7822 -16 -47 -17 -22 -4 -87 99 -34 117 92 51 90 -37 -117 136 92 -52 -201 -48 112 -18 109 -188 -105 -147 -105
7847 -105 255 -49 -65 11 29 -17 83 -91 3 51 -291 -93 -159 -52 35 -71 -151 33 4 -121 -144 47 -89 -42
7871 -42 -22 -95 17 96 56 51 86 136 147 17 -15 -35 -63 -162 -61 43 -25 -77 -24 68 -100 26 -87 5 63 175 146
7898 146 43 -15 101 -87 149 38 29 35 114 84 65 167 -155 39 -65 79 101 106 -122 -2 -79 0 -64 -200 25
7923 25 -45 18 83 153 22 -129 -111 49 37 26 -28 156 86 -105 -24 53 181 -32 -173 31 132 127 34 66 -119
$$ packed form
7748C4k9M4j49l9J69Oj08J24j24J29J4n7j17J42JJ08j84o6J77k03j0L53k50J54
7772A19j24O6n7n0J8j18J62J59j66k3On9l2J36k9N0m6p8J1O1K0j57K02j90O6Q9
7798C6k13J80j29R0J3j66K77j06l0j97Q8J62M3n5J57j39m4L7j4j23J3j9J02K1
7822a6l1L0nJ8q3J86j33J51k5m1L9j27q0K53m4j44j49J53J60j30J27k97Q3m2M2
7847a05L60l04j6P6J8m6J00j74R4M8l42J98o6J07Q7j06q0J84k9j25k3J91j36M7
7871d2K0p3J12P9m0nL5N0J1j30l2k0k8r9J01J04o8n2N3R2j68J26j13R2N8J12k9
7898A46j03n8J16j88K36j11rOP9l0j9J02l22J94j04J44K2Nk28J20p7P9o4j36K25
7923B5p0O3O5P0j31j51J8J60j2j1n4J84p0j91Q1P7J28k13j41K04J01nr3L2j85
$$ plain form
7948 -119 -69 -11 35 104 -116 162 -139 171 -56 -176 32 35 12 -37 -76 19 166 -45 -6 -118 -84 -122 103 4 -18
7973 -18 -58 8 50 -22 -51 -54 -179 110 32 50 140 -121 -31 -139 -51 92 56 61 -29 -3 22 -44 -36 43 -131 -48 70 -2
8001 -2 -165 23 -134 88 -73 -24 6 -120 43 -14 -60 -32 -112 -21 -157 65 75 -77 -168 97 1 30 -25 -137 76
8026 76 101 -109 -25 -49 -115 181 -19 25 -175 -2 15 50 31 64 9 -29 24 -25 -26 110 -9 -32 40 106 -85 -171 -50
8053 -50 7 0 83 93 -2 64 120 42 -18 84 -104 -40 24 -5 -80 44 105 229 -69 -201 7 153 76 48 69 -52
8079 -52 -87 17 -180 -16 47 7 -84 -119 -132 -101 65 134 242 -30 26 74 -30 -38 20 80 121 145 74 41 -134 104
8105 104 78 -64 9 112 -48 -185 -24 -36 57 -8 3 -99 -12 21 -34 59 63 14 66 110 -137 15 -19 -43 -64 6
8131 6 -79 -175 62 2 -128 149 -46 -17 -18 218 5 -20 -8 233 -127 -66 11 -107 -46 -53 1 -25 99 97 58 36 27 -65
$$ packed form
7948a19N0N8M6O9k20K78l01L10k27j20K08Lk3m9l9R5J47k11L9j12L4l8K25r9k2
7973a8m0O6M2p2k9lj25K89p8J8R0k61R0j08Q8J43l6Nr0K6K5o6QP9j74Q3J18p2
8001bj63J88j57K22j61M9L0j26J63n7m6K8q0R1j36K22J0j52r1K65r6K9n5j12K13
8026G6K5k10Q4k4o6K96k00M4k00J73J7L5j9L3n5l8N3m9jJ36j19k3P2O6j91q6J21
8053e0N7pQ3J0r5O6N6p8o0J02j88O4O4k9p5J24O1J24k98j32K08J46p7k8K1j21
8079e2l5J04j97J64O3m0r1l5j3L1J66O9J08k72N6M8j04qN8O0M1K4p1l3j75K38
8105A04k6j42P3J03j60j37J61j2R3o5J1j02Q7L3n5R3Mm9N2M4k47J52l4k4k1P0
8131Fq5r6K37o0j30K77j95K9jK36k13k5J2K41l60O1P7j18O1pN4k6J24kl9k2rr2
$$ plain form
8159 -65 7 21 81 -23 12 -14 -143 85 18 61 102 -48 53 31 145 -6 -65 -15 33 -7 31 -93 20 57 -73
8184 -73 -70 -102 173 -80 -132 173 82
$$ packed form
8159f5P2J4O0j04L5k6j29K28o7M3M1j50J01k2J14j51n9N0M8m0L8j24J13L7j30
8184g3Ll2K75k53n2L05r1
8191H2
$$ Imaginary data points
##PAGE= N=2
##DATA TABLE= (X++(I..I)), XYDATA
$$ plain form
0 0 0 0 0 0 0 0 0 0 0 0 0 0 0 -8 8 -8 8 -16 16 -16 24 -24 32 -40 41 -48 56 -67 80 -88 104 -117 132 -152 169
35 169 -192 215 -241 267 -299 331 -370 410 -452 500 -555 611 -675 742 -820 901 -994 1095
53 1095 -1208 1336 -1480 1642 -1831 2051 -2309 2617 -3000 3484 -4115 4983 -6253 8293 -12123
68 -12123 21777 -101721 -119045 98249 26640 -68713 12997 122609 18782 -63873 145
79 145 27691 -82906 -86851 37258 64303 -21980 9496 97220 38633 -73581 -30304 35806
91 35806 -25780 -57932 51286 89160 -16564 -43618 55152 51921 -54333 -47166 46655 20710
103 20710 -60204 -8592 83117 33638 -50695 -16210 26996 -31159 -54644 23284 43152 -28772
115 -28772 -24964 48117 22078 -57818 -25425 42949 -4056 -63129 -3242 53720 -925 -37204
$$ packed form
0@%%%%%%%%%%%%%qJ6j6J6k4L2l2M0m8N6p2Q1q9J04j23J47j68J92k21K49k84L21
35A69l61M07m56N08n66O30p01P80q62R52j055J166j286J417j562J721j895K089
53A095k303K544k816L122l473L882m360M926n617O484p599R098j1236J4546k0416
68a2123L3900j23498j7324K17294p1609r5353Q1710J09612j03827q2655O4018
79A45K7546j10597l945J24109K7045q6283L1476Q7724n8587j12214M3277O6110
91C5806o1586l2152J09218L7874j05724k7054R8770l231j06254P167R3821k5945
103B0710q0914N1612R1709m9479q4333L4485M3206n8155k3485P7928J9868p1924
115b8772L808P3081k6039p9896L2393O8374m7005n9073N9887N6962n4645l6279
$$ plain form
127 -37204 21865 38104 -35918 -50286 24121 37310 -21498 -14006 40270 13666 -41598 -6560
139 -6560 39940 -4551 -38607 17451 44012 -13596 -27111 30098 26522 -38036 -30899 28049 16173
152 16173 -29065 402 45334 7522 -39465 -7398 23921 -14533 -32821 15889 28379 -19229
164 -19229 -18978 29451 16779 -34339 -17958 24376 -408 -31637 6763 37366 -2097 -26390
176 -26390 10662 21412 -20955 -25221 20707 23039 -17063 -10251 27280 11324 -25336 -4253 24667
189 24667 -4282 -27634 8784 28388 -7255 -17699 16957 15334 -22722 -16421 19541 9139
201 9139 -20594 -3768 21735 -1162 -24151 1006 19051 -9252 -21205 10774 18324 -14516
213 -14516 -16062 16049 9390 -22583 -10367 19907 5378 -16531 4424 21112 -5084 -19810
$$ packed form
127c7204N9069J6239p4022j4368P4407J3189n8808P492N4276k6604n5264L5038
139f560M6500m4491l4056N6058K6561n7608j3515N7209l576o4558P137N8948j1876
152A6173m5238K9467M4932l7812m6987L2067L1319l8454j8288M8710J2490m7608
164a9229K51M8429j2672n1118J6381M2334k4784l1229L8400L0603l9463k4293
176b6390L7052J0750m2367m266M5928K332m0102O812L7531j5956l6660K1083K8920
189B4667k8949k3352L6418J9604l5643j0444L4656j623l8056O301L5962j0402
201I139k9733J6826K5503k2897k2989K5157J8045k8303j1953L1979P550l2840
213a4516j546L2111o659l1973J2216L0274j4529k1909K0955J6688k6196j4726
$$ plain form
225 -19810 4424 13070 -10055 -10135 16451 15261 -9856 -4634 16470 2734 -20270 -4314 16666
238 16666 -634 -13712 11016 21987 -5534 -15768 6402 6348 -17069 -11468 13708 9007 -9454
251 -9454 515 14897 -1436 -17882 -3753 6553 -8847 -12840 9315 14836 -5595 -7092 10527
264 10527 2720 -18775 -9502 10966 1948 -10555 5757 17895 -172 -10963 3435 6604 -9993
277 -9993 -10028 8825 9856 -3994 276 13678 4300 -11779 -3869 7953 -2871 -10625 5874 13755
291 13755 -1951 -6446 7435 5441 -11604 -8517 6651 2273 -8667 492 11194 693 -9315
304 -9315 -111 4863 -6593 -10071 3745 7351 -5045 -4425 8441 4479 -9293 -4890 6642 -376
318 -376 -8720 2036 9761 -731 -5615 4879 6031 -5757 -5749 5329 4082 -5259 -1000 8578 3038
$$ packed form
225a9810K4234Q646k3125q0K6586j190k5117N222K1104j3736k3004J5956K0980
238A6666j7300j3078K4728J0971k7521j0234K2170n4k3417N601K5176m701j8461
251i454R969J4382j6333j6446J4129J0306j5400l993K2155N521k0431j497J7619
264A0527p807k1495R273K0468r018j2503J6312J2138j8067j0791J4398L169j6597
277i993l5J8853J031j3850M270J3402r378j6079P910J1822j0824p754J6499P881
291A3755j5706m495J3881j994j7045L087J5168m378j0940R159J0702j0501j0008
304i315R204M974j1456l478J3816L606j2396O20J2866l962j3772M403J1532p018
318c76q344J0756P725j0492m884J0494J152j1788QJ1078j247r341M259R578n540
$$ plain form
333 3038 -6158 -205 6771 -1731 -7519 2323 7056 -3154 -5030 5408 4965 -6062 -3888 5294 1172
348 1172 -6677 -914 5599 -1003 -5687 1484 5033 -2763 -5272 2697 4009 -4345 -4121 4409 2420
363 2420 -5091 -1454 6169 715 -5367 1008 5366 -2351 -4791 2856 4170 -2944 -2366 4912 3002
378 3002 -3961 -1606 4010 305 -4923 -247 5067 70 -3716 2154 4376 -2819 -4367 2471 2092
393 2092 -4182 -1932 4354 1509 -3843 63 3648 -1596 -4719 454 2917 -1952 -2422 3073 3334 -2418
409 -2418 -2552 2553 1032 -4343 -1323 3915 776 -2972 1477 3947 -1164 -3448 1628 1934 -2855 -1489
425 -1489 3261 2148 -2006 -373 2828 -114 -3250 -342 2635 -383 -2507 1684 3041 -1696 -2624
440 -2624 1814 1193 -3131 -1553 2867 732 -2329 471 2629 -1129 -3345 179 1581 -1486 -1518 1949
$$ packed form
333C038r196N953O976q502n788R842M733j0210j876J0438m43j1027K174R182m122
348A172p849N763O513o602m684P171L549p796k509P969J312q354K24Q530j989
363B420p511L637P623n454o082O375M358p717k440P647J314p114N78P278j910
378C002o963K355N616l705n228M676N314m997l786N870K222p195j548O838l79
393B092o274K250O286k845n352L906L585n244l123N173K463m869m70N495K61n752
409b418j34N105j521n375L020N238l139l748M449K470n111k284N076L06m789J366
425a489M750j113m154J633L201k942l136K908K977l018k124M191J357m737r28
440b624M438o21m324J578M420k135l061K800K158l758k216L524J402l067l2L467
$$ plain form
456 1949 2130 -1268 -1135 1607 295 -2861 -928 2370 387 -1711 1443 2998 -972 -2225 1130 1046
472 1046 -2467 -1234 2430 1665 -1134 122 2102 -122 -2505 -606 1097 -716 -1460 1459 2448 -292
488 -292 -1195 944 296 -2450 -1322 1436 5 -1573 1115 2676 -515 -1783 283 479 -1954 -1728
504 -1728 931 1401 -462 -16 2022 888 -1736 -1263 632 -430 -1694 623 1967 -23 -355 1476
520 1476 905 -1691 -1450 631 -162 -1248 560 2135 875 -719 375 970 -985 -1904 -92 941
536 941 -559 -304 1555 1288 -771 -686 845 -649 -2109 -326 1099 -87 -514 1063 1065 -737 -799 318
554 318 -115 -1384 -697 1099 758 -128 237 1315 14 -1317 -379 368 -697 -790 1015 1248 -292 13
572 13 958 36 -1425 -422 344 -537 -734 430 1300 145 -578 224 179 -1132 -969 573 540 -521 49
$$ packed form
456A949J81l398J33K742j312l156J933L298j983k098L154J555l970j253L355q4
472A046l513J233L664p65k799J256J980k224k383J899J703j813p44K919R89k740
488b92r03K139o48k746J128K758j431j578K688J561l191j268K066J96k433K26
504a728K659M70j863M46K038j134k624M73J895j062j264K317J344j990l32J831
520A476n71k596K41K081p93j086J808J575j260j594J094N95j955r19J812J033
536I41j500K55J859k67k059Q5J531j494j460J783J425j186m27J577Kj802o2J117
554C18m33j269O87J796l41q86L65J078j301j331R38P47j065r3J805K33j540L05
572A3R45r22j461J003P66q81j97J164Q70j155p23Q02m5j311J63J542l3j061N70
$$ plain form
591 49 1026 267 -875 -164 328 -695 -952 485 671 -287 162 835 329 -904 -623 456 37 -600 -27
610 -27 739 242 -477 215 594 -367 -844 292 496 -370 -80 878 189 -664 41 372 -230 -472 339 651
630 651 -261 -174 309 317 -291 -395 313 255 -514 -326 767 206 -396 127 409 -363 -601 432 311 -375 -191
651 -191 535 255 -351 -208 146 -150 -448 40 461 97 -250 328 434 -395 -441 40 173 -434 -82 645 266
672 266 -293 123 380 -145 -400 -49 181 -95 -69 194 281 48 -240 189 -38 -322 -312 213 191 -219 307 386
694 386 -123 -465 231 167 -442 -427 252 213 -176 153 464 -31 -482 -212 -114 -135 -118 111 337 195 1 254
716 254 79 -447 -217 214 -86 -335 66 372 -47 -201 71 299 -266 -153 -32 -78 59 25 187 9 18 -248
738 -248 163 -111 -345 -37 243 58 -153 321 152 -184 -28 148 4 -181 56 372 108 -42 98 66 -35
$$ packed form
591D9R77p59j142P11M92j023k57J437J86r58M49O73n06j233K81J079m19o37N73
610b7P66m97p19O92L79r61m77J136K04q66K90R58o89q53P05L31o02k42Q11L12
630F51r12Q7M83Qo08j04P08n8p69J88J093n61o02N23K82p72k38J033j21o86J84
651a91P26k80o06J43L54k96k98M88M21l64l47N78J06q29m6M81J33o07L52P27l79
672B66n59M16K57n25k55L51K30k76K6K63Q7k33k88M29k27k84J0N25k2m10N26P9
694C86n09l42O96o4o09J5O79l9l89L29L11m95m51K70R8k1J7K29K26j42j94K53
716B54j75n26K30M31l00k49M01L06m19j54K72K28n65J13J21m6J37l4J62j78Rk66
738b48M11k74k34L08K80j85k11M74j69l36J56J76j44j85K37L16k64j50J40l2j01
$$ plain form
759 -35 -253 -121 214 36 -191 133 175 -86 -36 242 -177 -373 71 90 26 -191 244 146 -123 -116 -59 43 -422
782 -422 -238 -128 82 -83 -5 171 84 -218 -44 202 -78 -117 226 67 -216 15 266 115 -298 7 108
803 108 -115 -163 111 217 158 -93 31 137 -108 -161 26 102 -72 3 355 136 -188 -94 132 -210 -264 -94 147
826 147 -89 72 -68 -74 -153 -71 78 -117 -52 -151 -13 6 -36 181 89 -163 -226 43 121 -217 -134 81 137 47 78
851 78 168 -268 -107 143 -5 66 177 228 -42 3 12 -5 40 -31 116 76 79 -24 99 54 -271 -216 95 84 -335 192
877 192 70 130 -126 37 -63 -67 -104 -61 -72 93 59 -52 54 -47 -178 -58 24 -172 13 83 22 -21 52 88 33
902 33 29 173 48 -30 -76 91 3 71 -80 -35 92 -12 -159 7 15 -65 92 106 -59 32 -108 78 -5 -43 96
927 96 161 -62 153 52 -8 -69 6 115 -29 -53 -11 57 -5 5 -4 53 -70 -86 94 86 14 -46 -21 -60 0 100 -21
$$ packed form
759c5k18J32L35j78k27L24M2k61N0K78m19j96M44J9o4k17M35r8k69PN7J02m65
782d22J84J10K10j65P8J76q7l02J74K46k80l9L43j59k83K31K51j51m13L05J01
803A08k23m8K74J06n9k51J24J06k45n3J87P6j74P5L52k19l24R4K26l42n4J70K41
826A47k36J61j40op9Q2J49j95O5r9J38J9m2K17r2k52o3K69P8l38Q3K15N6r0L1
851G8R0m36J61K50j48P1J11N1k70M5Rj7M5p1J47m0Lj03J23m5l25N5L11j1m19N27
877A92j22O0k56J63j00ml7M3j1J65l4j11J06j01j31J20Q2j96J85P0o1m3P3L6n5
902C3mJ44j25p8m6J67q8O8j51M5J27j04j47J66Qq0J57J4j65R1j40J86q3l8J39
927I6O5k23K15j01o0o1P5J09j44k4M2O8o2J0rN7j23j6J80qp2o0K5l9O0J00j21
$$ plain form
954 -21 -32 -35 62 -63 -22 103 98 41 23 -111 14 84 -56 1 50 14 24 134 -18 -75 -18 -38 -77 0 100 38 15 218
982 218 6 -20 -22 22 -21 58 -17 -24 -18 67 -70 -30 29 -34 -143 -37 14 -119 -16 202 81 -14 -36 -21 -310 -102 -282
1009 -282 -73 22 73 -87 172 -57 -13 -29 -37 13 -113 39 247 155 13 119 99 52 -155 -31 -89 -15 -44 121
1033 121 -80 -9 26 -10 -22 -111 -86 3 122 23 46 111 -163 43 13 -105 69 65 79 47 -9 81 42 64 96 -7 -39
1060 -39 -85 -8 -134 49 191 37 -20 5 126 -72 -102 84 -156 84 196 -224 -44 21 -68 -157 -59 76 1 -103
1084 -103 53 -44 -30 -8 -169 132 0 -115 -72 110 149 3 92 237 2 12 -6 17 -102 168 154 -21 98
1107 98 57 9 -134 -61 -55 -23 94 -37 165 59 30 -2 -72 -96 9 -34 46 -153 -5 75 71 -260 144 56 57 -38 63
1134 63 -76 -75 109 24 26 105 178 -179 -195 11 23 76 56 41 -76 -61 -120 -75 -28 28 125 155 -37 6 2 167 -43 -144
$$ packed form
954b1j1lR7j25M1J25nn7j8j34J25P0j40N7M9l6J0J10j52n7N7k0l9P7J00o2k3K03
982B18k12k6kM4m3P9p5pOQ5j37M0N9o3j09J06N1j33J03K18j21r5k2J5k89K08j80
1009b82K09R5N1j60K59k29M4j6qN0j26J52K08r2j42J06k0m7k07J24n8P4k9J65
1033A21k01P1L5l6j2q9K5Q9J19r9K3O5k74K06l0j18J74mJ4l2n6R0l9K2L2j03l2
1060c9m6P7j26J83J42j54n7K5J21j98l0J86k40K40J12m20J80O5q9q9R8J35p5j04
1084a03J56r7J4K2j61L01j32j15M3J82L9j46Q9J45k35J0j8K3j19K70j4j75J19
1107I8m1m8j43P3OL2J17j31K02j06k9l2p0k4J05m3Q0j99J48Q0ml31M04q8Jr5J01
1134F3j39JJ84q5KP9P3l57j6K06J2N3k0j5j17J5n9M5M7N6R7L0j92M3mJ65k10j01
$$ plain form
1162 -144 183 -22 -24 -63 -8 30 -121 -22 -55 -81 -34 -33 -9 -89 -55 -102 86 -113 -145 -96 -65 36 -43 -29 -1 84 40 -2
1190 -2 58 9 -51 -78 83 195 102 -126 39 184 74 -31 119 -134 -53 16 -74 -134 67 -74 -74 -205 -201 14 -120
1215 -120 -35 -264 -130 -86 20 -5 -5 54 6 19 -172 115 -52 144 -6 -54 53 -18 20 -72 5 -31 -9 51 63 -1
1241 -1 96 21 54 -34 -152 -136 175 -86 59 246 162 -29 193 1 -256 89 92 53 -150 -55 18 74 150 -38 6
1266 6 -15 90 0 -39 159 -15 251 -98 -84 -133 -102 64 111 26 142 -156 68 -30 -76 -157 15 74 24 206 55
1291 55 23 65 0 69 6 201 -55 20 -1 -135 61 85 -47 -31 184 -108 0 118 32 -11 -79 23 47 -71 37
1316 37 3 -197 -56 69 65 192 -53 82 -73 -104 13 -2 -50 -8 60 43 -2 -96 144 -43 22 -221 60 123 -201
1341 -201 126 118 -12 -4 110 -91 141 -155 90 -76 32 -151 19 3 -168 -94 3 -214 -65 111 47 93 36
$$ packed form
1162a44L27k05kl9N5L8j51R9l3k6M7JK4q0L4m7J88j99l2M9L1J01p9J4K8Q5m4m2
1190bO0m9o0k7J61J12r3k28J65J45j10j05J50k53Q1O9r0o0K01j41%j31MK15j34
1215a20Q5k29J34M4J06k5%N9m8J3j91K87j67J96j50m8J07p1L8r2P7l6K2O0J2o4
1241aR7p5L3q8j18J6L11k61J45J87q4j91K22j92k57L45Ll9k03R5P3N6P6j88M4
1266Fk1J05r0l9J98j74K66l49J4m9L1J66M7q5J16k98K24r8m6q1J72N9n0J82j51
1291E5l2M2o5O9o3J95k56P5k1j34J96K4j32J6K15k92J08J18q6m3o8J02K4j18J08
1316C7l4k00J41J25mJ27k45J35j55l1J17j5m8M2O8j7m5r4K40j87O5k43K81O3l24
1341b01L27qj30QJ14k01K32k96K45j66J08j83J70j6j71P4R7k17J49J76o4M6n7
$$ plain form
1364 36 -111 -45 26 -84 24 11 -97 52 76 -36 223 -34 145 -64 -82 36 38 10 26 -39 68 -5 -169 23
1388 23 51 -107 -10 113 83 50 -1 33 -22 -33 -12 -99 62 -36 -107 67 -111 59 30 -62 -68 -96 62 -122 51 46 129
1415 129 191 -141 -37 28 -17 -93 -31 -70 7 10 75 99 -1 -69 70 206 119 -96 -93 287 53 56 -43 3 14 -30 239
1442 239 128 136 -36 -118 -69 136 -108 227 -174 -76 -57 22 80 0 -110 49 -57 12 -100 -31 121 -155 -123 64
1466 64 8 189 -118 -59 78 -54 250 -110 -5 81 -82 21 -78 -88 26 -56 -217 32 61 81 -15 -164 3
1489 3 -31 -118 -27 -56 87 60 155 -63 -200 -4 -7 -91 -28 -95 -97 -9 176 68 13 -57 -87 51 -81 115 -59 176
1515 176 -10 41 -149 -17 168 60 -122 -128 61 -20 50 -54 51 9 -87 -177 -31 -43 139 -97 15 -6 -38 92
1539 92 23 22 68 -1 17 -12 -78 22 -55 -175 -44 78 27 24 -219 93 -2 33 27 61 -63 23 -27 -61 -121 -144 -30 103
$$ packed form
1364C6j47O6P1j10J08j3j08J49K4j12K59k57J79k09j8J18Kk8J6o5J07p3j64J92
1388B3K8j58R7J23l0l3n1L4n5j1K1q7J61r8p1J74j78J70k9r2ok8J58j84J73nQ3
1415A29O2l32J04O5m5p6O2l9P7LO5K4j00o8J39J36q7k15LL80k34Lr9M6J1m4K69
1442B39j11Qj72q2M9K05k44L35m01R8J9P9N8q0j10J59j06O9j12O9J52k76L2J87
1466F4n6J81l07N9J37j32L04l60J05Q6j63J03r9j0J14q2j61K49K9K0r6j49J67
1489Cl4q7R1k9J43k7R5k18j37J96lq4O3o7kQ8J85j08n5p0l0J38j32J96j74K35
1515A76j86N1j90J32J85j08j82oJ89q1P0j04J05m2r6r0J46j2J82k36J12k1l2J30
1539I2o9jM6o9J8k9o6J00p7j20J31J22n1lk43L12r5L5oL4j24Q6n0l4o0k3J14J33
$$ plain form
1567 103 63 90 -88 82 72 -43 101 -101 48 29 -5 39 48 130 -104 -3 -70 5 -57 34 -16 -42 87 153 103 49
1593 49 61 -198 -192 94 -57 139 9 52 -48 123 -9 14 -105 163 94 89 21 30 103 -87 19 -189 -5 -38 -158
1618 -158 90 -125 -86 44 64 108 -86 21 32 -4 -8 -106 -42 56 -78 -165 67 -32 -16 -41 -117 76 148 -45 -64 -28
1644 -28 -90 -19 58 16 24 -95 -68 -95 -56 -72 -17 56 -86 -84 -75 -47 57 81 -91 -79 95 14 -60 144 5 -64 73 99
1672 99 13 70 18 67 -92 110 -34 7 21 -83 -45 139 -4 63 -56 55 -51 -41 114 92 74 69 -30 -68 -64 69
1698 69 -125 77 31 -115 56 -39 113 60 143 -91 -60 -52 46 -188 93 -72 1 120 -2 -46 144 8 19 -6
1722 -6 60 141 -8 13 -125 238 -41 121 2 -29 -38 36 35 -53 -22 -130 105 -83 -1 -29 132 -26 -83 120 -189
1747 -189 128 -97 43 -22 74 86 -76 89 81 18 67 -106 -138 -104 1 4 50 46 118 -75 -24 -102 19 -65 114 -247
$$ packed form
1567A03m0K7j78J70j0j15J44k02J49j9l4M4RQ2k34J01o7P5o2R1n0k6J29O6n0n4
1593D9J2k59OK86j51J96j30M3j00J71j32K3j19K68o9no8RP3j90J06k08J84l3j20
1618a58K48k15L9J30K0M4j94J07J1l6mr8O4R8j34q7K32r9J6k5p6J93P2j93j9L6
1644b8o2P1P7m2Qj19K7k7L9j6N5P3j42KRK8J04K4j72J2J74q1p4K04j39o9J37K6
1672I9q6N7n2M9j59K02j44M1J4j04L8J84j43O7j19J11j06J0J55k2j8nr9l8MJ33
1698F9j94K02m6j46J71r5J52n3Q3k34L1QR8k34K81j65P3J19j22m4J90j36J1k5
1722fO6Q1j49K1j38L63k79J62j19l1rP4jq8L1j08K35j88Q2k8J61j58n7K03l09
1747a89L17k25J40o5R6J2j62J65qo3M9j73l2L4J05LM6mP2j93N1p8J21q4J79l61
$$ plain form
1773 -247 -79 31 31 37 101 42 -141 103 35 -5 -95 48 48 63 131 -154 20 -32 -126 -8 -22 83 97 -6 107 26
1799 26 -2 -141 1 8 81 48 57 -60 -207 98 3 55 -27 53 48 27 -38 58 -5 20 90 -155 9 -23 -11 -39 37 94
1827 94 -69 29 -171 -115 -73 33 -9 72 -3 -39 -104 -134 5 43 91 97 120 21 -56 -68 -31 62 -58 124 -175 121 -46
1854 -46 32 147 -22 -69 -5 -29 -161 24 -82 -59 2 -81 -15 56 -2 103 -102 -87 47 20 -91 -209 -111 78 115
1879 115 23 48 -120 134 12 -82 19 -21 41 45 56 28 -12 -26 -112 -26 3 48 95 -49 -49 204 121 -28 138 -260
1905 -260 -100 34 46 21 -36 -33 36 53 -27 -71 -110 -77 -13 -91 -69 163 -14 -31 -75 61 -127 265 -107 -156 22 80
1931 80 88 3 26 -44 -76 107 116 14 -59 18 0 86 101 -148 105 -61 0 -89 173 -93 145 74 90 -14 93 -146
1957 -146 17 -91 29 203 172 91 50 75 30 -46 23 7 203 37 77 9 -192 -18 186 -57 53 -73 107
$$ packed form
1773b47J68J10%OO4n9j83K44o8m0r0J43%J5O8k85J74n2r4J18j4J05J4j03J13q1
1799B6k8j39J42PP3l3Rj17j47L05r5N2q2Q0nk1o5R6o3K5P0k45J64l2J2k8P6N7
1827I4j63R8k00N6M2J06m2Q1p5l6o5l0J39L8M8OK3r9p7j2L7R3j20J82k99K96j67
1854d6P8J15j69m7O4k4j32J85j06K3O1q3O6P1n8J05k05J5J34k7j11j18R8J89L7
1879A15r2K5j68K54j22r4J01m0O2MJ1k8m0j4q6Q6K9M5M7j44%K53q3j49J66l98
1905b60J60J34J2k5n7LO9J7q0m4l9L3O4p8K2K32j77j7m4J36j88L92l72m9J78N8
1931H0Qq5K3p0l2J83Rj02p3P7j8Q6J5k49K53j66O1q9K62k66K38p1J6j04J07k39
1957a46J63j08J20J74l1q1m1K5m5p6O9j6J96j66M0o8k01J74K04k43J10j26J80
$$ plain form
1980 107 6 96 94 18 182 145 84 -43 62 -18 93 22 7 39 48 17 -30 -122 -157 72 -80 186 -110 -3 90 72
2006 72 -82 81 -71 13 113 -32 -66 -151 -170 215 -20 123 42 9 153 -63 12 -71 58 -28 33 148 -112 -79
2030 -79 104 -107 212 14 90 -53 206 -118 30 59 74 46 25 34 68 61 29 36 54 66 75 68 76 -32 86 131 -30 -109
2058 -109 14 -41 37 2 12 23 -116 40 -103 -46 69 74 0 2 76 -203 40 -90 -14 -31 64 140 69 -53 -113 123
2084 123 -90 11 -140 204 118 -121 -97 65 -80 -104 27 82 -120 -140 -4 -97 3 20 -63 -191 64 -121 163
2107 163 33 -8 151 -213 -220 -173 -95 -63 -52 175 -131 -139 -52 94 18 202 43 -102 42 -60 27 -52 0 42 -66
2132 -66 -67 -124 -58 -65 107 -12 28 153 -104 132 80 179 -26 7 -78 70 73 -37 -139 127 115 46 30 -1 34 -38 50
2159 50 -40 -86 93 35 58 34 63 -29 -219 40 11 58 -70 -66 -99 -55 30 -4 23 -85 -154 -50 -35 37 99 -50 -104
$$ packed form
1980A07j01R0kp6J64l7o1j27J05q0J11p1j5L2Rl1m7r2l5K29j52K66k96J07R3j8
2006G2j54J63j52Q4J00j45l4q5j9L85k35J43q1l3J44k16P5q3J29q6O1J15k60L3
2030g9J83k11L19j98P6j43K59l24J48K9J5k8k1RL4pl2PJ8J2RpQj08J18M5j61p9
2058a09J23n5P8l5J0J1j39J56j43N7J15Np4KP4k79K43j30P6j7R5P6p1j22o0K36
2084A23k13J01j51L44q6k39K4J62j45k4J31N5k02k0J36r3J00J7q3j28K55j85K84
2107A63j30m1J59l64pM7P8L2J1K27l06qQ7J46p6J84j59j45J44j02Q7p9N2M2j08
2132f6jn7O6pJ72j19M0J25k57K36n2R9k05L3q5J48Lj10j02K66j2o9j6l1L5p2Q8
2159E0r0m6J79n8K3k4K9r2j90K59k9M7j28Ml3M4Q5l4K7j08o9J04J5P2O2j49n4
$$ plain form
2186 -104 -58 94 -29 -67 -144 165 -23 17 51 36 -70 -100 105 -64 -94 25 -67 -65 -32 -144 -109 11 -39 127 49
2211 49 -97 -47 -149 24 89 136 114 -95 59 141 15 79 200 16 33 -114 -111 36 32 30 -26 -146 -158 -100 -50 222
2237 222 -19 62 46 -30 174 -97 24 173 41 78 59 -158 14 -70 -97 -37 7 -3 24 -68 2 170 -68 17 -141
2262 -141 83 91 149 -94 53 128 -219 -43 64 -46 93 -62 121 15 -1 -3 44 -132 110 102 -102 31 5 82
2286 82 -94 86 -149 92 4 -30 112 73 51 -4 14 209 193 77 4 -140 179 40 41 170 57 63 -110 122
2310 122 92 80 -45 96 70 54 48 -81 42 -42 30 -44 -47 -115 -100 2 -121 -7 35 64 -125 -47 49 94 -99 20
2336 20 -29 -99 192 -8 -29 4 60 77 15 40 -75 -11 -16 -34 126 -36 -117 100 -134 16 -42 -105 89 -194 -53
2361 -53 -19 -116 37 19 -87 28 66 -97 -130 -3 186 36 24 17 -69 130 7 102 61 -72 -14 -34 73 91 -12
$$ packed form
2186a04M6J52j23l8p7L09j88M0L4j5j06l0K05j69l0J19r2KL3j12L5J20n0J66p8
2211D9j46N0j02J73O5M7k2k09J54Q2j26O4J21j84J7j47LJ47mkn6j20j2N8N0K72
2237B22k41Q1j6p6K04k71J21J49j32L7j9k17J72q4k7O0M4j0K7r2P0J68k38Q5j58
2262a41K24QN8k43J47P5l47J76J07j10J39j55J83j06j6kM7j76K42qk04J33k6P7
2286H2j76J80k35K41q8l4J42l9k2n5J8J95j6j16p3j44L19j39JJ29j13Oj73K32
2310A22l0j2j25J41k6j6oj29J23q4P2p4lo8J5J02j23J14M2K9j89P8R6M5j93J19
2336B0m9p0K91k00k1L3N6J7o2K5j15O4nj8J60j62q1K17k34J50n8o3J94k83J41
2361e3L4r7J53j8j06J15L8j63l3J27J89j50j2pq6J99j23R5m1j33N8k0J07J8j03
$$ plain form
2386 -12 -120 77 44 -15 86 -119 -100 -46 70 -80 -33 -42 4 -27 -58 -96 51 -139 -197 15 -91 24 113 -23 0
2411 0 -207 92 105 34 -18 54 -107 70 -143 -30 64 -74 25 55 -57 -14 -93 168 134 -48 64 -48 90 82 6
2436 6 -107 -165 14 79 -45 182 -9 2 31 13 -20 47 -67 -204 -15 -33 62 -205 -138 133 -23 16 49 -208 67
2461 67 15 118 12 59 46 -34 13 39 86 119 151 24 39 23 -72 97 -22 68 62 91 81 -66 -33 -94 15 62 -1
2488 -1 -12 -16 64 -45 -4 -68 38 -103 -101 -85 -82 -3 -106 20 -32 -14 -56 9 65 10 3 139 161 132 55 -85 32 -74
2516 -74 17 -109 79 -6 29 11 -92 161 -123 55 67 66 -72 125 84 118 49 -265 -50 123 -80 -1 -72 -112 -41
2541 -41 -22 -30 -118 140 -64 22 99 45 27 -221 66 -51 -90 127 -68 108 -77 0 10 42 4 2 110 199 -82 57
2567 57 107 49 51 111 83 187 134 -72 -42 -50 27 -18 -68 -47 -60 -37 61 -51 147 -27 -6 -31 1 66 -11 116 103 155
$$ packed form
2386a2j08J97l3n9J01k05J9N4J16j50M7rM6l1l1l8J47j90n8K12j06J15Q9j36K3
2411@k07K99J3p1n2P2j61J77k13J13R4j38R9L0j12M3p9K61l4j82J12j12J38qp6
2436Fj13n8J79O5j24K27j91J1K9j8l3O7j14j37J89j8R5k67O7K71j56L9L3k57K75
2461F7n2J03j06M7j3q0M7K6M7L3L2j27J5j6r5J69j19R0oK9j0j47L3o1J09M7o3
2488aj1mQ0j09M1o4J06j41KJ6LP9j03J26n2J8m2O5N6n5pJ36K2k9p7j40J17j06
2516g4R1j26J88q5L5j8j03K53k84J78J2jj38J97m1L4o9l14K15J73k03P9p1m0P1
2541d1J9qq8K58k04Q6P7n4j8k48K87j17l9K17j95J76j85P7J0L2l8kJ08Q9k81J39
2567E7N0n8KO0k8J04n3k06L0qP7m5n0K1j3K3R8j12J98j74K1k5L2O5p7J27j3N2
$$ plain form
2595 155 -70 133 -4 38 126 62 -15 -17 33 -122 -74 -108 13 -30 28 220 -127 44 182 -16 -94 12 -97 -94 -35
2620 -35 10 -215 61 63 49 -17 31 53 -63 61 -56 66 61 121 -55 -173 -175 33 108 -132 -41 43 19 -26 88 -18
2646 -18 -13 -190 58 -156 173 -74 68 73 -82 -133 82 144 -34 -79 -127 77 80 -70 107 121 8 295 89 0
2670 0 -36 -99 -23 17 147 195 -15 53 -100 33 108 -51 116 -146 -93 103 66 36 173 44 -40 -57 119 -81 -123
2695 -123 -5 -92 -24 -57 -103 68 -44 -50 -7 30 -42 101 114 177 38 234 103 -35 90 -100 206 121 144 60 98
2720 98 40 8 3 -100 -139 -6 -35 -84 -9 81 75 37 284 26 -14 -119 52 78 -158 -191 -75 -116 -2 66 162 -59
2746 -59 4 22 51 -54 -99 -121 -50 -3 -3 152 20 34 -67 -65 -91 53 25 -109 67 40 -101 33 -131 20 33 -104
2772 -104 -100 -24 -22 -243 58 -39 12 21 -62 56 -43 70 43 -47 -43 -58 11 88 59 34 114 101 -153 -111 -54 167 -51 54
$$ packed form
2595A55k25K03j37M2Q8o4p7kN0j55M8l4J21m3N8J92l47J71J38j98p8J06j09LN9
2620c5M5k25K76Kj4o6M8K2j16J24j17J22nO0j76j18kK08P5k40R1Q4k4m5J14j06
2646a8Nj77K48k14L29k47J42Nj55n1K15O2j78m5m8K04Lj50J77J4j13K87k06q9
2670@l6o3P6M0J30M8k10O8j53J33P5j59J67k62N3J96l7l0J37j29q4j7J76k00m2
2695a23J18q7O8l3m6J71j12oM3L7p2J43J3O3j39J96j31j38J25j90L06q5K3q4L8
2720I8n8l2nj03l9J33k9m9P5R0ol8K47k58m0j05J71K6k36l3J16m1J14O8R6k21
2746e9O3J8K9j05m5k2P1M7%J55j32J4j01Kk6J44k8j34J76k7j41J34j64J51J3j37
2772a04MP6Kk21L01r7N1Rq3J18r9J13k7r0Mj5O9P7k9k5Q0j3k54M2N7K21k18J05
$$ plain form
2800 54 222 -170 195 106 38 -90 62 -46 -62 -43 -74 111 -192 23 -43 -56 2 71 14 -18 -162 85 -67 33
2824 33 12 -40 -131 -46 -21 -20 -201 37 18 -7 220 -50 14 135 125 -9 14 -108 -59 -151 -15 42 -1 46 -158 -176
2850 -176 169 -60 -130 85 -27 -16 -10 77 -151 5 -113 -119 -80 -84 137 131 -51 -11 233 184 -57 39 -163 -13 112
2875 112 -14 1 -28 -96 160 8 -7 -65 20 23 86 82 170 -19 86 -101 -31 181 -69 36 -111 17 29 -1 97
2900 97 128 3 235 44 -35 -242 -22 37 -14 105 -126 -168 -42 -72 -87 74 62 -114 139 62 -89 71 -20 15
2924 15 131 117 25 -31 121 4 -143 30 -76 -41 -51 -22 165 7 -93 -86 35 -38 -198 37 18 -150 -20 37
2948 37 -19 -53 119 -64 -15 -64 -50 37 49 126 -37 -90 19 -2 244 72 -198 24 11 -108 -73 -15 -86 96 168
2973 168 142 242 38 34 -37 -3 142 19 -31 -80 -105 -108 114 127 -76 -84 -14 -4 69 -16 117 89 162 -61 -110 -31 -33 -122
$$ packed form
2800E4J68l92L65q9o8j28J52j08j6J9l1J85l03K15o6j3N8O9n7l2j44K47j52J00
2824C3k1n2r1Q5K5Jj81K38j9k5K27k70O4J21j0j34K3j22M9r2J36N7m3M7k04j8
2850a76L45k29p0K15j12J1OQ7k28J56j18oL9mK21oj82M0K44m9k41R6k02J50J25
2875A12j26J5k9o8K56j52j5n8Q5LO3mQ8j89J05j87P0K12k50J05j47J28J2l0R8
2900I7L1j25K32j91p9k07K20N9n1J19k31m2J26l0j5J61j2j76K53p7j51J60r1L5
2924A5J16j4r2n6J52j17j47J73j06L5j0K9J87j58j00PJ21p3j60K35j9j68J30N7
2948C7n6l4J72j83M9m9J4Q7J2P7j63n3J09k1K46j72k70K22j3j19L5N8p1J82P2
2973A68k6J00k04mp1L4J45j23n0m9k5lK22J3k03qP0J0P3q5J33k8P3k23m9P9kq9
$$ plain form
3001 -122 116 154 -58 93 -43 24 -12 -185 25 109 145 129 51 90 -32 61 -189 162 119 -31 105 103 -80 74
3025 74 4 218 -22 83 -258 117 50 21 133 -66 43 -17 -70 -150 -164 -9 -34 140 -48 37 -28 0 -20 -64 8
3050 8 -48 114 -74 -23 61 74 -102 119 -41 107 -87 -6 77 -93 -97 68 112 -144 -121 -167 0 -69 48 52 39 206
3076 206 -182 -8 82 67 -23 15 -22 143 167 -82 332 157 -98 51 6 45 7 32 -5 79 22 -99 82 96 33
3101 33 104 20 52 -80 73 26 -155 -10 -14 66 -42 100 117 -202 -143 -61 -72 142 99 20 119 -20 -6 127 -2
3126 -2 10 65 -125 -19 -75 135 14 -26 -68 71 -281 -1 -73 -103 -54 -167 4 -64 31 -26 -13 -17 -71 -51 109 185
3152 185 -10 -88 50 -107 141 57 -10 -13 -40 71 90 -49 116 42 -10 -17 69 194 50 53 -13 -1 -136 -4 27 -30
3178 -30 54 -21 35 53 92 57 1 -12 22 62 20 14 46 207 -93 12 27 26 72 209 218 -23 31 -20 8 18 -20 -87 -65
$$ packed form
3001a22K38L8k12J51j36O7l6j73K10Q4L6j6p8L9j22R3k50L51m3j50J36kj83J54
3025G4p0K14k40J05l41L75o7k9J12j99J09o0n3q0j4J55k5J74j88Q5o5K8k0m4P2
3050Hn6J62j88N1Q4J3j76K21j60J48j94Q1Q3j70mJ65M4k56K3m6J67o9J17Mj3J67
3076B06l88J74R0j5r0L8l7J65K4k49M14j75k55J49m5L9l8K5l7Q4n7j21J81J4o3
3101C3P1q4L2j32J53m7j81J45mQ0j08J42J7l19N9Q2j1K14m3p9R9j39J4J33j29
3126bJ2N5j90J06n6K10j21m0m2J39l52K80p2l0M9j13J71o8R5n7J3mn4K0J60P6
3152A85j95p8J38j57K48q4o7lk7J11J9j39J65p4n2pQ6J25j44Lo6J2j35J32L1n7
3178c0Q4p5N6J8L9l5n6j3L4M0m2oL2J61l00J05J5jM6J37Rk41N4n1K8J0l8o7K2
$$ plain form
3207 -65 15 -37 -105 -75 20 43 35 -168 -23 -80 172 -13 89 128 27 -109 53 -17 -51 136 -27 67 18 -17 -142
3232 -142 215 -31 92 -110 49 -2 144 -25 102 -9 -17 67 -202 16 14 92 0 -38 -18 64 103 -9 61 -120
3256 -120 -233 -81 45 16 -238 92 -2 -30 -137 -39 -49 -128 -36 56 -14 70 32 -3 -27 -91 -170 -131 -48 0 116 177
3282 177 -105 143 153 19 52 77 43 -5 -38 -16 29 -124 72 195 -67 -105 86 65 -72 -156 -64 -1 46 78 52
3307 52 5 -94 131 -28 33 6 52 -58 -146 -91 -74 -61 -39 63 -26 21 -98 96 -2 -114 -153 108 12 -15 92 -81
3333 -81 74 149 -9 42 -25 44 53 -113 117 58 89 -33 -108 -123 78 20 26 -12 -11 -67 -59 -81 -99 27 62 -52 -4 -126
3361 -126 -16 -155 -4 2 87 -18 71 -52 -83 4 22 9 10 136 208 -74 35 53 -103 -144 71 -38 164 -46
3385 -46 -138 -84 214 221 -41 139 126 13 42 -128 125 2 18 200 -31 -73 -110 -162 47 8 -72 75 15 20 -145
$$ packed form
3207f5Q0n2o8L0R5K3qk03J45n7K52j85J02L9j01j36J62p0l4J87j63R4m9l5j25
3232a42L57k46J23k02J59n1J46j69J27j11qQ4k69K18kP8r2l8K0Q2L9j12P0j81
3256a20j13J52J26k9k54L30r4k8j07R8j0p9R2R2p0Q4l8l5k4o4p9L9Q3M8J16O1
3282A77k82K48J0j34L3K5l4m8l3K2M5j53J96J23k62l8J91k1j37q4R2O3M7L2k6
3307E2m7r9K25j59O1k7M6j10q8N5J7J3K2J02q9M7j19J94r8j12l9K61r6k7J07j73
3333h1J55P5j58N1o7O9Rj66K30n9L1j22p5j5K01n8Ol8Jn6Qk2j8J26L5j14M8j22
3361a26J10j39J51OQ5j05Q9j23l1Q7J8j3JJ26P2k82J09J8j56m1K15j09K02k10
3385d6r2N4K98Pk62J80j3j13K9j70K53j23J6J82k31m2l7n2K09l9q0J47o0Nj65
$$ plain form
3410 -145 13 -104 20 -122 143 248 70 59 -48 38 138 -90 -51 -59 -50 110 13 61 73 23 -72 -106 -55 99 130
3435 130 -90 215 10 -69 191 -170 122 -98 -124 62 -112 -13 -11 -76 35 60 41 45 -24 132 56 55 -61 -33 15
3460 15 105 1 -53 74 -53 -10 -77 82 166 -36 -126 -237 93 55 -339 -89 139 -65 -51 -35 -18 22 -64 -1 4
3485 4 -53 -36 64 -112 91 53 5 167 -29 66 82 81 -102 67 -18 50 17 44 -42 50 -67 33 11 -178 -114 23
3511 23 -111 249 18 -6 64 38 33 -167 -17 -177 -22 10 -70 71 62 -13 -11 -91 11 48 -42 -32 -16 2 -89 -48 -14
3538 -14 58 156 173 -85 -39 16 -46 -160 50 79 68 13 -27 -169 108 75 -92 60 173 -57 -15 -33 -23 132 -3
3563 -3 -74 -104 -113 42 -177 110 -171 125 -123 -1 -110 -101 82 45 13 125 108 -77 59 37 19 48 8 -16 86
3588 86 -10 -30 54 -101 -146 -10 -49 62 115 -104 -124 12 -160 -7 -30 -11 -63 67 156 64 -9 -94 -201 67 -61
$$ packed form
3410a45J58j17J24j42K65J05j78j1j07Q6J00k28L9qRJ60r7M8J2n0r5l4N1J54L1
3435A30k20L05k05p9K60l61K92k20k6J86j74R9Ko5J11K5j9Mo9J56p6jj16K8M8
3460A5R0j04n4J27j27M3o7J59Q4k02r0j11L30l8l94K50K28k04J4J6J7M0q6O3N
3485Dn7J7J00j76K03l8m8J62j96R5J6jj83J69q5O8l3K7q6R2j17J00k2j89O4J37
3511B3j34L60k31k4P0k6nk00J50j60J55L2q0J41rp5Kq0J02L7r0J0J6J8r1M1L4
3538a4P2R8J7k58M6N5o2j14K10K9j1n5m0j42K77l3j67J52J13k30M2j8J0J55j35
3563cp1l0rJ55k19K87k81K96k48J22j09RJ83l7l2J12j7j85J36k2j8K9m0k4J02
3588H6r6k0Q4j55m5J36l9J11N3k19k0J36j72J53k3J9n2J30Q9r2p3q5j07K68j28
$$ plain form
3613 -61 70 23 -39 18 -79 -18 -25 -32 -190 27 44 -72 87 -109 -65 108 -88 -69 -26 14 -12 -140 20 -182 19
3638 19 -55 4 -85 26 -87 -176 136 8 -100 -5 42 77 -42 112 38 -48 -23 -63 -92 -108 103 -133 121 83 101
3663 101 -115 44 3 122 -221 -65 55 261 -19 -83 33 27 -7 100 82 87 21 29 -207 -74 -88 -15 97 8 -62
3688 -62 -79 80 23 128 -124 -108 -17 -2 -179 90 71 -5 -117 32 -9 91 75 7 42 -114 42 -90 -74 118
3712 118 -7 34 -137 39 -119 -92 -28 176 92 36 -83 144 186 -72 -34 -7 -50 97 -170 65 30 13 -129 39
3736 39 113 -82 305 -62 -206 -50 16 7 100 -60 -34 -74 153 -18 -113 -122 62 -66 97 -49 23 -76 -58 26 -13
3761 -13 -46 -12 88 49 -13 -5 -74 -22 -88 -31 -189 28 68 -13 -147 -114 13 -56 -64 59 103 -99 -41 -8 282 -69 20
3788 20 8 -4 145 77 99 -90 -69 2 3 16 -36 63 -114 -28 96 -137 217 -70 101 76 53 -41 -125 73 -80 125
$$ packed form
3613f1J31m7o2N7r7O1ppj58K17J7j16J59j96M4J73j96J9M3M0k6j28J60k02K01
3638A9p4N9q9J11j13q9L12j28j08R5M7L5j19J54p4q6K5m0k9j6K11k36K54l8J8
3663A01k16J59m1J19l43J56J20K06k80o4J16ol4J07j8No6Qk36J33j4P3J12q9p0
3688f2j7J59n7J05k52J6R1J5j77K69j9p6j12J49m1J00j6o8L5j56J56j32J6J92
3712A18j25M1j71J76j58K7O4K04q4n6j19K27M2k58L8K7m3J47k67K35l5j7j42J68
3736C9P4j95L87l67j44J56O6rR3j60K6m0K27j71r5rJ84j28J63j46P2r9J8Q4l9
3761a3l3L4J00l9o2Qo9N2o6N7j58K17M0q1j34L3J27o9qJ23M4k02N8L3K90l51Q9
3788B0j2j2J49o8K2j89K1P1JJ3n2R9j77Q6J24k33L54k87J71k5k3r4q4J98j53K05
$$ plain form
3814 125 65 223 -109 131 69 -51 -230 -57 -57 17 -12 -98 -91 -115 130 82 81 2 -45 107 63 78 95 -32 108 2
3840 2 68 74 -43 -57 81 119 89 7 -27 78 25 -37 186 157 15 55 -51 -119 24 23 62 -71 51 109 -2 -138
3866 -138 -50 165 -62 -9 27 -85 36 -38 -130 174 63 -47 2 -110 80 22 -63 93 -57 50 -125 -21 94
3889 94 20 -166 3 -166 -5 -147 -61 -108 55 188 179 -134 -54 -7 -115 29 6 200 -59 37 5 -89 16 99
3913 99 42 -23 217 -28 24 136 -23 188 -99 107 76 -23 -119 -44 82 21 -9 -120 -118 25 39 3 -55 -69 -30 -63
3939 -63 -109 -179 -124 -257 -21 27 -133 -52 161 -12 -57 138 -47 115 59 62 123 11 140 -42 -86 -11 27 -89 2
3964 2 -72 -227 39 4 31 -144 -51 -170 -77 -73 -251 -83 -181 50 -124 -51 -39 -40 64 -82 -72 50 41 -14 210 -117
3990 -117 -36 94 -143 1 190 97 124 -71 -96 -22 13 23 76 109 37 -39 -22 0 18 104 11 -124 -53 65 76 83 -61
$$ packed form
3814A25o0J58l32K40o2j20j79J73%P4k9q6Pk4K45m8jp9m7J52m4J5J7j27J40j06
3840BO6Oj17j4J38L8l0q2l4J05n3o2K23k9j42M0j06o8J43jL9j33J22N8j11j36
3866a38Q8K15k27N3L6j12J21p4r2L04j11j10M9j12J90n8q5J56j50J07j75J04J15
3889I4p4j86J69j69J61j42Q6m7J63J33rl13Q0M7j08J44k3J94k59R6l2r4J05Q3
3913I9n7o5K40k45N2J12j59K11k87K06l1r9r6P5J26o1l0j11KJ43J4l6n8j4L9l3
3939f3m6p0N5j33K36M8j60Q1K13j73m5J95j85J62n6LO1j12J29j82m4P5L8j16R1
3964Bp4j55K66l5K7j75R3j19R3Mj78J68r8K31j74P3J2jJ04j46J0J22rn5K24l27
3990a17Q1J30k37J44J89r3K7j95k5P4L5J0N3L3p2p6J7K2J8Q6r3j35P1J18J1Pj44
$$ plain form
4017 -61 -83 -52 -4 109 38 -10 -23 122 -82 -70 4 -117 70 -24 -64 -60 -1 -25 -51 35 111 -125 181 -40 -38 99 -87
4044 -87 -88 -73 -52 130 -95 -4 -28 143 -72 -73 19 -77 -98 9 72 -205 19 -26 33 -169 42 192 -53 18 -113
4069 -113 75 0 9 13 102 112 -169 17 -106 102 15 -42 80 -36 -83 -64 47 -52 91 -15 -74 -17 -91 -75 -9 -8
4095 -8 -7 45 136 -45 131 70 87 -18 3 89 -69 -127 95 -24 54 -65 52 -4 12 -125 -154 21 0 17 91 94 -41
4122 -41 89 3 7 -68 48 -133 -110 14 -21 47 -227 49 14 57 -50 -8 52 -21 -54 9 42 -98 -20 -83 -33 125
4148 125 -55 -156 -88 99 -43 -144 -81 -41 57 117 48 67 -140 24 -51 -90 127 -37 -200 -33 141 175 -87
4171 -87 -5 86 -100 -78 23 -5 -66 72 -114 -59 91 -135 25 46 127 27 -84 88 67 -44 110 -5 134
4194 134 -159 4 -23 25 -98 92 71 -58 130 118 19 73 -34 -57 -54 56 66 98 177 51 45 164 -186 -180 -9
$$ packed form
4017f1k2L1M8J13p1m8j3J45k04J2P4j21J87r4m0MN9k4k6Q6P6k36L06k21KJ37j86
4044h7jJ5K1J82k25R1k4J71k15jR2r6k1J07O3k77K24m5N9k02K11J50k45P1j31
4069a13J88p5RMQ9J0k81J86j23K08q7n7J22j16m7J9J11r9J43j06n9N7p4J6O6J
4095hJN2R1j81J76o1J7j05K1Q6j58n8K22j19P8j19J17n6J6j37k9J75k1J7P4Lj35
4122d1J30q6Mp5J16j81K3J24l5O8k74K76l5M3j07M2O0p3l3O3L3j40P8o3N0J58
4148A25j80j01O8J87j42j01O3M0R8O0o9J9k07J64p5l9K17j64j63J67J74L4k62
4171h7Q2R1j86K2J01k8o1J38j86N5J50k26J60K1Q1j00j11J72k1j11J54j15J39
4194A34k93J63k7M8j23J90k1j29J88j2r9N4j07k3LJ10J0L2P9j26oJ19l50OJ71
$$ plain form
4219 -9 -27 -45 215 -148 39 -94 111 44 40 43 -102 -109 60 -123 26 -45 -59 -113 -34 -30 -18 -40 -11 -2 -105 15 -140
4246 -140 23 33 -113 -37 42 -41 208 -112 -101 12 -42 0 134 95 -4 123 -112 -92 -63 -89 -36 -94 67 2 -53
4271 -53 -51 46 -36 -81 108 -50 81 -118 88 42 10 48 100 77 -21 28 -5 -102 123 -33 74 275 86 -10 31 143
4297 143 -59 -142 -135 152 25 -29 71 -109 -3 117 -44 -50 136 48 104 116 32 -55 123 -57 -127 -104 171 -132
4321 -132 -67 -77 -85 96 37 -10 12 288 16 14 -104 143 -12 -101 34 -100 -168 -13 -51 188 2 37 -238 -41
4345 -41 -61 -34 -98 -69 46 -46 -169 -96 -3 -58 -59 55 -87 -132 61 6 158 33 26 -58 -24 -31 32 61 43 54 96 -22
4373 -22 -99 -20 -156 96 98 136 -3 -6 -16 30 47 117 -40 25 201 59 -22 -20 -3 -79 -211 66 35 69 28 -79 -70 -48
4401 -48 -69 -154 -51 24 171 -166 -148 -83 194 -81 -91 104 -83 -125 -54 76 72 12 36 -29 97 -161 -159 222 62
$$ packed form
4219ij8j8K60l63J87j33K05o7mLj45pJ69j83J49p1j4n4P9MJ2k2K9Rj03J20j55
4246a40J63J0j46P6P9q3K49l20J1J13n4M2J34l9r9J27k35K0K9k6N3n8J61o5n5
4271e3KR7q2m5J89j58J31j99K06m6l2L8N2k3r8M9l3r7K25j56J07K01j89r6M1J12
4297A43k02q3PK87j27n4J00j80J06J20j61oJ86q8N6J2q4q7J78j80p0K3K75l03
4321a32O5j0qJ81n9m7K2K76k72kj18K47j55q9J35j34o8J55l8K39j86L5k75J97
4345d1k0K7o4K9J15r2j23P3R3n5jJ14j42m5J93n5J52j25pq4L4pO3K9j8J1M2j18
4373b2p7P9j36K52KL8j39lj0M6J7P0j57O5J76j42q1KJ7p6j32K77l1L4m1j07RK2
4401d8k1q5J03P5J47l37J8O5K77k75j0J95j87m2P1J30mo0K4o5J26k58KL81j60
$$ plain form
4426 62 103 -50 38 -13 -80 37 -55 111 -128 -103 58 36 -7 -68 16 126 -71 60 48 63 -68 -64 -98 7 24 -171
4452 -171 -79 88 -3 -106 9 -34 26 57 122 -132 -46 -194 32 72 -33 22 73 -48 0 126 -84 -63 -17 13 35
4477 35 183 -27 -237 -135 -23 -74 -53 13 -77 -21 -146 -38 -6 -23 161 40 12 57 64 61 29 -74 -27 133 62 -132
4503 -132 -195 -64 263 -60 3 -36 -48 -1 14 -11 63 150 47 29 21 -31 -30 -149 131 -34 -93 -13 -51 40 149 190 -85
4530 -85 148 -13 -31 -54 56 -41 200 65 133 32 -49 -119 -37 169 -91 -33 -101 5 -75 9 -24 -81 51 -21 73
4555 73 145 -95 33 -2 -54 -32 52 -42 134 -152 -12 71 97 -39 -53 19 -36 -44 102 136 14 -201 -24 2 -71 -55
4581 -55 -60 80 -172 -67 -40 -107 19 105 -35 39 -45 22 91 15 41 62 -14 -51 40 -41 -12 142 58 108 -38 50 -90
4608 -90 -43 134 52 -71 1 -81 25 -28 80 138 94 81 -81 -99 -88 -58 -171 -84 68 37 47 8 87 97 60 -109
$$ packed form
4426F2M1j53Q8n1o7J17r2J66k39K5J61k2m3o1Q4J10j97J31j2J5j31Ml4J05J7j95
4452a71R2J67r1j03J15m3O0L1O5k54Q6j48K26M0j05N5N1j21M8J26k10K1M6L0K2
4477C5J48k10k10J02J12n1K1O6r0N6j25J08L2j7J84j21k8M5Pll2j03M7J60p1j94
4503a32o3J31L27l23O3l9j2M7J5k5P4Q7j03j8qn2Jj19K80j65n9Q0l8R1J09M1k75
4530h5K33j61j8k3J10r7K41j35O8j01q1p0Q2K06k60N8o8J06q0Q4l3n7J32p2R4
4555G3P2k40J28l5n2K2Q4r4J76k86J40Q3K6j36j4P2n5qJ46L4j22k15J77K6p3J6
4581e5nJ40k52J05K7o7J26Q6j40P4q4O7O9p6K6K1p6l7R1q1K9J54q4N0j46Q8j40
4608i0M7J77q2j23P2q2J06n3J08N8m4j3j62j8J1L0j13Q7J52l1J0l9P9J0l7j69
$$ plain form
4634 -109 211 75 -97 -53 93 -53 -62 62 -32 -49 -98 -77 -100 113 -73 130 141 -97 -65 108 80 76 23 155 -69
4659 -69 -112 96 59 43 92 -72 48 26 37 -98 -5 -64 -9 114 160 172 -4 81 -68 49 53 -39 39 88 -79 -87 -7
4686 -7 -66 54 96 -18 -40 82 -175 96 186 2 90 -96 44 -76 -29 -10 -40 88 60 89 93 -91 -16 14 76 -58
4712 -58 75 67 61 3 86 10 -24 -22 100 98 50 4 -16 90 181 -42 -84 -31 28 139 -85 -32 51 134 182 18 -39 28 -113
4741 -113 -17 -176 -89 26 -17 50 21 -153 -8 167 108 132 30 -35 -68 15 34 140 -61 -66 -145 53 -25 -145 -14
4766 -14 -16 -185 18 -34 68 -130 -173 -49 171 12 24 -46 -10 4 192 114 44 -18 3 -146 -104 -31 54 -36 25 69
4792 69 -151 -152 -27 21 -21 63 -58 -7 -124 -59 201 -67 -92 32 77 50 15 -57 -45 84 -42 -92 56 -91 -185
4817 -185 -128 -63 32 -2 77 4 18 56 53 92 191 -1 12 40 31 90 80 118 -7 -10 81 112 -52 -49 12 115 73 -22 -83 -51
$$ packed form
4634a09L20j36j72M4J46j46rJ24r4j7m9K1k3K13j86K03J1k38L2J73k8mn3J32k24
4659f9m3K08l7j6M9j64J20k2J1j35R3n9N5J23M6J2j76Q5j49J17Mr2P8M9j67qQ0
4686gn9J20M2j14k2J22k57K71R0j84Q8j86J40j20M7J9l0J28k8K9Mj84P5L0O2j34
4712e8J33qon8Q3p6l4KJ22km8m6k0J06R1k23m2N3N9J11k24N3Q3Q3M8j64n7O7j41
4741a13R6j59Q7J15m3O7k9j74J45J75n9K4j02o5l3Q3J9J06k01np9J98p8j20J31
4766a4kj69K03n2J02j98m3J24K20j59J2p0L6J4J88p8p0o2K1j49M2P3Q5r0O1M4
4792F9k20jJ25M8m2Q4j21N1j17O5K60k68k5J24M5k7l5p2J2J29j26n0J48j47r4
4817a85N7O5R5l4P9p3J4L8lL9R9j92J3K8rN9j0L8j25lR1L1j64LO1J03m2r5o1L2
$$ plain form
4847 -51 124 119 -151 -36 117 9 -148 103 83 20 25 11 97 -14 -74 -75 -22 -35 1 -29 -23 177 -9 52 38 100 -80
4874 -80 -2 3 82 12 19 -129 -91 11 -71 -45 -41 36 132 -50 59 -207 144 10 -120 22 -108 -15 -73 42 -30 118
4900 118 49 183 -35 -16 -82 86 -69 -117 -55 120 -178 5 -88 -37 105 160 0 42 49 83 -48 24 10 -110 -53
4925 -53 55 -85 55 192 -54 24 -14 75 -89 142 -94 -34 31 42 25 -21 -89 43 -19 115 44 25 12 0 172
4950 172 93 69 -285 -37 -117 -164 -129 -118 74 115 105 54 18 37 -36 -30 -230 65 165 -61 -103 25 48 -26 -48 -85
4976 -85 4 60 -52 -157 -75 89 -25 -106 57 -45 -149 95 -81 -66 -133 57 12 -51 35 -44 86 -29 75 -137
5000 -137 42 4 37 -88 -78 95 -6 -19 70 -14 36 -167 -11 -19 11 -125 -17 -53 9 -77 -76 81 -175 -48 24
5025 24 -103 65 -105 -44 259 69 4 112 18 -35 -53 72 -11 -2 -6 52 10 -129 -44 110 -191 78 -102 -65 -33
$$ packed form
4847e1J75nk70J15J53j08j57K51k0o3Nj4Q6j11o0jN3j3L6l0OK00j86O1j4O2j80
4874h0P8NP9p0Pj48L8J02q2K6MP7R6j82J09k66L51j34j30J42j30R3n8J15p2J48
4900A18o9J34k18J9o6J68j55m8O2J75k98J83r3N1J42N5j60M2PL4j31P2j4j20N7
4925e3J08j40J40J37k46P8l8Q9j64K31k36O0O5J1j7m6o8J32o2J34p1j9j3j2J72
4950A72p9k4l54K48q0m7L5J1J92M1j0n1l6J9p3Ok00K95J00k26m2J28K3p4k2l7
4976h5Q9N6j12j05Q2J64j14q1J63j02j04K44j76J5o7J90m5o3Q6p9J30j15J04k12
5000a37J79l8L3j25J0J73j01j3Q9q4N0k03J56qL0j36J08l6O2q6JJ57k56J27P2
5025B4j27J68j70O1L03j90o5J08r4n3j8J25q3RmN8m2j39Q5J54l01K69j80L7L2
$$ plain form
5050 -33 -64 -1 42 30 -68 -177 -168 -164 -118 -72 75 29 118 -23 -55 31 -13 89 -85 135 126 22 157 8 225 -98
5076 -98 -9 62 -201 -140 51 -45 -43 96 37 38 115 251 -49 111 -24 -41 1 14 132 42 -78 -81 -57 -41 -88 -71 -100
5103 -100 -41 -25 185 -112 95 86 39 16 88 9 153 124 94 12 39 -32 -88 4 48 49 1 -10 -78 124 151 89 244 -119
5131 -119 -173 6 -71 -6 -77 -6 -41 -24 -22 40 -32 123 18 -55 16 -110 131 95 -93 87 -74 146 -58 12 -37
$$ packed form
5050c3l1O3M3j2r8j09RMM6M6J47m6Q9j41l2Q6m4J02j74K20rj04J35j49K17l23
5076i8Q9P1k63O1J91r6KJ39n9JP7J36l00J60j35j7M2J3J18r0j20lK4J6m7J7k9
5103a00N9J6K10k97K07rm7k3P2p9J44k9l0q2K7p1n6R2M4Jm8j1o8K02K7o2J55l63
5131a19n4J79p7O5p1P1l5J7KO2p2J55j05p3P1j26K41l6j88J80j61K20k04P0m9
$$ [...]
8191c8
##END NTUPLES=NMR FID
##END=
