##TITLE=1H_DE-97K2
 200.13MHz,DMSO-d6.
 8 sc
 
 4.1.2026
##JCAMPDX= 6.0         $$ Bruker NMR JCAMP-DX V2.0
##DATA TYPE= NMR FID
##DATA CLASS= NTUPLES
##ORIGIN= UXNMR, Bruker Analytische Messtechnik GmbH
##OWNER= pz
$$ XWIN-NMR		Version 3.5
$$ Wed Feb  4 13:52:56 2026 Russian Standard Time (UT+4h)  she@DPX200
##.OBSERVE FREQUENCY= 200.1313
##.OBSERVE NUCLEUS= ^1H
##.DELAY= (6, 6)
##.ACQUISITION MODE= SIMULTANEOUS
##.ACQUISITION SCHEME= undefined
##.AVERAGES= 8
##.DIGITISER RES= 18
##SPECTROMETER/DATA SYSTEM= spect
##.PULSE SEQUENCE= zg30
##.SOLVENT NAME= DMSO
##.SHIFT REFERENCE= (INTERNAL, DMSO, 0, 14.3821)
##AUDIT TRAIL= $$ (NUMBER, WHEN, WHO, WHERE, WHAT)
$$ ##TITLE= Audit trail, XWIN-NMR		Version 3.5
$$ ##JCAMPDX= 5.01
$$ ##ORIGIN= Bruker BioSpin GmbH
$$ ##OWNER= she
$$ F:/spectra/data/she/nmr/H-C/1/audita.txt
$$ ##AUDIT TRAIL=  $$ (NUMBER, WHEN, WHO, WHERE, WHAT)
(   1,<2026-02-04 13:51:49.73 +0400>,<she>,<DPX200>,
      <created by zg, POWCHK disabled, PULCHK disabled
       configuration hash MD5:
       00 E9 B6 7A A2 85 ED C7 34 08 36 98 17 FE 4E 26
       data hash MD5: 16K
       D4 24 B5 DF C9 08 B4 83 07 88 5D 42 4E A7 D4 CD>)
$$ ##END=
$$ 
$$ hash MD5
$$ 80 77 5C 61 FE 09 95 8F A2 4B 6B 6B A3 FF BB 83
##$RELAX= 
##$RELAX= 
##$RELAX= 
##$RELAX= 
##$RELAX= 
##$RELAX= 
$$ Bruker specific parameters
$$ --------------------------
##$DU= <F:/spectra>
##$EXPNO= 1
##$NAME= <H-C>
##$PROCNO= 1
##$TYPE= <nmr>
##$USER= <she>
##$AMP= (0..31)
100 100 100 100 100 100 100 100 100 100 100 100 100 100 100 100 100 100 
100 100 100 100 100 100 100 100 100 100 100 100 100 100 
##$AQSEQ= 0
##$AQ_mod= 1
##$AUNM= <au_zg>
##$AUTOPOS= <>
##$BF1= 200.13
##$BF2= 200.13
##$BF3= 200.13
##$BF4= 200.13
##$BF5= 200.13
##$BF6= 200.13
##$BF7= 200.13
##$BF8= 200.13
##$BYTORDA= 1
##$CFDGTYP= 0
##$CFRGTYP= 5
##$CHEMSTR= <none>
##$CNST= (0..31)
1 1 145 1 1 1 1 1 1 1 1 1 1 1 1 1 1 1 1 1 1 1 1 1 1 1 1 1 1 1 1 1 
##$CPDPRG= <>
##$CPDPRG1= <>
##$CPDPRG2= <>
##$CPDPRG3= <>
##$CPDPRG4= <mlev>
##$CPDPRG5= <mlev>
##$CPDPRG6= <mlev>
##$CPDPRG7= <mlev>
##$CPDPRG8= <mlev>
##$CPDPRGB= <>
##$CPDPRGT= <>
##$D= (0..31)
0 0.7 0 0 0 0 0 0 0 0 0 0.03 0 0 0 0 0 0 0 0 0 0 0 0 0 0 0 0 0 0 0 0 
##$DATE= 1770198709
##$DBL= (0..7)
120 120 120 120 120 120 120 120 
##$DBP= (0..7)
150 150 150 150 150 150 150 150 
##$DBP07= 0
##$DBPNAM0= <>
##$DBPNAM1= <>
##$DBPNAM2= <>
##$DBPNAM3= <>
##$DBPNAM4= <>
##$DBPNAM5= <>
##$DBPNAM6= <>
##$DBPNAM7= <>
##$DBPOAL= (0..7)
0.5 0.5 0.5 0.5 0.5 0.5 0.5 0.5 
##$DBPOFFS= (0..7)
0 0 0 0 0 0 0 0 
##$DE= 6
##$DECBNUC= <off>
##$DECIM= 32
##$DECNUC= <off>
##$DECSTAT= 4
##$DIGMOD= 1
##$DIGTYP= 9
##$DL= (0..7)
0 120 120 120 120 120 120 120 
##$DP= (0..7)
150 150 150 150 150 150 150 150 
##$DP07= 0
##$DPNAME0= <>
##$DPNAME1= <>
##$DPNAME2= <>
##$DPNAME3= <>
##$DPNAME4= <>
##$DPNAME5= <>
##$DPNAME6= <>
##$DPNAME7= <>
##$DPOAL= (0..7)
0.5 0.5 0.5 0.5 0.5 0.5 0.5 0.5 
##$DPOFFS= (0..7)
0 0 0 0 0 0 0 0 
##$DQDMODE= 0
##$DR= 18
##$DS= 0
##$DSLIST= <SSSSSSSSSSSSSSS>
$$ [...]
##$SUBNAM0= <"">
##$SUBNAM1= <"">
##$SUBNAM2= <"">
##$SUBNAM3= <"">
##$SUBNAM4= <"">
##$SUBNAM5= <"">
##$SUBNAM6= <"">
##$SUBNAM7= <"">
##$SUBNAM8= <"">
##$SUBNAM9= <"">
##$SW= 18.0517328524113
##$SWIBOX= (0..15)
0 0 2 0 0 0 0 0 0 0 0 0 0 0 0 0 
##$SW_h= 3612.71676300578
##$TD= 16384
##$TD0= 1
##$TE= 0
##$TE2= 300
##$TE3= 300
##$TEG= 300
##$TL= (0..7)
0 120 120 120 120 120 120 120 
##$TP= (0..7)
150 150 150 150 150 150 150 150 
##$TP07= 0
##$TPNAME0= <>
##$TPNAME1= <>
##$TPNAME2= <>
##$TPNAME3= <>
##$TPNAME4= <>
##$TPNAME5= <>
##$TPNAME6= <>
##$TPNAME7= <>
##$TPOAL= (0..7)
0.5 0.5 0.5 0.5 0.5 0.5 0.5 0.5 
##$TPOFFS= (0..7)
0 0 0 0 0 0 0 0 
##$TUNHIN= 0
##$TUNHOUT= 0
##$TUNXOUT= 0
##$USERA1= <user>
##$USERA2= <user>
##$USERA3= <user>
##$USERA4= <user>
##$USERA5= <user>
##$V9= 5
##$VALIST= <valist>
##$VCLIST= <CCCCCCCCCCCCCCC>
##$VD= 0
##$VDLIST= <DDDDDDDDDDDDDDD>
##$VPLIST= <PPPPPPPPPPPPPPP>
##$VTLIST= <TTTTTTTTTTTTTTT>
##$WBST= 1024
##$WBSW= 4
##$XGAIN= (0..3)
0 0 0 0 
##$XL= 0
##$YL= 0
##$YMAX_a= 128128
##$YMIN_a= -188468
##$ZGOPTNS= <>
##$ZL1= 120
##$ZL2= 120
##$ZL3= 120
##$ZL4= 120
##$ABSF1= 10
##$ABSF2= 0
##$ABSG= 5
##$ABSL= 3
##$ALPHA= 0
##$AQORDER= 0
##$ASSFAC= 0
##$ASSFACI= 0
##$ASSFACX= 0
##$ASSWID= 0
##$AUNMP= <proc_1d>
##$AZFE= 0.1
##$AZFW= 0.1
##$BCFW= 1
##$BC_mod= 2
##$BYTORDP= 1
##$COROFFS= 0
##$CY= -3
##$DATMOD= 1
##$DC= 2
##$DFILT= <>
##$DTYPP= 0
##$F1P= 0
##$F2P= 0
##$FCOR= 0.5
##$FTSIZE= 0
##$FT_mod= 4
##$GAMMA= 1
##$GB= 0.15
##$INTBC= 1
##$INTSCL= 1
##$ISEN= 128
##$LB= 0.25
##$LEV0= 0
##$LPBIN= 0
##$MAXI= 10000
##$MC2= 0
##$MEAN= 0
##$ME_mod= 0
##$MI= 1.114404
##$NCOEF= 0
##$NC_proc= 0
##$NLEV= 6
##$NOISF1= 3.799351
##$NOISF2= 2.8
##$NSP= 1
##$NTH_PI= 0
##$NZP= 0
##$OFFSET= 14.38212
##$PC= 1
##$PHC0= -3710.423
##$PHC1= 23.19231
##$PH_mod= 1
##$PKNL= yes
##$PPARMOD= 0
##$PSCAL= 0
##$PSIGN= 0
##$REVERSE= no
##$SF= 200.129724274929
##$SI= 16384
##$SIGF1= 3
##$SIGF2= 2
##$SINO= 400
##$SIOLD= 16384
##$SREGLST= <1H.CDCl3>
##$SSB= 0
##$STSI= 0
##$STSR= 0
##$SW_p= 3205.1282051282
##$SYMM= 0
##$S_DEV= 0
##$TDeff= 0
##$TDoff= 0
##$TI= <>
##$TILT= no
##$TM1= 0
##$TM2= 0
##$TOPLEV= 0
##$USERP1= <user>
##$USERP2= <user>
##$USERP3= <user>
##$USERP4= <user>
##$USERP5= <user>
##$WDW= 1
##$XDIM= 8192
##$YMAX_p= 0
##$YMIN_p= 0
$$ End of Bruker specific parameters
$$ ---------------------------------
##NTUPLES= NMR FID
##VAR_NAME=  TIME,          FID/REAL,        FID/IMAG
##SYMBOL=    X,             R,               I
##VAR_TYPE=  INDEPENDENT,   DEPENDENT,       DEPENDENT
##VAR_FORM=  AFFN,          ASDF,            ASDF
##VAR_DIM=   8192,          8192,            8192
##UNITS=     SECONDS,       ARBITRARY UNITS, ARBITRARY UNITS
##FACTOR=    0.0002768,     1,               1
##FIRST=     0,             0,               0
##LAST=      2.2672688,     0,               0
##MIN=       0,             -188468,         0
##MAX=       2.2672688,     128128,          0
$$ Real data points
##PAGE= N=1
##DATA TABLE= (X++(R..R)), XYDATA
$$ plain form
0 0 0 0 0 0 0 0 0 0 0 0 0 0 0 0 0 0 0 0 0 0 0 0 4 -5 8 -8 8 -8 8 -8 12 -13 15 -15 20 -20 21 -27 28 -30 35 -37 42 -48
44 -48 51 -56 62 -69 76 -82 91 -99 111 -124 136 -154 171 -193 219 -249 291 -342 412 -509 655
65 655 -892 1318 -2256 5120 -30243 -148275 -18000 128128 78069 19034 64591 90865 62867
78 62867 49634 35245 811 -9982 -15267 -55058 -80256 -62931 -50544 -49408 -45378 -44877 -20494
91 -20494 32404 40913 -590 8621 70410 69882 8679 -5100 24069 27857 18111 8704 -16359 -24215
105 -24215 682 -1250 -33924 -32335 -9464 -26272 -45107 -11683 20946 7338 -2243 16118 25639
118 25639 22870 21103 10493 -1804 957 2417 -10787 -12968 1579 2621 -6472 -762 5686 -1569
132 -1569 -5068 -3958 -8637 -6616 3481 289 -10289 -1171 17237 16231 59 -5677 -1180 3416
$$ packed form
0@%%%%%%%%%%%%%%%%%%%%%%MrJ3j6J6j6J6j6K0k5K8l0L5m0M1m8N5n8O5p2P9r0
44d8R9j07J18j31J45j58J73j90K10k35K60k90L25l64M12m68N40o33P54r21J164
65F55j547K210l574P376l5363j18032J30275J46128n0059n9035M5557K6274k7998
78F2867j3233j4389l4434j0793n285l9791k5198J7325J2387J136M030N01K4383
91b0494N2898Q509m1503R211O1789n28o1203j3779K9169L788r746r407k5063p856
105b4215K4897j932l2674J589K2871j6808j8835L3424L2629j3608r581J8361R521
118B5639k769j767j0610j2297K761J460j3204k181J4547J042r093N710O448p255
132a569l499J110m679K021J0097l192j0578R118J8408j006j6172n736M497M596
$$ plain form
146 3416 2047 -9711 -16413 -3917 9539 1260 -6769 5952 18702 9775 -3655 -1169 5874 3700
160 3700 -4400 -10237 -7895 751 1694 -6649 -8828 -1415 3841 539 -5533 -4722 690 5876 5294 318
176 318 2111 10627 11511 3593 -86 2940 3550 -3156 -9636 -8589 -4527 -4530 -8036 -8099 -1660 3392 2306
193 2306 -240 2673 6408 6288 3046 1645 4026 4571 1934 -59 130 439 -1018 -3765 -4295 -3902 -3691
210 -3691 -4323 -5195 -3714 74 1827 1299 1961 4932 6368 4507 2145 1342 1697 1162 -1933 -3989 -2419
227 -2419 -158 -1295 -3676 -2371 545 633 -1533 -1995 -50 1446 1537 -227 130 2585 3946 1769 -141
244 -141 730 1450 -42 -2337 -3174 -2231 -1108 -1362 -2134 -992 1220 2261 801 -20 1440 2227 793
261 793 -643 -710 154 576 -312 -882 -476 759 313 -1556 -1319 -425 -394 -1124 -814 -137 914 1252 1094 711
$$ packed form
146C416j369j1758o702J2496J3456q279q029J2721J2750q927j3430K486P043k174
160C700q100n837K342Q646R43q343k179P413N256l302o072Q11N412N186n82m976
176C18J793Q516Q84p918l679L026O10o706o480J047M062ll506o3O439N052j086
193B306k546K913L735j20l242j401K381N45k637j993J89L09j457k747n30L93K11
210c691o32q72J481L788J753n28O62K971J436j861k362q03L55n35l095k056J570
227b419K261j137k381J305K916Q8k166m62J945J496R1j764L57K455J361k177j910
244a41Q71P20j492k295q37R43J123k54p72J142K212J041j460q21J460P87j434
261G93j436o7Q64M22q88n70M06J235m46j869K37Q94L1p30L10O77J051L38j58l83
$$ plain form
281 711 1405 1399 425 -768 -701 -376 -597 -1513 -1441 -577 349 50 -202 -119 703 915 -30 -272 208 813 474 -159
303 -159 327 614 515 -253 -768 -413 152 -775 -1240 -1218 -328 -49 -72 74 335 925 982 333 265 355 558 -24
325 -24 -404 -362 -8 38 -239 -221 -10 -209 -177 -239 -491 171 3 16 7 218 634 654 318 588 313 463 -95 -556
349 -556 -216 -224 -477 -621 -565 -67 28 70 135 35 147 144 15 234 119 342 42 182 112 344 224 -282 -323 -194
373 -194 -1 -242 -197 -268 -65 -24 -6 190 134 330 334 94 61 235 306 -324 -77 236 34 153 -43 -87 -179 243
397 243 98 -256 8 48 133 24 111 185 280 37 377 20 116 98 26 -240 -108 -263 -200 -189 175 -27 23 160
421 160 83 12 42 168 -199 -162 54 -12 -221 -174 50 176 119 -382 67 -37 -457 -96 -219 12 207 379 14
444 14 6 75 136 -19 -241 -17 313 -105 -40 -124 -194 -199 -61 -114 109 -75 -176 27 -119 -20 97 -257 -112 -144 -52
$$ packed form
281G11O94or74j193O7L25k21r16P2Q64R26k99k52Q3Q22K12r45k42M80O05l39o33
303a59M86K87r9p68n15L55N65r27m65K2Q90K79k3J46K61N90N7o49o8R0K03n82
325b4l80M2L54M6k77J8K11j99L2o2k52O62j68J3rK11M16K0l36K70k75J50n58m61
349e56L40qk53j44N6M98R5M2O5j00J12lj29K19j15K23l00J40p0K32j20n06m1J29
373a94J93k41M5p1K03M1J8J96n6J96Mk40l3J74P1o30K47L13k02J19j96m4r2M22
397B43j45l54K64M0Q5j09Q7P4R5k43L40l57R6j8p2k66J32j55O3J1L64k02N0J37
421A60p7p1L0J26l67L7K16o6k09M7K24J26n7n01M49j04m20L61j23K31J95J72l65
444A4qO9O1j55k22K24L30m18O5q4p0nJ38n3K23j84j01K03j46R9J17l54J45l2R2
$$ plain form
469 -52 153 0 41 91 -107 61 -84 23 18 -62 -168 114 9 32 -44 -46 -231 18 -1 -16 -81 131 171 174 34 -312
495 -312 58 96 39 -6 -191 -89 -23 30 1 -141 106 117 88 146 147 155 -216 9 134 44 -62 -70 -142 -82 311 -14
521 -14 -54 66 130 -135 67 145 253 261 26 51 -135 9 38 -149 -63 155 95 -3 29 35 124 -139 19 5 192 61
547 61 11 16 31 84 148 -110 -24 257 126 197 12 -24 -199 -53 201 29 -22 -181 63 -83 -23 -11 38 -106 -89
572 -89 -112 172 54 66 106 267 -2 -123 49 24 40 -101 -47 -146 27 58 -17 57 -49 155 -217 78 111 -21
596 -21 45 -182 167 -56 105 1 198 -57 38 -148 82 61 107 279 -75 -68 -132 19 51 -152 91 105 -118 -107
620 -107 -116 148 -196 -126 -3 -245 -162 -98 68 -80 -21 61 40 37 -22 170 51 16 89 -159 140 -73 59 -65 -32
645 -32 -288 215 107 147 -34 -39 -82 47 -32 298 -200 28 -25 -117 62 27 128 181 238 -127 81 -241 -48 -108
$$ packed form
469e2K05j53M1N0j98J68j45J07nq0j06K82j05K3p6kj85K49j9j5o5K12M0Lj40l46
495c12L70L8n7m5j85J02O6N3k9j42K47J1k9N8JQl71K25J25r0j06qp2O0L93l25
521a4m0J20O4k65K02P8J08Qk35K5j86J44K9j87Q6K18o0r8L2OQ9k63J58j4J87j31
547F1n0NJ5N3O4k58Q6K81j31P1j85l6j75J46K54j72n1j59K44j46O0J2M9j44J7
572h9k3K84j18J2M0J61k69j21J72k5J6j41N4r9J73L1p5P4j06K04l72K95L3j32
596b1O6k27L49k23J61j04J97k55R5j86K30k1M6J72l54Po4J51L2k03K43J4k23J1
620a07rK64l44P0J23k42Q3O4J66j48N9Q2k1ln9J92j19l5P3k48K99k13J32j24L3
645c2k56N03j08M0j81nm3J29p9L30m98K28n3r2J79l5J01N3N7l65K08l22J93o0
$$ plain form
669 -108 -32 254 176 56 55 -49 243 38 4 -102 172 91 -6 -34 -193 14 -258 -22 -132 221 -123 -234 -78
692 -78 -126 113 -70 -152 135 -74 23 36 -350 -69 -168 187 -45 -95 -3 128 -163 -43 -69 -167 104 40 -138 107
716 107 128 -6 20 207 20 -135 203 -150 -7 -170 -77 37 -125 -17 36 116 268 -30 -36 -106 -219 -25 0
739 0 80 111 -46 -140 39 -17 213 55 -166 -162 234 107 -165 -20 -227 -389 -253 67 -132 -276 -273 73 273 -248
763 -248 -192 -77 -27 -118 -43 -23 -364 -249 -6 -21 187 314 125 79 -188 -264 -198 -45 85 -309 -216 -262 -399 196
787 196 -273 -48 193 107 38 -60 11 44 135 -350 193 -82 -170 109 57 -68 79 -243 -182 -36 -1 -187 40 88
811 88 73 -51 195 196 -126 154 254 265 -289 -100 -1 -28 117 -212 -53 -47 33 -186 -123 2 10 -85 -59 -199 157
836 157 19 -275 -20 -53 -56 87 82 -48 290 15 -14 -223 104 254 125 -99 -67 -86 11 71 -3 1 147 42 53
$$ packed form
669a08P6K86p8j20jj04K92k05l4j06K74q1r7k8j59K07k72K36j10L53l44j11J56
692g8m8K39j83q2K87k09R7J3l86K81r9L55k32n0R2J31k91J20k6r8K71o4j78K45
716A07K1j34K6J87j87j55L38l53J43j63R3J14j62J08N3Q0J52k98op0j13J94K5
739@Q0L1j57r4J79n6K30j58k21ML96j27k72J45k07j62J36L20j99j44LL46K00n21
763b48N6J15N0r1P5K0l41J15K43j5K08J27j89m6k67p6O6J53J30l94R3m6j37N95
787A96m69K25K41q6o9r8P1L3R1m85N43k75q8K79n2j25J47l22O1J46L5j86K27M8
811H8j5j24K46Jl22K80J00J1n54J89R9k7J45l29J59OQ0k19O3J25Qr5K6j40L56
836A57j38k94K55l3lJ43nj30L38k75k9k09L27J50j29k24L2j9R7O0p4MJ46j05J1
$$ plain form
861 53 105 130 4 61 7 -113 -142 104 85 -30 -112 85 48 -21 -133 91 -29 -86 93 100 -20 -104 42 -108 -219
886 -219 105 -225 -153 -206 -120 -135 -117 -73 -62 -41 3 -187 77 -49 -16 205 -18 181 -188 56 17 -113 141 36
910 36 156 -164 -239 65 -83 -7 33 147 243 113 -80 238 -89 152 -44 -28 -166 224 -155 103 -235 -133
932 -133 152 -124 -97 -138 -110 -201 54 -12 240 -80 -18 379 360 -173 -208 120 233 -143 137 -111 111 83 214
955 214 207 121 -34 77 -8 139 371 219 -38 -137 -9 3 1 87 -139 -102 79 165 122 76 -90 -141 -99 136 -80
980 -80 -41 -122 -16 -126 -112 80 -175 -8 -101 145 239 30 -15 174 -235 -70 166 -84 -29 -248 90 -36 -56
1003 -56 -15 -40 250 35 47 -103 136 -30 7 245 -101 71 116 -59 81 263 -66 125 -229 89 -229 -100
1025 -100 77 -20 -66 155 239 -147 -108 135 121 29 -129 -232 67 -44 311 -102 -152 -155 -222 -78 -19 -93 43 -135
$$ packed form
861E3N2K5j26N7n4j20k9K46j9j15q2J97l7o9j12K24j20n7J79Pj20q4J46j50j11
886b19L24l30P2n3Q6j5J8M4J1K1M4j90K64j26L3K21k23J99l69K44l9j30K54j05
910C6J20l20p5L04j48P6M0J14R6j30j93L18l27K41j96J6j38L90l79K58l38J02
932a33K85k76K7m1K8r1K55o6K52l20O2L97j9n33l5L28J13l76K80k48K22k8J31
955B14pq6j55J11q5J47K32j52k57r9J28J2kQ6k26L7J81Q6m3m6j66n1M2K35k16
980h0L9q1J06j10J4J92k55J67r3K46R4k09m5J89m09J65K36k50N5k19L38j26k0
1003e6M1k5K90k15J2j50K39j66L7K38l46J72M5j75J40J82l29J91l54L18l18J29
1025a00J77r7m6K21Q4l86L9K43j4r2j58j03K99j11L55m13n0lo7J44N9p4J36j78
$$ plain form
1049 -135 43 -83 -120 -2 -98 282 26 66 -14 16 -142 -39 166 -138 36 -247 317 15 -201 -18 19 34
1071 34 -1 -180 -116 -36 -178 -115 -114 -176 -89 -95 -120 -115 -163 -180 172 227 -148 -19 -305 -44 169 -193 74 42 143 -192
1097 -192 -86 -46 -218 214 164 27 -114 -107 -72 -39 -131 -33 -40 155 -87 -20 -75 107 -203 -76 -172 -57 -293 70
1121 70 -69 -119 192 56 -84 220 26 118 -66 90 -29 34 -48 228 140 -189 105 -6 -170 217 -2 -42
1143 -42 91 -23 -14 60 -55 -19 64 -162 -19 -70 -228 -32 -5 -121 -107 -16 39 -241 264 76 -233 -90 -125 140
1167 140 -205 -8 -100 -24 104 -121 377 -19 -6 -109 172 -381 -68 -23 -233 84 32 76 -4 150 -29 260
1189 260 -143 89 -114 108 -53 78 -95 268 89 -231 -131 -116 70 -95 189 179 273 378 167 131 -153
1210 -153 -22 -274 -87 73 149 9 -253 5 -187 -109 4 -306 -126 -42 197 -124 -102 -135 39 -138 -71 -6
$$ packed form
1049a35J78j26l7J18r6L80k56M0q0L0j58J03K05l04J74k83N64l02k16J83L7J5
1071C4l5j79O4Q0j42O3Jo2Q7ok5Nm8j7L52N5l75J29k86K61K13l62K67l2J01l35
1097a92J06M0j72M32n0j37j41PL5L3r2R8pJ95k42O7n5J82l10J27r6J15k36L63
1121G0j39n0L11j36j40L04j94R2j84J56j19O3q2K76q8l29K94j11j64L87k19m0
1143d2J33j14RP4j15L6Q3k26J43n1j58J96K7j16J4R1N5k80N05j88l09J43l5K65
1167A40l45J97r2P6J28k25M98l96J3j03K81n53L13M5k10L17n2M4q0J54j79K89
1189B60m03K32k03K22j61J31j73L63j79l20J00J5J86j65K84j0R4J05k11l6k84
1210a53J31k52J87J60P6j40k62K58j92P8J13l10J80Q4K39l21K2l3J74j77O7O5
$$ plain form
1232 -6 -177 -188 -53 -68 143 53 47 156 53 227 -92 101 -154 -34 -123 67 194 128 21 -77 74 -168 -80 49
1256 49 233 -209 121 69 -12 -83 -82 111 -113 56 -126 -216 134 265 -13 82 199 -145 -55 64 21 138 -287
1279 -287 49 11 -178 94 139 -100 -171 -77 -123 -133 47 295 275 -17 37 69 22 114 -183 -258 77 -117 85 78 -58
1304 -58 -298 -56 191 -25 -89 51 4 19 129 147 -170 34 87 37 178 -47 -52 -64 -194 -50 144 181 121 -60
1328 -60 -159 -46 340 302 -123 139 171 -35 -22 -113 -110 105 147 38 -57 62 -101 336 33 42 63 196 119 -104 -155
1353 -155 -58 73 -33 168 -65 19 -22 260 -144 69 -158 -19 -18 -36 38 25 -35 -364 110 -59 -25 222 -167
1376 -167 36 95 72 42 -383 10 -27 -39 -98 117 -67 -111 82 -225 220 -177 -49 26 172 -136 -15 53 72
1399 72 -186 131 109 -309 100 183 -14 -208 22 -203 124 -68 45 -112 -55 189 213 -121 165 -96 253 -8
$$ packed form
1232fj71j1J35j5K11r0oJ09j03J74l19J93k55J20q9J90J27o6j07r8J51k42Q8J29
1256D9J84m42L30n2q1p1JJ93k24J69j82r0L50J31k78R5J17l44R0J19m3J17m25
1279b87L36l8j89K72M5k39p1R4m6j0J80K48k0k92N4L2m7R2k97p5L35j94K02pj36
1304e8k40K42K47k16o4J40m7J5J10J8l17K04N3n0J41k25nj2j30J44J94L7o0j81
1328f0r9J13L86l8m25K62L2k06J3r1LK15M2j09r5J19j63M37l03RK1J33p7k23n1
1353a55R7J31j06K01k33Q4m1K82m04K13k27J39Jj8P4j3o0l29M74j69L4K47l89
1376a67K03N9k3l0m25L93l7j2n9K15j84m4J93l07M45l97J28P5J46l08J21O8J9
1399G2k58L17k2m18M09Q3j97j94K30k25L27j92J13j57N7K44K4l34K86k61L49k61
$$ plain form
1421 -8 199 57 -24 25 44 73 -34 351 -51 168 105 -38 -239 11 -25 -21 -208 -43 301 90 167 -46 119 44
1445 44 29 66 -150 -113 -148 54 223 -145 32 90 -297 78 -188 104 65 159 -206 -55 164 -64 36 222 -31
1468 -31 13 181 -61 -303 -74 -67 1 -35 -69 -199 2 -67 -138 -12 244 -237 -347 323 -271 -91 59 -91 102
1491 102 60 378 -110 144 -110 -47 8 -175 177 -157 -111 116 226 -21 175 -210 -98 258 109 104 -209 42
1513 42 142 -7 79 103 -327 -350 -36 2 14 -117 178 431 35 134 -153 150 294 29 224 250 -317 -50 354
1536 354 38 -148 99 -158 -52 -2 160 61 -122 -237 51 -76 -90 -257 42 -80 -22 48 430 221 -180 24
1558 24 -155 217 -224 -139 -131 155 119 18 -143 -109 3 144 283 182 -47 140 -8 -461 218 188 -18 -44 47
1581 47 -199 -227 101 95 52 201 -4 104 -99 -154 -98 79 -50 148 -338 -109 87 114 -82 -251 -195 34 125
$$ packed form
1421hK07j42q1M9J9K9j07L85m02K19o3j43k01K50l6Mj87J65L44k11P7k13J65p5
1445D4j5L7k16L7l5K02J69l68J77N8l87L75k66K92l9R4l65J51K19k28J00J86k53
1468c1M4J68k42k42K29PO8l6l4j30K01o9p1J26K56m81j10O70n94J80J50j50J93
1491A02m2L18m88K54k54O3N5j83L52l34M6K27J10k47J96l85J12L56j49nl13K51
1513D2J00j49Q6K4m30k3L14L8J2j31K95K53l96R9k87L03J44k65J95K6n67K67M04
1536C54l16j86K47k57J06N0J62r9j83j15K88j27j4j67K99j22N8P0L82k09m01K04
1558B4j79L72m41Q5QK86l6j01j61L4J12J41J39j01k29J87j48m53O79l0k06k6R1
1581D7k46k8L28om3J49k05J08k03n5N6J77j29J98m86K29J96K7j96j69N6K29R1
$$ plain form
1604 125 81 81 27 -155 -203 235 206 51 -50 66 -15 188 315 -64 -157 79 -126 31 -42 -110 287 -7 -293
1627 -293 -248 -23 -127 163 72 -89 197 -270 33 -309 -49 63 -19 -34 -122 139 -178 -57 -135 182 -9 3
1649 3 231 -153 43 187 -130 51 -89 50 118 98 138 18 -18 -189 196 -141 -113 -128 283 189 -152 101 -320
1672 -320 4 -9 101 -122 -187 -201 -106 128 193 -109 3 124 160 40 70 -276 -441 158 95 188 -295 -137 115
1695 115 242 98 354 20 59 -259 273 -164 -89 -27 162 -22 21 -53 76 145 -84 44 256 -237 -221 80
1717 80 -29 132 -21 -65 -88 -29 -167 117 -74 -69 -192 -137 -25 23 77 -32 -53 35 16 -145 195 -125 -23 58
1741 58 194 -126 -57 -45 126 -183 -85 84 -8 13 74 157 -128 -17 -81 205 -53 -27 -94 172 -126 -65 -255 -242
1765 -242 66 141 19 -232 -142 5 40 135 -169 -30 89 137 -14 -42 -216 -61 -65 149 117 -50 -16 88 -91
$$ packed form
1604A25m4%n4j82m8M38k9j55j01J16q1K03J27l79r3K36k05J57p3o8L97k94k86
1627b93M5K25j04K90r1j61K86m67L03l42K60J12q2j5q8K61l17J21p8L17j91J2
1649CK28l84J96J44l17J81j40J39O8k0M0j20l6j71L85l37K8j5M11r4l41K53m21
1672c20L24j3J10k23o5j4R5K34O5l02J12J21L6j20L0l46j65N99o3R3m83J58K52
1695A15J27j44K56l34L9l18N32m37P5O2J89j84M3p4J29O9k29J28K12m93J6L01
1717H0j09J61j53m4k3N9j38K84j91Nj23N5J12M8N4j09k1Q8j9j61L40l20J02Q1
1741E8J36l20O9J2J71l09R8J69r2K1O1Q3k85J11o4K86k58K6o7K66k98O1j90J3
1765b42L08P5j22k51R0J47L5R5l04J39J19M8j51k8j74J55mK14l2j67L4J04j79
$$ plain form
1788 -91 -163 8 -39 -78 -70 -5 -28 183 19 110 68 200 -237 -36 -19 -11 -33 -23 51 27 137 -81 145 205 114 207 -292
1815 -292 192 -124 28 211 30 -324 -65 -64 -3 -143 50 33 123 221 52 -214 114 154 -21 -149 -151 -173 175
1838 175 -224 -168 -49 -98 -27 -85 -58 -1 63 -99 -57 69 69 -186 258 21 81 94 184 139 219 -51 14 44 18 -49
1864 -49 20 133 -260 -1 141 -248 -30 173 -126 253 179 237 175 -8 60 -211 -83 -141 -56 -146 -112 -123 -2 56
1888 56 -206 -37 -216 170 -270 -80 21 12 6 155 -267 25 219 293 251 61 -71 -132 39 -82 202 -111 78
1911 78 -92 179 101 -14 259 -83 46 138 132 -4 18 380 112 -109 20 -99 -1 -210 -39 243 38 -123
1933 -123 300 -59 62 102 -143 -272 77 -5 -13 -70 165 76 -187 -44 -9 283 186 -69 -32 -102 -321 116 41 -288
1957 -288 26 50 -6 64 186 167 94 -121 233 -144 16 84 -54 -49 -26 -168 -280 52 -126 -130 124 177 111 115 -54
$$ packed form
1788i1p2J71m7l9QO5k3K11j64R1m2J32m37K01J7Qk2J0P4k4J10k18K26O0r1R3m99
1815b92M84l16J52J83j81l54K59JO1j40J93j7R0R8j69k66L28M0j75j28kk2L48
1838A75l99N6J19m9P1n8K7N7O4j62M2J26%k55M44k37O0J3R0m5Q0k70O5L0k6o7
1864d9O9J13l93K59J42l89K18K03k99L79p4N8o2j83O8k71J28n8Q5r0L4j1J21N8
1888E6k62J69j79L86m40J90J01roJ49m22K92J94P4m2j90j32o1J71j21K84l13J89
1911G8j70K71p8j15K73l42J29R2oj36K2L62k68k21J29j19R8k09J71K82k05j61
1933a23M23l59J21M0k45j29L49q2qn7K35q9k63J43L5K92r7k55L7p0k19M37p5l29
1957b88L14K4n6P0J22j9p3k15L54l77J60O8j38NK3j42j12L32j78mK54N3o6Mj69
$$ plain form
1982 -54 91 8 236 -78 -16 118 -228 -143 4 12 -6 -90 34 65 19 110 64 58 215 73 -40 49 -28 137 -89
2007 -89 -197 66 36 -137 69 5 -207 -148 -80 -52 84 80 -297 44 -97 154 -48 -151 -192 -130 -2 53 -159 -47
2031 -47 141 103 225 -88 68 -87 16 29 -22 301 -103 142 245 -87 -100 290 -43 273 -99 -248 147 -2
2053 -2 84 235 -84 -164 -149 -115 30 -19 72 181 61 79 225 102 -62 94 -99 10 -7 -28 -49 72 101 -188
2077 -188 135 11 -65 -170 -7 60 -104 220 192 -262 -307 -60 16 18 -18 331 -222 -166 189 140 194 25 -78 60
2101 60 -140 86 -11 -78 75 168 35 88 13 164 206 -264 -85 -70 -41 51 87 -266 -37 -193 -114 40 -53 -141 -127
2126 -127 -353 -33 -214 203 -191 -138 297 -105 299 5 256 -98 -96 169 35 85 81 -127 -193 199 324 107
2148 107 -67 145 47 -320 34 -71 61 -74 100 -6 63 140 95 17 41 -123 -48 -133 -101 35 82 -68 -153 -52
$$ packed form
1982e4J45q3K28l14O2J34l46Q5J47Qj8q4J24L1m6R1m6oJ57j42j13Q9p7J65k26
2007h9j08K63l0j73K06o4k12N9O8K8J36ml77L41j41K51k02j03m1O2J28N5k12J12
2031d7J88l8J22l13J56j55J03J3n1L23m04K45J03l32j3L90l33L16l72j49L95j49
2053bQ6J51l19q0J5L4J45m9R1J09j20J8J46j23j64J56j93J09j7k1k1J21K9k89
2077a88L23j24p6j05J63O7j64L24k8m54m5K47P6Kl6L49n53N6L55m9N4j69j03J38
2101F0k00K26r7o7J53R3j33N3p5J51M2m70J79J5K9R2L6l53K29j56P9J54r3q8J4
2126a27k26L20j81M17l94N3M35m02M04k94K51l54KK65j34N0mk08o6L92J25k17
2148A07j74K12r8l67L54j05J32j35J74j06O9P7m5p8K4j64P5q5L2J36M7j50q5J01
$$ plain form
2172 -52 189 -3 -192 -216 -155 272 265 -103 189 14 -269 100 -306 -20 345 -18 -169 -323 63 179 83 -173
2194 -173 69 -130 -204 -351 -235 43 -134 -320 -37 -8 -36 7 -74 12 97 -97 -49 85 19 177 78 -129 -80 146
2218 146 168 259 45 -110 -154 -112 22 106 62 -92 -38 -27 71 228 -24 -22 46 180 -42 -48 39 45 34 186 157 38
2244 38 -55 2 -60 -86 159 -281 101 -123 2 -81 -64 -19 193 276 -182 52 102 148 -100 8 114 -157 -104 11
2268 11 -430 273 204 -76 -52 42 87 1 -46 7 -239 -7 45 141 302 -245 -85 162 154 -155 17 74 -160 12
2292 12 -59 24 -137 -169 -27 38 48 115 -188 -152 94 -87 24 11 -181 97 -3 -135 -129 86 68 -71 138 88
2316 88 -229 80 102 90 19 17 67 13 -137 -105 272 168 -51 76 -128 -38 -245 -167 -12 0 -5 105 13 240 326
2341 326 -23 -98 -30 -9 -136 -184 -27 -6 4 -108 196 -50 -180 10 108 -88 38 98 118 118 -18 199 151 216
$$ packed form
2172e2K41j92j89k4O1M27pl68K92j75k83L69m06K86L65l63j51j54L86J16r6k56
2194a73K42j99p4j47J16K78j77j86K83K9k8M3q1Q6Q5j94M8J34o6J58r9k07M9K26
2218A46K2R1k14j55m4M2J34Q4m4j54N4J1R8J57k52KO8J34k22oQ7Oj1J52k9j19
2244C8r3N7o2k6K45m40L82k24J25q3J7M5K12Q3m58K34N0M6k48J08J06k71N3J15
2268A1m41P03o9k80K4R4M5q6m7N3k46K32N2R6J61n47J60K47ql09J72N7k34J72
2292A2p1Q3j61l2J42O5J0O7l03L6K46j81J11j3j92K78j00j32OK15j8j39K09n0
2316H8l17L09K2j2p1kN0n4j50L2L77j04k19J27k04R0k07P8J55J2nJ10r2K27Q6
2341C26l49p5O8K1j27m8J57K1J0j12L04k46j30J90R8j96J26O0K0%j36K17m8O5
$$ plain form
2365 216 -108 36 79 30 94 25 138 171 154 -137 -95 103 -294 -167 -89 111 64 -43 -17 91 22 130 131 27
2389 27 60 -91 -53 8 354 -88 89 87 -165 -238 34 -44 -275 -123 188 24 -33 -7 115 183 -77 36 -150 266
2413 266 10 -255 114 128 280 -11 -237 -92 83 -86 128 190 -230 7 -91 -52 290 156 -216 36 40 -75
2435 -75 170 -52 -1 -158 -2 85 -89 95 170 127 97 85 16 188 -77 -131 -62 -121 -201 271 100 41 246 -28
2459 -28 41 64 -118 -17 42 -8 -177 -206 152 39 208 106 183 169 133 38 52 -104 -60 32 82 138 5 -20 -52 2
2485 2 -230 -109 -183 -38 63 288 27 112 10 85 -20 9 22 -125 370 120 -181 -70 -144 -87 -65 -319 -146
2508 -146 -115 -289 87 52 97 101 -5 -7 46 -344 -10 -10 215 -73 288 318 -52 -45 58 280 199 -245 -81 76 -210
2533 -210 268 41 -211 -97 221 194 -10 112 -109 -162 -44 30 209 -84 118 -160 143 49 -115 -176 -54 -199
$$ packed form
2365B16l24J44M3m9O4o9J13L3j7k91M2J98l97J27P8K00m7j07K6J08o9J08Jj04
2389B7L3j51L8O1L46m42J77kk52p3K72p8k31J52L11j64n7K6J22O8k60J13j86M16
2413B66k56k65L69J4J52k91k26J45J75j69K14O2m20K37r8L9L42j34l72K52Mj15
2435g5K45k22N1j57J56Q7j74J84P5m3l0j2o9J72k65n4O9n9q0M72j71n9K05k74
2459b8O9K3j82J01N9n0j69k9L58j13J69j02P7j4l6r5J4j56M4R2N0N6j33k5l2N4
2485Bk32J21p4J45J01K25k61Q5j02P5j05K9J3j47M95k50l01J11p4N7K2k54J73
2508a46L1j74L76l5M5Mj06kN3l90L34%K25k88L61L0l70PJ03K22q1m44J64J57k86
2533b10M78k27k52J14L18k7k04J22k21n3J18P4J79k93K02k78L03r4j64o1J22j45
$$ plain form
2555 -199 -94 -200 -84 151 -123 141 132 145 9 -254 -16 139 -195 -218 168 216 -93 102 -60 16 -242 98
2577 98 154 -248 -221 -103 83 -248 -145 -27 -220 193 -184 27 -182 -152 24 -162 -219 175 219 20 141 106
2599 106 183 69 -259 -67 125 -58 291 -63 153 -36 -47 -161 -49 -60 64 -179 -208 -72 14 -102 -60 134
2621 134 63 52 7 45 -210 84 53 -5 -152 19 166 202 128 43 -14 -156 140 12 140 -137 279 -28 -196
2644 -196 158 25 -44 -31 43 31 150 106 -209 -126 22 -131 -196 -93 -1 -46 -87 -167 -15 -11 -23 -53 -119 -269 143
2669 143 -281 106 78 258 130 -332 -57 77 -145 29 253 25 145 -203 -27 -177 126 -51 63 120 -67
2690 -67 29 -79 -243 119 55 91 -95 -16 167 248 -100 6 -50 -134 151 -150 143 -46 193 90 90 11 49 -57
2714 -57 206 120 8 1 58 228 -277 -71 -63 4 -43 19 -48 -144 -89 11 20 54 6 -114 66 196 45 97 97 192 96
$$ packed form
2555a99J05j06J16K35k74K64rJ3j36k63K38J55l34k3L86M8l09J95j62P6k58L40
2577I8N6m02K7J18J86l31J03J18j93M13l77K11k09L0J76j86n7L94M4j99J21l5
2599A06P7j14l28J92J92j83L49l54K16j89j1j14J12j1J24k43k9J36Q6j16M2J94
2621A34p1j1m5L8k55K94l1n8j47J71J47L6p4q5n7j42K96j28J28k77M16l07j68
2644a96L54j33o9J3P4j2J19m4l15Q3J48j53o5J03R2m5m1q0J52Mj2l0o6j50M12
2669A43m24L87k8J80j28m62K75J34k22J74K24k28J20l48J76j50L03j77J14N7j87
2690f7R6j08j64L62o4L6j86P9J83Q1l48J06n6q4K85l01K93j89K39j03%p9L8j06
2714e7K63q6j12pN7J70n05K06QO7m7O2o7r6N5J00RL4m8j20J80J30j51N2%R5r6
$$ plain form
2741 96 -19 -49 -33 58 28 -172 185 73 34 100 18 327 295 201 49 322 -80 12 -249 -237 -352 65 48 -153
2765 -153 -15 90 49 -64 -52 -95 -9 59 135 -76 63 -165 127 -277 109 24 -74 -228 -162 34 304 44 300
2788 300 -199 -32 -5 189 -2 34 268 -119 36 -117 62 67 1 18 117 58 -11 -281 157 111 75 39 -12 -59 -132
2813 -132 235 17 -255 201 216 36 207 160 105 -30 266 50 -244 -83 120 -2 41 270 64 -56 284
2834 284 -47 130 51 94 195 -165 -45 88 -86 -19 105 49 -93 249 44 -146 -116 -43 -266 122 198 210 -119
2857 -119 97 -70 -42 -55 33 26 -313 -303 -160 59 96 14 -4 109 -52 62 106 -27 -103 234 136 140 158 83 -106
2882 -106 144 269 -101 -54 56 -186 -27 -121 183 -27 -239 -79 -62 63 256 31 82 222 -217 -58 -65 89
2904 89 -26 -8 147 33 46 137 -29 -82 53 196 -187 140 -84 54 302 50 57 171 -61 -86 38 -96 143
$$ packed form
2741I6j15l0J6R1l0k00L57j12l9O6q2L09l2r4j52K73m02R2k61J2j15M17j7k01
2765a53J38J05m1j13J2m3Q6O8P6k11J39k28K92m04L86q5r8j54O6J96K70k60K56
2788C00m99J67K7J94j91L6K34l87J55j53J79No6J7R9n9o9k70M38m6l6l6n1m7p3
2813a32L67k18k72M56J5j80J71m7n5j35K96k16k94J61K03j22M3K29k06j20L40
2834B84l31J77p9M3J01l60J20J33j74O7J24n6j42L42k05j90L0P3k23L88P6J2l29
2857a19K16j67K8j3Q8pl39J0J43K19L7q2j8J13j61J14M4j33p6L37r8MJ8p5j89
2882a06K50J25l70M7J10k42J59r4L04k10k12J60J7J25J93k25N1J40m39J59pJ54
2904H9j15J8J55j14J3R1j66n3J35J43l83L27k24J38K48k52PJ14k32k5J24j34K39
$$ plain form
2927 143 52 68 26 127 68 -210 -28 -3 -41 -78 158 75 -155 -32 -4 46 -207 42 -192 -225 -73 -40 -17 -79 0
2952 0 106 -54 -85 -134 -180 -80 -140 37 208 -82 -59 101 -240 113 47 267 -182 -200 50 -54 -38 251 53
2975 53 259 41 99 -34 -203 -35 -249 29 29 58 68 293 6 -49 330 8 -110 203 -88 67 174 -196
2997 -196 -36 -170 89 76 -239 -102 98 -225 147 -215 61 -174 -6 32 -480 8 267 254 -98 151 -47
3018 -47 -48 -119 84 12 -398 -101 -92 227 137 -93 -144 136 181 -170 87 -277 -171 73 118 -108 76 -192 -108 -131
3042 -131 -341 48 85 60 143 242 108 -208 -248 42 164 -14 -72 -96 -327 121 66 -126 46 224 41 34 -58 -32
3066 -32 29 -16 66 129 129 92 47 85 -77 64 100 173 -139 -75 63 -120 -41 46 162 -143 34 -116 125 -88 -92 13
3092 13 9 -48 71 -62 5 258 -197 2 -39 -139 -187 -95 106 83 169 48 -208 -6 -16 215 161 -125 55 65
$$ packed form
2927A43r1J6m2J01n9k78J82K5l8l7K36q3k30J23K8N0k53K49k34l3J52L3K3o2P9
2952@J06j60l1m9m6J00o0J77J71k90K3J60l41L53o6K20m49j8K50j04J6K89j98
2975E3K06k18N8j33j69J68k14K78%K9J0K25k87n5L79l22j18L13k91J55J07l70
2997a96J60j34K59j3l15J37K00l23L72l62K76k35J68L8n12M88K59j3l52K49j98
3018d7jp1K03p2m10K97RL19r0k30n1K80M5l51K57l64J06K44M5k26J84k68Q4k3
3042a31k10L89L7k5Q3R9j34l16m0K90J22j78n8k4k31M48n5j92J72J78j83pr2K6
3066c2O1m5Q2O3%l7m5L8j62J41L6P3l12O4J38j83P9Q7J16l05J77j50K41k13mJ05
3092A3mn7J19j33O7K53m55J99m1j00m8R2K01k3Q6j21k56K02j0K31n4k86J80J0
$$ plain form
3116 65 -35 1 145 -35 79 -209 12 -103 51 331 63 -63 -145 43 90 -10 -130 14 121 86 -210 -30
3138 -30 105 -268 67 3 -26 49 -159 -4 14 199 -46 -46 186 8 146 -331 -20 145 76 -94 128 168 -36
3161 -36 -151 -39 12 9 43 68 279 -149 90 95 15 13 -35 155 97 203 266 -141 52 -270 218 321 -165 97 127
3186 127 186 27 -76 111 -109 44 -8 154 5 -201 124 54 148 -109 -139 279 -235 201 106 100 -138 -212 -263
3209 -263 52 -1 111 507 64 383 -143 267 161 -280 38 -135 83 96 20 -68 -30 -31 -268 -85 137 16
3231 16 -19 -120 -103 -47 2 191 58 -33 -16 364 -117 330 -235 -37 -109 -59 172 -35 -159 48 157 -72 248
3254 248 85 313 93 26 200 -290 -51 -222 52 -140 320 229 -18 -59 152 19 -92 174 -164 -194 -58
3275 -58 35 33 44 -5 172 -55 -240 252 219 -11 1 -136 37 -222 -282 154 -40 -5 -11 18 -38 -122 -208 -58 -311
$$ packed form
3116F5j00L6J44j80J14k88K21j15J54K80k68j26q2J88M7j00j20J44J07l5k96J80
3138c0J35l73L35o4k9P5k08J55J8J85k45%K32j78J38m77L11J65o9j70K22M0k04
3161c6j15J12N1lL4K5K11m28K39Nq0km8J90n8J06O3m07J93l22M88J03m86K62L0
3186A27N9j59j03J87k20J53n2J62j49k06L25p0R4k57l0M18n14M36r5ok38p4n1
3209b63L15n3J12L96m43L19n26M10j06m41L18j73K18J3p6q8L8jk37J83K22j21
3231A6l5j01J7N6M9J89j33r1J7L80m81M47n65J98p2N0K31k07j24K07J09k29L20
3254B48j63K28k20o7J74m90K39j71K74j92M60r1k47m1K11j33j11K66l38l0J36
3275e8R3kJ1m9J77k27j85M92l3k30J2j37J73k59o0M36j94L5oK9n6q4q6J50k53
$$ plain form
3300 -311 -191 269 104 -48 -237 -63 152 26 72 -109 79 251 82 -76 -173 -179 165 -67 -148 335 281 -176
3322 -176 -48 131 155 130 -75 -132 -333 -51 129 94 287 -84 80 -228 -79 -119 86 -65 -140 -223 -111 199
3344 199 -170 66 160 -6 -22 75 302 131 -161 -102 144 -201 197 29 130 93 -81 172 -289 -153 56 -15
3366 -15 -158 196 -80 141 -49 251 320 -131 2 169 195 105 50 281 -74 95 71 100 -49 -5 57 -15 -39 16
3390 16 -153 -17 -181 -180 -113 153 254 -153 67 -280 256 53 40 -30 107 -137 103 -16 159 21 109 -103
3412 -103 145 157 72 -41 -112 204 31 177 -114 112 131 39 18 -246 -137 -1 -74 -14 241 157 -34 -111 120
3435 120 49 20 261 14 -58 -151 -288 96 -119 134 329 -22 61 -126 242 -117 151 -190 -94 -12 -295 100
3457 100 180 -9 -84 -463 -150 -40 106 2 206 32 -83 205 132 315 251 -36 124 -272 42 261 -23
$$ packed form
3300c11J20M60j65j52j89J74K15j26M6j81J88J72j69j58r7oL44k32q1M83n4m57
3322a76J28J79K4k5k05n7k01K82J80l5J93l71J64l08J49m0K05j51p5q3J12L10
3344A99l69K36R4j66j6R7K27j71k92N9K46l45L98j68J01l7j74K53m61J36K09p1
3366a5j43L54k76K21j90L00O9m51J33J67K6r0n5K31l55J69k4K9j49M4O2p2k4N5
3390A6j69J36j64JO7K66J01m07K20l47N36k03j3p0J37k44K40j19J75j38Q8k12
3412a03K48J2q5j13p1L16j73J46k91K26J9r2k1k64J09J36p3O0K55q4j91p7K31
3435A20p1k9K41k47p2r3j37L84k15K53J95l51Q3j87L68l59K68l41R6Q2k83L95
3457A00Q0j89p5l79L13J10J46j04K04j74j15K88p3J83o4k87J60l96L14K19k84
$$ plain form
3478 -23 -37 -258 -45 -123 -79 -171 35 148 187 213 1 -13 112 -229 48 237 82 -83 -84 75 -187 -120 -142 122
3502 122 166 -14 -143 133 -102 162 -151 -173 84 -216 61 307 137 -167 311 49 -122 67 -23 -3 -109
3523 -109 134 -307 75 -56 -38 22 -154 -188 30 166 89 -53 149 -71 -103 -361 91 -149 -214 105 89 -45
3545 -45 -57 141 -52 6 129 -65 -92 117 -48 29 60 -75 38 -194 80 98 265 -172 -19 63 189 -4 -42
3568 -42 119 -23 65 177 70 62 70 -11 -112 39 338 -141 64 142 -41 157 -80 -8 -142 135 29 -7 151
3591 151 -49 245 128 1 -46 200 -16 -20 181 -19 108 -26 33 -89 -190 -36 118 -260 68 57 5 35
3613 35 236 68 -41 31 135 180 -141 -67 224 202 222 -38 225 -43 -5 73 59 -219 -114 -62 -65 232 125 -15
3637 -15 161 28 -95 -47 -234 -94 -71 258 266 159 40 -76 -172 57 295 -199 -48 66 228 37 116 -275
$$ packed form
3478b3j4k21K13p8M4r2K06J13L9K6k12j4J25l41K77J89j55j65jJ59k62O7k2K64
3502A22M4j80j29K76k35K64l13k2K57l00K77K46j70l04M78k62j71J89r0K0j06
3523a09K43m41L82j31J8O0j76l4K18J36p7j42K02k20l2k58M52k40o5L19j6j34
3545d5j2J98j93N8J23j94k7K09j65P7L1j35J13k32K74J8J67m37J53Q2J26j93l8
3568d2J61j42Q8J12j07qQq1j01J51K99m79K05P8j83J98k37P2j34K77j06l6J58
3591A51k00K94j17j27m7K46k16mK01k00J27j34N9j22j01J54J54l78L28j1n2L0
3613C5K01j68j09P2J04M5l21P4K91k2K0k60K63k68L8P8j4k78J05N2lK97j07j40
3637a5J76j33j23M8j87J40K3L29Qj07j19j16r6K29K38m94J51J14J62j91P9l91
$$ plain form
3659 -275 239 274 -78 -201 104 157 -6 -7 -176 -65 110 -187 -48 90 39 -40 17 -169 42 -57 90 166 -36
3682 -36 -79 145 -31 -101 18 64 113 238 -163 119 184 -79 25 189 7 -221 44 193 -22 84 -106 152
3704 152 -287 54 93 32 65 37 -211 -290 -368 -57 -59 -222 76 -75 133 -88 -39 92 90 -128 -116 -36 137 -105
3728 -105 102 276 -108 -146 119 192 145 252 -267 -46 102 192 -45 80 118 -128 136 42 4 -175 94 135 177
3751 177 128 -41 44 -84 -77 152 -237 151 250 -100 355 50 34 -168 162 -51 95 95 -9 62 -206 -213 -183 -18
3775 -18 74 -42 152 98 30 20 160 246 -109 -84 -137 53 51 -61 -26 -107 -43 127 -391 -69 45 59 69 178 158
3800 158 -65 35 -90 -153 306 193 116 -42 299 -263 80 91 -55 -14 -93 57 -102 59 87 36 291 -73
3822 -73 -176 -107 102 -53 -332 222 -32 -52 42 159 145 207 -92 -46 -32 251 77 -49 -217 -214 -12 263 -30
$$ packed form
3659b75N14L5l52j23L05N3j63jj69J11J75k97J39J38n1p9N7j86K11r9J47P6k02
3682c6m3K24j76p0J19M6M9J25m01K82O5k63J04J64j82k28K65J49k15J06j90K58
3704A52m39L41L9o1L3k8k48p9p8L11kj63K98j51K08k21M9J31kk18J2Q0J73k42
3728a05K07J74l84l8K65P3m7J07n19K21J48R0k37J25L8k46K64r4l8j79K69M1M2
3751A77m9j69Q5j28PK29l89L88R9l50M55l05j6k02L30k13J46%j04P1k68pL0J65
3775a8R2j16J94n4o8j0J40Q6l55K5n3J90kj12L5q1O4J70n18L22J14J4J0J09k0
3800A58k23J00j25o3M59j13p7j58L41n62L43J1j46M1p9J50j59J61K8n1K55l64
3822g3j03O9K09j55k79N54k54k0R4J17j4O2k99M6J4K83j74j26j68LK02K75k93
$$ plain form
3845 -30 -101 -135 131 -197 -138 244 170 71 150 -8 153 245 -214 90 316 -21 -74 55 -287 -147 -129 -174 -152 -185
3869 -185 -21 -101 -156 15 25 18 -168 17 -118 111 -40 11 122 13 -188 58 -42 68 -69 -55 125 -154
3891 -154 -36 30 71 -42 -5 -139 210 136 141 163 176 29 43 167 -96 207 -117 -32 113 -62 57 -245 -228 -13
3915 -13 61 192 235 -279 79 84 213 -170 -212 -8 51 -146 133 -199 -134 -257 20 48 34 -49 -151 -161 -188 64
3939 64 92 245 157 8 298 -153 -144 0 267 -82 53 339 214 153 -16 -99 153 180 -77 -143 -75 308 -97
3962 -97 31 61 -173 24 -304 -163 -99 -24 88 -170 19 65 222 -60 -143 -21 231 -267 -177 -153 7 -147 -244
3985 -244 -106 25 -18 -128 -93 -75 164 -44 31 -211 -254 -119 -270 -10 -2 -227 262 7 171 217 80 -60 150
4008 150 26 -194 -157 -48 -50 -192 16 82 51 -89 -23 138 -154 187 -67 55 6 188 -50 209 85 236
$$ packed form
3845c0p1l4K66l28N9L82p4r9P9j58J61R2m59L04K26l37n3J29l42J40J8m5K2l3
3869a85J64q0n5J71J0pj86J85j35K29j51N1J11j09k01K46j00J10j37J4J80k79
3891a54J18O6M1j13L7j34L49p4NK2J3j47J4J24k63L03l24Q5J45j75J19l02J7K15
3915a3P4J31M3n14L58NJ29l83m2K04N9j97K79l32O5j23K77K8j4q3j02j0k7K52
3939F4K8J53q8j49K90m51RJ44K67l49J35K86j25o1j69q3K52K7k57o6O8L83m05
3962i7J28L0k34J97l28J41O4P5J12k58J89M6J57k82q3J22K52m98R0K4J60j54r7
3985b44J38J31m3j10L5J8K39k08P5k42m3J35j51K60Qk25M89k55J64M6j37j40K10
4008A50j24k20L7J09kj42K08O6l1j40O6J61k92L41k54J22m9J82k38K59j24J51
$$ plain form
4030 236 122 233 4 -104 130 -38 -76 -130 173 152 -34 184 4 -99 -26 23 -212 -208 -33 -59 106 -118 132
4053 132 -382 194 227 -169 49 23 82 170 58 -83 143 -63 -204 -73 -51 -36 -82 -170 126 148 -7 88 48 -55
4077 -55 257 2 -84 11 -44 -21 49 -15 -130 69 -10 -67 59 -188 51 -193 233 -311 -50 156 -69 -189 -66
4100 -66 82 -120 315 -65 127 72 -8 238 59 126 37 16 85 84 -92 -196 -69 -155 79 264 133 -44 -85 17
4124 17 -11 267 -169 191 12 253 22 -43 77 -36 -34 99 -216 57 147 12 -51 87 126 -107 68 28 38
4147 38 -13 93 -160 145 -182 -15 94 -159 -16 -35 48 -69 286 -88 36 23 126 -123 108 165 -65 10
4169 10 279 -87 139 85 81 -310 207 -38 247 140 11 -176 147 396 283 151 -146 279 224 -9 -235 115
4191 115 42 -10 149 130 67 32 -92 -118 -58 -71 -21 -450 224 -125 -139 355 145 -238 -33 -69 -159 -50 6 286
$$ packed form
4030B36j14J11k29j08K34j68l8n4L03k1j86K18j80j03P3M9k35MJ75k6J65k24K50
4053A32n14N76L3l96K18k6N9Q8j12j41K26k06j41J31K2J5m6q8K96K2j55R5m0j03
4077e5L12k55q6R5n5K3P0o4j15J99p9n7J26k47K39k44M26n44K61K06k25j20J23
4100f6J48k02M35l80J92n5q0K46j79O7q9k1O9jj76j04J27q6K34J85j31j77m1J02
4124A7k8K78m36L60j79K41k31o5J20j13KJ33l15K73R0j35o3J38L9k33J75m0J0
4147C8n1J06k53L05l27J67J09k53J43j9Q3j17L55l74J24j3J03k49K31N7k30P5
4169A0K69l66K26n4ml91N17k45K85j07j29j87L23K49j13j32k97M25n5k33k26L50
4191A15p3n2J59j9o3l5j24k6O0j3N0m29O74l49j4M94k10l83K05l6r0J09N6K80
$$ plain form
4215 286 131 161 -136 50 -51 32 -27 77 -98 -193 -25 -74 -31 -86 -27 94 144 -17 111 -96 -267 -110 -55
4238 -55 208 -188 103 36 81 44 -108 -60 -25 -178 82 85 220 90 119 48 -69 39 -24 -111 48 187 -51 207
4262 207 -39 -126 291 -76 -147 -43 -163 -12 85 136 186 -65 -116 64 185 38 242 -37 -121 153 -34 220
4284 220 147 -148 -73 119 115 -71 79 35 134 201 -27 -125 252 -202 -128 180 -60 -64 11 25 5 -75 -114 -84 278 -105
4310 -105 174 -95 108 -177 -301 167 -20 -105 -59 -24 4 -210 -45 -92 -105 269 -104 211 -203 127 -203 -88
4332 -88 -19 104 53 -53 178 193 146 -251 -1 -72 57 -229 -166 -156 -2 -70 243 238 177 19 -70 14 -2 15 61 -11
4358 -11 220 -21 105 161 230 131 -95 364 -43 -119 -102 -245 -60 10 236 148 -112 226 80 30 -106 -75 -174 2
4382 2 -137 -79 78 233 -55 99 -161 23 -216 64 -132 139 -103 -24 -67 -20 192 103 -39 -57 86 -17 381
$$ packed form
4215B86j55L0k97J86j01Q3n9J04j75r5J68m9M3n5N9J21N0j61J28k07j71J57N5
4238e5K63l96K91o7M5l7j52M8L5j53K60LJ35j30K9p1j17J08o3q7J59J39k38K58
4262B07k46q7M17l67p1J04j20J51R7N1N0k51n1J80J21j47K04k79q4K74j87K54
4284B20p3k95P5J92mj86J50m4R9O7k28r8L77m54P4L08k40mP5J4k0q0l9L0L62l83
4310a05K79k69K03k85j24M68j87q5M6L5K8k14J65m7j3L74l73L15m14L30l30J15
4332h8O9J23n1j06K31J5m7l97K50p1J29k86O3J0J54o8L13no1j58q9Q4j6J7M6p2
4358a1K31k41J26N6O9r9k26M59m07p6J7j43J85P0K26q8k60L38j46n0j36L1r9J76
4382Bj39N8J57J55k88J54k60J84k39K80j96K71k42P9m3M7K12q9j42j8J43j03L98
$$ plain form
4405 381 -60 103 278 -60 53 137 107 -275 60 -74 -192 -49 -96 -348 238 25 -76 -36 -51 -125 -98 291
4427 291 -41 29 -37 -51 -11 -144 140 -172 65 68 -48 13 210 171 -23 -112 129 -44 232 -113 83 -42 389
4450 389 87 24 -122 -92 67 -106 -14 199 254 -41 -186 -4 6 -180 149 114 152 5 279 55 75 99 -437
4473 -437 -225 -51 112 17 -5 -3 -168 94 253 -185 -198 -190 -155 -208 -121 255 74 7 -42 -160 -204 87 -95 80
4497 80 143 -82 183 101 -100 174 -85 -15 -78 108 181 -416 108 140 -102 -4 -234 -3 50 138 -2 20 -162 152
4521 152 -120 -225 61 -109 183 -85 -31 52 6 -106 -115 -126 72 -113 65 -160 -137 14 152 -86 -96 40 121
4544 121 -42 6 70 82 43 -160 63 -255 179 238 50 -340 19 -135 232 -61 -107 190 89 -49 -17 21 110
4567 110 -174 42 -15 61 155 -116 41 -48 146 -4 -56 91 161 -49 -58 288 -102 93 63 -188 93 170 48
$$ packed form
4405C81m41J63J75l38J13Q4l0l82L35j34j18J43m7k52N86k13j01M0j5p4K7L89
4427B91l32P0o6j4M0j33K84l12K37Lj16O1J97l9j94q9K41j73K76l45J96j25M31
4450C89l02o3j46L0J59j73R2K13N5k95j45J82J0j86L29l5L8j47K74k24K0K4n36
4473d37K12J74J63r5k2Kj65K62J59m38j3QL5n3Q7L76j81o7m9j18m4K91j82J75
4497H0O3k25K65q2k01K74k59P0o3J86P3n97N24L2k42R8k30K31N3Q8j40K2j82L14
4521A52k72j05K86j70K92k68N4Q3m6j12rj1J98j85J78k25K3J51J38k38j0J36Q1
4544A21j63M8O4J2l9k03K23l18M34N9j88l90L59j54L67k93m6K97j01j38L2L8Q9
4567A10k84K16n7P6R4k71J57q9J94j50n2J47P0k10rL46l90J95l0k51K81P7j22
$$ plain form
4590 48 -125 -125 -77 -211 -201 -56 -5 86 -59 -19 68 219 -25 -57 -50 -194 102 -270 -77 -131 108 -21 -117 57 -68
4615 -68 -236 104 86 119 -129 -147 45 -22 -230 -114 105 -45 -48 -175 17 342 -13 -97 -75 319 154 -307 67
4638 67 155 -150 -280 113 -282 -148 -199 191 91 49 82 34 230 201 74 -29 45 -98 -50 -5 12 -60 118 160
4662 160 165 149 59 -43 87 42 -62 -150 185 -160 -336 -58 89 -28 -6 78 -298 -45 -78 338 -91 -29 -29 -140
4686 -140 16 -26 141 -15 -155 -27 -105 112 66 40 -235 133 -22 -242 155 -8 -150 29 -112 -22 123 -264
4708 -264 -119 129 156 -241 88 -72 101 -267 50 353 99 6 -72 71 136 88 -73 220 -219 -118 -3 54
4730 54 14 -5 62 -66 50 -39 -363 24 7 -20 198 25 118 62 148 -156 -182 46 -142 -12 14 -64 272 209 -57
4755 -57 -95 -51 -75 -158 164 -276 -74 85 1 257 144 112 155 -116 -30 36 -68 61 190 -125 -102 -187 -366 -65
$$ packed form
4590D8j73%M8j34J0J45N1R1j45M0Q7J51k44l2Pj44K96l72J93n4K39j29r6J74j25
4615f8j68L40j8L3k48j8J92o7k08J16K19j50lj27J92L25l55q4K2L94j65m61L74
4638F7Q8l05j30L93l95J34n1L90j00m2L3m8J96k9j27j03P4j43M8M5J7p2J78M2
4662A60Nj6r0j02J30m5j04q8L35l45j76K78J47j17K2Q4l76K53l3M16m29O2%j11
4686a40J56m2J67j56j40J28p8K17m6k6k75L68j55k20L97j63j42J79j41R0J45l87
4708b64J45K48K7l97L29j60J73l68L17L03k54r3p8J43O5m8j61K93m39J01J15N7
4730E4m0j9O7j28J16q9l24L87j7k7K18j73R3n6Q6l04k6K28j88J30K6p8L36o3k66
4755e7l8M4k4q3L22m40K02J59q4K56j13l2M3k71Q6O6j04J29J29l15K3q5j79L01
$$ plain form
4779 -65 -2 180 -3 -75 -208 68 -67 38 75 -59 -94 -115 54 -49 73 -193 -64 -12 187 31 196 -119
4801 -119 -101 -348 91 -55 78 58 17 -39 -210 39 -72 86 16 -57 195 -166 -109 -83 284 30 103 238 -68
4824 -68 -197 43 99 106 -73 -219 -34 113 -59 5 -44 -19 8 -160 -353 -16 -9 123 -41 -154 172 -109 -214
4847 -214 -248 -27 -203 -6 -3 9 -67 187 -315 36 158 127 -93 24 -50 72 326 -14 218 29 -115 136
4869 136 130 -57 108 -11 -17 -120 -80 -119 -59 246 107 43 -54 152 -35 22 -86 -191 -54 -227 60 91 -193 17
4893 17 -25 -218 -34 197 160 55 -53 227 49 -155 20 -134 -57 119 -44 89 134 -127 141 21 -3 -161
4915 -161 202 -34 -91 22 -45 398 241 -271 -24 284 -71 96 78 3 241 39 -348 52 -61 -68 -265 -186
4937 -186 50 -90 95 -113 -110 -18 -104 99 11 -113 -58 231 92 -32 -33 74 33 365 -88 22 -140 46 231
$$ packed form
4779f5O3J82j83p2j33K76j35J05L7j34l5k1J69j03J22k66J29N2J99j56J65l15
4801a19J8k47M39j46J33k0m1n6j71K49j11J58p0p3K52l61N7K6L67k54P3J35l06
4824f8j29K40N6Pj79j46J85J47j72O4m9K5K7j68j93L37PJ32j64j13L26k81j05
4847b14l4K21j76J97LJ2p6K54n02L51J22l1k20J17p4J22K54l40K32j89j44K51
4869A36oj87J65j19oj03M0l9O0L05j39o4r7K06j87N7j08j05J37j73K87L1k84K10
4893A7m2j93J84K31l7j05j08K80j78k04J75j54P7J76j63J33M5k61K68j20k4j58
4915a61L63k36n7J13o7M43j57n12K47L08l55J67j8p5K38k02l87M00j13pj97P9
4937a86K36j40J85k08LR2q6K03q8j24N5K89j39j24jJ07m1L32m53J10j62J86J85
$$ plain form
4960 231 -44 218 -255 -132 0 212 -132 2 162 132 -19 8 -170 21 -54 50 500 196 60 -38 67
4981 67 252 -233 41 -107 -314 190 66 46 26 -28 -110 -90 -30 346 -89 -187 -8 -160 -138 355 -121 -4 -50
5004 -50 173 -18 22 -183 65 64 -105 -97 -159 81 -51 45 -55 331 39 4 345 -149 -222 4 -248 332 -101
5027 -101 -235 -17 -23 60 -112 -182 -21 -77 -185 -49 -119 92 26 -140 -76 94 -134 59 95 -101 180 194 7
5050 7 -102 -128 -230 -137 -229 186 244 -232 34 -2 52 183 -24 -154 -93 -233 -173 204 -109 -156 58 -24 69 -225
5074 -225 -316 -128 -61 111 -107 -26 -47 -14 -161 17 133 176 -110 14 15 176 38 -67 140 30 -135 36 10
5097 10 -178 117 7 147 113 136 -176 -66 -57 -35 107 -74 -186 -176 -149 -50 33 -212 143 -306 299 155 278
5120 278 99 -109 -181 -132 -9 191 -186 128 -16 262 279 5 -120 164 -84 195 21 49 -104 9 -88 148
$$ packed form
4960B31k75K62m73J23J32K12l44J34J60l0j51K7j78J91p5J04M50l04j36r8J05
4981F7J85m85K74j48k07N04j24k0k0n4q2K0O0L76m35r8J79j52K2M93m76J17m6
5004e0K23j91M0k05K48jj69Qo2K40j32R6j00L86k92l5L41m94p3K26k52N80m33
5027a01j34K18oQ3j72p0J61n6j08J36p0K11o6j66O4J70k28J93L6j96K81J4j87
5050Gj09k6j02R3r2M15N8m76K66l6N4J31k07j30O1j40O0L77l13m7K14q2R3k94
5074b25r1J88O7J72k18Q1k1L3j47J78J16M3k86J24JJ61j38j05K07j10j65J71k6
5097A0j88K95j10J40l4K3l12J10RK2J42j81j12J0K7R9Q3k45L55m49O05j44J23
5120B78j79k08p2M9J23K00l77L14j44K78J7k74j25K84k48K79j74K8j53J13r7K36
$$ plain form
5142 148 -202 -129 -76 19 132 73 -195 176 19 -293 34 232 345 -92 -138 -52 187 -60 -11 10 51 -15 48 -38
5166 -38 -153 78 -35 15 69 211 150 -79 -18 45 -22 34 101 -262 350 -71 -82 133 -18 217 10 5 107 -180
5190 -180 -50 86 -130 -320 69 -150 27 59 145 -11 126 -75 -74 -19 289 -44 -226 202 18 193 259 89
5212 89 85 -89 80 152 -126 60 33 230 -40 -128 26 -37 62 -57 -233 62 5 -125 -20 211 -62 -44 -305
5235 -305 -63 -217 111 19 -187 -199 69 22 144 -128 170 87 -234 58 86 40 162 -126 321 -245 96 -3
5257 -3 3 -232 6 -62 6 114 -212 -104 -79 -238 -216 120 -37 -209 -241 159 163 74 -164 -65 -29 94 3 1 49 -135
5283 -135 -62 -91 -260 -70 193 124 -19 101 -56 -14 63 184 214 -157 81 51 -117 35 107 -225 -120 -77 -265
5306 -265 -43 -327 -258 79 91 48 64 157 -36 102 59 58 31 -21 176 -115 104 80 61 -26 6 14 103 198 96 -51
$$ packed form
5142A48l50P3N3R5J13n9k68L71j57l12L27J98J13m37m6Q6K39k47M9K1M1o6O3q6
5166c8j15K31j13N0N4J42o1k29O1O3o7N6O7l63O12m21j1K15j51K35k07nJ02k87
5190a80J30J36k16j90L89k19J77L2Q6j56J37k01JN5L08l33j82M28j84J75O6j70
5212H9mj74J69P2k78J86k7J97k70q8J54o3R9j19j76K95n7j30J05K31k73J8k61
5235c05K42j54L28r2k06j2K68m7J22k72K98q3l21K92K8m6J22k88M47n66L41r9
5257cOk35K38o8O8J08l26J08K5j59K2L36j57j72l2M00Mq9k38R9L6J23r1kM8j84
5283a35P3k9j69J90K63o9j43J20j57M2P7J21L0l71K38l0j68J52P2l32J05M3j88
5306b65K22k84O9L37J2m3J6R3j93J38m3jk7n2J97k91K19k4j9q7L2QQ9R5j02j47
$$ plain form
5332 -51 -122 206 5 -25 -210 79 125 -81 69 39 -37 -137 195 -333 54 162 -28 -132 236 106 41 -6 -260
5355 -260 160 -146 -128 63 65 -72 149 65 -74 104 -217 188 -299 106 -95 -211 3 161 50 -23 65 233
5377 233 249 64 -23 33 168 -139 402 -344 -260 255 -53 -10 -39 -20 65 -65 -94 -61 -69 -34 329 -236 -151 -57 39
5402 39 -49 -98 95 -212 -107 342 83 88 83 -132 56 95 219 -190 174 -19 67 -87 -23 -109 -4 -94 41 86
5426 86 21 -203 -86 54 89 -2 -150 -27 63 36 -117 -92 197 -197 121 -28 -219 55 -89 61 55 152 192 -296
5450 -296 125 -54 171 80 -366 262 65 -78 -51 180 -23 -29 234 267 -78 59 -7 -293 -230 75 -12 6 -113
5473 -113 128 170 -122 -91 102 -222 218 -114 117 -23 -29 -230 -34 15 -201 -171 -158 77 -163 -43 -151 4
5495 4 137 -123 -44 134 -55 91 -137 125 -197 -125 150 -7 200 66 396 -149 109 -121 -97 93 -26 339
$$ packed form
5332e1p1L28k01l0j85K89M6k06J50l0p6j00L32n28L87J08j90j04L68j30o5m7k54
5355b60M20l06J8J91Kj37K21q4j39J78l21M05m87M05k01j16K14J58j11p3Q8J68
5377B33J6j85q7N6J35l07N41p46Q4N15l08M3k9J9Q5j30k9L3qL5L63n65Q5R4R6
5402C9q8m9J93l07J05M49k59Nnk15J88L9J24m09L64j93Q6j54O4q6J05r0J35M5
5426H6o5k24J17J40L5r1j48J23R0k7j53K5K89l94L18j49j91K74j44J50oR7M0m88
5450b96M21j79K25r1m46O28j97j43K7K31k03oK63L3l45J37o6k86O3L05q7J8j19
5473a13K41M2k92L1J93l24M40l32K31j40ok01J96M9k16L0J3K35k40J20j08J55
5495DJ33k60P9J78j89J46k28K62l22P2K75j57K07j34L30n45K58k30K4J90j19L65
$$ plain form
5517 339 28 -101 -6 -80 14 273 -52 -206 -76 54 -140 -137 116 -20 -388 98 30 50 -68 -71 -68 -141 105 333
5541 333 164 -2 -135 149 30 -169 84 106 206 12 -3 -26 183 -57 -112 -151 -129 374 169 52 64 -110
5563 -110 88 58 -58 142 214 -100 16 279 -132 -29 128 218 75 8 126 129 -118 9 128 87 71 -39 147
5586 147 311 3 -168 19 -122 -177 -240 164 -268 187 157 289 -170 -202 106 -162 176 65 -67 114 146 -92
5608 -92 14 53 279 240 130 -8 191 89 68 214 207 -69 -115 18 -115 -14 -171 -13 -92 -106 135 280 78
5631 78 -69 152 -207 -54 -171 41 41 -54 -110 179 33 -28 -13 -57 24 55 -213 140 -85 -279 -145 -312 -82
5654 -82 194 33 -208 98 -13 -262 135 97 330 -194 -17 103 13 106 360 84 198 222 -201 111 -3 -66
5676 -66 -204 121 -190 -127 48 266 284 -43 -19 75 171 -65 6 -149 -248 237 110 -107 179 -22 133 -195 48
$$ packed form
5517C39l11j29R5p4R4K59l25j54J30J30j94LK53j36l68M86o8K0j18lLp3K46K28
5541C33j69j66j33K84j19j99K53K2J00j94j5k3K09k40n5l9K2N03k05j17J2j74
5563a10J98l0j16K00P2l14J16K63m11J03J57R0j43o7J18Lk47J27J19m1j6j10J86
5586A47J64l08j71J87j41n5o3M04m32M55l0J32m59l2L08k68L38j11j32J81L2k38
5608i2J06L9K26l9j10j38J99j02k1J46pk76m6J33j33J01j57J58p9j4K41J45k02
5631G8j47K21l59J53j17K12%r5n6K89j46o1J5m4Q1L1k68L53k25j94J34j67K30
5654h2K76j61k41L06j11k49L97l8K33n24J77J20r0R3K54k76J14K4m23L12j14o3
5676f6j38L25l11O3J75K18J8l27K4R4R6k36P1j55r9M85j27k17K86k01J55l28K43
$$ plain form
5699 48 102 -244 54 127 249 27 -19 -150 -116 -16 121 -78 5 537 243 121 -77 7 240 59 205 18
5721 18 86 104 -283 -63 -48 12 -250 101 165 234 -204 28 -175 39 209 58 92 104 -135 81 179 -13 33 -252
5745 -252 6 -23 62 -106 -110 100 103 -197 -43 93 -21 -317 -159 17 -52 239 260 -43 67 -19 138 100 -25
5768 -25 132 -25 442 -184 -156 60 76 -190 3 -153 57 19 -16 29 -372 -128 55 157 -294 -173 40 49 -104
5791 -104 -20 -72 -134 -194 -139 58 12 -131 -22 11 58 -220 199 -22 87 -222 -52 125 -12 1 44 47 73 69 126
5816 126 -186 56 -18 30 69 56 83 -194 -20 81 -55 -6 113 135 13 74 -241 -120 -147 1 104 37 -342
5839 -342 -4 -54 64 26 -109 108 -233 140 119 119 -131 112 112 331 88 58 167 -151 -99 -126 -112 -181 -7 1 -130
5864 -130 -73 27 69 -41 15 -83 30 -142 190 -4 209 -36 255 148 24 162 116 30 -37 -210 261 179 142
$$ packed form
5699D8N4l46K98P3J22k22m6j31L4J00J37j99Q3N32k94j22j98Q4K33j81J46j87
5721A8O8J8l87K20J5O0k62L51O4O9m38K32k03K14J70j51L4J2k39K16R8j92M6k85
5745b52K58k9Q5j68mK10Ll00J54J36j14k96J58J76o9K91K1l03J10q6J57l8j25
5768b5J57j57M67o26K8K16J6k66J93j56K10l8l5M5m01K44J83J02m51J21K13Rj53
5791a04Q4n2o2o0N5J97m6j43J09L3M7k78M19k21J09l09J70J77j37J3M3LK6mN7
5816A26l12K42p4M8L9j3K7k77J74J01j36M9J19K2j22O1l15J21k7J48J03o7l79
5839c42L38n0J18l8j35K17l41L73k1%k50K43%K19k43l0J09l18N2k7J4o9J74Qj31
5864a30N7J00M2j10N6r8J13j72L32j94K13k45K91j07j24J38m6q6o7j73M71q2l7
$$ plain form
5887 142 47 95 -210 173 138 42 182 34 121 52 55 -89 -197 -275 77 2 176 104 472 29 232 87 145 40
5911 40 -107 229 180 49 -174 -1 -349 88 -60 46 76 -148 -107 83 -214 -428 -128 -69 -27 -137 -128 265 -59
5934 -59 -47 143 156 -11 97 14 -232 108 -65 -337 108 148 -131 -157 -26 -122 97 136 -57 -18 -230 -45 -137
5957 -137 246 -69 139 30 11 105 286 -7 9 178 -78 98 73 -98 -85 73 -340 258 351 -254 -118 -72
5979 -72 163 -54 52 -28 90 119 106 -164 -319 -80 -62 -97 -173 -51 66 73 136 69 -45 129 -127 -215 -82 -119
6003 -119 -38 -225 160 -226 184 126 -198 48 -229 -123 -38 128 98 -22 -341 32 -8 -99 66 -22 -151 5
6025 5 185 -97 -22 -159 -302 142 -270 172 55 -19 52 208 83 56 -65 -195 29 59 157 149 202 -5 24 44
6049 44 -89 147 86 -98 175 -246 -100 70 267 -30 -210 97 -39 52 78 95 -241 206 98 70 -22 -74 139
$$ packed form
5887A42r5M8l05L83l5r6J40j48Q7o9Lj44j08p8L52p5J74p2L68m43K03j45N8j05
5911D0j47L36m9j31k23J73l48M37j48J06L0k24M1J90k97k14L00N9M2j10RL93l24
5934e9J2J90J3j67J08q3k46L40j73k72M45M0k79k6J31r6K19L9j93L9k12J85r2
5957a37L83l15K08j09j9R4J81k93J6J69k56J76k5j71J3J58m13N98R3o05J36M6
5979g2K35k17J06q0J18K9j3k70j55K39J8l5p6J22J17PO3o7j14J74k56q8J33l7
6003a19Q1j87L85l86M10n8l24K46k77J06Q5J66l0j20l19L73m0r1J65q8j29J56
6025EJ80k82P5j37j43M44m12M42j17p4P1J56j25k7j21j30K24L0R8qN3k07K9K0
6049D4j33K36o1j84K73m21J46J70J97k97j80L07j36R1K6J7l36M47j08k8r2n2K13
$$ plain form
6072 139 72 -131 -28 36 -66 -257 -54 -144 -126 -103 228 7 -120 -347 154 90 -87 151 -148 192 -81 22
6094 22 86 109 42 129 -50 -111 -223 -18 -351 -4 36 -40 128 169 159 -23 -132 124 -113 -95 103 35 -58 -50 72
6119 72 134 60 41 59 -158 -78 417 -44 58 340 -254 305 229 -105 -16 -91 40 -33 187 83 -50 -165 250
6142 250 348 -88 135 -132 -50 1 -170 -37 -35 65 -139 66 149 266 -114 -191 -172 -117 -92 -35 203 278 151 -205
6166 -205 -51 -35 -32 -24 31 28 -142 86 279 -86 -50 -79 195 -29 -138 -100 -109 -166 100 93 16 -179 -4 342 68 -1
6192 -1 -6 23 -21 -142 -75 -95 34 233 57 183 118 -94 -100 -95 -82 262 48 -13 9 99 115 82 223 -314 66 130 -292
6219 -292 51 2 80 122 53 45 24 43 -135 -112 134 -91 102 5 -47 -43 -31 -83 271 -97 -233 -93 140 -75 82
6244 82 49 21 383 -73 32 -153 -184 -91 0 -157 -142 12 195 196 169 0 -172 -176 88 29 -182 230 -256 96
$$ packed form
6072A39o7k03J03O4j02j91K03r0J8K3L31k21j27k27N01o4j77K38k99L40k73J03
6094B2O4K3o7Q7j79o1j12K05l33L47M0p6J68M1j0j82j09K56k37J8J98o8r3QJ22
6119G2O2p4j9J8k17Q0M95m61J02K82n94N59p6l34Q9p5J31p3K20j04j33j15M15
6142B50R8m36K23k67Q2N1j71J33KJ00k04K05Q3J17l80p7J9N5K5N7K38P5j27l56
6166b05J54J6LQN5lj70K28J93l65L6k9K74k24j09L8rn7K66pp7j95J75L46k74o9
6192anK9m4j21O7k0J29J99j76J26o5k12oNJ3L44k14o1K2R0J6l3J41n37L80O4m22
6219b92L43m9P8M2o9qk1J9j78K3K46k25J93r7n2MJ2n2L54l68j36J40K33k15J57
6244H2l3k8L62m56J05j85l1R3R1j57J5J54J83Jk7j69j72mK64n9k11M12m86L52
$$ plain form
6268 96 -11 -223 279 -144 -62 -72 -20 22 32 -116 -265 -45 -163 -89 119 -65 162 -276 -342 -41 88 -71 424
6291 424 87 -108 -132 116 112 38 44 121 -235 164 10 -52 2 41 36 -223 196 -3 -218 -50 16 87 26 145 121
6316 121 256 164 -27 -19 131 175 59 99 219 -275 -317 -19 118 79 -61 -102 -95 205 -54 -115 -34 -315 -146 -392
6340 -392 -137 105 38 -131 208 -142 114 76 -288 -8 97 -166 72 155 94 27 -225 193 81 70 -111 10
6362 10 -8 -106 -117 28 -56 -213 -184 151 119 -3 81 5 377 -103 39 -82 18 -229 80 190 -30 -15 127
6385 127 -250 -19 31 262 -90 119 -176 -180 38 -80 421 128 174 -95 -324 180 -21 16 200 63 268 31
6407 31 -42 -24 -32 -102 -204 36 -168 136 -134 67 16 57 -159 83 -140 -19 24 180 75 26 121 -126 -73 134
6431 134 71 193 132 113 -285 -70 -126 11 -154 15 259 -3 48 -93 -209 23 60 148 10 107 100 405 -68
$$ packed form
6268I6j07k12N02m23Q2j0N2M2J0j48j49K20j18P4K08j84K27m38o6L01J29j59M95
6291D24l37j95k4K48mp4OP7l56L99j54o2N4L9nk59M19j99k15J68O6P1o1J19k4
6316A21J35r2j91QJ50M4j16M0J20m94m2K98J37l9j40m1PL00k59o1Q1k81J69k46
6340c92K55K42o7j69L39l50K56l8l64K80J05k63K38Q3o1o7k52M18j12j1j81J21
6362A0j8r8j1J45q4j57K9L35l2j22Q4p6L72m80J42j21J00k47L09J10k20J5J42
6385A27l77K31N0K31l52K09k95mK18j18N01k93M6k69k29N04k01L7J84j37K05k37
6407C1p3J8qp0j02K40k04L04k70K01n1M1k16K42k23J21M3J56j05m9R5k47N3K07
6431A34o3J22o1j9l98K15n6J37j65J69K44k62N1j41j16K32L7Q8j38R7pL05m73
$$ plain form
6454 -68 -54 306 97 169 6 211 -94 185 -10 16 -125 105 -23 -22 -127 347 -50 189 7 -122 -47 -20 14
6477 14 197 -27 -261 13 -75 -138 -16 -65 14 86 -107 167 180 -19 54 -131 31 88 256 120 118 -39 -48 31 194
6502 194 9 42 -132 156 -16 -9 156 -434 -40 -121 -49 123 -174 112 150 181 177 204 88 116 101 -69 297 -287
6526 -287 132 106 77 -64 50 -277 -194 -13 -92 240 -13 222 41 230 115 -43 77 -47 126 19 9 82
6548 82 82 19 52 22 64 -155 122 -23 168 -174 -81 106 55 437 -337 -105 138 -50 -116 154 -60 148 -163
6571 -163 30 -41 -87 184 131 -206 -158 -10 45 -200 -285 137 1 -183 -100 80 -125 -292 -230 -4 -241 256 179
6594 179 259 161 -92 111 -7 -38 6 -28 89 51 -210 -24 -9 1 -27 57 21 -3 237 -60 -104 -245 -198 67 136
6619 136 -305 41 -191 -242 -108 -117 164 139 54 48 -6 17 96 -61 123 -110 25 -52 -88 -16 14 -31 -89 179 -96
$$ packed form
6454f8J4L60k09P2j63K05l05K79j95K6j41K30j28Jj05M74l97K39j82j29P5K7L4
6477A4J83k24k34K74q8o3J22m9P9P2j93K74J3j99P3j85J62N7J68j36kj57rP9J63
6502A94j85L3j74K88j72PJ65n90L94q1P2J72k97K86L8L1mK7j16K8j5j70L66n84
6526b87M19k6k9j41J14l27Q3J81p9L32k53K35j81J89j15j58J20j24J73j07j0P3
6548H2%o3L3l0M2k19K77j45J91l42R3J87n1L82p74K32K43j88o6K70k14K08l11
6571a63J93p1m6K71n3l37M8J48N5k45q5M22j36j84Q3J80k05j67O2K26k37M97p7
6594A79Q0r8k53K03j18l1M4l4J17l8k61J86J5J0k8Q4l6k4K40k97m4j41M7K65O9
6619A36m41L46k32n1J34rK81k5q5on4K3P9j57J84k33J35p7l6P2L0m5n8K68k75
$$ plain form
6644 -96 149 -44 -121 12 3 241 -203 -176 83 237 50 23 64 -67 105 52 153 -103 -27 17 -117 -156 -4 235
6668 235 210 -43 -153 -26 166 -27 192 -31 -37 -137 -129 -21 -99 117 26 -148 -175 -76 337 -146 50 -266 295
6691 295 298 -39 74 -8 -285 34 -68 241 120 14 31 122 20 -104 -21 -8 -202 30 58 -103 -199 20 181
6714 181 -63 -66 89 163 37 -110 -36 -92 58 137 15 -30 16 -21 -56 -35 6 -140 14 -62 16 268 -108 -226 -87
6739 -87 -12 91 244 205 -78 -69 22 -80 -363 127 3 -144 257 119 -44 -132 -59 -99 -87 -21 -56 -39 -22 -131 112
6764 112 308 341 -59 96 67 -259 -52 215 -6 -153 1 -40 -18 32 -34 43 69 -115 39 -240 174 -145 -257
6787 -257 85 30 192 93 39 -179 95 -9 -79 106 13 -37 262 -61 -312 2 -171 -245 102 -235 29 -18 -6
6810 -6 96 -107 3 121 27 -73 16 72 73 -169 -250 -52 -311 352 94 165 37 -54 156 -37 240 159 -84 101
$$ packed form
6644i6K45j93p7J33rK38m44K7K59J54j87k7M1j31J72n3J01k56P6M4j34l9J52K39
6668B35k5k53j10J27J92j93K19k23oj00QJ08p8K16r1j74k7R9M13m83J96l16N61
6691B95Ll37J13q2k77L19j02L09j21j06J7R1j02j24Q3J3j94K32K8j61r6K19J61
6714A81k44lJ55P4j26j47P4n6J50P9j22m5M6l7l5K1M1j46J54p6P8K52l76j18J39
6739h7P5J03J53l9k83RR1j02k83M90j24j47M01j38j63q8P3m0J2O6l5J7J7j09K43
6764A12J96L3m00J55k9l26K07K67k21j47J54m1K2N0o6P7K6j84J54k79M14l19j12
6787b57L42n5J62r9n4k18K74j04p0J85r3n0K99l23k51L14j73p4L47l37K64m7J2
6810fJ02k03J10J18r4j00Q9N6Jk42q1J98k59O63k58P1j28r1K10j93K77q1k43J85
$$ plain form
6834 101 106 -83 -148 202 87 100 135 -247 3 -106 23 -14 -72 233 -257 44 18 -19 56 -43 37 -247 242 -157
6858 -157 -91 -117 -49 245 -63 331 93 -37 137 57 85 132 24 301 -173 160 326 39 21 64 6 -109 -16
6881 -16 164 -100 -135 39 -115 27 -363 -85 -106 78 76 -75 -81 9 142 124 65 332 -37 94 73 180 -267 -125
6905 -125 -380 -61 -15 -74 207 -42 -67 -75 -144 -113 -208 -162 142 -93 -189 -108 100 103 -126 153 118 35 150 5 -75
6930 -75 448 -19 -89 -20 34 -124 95 38 -287 -22 -116 -9 44 79 -29 6 208 119 43 -264 -28 -26 -269 129
6954 129 147 -112 -136 255 -158 51 -50 -61 46 -48 131 228 -66 -103 177 -120 213 -43 -138 103 -309 356
6976 356 168 -68 264 78 136 -98 317 -75 -185 -129 -36 41 130 -45 45 -33 -59 -228 -189 103 33 45 -243 11
7000 11 146 -313 -51 -173 52 0 -257 169 -44 194 269 81 -378 117 -102 -106 124 57 -116 168 45 -171
$$ packed form
6834A01Nj89o5L50j15J3L5l82K50j09J29l7n8L05m90L01k6l7P5r9Q0k84M89l99
6858a57O6k6O8K94l08L94k38j30J74q0K8M7j08K77m74L33J66k87j8M3n8j15R3
6881a6J80k64l5J74j54J42l90K78k1J84kj51oR0J33j8n9K67l69J31k1J07m47J42
6905a25k55L19M6n9K81k49k5qo9L1r5M6L04k35r6Q1K08Lk29K79l5q3J15j45q0
6930g5N23m67p0O9N4j58K19n7l25K65r4J07N3L5j08L5K02q9p6l07K36Kk43L98
6954A29J8k59k4L91m13K09j01j1J07r4J79R7k94l7K80k97L33k56r5K41m12O65
6976C56j88k36L32j86N8k34M15l92j10N6R3P7Q9j75R0p8k6j69L9K92p0J2k88K54
7000A1J35m59K62j22K25n2k57M26k13K38P5j88m59M95k19mK30o7j73K84j23k16
$$ plain form
7022 -171 -62 -114 -142 -177 -54 -20 -153 -279 -369 43 -40 -49 261 275 -36 -84 165 -47 337 -9 98 -51 -216
7045 -216 38 146 162 -84 -266 -44 -184 -107 179 -96 -143 -44 -74 -131 258 29 13 56 15 75 90 -22 -215 -244
7069 -244 -51 -53 -162 73 -203 -141 256 39 -10 -48 6 141 189 295 -15 76 112 -151 110 -107 -108 -257 103 23
7093 23 -142 -19 -5 220 94 -122 -78 -103 119 4 -67 -9 38 54 -2 -113 147 -132 -53 -27 218 44 93 82
7117 82 10 -190 -253 -377 108 346 -64 -212 -77 213 -225 -70 18 42 -167 30 -66 -122 69 82 74 -181 -52
7140 -52 -145 5 -65 -98 -68 223 -157 41 272 -350 -262 53 36 -46 44 -239 -126 126 214 111 -30 -264 -154
7163 -154 -153 163 -13 -38 107 220 -144 208 65 -201 90 55 226 63 -40 -115 -263 149 36 -10 -86 10 1
7186 1 175 -107 -226 15 -102 -298 -19 -61 99 113 43 108 -91 206 -30 15 -46 236 66 -177 -153 113 48
$$ packed form
7022a71J09n2k8l5J23L4j33j26r0M12q3rL10J4l11m8K49k12L84l46J07j49j65
7045b16K54J08J6k46j82K22j40P7K86k75m7R9l0n7L89k29j6M3m1O0J5j12j93k9
7069b44J93kj09K35k76O2L97k17m9l8N4J35M8J06l10R1L6k63K61k17jj49L60q0
7093B3j65J23J4K25j26k16M4k5K22j15p1N8M7J6n6j11K60k79P9K6K45j74M9j1
7117H2p2k00o3j24M85K38m10j48J35K90m38J55Q8K4k09J97r6n6J91J3qk55J29
7140e2r3J50p0l3L0K91l80J98K31o22Q8L15j7q2R0k83J13K52Q8j03j41k34J10
7163a54JL16j76k5J45J13l64L52j43k66K91l5J71j63j03p5j48M12j13m6p6R6r
7186AJ74k82j19K41j17j96K79m2J60J4p0O5j99K97k36M5o1K82j70k43K4K66o5
$$ plain form
7209 48 -296 182 61 -16 276 153 -29 -326 -231 -206 -211 144 -352 94 -270 -365 59 112 5 -273 -152 -171 337
7232 337 -259 -5 -199 -138 -334 138 -132 70 74 -15 41 22 6 -126 -80 27 8 -75 59 20 170 -28 240 52
7256 52 4 -191 151 220 17 -184 290 -182 -8 77 -24 -38 -8 -39 -21 -40 279 -230 111 113 97 62 -2 38 77
7281 77 28 -17 -140 -34 -215 61 67 -250 -231 93 321 4 -23 -29 220 -4 -130 -121 -99 -70 364 -40 -81 39 -10
7306 -10 -136 46 -23 -267 15 -180 -80 -177 -37 47 39 -252 -9 -82 15 117 22 -61 213 241 109 -128 -112 91
7330 91 -249 48 259 131 -205 14 156 -171 119 -116 64 -204 18 -149 123 290 90 118 -140 -126 112
7351 112 227 -80 51 52 0 -210 -156 -117 -166 -9 92 -25 -18 268 -22 -120 100 129 157 -321 195 -29 -60 7
7375 7 369 -31 -89 -78 -53 138 -77 -20 91 -68 142 52 125 -60 -92 -143 67 2 116 -184 -47 24 -99 -9
$$ packed form
7209D8l44M78j21p7K92j23j82k97R5K5nL55m96M46l64r5M24N3j07k78J21j9N08
7232C37n96K54j94O1j96M72k70K02Mq9N6j9j6j32M6J07j9q3J34l9J50j98K68j88
7256E2m8j95L42O9k03k01M74m72J74Q5j01j4L0l1J8j9L19n09L41Kj6l5o4M0L9
7281G7m9m5j23J06j81K76Ol17J9L24K28l17k7oK49k24j26RK2K9M34m04m1J20m9
7306a0j26J82o9k44K82j95J00r7J40Q4qk91K43p3R7J02r5q3K74K8j32k37J6K03
7330I1l40K97K11j28l36K19J42l27K90k35J80k68K22j67K72J67k00K8k58J4K38
7351A12J15l07J31Jn2k10N4L9m9J57J01j17PK86k90r8K20K9K8m78N16k24l1O7
7375GL62m00n8J1K5J91k15N7J11j59K10r0P3j85l2n1K10o5J14l00J37P1j23R0
$$ plain form
7399 -9 -46 276 -184 123 23 -59 148 91 193 173 -130 -154 -128 201 -169 -31 214 330 -88 -145 80 45 -10 338
7423 338 77 54 -205 -27 -76 45 -199 -45 214 98 81 -272 -157 133 242 -46 47 -84 192 -144 174
7444 174 20 156 -74 -191 134 -47 -323 -55 -117 -382 -304 13 -64 109 32 64 25 143 463 56 -39 2 58
7467 58 35 12 -109 93 -60 -63 196 177 -138 -126 139 57 43 65 32 -32 31 131 35 -80 -43 -16 -5 -96 86 117
7493 117 87 95 92 -181 124 -161 180 -90 125 1 99 117 -233 -73 186 46 227 -57 49 36 -220 71 168
7516 168 249 -206 -132 34 17 -156 59 25 -77 17 -8 -69 15 -26 26 188 -26 194 185 -6 -261 55 -81 188
7540 188 22 -44 -203 66 74 14 -201 30 126 27 78 27 204 12 -17 -87 -59 -53 110 44 90 243 6 -297 9
7565 9 36 -189 -94 -1 -35 -128 98 -28 -60 -128 -42 100 78 223 -5 75 -93 -291 132 109 -208 36 149 193 -32
$$ packed form
7399il7L22m60L07j00q2K07n7J02k0l03k4K6L29l70J38K45J16m18n7K25l5n5L48
7423C38k61k3k59J78m9J21k44J54K59j16j7l53J15K90J09k88R3j31K76l36L18
7444A74j54J36k30j17L25j81k76K68o2k65P8L17p7J73p7L2l9J18L20m07r5M1N6
7467E8k3k3j21K02j53lK59j9l15J2K65q2j4K2l3o4O3J00r6j15L7K7J1r1J82L1
7493A17l0Qlk73L05k85L41k70K15j24R8J8l50J60K59j40J81k84J06j3k56K91R7
7516A68Q1m55P4J66j7j73K15l4j02R4k5o1Q4m1N2J62k14K20rj91k55L16j36K69
7540A88j66o6j59K69Qo0k15K31R6r9N1n1J77j92k9p0K8OJ63o6M6J53k37l03L06
7565IK7k25R5R3l4r3K26j26l2o8Q6J42k2J45k28Q0j68j98M23k3l17K44J13M4k25
$$ plain form
7590 -32 212 153 -111 248 292 176 -31 138 -17 -1 261 154 -111 -121 -64 -121 135 95 50 -311 -126 17 -173
7613 -173 131 -104 7 -5 52 70 -123 54 -17 -12 -178 -13 -165 21 34 3 -55 352 0 98 -72 -24 54 -52
7637 -52 107 -74 135 132 -26 115 -18 -19 36 10 100 -34 179 26 105 214 -105 -176 4 -326 -117 -257 -115
7660 -115 22 262 -117 120 107 -315 20 -75 -139 119 186 79 51 111 63 175 -41 -130 -37 19 -14 83 -15 -119
7684 -119 -117 115 -220 31 -136 34 -11 -221 239 -28 -101 121 80 152 82 -116 257 284 -171 -250 131 283 -97
7707 -97 -211 107 -183 -260 33 -203 13 264 -118 140 188 22 -125 128 -89 -63 75 -65 -267 142 112 -15
7729 -15 119 -78 -16 -228 -221 -321 -59 -110 -62 -44 -119 -142 225 -10 -148 63 -9 -182 308 176 12 154 -146
7752 -146 53 -71 194 -26 -17 194 3 76 -126 130 -140 18 -18 31 131 96 215 191 -125 -13 -92 -13 -6 -403
$$ packed form
7590c2K44n9k64L59M4j16k07J69j55J6K62j07k65j0N7n7K56m0m5l61J85J43j90
7613a73L04k35J11j2N7J8j93J77p1Nj66J65j52J86J3l1n8M07l52R8j70M8P8j06
7637e2J59j81K09lj58J41j33jN5k6R0j34K13j53P9J09l19p1J80l30K09j40J42
7660a15J37K40l79K37j3m22L35r5o4K58O7j07k8O0m8J12k16q9R3N6l3R7r8j04
7684a19KK32l35K51j67J70m5k10M60k67p3K22m1P2p0j98L73K7m55p9L81J52l80
7707i7j14L18k90p7K93k36K16K51l82K58M8j66j47K53k17K6J38j40k02M09l0j27
7729a5J34j97O2k12Pj00K62n1M8J8p5k3L67k35j38K11p2j73M90j32j64J42l00
7752a46J99j24K65k20RK11j91P3k02K56k70J58l6M9J00l5J19k4l16J12p9P9Pl97
$$ plain form
7776 -403 -152 79 57 -100 -63 -167 -93 81 85 -1 258 128 50 62 -183 190 1 -84 -27 44 -100 143 -68 285
7800 285 -14 -171 -6 121 -69 -257 -152 245 -70 -124 289 193 175 -90 17 28 -35 148 -56 -167 73 256
7822 256 -48 -234 -72 -57 52 87 -3 -178 -123 108 -185 -53 28 -37 35 33 -14 -320 -97 44 17 139 -5 23
7846 23 37 -56 6 158 204 316 53 -215 -37 -67 180 -296 58 53 -36 106 76 40 -53 -108 88 108 -46 -85 136
7871 136 -126 275 -14 110 -9 222 181 188 101 -17 -33 -181 107 58 65 104 57 -515 -47 29 86 265 50 196
7895 196 216 105 63 80 238 19 -223 122 -268 82 81 138 46 12 138 106 211 -129 -97 -28 299 -57 56 128
7919 128 75 97 -163 279 -33 68 -106 -232 159 -80 -1 -166 13 45 -10 32 42 -53 91 -220 -144 -200 -206 86
7943 86 -36 268 2 -62 -204 3 -115 113 -156 51 248 109 -58 -122 418 -100 -38 277 -7 2 104 246
$$ packed form
7776d03K51K31k2j57L7j04P4J74Mq6K59j30p8J2k45L73j89q5N7P1j44K43k11L53
7800B85k99j57J65J27j90j88J05L97l15n4M13r6j8k65J07J1o3J83k04j11K40J83
7822B56l04j86J62J5J09L5r0j75N5K31k93J32Q1o5P2km7l06K23J41k7J22j44K8
7846B3J4r3O2J52M6J12k63k68J78l0K47m76L54nq9J42l0l6r3n5J96K0j54l9K21
7871A36k62M01k89J24j19K31m1Pq7j18j6j48K88m9PL9m7n72M68P6N7J79k15J46
7895A96K0j11m2J7J58k19k42L45l90L50jN7r2l4J26l2J05l40L2O9L27l56J13P2
7919A28n3K2k60M42l12J01j74j26L91k39P9j65J79L2n5M2J0r5J44l11P6n6oK92
7943H6j22L04k66o4j42K07j18K28k69K07J97j39j67o4N40n18O2L15k84RJ02J42
$$ plain form
7965 246 -1 -77 62 -193 -53 -54 1 182 -1 161 -48 -95 81 98 -243 57 -63 -156 -36 -144 5 -264
7987 -264 -40 58 23 -112 117 118 -90 108 -25 19 -188 -10 -181 -66 89 136 265 3 47 90 315 263 -35
8010 -35 -347 70 64 -102 -249 24 -156 -144 34 -71 98 108 176 -60 167 8 36 87 177 191 116 -122 180 380
8034 380 21 -73 -43 257 128 222 259 -153 -202 -38 -338 16 140 -86 -96 301 94 35 -78 9 185 144 -59
8057 -59 4 180 -187 140 -265 207 103 -103 -211 114 -310 256 -24 -357 159 -25 365 -191 -42 177 263
8078 263 89 297 -224 122 141 -74 -21 113 -13 68 21 -30 73 17 -68 130 -7 12 16 46 266 44 -4 121
8102 121 -139 218 8 -36 -146 109 -162 189 304 -167 -245 127 36 -88 112 -138 162 75 132 -158 0 118
8124 118 -334 -110 220 -7 269 -83 -199 -87 -334 63 -6 -6 192 128 -85 63 -27 234 238 24 -18 41 315
$$ packed form
7965B46k47p6J39k55J40jN5J81j83J62k09m7J76J7l41L00j20r3J20j08J49k69
7987b64K24R8l5j35K29Jk08J98j33M4k07J78j71J15J55M7J29k62M4M3K25n2k98
8010c5l12M17oj66j47K73j80J2J78j05J69J0O8k36K27j59K8N1R0J4p5k38L02K00
8034C80l59r4L0L00j29R4L7m12m9J64l00L54J24k26j0L97k07n9j13Q7J76m1k03
8057e9O3J76l67L27m05M72j04k06j08L25m24N66k80l33N16j84L90n56J49K19Q6
8078B63j74K08n21L46J9k15N3J34j26Q1m7n1J03n6q5J98j37J9ML0K20k22m8J25
8102A21k60L57k10m4j10K55k71L51J15m71p8L72r1j24K00k50L00q7N7k90J58J18
8124A18m52K24L30k27K76l52j16J12k47L97o9%J98o4k13J48r0K61Mk14m2N9K74
$$ plain form
8147 315 277 -8 -154 -158 -209 85 177 -22 -189 54 -346 314 -123 -205 -72 118 -303 -49 -16 -106 -272 103 355
8170 355 209 33 88 106 -86 138 -88 233 -91 -271 -96 42 -13 -32 -111 39 -17 -206 39 72 7
$$ packed form
8147C15l8k85j46mn1K94R2j99j67K43m00O60m37q2J33J90m21K54L3r0j66L75K52
8170C55j46j76N5J8j92K24k26L21l24j80J75J38n5j9p9J50n6j89K45L3o5
8191G
$$ Imaginary data points
##PAGE= N=2
##DATA TABLE= (X++(I..I)), XYDATA
$$ plain form
0 0 0 0 0 0 0 0 0 0 0 0 0 -8 8 -8 8 -13 16 -16 24 -24 32 -40 47 -55 64 -72 87 -98 113 -131 150 -171 194
33 194 -219 248 -279 314 -350 392 -438 488 -541 600 -664 736 -813 897 -989 1090 -1202 1322
51 1322 -1457 1607 -1772 1959 -2168 2407 -2683 3001 -3379 3831 -4386 5087 -6003 7256 -9085
66 -9085 12015 -17490 31277 -146746 -188468 40457 -41415 -83130 -16186 70931 47837 55208
78 55208 60907 56348 46938 60346 30179 13689 27715 35075 6161 -12361 -32331 -35615 -23305
91 -23305 -35262 -84882 -74998 -9433 4929 -39795 -26055 36138 57755 43023 36229 22210 15477
104 15477 33110 28909 -9152 -15294 5808 -7434 -32367 -9017 14400 -11822 -33542 -15243
116 -15243 -2771 -8012 -7393 -5439 -6034 5740 16134 9260 6839 18956 17060 1679 1062 6201
$$ packed form
0@%%%%%%%%%%%qJ6j6J6k1K9l2M0m8N6p2Q7j02J19j36J59j85K11k44K81l21L65
33A94m13M67n27N93o64P42q30R26j029J141j264J400j549J710j886K079k292K524
51A322k779L064l379L731m127M575n090N684o380P210q217R473j1090J3259j6341
66i085K1100k9505M8767j78023m1722K28925q1872m1715O6944Q7117k3094P371
78E5208N699m559r410J3408l0167j6490J4026P360k8914j8522j9970l284J2310
91b3305j1957m9620R884O5565J4362m4724J3740O2193K1617j4732o794j4019o733
104A5477J7633m201l8061o142K1102j3242k4933K3350K3417k6222k1720J8299
116a5243J2472n241O19J954n95J1774J0394o874k421J2117j896j5381o17N139
$$ plain form
130 6201 -3136 -9429 -6010 -7137 -6644 999 -907 -9780 -1497 15335 11109 -5992 -8029 2102 6252
145 6252 2176 -7407 -11914 -289 9355 -928 -10955 388 12098 1898 -10792 -4249 7215
158 7215 5379 -1455 -2595 3376 11564 10290 603 -3102 2458 4108 -4291 -12638 -11731 -6323 -3452
173 -3452 -4801 -7226 -3326 6827 8938 2637 1021 6968 8609 3211 -1533 1216 5194 3377 -2001
188 -2001 -3496 -210 986 -4170 -9024 -7412 -4110 -4009 -5851 -3804 1259 5006 4675 4816 6694 7581
204 7581 5844 1908 335 659 -763 -2906 -4116 -3621 -1519 -1302 -3410 -3492 -1165 436 -1270 -2140 -942
221 -942 1968 3364 2098 1319 3545 5370 3332 -684 -361 807 -1023 -3974 -4685 -2418 -821 -1159
237 -1159 -2304 -857 1910 2949 990 -429 928 2560 1101 -725 -442 821 1378 -64 -880 -736
$$ packed form
130F201r337o293L419j127M93P643j906q873Q283J6832m226j7101k037J0131M150
145F252m076r583m507J1625R644j0283j0027J1343J1710j0200j2690O543J1464
158G215j836o834j140N971Q188j274r687l705N560J650q399q347R07N408K871
173c452j349k425L900J0153K111o301j616N947J641n398m744K749L978j817n378
188b001j495L286J196n156m854J612L302J01j842K047N063L747l31J41J878Q87
204G581j737l936j573L24j422k143j210M95K102K17k108q2K327J601j706q70J198
221i42K910J396j266p79K226J825k038m016L23J168j830k951p11K267J597l38
237a159j145J447K767J039j959j419J357J632j459j826K83J263N57j442q16J44
$$ plain form
253 -736 483 417 -2057 -2403 -722 133 -855 -1164 -284 1479 1830 1282 403 1166 2079 735 -968 -1196 -407
272 -407 -373 -1411 -1779 -618 116 421 -394 -144 928 1087 8 -586 276 856 974 -224 83 805 874
291 874 150 -894 -1009 -372 -663 -1277 -1362 -168 261 159 285 474 1330 1212 359 240 186 371 -104 -710
311 -710 -453 -291 -43 -352 -756 -223 30 -271 -575 -286 57 384 -33 -89 594 740 857 219 358 188 304
332 304 -391 -976 -632 -430 -459 -940 -407 -312 130 141 47 -255 374 245 -105 101 107 257 -230 164 -2 160
354 160 162 -198 -509 -432 120 -333 -503 -410 43 -92 304 204 310 345 441 265 -458 33 102 -267 -289 -21 14
377 14 -131 -335 120 -517 -54 -135 -94 -330 126 -19 -98 202 174 290 173 -12 156 -57 -22 66 -98 -157 84
400 84 -221 -116 -3 206 62 57 279 270 306 -141 7 40 -69 325 52 180 246 30 -18 -241 -254 108 -98 71
$$ packed form
253g36J219o6k474l46J681Q55r88l09Q80J763L51n48q79P63R13j344j703k28P89
272d07L4j038l68J161P34L05q15K50J072J59j079n94Q62N80J18j198L07P22O9
291H74p24j044j15O37k91o14q5J194M29j02J26J89Q56j18q53j19n4J85m75o06
311g10K57J62K48l09m04N33K53l01l04K89L43L27m17n6O83J46J17o38J39j70J16
332C04o95n85L44K02k9m81N33R5M42J1r4l02O29j29l50K06OJ50m87L94j66J62
354A60Kl60l11P7N52m53j70R3M53j35L96j00J06L5R6j76p23M91O9l69k2K68L5
377A4j45k04M55o37M63q1M1k36M56j45p9L00k8J16j17j85J68k13L5Q8j64n9K41
400H4l05J05J13K09j44nK22rL6m47J48L3j09L94k73J28O6k16m8k23j3L62k06J69
$$ plain form
424 71 -173 124 -307 -32 422 31 74 -145 176 -256 -201 44 -33 -323 100 106 -121 -13 -43 127 52 51 -90 -91
448 -91 -76 28 -94 93 71 17 71 -13 -37 152 -172 -132 -205 -104 -39 -48 -220 232 34 57 131 85 -12 138 94 150
474 150 44 -208 -110 -71 -30 239 -5 4 -95 -82 -75 -12 -228 111 104 -95 449 -20 33 -19 -102 355 66 -142 149
499 149 -52 13 50 43 -238 48 -59 -365 109 -72 -261 -172 66 -10 94 47 74 147 -76 112 -123 79 95 13
523 13 4 194 -15 -34 410 65 133 303 -57 47 14 22 -208 248 209 11 -24 -196 43 -334 -210 -118 321 1
547 1 256 -4 -43 292 -8 -64 -16 12 -39 29 -15 -295 8 -110 81 126 450 -94 -96 -218 -132 14 209 120 29
572 29 100 172 -133 96 250 -118 232 -112 250 178 14 -5 -221 -186 -77 -138 90 72 31 59 38 -91 11 -77
596 -77 27 -57 -195 46 -45 -14 135 55 -118 -47 148 49 -48 104 9 172 12 209 50 -33 142 123 -60 -214
$$ packed form
424G1k44K97m31K75M54l91M3k19L21m32N5K45p7k90M23Ok27J08l0J70p5jj41j
448i1J5J04j22J87k2n4N4q4k4J89l24M0p3J01O5rj72M52j98K3P4m6r7J50m4N6
474A50j06k52R8L9M1K69k44Rr9J3PO3k16L39pj99N44m69N3n2q3M57k89k08K91
499A49k01O5L7pk81K86j07l06M74j81j89Q9K38p6J04m7K7P3k23J88k35K02J6q2
523A3rJ90k09j9M44l45O8J70l60J04l3Qk30M56l9j98l5j72K39l77J24R2M39l20
547AK55k60l9L35l00n6M8K8n1O8m4k80L03j18J91M5L24n44kj22Q6J46J95q9r1
572B9P1P2l05K29J54l68L50l44L62p2j64j9k16L5J09o1K28j8m1K8k1j29J02q8
596g7J04q4j38K41r1L1J49q0j73P1J95r9r7J52r5J63j60J97j59q3J75j9j83j54
$$ plain form
620 -214 111 -40 51 -191 -249 272 12 78 -143 -69 -132 242 -93 -70 91 42 -49 -81 45 -226 75 -199 -138 -75
644 -75 -146 -114 -25 225 177 26 8 100 -12 158 -15 99 123 -36 278 8 -51 79 -86 -50 331 -189 62 -78
668 -78 -258 -234 -45 186 -67 10 -25 86 28 -40 -154 -127 143 -70 -189 122 209 -138 4 -209 121 148 -102
691 -102 150 -50 -105 -161 233 -93 72 109 98 -84 96 69 18 -66 -170 -127 -150 -225 219 96 146 171 -86 49
715 49 -13 -89 -149 -8 -304 -150 208 -150 7 -17 -289 76 71 -137 64 -206 163 37 -154 150 98 64 29 307
739 307 -79 14 -104 -243 -96 29 -52 120 -324 -141 -111 -82 125 -16 230 236 -49 76 100 -53 452 -29 14
762 14 -32 -90 35 -116 -105 -165 -37 102 -72 133 38 -58 17 -84 311 0 75 45 159 -7 -85 92 -225 -143
786 -143 15 2 -144 3 62 -105 -104 120 -129 54 80 -84 315 -116 98 225 119 -110 -20 -74 -27 -153 220
$$ packed form
620b14L25j51R1k42n8N21k60O6k21P4o3L74l35K3J61m9r1l2J26k71L01k74O1O3
644g5p1L2Q9K50m8j51j8R2j12J70j73J14K4j59L14k70n9J30j65L6L81n20K51j40
668g8j80K4J89K31k53P7l5J11n8o8j14K7K70k13j19L11Q7l47J42k13L30K7k50
691a02K52k00n5n6L94l26J65L7j1j82J80k7n1q4j04M3k3p5M44j23N0K5k57J35
715D9o2p6o0J41k96J54L58l58J57k4k72L65nk08K01k70L69j26j91L04n2l4l5K78
739C07l86R3j18j39J47J25q1J72m44J83L0K9K07j41K46Ok85J25K4j53N05m81M3
762A4m6n8J25j51J1o0J28J39j74K05r5r6P5j01L95l11P5l0J14j66p8J77l17Q2
786a43J58j3j46J47N9j67JK24k49J83K6j64L99m31K14J27j06k29R0n4M7j26L73
$$ plain form
809 220 145 -33 24 169 -22 131 -123 195 -170 38 173 89 -72 99 292 115 -318 -127 125 81 -44 48
831 48 39 337 -2 -82 56 -156 28 -107 163 26 44 -113 -156 -70 161 -93 -209 155 -205 -127 -184 59 -110
854 -110 -171 -6 407 45 -104 139 128 240 435 137 -15 -58 -208 92 111 115 261 114 242 226 -55 -59 -130 54
878 54 -169 100 87 67 -353 140 -73 47 197 132 96 140 68 59 146 -83 -139 39 -49 45 198 -65 15 124 105
903 105 -180 -51 171 -148 6 -112 -75 -207 137 247 -90 49 -252 87 -4 -53 266 -71 195 179 -205 -93
925 -93 -134 -203 -31 -148 -60 -188 -94 -3 -21 129 224 -286 -8 -310 -138 106 -74 -63 -119 -122 -115 5 234 90 117
950 117 84 -94 -172 84 184 131 -45 114 -230 32 89 185 184 112 -119 -69 -18 33 -9 33 -18 -156 46 -52 -182
975 -182 100 19 84 500 -37 -305 -85 228 150 35 142 180 43 -288 -177 129 -26 -28 -94 -33 -168 -42 85
$$ packed form
809B20p5j78N7J45j91J53k54L18l65K08J35q4j61J71J93j77m33J91K52m4j25R2
831D8rK98l39q0J38k12J84j35K70j37J8j57m3Q6K31k54j16L64l60P8n7K43j69
854a10o1J65M13l62j49K43j1J12J95k98j52m3j50L00J9MJ46j47J28j6k81mp1J84
878E4k23K69j3k0m20M93k13J20J50o5l6M4p2rQ7k29n6J78q8R4J53k63Q0J09j9
903A05k85J29K22l19J54j18L7j32L44J10l37J39l01L39r1m9L19l37K66j6l84J12
925i3m1o9J72j17Q8j28R4R1j8J50R5n10K78l02J72K44j80J1n6lPJ20K29j44K7
950A17l3j78p8K56J00n3j76J59l44K62N7R6jp2k31N0N1N1m2M2n1j38K02r8j30
975a82K82q1O5M16n37k68K20L13p8j15J07L8j37l31J11L06j55ko6O1j35J26J27
$$ plain form
998 85 110 -21 -100 -157 28 -161 73 -159 122 -32 285 -45 -261 231 -42 240 322 86 -125 115 106 54 -45
1021 -45 -174 -148 -209 -151 -120 88 73 44 187 -235 108 -10 8 18 -81 63 -178 -77 52 72 -268 -244 102 -44
1045 -44 305 -107 -338 -252 -12 15 -282 -18 105 168 -218 5 -118 -47 -67 -7 51 -140 77 -120 -119 -49 224 -43
1069 -43 -131 180 -196 -190 20 13 -209 193 136 306 -93 90 -6 -158 30 172 12 39 210 18 99 101 -133 -12
1093 -12 124 95 -3 173 -135 -64 -107 36 -75 -172 158 -170 5 171 267 -123 -34 -379 144 70 -29 -58 103 275
1117 275 281 132 39 35 103 112 -9 65 -113 22 36 395 -50 67 135 -97 -8 12 -57 -44 -71 -71 -28 15 56 266 -44
1144 -44 -277 -67 199 -80 87 -123 -2 -180 -175 42 68 152 105 8 -335 -277 155 -67 -28 -50 40 156 -243 18
1168 18 143 249 104 71 93 107 52 96 -174 207 -177 -60 291 72 -189 -200 -75 324 -149 -71 161 -132 215
$$ packed form
998H5K5j31p9n7J85j89K34k32K81j54L17l30k16M92k73K82Q2k36k11K40rn2r9
1021d5j29K6o1N8L1K08j5k9J43m22L43j18J8J0r9J44k41J01J29K0l40K4L46j46
1045d4L49m12k31Q6K40K7k97K64J23O3l86K23j23P1k0O0N8j91K17j97JP0K73k67
1069d3q8L11l76OK10pk22M02n7J70l99J83r6j52J88J42j60K7J71j92Q1Kk34J21
1093a2J36k9r8J76l08P1m3J43j11r7L30l28J75J66R6l90Q9l45N23p4r9k9J61J72
1117B75Oj49r3mO8Rj21P4j78J35J4L59m45J17O8k32Q9K0o9J3k7%M3M3M1K10l10
1144d4k33K10K66k79J67k10J21j78NK17K6Q4m7r7l43N8M32k22L9k2R0J16l99K61
1168A8J25J06j45l3K2J4n5M4k70L81l84J17L51k19k61j1J25L99m73P8K32k93L47
$$ plain form
1191 215 -240 -302 -187 -77 19 -85 244 15 -128 -50 -61 354 270 134 117 16 28 35 -16 -5 -246 -132 -100 -3
1215 -3 -50 239 -123 -146 22 68 -115 -108 138 -124 32 -24 27 192 -124 -62 49 218 -88 -107 -77 -304 -38 -80
1239 -80 -74 -52 -133 128 -40 -92 -224 195 195 9 -105 -85 -13 -91 22 -33 -49 -49 172 136 62 -140 121 -132 27 -149
1265 -149 100 166 -83 110 -141 -151 -27 98 -307 -45 225 -120 125 244 -24 37 -194 -178 3 303 109
1286 109 90 35 31 59 -64 -207 -9 191 -155 -56 34 14 26 7 -193 -62 -63 49 -19 163 10 34 0 77 234
1311 234 -2 -143 276 266 169 8 35 -35 248 271 222 103 -137 41 6 58 21 214 -192 77 53 120 -77 28
1335 28 -150 -20 30 66 65 53 -35 107 148 -257 -260 -171 -68 -22 -104 -231 168 -36 66 82 53 5 204 26 -29 222
1361 222 93 47 -195 20 -116 130 -77 20 -207 148 78 16 47 -81 215 -269 55 -108 40 -119 -106 -228
$$ packed form
1191B15m55o2J15J10R6j04L29k29j43P8j1M15q4j36j7j01J2Pn1J1k41J14L2R7
1215cm7K89l62k3J68M6j83PK46k62J56n6N1J65l16O2J11J69l06j9L0k27K66m2
1239h0OK2q1K61j68n2j32M19%j86j14K0P2p8J13n5j6%K21l6p4k02K61k53J59j76
1265a49K49O6k49J93k51j0J24J25m05K62K70l45K45J19k68O1k31J6J81L00j94
1286A09j9n5mK8j23j43J98K00l46R9R0k0J2j9k00J31jJ12o8J82j53K4l4P7J57
1311B34k36j41M19j0r7j61K7p0K83K3m9j19k40J78l5N2l7J93m06K69k4O7j97J05
1335B8j78J30N0L6jj2q8J42M1m05lQ9J03M6q2j27L99k04J02J6k9m8J99j78n5K51
1361B22j29m6k42K15j36K46k07R7k27L55p0o2L1j28K96m84L24j63J48j59J3j22
$$ plain form
1383 -228 73 60 -29 -109 -166 -42 27 138 262 217 -168 -151 46 109 -3 -31 120 94 22 -139 102 -46 -31 -100
1407 -100 13 49 -163 -402 41 294 66 251 97 -124 169 128 -59 0 -334 -128 80 88 46 -238 339 -18
1429 -18 23 109 -145 69 65 -95 -163 -46 247 -200 240 45 -127 4 34 -97 176 210 -147 173 -68 59 -60
1452 -60 -86 -217 135 46 -95 -139 -43 98 13 137 -30 60 193 99 -258 -230 -64 71 49 120 -26 -234 113 55
1476 55 218 176 -35 -155 -207 234 -5 -107 37 321 -12 -88 70 -87 121 126 56 49 -10 -41 -183 271 99 -142
1500 -142 -167 -117 -23 -32 -157 105 -140 -150 29 222 -154 147 51 -1 -303 -47 106 -46 119 -27 -144 -96 13
1523 13 -149 -125 122 219 223 145 -118 10 -135 -182 -85 21 9 -2 174 154 290 -42 3 104 -73 70 -60 80
1547 80 -75 -282 31 -27 23 83 15 91 55 -184 68 -157 -128 -334 54 -114 162 -191 -49 103 -122 -399 161
$$ packed form
1383b28L01j3q9q0n7J24O9J11J24m5l85J7J97O3j12k8J51k6p2j61K41j48J5o9
1407a00J13L6k12k39M43K53k28J85j54k21K93m1j87N9l34K06K08Qm2k84N77l57
1429a8M1Q6k54K14mj60o8J17K93m47M40j95j72J31L0j31K73L4l57L20k41J27j19
1452f0k6j31L52q9j41m4R6J41q5J24j67R0J33r4l57K8J66J35k2P1j46k08L47n8
1476E5J63m2k11j20n2M41k39j02J44K84l33p6J58j57K08Np0pn9l1j42M54j72k41
1500a42k5N0R4rj25K62k45j0J79J93l76L01r6n2l02K56J53j52J65j46j17M8J09
1523A3j62K4K47R7Mp8k63J28j45m7R7J06j2j1J76k0J36l32M5J01j77J43j30J40
1547H0j55k07L13n8N0O0o8P6l6k39K52k25K9k06L88j68K76l53J42J52k25k77N60
$$ plain form
1570 161 94 118 71 123 75 278 4 96 -19 87 -114 63 88 -9 115 77 -21 167 214 -96 33 139 34 -15
1594 -15 -51 91 29 11 -110 -39 -88 85 104 -24 230 -65 37 -60 -174 -27 113 -167 -75 99 71 -86 -67 -52
1618 -52 -60 29 -151 -139 -70 278 85 -154 231 -248 -182 -217 345 3 62 -25 -40 115 -142 106 113 129 -31 -131 302
1643 302 -159 132 -62 -80 215 102 -175 -332 -36 -62 -161 -88 -23 -88 -257 106 -65 52 133 -134 46 -134
1665 -134 -36 -45 -71 -90 -198 264 49 -144 104 -193 -12 113 -242 181 124 163 -171 48 -17 -98 -128 9 -87 -145
1689 -145 82 -24 -217 -68 -81 -92 102 19 -199 -137 -155 22 9 -186 -215 -177 52 71 -61 75 -21 -62 16 -145
1713 -145 -21 143 259 129 229 -80 -33 60 -86 -87 -28 -61 -12 91 -105 -32 134 18 -151 -78 70 121 10
1736 10 -56 -255 1 205 54 -227 -10 -99 57 -326 -46 -259 195 -263 -164 104 -97 9 70 115 -26 341
$$ packed form
1570A61o7K4m7N2m8K03k74R2j15J06k01J77K5r7J24l8r8J88M7l10J29J06j05m9
1594a5l6J42o2j8j21P1m9J73J9j28K54k95J02r7j14J47J40k80R2J74k8j57J9J5
1618e2qQ9j80J2O9L48j93k39L85m79O6l5N62l42N9q7j5J55k57K48PJ6j60j00M33
1643C02m61K91j94j8K95j13k77j57K96k6r9P3O5o5j69L63j71J17Q1k67J80j80
1665a34R8rk6j9j08M62k15j93K48k97J81J25l55M23n7L9l34K19o5q1l0J37r6n8
1689a45K27j06j93J49j3j1J94q3k18O2j8J77j3j95k9L8K29J9j32J36r6m1P8j61
1713a45J24J64J16j30J00l09M7R3j46jN9l3M9J03j96P3J66j16j69P3J48N1j11
1736A0o6j99K56K04j51k81K17q9J56l83K80k13M54m58R9K68k01J06O1M5j41L67
$$ plain form
1758 341 -117 -11 83 130 -84 -90 -104 81 -94 175 208 163 17 -86 43 -134 25 -138 -447 -95 51 3 -262
1781 -262 -173 186 97 275 83 -228 -29 244 85 4 30 -54 -318 -151 102 2 -108 -17 141 88 115 -81 -70
1804 -70 -67 -501 -289 234 74 142 341 18 112 -148 113 -190 -224 -216 383 98 -17 -59 65 -38 -42 137 -161 -85
1828 -85 41 -54 -36 -145 43 -56 -123 142 -23 -165 362 -4 201 128 97 185 57 -21 81 40 -9 27 99 -88
1852 -88 130 -109 -149 -190 -115 112 -127 72 181 17 -26 23 -159 130 203 116 -40 210 204 -2 -86 -118 139 -17
1876 -17 48 -66 -78 -45 44 356 -153 107 98 -6 -165 89 -3 189 -24 104 309 -44 -223 -145 53 87 -136
1899 -136 -5 -1 -53 -151 172 25 -5 -297 -176 57 -302 268 -50 26 200 53 -255 94 -28 -76 -197 218
1921 218 -38 127 182 -155 -193 -25 -3 175 -117 -42 -137 23 106 -205 -105 15 -275 -176 90 53 -130 34 -63
$$ packed form
1758C41m58J06R4M7k14oj4J85j75K69L3m5j46j03J29j77J59j63l09L52J46m8k65
1781b62Q9L59q9J78j92l11J99K73j59q1K6q4k64J67K53j00j10R1J58n3K7j96J1
1804g0Lm34K12N23j60O8J99l23R4k60K61l03l4QN99k85j15m2J24j03mJ79k98P6
1828h5J26r5J8j09J88r9o7K65j65j42N27l66K05p3l1Q8j28p8J02m1m9L6P2j87
1852h8K18k39m0m1P5K27k39J99J09j64m3M9j82K89P3q7j56K50ok06q4l2K57j56
1876a7O5j14j2L3Q9L12n09K60rj04j59K54r2J92k13J28K05l53j79P8J98L4k23
1899a36J31Mn2r8L23j47l0k92J21K33l59N70l18P6J74j47l08L49j22m8j21M15
1921B18k56J65N5l37l8J68K2J78k92P5r5J60Q3l11J00J20k90R9K66l7j83J64r7
$$ plain form
1944 -63 -30 -18 -65 -53 -58 100 -27 -48 -17 -200 -62 -79 53 -20 -186 156 211 -190 84 -120 -62 228 -237 -146 51
1969 51 -10 44 139 1 -72 -66 94 -123 -47 57 80 34 -154 69 26 135 223 -82 -116 -91 -81 -72 -128 81 201 231
1995 231 -163 8 -110 -138 158 49 -216 23 33 55 127 128 -219 -3 -245 -81 -1 -227 31 -237 298 -200
2017 -200 -16 -117 194 155 204 3 -112 67 -202 191 -264 23 -49 -7 -166 205 -124 -89 -200 59 -43 -56
2039 -56 -27 -126 -282 10 -192 60 -3 -121 141 -243 91 -117 -201 -119 -38 -163 11 90 -137 -38 -54 -159 -129 114
2063 114 155 -154 -129 185 -79 -17 5 -92 145 -77 182 -151 -112 112 -79 19 -78 30 -215 -14 28 14 -292
2086 -292 -7 118 -37 -56 150 -334 24 -147 -164 -123 9 78 -21 -76 188 -138 66 -174 -68 68 61 33 -46
2109 -46 -206 -43 16 -9 -126 87 -227 -312 162 32 -102 -128 -312 -186 -19 46 5 -121 -73 47 142 59 71 -64
$$ packed form
1944f3L3J2m7J2nJ58j27k1L1j83J38j7J32p3j66L42N5m01K74k04N8K90m65R1J97
1969E1o1N4R5j38p3OJ60k17P6J04K3m6j88K23m3J09Q8l05l4K5J0Rn6K09J20L0
1995B31l94J71j18k8K96j09k65K39J0K2P2Jl47K16k42J64Q0k26K58k68N35m98
2017b00J84j01L11l9M9k01j15J79k69L93m55K87p2M2j59L71l29L5j11K59j02j3
2039e6K9r9j56K92k02K52o3j18K62l84L34k08q4Q2Q1j25J74P9k27R9j6j05L0K43
2063A14M1l09K5L14k64O2K2r7K37k22K59l33L9K24j91R8r7J08k45K01M2j4l06
2086b92K85J25j55j9K06m84L58j71j7M1J32O9r9n5K64l26K04k40J06J36pk8p9
2109d6j60J63N9k5j17K13l14q5M74j30j34k6j84J26J67O5m1j26M8J20R5q3J2j35
$$ plain form
2133 -64 -167 50 -50 -268 -108 -28 -239 194 -81 246 -139 162 -18 -96 152 -124 -115 -20 224 5 -49 128
2155 128 11 -112 -49 62 -176 -157 111 -116 151 -118 -70 -100 -160 35 153 62 62 -150 213 -145 9 16 53 -244
2179 -244 141 -66 63 59 -211 -477 135 -329 164 -233 -2 -126 -22 110 -54 23 42 265 143 -210 109
2200 109 -21 0 209 -9 29 78 16 102 129 -129 -19 82 -31 -91 -98 -35 169 -42 24 -78 12 8 31 -275 48
2225 48 -37 -65 23 79 -6 93 -241 -231 19 79 -147 169 -306 129 -112 -141 52 -49 40 -233 -127 40 100 -16
2249 -16 -85 174 -207 24 47 223 -210 61 233 -182 -65 -31 -16 66 44 76 -140 120 -35 2 127 92 -44
2272 -44 14 -198 -285 -135 8 188 201 114 -86 245 -36 -116 3 161 229 -28 106 93 88 85 -103 -191 -99 2 -86
2297 -86 -180 202 -241 311 335 -1 -216 114 -75 -163 76 -257 125 158 96 24 -4 5 0 55 66 -118 -312 102 -80
$$ packed form
2133f4j03K17j00k18J60Q0k11M33k75L27l85L01j80p8K48k76RR5K44k19n4J77
2155A28j17j23O3J11k38J9K68k27K67k69M8l0o0J95J18r1%k12L63l58J54PL7k97
2179b44L85k07J29mk70k66O12m64M93l97K31j24J04J32j64P7J9K23j22l53L19
2200A09j30K1K09k18L8M9o2Q6K7k58J10J01j13o0pO3K04k11O6j02R0mK3l06L23
2225D8q5k8Q8N6q5R9l34J0K50O0k26L16m75M35k41k9J93j01Q9k73J06J67O0j16
2249a6o9K59l81K31K3J76m33K71J72m15J17L4J5Q2k2L2k16K60j55L7J25l5j36
2272d4N8k12q7J50J43J80J3q7k00L31k81q0J19J58O8k57J34j3nlj88q8R2J01q8
2297h6r4L82m43N52K4l36k15L30j89q8K39l33L82L3o2p2k8RnN5J1j84j94M14j82
$$ plain form
2322 -80 -127 -72 105 53 -150 42 91 28 -254 159 217 -29 -96 -74 -106 64 -53 233 39 -75 -94 108 -9 13
2346 13 44 -130 -257 -15 75 131 -5 301 316 185 34 22 -48 161 191 -114 35 -173 384 67 138 -189 239
2369 239 -123 122 -77 -132 130 29 -20 4 50 114 14 -162 211 -195 142 -91 -87 -204 -96 -86 147 -24 -20
2392 -20 -173 88 312 -79 99 -19 -134 -150 20 102 -165 -121 -109 -13 241 56 255 141 174 -66 88 -28
2414 -28 70 -290 -42 -46 -88 -93 45 -272 162 1 157 31 27 44 156 -26 53 328 160 -149 -188 14 -257 286
2438 286 73 -117 -91 9 36 93 -119 124 -88 -103 75 -182 266 14 294 -131 3 -65 22 90 -74 102
2460 102 -161 -263 0 71 -114 112 55 92 258 -145 -21 -132 -150 -105 -145 -24 -89 -309 214 71 -107 -51 37
2483 37 199 204 -20 119 86 13 82 242 -56 83 -14 141 42 -64 134 136 174 -188 124 86 -6 -124 -22 -183
$$ packed form
2322h0m7N5J77n2k03J92M9o3k82M13N8k46o7K2l2J70j17K86j94j14j9K02j17K2
2346A3L1j74j27K42R0N6j36L06J5j31j51j2p0K09L0l05J49k08N57l17P1l27M28
2369B39l62K45j99n5K62j01m9K4M6O4j00j76L73m06L37k33Mj17J08J0K33j71M
2392b0j53K61K24l91J78j18j15j6J70Q2k67M4J2R6K54j85J99j14L3k40J54j16
2414b8R8l60K48mm2nJ38l17M34j61J56j26mJ7J12j82P9K75j68l09l9K02k71N43
2438B86k13j90K6J00K7N7k12K43k12j5J78k57M48k52K80m25J34o8Q7O8j64J76
2460A02k63j02K63P1j85K26n7L7J66m03J24j11j8M5m0J21o5k20N23j43j78N6Q8
2483C7J62Nk24J39l3p3O9J60k98J39r7J55r9j06J98KL8l62L12l8r2j18J02j61
$$ plain form
2507 -183 15 107 22 87 -179 0 86 -167 80 -199 6 160 67 44 176 -7 -111 44 78 -291 133 159 -95
2530 -95 -149 -159 61 -286 -95 182 -82 56 -160 -35 106 26 -35 120 224 -226 -267 86 57 9 381 123 -46
2553 -46 147 2 -284 56 131 -21 -78 7 -283 183 -114 -51 -138 -136 96 127 6 -51 57 105 255 -305 63 59
2577 59 -62 -251 -91 35 107 -89 -58 109 120 -183 156 41 -189 34 186 -59 -173 82 312 -148 -8
2598 -8 -32 72 46 -113 125 -57 -27 -16 -164 81 7 69 91 -92 -326 -47 210 158 238 -198 -13 -175 85 -41
2622 -41 26 -87 41 168 30 14 61 212 -48 -171 292 -43 73 -190 118 -310 -246 -2 -94 18 -19 -101 -42
2645 -42 131 -12 82 -19 8 -138 21 -46 -30 -66 28 -63 -185 96 81 88 115 13 52 -57 225 -234 -105 77
2669 77 40 -115 -273 -18 -44 0 -196 4 9 69 119 -1 42 117 246 -159 -204 24 -127 125 -329 -405 -78 82
$$ packed form
2507a83J98R2q5O5k66J79Q6k53K47k79K05J54r3k3J32j83j04J55L4l69M24K6k54
2530i5n4j0K20l47J91K77k64J38k16J25J41q0o1J55J04m50m1L53k9m8L72k58j69
2553d6J93j45k86L40P5j52n7Q5k90M66k97O3q7KK32L1j21n7J08M8J50n60L68m
2577E9j21j89J60J26P2j96L1J67J1l03L39j15k30K23J52k45j14K55K30m60J40
2598hk4J04k6j59K38j82L0J1j48K45p4O2K2j83k34K79K57n2Q0m36J85j62K60j26
2622d1O7j13J28J27j38j6M7J51k60j23M63l35J16k63L08m28O4K44r2J12l7q2N9
2645d2J73j43R4j01K7j46J59o7J6l6R4r1j22K81j5PK7j02L9j09K82m59J29J82
2669G7l7j55j58K55k6M4j96K00NO0N0j20M3P5J29m05m5K28j51K52m54p6L27J60
$$ plain form
2693 82 41 -21 -90 -46 -212 360 47 -84 58 7 19 -177 221 -16 -152 98 178 325 153 -99 -138 97 28
2716 28 -37 -227 -279 146 -140 -202 -63 127 -81 -3 83 -106 84 265 -95 117 53 32 -170 -70 67 -245 40
2739 40 73 -382 -119 -10 -34 -57 -185 9 -315 -102 15 -65 95 -56 -292 270 -178 -88 -58 146 56 149 -163
2762 -163 24 201 17 -178 -136 156 57 -91 -237 -110 69 -137 18 297 -6 -6 -55 222 188 272 -146 208
2784 208 -72 154 10 -3 61 -59 -30 25 -85 160 97 197 171 278 112 -91 88 -296 175 -128 -32 -67 11
2807 11 -272 -108 103 105 108 -143 314 -106 278 -30 -28 143 196 77 -202 71 -28 58 176 150 35 -7 -9 -227 -5
2832 -5 -291 -40 -262 -120 29 -71 -27 107 -14 -107 232 -188 92 -77 -210 -217 -17 -92 214 -57 -1 52 -8
2855 -8 -103 105 224 -41 -114 -61 131 98 -70 231 -342 200 77 108 -7 -16 -114 5 63 -216 -287 214 207 96 56
$$ packed form
2693H2m1o2o9M4j66N72l13j31J42n1J2j96L98k37j36K50Q0J47j72k52l9K35o9
2716B8o5j90n2M25k86o2J39J90k08P8Q6j89J90J81l60K12o4k1k02J00J37l12K85
2739D0L3m55K63J09k4k3j28J94l24K13J17q0J60j51k36N62m48R0L0K04r0R3l12
2762a63J87J77j84j95M2K92r9j48j46J27J79k06J55K79l03%m9K77l4Q4m18L54
2784B08k80K26j44j3O4j20K9N5j10K45o3J00k6J07j66k03J79l84M71l03R6l5P8
2807A1k83J64K11KLk51M57m20L84l08KJ71N3j19k79K73r9Q6J18k6j15m2kk18K22
2832ek86K51k22J42J49j00M4J34j21r3L39m20K80j69j33pK00p5L06k71N6N3o0
2855hr5K08J19k65p3N3J92l3j68L01n73N42j23L1j15rr8J19N8k79p1N01pj11m0
$$ plain form
2880 56 -108 1 -274 216 22 112 145 136 -144 -126 -120 -98 -124 10 89 -69 -137 96 -133 103 -21 -56 -102 89 -75
2905 -75 -38 42 88 154 -177 183 -42 -103 30 -68 218 459 -200 -170 21 104 -246 135 -11 203 -90 225 -98
2928 -98 212 -2 178 257 -56 -89 112 417 -25 -191 -34 115 38 81 -12 -19 -206 -52 -63 -162 -55 16 88 274
2952 274 -95 -76 28 -209 147 5 -95 184 47 -99 155 -341 89 72 91 152 113 -148 -250 208 55 -208
2974 -208 64 -237 181 98 -129 -16 -243 19 40 192 245 103 -94 -250 -151 31 -116 33 -132 111 33 12
2996 12 -96 96 -83 -101 31 -53 6 16 35 54 127 -220 -195 -124 230 -140 -171 44 60 -119 -227 -288 29 -178
3020 -178 130 -58 41 9 -14 -78 -101 226 -7 68 12 -54 -149 122 -418 97 145 -204 -57 -28 -1 95 166 -61 -17
3045 -17 -51 13 -151 -35 -136 -13 -21 247 234 -81 -19 -22 -67 -50 -33 -88 15 103 172 -7 -122 12 64 -134 -46 51
$$ packed form
2880E6j64J09k75M90j94R0L3rk80J8OK2k6J34P9j58o8K33k29K36j24l5m6J91j64
2905g5L7Q0M6O6l31L60k25o1J33r8K86K41o59L0J91Q3l50L81j46K14k93L15l23
2928i8L10k14J80P9l13l3K01L05m42j66J57J49p7M3r3pj87J54j1r9J07P1P2J86
2952B74l69J9J04k37L56j42j00K79j37j46K54m96M30j7J9O1l9k61j02M58j53k63
2974b08K72l01M18q3k27J13k27K62K1J52N3j42j97j56R9J82j47J49j65K43p8k1
2996A2j08J92j79j8J32q4N9J0J9J9P3l47K5P1L54l70l1K15J6j79j08o1L17k07
3020a78L08j88R9l2k3o4k3L27k33P5n6o6r5K71n40N15M8l49J47K9K7R6P1k27M4
3045a7l4O4j64J16j01J23qK68j3l15O2lm5J7J7n5J03Q8O9j79j15J34N2j98Q8R7
$$ plain form
3071 51 -190 236 176 -136 92 247 -34 74 91 -4 -345 45 53 210 1 -122 -255 34 -64 -5 27 28 5 -66
3095 -66 109 127 125 -269 53 30 69 -76 -292 52 106 221 162 -343 -153 160 208 15 -194 -108 100 220 -97
3118 -97 118 -89 28 243 -136 -15 -68 -88 -275 -175 44 46 -120 -114 64 296 123 -116 -29 -33 -37 -94 -142 -166 36
3143 36 -19 -71 -151 -252 -61 92 -122 174 -33 -58 -42 -257 27 69 -239 -119 -154 -106 185 -245 75 181 141
3166 141 -35 -25 44 183 -189 -41 -59 -40 181 163 -38 -31 -322 75 21 -13 96 -42 -51 56 31 73 -58 -56 -15
3191 -15 163 244 -52 262 37 -16 -94 133 -169 36 45 83 82 -25 -306 23 57 -35 -56 67 195 -113 -150 127
3215 127 11 -166 -71 -95 -147 139 -5 23 149 2 25 120 -167 -108 -243 -60 35 94 44 -134 -351 -264 159 65
3239 65 -242 124 -106 98 34 268 51 -75 -5 -168 97 -90 35 114 -88 -261 -88 -45 135 1 -4 -135
$$ packed form
3071E1k41M26o0l12K28J55k81J08J7r5l41L90QJ57k09j23j33K89r8N9L2Jk3p1
3095f6J75J8kl94L22k3L9j45k16L44N4J15n9n05J90L13M8j93k09Q6K08J20l17
3118i7K15k07J17K15l79J21n3k0j87J00K19Kj66OJ78K32j73k39Q7mmn7m8k4K02
3143C6n5n2q0j01J91J53k14K96k07k5J6k15K84M2l08J20l5M8K91m30L20J06m0
3166A41j76J0O9J39l72J48j8J9K21j8k01Pk91L97n4l4J09j38rJ07k5M2j31KM1
3191a5J78Q1k96L14k25n3p8K27l02K05RL8jj07k81L29L4r2k1J23J28l08l7K77
3215A27j16j77R5k4n2K86j44K8J26j47K3R5k87N9j35J83R5N9n0j78k17Q7M23r4
3239F5l07L66k30K04o4K34k17j26P0j63K65j87J25P9k02j73J73M3J80j34nj31
$$ plain form
3261 -135 194 2 22 -43 -187 -283 -209 89 -292 214 122 -130 25 -121 0 -49 -12 178 279 -130 -46 93 159
3284 159 -128 -309 105 10 193 132 278 92 -32 144 -96 -227 192 153 -48 -104 -137 176 -104 -271 204 119
3306 119 -164 -244 -87 26 -96 -102 -128 -136 -78 68 -92 98 93 112 52 -56 -106 158 169 29 104 -15 16 -130 133
3331 133 282 -37 152 27 -79 -223 61 -67 -83 -115 46 22 63 119 261 193 138 200 187 300 180 20 -141
3354 -141 -24 -8 -37 -3 -81 94 -97 -166 78 207 -45 78 -52 13 -101 -221 -138 179 -123 -206 -34 -60 202
3377 202 79 119 -5 54 -126 -117 -8 177 -133 -59 -60 249 -54 -172 233 -162 21 39 14 54 -7 -137 118 119
3401 119 194 121 21 14 -46 -4 228 154 277 186 -79 -2 154 36 197 -35 86 41 -167 66 -126 208 -9
3424 -9 210 2 -72 280 -253 -201 -72 -91 80 -48 29 381 -11 -128 238 -147 26 -109 -251 80 -68 224
$$ packed form
3261a35L29j92K0o5j44r6P4K98l81N06r2k52J55j46J21m9L7J90J01m09Q4J39O6
3284A59k87j81M14r5J83o1J46j86j24J76k40j31M19l9k01n6l3L13k80j67M75q5
3306A19k83q0J57J13j22ok6qN8J46j60J90nJ9o0j08n0K64J1j40P5j19L1j46K63
3331A33J49l19J89j25j06j44K84j28j6l2J61k4M1N6J42o8n5O2j3J13j20j60j61
3354a41J17J6k9L4p8J75j91o9K44J29k52J23j30O5j14j20Q3L17l02q3J72k6K62
3377B02j23M0j24N9j80RJ09J85l10P4jL09l03j18M05l95J83J8k5M0o1j30K55J
3401A19P5p3j00po0M2K32p4J23r1k65P7J56j18J61k32J21m5k08K33j92L34k17
3424iK19k08p4L52n33N2J29j9J71j28P7L52l92j17L66l85J73j35j42L31j48K92
$$ plain form
3446 224 209 -83 -460 -159 165 -145 -130 -17 -129 151 -98 -59 -106 159 -332 -67 -154 109 -211 -208 22 245
3468 245 16 241 -2 -55 -65 89 283 -106 -142 -59 335 -72 41 55 8 -202 -88 -123 240 -180 5 182
3490 182 205 40 204 245 200 -29 -125 282 -146 50 -45 -235 -263 151 -91 10 -77 112 18 34 -10 39 79 -61
3514 -61 -251 -32 -31 70 -110 4 36 -289 -134 -203 -103 -66 -395 -31 82 86 263 -78 148 -53 -131 15 -44
3537 -44 -61 47 -164 -47 257 1 65 176 -149 173 -34 56 -144 -84 81 87 124 -70 -148 -117 -115 -56 -276 -138
3561 -138 -115 366 -106 29 212 -67 -215 -42 219 42 209 -134 94 -38 -218 93 491 281 -80 81
3581 81 192 143 -82 234 -56 -20 76 -197 -65 126 15 -80 -59 -179 76 -129 100 96 -14 -77 81 86 191 -285
3605 -285 254 -127 155 92 24 36 -410 302 97 -101 9 112 -108 -95 93 13 -37 -71 -119 -54 70 268 191
$$ packed form
3446B24j5k92l77L01L24l10J5J13j12K80k49L9m7K65m91K65q7K63l20LK30K23
3468B45k29K25k43n3j0J54J94l89l6Q3L94m07J13J4m7k10J14l5L63m20J85J77
3490A82K3j65J64M1m5k29r6M07m28J96r5j90k8M14k42J01q7J89r4J6m4M9M0j40
3514f1j90K19JJ01j80J14L2l25J55o9J00L7l29L64J13MJ77l41K26k01p8J46n9
3537d4j7J08k11J17L04k56O4J11l25L22k07R0k00O0J65OL7j94p8L1KN9k20J38
3561a38K3M81m72J35J83k79j48J73K61j77J67l43K28j32j80L11L98k10l61J61
3581H1J11m9k25L16k90L6R6k73J32J91j11r5K1j20K55k05K29mj10o3J58NJ05m76
3605b85N39l81K82o3o8J2m46P12k05j98J10J03k20J3J88q0n0l4m8O5J24J98p7
$$ plain form
3628 191 241 -288 -63 -130 218 178 -207 -433 311 -106 120 271 -127 -75 100 -190 -83 83 -84 -109 138 -22
3650 -22 37 3 198 -159 59 148 173 -38 85 8 66 19 20 68 -238 -96 82 22 -93 -169 -48 98 -83 397
3674 397 -127 110 -224 173 15 -18 173 -205 36 128 274 -47 -217 -22 78 -95 -51 126 30 -101 -251
3695 -251 -254 -126 -156 -64 -24 -78 156 -33 85 30 10 -116 230 -206 -320 42 32 -57 117 12 28 -110 131 -174
3719 -174 83 -99 66 -200 -72 -10 119 223 -59 8 136 -24 237 -56 -204 53 -30 -94 -174 -8 81 141
3741 141 129 101 -47 125 -94 103 -201 32 119 -21 158 -19 137 33 231 275 76 177 -101 34 -81
3762 -81 -116 42 -207 42 226 102 -2 -120 173 -78 21 91 -59 -117 -184 155 -41 -105 4 -195 302 -139
3784 -139 73 21 -73 -197 164 91 -289 9 -74 -90 125 34 10 -58 232 -148 355 76 38 -293 -202 152 108 167
$$ packed form
3628A91N0n29K25o7L48m0l85k26P44m17K26J51l98N2J75k90J07J66j67k5K47j60
3650b2N9l4J95l57K18Q9K5k11J23p7N8m7JM8l06J42J78o0j15p6J21J46j81M80
3674C97n24K37l34L97j58l3J91l78K41R2J46l21j70J95J00j73M4J77r6j31j50
3695b51lJ28l0R2M0n4K34j89J18n5k0j26L46m36j14L62j0q9J74j05J6j38K41l05
3719a74K57j82J65k66J28O2J29J04k82O7J28j60K61k93j48K57q3o4q0J66Q9O0
3741A41j2k8j48J72k19J97l04K33Q7j40J79j77J56j04J98M4j99J01k78J35j15
3762h1l5J58k49K49J84j24j04j18K93k51R9P0j50n8o7L39j96o4J09j99M97m41
3784a39K12n2r4j24L61p3l80K98q3j6K15r1k4o8K90l80N03k79l8l31R1L54m4N9
$$ plain form
3808 167 -13 5 -7 -140 -118 38 -328 -274 -2 151 98 128 58 188 -83 -184 -100 30 -126 -101 -127 126 -16
3831 -16 92 284 18 45 -147 60 49 -106 5 -80 157 -185 25 115 22 -233 -236 -86 134 14 -202 168 173
3854 173 23 61 -88 65 -222 -154 -118 70 -114 -56 -103 -114 -22 -298 314 -108 93 40 -54 -104 -38 6 100 -19
3878 -19 82 5 104 -89 46 45 -100 75 37 11 -416 161 -46 -201 -60 159 292 81 20 227 -20 7 85
3901 85 -74 47 -196 -84 -75 -141 274 -70 -84 -147 -63 32 43 216 -97 -187 2 388 -180 39 91 16 27 79 43
3926 43 26 -45 -86 94 -52 132 128 88 83 -80 -118 -179 -47 238 25 162 33 -230 -191 -324 103 220 -15 -158
3950 -158 173 17 -149 -381 95 -135 -4 225 94 84 10 -71 -223 108 24 212 296 -132 117 182 -104 134
3972 134 -131 -72 -3 100 78 33 -62 210 92 -1 87 148 -135 22 -280 67 371 215 18 11 1 -102 85 22
$$ packed form
3808A67j80J8j2j33K2J56l66N4K72J53n3L0p0J30k71j01Q4J30j56K5k6K53j42
3831a6J08J92k66K7j92K07j1j55J11q5K37l42K10R0r3k55lJ50K20j20k16L70N
3854A73j50L8j49J53k87O8L6J88j84N8m7j1R2k76O12m22K01n3r4n0O6M4R4j19
3878a9J01p7R9j93J35jj45J75l8k6m27N77k07j55J41K19J33k11o1K07k47K7P8
3901H5j59J21k43J12Ro6M15l44j4o3Q4R5J1J73l13r0J89L86n68K19N2p5J1N2l6
3926D3j7p1m1J80j46J84mm0nj63l8o1J32K85k13J37j29k63L9j33M27J17k35j43
3950a58L31j56j66k32M76k30J31K29j31j0p4q1j52L31q4J88Q4m28K49O5k86K38
3972A34k65N9O9J03k2m5r5K72j18r3Q8O1k83J57l02L47L04j56j97pj0j03J87o3
$$ plain form
3996 22 135 -179 -342 -51 -327 -115 134 131 108 -67 68 320 158 -134 39 38 -134 217 198 69 154 81 108
4019 108 95 175 -106 -91 152 91 -6 -76 5 173 -2 -162 -287 101 245 205 21 108 -21 61 -3 -114 61 -46
4043 -46 47 178 -5 -181 -123 -60 -111 98 -15 189 191 35 238 109 16 5 -40 111 -23 50 -152 -124 295 369
4067 369 7 170 116 -169 -60 -142 48 45 -159 -94 -207 -161 18 173 63 32 129 -197 -8 -182 50 15 -48
4090 -48 -224 -38 140 63 104 -78 -47 93 -336 50 -283 -279 -17 117 -51 6 -21 154 -68 16 -8 62 62 25 118
4115 118 2 -32 -200 138 143 150 145 38 -570 -91 155 -119 212 64 133 -164 74 130 -359 -141 152 -4 94
4138 94 110 97 -14 -95 187 11 -69 80 12 205 3 -6 36 66 -35 12 26 96 -22 -110 150 260 -106 -140 -69
4163 -69 97 105 -37 160 -61 244 58 -249 190 -323 -21 304 13 -179 -67 68 87 -63 21 -551 217 135
$$ packed form
3996B2J13l14j63K91k76K12K49lk3j75J35K52j62k92J73jj72L51j9j29Q5p3K7
4019A08j3Q0k81J5K43o1r7p0Q1J68j75j60j25L88J44m0j84Q7j29Q2o4j11J75j07
4043d6R3J31j83j76N8O3n1K09j13K04Kj56K03j29r3j1m5J51j34P3k02K8M19P4
4067C69l62J63n4k85J09q2J90lk04O5j13M6J79J55j10l1R7l26J89j74K32l5o3
4090d8j76J86J78p7M1j82L1J40m29L86l33MK62J34j68N7k7J75k22Q4k4P0%l7R3
4115A18j16l4j68L38NPnj07o08M79K46k74L31j48O9k97K38N6m89K18K93j56R8
4138I4J6j3j11q1K82j76q0J49o8J93k02rM2L0j01M7J4P0j18q8K60J10l66l4P1
4163f9J66Qj42J97k21L05j86l07M39n13L02L25k91j92J12J35J9j50Q4n72P68q2
$$ plain form
4185 135 87 141 204 -205 -34 -79 -89 -42 1 -190 107 131 223 -159 315 -24 -132 382 -90 -230 -133 -47 0 11
4209 11 104 -211 40 102 -63 15 5 -15 249 -175 -15 -93 -89 -12 -195 169 -198 -149 7 123 -201 -50 234 36
4233 36 -160 -34 108 -221 -96 129 -38 67 136 -234 70 -9 238 -8 -261 60 -165 167 -100 67 239
4254 239 200 -154 -100 -80 50 -64 -38 198 26 160 -371 -74 387 132 -100 -63 -6 229 -81 99 159 -85
4276 -85 -143 144 -70 31 300 4 -325 53 -325 74 162 44 51 -114 139 77 -113 2 195 -284 155 365
4298 365 134 -183 -75 113 45 49 -309 108 9 -184 190 89 -104 -14 -45 34 21 25 97 54 47 8 -257 -47 102
4323 102 -291 -8 25 -178 -213 110 209 -221 -118 -307 -25 -112 64 -257 32 -189 -98 -70 175 81 162 80 -56
4346 -56 43 -130 120 -103 -34 39 -133 -120 114 -256 15 122 -194 -280 177 9 175 -120 -161 53 -47 100
$$ packed form
4185A35m8N4O3m09J71m5j0M7M3j91K97K4R2l82M74l39j08N14m72j40R7Q6M7J1
4209A1R3l15K51O2j65P8j0k0K64m24J60p8MP7j83L64l67M9J56J16l24J51K84j98
4233C6j96J26J42l29J25K25j67J05O9l70L04p9K47k46k53L21k25L32k67J67J72
4254B39l9l54N4K0J30j14K6K36j72J34n31K97M61k55k32L7N7K35l10J80O0k44
4276h5n8K87k14J01K69k96l29L78l78L99Q8j18Pj65K53o2j90J15J93m79M39K10
4298C65k31l17J08J88o8Ml58M17r9j93L74j01j93R0l1P9j3MP2m3pl9k65K10J49
4323A02l93K83L3k03l5L23R9m30J03j89K82q7J76l21K89k21R1K8K45r4Q1q2j36
4346e6R9j73K50k23O9P3j72J3K34l70K71J07l16q6M57j68J66k95m1K14j00J47
$$ plain form
4368 100 -364 -204 15 -29 -246 223 -128 -55 -172 -18 11 73 37 59 -40 -159 95 -58 -173 154 24 228
4390 228 -40 116 241 -44 301 -86 -101 -11 -201 -157 24 11 220 13 -292 123 207 145 10 22 70 -103 126
4413 126 26 -198 -42 -129 114 67 -188 212 -245 -137 -80 163 146 -41 41 -19 -4 -350 -16 25 136 -118 -28
4436 -28 -130 -50 -222 194 -193 -116 507 -160 65 -23 -219 -200 6 -61 -91 -8 -74 68 -3 -40 -63 3 -16 69 33
4461 33 246 129 50 -47 10 -96 -42 75 -19 30 23 -164 30 352 109 -13 -124 -74 -73 179 -32 -43 25 386 -183
4486 -183 17 256 -304 118 109 11 -83 144 -127 -82 -303 7 -120 113 106 41 115 -19 31 -4 -120 114 31 0
4510 0 -194 84 10 -87 -153 -156 -26 55 282 -32 -122 290 155 26 -8 88 -26 14 160 -85 159 -76 105 -49
4534 -49 -43 109 -54 -123 -252 66 10 141 145 -40 -53 10 -112 -130 -245 264 -256 185 188 -114 -93 -20 50 301 91
$$ packed form
4368A00m64J60K19m4k17M69l51P3j17J54K9O2l6K2r9j19K54j53j15L27j30K04
4390B28k68J56J25k85L45l87j5R0j90M4J81j3K09k07l05M15Q4o2j35J2M8j73K29
4413A26j00k24J56q7K43m7k55M00m57J08N7K43j7j87Q2o0J5l46L34M1J11k54R0
4436b8j02Q0j72M16l87P7O23o67K25q8j96J9K06o7l0Q3o6J42p1l7k3O6j9Q5l6
4461C3K13j17p9r7N7j06N4J17r4M9pj87J94L22k43j22j11N0JK52k11j1O8L61n69
4486a83K00K39n60M22rr8r4K27k71M5k21L10j27K33po5P4j34N0l5j16K34q3l1
4510@j94K78p4r7o6lJ30Q1K27l14r0M12j35j29l4R6j14M0J46k45K44k35J81j54
4534d9OJ52j63o9j29L18n6J31Mj85j3O3j22j8j15N09n20M41Ll02K1P3P0K51k10
$$ plain form
4559 91 5 -112 57 -144 103 -103 155 144 17 113 -113 -27 -52 119 -55 42 165 -56 -39 -39 -39 -169 -109 -68 -39
4584 -39 20 49 96 110 88 83 -78 -17 239 -168 -273 122 -74 28 24 -43 -84 154 74 29 329 115 -272 -210 -131 -70
4610 -70 134 158 56 -20 -43 -17 296 305 -27 -90 61 82 -266 177 69 -86 -132 43 126 -254 -50 115 128 -162
4634 -162 19 -121 112 73 3 102 -83 -198 -47 36 -30 -18 -184 212 -74 -243 -110 24 -81 -81 57 -84 -88
$$ packed form
4559I1q6j17J69k01K47k06K58j1j27R6k26Q6k5J71j74R7J23k21J7%%j30O0M1K9
4584c9N9K9M7J4k2nj61O1K56m07j05L95j96J02mo7m1K38q0m5L00k14l87O2P9O1
4610g0K04K4j02p6k3K6L13Rl32o3J51K1l48M43j08j55m6J75Q3l80K04J65J3k90
4634a62J81j40K33l9p0R9j85j15J51Q3o6J2j66L96k86j69J33J34j05%J38j41m
$$ [...]
8191B02
##END NTUPLES=NMR FID
##END=
