##TITLE=1H_DE-97K
 200.13MHz,CDCl3,
 8 sc
 
 7.7.2025
##JCAMPDX= 6.0         $$ Bruker NMR JCAMP-DX V2.0
##DATA TYPE= NMR FID
##DATA CLASS= NTUPLES
##ORIGIN= UXNMR, Bruker Analytische Messtechnik GmbH
##OWNER= pz
$$ XWIN-NMR		Version 3.5
$$ Mon Jul  7 14:15:06 2025 Russian Standard Time (UT+4h)  she@DPX200
##.OBSERVE FREQUENCY= 200.1313
##.OBSERVE NUCLEUS= ^1H
##.DELAY= (6, 6)
##.ACQUISITION MODE= SIMULTANEOUS
##.ACQUISITION SCHEME= undefined
##.AVERAGES= 8
##.DIGITISER RES= 18
##SPECTROMETER/DATA SYSTEM= spect
##.PULSE SEQUENCE= zg30
##.SOLVENT NAME= CDCl3
##.SHIFT REFERENCE= (INTERNAL, CDCl3, 0, 14.3821)
##AUDIT TRAIL= $$ (NUMBER, WHEN, WHO, WHERE, WHAT)
$$ ##TITLE= Audit trail, XWIN-NMR		Version 3.5
$$ ##JCAMPDX= 5.01
$$ ##ORIGIN= Bruker BioSpin GmbH
$$ ##OWNER= she
$$ F:/spectra/data/she/nmr/H-C/1/audita.txt
$$ ##AUDIT TRAIL=  $$ (NUMBER, WHEN, WHO, WHERE, WHAT)
(   1,<2025-07-07 14:13:30.71 +0400>,<she>,<DPX200>,
      <created by zg, POWCHK disabled, PULCHK disabled
       configuration hash MD5:
       00 E9 B6 7A A2 85 ED C7 34 08 36 98 17 FE 4E 26
       data hash MD5: 16K
       9D D0 8E 6F EC 66 7A 48 9A CF 22 40 9B CD C3 01>)
$$ ##END=
$$ 
$$ hash MD5
$$ 51 6B 8B D8 61 59 4D 16 91 FF F8 B7 30 6F C0 BA
##$RELAX= 
##$RELAX= 
##$RELAX= 
##$RELAX= 
##$RELAX= 
##$RELAX= 
$$ Bruker specific parameters
$$ --------------------------
##$DU= <F:/spectra>
##$EXPNO= 1
##$NAME= <H-C>
##$PROCNO= 1
##$TYPE= <nmr>
##$USER= <she>
##$AMP= (0..31)
100 100 100 100 100 100 100 100 100 100 100 100 100 100 100 100 100 100 
100 100 100 100 100 100 100 100 100 100 100 100 100 100 
##$AQSEQ= 0
##$AQ_mod= 1
##$AUNM= <au_zg>
##$AUTOPOS= <>
##$BF1= 200.13
##$BF2= 200.13
##$BF3= 200.13
##$BF4= 200.13
##$BF5= 200.13
##$BF6= 200.13
##$BF7= 200.13
##$BF8= 200.13
##$BYTORDA= 1
##$CFDGTYP= 0
##$CFRGTYP= 5
##$CHEMSTR= <none>
##$CNST= (0..31)
1 1 145 1 1 1 1 1 1 1 1 1 1 1 1 1 1 1 1 1 1 1 1 1 1 1 1 1 1 1 1 1 
##$CPDPRG= <>
##$CPDPRG1= <>
##$CPDPRG2= <>
##$CPDPRG3= <>
##$CPDPRG4= <mlev>
##$CPDPRG5= <mlev>
##$CPDPRG6= <mlev>
##$CPDPRG7= <mlev>
##$CPDPRG8= <mlev>
##$CPDPRGB= <>
##$CPDPRGT= <>
##$D= (0..31)
0 0.7 0 0 0 0 0 0 0 0 0 0.03 0 0 0 0 0 0 0 0 0 0 0 0 0 0 0 0 0 0 0 0 
##$DATE= 1751883210
##$DBL= (0..7)
120 120 120 120 120 120 120 120 
##$DBP= (0..7)
150 150 150 150 150 150 150 150 
##$DBP07= 0
##$DBPNAM0= <>
##$DBPNAM1= <>
##$DBPNAM2= <>
##$DBPNAM3= <>
##$DBPNAM4= <>
##$DBPNAM5= <>
##$DBPNAM6= <>
##$DBPNAM7= <>
##$DBPOAL= (0..7)
0.5 0.5 0.5 0.5 0.5 0.5 0.5 0.5 
##$DBPOFFS= (0..7)
0 0 0 0 0 0 0 0 
##$DE= 6
##$DECBNUC= <off>
##$DECIM= 32
##$DECNUC= <off>
##$DECSTAT= 4
##$DIGMOD= 1
##$DIGTYP= 9
##$DL= (0..7)
0 120 120 120 120 120 120 120 
##$DP= (0..7)
150 150 150 150 150 150 150 150 
##$DP07= 0
##$DPNAME0= <>
##$DPNAME1= <>
##$DPNAME2= <>
##$DPNAME3= <>
##$DPNAME4= <>
##$DPNAME5= <>
##$DPNAME6= <>
##$DPNAME7= <>
##$DPOAL= (0..7)
0.5 0.5 0.5 0.5 0.5 0.5 0.5 0.5 
##$DPOFFS= (0..7)
0 0 0 0 0 0 0 0 
##$DQDMODE= 0
##$DR= 18
##$DS= 0
##$DSLIST= <SSSSSSSSSSSSSSS>
$$ [...]
##$SUBNAM0= <"">
##$SUBNAM1= <"">
##$SUBNAM2= <"">
##$SUBNAM3= <"">
##$SUBNAM4= <"">
##$SUBNAM5= <"">
##$SUBNAM6= <"">
##$SUBNAM7= <"">
##$SUBNAM8= <"">
##$SUBNAM9= <"">
##$SW= 18.0517328524113
##$SWIBOX= (0..15)
0 0 2 0 0 0 0 0 0 0 0 0 0 0 0 0 
##$SW_h= 3612.71676300578
##$TD= 16384
##$TD0= 1
##$TE= 0
##$TE2= 300
##$TE3= 300
##$TEG= 300
##$TL= (0..7)
0 120 120 120 120 120 120 120 
##$TP= (0..7)
150 150 150 150 150 150 150 150 
##$TP07= 0
##$TPNAME0= <>
##$TPNAME1= <>
##$TPNAME2= <>
##$TPNAME3= <>
##$TPNAME4= <>
##$TPNAME5= <>
##$TPNAME6= <>
##$TPNAME7= <>
##$TPOAL= (0..7)
0.5 0.5 0.5 0.5 0.5 0.5 0.5 0.5 
##$TPOFFS= (0..7)
0 0 0 0 0 0 0 0 
##$TUNHIN= 0
##$TUNHOUT= 0
##$TUNXOUT= 0
##$USERA1= <user>
##$USERA2= <user>
##$USERA3= <user>
##$USERA4= <user>
##$USERA5= <user>
##$V9= 5
##$VALIST= <valist>
##$VCLIST= <CCCCCCCCCCCCCCC>
##$VD= 0
##$VDLIST= <DDDDDDDDDDDDDDD>
##$VPLIST= <PPPPPPPPPPPPPPP>
##$VTLIST= <TTTTTTTTTTTTTTT>
##$WBST= 1024
##$WBSW= 4
##$XGAIN= (0..3)
0 0 0 0 
##$XL= 0
##$YL= 0
##$YMAX_a= 98688
##$YMIN_a= -143602
##$ZGOPTNS= <>
##$ZL1= 120
##$ZL2= 120
##$ZL3= 120
##$ZL4= 120
##$ABSF1= 10
##$ABSF2= 0
##$ABSG= 5
##$ABSL= 3
##$ALPHA= 0
##$AQORDER= 0
##$ASSFAC= 0
##$ASSFACI= 0
##$ASSFACX= 0
##$ASSWID= 0
##$AUNMP= <proc_1d>
##$AZFE= 0.1
##$AZFW= 0.1
##$BCFW= 1
##$BC_mod= 2
##$BYTORDP= 1
##$COROFFS= 0
##$CY= -3
##$DATMOD= 1
##$DC= 2
##$DFILT= <>
##$DTYPP= 0
##$F1P= 0
##$F2P= 0
##$FCOR= 0.5
##$FTSIZE= 0
##$FT_mod= 4
##$GAMMA= 1
##$GB= 0.15
##$INTBC= 1
##$INTSCL= 1
##$ISEN= 128
##$LB= 0.25
##$LEV0= 0
##$LPBIN= 0
##$MAXI= 10000
##$MC2= 0
##$MEAN= 0
##$ME_mod= 0
##$MI= 1.114404
##$NCOEF= 0
##$NC_proc= 0
##$NLEV= 6
##$NOISF1= 3.799351
##$NOISF2= 2.8
##$NSP= 1
##$NTH_PI= 0
##$NZP= 0
##$OFFSET= 14.38212
##$PC= 1
##$PHC0= -1205.412
##$PHC1= 16.59238
##$PH_mod= 1
##$PKNL= yes
##$PPARMOD= 0
##$PSCAL= 0
##$PSIGN= 0
##$REVERSE= no
##$SF= 200.129724274929
##$SI= 16384
##$SIGF1= 3
##$SIGF2= 2
##$SINO= 400
##$SIOLD= 16384
##$SREGLST= <1H.CDCl3>
##$SSB= 0
##$STSI= 0
##$STSR= 0
##$SW_p= 3205.1282051282
##$SYMM= 0
##$S_DEV= 0
##$TDeff= 0
##$TDoff= 0
##$TI= <>
##$TILT= no
##$TM1= 0
##$TM2= 0
##$TOPLEV= 0
##$USERP1= <user>
##$USERP2= <user>
##$USERP3= <user>
##$USERP4= <user>
##$USERP5= <user>
##$WDW= 1
##$XDIM= 8192
##$YMAX_p= 0
##$YMIN_p= 0
$$ End of Bruker specific parameters
$$ ---------------------------------
##NTUPLES= NMR FID
##VAR_NAME=  TIME,          FID/REAL,        FID/IMAG
##SYMBOL=    X,             R,               I
##VAR_TYPE=  INDEPENDENT,   DEPENDENT,       DEPENDENT
##VAR_FORM=  AFFN,          ASDF,            ASDF
##VAR_DIM=   8192,          8192,            8192
##UNITS=     SECONDS,       ARBITRARY UNITS, ARBITRARY UNITS
##FACTOR=    0.0002768,     1,               1
##FIRST=     0,             0,               0
##LAST=      2.2672688,     0,               0
##MIN=       0,             -143602,         0
##MAX=       2.2672688,     98688,           0
$$ Real data points
##PAGE= N=1
##DATA TABLE= (X++(R..R)), XYDATA
$$ [...]
1853A8o2j19N2K07k31J47J01j54L74k11P9l2M3k57K31l63J77k30l8K28N1k9L05
$$ 18 -44 -163 -111 96 -135 12 113 -41 333 122 201 169 212 -45 186 -177 0 -230 -268 -40 11 -18 287
1876B87m06M6K17n34K66m7J39K05m7q3J04m76K77K12k08J16J4j20j05N35p05K29
$$ 287 -119 -73 144 -390 -124 -171 -32 173 126 43 147 -329 -52 160 -48 68 82 -38 -143 392 -313 -84
1898h4J1J29K7m65M05j96K45k71K85k99M28m04K8L33k70N9J49k38J16K32k94J81
$$ -84 -73 56 83 -382 23 -173 72 -199 86 -213 215 -189 -161 172 -98 -39 110 -128 -12 220 -74 107
1920A07k38o6L28l98K26J84j95j21L28q9M0J71n08L99P9l58N12k19J31j98k38
$$ 107 -131 -197 131 -267 -41 143 -52 -173 155 66 106 277 -231 168 247 -111 401 182 313 115 -123
1941a23J07k52M9J85m8r3J75K1k1m8m8M61r6n27L73J20J44j04n2l09K04m30K48
$$ -123 -16 -268 -219 -34 -82 -175 0 21 0 -48 -96 365 269 -258 115 235 379 275 223 -86 118 -312 -64
1964f4j18K87k98K97m29L67n9j9J27J57k59K14K09k92j47l1J23J39l02j8J29%
$$ -64 -182 105 -193 104 -325 42 -17 -36 91 248 -11 203 412 120 -27 -58 65 204 -98 -116 13 13
1986A3j75r1R3r7j31K9O24l17P9J16r4L2L21k82j44o1j56L43J6j27Q7j45Q6k49
$$ 13 -162 -253 -160 -257 -388 -359 265 -52 27 143 49 81 402 120 -24 -85 -241 102 118 -9 78 -67 19 -230
2010b30J3J93K23k46J98q3l2Q3L16l67L93l75q2Q8L5j36L4j16k34J99J41q8j74
$$ -230 -217 -24 199 -47 151 68 36 119 435 68 461 86 4 92 127 -9 25 -91 -325 -126 15 -73 -247
2033b47K48J21j87j14K46k63K63j51K62j12L5n48Q17j7n90L10L4k06j5L58r2j91
$$ -247 1 122 -65 -179 67 -196 67 -84 178 66 101 -447 370 353 -237 73 107 -99 -114 244 152 -39
2055c9j49J08J78l30J30p4J55J48l54L24Q5j64j13J98j85J44K5l80L44m19J29
$$ -39 -188 -80 98 -232 -102 -176 -21 127 -227 97 182 18 -95 103 -82 62 87 -293 51 -368 -239
2076b39K83%j83K2j68J11J13K3J55j51j60L85K4j98J73o0QJ5k5j57L4O6O8j53
$$ -239 44 44 -139 -117 -285 -174 -61 -38 117 -34 -194 191 215 17 190 130 138 153 128 -29 5 71 139 -14
2100a4P7q2j70l4J58k59K08J82o8l0K44k49J92J62j80O0k94j49L30k93k59M03
$$ -14 63 -19 -189 -223 -65 -324 -116 66 -2 -32 212 -37 155 317 137 197 -97 -246 84 -209 -468 -65
2122f5j41j5j45J85K75Oj36K46k05q5J80j5l7pN5M8K13n80K2K29j00J74k16J63
$$ -65 -206 -221 -366 -181 94 100 -36 210 5 -80 100 85 48 41 96 144 357 -223 -201 28 -72 102 -114 49
2146D9n2j68K7O0j64K78J48L9k27L8q7J21J1j66Q8Q0m73N33l54j07L19k05K56
$$ 49 -3 -171 -144 -84 -248 30 178 217 -10 28 -59 62 73 -93 -5 75 -398 135 -219 -326 -7 -212 44
2169D4k62M0O3K89O4j63J50o8m8P9l96K88k18K32k64Q0J2q6q9J39O0k8L22n09
$$ 44 -218 -178 -115 174 238 75 225 157 109 188 -208 80 -138 94 -170 -90 -78 -164 -253 -114 -54 -82 240 -269
2193b69L59J26k54K07o4m14K27K71j57M6Q9l02K97k02R1j19J03j12l55L93r9o2
$$ -269 90 216 -38 169 105 -309 -82 189 32 78 167 -135 162 -40 51 -68 35 -77 -432 -39 -138 -200
2215b00K54k2j85M34j58L4j71n0l4L27r0q5n1J18k73K9J54l17L80l39J52j85R8
$$ -200 54 32 -153 281 123 157 -14 -64 -98 229 139 54 3 121 -152 -123 31 -286 94 -245 -93 -278 -180
2238a80L93j57m3J00j66j41L91l1l66K99l27N68k60p7K07k11K54k50Jo8L74n13
$$ -180 213 56 13 113 -53 -194 197 166 -200 99 -228 340 80 3 210 -1 253 3 4 -64 310 -203
2260b03J04n6k00L58L8o0p3J62j41J23K5J65J29O5o38L46k93J31o6k70L48L2j28
$$ -203 -99 -155 -355 3 41 -19 -92 70 -71 52 77 242 371 436 -202 144 -149 -18 -84 -354 -6 26 -102
2283a02J19l88L66K22n33M43J62l29j43P9K83j16r0r7J42j56P9Om3Qj15N5L05
$$ -102 17 -371 -5 217 -316 127 289 -40 -183 -104 179 63 -27 -124 18 -138 -59 -53 -96 -88 -203 -148 157
2306A57j09j53p3L29k36L78o0k67K29m65M38K14l73R5j49j63O2m6p3K01K7j18
$$ 157 48 -105 -178 151 -85 293 233 -34 195 -270 168 382 9 104 -45 -208 -146 -192 -265 -64 -37 -155
2328a55K61r8L02j32oJ5j21m24L02J4R3l9j01J79l70J15q5L66n04O4J49J51K11
$$ -155 106 8 310 178 172 187 66 -358 -56 -42 51 12 -89 90 -280 -165 -250 116 -388 -324 -175 -24 187
2351A87j2p3l87K19R9q7m7K54k30r0J99k3p8R7m6j14J39k59K80K38l49J34j2j31
$$ 187 175 102 -285 -66 33 -54 -101 153 -77 -167 32 9 -69 28 -18 -132 7 -252 28 266 -83 51 39 -92
2375i2N1J01k03L10k10k28N07j42J31l25J1J30j77o2L88q6j61j91K52J08l7nl3
$$ -92 -41 60 -143 167 -43 -271 236 94 225 -100 -89 41 -136 -198 190 104 -57 -248 4 112 75 70 37
2398C7k7l6J27L8M0j68j26J37J91n2j65k3K75j94k02J45m4O2j67j9K80j90J71
$$ 37 10 -26 101 139 179 11 -115 22 213 161 -4 -27 248 54 -148 -3 -47 15 -152 -171 109 -81 90
2421I0R9r3K92k45J16k85R1m6o6j63o0K29K1l1o5j09kQ8Q5J80r7j05J47j70K15
$$ 90 189 96 388 143 259 -26 65 19 -47 -210 -270 -41 -20 -51 -116 -225 -227 -139 -54 126 29 -76 71 -99 116
2446A16r2L04k81n1l37N12n3k16K02j63L36l10l02M10O2k48j75J89M5o5K84l68
$$ 116 24 328 47 -4 -341 171 118 -98 104 -59 277 -33 -335 75 137 -111 -286 -97 -52 -117 167 -201
2468b01J11Q4J85k09J8R3rK6j12k49K4J53k54K01K85k36M3J86l77L98o9J61j47
$$ -201 -90 -6 179 -30 -12 81 72 98 -14 -263 -239 -86 -340 -139 146 -90 -47 139 -238 160 91 252 105
2491A05J6o4k23J25J58m5m8J21l82K57L7J5o5J37n7k89J92k43K57K65k88%J30
$$ 105 121 57 -166 -41 117 72 24 145 -237 20 57 72 7 144 87 -202 -10 -253 4 269 -19 -19 111
2514A11l73K21m0J57j14j23J81J34k04o5L9J17l39J75j69L93j77l5K95m09J50
$$ 111 -262 -41 -81 76 -38 -161 20 154 -50 -115 -76 41 -298 -123 -292 101 -76 -111 184 -225 -75
2535g5JK0N7r7J62lJ23r3q9j73J46J0m5L11k73j83N5K64l25K24Pj85K61j98J94
$$ -75 -74 -54 3 -94 68 65 188 95 6 -167 -21 -11 -56 255 -18 -201 -146 118 -207 17 24 -161 100 -98 96
2560I6P6j29N7Q1j26K09J15n71J81l97K21J79q1l7J06k56K81j43j20L95m5j35
$$ 96 172 43 100 181 55 264 379 -192 -11 -408 -187 -8 -89 -126 -20 -276 5 -138 -258 137 92 -43
2582d3J07L4k20K60j36k63L69k96lM07n15J33J04PK51j81J12J14k38J32J67k58
$$ -43 64 98 -122 138 2 -261 108 -188 -191 216 -299 -166 -62 -55 196 15 127 241 3 135 302 44
2604D4K0JM4k5k15L32r5k77K21k16L8K2J10n9J34m9k67N94j59k40N1L7L11l37
$$ 44 64 65 109 84 -131 201 106 -171 50 -166 -128 -106 4 -55 79 30 -237 357 198 -42 9 46 357 20
2628B0JQ7k29K72o3k47OJ39J07k13J62k4J35p7j88K01%k24J06J51q5n1R2l39J31
$$ 20 21 108 -121 151 88 -159 -153 -14 93 -120 42 18 153 76 -112 89 89 -135 -29 122 37 -14 78 -261 -130
2653a30O4j16Q4K33l65M09j48J43l0k54J7J36K2k33j9QJ55L07l61J50j91J76M2
$$ -130 -66 -182 -98 135 -230 179 31 174 144 -110 -93 43 65 -168 -187 -179 -24 283 -78 72 -119 57 99
2676I9j26L13j9n51M39j83n7o2mJ51j33L5L10k38j04K9j47L77l41lK85qk02J32
$$ 99 -27 286 267 -284 155 -28 -85 -147 -151 0 -133 -98 212 -26 -130 -101 -248 129 -212 -215 70 62 -140 -8
2700hq6Q8J0MN4m4j18J73j99O7m0N9j79K17k08K45j57rJ03p6J55j06L02k59j45
$$ -8 -94 -6 4 8 62 18 -100 73 -126 -59 -99 -40 -219 -2 -210 35 -122 -131 -28 -104 51 -55 247 -12 -157
2725a57O0J99j7p3R7K1l68L5J19R6p6j5M26L6k43j32Q0P0l49L94j90k6Jk71M67
$$ -157 -97 102 85 12 109 130 -238 -203 -84 12 -64 -79 347 383 140 8 88 158 -191 203 13 -13 -12 -283 184
2750A84k40l44K91m9QK70J98n96O74l29J05j46N1r1K96n08J24M78n43l9J15K38
$$ 184 -56 -400 -109 -158 -150 120 318 -278 396 67 172 26 77 -14 282 -226 -102 376 -167 -206 -91 147
2772A47k84J85j78J85Qn5J30k04J93k16M3K12pr0k57K17j55J9j58Q4K14o6J66
$$ 147 -137 48 -130 55 63 8 138 -66 127 -89 -46 166 159 69 -188 29 -126 -107 -265 -181 33 -33 133
2795A33k29oL1k4J47m9n4K01j1l12M36l95Q3P7pM0k97L59k90J16r6%k8L98k27
$$ 133 -96 -102 -71 -95 52 3 -51 150 139 -173 263 -132 -49 28 21 61 -236 123 -167 -51 -147 -147 -175 223 -4
2820dL4j17m7K1J71J08k4l09K0J23j15K40L2j59Q3l99K23j6Q7J53k01n1J03J11
$$ -4 30 -87 -134 -113 58 166 142 -167 -147 -24 -139 101 133 -26 57 -342 -119 -135 -48 105 -96 -147 -44 67
2844F7J07jn6j0L3l21J27Jl50M43mj10K72j78R6j10J53j68K10j56j70n1K0J10
$$ 67 174 173 117 107 140 -181 -54 -53 -403 40 36 -74 198 20 116 6 159 -9 201 45 -125 -176 -156 -46
2868d6J70r9RK11j21J13j06l66K19K92m30J26p0L7M7r2O2N1j72K32j50LppK00
$$ -46 124 25 34 245 124 237 131 -235 -16 276 -154 -28 -98 -61 -14 -106 -44 7 -165 67 -83 -80 -87 -94 106
2893A06L4j93q8N18k35j57L61m81K1O6k62L32k20M7K23l57L00l24L28P4J27k18
$$ 106 140 -53 -141 377 142 -15 346 -135 -114 -48 -310 22 -198 -151 72 -285 15 -309 19 93 220 2
2915BJ4J41Q1j37j4j1J5l0N4l93J07Rj95L11JJ02j9J49k13J10J16m42K61j47K40
$$ 2 16 157 238 101 87 76 91 61 115 -278 -171 -162 -357 -46 -45 57 38 187 -26 84 200 -242 19 -128 112
2940A12P8n2ol81L23r6oj02J96M9j68j4J38j48J28n3M9J58k79K6R6j11J92j5l11
$$ 112 190 138 132 -249 74 -22 -28 -130 66 115 -53 -67 71 -77 51 -2 47 205 -74 -48 48 -63 129 114 -197
2965a97L3L14k12J42n3k06L32m00J99Pl78L00K03l20J21k7J95jJ35j80J60j54
$$ -197 -164 150 -62 80 27 -179 153 -247 -48 -41 -419 -119 84 -236 -115 -142 53 52 187 7 167 13
2987A3OQ9j59o1M5J08K62j79j45J8p8j6K83j43O1K7M3K1j52K0P4K9j99R0J0j33
$$ 13 19 108 -51 -112 -67 41 303 124 -21 -3 -81 -97 186 43 104 131 174 195 43 63 137 166 -33 57 67 -66
3013f6P7r6m8K26k45j56K92k37J06K93k88L1J07j19Q1p5K56K7k29j16L85l99M77
$$ -66 11 -85 -133 93 -152 -308 -16 -253 -147 146 -142 -111 -4 -123 -42 -117 139 166 -63 -179 206 -193 284
3036B84l22o8M55m54k8K2K1j32L64l73L04Lm52N63j63j36L54k31j3q4m1O9P9j61
$$ 284 -38 -106 349 -105 -133 -111 -90 -222 142 -231 73 76 -376 187 24 -112 242 11 -2 -86 -127 -58 21 -140
3060a40KL8R2j99M02k19R4o0P5j64J06q8p3J70J00k2K4j88N7J78j53j22p1M73
$$ -140 -138 -100 -8 -207 195 -24 70 10 85 -79 27 -61 -134 36 136 114 138 -50 7 185 32 -90 -161 312
3084C12n35J04O3P0o8j59J21R8k66L98J40n2j92J07j59j54M08k93J05j66R8M3
$$ 312 -223 -119 -56 14 -54 -213 -92 6 -260 138 278 226 34 141 -18 -172 236 -57 48 -118 -20 23
3106B3j08k37N01l47rR6r6K28l3J03R7j18j95K97k51L2q6J81j6oj11J80n2L1J49
$$ 23 -85 -322 179 -168 -177 -81 -177 51 18 121 218 100 -95 202 -49 -17 -103 78 62 56 -55 125 73 104 253
3131B53m34k2L22j57j17K36k24J38K02m40K87R0J0n1r7k72J22J23p3M2j67L41
$$ 253 -181 -203 119 -38 -155 81 -143 -5 197 -243 44 134 144 93 -4 -276 -154 -31 -104 -62 -229 112
3153A12N9k26K15j56j31K7L10m10M97k73J5o9K55l07K14k28k6K23o6l61L18J06
$$ 112 171 -55 160 4 -127 -100 210 -200 297 24 39 -30 225 -82 132 -96 -122 101 35 -326 -8 98
3175I8m13M16k51L1K5R0j5k62M50r0P6j73O8r1J65k6k34K59k46K73j97k59K73
$$ 98 -315 101 -150 -119 -94 -4 -19 -281 169 79 155 -18 50 -41 124 98 -136 123 -123 150 -47 -306 -33
3198c3k7j7M06l31M42n22J18J85R8l36K2N6J29N1l44n5R9n0l06O79m23K52j59
$$ -33 -60 -77 329 -2 440 -82 36 221 319 -17 5 61 190 241 -103 -158 -59 -109 -415 264 -159 93 -66
3221f6L6l11N66m93K80L40k64k38J05m1L23j08K6k57M6k1O8K3J1j10mRL9j04M6
$$ -66 -30 -341 225 -268 12 352 88 -150 -45 -86 237 129 155 -102 -56 -77 -9 14 25 -85 -89 -80 -41 -145 -99
3246i9J28l00L89j29q6J15p1J24J78k35J84k47QoJ24k80q5J65m1K09k23J60K47
$$ -99 29 -271 118 -11 -97 18 -53 71 249 14 198 -49 -41 -47 77 -203 -288 -123 -164 45 -178 -18 229
3269B29j64p0p7J08L03k83r9k74M62k60J22j1J54q6j04j9q3J96k39K22n7J18j98
$$ 229 65 -5 -82 26 329 46 -53 -327 135 -125 -3 -14 140 54 -50 -69 -152 44 -195 27 -30 88 -110
3292a10j04K44l7j7j60K60Q5j58R5N9m06J30M9%J18rJ16k7Mp4k41J36K58l24o8
$$ -110 -214 30 -7 -24 -184 76 161 3 98 157 -249 -119 -70 -70 48 39 155 128 132 58 -183 -47 211 -113 -181
3317a81K28M01n45L8j93J76J51k84K57M14n98j7J32J95j81M6J04j85n9R9n8J94
$$ -181 47 448 -97 -59 -252 -76 75 -209 48 462 -136 -153 -21 174 -7 39 143 -42 -101 -2 -60 134
3339A34j48K11R6l68O2L6l8M9j67K78k36J15j07J9k9J77j98k79O24n52M26m02
$$ 134 -14 197 293 -75 -13 23 -15 34 -133 145 -91 24 -83 -64 -93 84 -114 -393 231 -321 105 -297
3361b97K64j49J80k6J57J03j98J54k01Q4M0j59n8M37j66j56k5p4K26P1l08Oj0
$$ -297 -33 -182 -2 -28 129 232 34 188 -13 71 111 -48 -106 331 165 9 -16 -90 136 207 -101 -95 -105
3384a05R3Q4k03J13K28J1k27l0L93m10K34m13J67o9O9JJ84j27J23j80J93k82K69
$$ -105 -12 72 -131 -18 210 221 -6 -36 357 -53 181 -232 -65 -134 -65 -64 120 -7 116 -64 129 -153 116
3407A16rj20K20J23o3k08K9k86L89j28Q1l53K18p3J12j49J24J05q8K5k4j37M46
$$ 116 107 -13 207 330 267 59 88 -198 191 63 144 -209 9 -64 48 -101 23 128 40 65 41 -96 350
3430C50o6j53k84r8L23j30N4lP3J36j11k02K49k17JK30l10J08L18lj56L1q0R3
$$ 350 284 131 -153 -251 72 -58 -4 -7 66 202 91 -111 138 -79 -78 152 -158 -50 268 265 109 140 60 153
3454A53L7k71Mm3J86J55k93N1r6%M7J09j05p5J06K06k80qJ5qJ76p3mL79m74K60
$$ 153 190 -81 -77 -120 66 221 -72 -21 -117 -117 -70 39 -66 -141 -35 171 -109 -117 -102 -110 66 -7 -11 368 -106 154
3480A54j05P6j79k59M13O5q8o7l2P9K01m74r3L89O3l09K86k54K48J65k76j61J66
$$ 154 49 125 -54 -313 100 165 77 10 -22 57 258 -216 -309 80 143 -166 120 -134 114 279 3 -158 8
3503Hj3K02l02J30J51l25K81j21k8K9k24P7J64J29O6r5j37nL23j23j04j51J91
$$ 8 -5 197 -105 25 176 -149 132 11 -17 12 -212 -135 29 158 224 129 -8 -13 310 187 83 -68 123
3526A23j11k86L12o0k00J87K23m10K50J29j81l2qj14K28j77K01j80K21l9k80L31
$$ 123 12 -274 38 -22 -222 -35 188 -222 28 157 -24 -56 -64 -178 50 -127 74 -106 115 76 -204 127
3548A27k5l0%k57K37J78k91L7L0L3J56k65P3J8k09J77p2K56l85M36l41J62j74
$$ 127 102 72 72 -185 52 230 -61 -24 6 39 195 -70 3 21 -188 -11 -83 173 -212 224 -117 45 -129
3571a29oo8J4P2M13o09M09J08l00J67j07k54K27K50j47J0j68K76j63m7K25k10
$$ -129 -135 -203 -189 -117 296 -313 96 204 -96 71 -36 -290 -63 187 40 50 -118 158 -5 -52 173 -37
3593c7K40j40%p3J20R7j31n9K1J26k19J27k30q6L69M5l5J29m58L4J44m4j67P5
$$ -37 203 63 63 -10 110 207 76 17 38 164 -55 72 -158 -244 125 170 135 264 -194 -160 -16 -60 -227 -152
3617a52L13l17j2J44o3K2L1P0k39N8K22n2K6n8O2p7K05K17l92j50L87k41K2J95
$$ -152 161 -156 -168 -24 -87 -65 -34 36 -203 -145 77 25 51 -7 55 -22 183 400 8 -142 245 4 26 221
3641B21m70Q3J91m27O08k10o1K20r1q1k61J90K17k26R6J9j53K75O2k08J59k07
$$ 221 -249 -166 25 -402 206 -4 -65 155 64 -17 -278 -88 129 -97 -1 18 -135 140 202 -6 153 -54
3663e4k04L31k09J03j09M6O8j16K16j09l40O09j27K14k75J7l2M7O8O4P0k23J5
$$ -54 -258 73 -136 -33 -142 -96 -28 -144 72 -37 -377 232 105 319 44 61 29 76 144 208 278 55 70
3686G0o4Q5k8k95L65k58K1K69j28J26r9k81K61p0J16j36J76j78j52L81k13M2m4
$$ 70 6 91 63 -232 133 -125 -104 165 37 163 64 -217 44 -26 90 -46 130 -48 -200 181 -32 10 -34
3709c4q5j25L6N09l63O8j38j22J62OkP3j24Q6M25l85o4J66o4k11k1J36J5J29j76
$$ -34 -119 -244 -208 301 -62 6 -132 -254 -92 -86 -88 -15 -139 -53 372 -13 -77 89 25 -186 -207 -71 -56 73 -103
3734a03M8O3j38K94j99l3K35l17J74P9k00j4L20k43K66oj83k46j22M08j61L9J13
$$ -103 -55 8 -130 164 -35 -68 167 -150 24 103 -97 -111 209 -34 232 226 43 -203 -325 83 -78 -39 74
3757G4j58O8l1J34l79J46K70k72J59K72l45O3L89o32L06%j49K03m5j33K71k42
$$ 74 -84 -16 -47 87 -292 -146 124 -148 11 283 -62 1 390 -242 64 64 -85 118 73 -60 211 -31
3779c1J80k74J07m7kj0J32L03rn57L76j01k1m9k74K29K01j83J03M1j18J6j6K82
$$ -31 149 -125 -18 -65 -67 -77 55 358 349 -208 168 67 46 -3 -277 -48 153 -30 73 114 -4 12 -4 278
3803B78k13J75m31J89O3J27n09L74J53k88J35%j04J24k3J3n2Nj13J15M5j70K62
$$ 278 65 240 -191 -2 61 188 -321 53 206 -82 53 53 -51 73 50 63 11 16 -97 18 63 -107 155
3826A55l86K10K10m38J07L63P2q8l03N53l74j02J49j72k09J84J17j5J12k29oJ38
$$ 155 -231 -21 189 -249 -142 221 293 205 -98 455 81 -21 128 -44 -253 -69 48 33 145 -84 -90 48
3848D8j76J1L01k13K05k8j05Mj28K95j14j2P8k62j2Q4o0j24K62k5k03K79j89K
$$ 48 -128 -117 184 -29 176 148 43 47 -81 214 100 88 166 -96 -108 -24 -84 -208 54 29 -174 105 -84 -82
3872h2n3K41m44L66k6J11l81L03K9J19j75j36Oj0J53Mk38K49J4j46P8J60k65L31
$$ -82 -135 106 -338 28 2 113 -268 35 64 183 8 -128 -122 -132 21 25 -213 36 50 -96 -18 142 -123 208
3896B08j43K8K51j82ml62J43M88m84o3M78o35N74j46Lk31r0K95l42O2K75o5j32
$$ 208 65 93 344 162 158 -204 -61 427 -57 -120 358 -277 297 151 154 -77 -167 128 -214 -152 123 58 -74
3919g4j71L28k35K47k44J01J95j03K0j2J25j97j38l8QM12k74j06K14n4p2N8mP2
$$ -74 -245 83 -152 95 -149 -48 147 44 64 52 177 -20 -158 -196 -188 224 -50 -156 58 4 -68 -10 -14 58
3943E8M9j0J2n6l1l1P3nJ1q0k92K62o3J15j03q2K81l74M34K7r0k00O6j7M3j66
$$ 58 107 97 109 53 22 -9 64 59 70 -10 -302 -40 -103 12 -91 -173 108 -266 168 195 105 -95 -29 -46 -3 -169
3969a69L64l22j18L18k39J75Kj59L49j91kj90K13j65K40j28%K53l14Q1J53p1J25
$$ -169 195 -127 -245 73 -166 9 11 -148 201 10 8 -182 31 -134 106 -22 -22 231 -83 -2 151 80 205
3992B05O2n10J96j25K12j05J88l09K42J46l10J33J61j92j21L7J34P6l95L59o4
$$ 205 267 -243 -47 -172 40 -65 123 -186 56 202 -108 25 186 -6 -127 -90 44 120 -275 84 20
4013B0P7k30R4J40j7Q9k57O2j7J82l51J44J35j02j24J58j93J03lK5K31o37N07
$$ 20 97 -133 -39 101 84 173 -84 -22 -39 143 -208 -64 71 -31 -155 3 -190 -87 -90 -65 166 -471 36
4036C6p0J42k03J3j14K36k22J33J48j33L8k9k71M33j38J76j16k13J54pJ23n7K6
$$ 36 -34 108 -95 -82 -196 40 -182 -49 99 -34 4 -25 -296 137 -1 175 59 -154 0 -7 116 59 85
4059H5j21%L29l60J73J77k47n7K29k02K67j10L4l52L35M3m49J43r1K49M3j20J15
$$ 85 -36 -36 293 -67 106 283 36 -21 208 6 273 163 197 -155 180 223 -226 -83 -174 75 118 -2 113
4082A13j32j20L72l94J57P1Q9j88k8K41j05k45n7K88j04J02l5k42K80k08J67J10
$$ 113 -19 -139 233 -161 -4 67 156 -32 -60 181 76 -169 -226 62 -42 60 25 -217 63 -145 22 132
4104A32l0Ko3q1nL7R7M9o6M6j73J42j77p6J52K12l31J21j39L9J45RK13m64J82
$$ 132 102 104 41 -40 -45 -8 89 138 72 118 -55 87 -90 -166 -14 198 -133 -12 -151 -112 33 42 255 -209 -27
4129b7J1L7%P2k82K11l9j62L23l48J84mj57R4N7K10o2k67J90l2j25L53k48J6O
$$ -27 -16 21 21 93 -189 22 -17 -179 144 -204 -20 -24 -181 -87 -30 180 118 -149 41 9 -116 237 -11 5 11
4154A1Q7k40J8J61m7P2j78K82m00J11O5M2J39j51KK05j49n3M4J76k06Rj50L20
$$ 11 98 -142 -124 37 -10 62 -116 166 -234 -123 -58 -16 123 -28 -26 179 30 -23 21 197 -9 0 -150 170
4178A70l35P4p2K61j16p9K39l59M00l01O2N4Q2Q6k09L96l85R0r2K52r6p2o6J37
$$ 170 -165 -91 -163 98 -18 -97 142 -217 183 -118 -56 -2 80 166 -43 353 -32 58 -34 218 122 50 -16 121
4202A21j36o3J82l08P6K21j65K10j79O1J03jk8J5j03J45j36k41L42j77K9J02j71
$$ 121 -15 -78 104 -204 -128 93 -72 138 -41 20 123 122 94 109 6 151 15 -226 116 -61 -32 70 -101
4225a01J00l6J02oP2J48j38o5j74l1L73l39lJ57n9L01k43j95J58K0j11L06k08
$$ -101 -1 -37 65 59 131 279 141 76 -98 -129 244 -95 -98 59 0 301 58 -137 21 41 -70 236 28
4248B8m4K9j03Q1R6J75j22k5k97n4nJ92n7J81j03J72j95k2K17Qj80J61N9Ml58
$$ 28 -16 13 -90 -9 87 262 140 115 -182 -236 -241 -49 -106 75 -28 144 -51 -73 144 152 -28 133 192 196 -162
4273a62k35L51L0m8L41k68k61K99n60R01l38N4m6L1k09J49O8p7q4L03l68p9R9
$$ -162 -397 -46 -16 -64 277 9 -252 47 -513 388 50 104 58 89 -120 29 97 20 -64 239 -129 -208 -109
4296a09N4L38l43K24q9m36O31k82j23M17j80j65R3k9P1k35M5K06P9m59K94j42
$$ -109 -55 283 -60 164 75 -361 270 -12 -135 282 102 -63 30 1 72 -163 -118 88 167 -292 2 -140
4318a40J42J27l16j17K84J79k51L64m50L81n4j91K24k72J15j05J36k03K67%m0
$$ -140 2 129 -187 -304 -20 159 -92 272 -178 203 149 -42 182 -90 25 -80 56 -147 120 120 80
4339H0M4J41l27m5j40M02k03n5K85k57J02J29o9j62L69K5k63j72J74m16K71pQ1
$$ 80 124 265 -62 -107 -247 155 -48 -103 182 -75 27 156 87 -75 294 319 56 -116 58 -358 -87 -94 -13
4362a3L0L28l60O8j37K27j16r3J15r9qK4j10L59k94L9K65k13o6M1j10K81j57j05
$$ -13 17 345 -15 53 -84 143 27 -66 49 -50 -58 -34 -144 215 -79 -40 225 12 -54 -13 -123 158 1 -104
4386a04K52j48N7j25J13k4N2k63K88k79K74n8R1R2k32J52j01k8K27m36J62k35
$$ -104 148 0 57 -68 45 21 73 -190 98 -181 93 35 126 218 -14 138 37 9 236 -200 -38 -273
4408b73K46L6M7j7jj43P0k76L21n5J47j1J37j05m4j18O9l3m2n5J16Q3j13j24M02
$$ -273 -27 9 56 39 38 -105 -35 -311 10 -45 102 91 228 123 79 -39 30 -3 -45 -100 16 99 -14 -138 264
4433B64n09o5M88k49j59M07M1j30j96P3R8K55k52k05K53O2k03J6J74l54K67k23
$$ 264 -245 -310 178 -71 -230 177 218 88 -108 -35 63 318 66 -139 114 176 -27 -11 163 -191 76 -147
4455a47J67N2L07m90J78J4m1j57K77k90J80k77R2O9J35j49M2N3k1Nj48J97m0J73
$$ -147 20 72 379 -111 67 81 40 -117 160 -130 50 -227 -135 -66 69 -80 -38 15 -6 -1 -149 48 8 181
4479A81j24j0j48k9J3n8K54j09j32J1L89j59j12k3M9K05n10M78j19o1q8K06rJ97
$$ 181 57 47 -101 -130 -117 -175 79 -30 -162 -151 238 79 -33 -56 -7 198 -312 166 47 -14 -102 104 95 292
4503B92k43o2j44K43j38J9r3K05q7j08K00k60K78k45K2k5K19k71J59J65j00k59
$$ 292 49 -13 -157 86 -52 -33 -126 79 -8 -116 84 -176 102 -143 -121 -146 73 -198 -39 126 26 -233
4525b33K51r9n4J47r5R4J25r2j27L8O3k67K88k71O8K33k28K72l2p9J24j23l8j87
$$ -233 18 -81 -135 12 -83 11 136 44 -83 -45 18 -249 39 -232 -164 69 -159 113 81 2 126 3 -35 -222
4549b22M38j89m4j34K15M1l2j83K9J09j04K2m2J46J71l31Q5l2o1K21NK20m58k2
$$ -222 216 27 -17 -151 64 105 73 -110 -81 28 -76 -54 -96 50 221 -110 -25 -57 -118 103 108 328 -130 -152
4573a52J70K03k24R4l4k7j59J97o2K42m47R3l2K39j27J78jj19K27m95J86p3L31
$$ -152 18 221 -3 91 57 30 -129 68 6 248 -199 -106 -138 101 -26 152 151 32 259 -236 -50 -123 208
4596B08Q8m07j06K94P0k39N9K4K34j32m3N3k58L83k94J37k29J29K56j02k46K13
$$ 208 296 -111 -217 77 147 -92 -33 -9 225 93 50 103 -155 228 -66 71 -158 -29 227 125 -121 92
4618I2j23j57J17j32L45l85Q1K30j82J01j87K92k78K43L4j10j11Q5j30M01j40
$$ 92 -31 -188 -71 -203 142 -243 -162 68 -114 -13 -200 92 -186 57 91 -19 -130 -45 -175 226 86
4639H6j68R5L6m6J53o8r7l6K3L12k43j62J99N1k05r1M02l46J97P7m28K97r7p5
$$ 86 -82 13 49 3 156 88 -9 -45 -22 290 47 -115 84 135 -70 -161 241 -105 92 169 -259 38 -59 -134
4663a34L09j55K27k08k12K18j55j49j6K15r5J65Q4m3K2j81K33R1k47J04K4r9j59
$$ -134 175 20 247 39 -173 45 -110 -259 -275 -60 -155 10 94 51 73 -108 125 216 -31 73 97 -2 -161
4686a61M80k63k23J58m7pN0p1K3l0%O1lo6K52j63j36l6J9J60l7m1j54K48J84j22
$$ -161 319 56 -167 -9 -56 -63 -13 -84 -61 -91 -91 -30 -33 -99 153 -10 -146 -182 -163 -3 -40 -81 -235 13 197 75
4712G5Q3j27o0q5m3L40k69P4J20k67K52k65K25l7r1k99K99J47lj66J77k46K99
$$ 75 158 31 -29 -114 -157 183 -86 -12 108 -159 93 -172 53 16 -75 -374 -75 72 69 -97 80 -166 133
4735A33k35m7J26k09L30j05j5n7J19l9k23M34k15J09k30K53j09j23J75k07J54
$$ 133 -102 -149 -23 -232 98 -7 -22 -79 40 1 -222 212 -3 106 -124 129 20 -103 72 -135 19
4756A9P6P8J54n54j2N15m55j15N5K66q8N5J35k04L13k68R9K5p9k17K93m6J19O6
$$ 19 95 173 327 -227 -239 276 -179 -294 -239 27 -61 -6 129 -75 238 -30 69 94 15 -202 91 45 164 230
4780B30j63Q0Ml67L72J2k06K54k68J6K84m34N2L39k01r2J01M7k2r8J8J64l78L40
$$ 230 67 147 151 -216 156 168 -38 216 -52 -36 248 -186 -134 205 4 -88 13 60 38 -60 -42 122 -256 84
4804H4k44K03n8J40j99J52J69j36j54k97N63q9Qk4R5l26L40j96j06J46m2RJ24
$$ 84 -160 43 -15 125 -74 78 247 111 -43 -340 223 134 142 118 213 -113 227 31 -75 71 29 38 162
4827A62j95Q0p2J70P8j88k39n5K83J24q1j71K62k81K88%k62j1q0K34l44L87l15
$$ 162 -33 47 -25 145 223 35 -204 -259 24 148 67 -104 158 -123 165 165 -97 -108 -188 46 -298 89 -226
4850b26L13m3K54j02j33k60K02J6r0J28L4l91N34j51l1n2j41J33P5j58q8K37j92
$$ -226 87 44 298 196 63 -197 5 21 -69 59 93 -298 236 85 54 2 -139 -6 69 -89 -177 60 -132
4873a32r0M12k96L58q9k84K74j67K91l15p9L86k05k2m3j92L37q2l07M26j95P8
$$ -132 -222 190 -106 252 163 -121 153 -14 277 -38 -117 269 64 42 -1 -193 144 62 -245 181 -14 64
4895F4j45J10K6j31Q6j50J98J02l96j22O35k08J49l00K40l69QJ64n9j30L43j24
$$ 64 -81 29 55 -76 10 -140 58 160 -236 -358 277 69 218 -82 158 -211 -203 -39 -98 -228 115 -9
4917ij74L52l71J54K0j11K23rP1N6j25K0k1p7K3j02J49r2O1j77J48L5Q9O3k8j74
$$ -9 -183 169 -202 -48 -28 -139 84 75 146 202 77 97 76 -1 22 -80 69 -23 38 -139 9 44 133 196 168 -6
4943fk93M42l28O6n0K59J0k84K06k80J94K54j84Q1J13k07%l82L97k3j40M01j72
$$ -6 -299 143 -185 -119 -169 90 100 -184 22 -258 -64 190 6 87 200 -7 -7 -389 8 -15 -155 246 74
4966G4J16k23J15k07O8k2K82k76J36j28N8o2K05j42l9L5J17J4q4O6K0qRk91%L59
$$ 74 190 -33 82 -125 -57 -79 203 -73 63 -65 -7 -69 136 -6 -45 -10 107 121 37 103 123 115 124 -167 -167 192
4992A92j94M1J48k69k35L60n6n3o4j23K3M15k83L3k07K68Q7k33R0l7J09L7p4K45
$$ 192 -2 39 187 -82 -317 43 -13 -66 -130 -253 -230 185 -98 -65 -272 -4 83 -150 -60 -97 12 49 -25 220
5016B20j97k77L90l20M35j68J9q8Q7l24K34Q9j28Q4J58j46k28J60k18L33O9l02
$$ 220 23 -254 136 -184 251 83 102 14 101 -223 11 100 -28 56 214 68 -160 0 -218 115 184 -118
5038a18J8n1J41N6k09K58J25k91K99k48J17M9p4k46J88j21p6J48O8K42k68K53
$$ -118 -100 -151 -10 46 -163 95 220 -71 228 -20 97 146 72 -174 14 -107 -183 -35 33 275 7 260
5060B60m5n3m61L88L4mR8l92J82j51P7L8p9K97j05j07q0J1p2J27J50l18L49ml9
$$ 260 215 162 -299 89 123 119 217 -175 7 -144 -67 -29 -108 189 84 -23 -103 -92 -164 -37 113 -205 144 140 101
5085A01n5j42J66j78K36j4Q6l12K67k65j13K21MM4j63r2K09J01k03K13J31l84
$$ 101 46 -96 70 -108 128 114 200 -112 155 -110 -223 -2 2 46 -117 -209 0 101 -102 111 242 -142
5107a42K06j46K5M67n53P0J80r6j47J32pk16J35k5j80L20P7k4j38j26J03K06O9
$$ -142 64 -82 -57 410 -143 -73 107 11 -136 -4 -11 -227 -92 -117 -297 23 100 76 -62 -188 -85 121 190
5130A90j03l07J27M8j85J82on4J66j03Q7J74j27J02on6l3l3j99O4J04m0k8K38
$$ 190 87 -220 -93 -45 -230 -48 -54 -108 58 -45 42 216 89 191 185 129 96 63 -136 -72 32 -8 -36 202
5154B02m57N00k71L4L65n77J14M3k8J56Q1j28j48J62Q5k00J0K65k17M9J16j68
$$ 202 -255 245 -26 8 373 -204 -90 -47 -75 81 162 34 -114 48 133 -67 -57 208 -9 40 156 -12
5176a2L70l39k50J69m6j33L89k29k95L62o7K75k14r8M9P9Kj67l5J89R9N9k05J84
$$ -12 358 19 -231 -62 -108 -241 148 -81 -376 -14 -81 194 -20 -118 -69 10 12 -155 -190 -1 98 157 -48 136
5200A36k22nj66R9J90j45J56M9J19p5J01k91L73k60Q4m2j20m0l3J56j11n6M5K18
$$ 136 -86 -91 -257 -158 32 -113 43 92 211 136 237 -54 319 59 143 101 -19 -59 -92 64 -47 -103 -58 160
5224A60o9j31k1J68j17L1j41J8j56K71O8O6l08jK60M1J01k16j29L1j08K8K28j44
$$ 160 91 -40 -61 107 -10 21 -120 -102 -258 13 81 147 -161 -162 98 139 240 24 -105 -74 -182 -154 74 -70
5248g0j27j1K21j67K31M9n3p2K5j50O3L09j65j5j92K40j60J55L5J85k44q1M8j72
$$ -70 -197 -208 13 -154 77 126 73 1 26 -124 -61 248 83 68 -124 116 -44 111 146 331 87 6 54 -118
5272a18k7j3J30Q1J4j76K13l0j41K71k31j13J88K4o9J32p8l1M3n3j16K38j15l9
$$ -118 -145 -158 -28 53 67 -109 104 74 -67 204 -27 -140 48 72 3 135 57 26 69 16 -100 138 23 -16
5296a6P3pM0j0l17L02O7j93K9r3M9J88j46K3k3O4q7M1k2l1P5J01j03q5K20k40
$$ -16 57 50 90 80 -237 65 132 -61 -32 -125 -76 112 -34 -11 -34 30 -57 -16 -38 -69 6 107 4 -81 139 -101
5322a01K31k31K45m8k27L2J36j19K24M4k13k5J24k72J59J10o5n0j3J90J3k37J28
$$ -101 130 -101 144 96 -131 -99 37 -82 142 186 -27 -52 72 -200 -41 69 4 -46 -59 131 144 -93 35
5345C5P6k95M8M6J39l27J23J50Q1J39k50K9J70j30O7R1l84K95k44J34j3K13J7
$$ 35 111 -184 -136 -90 49 -278 -155 -5 76 215 -35 -6 164 34 101 192 -192 103 -141 -7 -20 193 210
5368B10k27j59J29J25l97J70K36L4j9l08J9J08Q6K50m71L42j70q3J11J24p7Q7
$$ 210 -17 -176 -47 78 -319 -149 87 121 102 -206 -187 -79 7 257 -214 128 -42 -125 -14 110 33 120
5390A20k04Q7J1p9r3J59L9j6L1k41K79L49l68k88K66K83k30j32J69k77O7K52k14
$$ 120 -84 3 14 -65 -158 1 40 24 55 -186 93 442 74 -214 52 335 105 -27 142 -135 -68 184 -30
5413c0l3N0K69j64m6j99J94k13L15o2p6R5j48q9Q2M6L71l78J56m9k93J82P5j28
$$ -30 -63 -13 256 92 46 -153 41 -172 143 81 5 100 -48 -137 -55 -9 362 -16 140 91 -202 -20 55 -73
5437g3J30K08r0j34Q5j33L8o5J97k4j67J61j61k84K34Q1J6o0p8K23j83O18l69
$$ -73 57 265 175 41 126 -7 31 -34 163 139 -28 133 -28 -312 -78 3 19 -41 -119 104 -79 539 170
5460A70j83m7L02l09J82p3o0j10K91k35J67j93J94k22K63j30K34l19K1Q9j34j00
$$ 170 -13 -60 242 -67 115 42 -18 -128 163 -72 95 -98 96 -126 137 7 241 -78 -57 32 -102 -202
5482b02L5L97k7k04j1K33j82ro9J02j47L10k16j77qM37k75j85L25j47J03J10J32
$$ -202 -167 230 203 -1 -12 221 39 30 -39 63 -84 226 10 -167 -175 262 -13 -198 127 -20 83 193 325
5505C25n48K75l61L10n0P6j11Q6J06r3O5j22O3j2L0q0K81p0l03n5L41p8M7J69
$$ 325 -223 52 -309 1 -49 27 -84 2 108 15 80 -42 21 9 39 -41 240 170 -133 -188 153 75 122 291
5529B91j60k87J32l11N4L25j72r9J01R0k61K11R3k6M3r4P8P9k84L10j64r4M48
$$ 291 131 -156 -24 -335 -281 44 -128 -227 -126 -36 -297 -86 7 -19 24 -70 8 87 -197 113 -51 -145 303
5552C03k69R4l87J96p8L99l25k9r4K23Q7j03j87L49l15J52O3j25j25m5K63J37
$$ 303 34 128 -259 -63 -141 258 -67 -96 -190 33 120 17 -170 179 -136 16 79 -46 -171 -216 47 184
5574A84l14j30L13j53N4N5j0O3j55k30J50L29l12N2L14r0j58j72J63j8K4j5o8
$$ 184 -130 -260 53 -100 -46 9 -1 62 -93 -323 -173 156 -156 -104 210 120 -38 -210 -47 -65 -41 -56 -124
5597a24N9o4L92k21o0K55j48j31p7L39l69M31l05P8M7o9k39J00K46J11j19k56
$$ -124 -65 -129 263 42 -18 237 89 -42 -119 220 -149 282 -23 55 102 33 -206 -106 140 251 132 -124
5619a24L38l19n9M9N3j50K1K53k84J43R7J60j39M5o9J9J71o1K9P5k11k38L98J0
$$ -124 214 -105 -164 -115 -62 -212 -191 62 -222 -79 18 178 39 84 15 34 205 144 173 248 37 -201 197 207
5643B07j76q9j97L13q4J4k04K11k08L1J96p5JK37j66K75l70J38J42k68N4J9L95
$$ 207 31 -58 -255 58 -26 -12 -216 -5 -213 -182 14 -61 -60 177 11 286 -84 54 196 -72 -18 1 396
5666C96l48n4L8j67PL51j09j75J52R0j30k96L03J2k06K39Mp1o5j24K19j13j09
$$ 396 48 -6 32 -135 -128 223 114 -61 91 181 51 -245 58 70 -136 103 107 36 -29 -153 66 -47 -156
5689a56J79K5p4k13L8L04J45j24j9j41n6J22M8k65O0k77N02k0J21j03k50K69J64
$$ -156 23 48 -26 -239 -201 103 248 124 105 -36 -92 30 78 -187 -127 -404 98 78 199 96 -154 115 279
5712B79o0j08K9j98K48O3k08j60j0M52k45mj28J59L8j89j2L32m03K27j3J47l95
$$ 279 219 111 140 -58 190 253 45 -115 -125 327 82 78 -50 109 147 -42 -54 278 -125 102 89 236 -159
5735a59J1K0o1J67J1J19k23J30k7k3m4j10nK48q9l8j14L39Q3k89J18l12M52k62
$$ -159 -148 -128 -189 -22 -11 108 -115 15 -12 -35 -79 -189 -194 54 -35 -73 -187 152 235 -54 64 -248 204 -58
5759e8O4j19J13r7J18N7J61j81m9j7M0L13j19m75K32M2j25K22j47J12Ql5k1j42
$$ -58 6 -113 0 -97 21 78 239 58 9 -8 32 345 226 -249 -17 25 -100 122 -25 87 95 60 39 -103
5783a03J78j31J41mK06K4m24K43k03J04J53k95J8M2k23J92P9oj41L02k44j00k36
$$ -103 75 -56 85 81 287 311 -113 130 -73 31 184 -111 -93 -51 -274 -82 -3 -9 -150 152 -92 -192 -428
5806d28K85RJ25j99L9K64j30l3J76j95K54j44k0N3k99L90j17j7j5O6j2J74l76
$$ -428 -143 -134 -9 -208 -169 95 -35 -68 108 -87 167 23 3 56 -243 147 30 13 -2 64 52 226 -150
5829a50L02m2j3n4J42p8m7m7O3q1K9qJ12p5N9j3j69K2J00k10p3M8L89j39j22L6
$$ -150 152 110 97 43 185 107 60 13 76 -5 24 16 128 53 112 99 -70 -48 52 -158 -231 -183 206 67 -55 -19
5855a9P7l8J66k23L46r6l24J55l9J06P3j41rJ0KJ47k68k4m4j8j38K65o8L0R0r
$$ -19 58 20 186 -37 309 213 -111 44 5 111 184 43 34 44 46 193 -75 -99 -143 -161 -299 -34 -102 -72 18 9
5881Ij04j89J68M7J3J57j84o6K77k29J67n6j03L17k51o3R4j83K48j16o9M1L47
$$ 9 -95 -284 -116 -69 -56 101 -83 -149 128 -101 66 10 -93 224 -27 -90 4 -179 69 -47 -116 -75 272
5904B72l39K08k74L63n2j15k53J69r8K04k8J0p8n1K25k54M20n05J93J9M2K0p7
$$ 272 -67 141 -133 230 178 63 -190 -21 -119 85 57 67 -11 -62 163 -91 329 -176 17 36 78 98 21
5927B1j2J41k49L12l39k1L70l20L27k97j5r4O7L01k19Q2j13K6J50m2k33J96K48
$$ 21 9 150 -99 213 -126 -147 223 -97 230 -67 -82 -176 -109 192 -27 55 -58 -32 118 76 -157 39 287
5950B87m01L38l76K88j30J62k08M27j58j3o1l06L2j63J03Q3K88l01K11j09j07
$$ 287 -114 224 -152 136 6 168 -40 387 229 216 155 -151 -119 -282 -179 -96 192 -109 102 -7 -114
5971a14j44J04K19Rnnk8j04l9K78k58K58k05QK4Q5m4J81l03j90K95k7N1j06rq1
$$ -114 -258 -154 65 74 69 64 36 -68 -107 171 -87 171 -34 -26 -2 83 39 220 -83 -273 22 -5 46 -60 -69 -150
5997a50j07N6J25J01j23L24m78R7J16J47j94p5K07k80M55j53j15P5J11j29j19
$$ -150 -257 -201 -76 25 -98 226 -252 -155 -39 108 -86 -161 46 -234 221 68 -47 28 139 10 -109
6018a09K74j13k6K54K0l31k3m4J77k99K02l9R0j93J29J14Q3k13O2o3j70K37o1
$$ -109 165 52 26 280 300 -31 -54 -98 79 -220 -18 -57 33 -160 -31 83 166 -47 15 -48 -218 19 -42
6041d2Q8j73J29J98j35n1k3m3K01k35J22j17J76P5l35LJ58k11L63lr4p7L61l50
$$ -42 46 -127 2 200 65 14 -9 -52 149 -86 36 -81 95 170 -165 -162 -4 -215 148 145 51 -26 335 -15
6065a5K5j28J02o1k1n3L0K35n9k9L07j67n3j28j16p6L83q7j0K5J8k18J90k39K75
$$ -15 10 -118 -16 -77 -98 -151 -121 114 55 26 333 166 113 -15 -131 -207 176 89 79 104 122 -96 94 -145 130
6090A30j92J73n6k01J79qN5N8k20Q1K43n65J21l33M72J60j44q5J27o9J09KR9J5
$$ 130 -62 111 55 -146 33 25 80 138 -82 -1 242 -323 -202 -535 -63 97 -47 -132 -5 -74 35 37 136 151
6114A51q1l26K44r1M09l65J88p2J4M7n5n3j04j84L20J20k67PK21j98J48nl1j92
$$ 151 70 -256 -12 -103 306 -59 129 57 71 118 63 10 -94 -278 42 162 -105 -98 123 -75 73 68 37 -155
6138a55R0j03R8L3R4j72M10k45j25OJ86L8l57J76J58m67M90o9K7mk04R3j05J29
$$ -155 -65 -168 -70 -37 57 -115 295 50 -75 -69 117 155 -202 -26 132 -335 155 86 113 109 -95 -2 -107 22
6162B2o5K55k97M5j60K78J24q8P7p7j28J3n6RK3k2K53l58J18P3o0r4J19J69k84
$$ 22 -43 212 -85 -40 -200 78 202 114 191 114 -14 -1 -57 -48 -25 -47 206 -152 -34 39 -21 -115 4 173 -111
6187a11J04K37l57L45j22j32K04k51NqL35j62K14o49J77J61j14J87o4o4K70n2
$$ -111 -7 230 -127 218 96 -36 168 -83 -78 -86 249 87 301 -348 -171 -10 -124 63 -1 -65 205 153
6209A53J02l86J30J49j36p7k6Q4j89J33J33O9j37O2r9J09l8j97K1J63l9p8K36
$$ 153 255 -131 -1 148 12 -65 -91 -7 -196 -63 70 139 2 64 -35 74 36 -161 -140 23 -16 -94 142
6232A42j25Qk1j31O4j06K19J11k54K47m04L26l2L8k39J63k19O7k64N23j49j26
$$ 142 17 25 4 -127 -63 -169 50 161 -93 154 -250 76 44 82 -157 6 -213 -146 -410 113 -36 -162
6254a62M6P9j40P1r0J65K79m80K78m2K14l2l44K85o9k9J3k74L18l15M9K06N8L2
$$ -162 -116 -37 -177 -106 -196 -31 248 -232 46 4 218 186 -158 127 58 29 42 -232 86 -229 -180 26 84 116
6278A16J67k70r9Q2M8j61J07J12j38q0L34l36J77k94J80Q7P3j76J89P7j84L1j22
$$ 116 283 13 -86 -4 44 -117 -10 102 -36 -116 218 -118 59 -235 -55 32 105 -71 118 195 11 42 -80
6301h0P0M9j76K04j56jj30K30J40k37L9j46J06o8K05o6p9k69M24n1Q8r8L03l29
$$ -80 -10 39 -137 67 -89 -90 -220 10 150 -87 -48 -194 -88 -156 49 -17 -96 -365 59 8 96 -2 301 -28
6325b8J70J34j79j79K0J99k23LJ68k63l2L00J16k70N8j11N2L11l69M13m10J63
$$ -28 142 276 97 -82 -62 137 -86 -83 85 -178 -210 90 206 -64 -6 -117 -65 246 -123 290 -120 43
6347D3j99L95n41M36k16l8k6O0Q9k73L34l8K9PL0p9O2n1k1O8p7j35j44L49j39
$$ 43 -156 239 -302 134 -82 -120 -146 -86 3 -270 64 26 55 62 92 13 75 24 3 71 -6 -141 -285 64 -75
6372g5K8L6J03K03k61j99O5k1J92k50N0KJ62r8K10l33O9J05r5P3K34l06J18m6
$$ -75 -47 -11 92 295 34 -165 -100 -121 71 -179 -129 -127 35 -63 147 -186 -117 -12 -107 -34 200 -106 12 -34
6396c4L78l29K3J73l26K75p8n8o9K10j07m0K99m13n5l3J7J48j90J68L2P6k3j59
$$ -34 344 15 38 211 -115 160 82 24 -45 165 58 18 317 -96 -151 -184 -167 -19 -209 -41 -9 67 44 -115
6420a15J15Kj11L24m7l41J55r0R0j51L87k33k62L76j23J41P2l56O6L25j14k90
$$ -115 0 2 -109 215 168 -173 -18 -108 -18 -169 218 -15 -277 99 -24 117 189 -167 -101 224 110 -180
6442a80p4N73m73N5K50Q0k60lR6p8K50k60q4J5M4J68k66P0jR2j78J26q7J5m6J
$$ -180 -254 319 -154 -99 151 231 -29 -32 64 -14 236 -24 -108 -93 -49 119 -147 -77 -78 14 -164 -38 -125 -110 -156 -155
6468a55J88J03N9j98P5l9k8j31J86l65M89m26M21k43J38j59J47k61P3M03m22J46
$$ -155 33 136 195 -3 72 33 5 -126 60 -305 184 -242 179 -64 74 -85 62 -199 -126 277 -145 1
6490AN1j13M38o08KJ06O8n8J11K13q9j29j02L66k62M7j78J00J22R6m15K77j74
$$ 1 52 -61 377 -231 -229 -123 -55 -113 -2 211 122 -7 -109 257 -5 42 -136 -36 86 182 -233 44 -130
6513a30J50k67K48J63l15K17J30k31l6K15J65k25k40K23j05Q8J13j67K09l3j65
$$ -130 20 -247 1 164 -151 66 196 -35 -71 144 309 84 -156 67 -38 50 163 -4 205 172 7
6534Gr7k36M12l31J44K64k96J7L76l76K27l4J42k81J17l8K3N4m38K57N0K53k23
$$ 7 -90 -326 86 -245 -101 163 -133 -116 260 -116 111 77 219 -62 55 17 40 94 -344 -87 -37 216 -7
6557gRJ01o9j67J77k3l9P9l26J89k3P3j7r3l1K03K68m84P8J69k40L63k42O8J32
$$ -7 2 103 34 -133 44 21 -18 61 -265 -76 -99 -26 -43 -136 -167 36 304 -180 -102 67 -173 190 -52 16 148
6582A48j92P1J15k52Q6M1O9J4k77N3L7j54J85J5J27k01r6K88l8q1K0J85p3j52
$$ 148 -44 27 142 -110 -24 17 86 100 -177 -124 -87 -241 -56 -41 86 -115 -211 77 39 -42 -22 163 90 -62
6606f2M1J03j55r2J27k11L22m2J6J39j79o3J0p0m4L33l28L24j62k05J9J21j13
$$ -62 -21 82 -73 -165 -38 -249 73 31 47 186 7 -56 -46 -116 -160 173 -155 169 7 -198 -179 -58 -171
6629a71L91o4k27J7j32L63o9k73m9K29j65K67Kk76K32o8k12J51J5Q8j52J30o0
$$ -171 220 156 -71 -54 -186 177 108 -165 -214 15 -150 117 119 -157 75 7 -205 -54 -39 49 -103 27 -33
6652c3j21P1J52R5j61N1j15J76m8j75O1J25j28m4L46j75m0j41J28J5J34j26j14
$$ -33 -154 -83 69 164 3 54 -61 115 67 -108 -47 78 -50 -94 252 77 37 -104 24 39 173 47 -67
6675f7k5p0j41K72Q6k0l09P4K14jn3J7j8k3J07k43M0P7J18j70K94k6J6k54K08
$$ -67 -92 -162 -303 -31 55 35 -274 -200 14 13 -40 -23 -41 -64 43 -200 -160 -83 35 -135 159 133 149 -105 103
6700A03r8J32l46J19r1K09q3J41J40l07p2L44j81N1j23qn4J74k74J16Q9J06j82
$$ 103 5 137 -209 -90 -181 28 -55 86 226 -81 -153 191 10 61 -62 -70 -124 50 -224 -108 -19 87 -95
6723i5K31j85N3j44K60L9k26j31N48k87J90l69j04L8L16k98J11J03J19l5j84J63
$$ -95 136 -49 4 -140 120 159 -67 -198 350 63 253 -116 -220 -182 134 -164 -53 50 169 134 -50 113
6745A13j01Q4j18k08J34J66K91j53n26K74j1J00N6j27J08N3p1j40L48k23m51M41
$$ 113 12 96 -22 -230 -96 70 361 208 -318 -44 -55 45 101 -26 82 135 64 -76 272 49 -402 39
6767C9j18K29l2K6n2j62M3N1j30k07L94j80K70j94o2Q3j52J52j37J02K57n85L94
$$ 39 -79 150 118 144 92 -70 -27 24 -106 -313 81 -99 171 -23 -85 -2 -154 -2 -139 -37 220 -365 29
6790B9m54M63j92R9j13L05r4J21j99K24Q1l32J03k75M28j64n5L8j00J75N5k65
$$ 29 -425 38 -154 -55 -168 137 43 164 -35 189 270 -62 41 -234 194 30 -25 13 -87 88 143 -122
6812a22J33l13K03J74j71o8K71j10J27J36k41J45j74j7N9j78L61k13K04q1m21
$$ -122 11 -302 -99 75 -96 -164 107 -3 124 260 19 164 -10 -27 32 -146 215 2 206 125 -296
6833b96J17J24M8K40k61j4j8J14j38q7L60l42K14m5M2J55k59R7l7l7K69j59M8
$$ -296 -179 -55 -7 233 -28 -42 -60 54 -84 -171 189 -153 61 16 58 213 -46 51 14 -23 246 87 135
6856A35m45J45O3K17m13L92j76L2J74k38R2J8K16n36L88K9k48p1JK65k74J04J07
$$ 135 -310 -165 -102 115 -298 94 -82 -50 124 -114 -22 -4 212 -324 64 93 -155 -226 -225 40 -234 -130 -23
6879b3L4j26L43n45L52j09J87J01l90K46J35k08q1J53Q9j17q0k23L92Kj04J87
$$ -23 11 -115 228 -317 35 -74 113 214 -176 70 205 -3 -84 69 158 41 -39 -262 130 132 28 215
6901B15j56k86j31M43k00K89k47L46k42jj69L64k73N4l2j54L37k03o5M59m89J78
$$ 215 59 -227 -358 85 -115 174 -73 273 31 30 -139 225 -48 6 -26 -180 157 -46 -111 348 -141 37
6923C7j52L53m15J3K9p4K38K3j73K02l81L27J31j7j66L92m34O5J9k18M77j28J
$$ 37 -115 238 -177 -164 -135 -209 29 52 -121 81 -300 27 158 141 -25 367 -67 -2 17 -201 276 148 149
6946A49j22O9oj11R0Kj50J19j82M89k70O1p1j02j30p2J16R8P4j18J10k35J73O9
$$ 149 27 96 90 -21 69 71 -79 40 -142 347 77 138 67 -35 -165 -237 -121 -23 51 -67 43 -192 -19 50
6970E0l13M88K1k49o2O9N1J37m61L6L90J7j92K5O7R7k9q0k12O3K90j97Q9p0J22
$$ 50 -263 225 246 -3 -65 4 55 192 -269 -233 157 174 -18 7 74 171 142 62 -150 -87 203 6 95 25 147
6995A47mJ11k85J35p3l00K41J90J49n06Q6K23l53J76p5J88j9j31N6q8J47j73K10
$$ 147 143 254 -31 104 31 -269 -28 162 311 -195 -109 114 -239 -63 -138 50 31 -100 -44 -132 15 -158 52
7018E2NJ68o5k01K13ol21K30j52K8l4P0M2J58j41n4K11k54J42J5j39j49QL18k93
$$ 52 57 225 160 -41 172 166 -155 75 -77 -49 -83 -13 29 187 46 -8 203 -51 91 106 -33 -182 -174 144 -149
7043a49L5K75p2J89l58J93k35K22k31o2K99J36m11P2o7L61j70o7j19j33M07oj46
$$ -149 -114 161 89 278 -80 113 -122 100 -131 -193 106 242 -169 -97 -164 197 27 -40 -159 -292 115 109 -37
7066c7K50j37k30Q1q8M62k69p5m5L7J68k56J98j43J12j95J8J8k1N1J42j88J11
$$ -37 213 76 -154 -73 -161 301 32 -43 -88 -51 117 -139 59 -84 28 -167 -149 -131 -152 -101 41 -147 -36
7089c6Q4K5J28k5n2o4J5K3MJ2q4p2n7qJ90J18m47J16R2kk21L99nj32J22J05m65
$$ -36 48 73 201 176 124 60 75 98 102 114 30 -42 -99 -107 83 201 -246 -130 -38 -40 -261 138 133 1 123 228 -237
7116b37L6K01L9k14J27l6m0j59L7J94j33m8K64J27m8r7K02j64j43J28L7j74mj17
$$ -237 -201 0 39 -175 -48 -84 -124 -283 -246 -52 -185 -233 31 158 110 13 215 51 -92 36 73 -101 -105 -222
7140b22M33j83o7M1j9M06l42J8p0k3k13L44k61L3J42J08k62P4J3n0KK63l18K77
$$ -222 211 28 -39 2 -17 389 47 65 -5 -28 -241 103 -158 -125 17 125 -137 -63 -50 -100 -98 165 -153 124
7164A24l16J44j49J83J62R8m06o8L9R9K51k34p6J69KN2k4J31Kk29J7J50P8j77
$$ 124 -192 -48 -197 -14 148 246 -160 -228 -189 -90 161 -73 -149 20 22 74 50 181 183 -46 -29 121 199 22
7188B2k04J73m1K26k74J06J81j42N2L5j46J45k85R2J18o0j9M78k75kj73j46o5
$$ 22 -182 -9 -50 176 -98 8 189 47 99 134 -12 133 -152 -60 58 -2 -21 457 182 180 7 -139 -204
7211b04M83k40J91j17j75k56M92j76r7O5OK55l6j60J24j90P2k9m0j68J12J22j43
$$ -204 279 39 230 113 -62 -318 174 -2 -99 -34 -28 227 191 31 155 -35 37 8 -32 -200 -88 34 -109
7234a09J61n7Q2MJ01l95K45K90n26l0L95k01K0k5m7J56j13M1p9M12k25j26j04
$$ -109 52 -5 77 81 182 -213 32 322 -204 -234 161 -40 -20 -45 -92 64 -49 -8 -87 325 100 -26 -130
7257a30N1j42K48L3j3k06J60rK59j59l38j5L9J00L37j64J36j58j30O3j61M25m44
$$ -130 -79 -221 27 60 47 -159 1 -8 251 92 -246 -261 -222 -122 215 51 187 29 -101 -38 -199 226 -218
7280b18l4J15J33N3J17l64R5N3J5n7P5m0L79l72l7J88K1j1j52j13K32j43P5l0
$$ -218 -252 -137 -4 49 166 -198 -103 -50 -35 -92 -17 -57 322 -50 -87 101 122 111 -41 -154 78 -65 10 -20
7304b0K68j18k3L0j69J9L55m39P9J00M5j45l4o5L6J33j8R7k08Q5N2L1j18o4J96
$$ -20 248 130 107 137 -32 -13 342 -97 -18 82 127 -18 -52 -117 -81 52 34 131 -77 8 60 91 -27 -91 105
7329A05j26O5P3k03J16Q0k59P6J40N0j19J0J53j99L0k11Q8O2j0k1N0L7Q4m4j9
$$ 105 -21 44 117 -86 30 110 -149 -73 67 117 -2 8 161 -38 -8 -219 -131 -69 -79 -100 -50 -13 71 27 8
7354HJ3n8J13l97M95r4n5K7o2J68n2J52k68K2J9K4l2r%l5J17rj14p4M8O6J36m19
$$ 8 21 -37 76 -321 174 80 25 52 -10 158 106 258 -10 12 31 55 23 14 14 -21 96 87 -27 -101 -53 13 149 -270
7382b70N02k69L5j91J44j38J04L2K66j50Q4j24j16K01j4J17k75J75r4r0r6K52
$$ -270 232 -37 -2 -193 -49 -187 -83 -51 215 65 149 25 -91 110 96 213 -62 113 19 -71 -167 85
7404H5p5K9q7K6j97K48p5J58l77M05k08q4K71l92L08k4j85K39j04R1J46l19J46
$$ 85 10 39 -48 -22 -219 29 -46 112 -265 140 -68 -152 119 -273 35 11 -174 65 -39 52 198 -121 25
7427B5nM0n6J12lk13p3J15O4k27J25O0J74Ok95K03K8j13J92j97J36Jm09M10j52
$$ 25 20 60 4 116 113 -100 -173 -58 6 -221 -96 -36 138 144 -151 52 80 -33 159 -38 98 99 -310 100 -52
7452e2P9J32k25J22p3O0m1l8j2j50O8J49j27J91n8R4j31r0K66j13l7K3P5p4o0
$$ -52 27 159 -66 56 -17 43 2 -36 -48 -198 -130 19 -108 83 25 119 -12 -102 164 51 14 37 112 38 -22
7477b2J35j9j56N9l8n2K81o5o8q2J27k78L97q01O06k21J34p6oJ91j38J45J86O7
$$ -22 113 94 -62 -3 -41 -93 188 123 55 -27 100 -178 219 -582 24 -197 -63 -139 -145 46 -92 53 239 306
7501C06j63j5n4k7K7k4j2o9q8J49k31J65J85j17n5J29l23P5J09j52K24L4oo4j77
$$ 306 143 128 74 47 74 50 38 -31 -119 30 -201 -36 149 32 -23 106 -217 -142 -33 -185 39 73 67 3 -174
7526a74K29o3K99l84j03L59k14n9J69j32L89l70j21M5K74j38K5K0m7l1m1j01K97
$$ -174 55 -8 291 -93 -196 163 -51 -110 59 -73 316 -54 -175 -130 144 6 31 51 4 -27 -68 -169 128
7549A28l5l38R8J92J68k68L45l05J16L3k92J55K09m3j30J08j84M7O8Q1P9l47j59
$$ 128 93 -245 -147 45 213 -55 290 -15 101 134 -158 -3 206 163 33 141 -43 4 72 153 232 -115 -274
7572b74N62k48p3j09J59J36r2j77O7J93k54J21K42j13n7m15L81k34L6q8J42J09
$$ -274 288 40 -33 -142 17 153 61 -116 -49 144 -110 11 253 140 83 -332 49 -185 -149 -237 -95 14
7594A4L3o4p2J05k53K50j37M38m96L24k41K78k06r0L9N9j3k05L40K7r6k33K39
$$ 14 47 -17 -89 16 -237 13 -124 314 -182 142 -99 179 -27 -117 -78 -19 -32 -237 103 130 34 -199 40
7617D0q5l9K5j7M7j70pJ8K46j33J59k76L8J84p1N5k6J37j07o0j30P3k0K35r9Q1
$$ 40 -45 -84 -59 -76 -29 -199 -206 -188 58 -75 84 -192 -154 30 -41 14 -12 125 18 -42 -172 -99 -119 116 17 98
7643I8Q3j53q6r7L14k54J22J10k92J7K16n7j0m0Nj75K18J58m46L00j03j39L59
$$ 98 181 28 -58 -155 159 -95 27 137 -155 -138 78 21 11 -29 -24 -199 19 177 -269 31 -72 -211 148
7666A48k41jQ6l5j34K88p0O8p8K31k62L5J10n0q9J58r5o8J85l03J94m9j55j05
$$ 148 -93 -94 -8 -43 -177 111 41 109 31 262 0 35 145 95 6 164 69 1 186 -117 77 28 -127 -232
7690b32M0K90L51m10o1o2K19P4k37l5l9J48O2kj76J23k07K95k19O6K70j96pk08
$$ -232 -192 98 449 39 -22 -84 135 209 -28 -63 -102 46 108 106 -70 53 -154 141 -78 -12 258 62 55 -153
7714a53R6L81l48l2K68k26o5O4p6R2N0k20l4L67l18mK17J30mJ9j25K07l15O7J5
$$ -153 -57 324 -24 -56 212 -14 -79 -15 -91 1 51 -169 -203 164 -154 -158 59 189 185 204 79 286 -29 38 53
7739E3j5r4k4pJ70M4q6N2j6l8k21K62L6l27J1R7J92k42q5K95j05J31j29R5K8K4
$$ 53 38 -56 -80 -87 83 127 41 93 77 39 -182 80 116 -211 -200 -103 89 -153 -238 57 -48 83 -46 49 77 101
7765A01j61J38J1j93J32J44j16n1j07j52K45j99K48j27J28pk65J33Q5NK34k10
$$ 101 -60 78 89 -104 28 172 56 5 -102 -254 -9 -208 40 -87 41 34 -231 -98 -13 -8 226 16
7787A6j61N9j0Q9o4o2J43k02J01m3K74M8o8q1J85n3k81p7J25l5OK37q3np4k77
$$ 16 -145 -86 -96 -7 -71 -133 10 -192 -91 -134 140 188 120 39 224 171 -110 -187 -62 -97 -91 146 63 58 -16 -293
7813b93M01k35qL55l49J73p2J13Q7k14l38K76l5L17j21k36M2L70j85J52j95q3
$$ -293 108 -127 -135 220 -129 44 -28 85 172 -42 -380 -104 -139 178 57 -179 -137 233 48 200 5 -78
7835g8P5O3j27J88j52N0N4k53K26j01n9q9Q8K13k03R2J39q4J40j83m3J22J5j72
$$ -78 -3 60 -67 121 -31 19 73 -180 46 -55 -114 -203 -115 98 -105 -13 126 42 182 -1 -44 78 93 -79
7859g9K5J41N1l61L19k17M5j11K9J04k26L29K1Pn7j23J45l11Q2K31m20K92N1J45
$$ -79 -54 87 138 -223 96 -121 -76 -187 -158 -54 -280 49 70 77 20 -103 42 -269 -187 44 -376 -84 -33 112
7883A12n6j37l7J45p5J02J35j90K37m05J94nQ7l2J15P4k66M4j3K1K06q6j00J8
$$ 112 56 -81 -118 27 -48 54 189 -1 236 -169 25 20 107 75 190 264 -2 42 29 50 256 170 70 88
7907H8p1j18K5k38L06J6R6k77j19K96J93j84Q0k37L6J03K51l23P5L5j27mN8j28
$$ 88 17 -101 -76 -314 -8 8 104 -173 -292 4 197 13 93 -144 -108 -5 246 -77 -2 33 -94 -98 -40 -168
7931a68K85l14L70k92L22lq3J84k16j94L21k19J47j76j83J27J04j61J50J5mq6
$$ -168 117 -197 173 -119 203 200 117 301 85 -109 212 -7 140 -36 -219 -92 12 -149 1 16 12 -74
7953g4K36k66J80l33K13K17Jk64MJ95j1Qqk22K38j46K09M0j98J75m17K45j9k69
$$ -74 162 -104 76 -257 -44 173 174 -90 -86 109 98 106 98 -124 114 -32 177 217 19 194 -223 22 3 -266
7977b66L51j28m05K44J39K38k64R5l6j88K37O4L4N9j22J71j16M2N2k81k37N40
$$ -266 85 -43 -448 -204 -65 173 -91 4 -32 -220 17 81 115 174 52 223 107 149 201 -80 -317 223
7999B23k13q3J99j25J76j08P4p2l73J63K82N3o3o3q9k12J53poJ8q1Q5J76K1j49
$$ 223 10 -73 126 1 177 69 143 71 -302 -139 143 196 133 70 -19 -231 -78 -85 -91 -73 -154 -69 107 128 -21
8024b1J43j81J87l5k46L31k30K55m00L60k95J92j60j34K41k83L40l1J7L3O3j44
$$ -21 122 -59 128 93 -153 178 -52 203 -197 163 -132 60 -100 -234 7 -276 64 33 50 83 146 2
8046Bj47J24OK75p2l10J40J02l1j88K37l0k2j83j08J27K56N6k32O1J7k26K18P4
$$ 2 -145 -21 -15 260 188 -122 18 120 89 -99 138 108 86 -97 -205 -78 178 234 2 63 80 -146 72 146
8070A46J13k40m6j07L44j8l11K04j20Pj04M8L95k46j81J40l04K77o0K41j52K7
$$ 146 259 19 -27 -134 210 192 -119 85 -35 -28 -132 -84 311 65 -116 24 -280 -3 -63 178 26 53
8092E3J3K2P2j8k21L36j44k23K30q4r4j13L09l41M18m46j13N13l41K20j11J23
$$ 53 66 88 160 142 -79 257 113 -110 120 36 -58 -171 138 -203 215 -231 -344 169 -172 48 -63 60
8114F0j78mJ83Qp9J21m0%n7J2j2k52P7L02L7j64R8k2j03j85M72r8l57L13j93J30
$$ 60 -118 -122 61 69 -10 111 71 71 14 26 14 -238 -161 141 178 14 112 90 -13 -198 274 176 -181 132 -61 69
8140F9R9M0m27K02N1J8k73PK64R1j41%P1j18K86j96K6k61l5K74J01k78K69k21
$$ 69 168 208 -219 -17 34 52 -221 -214 50 141 0 0 71 -47 239 43 69 -192 -227 47 148 -130 139 -82
8164h2k2P7R3l16J83j84K31l4J17j66n1J0K19p6k89K86J88q9k5k4j83L57k07k63
$$ -82 -104 -27 66 -250 -67 -251 -20 -54 63 -103 -154 -144 75 -1 -290 -4 184 95 70 46 -137 220 13 -250
8188b50Q0J23n5
$$ -250 -170 -47 -102
8191a02
$$ Imaginary data points
##PAGE= N=2
##DATA TABLE= (X++(I..I)), XYDATA
0@%%%%%%%%%%%%Qj6J6j6J6k4L2l8M6n6O4p2Q8j04J20j36J60j86K10k40K75l13
$$ 0 0 0 0 0 0 0 0 0 0 0 0 0 8 -8 8 -8 8 -16 16 -22 24 -32 32 -40 48 -56 64 -72 88 -98 112 -128 147 -166
34a66L54l99M49n04N64o29P00p78Q65r60J062j174J296j429J575j736J912k105
$$ -166 188 -211 238 -266 298 -331 369 -409 456 -504 558 -616 680 -749 826 -910 1002 -1103
52a103K321k560K826l126L467l856M303m827N451o209P154q367R988j2285J5811
$$ -1103 1218 -1342 1484 -1642 1825 -2031 2272 -2555 2896 -3313 3841 -4526 5462 -6823 8988
67H988k1993L6009j29994m215J32552j03553r92O8868L2142l3316L0267K8118
$$ 8988 -13005 23004 -106990 -111205 21347 -82206 -83198 -14330 17812 -15504 14763 42881
79D2881K036R30K4845j6558q154O761j3218k0864Q264j7921k9540o085j601l5733
$$ 42881 44917 45847 70692 54134 45980 52741 39523 18659 26923 9002 -20538 -26623 -28224 -63957
93f3957k8287K4047M7935m063j6177J8759K1761J5014L2276P124k9947r628L0040
$$ -63957 -92244 -68197 -20262 -24325 -40502 -21743 18 15032 47308 54432 24485 14857 44897
106D4897K173m2444j1327K6866j1172k8299O273K628r787P049N63j5121J319J9470
$$ 44897 47070 4626 -6701 20165 8993 -19306 -13033 -10405 -20192 -13143 -12580 -27701 -26382 -6912
120f912Q158p956J980J3012N175J0785Q508k1270j4246J6704M541k1214j7505
$$ -6912 1246 -6710 -4730 8282 13457 24242 32750 11480 -2766 13938 18479 -2735 -20240
133b0240L562J1840o047p198R792P148L616P766m096o871Q828N641o900q006K475
$$ -20240 -16678 -4838 -10885 -18083 -8291 -1143 2473 10239 6143 -728 8100 13741 6841 -1165 1310
148A310L933n465o36M511r515k933J1559n820j1835L939M266O45L410J662J165
$$ 1310 5243 -222 -858 3653 -5862 -8795 2764 -3056 -14891 -10952 -6686 -6041 -2631 -969 196
163A96N349Q325K316q747M69O884n748o685k312o261p8K592n656k828J432L529
$$ 196 5545 13870 16186 7439 7908 14792 9044 2359 47 -6214 -6292 -3700 -9356 -12184 -10752 -7223
179g223L808n098j097Q478L408J2R97n18N494M773k627j164j212p1k2o830l566
$$ -7223 -3415 -8513 -9610 -1132 2276 2288 3285 2767 8261 13034 10407 9243 8031 7960 7938 1108 -2458
196b458Q54o434q23L110o240L87P414m16j780K789N071J927k495J793L608k238
$$ -2458 -1604 -8038 -8861 -5751 -11991 -11604 -4190 -4606 -6386 -3597 1474 3401 906 2699 6307 4069
212D069K052K608l408J776P57n705O35R66o793l971k78J06j335l985M414N407
$$ 4069 6121 8729 5321 7097 7854 2149 2784 3750 -3043 -7014 -7292 -7186 -8521 -12506 -8092 -2685
228b685j954K907N223J232K838P33j316K52j691l54o71o030p57K351m507p74J429
$$ -2685 -4639 -1732 3491 4723 7561 8294 6978 7230 5539 5185 4514 -1516 -2273 78 -4429 -5203 -3774
245c774l316J909L116k487p67L391M708p43l337N873M725n468L48L263l610j134
$$ -3774 -7090 -5181 -2065 -4552 -5319 -1928 2780 2037 -1300 4573 9298 3830 4178 7441 3831 2697
261B697j185l441o85j582j849p15r39L053J144k204N270K926j621L259L010j354
$$ 2697 1512 -1929 -2614 -4196 -6045 -6760 -7699 -4646 -3502 -5706 -436 2490 869 4128 7138 5784
277E784J93J4k60k014m208J790m01o929N50K564k985j062Q71K076K480l54Q30
$$ 5784 5977 5991 5731 3717 -491 1299 898 -6031 -5481 -2917 -5902 -6964 -6093 -4017 -1537 -1891 -1061
294a061L416R58K371K65k370L674M63n452l11J20l603j697j729m87q6j576K470
$$ -1061 2355 3313 5684 5949 3579 7253 7716 2264 1953 2073 -1530 -3227 -4956 -5443 -5529 -7105 -4635
311d635J509j545M085L086j388K298Q68k5J218j534j459J072j542j082j616j683
$$ -4635 -3126 -4671 -586 2500 1112 3410 4278 4253 5471 3937 2478 3550 2008 926 -690 -2373
327b373K042j650m098K342J569k237K41Q48K347J795j375K568K643p91J292k17
$$ -2373 -331 -1981 -6079 -3737 -2168 -4405 -4164 -3316 -969 826 -549 2019 4662 3871 5163 4946
343D946j834J224k085l141K09j321j976N24q76O44N30M82K625l59j205M280M12
$$ 4946 3112 4336 2251 -890 -681 -2002 -3978 -3454 -4330 -3686 -3156 -2674 -49 -408 -1613 2667 3079
360C079k590J388O74k61l21k290J102Q98j914o3o67k85J990k105j852K730pj334
$$ 3079 489 1877 2551 2290 1969 -321 781 1679 -235 -298 -965 -1250 740 -1365 -3217 -487 -494 -1828
378a828R39J29J220j19o79K293k53j666K055m63j954J410k41j405L22j104J168
$$ -1828 -889 -760 460 341 -338 1955 1702 36 2091 1628 -326 1084 843 -562 -240 -1344 -176
395a76k61j586J336J79l44J365j412l29L604j622j785J427R79p4j646r87K598
$$ -176 -437 -2023 -687 -508 -852 513 -899 -1228 2376 754 -1031 396 1375 1301 -345 -1332 1266
412A266p58k114J759m41r84J793n54l12N37K2P06m32j478J621M5q15M34q07j6
$$ 1266 508 -1606 153 -288 -1272 521 -33 -345 192 214 920 488 -990 631 676 -139 295 -512 -528
431e28J872j507r72J803k73o76n55j38K136j724j722K740K29r72J023p13J200
$$ -528 1344 -163 -1135 668 395 -281 -836 -974 1162 -562 -2284 456 685 -287 736 23 1223
448A223P78j434m06J206p17k10r35n95J345j360m85J720j625j45K056p80l18J49
$$ 1223 2001 567 161 1367 650 440 -495 -1090 255 -1105 -1590 130 -1495 -1640 416 -364 -682 -533
466e33O64J521r64q80K410p13j175O92l99J52l68k055N9J079q67k8j46R55J940
$$ -533 131 1652 688 -192 2218 1505 330 1022 623 775 407 -1648 -1589 -510 -1377 -1405 -1551 -596 1344
485A344k270L30K799j437q64J016q36M62L2o37M64o48K74J393j008r27M21n33
$$ 1344 -926 -596 2203 766 -98 918 82 544 576 -61 403 -245 29 1422 414 -513 -92 -625
503f25Ok03j550R97J173r44M35Q73R50J111j553J0J971j765r10J77q81k03r04
$$ -625 -619 -822 -2372 -1375 -202 -1146 -711 162 1112 2223 670 680 2651 886 -24 153 -728 -931 -1835
522a835J7J514L8q46J079N88Q0J023j609J88Q43j398L55K09r05N94J8J20J28p70
$$ -1835 -1818 -304 -266 -1112 -33 555 635 1658 49 237 1080 -318 37 246 -659 -65 -47 73 201 -569
542e69J026N20k637Q9J285k37K64n31m85J806O38n83K69L03K14l82j421Q96L57
$$ -569 457 977 -1660 -1571 -286 -523 -259 -790 -1275 531 1169 586 855 1158 1372 990 -431 465 822
561H22j908M83R9p86M79N98j94L46j074O17J068n30L44N47j266J016M56k30P82
$$ 822 -1086 -603 -504 -1290 -811 -213 -407 -61 -1135 -518 550 20 364 911 -355 661 1117 887 1669
580A669j105q74Q38J0r60n93q31J432l06j921J789J650r62J01L1P21J195r03j89
$$ 1669 564 -310 528 538 -422 -1015 -1846 -414 -720 -2641 -852 798 -164 -63 -32 689 1884 981 792
599G92n7r37P31N39j719P33L37j218P97k20n32K80l3m44k22NJ665R6j636J984
$$ 792 735 -202 529 1068 -651 82 419 -799 -2 -222 -754 -474 -507 -951 -1173 -1168 497 593 -1043 941
619I41N59r85Q71L24k30l76j278o4P69j356n72k50j71J545j125j05J595P0l58
$$ 941 1500 515 1386 1710 1480 1104 -174 -238 531 -825 -1397 -1647 -1818 -273 -1398 -1503 92 162 -196
638a96R33l80J105Q23j654L60j58o71J082o56j544J93l5P4j04j289P91R07o89
$$ -196 737 357 1462 2285 631 991 833 162 1244 588 -956 -763 -798 -724 -828 -2117 -1326 -419 -1108
657a108P49M92j34J373p61m65J786k78j501M52K05j57o46p50J137q11j453P33
$$ -1108 -359 133 -1 1372 611 146 1932 1654 153 605 810 653 7 -743 394 -417 -1870 -1137
675a137q8l35Q56p66l9J576Q5M79J025m55M92N68r03j20q46m04O80j803j085R66
$$ -1137 -1225 -1560 -704 -1470 -1509 67 152 631 1656 1201 1693 2261 1358 1238 392 -12 668 -1135 -2220 -1254
695a254K26l8l80l51K115K31j094Q56M23l79M58n07L10O26q82r2L52l50J34m95
$$ -1254 -1028 -1066 -1446 -1797 318 549 -545 311 734 355 813 306 616 1242 360 268 620 270 404 -91
715i1p21O26q29n65Q88m95J45Q28J83M7M02K22J010n99j338J229K8r03Pq84J024
$$ -91 -812 -186 -1015 -1580 -692 -1187 -1042 -214 -31 16 418 640 1650 1051 -287 942 970 67 74 -810 214
736B14K51j204j11J043o37J24l22KR82o57o48J386k11j31Q54m93M90J9o91L34
$$ 214 465 -739 -850 193 -444 -320 -642 -640 342 -315 -963 423 212 81 935 442 932 951 260 594
756E94m34p00P08o82l37R89o79K54P78r64L98R84j071m1J98j05K64j246N66J230
$$ 594 160 -540 168 -514 -851 138 -541 -287 491 -473 -75 909 -162 -203 -5 -110 154 -1092 -526 704
776G04n00j84O50j41O91l39q35K55j61r83M56p67j02J016n14l4J095l99M34O46
$$ 704 204 20 670 529 1220 881 46 301 140 -843 -387 -1154 -1256 -240 -754 -788 307 -92 342 988
796I88o15K38j93J3J57r91M41M04q07j82O06K0n15J50p80R47K01r46N01K59M4
$$ 988 373 611 418 431 588 -403 38 442 -365 -547 59 79 -436 -286 -1066 -119 82 -864 -363 -104 -60
817f0J29o6Q87L23m43K03j20n63L41o21n20R7m28k69P77o92N0P20k88O9N34L92
$$ -60 69 3 890 1213 770 973 853 290 631 10 -510 -413 -841 -1110 -333 -1025 -975 -255 -543 -474 60 452
839D52P04m24n00R33o4l75nj075M21J38j382j81P13m68M8o5M96J000o01L48P92
$$ 452 1156 732 232 1165 1101 726 721 -354 67 205 -1177 -1358 -645 -1113 -1065 -1130 -634 366 -235 113 905
860I05k48L28L03p61L96k43o24L99m35o80M94k80n05L98k45N57mj041J111P74
$$ 905 657 985 1288 527 923 680 56 455 20 -660 -166 -446 -951 -553 -798 -241 -245 -1286 -175 599
880E99q37L62Q0O95P53j261m6R29r60r7m98n84L33K28q73O94j8k16P13k24K06
$$ 599 -238 124 204 899 1652 391 345 1274 314 217 -281 -865 -532 -304 -1177 -483 -501 -717 -4 -228 -22
901b2N57m70O53J8p20N34O3o77M2M22o12J63p59M45M13m66p0J13j51R77k68o67
$$ -22 535 65 718 736 16 550 613 -64 -22 400 -212 -49 -808 -363 50 -416 -486 -373 -524 453 185 -482
923d82J322k4p21J76m66K09K44r63L01P83j076O53K90k45N42j89k43J28m45L34
$$ -482 840 816 95 271 -195 14 258 -705 -404 379 -697 -44 246 1 543 354 111 239 -206 128
943A28j43l40N1M01p81Q29m77J29R52l36p05O67J50j90n55k67P73j55m66N04j91
$$ 128 -15 -355 -304 97 -684 145 -332 -203 749 413 -292 375 525 335 -220 -487 286 131 -335 169 -22
964b2K85K25p91j27J066r20n29L87q9M48k07j94P07K30N1N15m00l6K94n88j97
$$ -22 263 488 -303 -430 636 -284 -813 -426 -515 -67 -274 -468 239 469 520 1035 635 599 893 305 108
985A08k41o32P04o15o09R96L13n47M42P3k13R88o25r9Q27j71k50j50k70P09o03
$$ 108 -133 -765 -61 -676 -1285 -289 24 -523 -81 -8 -221 767 142 43 870 699 449 299 29 738 135
1006A35p75P26m12p51O41n47m1R86m24K02J50m9Q18K37q29N86j78k48L54j120
$$ 135 -640 86 -326 -1077 -436 -983 -1024 -38 -462 -260 -110 -159 659 896 67 653 475 227 581 -539
1026e39J73N45o19j18k02K68P24o90k76P01R0k81L00J10K2M57n80P55k49j88J62
$$ -539 -366 179 -440 -558 -760 -492 232 -458 -734 -33 57 -224 76 186 208 665 85 840 591 403 565
1047E65n74j84K43o87m33Q64o77K19N83n00M79M81l19Q41n14o2Q18o29o67L57
$$ 565 -9 -193 50 -637 -1070 -206 -883 -664 -81 -581 -102 379 60 901 387 325 1143 514 -153 204
1067B04j63L70o68p76P65L07n72K34J46PO42m41o6N69o27P0m2K9%j23L4K97p58
$$ 204 41 411 -257 -1033 -268 39 -533 -299 -153 -146 496 55 -11 558 -69 1 -41 -12 -12 -135 -101 196 -562
1090e62M39L80n36j09P27o43J61L10m76L17n5k47K18K75j43l2n13P88Q8n20J16
$$ -562 -123 257 -279 -388 339 -304 -143 167 -309 8 -47 -294 -76 199 56 24 -489 299 387 -133 -17
1111a7L02l23J92m45j90J001n79m02P34k07K2L07n13k53L88k13J3k7l87N52k28
$$ -17 285 -38 154 -291 -481 520 -59 -461 273 66 88 395 -118 -371 17 -196 -183 -210 -597 -45 -273
1132b73K86L43o53P46O55j082M6P01j2o87n32Q0K73m93N5N9J65l70M87k0O34r4
$$ -273 13 356 -297 449 1104 22 68 769 757 70 -462 -382 -109 -602 -547 -488 -323 -693 -206 -226 408 314
1154C14p21R74m7l07L28j84m76M21l28j83K86m05R4N1n80L65k9K4N54o25R6J288
$$ 314 -407 567 520 213 541 357 -119 302 -26 -209 77 -328 -234 -183 -763 -398 -427 -403 151 -474 -378 910
1176I10l62N3J0n0K6k1q75J88K88m08j44l20K51J01l19K88L73j62K99J61l98O09
$$ 910 548 601 611 561 587 566 -309 -121 167 -241 -385 -705 -454 -353 -672 -384 -11 -173 126 287 -111 498
1198D98k39j00O19j40j86L83o20j13J28m33j33l11m77Q26J35o44J20O61J36L29
$$ 498 259 159 778 638 452 835 215 102 230 -203 -336 -647 -1124 -298 -163 -807 -687 -26 110 439
1218D39k87P00M06o92n34L04m25K11j37n38K01l9P0M00l79N19J10n76N22o4n25
$$ 439 152 852 1258 566 32 336 -89 122 -15 -553 -352 -391 -321 79 -300 219 329 -247 275 211 -314
1239c14M71p3j70M53J03j69J08k95M33k27o53K33J65l08k14j27k7P53n12K95Q4
$$ -314 157 84 -86 367 470 301 409 114 547 320 -333 -100 65 -243 -457 -584 -611 142 -370 -75 9
1260IM0J15L29o24O46J20r08N06k65O8P8k93K57j34j05K05j96o7M60O8m96L96
$$ 9 49 164 493 -131 515 635 -273 233 -32 36 114 -179 78 -56 -161 44 -152 -219 241 309 -187 209
1282B09l17J4N19n39Q0M16k72l16L40N5M8o1m13N61k4n31L20j29K8J31o38J99
$$ 209 -108 -94 425 -114 -34 382 110 -206 134 189 237 176 -237 324 300 -231 89 -40 -12 119 -519 -320
1304c20K23j64L95M9l16L14J68K40l03p9j88J96k02O4j72j61M19n14l03O90j74
$$ -320 -97 -261 134 183 -133 181 349 589 286 207 19 215 13 77 -95 -256 163 -351 -654 36 -138
1325a38m38O29o9q8J93n6R5Q9k01M91l34m3N45k91m16M71n83l72Q26p00J16M56
$$ -138 -576 53 -16 -104 89 33 128 217 16 507 173 130 675 384 -32 439 -144 -516 310 -390 -274 182
1347A82p32M61j78j39N03j37j86P03o6L0j00l65N28k46m36L74j38k13K83o21j02
$$ 182 -550 -89 -267 -406 97 -40 -226 477 411 441 341 -24 504 258 -178 196 58 -155 128 -493 -595
1368e95O94o07K30L30J04n5Q3j02L51j83p2K97l91O1K53m83j12L18p02L89L02
$$ -595 99 -508 -278 52 156 101 184 82 433 250 178 475 84 145 398 -85 -197 121 -581 -192 110
1389A10n31N32M1l96J78m24O69M3p67M72Q2P5J93k02j07M23j25n67N51l18L7l52
$$ 110 -421 111 152 -244 -66 -490 179 222 -545 -73 9 84 277 75 -32 391 266 -301 250 -68 -31 -383
1411c83j6L9L33k42M0K1K28L25k04J44L4q2j74J99m80M3N75m18m6L4q9K65n32
$$ -383 -399 -360 -27 -269 -229 -208 20 345 141 285 319 237 63 262 -218 -175 400 -18 -64 -30 -119 146 -386
1434c86J25M49j80k11m5J87J40n8j92M92j67M8q9O3m2n7j34j12L11j75j31K02
$$ -386 -261 188 8 -203 -248 -61 79 21 -171 321 154 202 113 176 134 77 -57 -169 142 -33 -164 38
1456C8l33K16K14j04q0l36L15L55k99J69J92l79K99Rn26L57K31l52k7k88n4L21
$$ 38 -295 -79 135 31 -49 -385 -70 285 -14 155 347 -32 267 276 -250 107 338 -14 -41 -329 -383 -62
1478f2l88K51M17k26M0J16l65K88J91m28L17k84q9M36l17k86M47j72o2K00lP1
$$ -62 -450 -199 218 -8 32 148 -217 71 262 -166 151 -133 -222 214 -103 -389 58 -114 -176 24 21 92
1500I2r9NJ49Kl32n8J79L0L65o82L86L0K60q7rk78N73l71k49r7M4k9J23n55M70
$$ 92 -7 -2 147 149 -183 -241 -62 -32 333 -349 37 67 327 240 231 -47 526 155 -94 -191 -147 -176 -53 -608 -138
1525a38K54l73K54J15j44P2J22j60j33K42K47j74k72N1J95m26K91l33j4L58m33
$$ -138 116 -257 -3 112 -32 40 162 2 -131 111 358 184 -88 -37 158 -268 23 -310 -324 34 -399
1546c99O4L88r7J6k02J1L04J62m69K81J7p9J83k93L50J38n09j09M22k49K14K4
$$ -399 -335 53 -44 -28 -230 -219 85 247 -222 59 76 -3 180 -113 237 375 -134 -243 179 -70 144 168
1568A68l87P2J35n65O23p3l26N67J05l86K02j18NK7j87K28m8l09K04L74k45J90
$$ 168 -219 -147 -12 -577 46 -27 -353 214 319 -67 135 17 22 49 -138 90 42 -267 -63 311 66 256
1590B56l05k30N91m90n9K90k47Q2J49j9J90l47L93n9k93K90J93m18J24j02l94
$$ 256 -49 -279 312 -178 -237 53 -194 -112 37 18 208 -139 254 195 -98 192 385 -33 91 -11 -405
1611d05K24r3J6J59l08J96N5q6J71K40k17M13n6j11K69n13L49K6k67KL27o62j61
$$ -405 -181 -274 -258 -99 -407 -211 -156 -242 -71 169 -48 365 309 198 467 -46 303 329 62 64 391 -271 -432
1634d32K06l13M62P6n8J43j59K44N6N4j17M8j55L02m1l59J96J25j70k10j3lJ57
$$ -432 -226 -539 -77 -1 -59 84 -75 169 225 279 162 210 55 357 316 -43 153 278 108 -102 -115 -118 39
1657C9l4j63L35l22R3J61l55L68j71j54M27KOk2l74J73J34l02J08k00k93M17K4
$$ 39 5 -158 177 -145 -52 109 -246 122 -49 -203 224 226 232 210 -164 9 143 -159 -51 -251 -544 -127 -103
1680a03n16N87j49J67L44l64j85L33j3j35K01j05J2k21m6K36j07L9K48j71j82
$$ -103 -619 -32 -181 -14 330 -34 -219 114 101 -34 167 62 74 -147 -193 43 -64 -25 223 52 -130
1701a30N43n13J85L7m65J25K59k54O07p26J79M38l22k4K8L46j53l1j11l8o6K50
$$ -130 413 -100 85 122 -343 -218 41 -213 394 -332 -153 285 -37 -61 -33 313 160 129 18 -20 -86 164
1723A64j57k05J31K9O7l1q6k33J43L23l83L26O4R7j36j50k02Q51m00k82M8J1L2
$$ 164 7 -198 -67 -38 29 -2 -88 -321 -178 145 -238 88 152 249 113 -37 -239 612 212 -70 -22 -11 21
1746B1m7L3p6j8mJ3L0j15K24l27M10qj02K26k13Q1P7N2r6K23n38K39j53j52J61
$$ 21 -26 7 -69 -87 -91 -78 -48 -163 61 -266 144 136 34 260 47 128 205 257 161 384 -154 85 -68 -220 -59
1771e9J15j01j53q4J47K14P2K6J00j64J39M77o64K6K42k89j19q9m3k8N3K14k27
$$ -59 56 -45 -198 -282 -135 79 151 177 277 113 252 729 65 91 333 44 -75 -164 -207 -235 -182 32 -195
1794a95k2L18k01l56O05J17k31J02J03j51N42n87j03J77m5J36k71K29j19j46l50
$$ -195 -217 101 -100 -456 149 266 35 137 240 89 631 44 -59 118 73 209 -62 167 48 -98 -448
1815d48J36K05m54M97k6O8Q2j45L4M09m29J80O3m28N62k86kK06o05Q9L87m06L07
$$ -448 -312 -107 -561 -64 -90 -22 60 -85 -51 358 -71 109 172 -256 306 20 18 224 -381 -292 95 -311 -4
1838dk7L2J88q3k83L12K80l76J5j01K99k70n27K39M32k46O1ML2J66j16l80J41
$$ -4 -31 1 189 106 -177 135 415 39 54 -47 252 -18 -545 -306 126 -120 -59 -55 -23 143 27 -353 -212
1861b12K07LM8Q8k46j10J86J33L4%o8K60m47K32o4l49O21o49J72J46k52J97R7
$$ -212 -5 -2 46 134 -112 -222 -36 97 131 131 63 323 -124 108 44 -305 316 -333 -161 -15 -267 -70 27
1884B7N8J96k49m66Q47k29l19O2J44n9j97K40K5R7K7j82l20J84K15j40j87J69
$$ 27 85 281 32 -434 413 184 -135 -73 71 12 -185 55 80 177 204 22 -298 -114 101 -39 -226 -57
1906e7k56L59J89o28K72J31R6j0jO1J31k59q1Q7J30M7j77J45j85L3m08M30J69
$$ -57 -313 46 235 -393 -121 10 106 96 95 156 287 28 -53 34 164 211 34 179 -6 27 -381 49 218
1929B18m05K17k19j16L36J2j79L57j60M77l11r4q2J26j80K63n22N6J21k43R6R1
$$ 218 -187 30 -189 -305 31 43 -136 221 61 538 227 133 51 177 -3 260 -262 -206 -85 -328 -232 -141
1951a41J22K85m30J50L42l07m1K72j11QK67l08m0J29j11P2q8j88K79j88m85L85
$$ -141 -19 266 -164 -14 328 21 -20 252 141 149 416 108 68 197 86 158 70 -118 161 -27 -512 -127
1973a27O8l2R6Lj12J59q6K19R0p7Q0j31l70L03k30N8J75m01k32M28k04J52m1n6
$$ -127 -59 -91 5 8 -104 55 -31 188 278 201 281 150 -220 83 -147 -89 86 -315 -547 -119 -323 -171 -212 -268
1997b68L97k00J16L9R5j46K53q8J75l45q8J91j59J83k63j87M3L54l2j69M00n76
$$ -268 129 -71 45 84 179 33 286 198 373 28 -60 131 -28 155 -108 -295 -252 102 70 -99 301 -275
2019b75R0K96k29J05q3J00M8o2J93J18k62l03K80j10n9K10l14J41Q0k14K19k13
$$ -275 -185 111 -118 -13 -96 4 52 -10 183 301 39 -264 16 -94 -153 57 -257 -116 -36 -250 -31 -244
2041b44L54o1M1J11k47k0J59j68K15o9n6k14J64R5J20j75Q4j96K58k86J25j44
$$ -244 110 49 90 201 -46 -66 93 -75 140 71 15 -199 -35 60 180 5 89 -107 151 -135 -10 -154
2063a54J18J37Q3j97J13j15L6n9P2J21J18j75q6L85l19J70m87N97j87k71J0Jj81
$$ -154 -36 101 184 -13 100 -15 21 -38 34 155 273 98 12 397 78 248 -239 358 171 -100 -90 -89 -270
2086b70j80K36J69JL16o76M34l17M69K68l61K08j48k92J92P3l94R2R5j99J49K77
$$ -270 -450 -214 -45 -44 272 -404 30 -287 182 450 89 297 149 -143 49 122 -272 -180 -85 -284 -135 142
2108A42O4k48j20q2M76m9r8k29M2K76J41n26L25q2l8J69k01K48r7l69J14K5k96
$$ 142 206 -42 -162 -244 232 183 85 -144 -102 174 315 -211 114 32 -6 163 -38 210 113 -256 -142 -117 -413
2131d13L83J02l38K70R4j25J94j87J87p5J74j09j28m12M41l63o4M67j41K76m12
$$ -413 -30 72 -266 4 98 -27 167 -20 167 92 266 157 29 -383 58 -305 -369 98 -43 233 -179
2152a79L4J73K05n15P30l10l07K87j34k4kj42K38P5j99j36J86l44J75J80l14L06
$$ -179 -145 28 233 -282 448 138 -169 118 -16 -40 -42 -184 54 129 -70 -206 -20 -364 -189 -9 -323 -17
2174a7J86j51Q1k39k62O32k29K04J56n33J70M3r8J77n1l7J31k78J10j25m7r5O98
$$ -17 169 18 99 -140 -402 230 1 205 361 -172 -2 41 -57 120 69 32 163 -115 -5 -130 -177 -272 426
2197D26n79K27J44l36O4j1L0rj73M08j24N2k78m9J70J81k79J48K23j79j38J08
$$ 426 -153 74 218 -118 -54 -65 -35 -44 -217 191 67 119 -159 -208 -38 143 -136 12 235 56 -82 26
2219B6j60j0K52j45J77r0Q6j57p4R7j31K57n6j53L09M4k2l85J71rk79M72k89j78
$$ 26 -134 -144 108 -37 140 50 136 -21 -95 2 -129 128 72 -81 228 272 250 -135 36 27 -252 220 -69 -247
2243b47L36q1j94j2J88m0K71j98l1Q8m5k41l8K07P9n70L97L29m22j73L91l37L25
$$ -247 89 8 -186 -198 -10 -50 221 23 -8 80 35 -206 -244 -37 42 -528 -131 198 -224 -397 -6 -343 -18
2266a8j2R1p9K0N2r9J63l3Q0k41K7J98j16j13P8J09k02J78k17J22k80L07J36k64
$$ -18 -30 61 -18 2 54 -45 118 85 165 -76 -49 149 33 -80 -2 107 -95 83 -134 -12 -292 15 151 -113
2290a13L7j7J21J38r9j79J38K59j96O7k01O2K68m57K88l30j03K23J33j12J63J01
$$ -113 -76 -93 28 166 67 -112 26 285 89 156 -45 17 285 -172 116 -214 -317 -94 39 -73 90 191
2312A91k26j21K64p5M52o30K73M3q5K5k22K13j91J32l15J00Lj48L59j93j25K33
$$ 191 -35 -156 108 33 485 -145 128 171 86 111 -111 102 -89 43 -272 -172 -169 -317 42 -151 -276 -43
2334d3K50o3P1q9J32j03k18K00j32M0K3n1o7J29j04j35L83n08M29l26J84J33l59
$$ -43 207 144 215 126 258 155 -63 137 5 45 68 17 -50 79 -25 -160 223 -285 144 -182 2 135 -224
2357b24L05K8j55K02j43K35O7k47k68M68k17O8k62N1J33p1k22M12q6k15J52j7
$$ -224 81 109 -46 156 13 248 315 68 -200 268 51 119 -143 -92 41 -30 -252 160 74 -141 11 -6
2379fj23K09j20j17L81m20J95k3q5K54j38K46j95r8j67J05k95L32J98j92l7r9
$$ -6 -129 80 -40 -157 224 -196 -1 -24 -109 145 7 253 58 -40 -207 -102 -397 -65 133 -59 -96 -195
2401a95L59k07K50k73L72M8n68L45j79K0J32j59j69K00O0k73L67j29l13L49r4
$$ -195 164 -43 207 -66 306 354 -214 131 -48 -28 104 -55 -224 -24 36 -237 130 1 -312 37 -57
2422e7J86o6j61L10j89L1R8j66k52O33m92J10n4K4K69k84k03L63j52J45r6p8J6
$$ -57 129 63 -98 212 23 54 152 -14 -266 367 -125 -15 -69 -45 224 -60 -263 100 -52 93 -3 -81 -65
2445f5j16J51j51J32J18j50J21M9K85n23K10K29l0l42J75j78l81L77k37K84L2
$$ -65 -181 -30 -181 -49 69 -81 40 89 374 -149 61 290 260 -82 93 -85 -466 -89 -326 -42 -10
2466a0j94M3J19Kk1L23J15m02K9k40K31j0j01j09K3M81k74j40J73l5j34R8k88
$$ -10 -204 -161 -42 -40 -61 262 377 -25 4 -236 -5 -15 -116 -225 -202 279 5 -135 38 3 -131 -33 -321
2489c21M38k59K72j7k22L92m69J25RK63KJ29k78j78L14k09l90Q5N18l16K84n3
$$ -321 117 -142 130 113 -109 283 -186 -61 -52 211 213 342 64 -114 200 -9 -399 -314 204 -112 172 119
2511A19r3J20q1kn3j03L04j44J19K80m11P4k25jJ66j73l08N19M5j83J4m2J9j13
$$ 119 26 146 65 63 10 -93 211 67 186 466 55 129 -96 -97 69 -104 -412 107 152 -31 -17 -59 -40 -153
2535a53N1P4M0k41J01J05L1O7q9N4K33k36%J29k31k10L05l79K43m6N6P3L6k04
$$ -153 -102 -28 12 -229 -128 -23 8 75 -14 40 273 37 37 166 -65 -275 30 -349 -106 -152 -96 -23 13 -191
2559a91L70j73j2P7k60K98q9P0n4k20J69Q5k14j08J07R9J7J40k60n5K79k03J58
$$ -191 179 6 -6 71 -189 109 20 90 36 -184 -15 70 -144 -252 -145 -46 -29 111 -149 -204 75 -128 30
2582C0m8r6M22j44p6N0k87M12m3l12J44M6j41LJ55l25L01j59j56L15N1N1k77K08
$$ 30 -18 -114 308 164 88 138 -149 263 220 -92 52 98 -43 -40 115 -210 91 -68 -224 91 142 193 -84 124
2606A24L8k06k4K68k53L0M8k4j32J60l0k9k71J69N8k6o5K85j7K2j59l8k1K83k44
$$ 124 162 -44 -68 200 -53 -23 25 1 -131 29 -1 -30 -301 -132 -74 -100 -165 120 103 125 -34 -72 -93 190 -54
2631e4J1q9J00Q2k46j39K07M3j39K82l14J10K10j65K86k2j72q3K18j49K09N6J8
$$ -54 -43 -132 -32 50 -196 -335 -128 -85 -224 58 -256 -146 64 -101 185 163 -9 -92 126 -23 186 242 260
2654B60j44Lj37K12j67m00N27Kk37K73m41l6M05j62o1QR6k4J19j33O6KP7j07o1
$$ 260 116 119 -18 194 27 -373 154 156 -81 192 -249 -285 120 -42 -103 -95 1 -23 96 -37 29 31 108 1 -60
2679f0J42K35k51J40R9m93J90J37P0p2j26J2j30J20J31J0l01M84l47J98l62J19
$$ -60 82 317 66 206 305 -188 2 139 209 137 11 23 -107 13 144 154 -147 337 -10 188 -174 -55
2701e5K99m47K6L49l6k07l1q1k25M86K3o4Q2j89L13j64Oo1NR7L02n89N73l25j74
$$ -55 244 -203 -177 172 136 -71 -102 -183 -408 78 101 37 119 -70 243 79 85 24 29 126 428 -161 412 87 -87
2726h7M7NQ0P6jl80K65j27j05K52l05K3L40q4j5J84k40J95M9q7J74N1m65L09r6
$$ -87 -40 -35 45 121 120 -260 5 -122 -227 25 -280 -257 83 -1 -16 168 -72 123 172 85 259 310 -155 154 58
2751E8j67j45M1k09L87J5K3k37J44L40k62L1J3K56J23j38j53j62K22k35L7q8J13
$$ 58 -109 -254 -213 -422 -35 -20 3 -234 -90 250 -12 19 32 288 411 273 120 -42 180 -55 -18 -106 7
2774Gl8N6L5l5J60n10N25l1j82j26k4J11L79n12N4M5P0K9m32L59o6l3J38j69J56
$$ 7 -31 25 60 25 185 -325 200 169 -13 -139 -163 -52 327 -185 -131 -86 -16 13 -419 -60 -126 -159 -21 -190 -34
2799c4l4Nm7L13k68J56k59J47L52jj92j57N3nP5k29K20j9j23p2J4N0K6L33j8j91
$$ -34 -68 -63 -110 203 -65 91 -168 -21 331 330 138 -19 34 29 104 -125 95 76 -47 -119 -105 -55 -29 304 286 95
2825I5K33n10L29j6l38K27K23k52p1m7J40M4n9J62o5q7J09k5m1K5P2j75J79K9
$$ 95 328 -182 147 131 -207 20 243 -9 -80 -127 13 57 -2 160 95 8 117 92 51 76 148 -27 152 181
2849A81k36J20J10k94K61JJ32j92k50J50K65m26JJ63J0L3J7jJ37N7k90J6j98K02
$$ 181 -55 65 175 -119 142 143 275 83 -167 -17 248 -178 -177 -14 -4 29 46 45 182 239 -51 -35 -233 -31
2873c1O7j89Q6K45J5n4J2k56j1K84k34o1J95p9R3P1k19J51l15O9MR3j32l4K05
$$ -31 36 -153 -67 178 193 139 151 -105 -116 168 -66 -127 68 -11 82 153 -66 85 -230 -161 -157 -64 -196 -230 -25
2898b5L7L1j0J11j67rk53K05R4Q6k17J23k22L48j52J41l41K68r6n6rJ58J83k90
$$ -25 12 43 33 144 -23 -32 -285 -80 14 100 -117 6 -216 132 -20 121 -220 48 -48 -104 -113 45 228 -62
2922f2k0J26K02k53M6k42L74j87pK6p8J38k65M13qj96K33q3k94o4J89L88m66j7
$$ -62 -82 44 246 -7 39 -203 171 -16 -23 3 -75 63 -202 211 203 7 240 157 -137 -201 -12 376 -90 -107
2946a07J85r4j40N2k0K11k78K83R7l91K29R6k75r8J72K13J48k38k1K05o5P8m60
$$ -107 78 -16 -156 -104 -124 87 -191 92 189 -202 27 123 -152 -250 -78 135 283 45 24 229 164 242 -218
2969b18L84l24J8j73J73j0L26k27j69P4L92m80J63K22k40n7J44J70k24K16l33
$$ -218 166 -158 -140 -313 -140 -150 176 -51 -220 -146 246 -234 -71 151 -89 -146 -2 168 -56 160 -173
2990a73L99r4k93K08p8k07M31j89o3J33j3j34J47J65k18K08j57j09j86K8L21l54
$$ -173 226 132 -161 47 -31 -238 193 4 -59 74 61 -73 74 239 21 229 72 -37 -223 -195 126 -228
3012b28M23p6r8nJ3j3J9k6J90j97j03M47k11k64L33l06J85P0k24J52j37P2j75
$$ -228 195 119 21 16 29 16 35 9 199 2 -101 346 135 -129 204 -102 83 153 -71 81 -56 16 -159
3035a59R6R3J6J1j41j39K55m25M11j00K98l52j33l2L21l37L96r2N6qR9K0m37L82
$$ -159 -63 30 46 57 -84 -223 32 -393 18 -82 216 -136 -269 -301 20 -317 79 -13 43 35 134 154 -283 99
3059I9p7L29k69r2J6R9k61O3j32R8K22o8J66l39LJ33Jl5j49L32k55L15k43K73
$$ 99 22 351 82 -10 6 105 -156 -93 -225 -127 95 27 193 -146 -143 -10 -9 -44 -193 139 -116 199 -44 229
3083B29j80k4k2N0o6nL6j58RK5K96j49k54K65o0J25J15j63j9J71m25K21J09m9
$$ 229 49 25 3 53 -13 -18 18 -140 -131 -106 190 41 -213 52 -8 117 232 69 50 221 -204 17 126 77
3107G7Q9k8P1m23M5j30M01k34J56k1J26j66J17k14K14K80m01L46n34K21N22m74
$$ 77 166 138 209 -214 -169 -299 102 -132 24 3 129 -37 80 -134 80 360 -41 305 -229 -8 514 40
3129D0j86J93j39J35j01j85J57J95j7l34l6L10J97j75j94K91o1j80J29J0r6M5
$$ 40 -146 47 -92 43 -58 -243 -86 109 92 -242 -278 32 229 54 -140 151 90 -90 39 49 -47 -2
3151bM8k14k6OJ32j31J76r0j25M8K70k62L71j90kj07N5J90p9k61L59Nj21j8k53
$$ -2 46 -168 -194 -188 -56 -187 -11 -101 -226 -178 92 -170 201 11 9 -98 -43 147 68 -193 166 171 50 32 -221
3176b21J74k12KL03j17r1R7L9k20J72K83j84r2MJ71j71j55J17L27n47K65J54j51
$$ -221 -47 -259 -257 46 -71 -162 -65 -26 -246 -74 209 25 -67 -63 108 -63 -218 -101 226 -321 -56 98 -53
3199e3l4K27l11K06k48J78j2r0K64k51n7J26K31l13L71p1P5m29L84l97LK19o8
$$ -53 -87 140 -171 35 -213 -35 -47 -137 127 -124 -181 -55 176 -137 234 163 238 -191 193 -204 -201 18 -50
3222e0k18K50N5p7r3k41N24L8l17K93k73K07N6j27L07l11J07k31O2M5J24r5mJ02
$$ -50 -268 -18 37 -40 -133 -374 150 188 -129 164 -109 98 154 27 334 23 130 -101 -39 6 130 35 31 133
3246A33p5n4rj68J62k03j24N29j03J31j71m2J11K28o16N53j62l4j10k7nn1K8M0
$$ 133 58 4 -5 -173 -11 -214 -338 191 88 219 48 6 117 345 -271 282 120 86 -24 -51 -56 -107 -79 -39
3270c9P1j92K35J03k8k70K1n4J21K79j00J5j51J98r7M1j52l6o0P3P6j58K48j93
$$ -39 32 -160 75 178 150 -120 -99 -153 -32 247 147 162 11 209 112 153 1 -35 -95 -22 54 -104 144 -49
3294d9J40k06K43j77R6k61J52K28l37L40j20j59j2m9L58r9p0J03j28q8N5%j2r9
$$ -49 91 -115 128 -49 47 -214 -62 166 -171 169 49 -110 -122 -171 187 88 18 121 -7 -95 -40 -40 -52 -151
3318a51J31k2J24K2k04J09L24k44J9j14j41J12p3j76K72O2j2j58J74J19m35J50
$$ -151 -20 -42 82 104 -100 9 333 89 108 -6 -147 -35 -108 -284 -12 50 38 -120 54 173 -262 -112
3340a12L32l78J14K58k78N2J46mk65K58%k68K14j24J25j46L16n01M35j03j83o1
$$ -112 220 -158 -44 214 -64 -12 134 130 -135 123 123 -145 69 -55 70 -76 240 -261 174 71 -112 -173
3362a73K94l46K14J27q5J71j89k5J00K9r5Q3J14p8m3r1K9J50o0k76J33Q8j68K60
$$ -173 121 -225 -11 116 31 202 13 -12 88 117 22 105 219 141 98 7 36 186 126 -150 -17 71 -97 163
3386A63l41K93l23L5J98j6M1j13J54j96J79k2R4j13L9l47j23L90Q3l78N16k20
$$ 163 -178 115 -208 -173 25 9 50 -63 91 -105 74 52 146 33 72 -275 -398 -8 75 -303 213 -7
3408gl08Q9K44N2j85K9q5K91P3m63M80M3J35n65J35P2o5l7K10k76N0K8j48K84
$$ -7 -315 -226 18 70 -115 -86 -171 120 193 -270 210 253 388 -177 -42 30 -35 -72 138 -138 -88 -60 -208 76
3432G6j36N3j45J48M6M60n23M2Jj62J46k24J80J09l4L4j27J60k07j99M40j80L40
$$ 76 -60 -7 -152 -4 42 502 -21 21 22 -140 6 -218 -38 71 37 71 -56 104 -103 -302 138 -42 298
3455B98j52r9r4L81m72J37j75K95M9p2l18K76o6k01K98k86j01K12j14L97k10L0
$$ 298 146 47 -47 334 -138 -1 -176 119 168 96 -222 54 -12 -213 85 -201 -302 -90 -204 193 -17 13
3477A3k08J35J19q5K17j82Q9J01k69M6J55Pj20l6Q8J09J7m99J70K15n8j92M9L24
$$ 13 -195 -60 59 -26 191 9 98 199 -70 -24 131 138 18 -18 70 179 196 -303 -133 82 24 -168 -119 205
3501B05k70L10k68j26J74p1j0J8J27l9p0J23j14k15K85np2m8J71j20K00nk00J35
$$ 205 -65 245 -23 -149 25 -46 -56 -38 89 50 -20 103 -11 -226 59 54 -18 -66 105 -15 185 180 -20 115
3525A15J21p5n3j46K12j73k20M09j20k55J82J35Q4j21j02j35K40k50K51K22m14
$$ 115 236 161 108 -38 174 1 -219 190 70 -185 -3 132 216 95 -7 -142 98 -152 99 321 -93
3546i3L7J41J05pk54K77m42J68Q4j83j95K23L3o8L19q9j74j4J66p9R3l06K26K34
$$ -93 -56 85 190 183 -71 206 -236 -68 16 -167 -362 -139 -106 -174 145 56 -118 -132 34 -45 48 -258 -32 202
3570B02m57J87J90k5J9pj78Q9L6o0j11r2%L02k9l1k07K52m4j59J09L60n34L08
$$ 202 -255 -68 122 97 116 109 -69 20 56 -4 -115 -207 -207 95 66 35 -172 80 36 -123 -14 346 -188 120
3594A20K25l94k12m3L62p0K43j59k0K6j66J72n6j06J17l84J99J66J25k08J42J00
$$ 120 345 -49 -261 -304 58 -12 231 72 52 78 -88 84 28 -78 39 -345 -146 20 145 -63 79 179
3616A79J7l67j9J40K58p8n7q8K07k12KM8j01k29M78Q8m90R1L62j69J63l09L09
$$ 179 196 -171 -190 -50 208 130 73 -15 192 -20 -18 30 -71 -300 178 266 -224 -133 229 60 223 -86 223
3639B23J9k45o0j49K77M9J86l10J53j83j33K63j79J96k19L4K60j92j90J54J38
$$ 223 242 -3 -63 -212 65 114 300 -10 143 -40 -173 90 -89 107 -112 -78 182 -10 -200 -46 92
3660I2j86K01q8J06l47K39J2j82Q9k8j4L2J28j25M8j11L9P1nr3J14k09Q2P7J01
$$ 92 -94 107 19 125 -222 17 29 -153 -64 -92 -106 -74 54 -71 -23 -134 -95 -24 -29 -122 -8 -217 -135 -58 43
3685D3J7m8o4K55k09j84O1M0M25k98j58L06k51r9L84k01M2j48j61K88o5m8L42
$$ 43 60 12 -52 203 -6 -190 -129 -89 336 38 -120 186 -65 -164 220 19 61 -87 -248 40 -25 -73 269
3708B69l00m9K42j00k36J15j18K09j19J5L8R5Ol78L90J8k96K12q2jj21J41M5K9
$$ 269 -31 -80 162 62 -174 -59 -177 32 -87 -72 -34 61 67 -311 79 97 -199 13 -69 -70 -191 -50 -5 24
3732B4j47P7j31L43q0l13j07K35J82j8k00Q0q4L01l10J07k21K76N1j36K42k42
$$ 24 -123 -46 -177 166 86 -227 -334 -99 83 65 -135 -55 -139 162 -148 -41 -262 14 65 -71 171 -71
3754g1K58p7j39j7k3R4j21o9J58Q5k61o2L89m30L90k6J83l29r1K47l2j45j1O3
$$ -71 187 110 -29 -46 -69 25 -96 -165 -7 78 -183 -245 144 -286 104 78 261 -68 -159 88 56 -89 -100 -37
3778c7J60j21q3K75k37M5J61l03l0J01n5n7J87J43K26l54J71k9j78Jj6K03j83
$$ -37 123 2 -81 194 -43 2 163 -140 -170 -69 -124 -181 6 149 375 21 192 163 -15 -14 -30 173 -10
3801a0j56J06n7Q5J0j92J43%J1K2j24J77p9J94k64J13n2J7j25Q0O5r3K19p9K0
$$ -10 -166 -60 -117 -32 -22 -214 -71 -71 -60 -38 -162 15 -64 130 -134 -21 -73 -56 -181 -101 -36 -129 90 11 31
3826C1k2O5j57R6K00K5k4j63J48l91J77N6J1j09RP6Nq6n5L53o8l31J21j27Jk2
$$ 31 9 74 -83 13 213 238 214 51 199 -192 -15 41 52 -57 -48 28 33 -53 -108 245 177 -154 -33 -160 -159 -181
3852a81J57k97J08K59Q0j25k03K43N4j87K40j7qo1j29J76o3k77L48nJ00k91N6
$$ -181 -24 -321 -213 46 126 1 -202 41 95 -92 148 131 123 62 -67 109 46 -231 117 112 212 -79 -23
3875b3k52J73L80j60p4q0P4j30K61j25P9m75J68P4p4J76j18J28o9K23j76P2q4
$$ -23 -275 -102 278 118 44 -36 38 -92 169 44 123 -352 -184 -110 -184 -8 -126 2 -67 156 -20 52 -32
3898c2K96k14J48k54j03N6J74j93J86M9k85Q9P6j60L4j13M47l78J46J45j32j87
$$ -32 264 50 198 -56 -159 -103 71 -122 64 113 -172 -83 -7 -167 -133 -246 201 -177 -31 114 -18 -205
3920b05K57j12P9Rj58Q6r9J24J12k53K07J93j29o2p4L01l69O3j32Q6M9O8o4N1
$$ -205 52 -60 19 28 -130 -44 -143 -19 93 -160 47 240 111 49 -25 276 -93 -30 -162 -76 -27 41 -23 28
3944B8k19K75j81m9M9J55k05K22j52j00o8N07k46l25M31k84J10o1O1r4J37k28
$$ 28 -191 84 -97 -146 -97 58 -147 75 -77 -177 -245 262 16 -309 122 -162 -52 -113 -52 -146 -9 -237
3966b37L43K7k89m8NK67j91L98k30p2p2J89k19J72j60J29J12p3K14k42j79M24
$$ -237 106 133 -156 -204 -199 68 -123 275 45 -27 -99 90 -129 43 -117 12 124 51 265 23 -156 268
3988B68l84L9J56k20K42k11kK74j33O9R1k29j5KK64n27K56J25j22J52j12PK02
$$ 268 -116 -77 79 -141 101 -110 -112 162 29 98 189 -40 -55 -53 211 -316 -60 65 -57 95 -17 -10 192
4011A92k04p1k23N9J55L41l12j89L49j38K68m9j42O8N3k71J75m1K0J47j13l77
$$ 192 -12 -83 -306 -247 -92 249 -63 -252 97 -41 227 178 36 104 157 -114 61 20 40 187 74 -303
4033c03N0K54K25k28l7j26K45q1kj66M11q6k05p7j74L7J31J80m44L38M4j88P4
$$ -303 -253 1 226 -2 -39 -165 80 -1 -3 -169 242 156 -49 -126 -300 -263 -132 48 -396 -58 -14 -202 -128
4056a28m7N5J44R0j28J85p3m70M14K3p8q3M5K70j71N9O6j63o8nP8J17K07m73k49
$$ -128 -175 -120 24 114 -14 171 98 -372 42 65 -13 -96 -51 219 48 107 173 10 -58 -63 15 132 339 -134 -383
4081c83M68j01r9j1K87j7k39J84J20n4p3J45m22K10J3n5j92M50j65k03J08k27
$$ -383 85 -16 -115 -126 161 144 -95 89 209 155 82 227 -195 15 28 -27 -219 231 66 -137 -29 -256
4103b56N60k20k68L21J52m14L97m60M4Q4K52j94Rk0L40m56Q9Q6j38L34j70k70
$$ -256 304 84 -184 137 289 -125 272 -188 -144 -60 192 -2 7 -13 327 -129 -40 46 -92 242 72 -198
4125a98K28J11Q1j55k67J28lJ5r1J31l7Q3L3k77M0K95J28j77j97M9mJ6O9J48r5
$$ -198 30 141 222 67 -200 -72 -75 -60 -151 -20 -57 26 59 -218 -178 117 245 68 -129 -80 -84 -68 1 149 54
4150E4K4K43j62l2j95m8J30J8k3P4p5P9R1j43j38N16l96k83LM00k59L13j32mK3
$$ 54 78 321 159 127 -68 -116 14 32 9 83 8 87 178 35 -103 413 17 -266 -263 137 -122 191 59 55 78
4175G8Q0M4l8j75ol2k20M69k86R5J1M2j28J23k2j50K19j51mJ47k12L00J47k01
$$ 78 158 202 164 -11 -17 -49 -269 200 -86 9 20 62 -66 57 35 -115 104 -47 -51 96 -116 184 331 130
4199A30k17J48J57l22L10k46oj6K13K21m34j96J06J79J63k26J17j23J07K5j25
$$ 130 -87 61 218 -104 206 -40 -46 -62 151 372 -62 -258 -152 27 190 -36 81 -42 65 90 -35
4220c5J11r6q5K27k92n3K56j83O6J0j72J11J90l5j40J30k30J49L7j64R8j24K61
$$ -35 76 -20 -105 122 -170 -223 33 -150 -84 -74 -246 -135 55 20 -120 10 -220 -71 -34 -198 -100 -224 37
4243C7r4J39r1%nJ63k6P4l97J06J74l38J22J05k07M25j70n3k5N1K34j54J12l9
$$ 37 -57 82 -9 -9 -14 149 123 197 -200 -94 80 -258 -136 -31 -238 187 17 -36 -61 -10 224 70 182 143
4267A43k53J46o1k28K77r4k6L41k66J39J05l05J90l33K60k3j95J25j23J37k2j27
$$ 143 -110 36 -25 -253 24 -70 -96 245 -21 118 223 -82 108 -225 35 12 -183 -58 -181 -44 -66 -193
4289a93L09M4j21j09m83K72K81L01k37r0o2J27l7L08j80j10j79N4j9J39l7J16
$$ -193 116 160 39 -70 -553 -281 0 301 64 -26 -88 39 2 310 130 20 -159 -105 -124 15 -22 94
4311I4L7R2l46r2J81J07L25o05J94RJ59k45k6k6J46N6Q8k72L4J89j56Q9N0l3O
$$ 94 131 223 -123 -215 -34 73 398 -207 -13 -4 155 -90 -116 -142 4 60 148 -124 -90 99 -57 32 82 49 55
4336E5r1N0k2j9K54l65K22j03J27j64J73l0j76K13R2l68L8K06N6J04j32J1l07
$$ 55 -36 14 -8 -27 227 -138 84 -19 108 -56 117 87 -89 124 216 -152 -114 92 148 252 120 131 -176
4359a76J89J0J50j70j42J92j80J42O7l7J53m92L09K61j71n0q5m5K93k12j1P4N5
$$ -176 13 23 173 3 -139 53 -127 15 82 45 198 -294 15 276 105 55 -30 -75 218 6 -5 69 124
4382A24j87J34j62K98j61n0K8j40N1K81j84k4N1j02o6j71J67K14R2j17o9J86j89
$$ 124 -63 71 -91 207 46 -4 24 -116 -65 216 32 8 59 -43 -109 -280 -113 101 193 76 7 193 4
4405DJ89j67q3O2j04J20j09K15j32J13k7J34k24J85k28o7L00M3j54l29M76m07
$$ 4 193 26 -57 5 -99 21 -88 127 -5 108 81 215 -9 176 -52 -119 181 224 70 -259 217 -190
4427a90J59J36k34K7J84j62J80l89N53k29k9L3k07Q0k63M21l28M83j08j1J61j73
$$ -190 -31 105 -129 -102 82 -80 100 -289 264 35 6 39 -168 -88 -351 70 -258 225 117 106 267 94
4449I4j63Q8j09rK84j01R6k1j79N8J12r7M5j1Q4j98J31l22M48k27J48k87M5L20
$$ 94 -69 19 -90 -99 185 84 180 159 -20 38 150 53 98 87 171 -27 104 -218 230 3 151 -136 -91 229
4473B29l24K18p3o7j50K70J33j12k35n4J85j27J66L4k07M6p4O8j27K66lJ3j76
$$ 229 -95 123 50 -17 -167 103 236 124 -111 -165 20 -107 59 93 -114 -68 -142 -74 -201 65 62 75 -101
4496a01J8j47K98n7k86K76j58K79K6J60l60m2J61j4K23k80lL7J25J95l12o5OR6
$$ -101 -83 -230 68 11 -275 1 -157 122 148 308 -52 -94 67 53 276 -4 -7 30 155 350 38 -27 -21 75
4520G5O9k38r9K63j09Qj07Q4L7n9M2L8j15K22jj89K97J30m89K25M1P7O7k44j32
$$ 75 144 -94 -193 70 -39 -31 -138 -54 -17 -76 -34 4 -111 111 110 -79 218 348 -141 84 125 202 269 25 -107
4545a07K22k32j36N31l08K26j66N7p4QO6n2j3J14K3k6k41j06K17r6n8K40l59K74
$$ -107 115 -117 -253 278 -30 196 30 87 13 21 87 35 22 136 159 133 -108 -214 3 -93 -151 89 -270 4
4569DJ98l03j73L46k54j39L74L9JK8j6j3L29l18j62O4O0j8K10j95K37k14R5l4
$$ 4 202 -101 -274 72 -182 -321 53 92 93 121 105 92 421 103 -59 5 65 47 257 62 299 85 180 146
4593A46j9oj26P4J59J02l91O9P4q0j21K18k16K07j56j1K42k83J28N9l26M44l92
$$ 146 127 121 -5 69 228 330 -61 8 82 2 -119 99 -117 90 -66 -77 165 -118 10 69 -257 187 -205
4616b05J16J1N8P2j37P0o8M8J63k18M14m38k2J14j34J54O1J43m26L84l7l0o5n7
$$ -205 -89 -78 -20 52 -85 -15 -83 -35 128 -90 324 -114 -136 -22 -156 -2 59 202 -224 160 123 93 28 -29
4640b9J34k97J44J9K12j75R0m43O07k58j79K67k17RP8O2J81q1J20k81J19j47J55
$$ -29 105 -192 -48 -29 183 8 98 -345 262 4 -175 92 -125 -116 -38 24 205 124 244 -37 82 -65 90
4663I0n1j59K73j07j46J15Q6R2n00M72j67k5J53l51J91J23j43J27l26K58o2Q3
$$ 90 39 -120 153 46 -100 15 101 193 -307 165 -2 -27 126 -225 -34 89 -54 73 -253 5 -57 26
4685B6j85O7M35j76l94J15J01p7J03M3r1m9J9k49N80j72rl5j15l3K01mk06n2K33
$$ 26 -159 -92 343 167 -227 -112 -11 -88 15 58 -33 -82 -63 -312 268 96 87 52 -63 -96 105 101 -105 -157 76
4710G6R8r9l25J33L23k34j21J93J41l00j9L46k24k9j2j9J62j10Q2K9O4k96J84
$$ 76 174 75 -250 -117 206 -28 -149 44 185 -115 -134 212 -12 -41 -53 -72 90 -20 62 91 155 -141 43
4733D3n2m7K66l35K54J89n56K78J30k70j70L51j87K83j25J04j44q3j19J53K54
$$ 43 -9 -56 210 -125 129 318 -238 40 170 -100 -270 81 -106 177 52 156 12 -71 -190 -37 217
4754B17k72J42K51k15j14r2K7J30j22N6K26l04K80q6Q0m04M48k18k08L90j59j64
$$ 217 -55 87 338 123 9 -83 -56 74 -48 8 234 -70 210 124 204 -200 248 30 -178 212 53 -111
4776a11k12L01O6K25l20K87m32L36k05Kj22J1J15K99l03j55L49J73m66J46L59
$$ -111 -323 -22 44 269 -51 236 -196 140 -65 -63 -185 -174 -59 240 -63 -218 131 304 -162 -16 343
4797C43n01M05l0k53j1L03l38j05K83R6l0l26M2M4K37q4J14m39M70l45K15m58
$$ 343 -158 247 217 -36 -47 256 -82 -187 96 192 162 -164 -122 -78 159 75 189 -250 220 -125 90 -368
4819c68M13K1k12N7J00j39J28J98o7k06Rl2J56j98%J91o7J28j3m91M22J9k1k1
$$ -368 45 66 -146 -89 11 -128 0 198 131 -75 -66 -98 58 -140 -140 51 -16 112 99 -392 30 49 28 7
4843GMl8k31L95j06j71J34j64J17K62k42M5rK00j78O8k25J04K49k12qLJ1m6j05
$$ 7 11 -27 -258 137 31 -140 -6 -170 -53 209 -33 12 3 203 25 93 -132 -28 221 9 1 4 15 -31 -136
4868a36K99j90j97M16j07k30K88l6m07K4L50K38k64J97n99L44j25M12j86K08j62
$$ -136 163 -27 -224 192 85 -145 143 107 -300 -276 74 312 48 245 -354 -10 -135 277 91 299 137
4889A37l3k23nL23k83Q1K87l28l4J79j30n1K7j23L55l92L71q0J12K5n94O34j90
$$ 137 104 -119 -124 199 -84 -3 284 -44 -78 101 -29 -80 -53 -176 179 -213 158 78 190 215 -379 255 65
4912F5k7o9k0m9j23L59l43P0K45j41J22k54L60k43J23j49K03m4q6J88j98o8j65
$$ 65 38 -31 -51 -100 -223 136 -207 -137 108 -33 89 -165 195 -48 75 -74 129 85 -1 187 -11 -79 -244
4935b44K68P3j55J56k8J36l96L55lm3n3Nk02L33m36K35j92L17J63l14J37j62P0
$$ -244 24 97 -58 98 70 206 -190 165 162 119 66 71 -131 202 -234 1 -191 126 289 -25 112 -50 20
4958B0J0N4k70L16k34K42m13M56j04k6J3J84j49p9Rj55J53j49J61L0j16j06O5
$$ 20 30 84 -186 130 -104 138 -275 181 77 51 64 248 99 20 29 -126 27 -122 39 69 -47 -153 -88
4981h8L6M3r4J54L7l32K56j51P3m4J37m8R7k82K90o7j76K00J02k35J10K11l65
$$ -88 -52 -9 -103 51 88 -244 12 -139 -66 -110 27 -21 76 -206 84 17 -159 41 143 -92 18 229 -136
5004a36R8R8j8j00Q3J50l15K18j81K33j95K19k63P5o7J34J05qj29K08j96L5J65
$$ -136 -38 60 42 -58 25 175 -140 78 -103 130 -65 154 -109 -34 -101 33 138 130 1 209 13 48 213
5027B13p6n9j49L4LQ5J14l31K40j21M0j17K78J6k17j98J04J75j57Q4l6J05m53
$$ 213 137 78 -71 -37 -34 51 165 -166 74 -47 -7 -124 154 170 -47 -245 -141 34 -123 -39 -75 30 -423
5050d23M93q1J71n7j96J17j08N9K0k30K48P2k62j2qL01j16J31l41J79j89L91k43
$$ -423 70 -11 160 103 -93 24 -84 -25 -5 -235 13 85 -177 -189 -197 104 -12 119 -222 -43 -232 159 -84
5073h4J43O6k92N9k9J17J17r5J06j26J16k80K22O7j80J38j3j7l76L15jr7J73l48
$$ -84 59 125 -167 -108 -137 -20 97 2 108 -18 98 -182 40 107 -73 65 52 35 -341 -26 -27 -124 49 -299
5097b99M86R2m47p7L66l13J98J74kk78K23o2k05J91K49r2k97l6K47J29m31K91
$$ -299 187 279 -168 -245 121 -192 6 180 178 -100 123 61 -144 47 296 204 -93 -129 118 247 -184 107
5119A07l89K39J4r1L54m41K55j56K76m15K75p0J7J00L1j45j27O3P0r4j19N02m61
$$ 107 -282 -43 -29 -120 234 -207 48 -108 168 -247 28 -42 -25 75 106 -39 -166 -103 -33 -127 -246 256 -205
5142b05L50N7j44l10J21J31qJ88j75j55jK00O5l15J77p3K34j36J52j1l86K71R1
$$ -205 145 202 58 -252 -131 0 -8 180 5 -150 -151 49 114 -201 -24 -97 137 1 153 142 -244 27 118
5165A18k18K7J62k29L41l46J89j21j65K20K06j71m8K9L6Lj64k2O8K16J34j31O8
$$ 118 -100 -73 89 -140 201 -145 44 -77 -242 -22 184 13 -35 -6 30 33 -131 -153 -85 131 265 134 202
5188B02l63J78k06P6J64K36j77j30R3j50j66J54J2J32k4l9J94j16j83J57j11P7
$$ 202 -161 17 -189 -113 51 287 110 -20 73 -77 -243 -89 -77 55 31 -8 186 70 -113 44 -67 10
5210A0q2J67k93K78M3p2J01J18o8J6k36l6O1mk9J39O8k86K8R5j93J86j61R5J01
$$ 10 -72 95 -198 80 123 51 152 270 202 218 -18 -54 7 3 -26 113 181 -105 -77 18 -175 11 -150 -55 46
5235D6n1j09M18k67pn7k03RJ53o6O0L32k94R4J56l61K85O8j6l30R3k30L84n5l34
$$ 46 -5 -114 304 37 30 -27 -230 -221 -68 -134 -74 258 -36 58 214 -147 138 206 190 -140 -47 -277 107 52 -282
5260b82J63r1q4L65N0j15j28K01l4O9o4N5o1J21j73J19j33k1J82k96L56m38M8
$$ -282 -119 -210 -294 71 121 6 -122 79 45 114 50 105 44 165 -8 111 -22 -43 139 -157 199 -239 -191
5283a91o7J44L90k06j41N7N8JR7r1k76M02l7l05J54p8P3k86M10r9J68k72N8Q6
$$ -191 -258 -114 276 70 -71 -14 44 45 142 51 -225 177 140 -165 -11 -89 -16 -302 108 9 177 -95 -37 49
5307D9l01K82J89Q9k02K4l2j70J73m9L37k23j86J17j71M0J8j8L9M0m5L6o6J54
$$ 49 -252 30 219 308 106 130 98 -72 101 52 389 166 -20 97 -74 -34 -16 -34 5 45 0 36 -30 124
5331A24l7o8k0J86Ok36J1k5k5k04L42kl07L91m06K70o5M7r6k1r9O8K40j91J03
$$ 124 87 19 -1 185 191 -45 -34 -59 -84 -288 54 52 -255 136 -270 0 -65 -18 -114 -135 -234 -166 74 -117 -14
5356a4o3J11j04L66j26j43P7j50J91j47m7Q9p1K72m64pJ45j7J24p0J55Q4k27j61
$$ -14 -77 34 -70 296 170 27 104 -46 145 -2 -49 40 -31 241 -223 -230 -85 -102 22 -48 107 191 -36 -197
5380a97K20J23k97n2l7K50j82K03j72Q2K2K29j09J19Nj78j26P4q2j17J00L66k34
$$ -197 23 146 -151 -203 -240 10 -172 31 -141 -59 -37 192 83 202 207 29 -97 -23 -105 -222 -122 244 10
5403A0k8J32j61K10j62J39l29R4L73l08j7Rj96L81J15k78l0j89J73J83l5R8l15
$$ 10 -18 114 -47 163 1 140 -189 -95 278 -30 -47 -38 -234 147 262 -16 -46 -235 -62 121 86 184 -131
5426a31l8j3M31k82m0j38K53K3j40J93k90P1j00L64J7l84K81M1k72K6J6J63j3
$$ -131 -169 -182 249 -33 -73 -211 42 65 -75 118 -172 -101 -201 163 180 -204 77 118 -154 -128 -112 51 38
5449C8l0j39J40L9r1M2p0J31j81L6J79k40K14O2k4j44K87j66L8r8k56L60J3l24
$$ 38 8 -131 9 48 -43 -1 -71 60 -121 -85 94 -146 68 130 106 -38 249 83 121 23 -233 127 140 -184
5473a84M53k65l46L53j9j9Q1M0j21J55k18p1J86n9K19j17l9o3j98K75N9o9k6l2
$$ -184 269 4 -342 11 -8 -27 54 94 -27 128 -90 -161 25 -34 185 68 29 -34 -232 43 102 33 7 -25
5497b5N1J24j18n2q8K84N0l57Q9pR8J75k56k82K69L9n3J60j53p8K46m23K60J01
$$ -25 26 150 32 -20 -108 176 226 -131 -42 -49 49 224 -32 -314 -45 -6 -59 101 -52 -130 116 -307 -47 54
5521E4L6j18N8p0K90j03l83M18l87J96L9q6j01J48r8K30j72j10Q0q0K07o2k83
$$ 54 90 -28 30 -40 250 147 -236 182 -205 -9 30 -56 -157 -9 -107 123 -49 -159 -79 -159 48 -14 -297
5544b97K26l5O9J50O5j41K33k24J85l33K5Pj33J93P1O9Nk21J1K40l19N86k38r5
$$ -297 -71 -106 -37 113 178 37 270 46 231 -102 -77 -70 -203 -10 61 130 135 -86 -75 165 -154 432 194 99
5568I9j56P3p2k40Q0N1K81j44j16J78r4K50j35j84L03j90K22j27m46L04J33m7
$$ 99 -57 16 -56 -296 -216 -165 116 -28 -144 34 -60 190 55 -129 174 -16 206 79 -367 -63 70 23
5590B3j05P6l8Q1j55K39l8k48K41p8k3J55O2m00J20L9J14p7j02K45r6J56K7l42
$$ 23 -82 -6 -44 37 -118 121 83 -165 76 -2 -25 130 192 -208 -88 -49 65 -12 -114 131 35 191 218 -124
5614a24p8L17r3P4l44J39K85k68J28l5M2j93K03J29n1r7K03r9J17l30l3Q5K20
$$ -124 -202 115 22 96 -248 -109 176 -92 36 1 43 -150 53 182 131 34 237 138 255 -75 -108 -23 197
5637A97k13L9r8L0K83q6k56P2m0k16M40l24L11j57l1P9j42J44k13K55k10L04p8
$$ 197 -16 23 -75 -45 238 152 -104 -32 -72 -288 152 -172 139 -18 -49 30 -112 32 -181 74 -136 168 90
5660I0j40J07K4k70J42j06L58j38j4o5K22m06K97n2k25J61J24j47J50k44J55k10
$$ 90 -50 57 81 -189 -47 -153 205 67 53 -12 210 -196 101 49 -176 -15 109 -38 112 -132 23 -187
5682a87m9M4L48q2k75L37o5K2l40J57q8J48J46m9j61K82n01K40p1N7k2J06KJ05
$$ -187 -236 -192 156 74 -201 136 71 93 -247 -90 -178 -30 116 67 -94 188 -313 -73 -144 -87 -109 -3 -1 104
5706A04j65J88q3R3l42M17k66j87J17K79j2k53J37K43k91J18k16K6K11l42K57
$$ 104 -61 127 44 137 -205 212 -54 -241 -124 155 143 -110 27 270 -21 97 -119 -93 118 -224 33
5727C3j55P1kL8l87M49K9j50K5K2m2n7L21j45r4j49L28k45K43l66K86oj47L02
$$ 33 -122 -51 -53 -15 -402 47 76 -74 -49 -27 -69 -126 195 50 -44 -193 135 -110 133 -233 53 47 -100 202
5751B02j81r1N1N7j01J36Pj7L2j82J55J67k11j27K21j58o1J48j42NR7j94J7K14
$$ 202 21 -70 -19 38 -63 73 80 63 95 -87 68 235 24 -103 118 -40 -101 47 -95 -90 7 -187 -170 44
5775D4j32J56j31L52k31j00J18m1j13L64n00J89r9K1Q8l6L19l73J54J11l42l9
$$ 44 -88 68 -63 289 58 -42 76 35 -78 286 -214 -25 -124 -103 -15 -51 268 -105 49 160 -182 -221
5797b21J90k07K21l0m0L28l84Q8pq3K48j9Q6j06o0J14rk76l7L73j74j32K18j24
$$ -221 -31 -238 -17 -47 -87 241 -143 -55 -62 -145 103 84 170 64 4 118 109 -167 -204 169 -5 -137 81 -43
5821d3K69n59K33M0M6j34L21k28J2O9n7K2n0K38P1l17J12j79J42QJ5j4J36k89
$$ -43 226 -333 -100 -60 -14 -148 173 -55 -43 26 -31 -9 -59 179 250 -67 45 -134 8 16 31 17 153 -136
5845a36K06j21J11j74O7j13L13r2j7r4L78m19k02J19M6L23m56N91k36k22K13n4
$$ -136 70 -51 60 -114 -47 -160 153 61 44 -50 328 -91 -293 -174 -128 195 -261 330 94 -128 85 31
5867C1P5K11k76K5k6j27l8K34p4q2M5R3N7oj54L7j5K80l65L0k1Ok9k23K01J02
$$ 31 106 317 41 66 40 -87 -125 109 35 -47 -2 91 148 142 -12 25 10 290 -75 -45 -66 -60 -89 -312 -111 -9
5893iK57j33r4r0p6k7K05l31J93J20P2k03M03m52j3K21J17k83K39m59J93Q4J34
$$ -9 248 115 21 -69 -145 -172 33 -298 -105 15 87 -116 287 -165 -178 43 160 -123 116 -343 -150 -66 68
5916F8L8q9j51RK78j49M8q0J8l55O49l40k22J43K31L2l20O7Q3J63k64J26m4l7
$$ 68 106 17 -134 -125 153 4 52 -28 -10 -365 284 -56 -278 -135 96 128 -192 -125 -42 121 -143 -17 -61 -98
5940i8QJ09Q6j06OL3k97L85j11nMo5L6R4J32k20R7j06r1L7L25l51J31L9o5o3r9
$$ -98 -90 19 105 -1 5 38 -259 126 15 10 14 -51 -15 79 211 -9 88 -18 -109 -72 253 -98 33 72 7 -56 -155
5967a55m3K93l96L12l5J60J3l90K52J78j09j06qJ7J80k97L8J42K1o2J02j86p9
$$ -155 -198 95 -301 11 -24 136 149 -241 11 189 80 -26 -34 -17 163 -134 -96 46 67 5 107 -79 -158
5990a58P6j45L13k02K2j33N12j65l78L04j80L95k09j38M9o9O0K23r0o0q7J14q5
$$ -158 -82 -227 86 -116 -94 -227 285 120 -258 46 -134 261 52 -86 -37 -106 -46 177 87 27 -60 54 -31
6013c1Q5r3N0j5j34J22j27J34Q4j8j73k27K81K5j06N36k15j01l0j1L5m4n3q0K35
$$ -31 54 -39 11 -4 -138 -16 -143 -9 75 57 -116 -343 -62 -37 -143 393 178 77 47 36 71 27 -26 -106 129
6038A29k53J95j37p8J94k80O6J17P4j69K64j50J75k4l16k6K31j60K69k07J05r1
$$ 129 -124 71 -66 -144 50 -230 -164 -47 27 -142 122 -28 147 123 -193 -219 12 -148 121 -86 19 -72
6060g2J02j07K59j6k54K10p4k14K13J31k99J73k38K43j52J10K0j30K63o9k59L18
$$ -72 30 -77 182 166 -88 122 48 -166 47 178 -121 52 -186 57 -95 15 35 -95 168 99 -160 158
6082A58m39M74j72o4m2j08J2K76o6l6K04l52J67K17p8Q0j44j63lP7k07K38M2n1
$$ 158 -281 193 21 -43 -85 -193 -181 95 29 -7 197 -155 12 229 151 231 87 -76 -79 -2 -209 29 71 20
6106B0m1qq1l4m1K52j59M42j65k52j76M18n6l46K12l3j29J50n8j25J16P7j32K59
$$ 20 -21 -29 -110 -144 -185 67 -92 350 185 -67 -243 175 119 -227 -15 -48 -177 -27 -85 -210 -94 -17 -149 110
6130A10j59K60j56r2K52k2l58K43j78LK87j82l36O6L86k00J47j61q7PJ20k0J90
$$ 110 -49 211 55 -37 215 193 -165 78 -100 -97 190 8 -328 -262 124 -76 71 -90 -177 -170 -50 -70 120
6153A20k85K76l09j0J67R5J1J72k64K07P4l66J12k40K40jo8J55J17N1l14j77k5
$$ 120 -165 111 -198 -208 -41 54 65 237 -27 180 254 -112 0 -240 0 -1 -69 86 203 254 -60 -237 -262
6176b62K57J96m64L31J58lj43m50K22M8K42k40K20k24o9R9q7K54J03qO7Pj68k57
$$ -262 -5 191 -273 58 216 213 70 -380 -158 -110 132 -108 112 -112 -181 -82 -169 85 188 180 247 254 86 -171
6200a71K79k92kL61Rl78K04j0J12k12N4p1K54lk14R1O9J10j74p3j08J02L81l95
$$ -171 108 -184 -186 175 184 -194 10 0 112 -100 -46 -117 137 134 -80 11 80 190 16 -57 -165 -63 318 -77
6224g7J48o3J32j31j90J09q5K41R2n34M71q0R1j38k54M06n9k50O0L60k04J41l33
$$ -77 71 8 140 9 -181 -72 -157 84 176 -358 113 33 124 -14 -268 138 79 -171 -111 249 45 186 -147
6247a47J22l6K16k99J60j93J26n1K77j3n8j45K67j80L0Q0m17K95k54K69r5r9K57
$$ -147 -25 -61 155 -144 16 -177 -51 -102 175 162 104 -41 226 46 76 156 -261 34 -220 49 -46 -145 112
6270A12K5l24K77J74k64J54m0j26j85M04k86M0Q5j42K08j78J08l77l3O26k30r6
$$ 112 137 -187 90 264 0 154 114 -12 -197 207 -79 -39 46 -96 112 -66 42 -335 -368 258 28 -68
6292f8M8M1k00j8N25m08J23M7J06k11j22J44QP1l32M95j56K73m66J70j06M19o59
$$ -68 -20 21 -179 -197 328 -80 43 90 196 -15 -137 7 15 86 -246 249 93 366 -100 70 -36 383 -276
6315b76L11n9J61%k55K30l7k40O7J17l3L2L32l84k01L33NK08k88k0j16K30k38
$$ -276 35 -24 137 137 -118 112 75 -165 -98 19 -14 18 350 -34 -235 98 103 311 23 3 -113 117 -121
$$ [...]
8191a70
##END NTUPLES=NMR FID
##END=
