##TITLE=1H_DE-96_oil
 200.13MHz, CDCl3,
 8 sc
 
 9.6.2025
##JCAMPDX= 6.0         $$ Bruker NMR JCAMP-DX V2.0
##DATA TYPE= NMR FID
##DATA CLASS= NTUPLES
##ORIGIN= UXNMR, Bruker Analytische Messtechnik GmbH
##OWNER= pz
$$ XWIN-NMR		Version 3.5
$$ Mon Jun  9 14:33:32 2025 Russian Standard Time (UT+4h)  she@DPX200
##.OBSERVE FREQUENCY= 200.1313
##.OBSERVE NUCLEUS= ^1H
##.DELAY= (6, 6)
##.ACQUISITION MODE= SIMULTANEOUS
##.ACQUISITION SCHEME= undefined
##.AVERAGES= 8
##.DIGITISER RES= 18
##SPECTROMETER/DATA SYSTEM= spect
##.PULSE SEQUENCE= zg30
##.SOLVENT NAME= CDCl3
##.SHIFT REFERENCE= (INTERNAL, CDCl3, 0, 14.3821)
##AUDIT TRAIL= $$ (NUMBER, WHEN, WHO, WHERE, WHAT)
$$ ##TITLE= Audit trail, XWIN-NMR		Version 3.5
$$ ##JCAMPDX= 5.01
$$ ##ORIGIN= Bruker BioSpin GmbH
$$ ##OWNER= she
$$ F:/spectra/data/she/nmr/H-C/1/audita.txt
$$ ##AUDIT TRAIL=  $$ (NUMBER, WHEN, WHO, WHERE, WHAT)
(   1,<2025-06-09 14:32:10.59 +0400>,<she>,<DPX200>,
      <created by zg, POWCHK disabled, PULCHK disabled
       configuration hash MD5:
       00 E9 B6 7A A2 85 ED C7 34 08 36 98 17 FE 4E 26
       data hash MD5: 16K
       E9 7D BE 9B 9C E1 E0 20 E4 1A 6B FC 47 4D 99 30>)
$$ ##END=
$$ 
$$ hash MD5
$$ 6A 1B A5 FA 2E C7 79 35 EF C7 2F 01 1A 72 88 DB
##$RELAX= 
##$RELAX= 
##$RELAX= 
##$RELAX= 
##$RELAX= 
##$RELAX= 
$$ Bruker specific parameters
$$ --------------------------
##$DU= <F:/spectra>
##$EXPNO= 1
##$NAME= <H-C>
##$PROCNO= 1
##$TYPE= <nmr>
##$USER= <she>
##$AMP= (0..31)
100 100 100 100 100 100 100 100 100 100 100 100 100 100 100 100 100 100 
100 100 100 100 100 100 100 100 100 100 100 100 100 100 
##$AQSEQ= 0
##$AQ_mod= 1
##$AUNM= <au_zg>
##$AUTOPOS= <>
##$BF1= 200.13
##$BF2= 200.13
##$BF3= 200.13
##$BF4= 200.13
##$BF5= 200.13
##$BF6= 200.13
##$BF7= 200.13
##$BF8= 200.13
##$BYTORDA= 1
##$CFDGTYP= 0
##$CFRGTYP= 5
##$CHEMSTR= <none>
##$CNST= (0..31)
1 1 145 1 1 1 1 1 1 1 1 1 1 1 1 1 1 1 1 1 1 1 1 1 1 1 1 1 1 1 1 1 
##$CPDPRG= <>
##$CPDPRG1= <>
##$CPDPRG2= <>
##$CPDPRG3= <>
##$CPDPRG4= <mlev>
##$CPDPRG5= <mlev>
##$CPDPRG6= <mlev>
##$CPDPRG7= <mlev>
##$CPDPRG8= <mlev>
##$CPDPRGB= <>
##$CPDPRGT= <>
##$D= (0..31)
0 0.7 0 0 0 0 0 0 0 0 0 0.03 0 0 0 0 0 0 0 0 0 0 0 0 0 0 0 0 0 0 0 0 
##$DATE= 1749465129
##$DBL= (0..7)
120 120 120 120 120 120 120 120 
##$DBP= (0..7)
150 150 150 150 150 150 150 150 
##$DBP07= 0
##$DBPNAM0= <>
##$DBPNAM1= <>
##$DBPNAM2= <>
##$DBPNAM3= <>
##$DBPNAM4= <>
##$DBPNAM5= <>
##$DBPNAM6= <>
##$DBPNAM7= <>
##$DBPOAL= (0..7)
0.5 0.5 0.5 0.5 0.5 0.5 0.5 0.5 
##$DBPOFFS= (0..7)
0 0 0 0 0 0 0 0 
##$DE= 6
##$DECBNUC= <off>
##$DECIM= 32
##$DECNUC= <off>
##$DECSTAT= 4
##$DIGMOD= 1
##$DIGTYP= 9
##$DL= (0..7)
0 120 120 120 120 120 120 120 
##$DP= (0..7)
150 150 150 150 150 150 150 150 
##$DP07= 0
##$DPNAME0= <>
##$DPNAME1= <>
##$DPNAME2= <>
##$DPNAME3= <>
##$DPNAME4= <>
##$DPNAME5= <>
##$DPNAME6= <>
##$DPNAME7= <>
##$DPOAL= (0..7)
0.5 0.5 0.5 0.5 0.5 0.5 0.5 0.5 
##$DPOFFS= (0..7)
0 0 0 0 0 0 0 0 
##$DQDMODE= 0
##$DR= 18
##$DS= 0
##$DSLIST= <SSSSSSSSSSSSSSS>
$$ [...]
##$SUBNAM0= <"">
##$SUBNAM1= <"">
##$SUBNAM2= <"">
##$SUBNAM3= <"">
##$SUBNAM4= <"">
##$SUBNAM5= <"">
##$SUBNAM6= <"">
##$SUBNAM7= <"">
##$SUBNAM8= <"">
##$SUBNAM9= <"">
##$SW= 18.0517328524113
##$SWIBOX= (0..15)
0 0 2 0 0 0 0 0 0 0 0 0 0 0 0 0 
##$SW_h= 3612.71676300578
##$TD= 16384
##$TD0= 1
##$TE= 0
##$TE2= 300
##$TE3= 300
##$TEG= 300
##$TL= (0..7)
0 120 120 120 120 120 120 120 
##$TP= (0..7)
150 150 150 150 150 150 150 150 
##$TP07= 0
##$TPNAME0= <>
##$TPNAME1= <>
##$TPNAME2= <>
##$TPNAME3= <>
##$TPNAME4= <>
##$TPNAME5= <>
##$TPNAME6= <>
##$TPNAME7= <>
##$TPOAL= (0..7)
0.5 0.5 0.5 0.5 0.5 0.5 0.5 0.5 
##$TPOFFS= (0..7)
0 0 0 0 0 0 0 0 
##$TUNHIN= 0
##$TUNHOUT= 0
##$TUNXOUT= 0
##$USERA1= <user>
##$USERA2= <user>
##$USERA3= <user>
##$USERA4= <user>
##$USERA5= <user>
##$V9= 5
##$VALIST= <valist>
##$VCLIST= <CCCCCCCCCCCCCCC>
##$VD= 0
##$VDLIST= <DDDDDDDDDDDDDDD>
##$VPLIST= <PPPPPPPPPPPPPPP>
##$VTLIST= <TTTTTTTTTTTTTTT>
##$WBST= 1024
##$WBSW= 4
##$XGAIN= (0..3)
0 0 0 0 
##$XL= 0
##$YL= 0
##$YMAX_a= 139752
##$YMIN_a= -212219
##$ZGOPTNS= <>
##$ZL1= 120
##$ZL2= 120
##$ZL3= 120
##$ZL4= 120
##$ABSF1= 10
##$ABSF2= 0
##$ABSG= 5
##$ABSL= 3
##$ALPHA= 0
##$AQORDER= 0
##$ASSFAC= 0
##$ASSFACI= 0
##$ASSFACX= 0
##$ASSWID= 0
##$AUNMP= <proc_1d>
##$AZFE= 0.1
##$AZFW= 0.1
##$BCFW= 1
##$BC_mod= 2
##$BYTORDP= 1
##$COROFFS= 0
##$CY= -3
##$DATMOD= 1
##$DC= 2
##$DFILT= <>
##$DTYPP= 0
##$F1P= 0
##$F2P= 0
##$FCOR= 0.5
##$FTSIZE= 0
##$FT_mod= 4
##$GAMMA= 1
##$GB= 0.15
##$INTBC= 1
##$INTSCL= 1
##$ISEN= 128
##$LB= 0.25
##$LEV0= 0
##$LPBIN= 0
##$MAXI= 10000
##$MC2= 0
##$MEAN= 0
##$ME_mod= 0
##$MI= 1.114404
##$NCOEF= 0
##$NC_proc= 0
##$NLEV= 6
##$NOISF1= 3.799351
##$NOISF2= 2.8
##$NSP= 1
##$NTH_PI= 0
##$NZP= 0
##$OFFSET= 14.38212
##$PC= 1
##$PHC0= -1550.243
##$PHC1= 2.5922
##$PH_mod= 1
##$PKNL= yes
##$PPARMOD= 0
##$PSCAL= 0
##$PSIGN= 0
##$REVERSE= no
##$SF= 200.129724274929
##$SI= 16384
##$SIGF1= 3
##$SIGF2= 2
##$SINO= 400
##$SIOLD= 16384
##$SREGLST= <1H.CDCl3>
##$SSB= 0
##$STSI= 0
##$STSR= 0
##$SW_p= 3205.1282051282
##$SYMM= 0
##$S_DEV= 0
##$TDeff= 0
##$TDoff= 0
##$TI= <>
##$TILT= no
##$TM1= 0
##$TM2= 0
##$TOPLEV= 0
##$USERP1= <user>
##$USERP2= <user>
##$USERP3= <user>
##$USERP4= <user>
##$USERP5= <user>
##$WDW= 1
##$XDIM= 8192
##$YMAX_p= 0
##$YMIN_p= 0
$$ End of Bruker specific parameters
$$ ---------------------------------
##NTUPLES= NMR FID
##VAR_NAME=  TIME,          FID/REAL,        FID/IMAG
##SYMBOL=    X,             R,               I
##VAR_TYPE=  INDEPENDENT,   DEPENDENT,       DEPENDENT
##VAR_FORM=  AFFN,          ASDF,            ASDF
##VAR_DIM=   8192,          8192,            8192
##UNITS=     SECONDS,       ARBITRARY UNITS, ARBITRARY UNITS
##FACTOR=    0.0002768,     1,               1
##FIRST=     0,             0,               0
##LAST=      2.2672688,     0,               0
##MIN=       0,             -212219,         0
##MAX=       2.2672688,     139752,          0
$$ Real data points
##PAGE= N=1
##DATA TABLE= (X++(R..R)), XYDATA
0@%%%%%%%%%%%%%%%qJ6j6J6j6J8k6L2l2M0m8N6o4P2q5R5j07J21j38J57j76J98
37A05k22K48k76L07l42L79m19M62n08N61o19O82p53Q29r13J008j112J228j361
56g16J514j690J895k139K432k795L259l873M723n977Q019j1878K1562r0404j36151
71b12219K51801P5108j49153M0116J34099o3028n8506O0062r544p2074L2511j75
83B8998j11211r250Q5576l9655m5071Q8023M2278o8003R108Q9973M113o1786K2980
96C6073M2858o1341m7755M9626k579o1961J0547K4674l6014N57M1725k0937l0640
109e5167M6719J1403o2231L2662R8542k7344o3443N3763M3341m6138j2312K5930
121D5725k6877l8913l449j5732j7110K7797J5602k6928N219L6335m03j802L9003
$$ plain form
0 0 0 0 0 0 0 0 0 0 0 0 0 0 0 0 0 -8 8 -8 8 -8 10 -16 16 -16 24 -24 32 -32 40 -45 50 -57 64 -74 83 -93 105
37 105 -117 131 -145 162 -180 199 -220 242 -266 295 -324 358 -395 434 -479 529 -583 645 -716
56 -716 798 -892 1003 -1136 1296 -1499 1760 -2113 2610 -3367 4652 -7226 14336 -76068 -212219
71 -212219 39582 114690 -34463 5653 139752 76724 18218 78280 68736 -3338 29173 28998
83 28998 -82213 -91463 -5887 -45542 -90613 -2590 39688 -28315 -19207 70766 74879 13093 36073
96 36073 78931 17590 -30165 19461 16882 -45079 -34532 -9858 -45872 -45315 -3590 -24527 -55167
109 -55167 -8448 2955 -59276 -26614 71928 44584 -18859 34904 78245 32107 19795 45725
121 45725 18848 -20065 -23514 -39246 -56356 -28559 -12957 -39885 -34666 1669 1266 -536 38467
134C8467J6097l1583j2352K0577o058k7431M842J3670k1477k2024Q340J0177n196
147a3951Q85J591r902J192J3511m109K952L3978M230l1929J2239L5733j5192k8322
161B906Q059J216k9423j2345J2719j507m063R113n407k460K7808J2250j3499J1256
175A6623J5440k0008j6360J6554R887k0774j1869J1569n260j6377J0440J1601
187A466r628m288L728m107J588J3337P311n394K482J3145p406r588J8044K701
201B3391k8283n840J1868j2749j3860J2314J1169j2502m115J6449O905j609J0142
214A3280J251q875M831J147j1908K741R970r749j5387M091J1906p542q803R113
228c934J430j1536K437R117J540K853O064N44k692M830P054n336p420K145p252
$$ plain form
134 38467 54564 22981 10629 31206 25148 -2283 2559 16229 -5248 -27272 -18932 -8755 -13951
147 -13951 -13066 -11475 -21377 -20185 -6674 -10783 -7831 26147 30377 -1552 10687 46420 31228 2906
161 2906 10965 12181 -17242 -29587 -16868 -18375 -22438 -13325 -18732 -21192 6616 18866 5367 16623
175 16623 32063 12055 -4305 12249 22136 1362 -10507 1062 -4198 -20575 -10135 1466
187 1466 -8162 -12450 -8722 -12829 -11241 2096 9407 4013 6495 19640 12234 2646 20690 23391
201 23391 -4892 -10732 1136 -11613 -25473 -13159 -1990 -14492 -18607 -2158 4747 3138 13280
214 13280 14531 5656 10487 11634 -274 2467 12437 2688 -12699 -8608 3298 -4244 -13047 -3934
228 -3934 -2504 -14040 -11603 -2486 -946 1907 7971 8515 5823 10653 17707 12371 4951 7096 -156
243a56j2083L146K911p860O96Q002j814l341J0485J2170m886o365P051J680o392
258C244J399J323k643K54k301n549K011N444l248r886q88O279m199m080R315N245
274A720k813L010O051J831J232L033k190q616l261J463n542n409L075j075m286
289a1777M976L802q29L850N837k516o059L913P588n348n172O419J587m791O89
304B169K610n55j572l571n484j725L022l64n993K420Q910j965j821R880N921m438
320G444j551K728k369n217R60K07p356k443N068r15k676M842K011l164P7J874
336d80j491M3M098r98m607L551P812l313l000O021M60o726l238J450r34k941k362
353f655j193r76M589L947k751L074P338k840m959M782M006m695m493K136l44m868
$$ plain form
243 -156 -12239 -9093 -6182 -14042 -13346 -5344 -7158 -10499 -14 12156 7270 905 7956 9636 3244
258 3244 4643 5966 3323 3577 1276 -4273 -2262 3182 -66 -9952 -10840 -4561 -8760 -12840 -3525 1720
274 1720 -1093 1917 7968 9799 11031 14064 11874 3258 -3 1460 -4082 -9491 -6416 -7491 -11777
289 -11777 -6801 -2999 -3828 22 5859 3343 -2716 1197 8785 3437 -1735 4684 6271 1480 2169
304 2169 4779 4224 2652 -919 -6403 -8128 -5106 -5470 -11463 -9043 -133 -2098 -3919 5961 11882 7444
320 7444 5893 8621 6252 1035 1995 2202 -5154 -7597 -2529 -3444 -6120 -1278 733 -2431 -2354 -480
336 -480 -1971 -1928 2170 1172 -3435 116 7928 4615 1615 7636 8096 1370 -1868 -418 -1352 -4293 -6655
353 -6655 -7848 -8824 -4235 -288 -3039 35 7373 4533 -426 4356 8362 3667 -826 1310 966 -3902
369c902K290M279l758k083L422k053k736K707J517k322q80J410N08J367N471J609
385F846m973J682M160n345m319M120J35o321l589K672K096q58J962J253j080K596
401A037J620l198K273N093l707n751K217M253k232k632L602N0o066N02L573k889
417b255n93J991k117k153L076L660L75R2J823q14k846L034P36m592Q05J230n012
434c560k656M721L159k487k233K902L77k118K332K418j786N56l71l371J481M994
450D358j242m966N79L140l563k963M582J434m498j51K483n30J820L980j086k286
466A091O2J437j933j212K479j955m266J673N00j869L603L021l209k460L503K650
482C115k746m93L587o31m624J262K162k89J491j171m019m61K429j041k788J324
$$ plain form
369 -3902 -1612 2667 -1091 -3174 248 -1805 -4541 -1834 -317 -2639 -3519 -2109 -1601 -234 5237 6846
385 6846 1873 3555 7715 2370 -1949 2171 2306 -4015 -7604 -4932 -2836 -3694 -1732 -479 -1559 1037
401 1037 2657 -541 1732 6825 3118 -2633 -416 3837 1605 -1027 2575 2625 -3441 -2939 634 -2255
417 -2255 -2848 -857 -2974 -5127 -2051 1609 1984 2076 3899 3085 239 3273 4009 -583 222 1452 -3560
434 -3560 -6216 -1495 1664 -823 -3056 -154 223 -1895 437 2855 1069 1625 1254 -2117 -636 4358
450 4358 3116 -1850 -1271 1869 -1694 -4657 -75 1359 -3139 -3290 -807 -1337 483 4463 3377 1091
466 1091 1153 2590 657 -555 1924 -31 -4297 -2624 -2124 -3993 -390 2631 -578 -3038 465 3115
482 3115 369 -124 3463 2832 -1792 -530 1632 1343 2834 1663 -2356 -2817 -388 -1429 -4217 -2893
498b893L468k833k747N179L971j821J201Q48k087r85J705r91l028k99K1l262j309
515e862M131J078r68J512j81j468K783K876k224j467J583J167l148m41M595J56
531D122l781j450p98j88P20j152j602O6J408N67r38L059M916o42k711J898J576
548E070j624j330m95j569k289q71l7p77Q98K682j234j444K054J136M41J650r09
565A352j394R29J429q28k21K324R42l899k718K042K05k044j697m77J8R21L14J415
583a387K178J826L80j614P89L165j441k505m38l31j608j324M44O73r25J72R05
600a041j047O21K529l06j811J451k10o06J385J244l86m1R39j276k516J720J745
617B394m014k550K027J43j259J169J674Q10p3K04P39M14J106J69l105J56J497
$$ plain form
498 -2893 575 -2258 -5005 174 4145 2324 3525 4373 2286 1301 3006 2015 -1013 -1312 -1291 -4553 -5862
515 -5862 -1731 -653 -1621 -109 -290 -1758 1025 3901 1677 210 1793 2960 -188 -629 3966 4122
531 4122 341 -1109 -1907 -2095 -1375 -2527 -4129 -4063 -2655 -2088 -3026 33 4949 4307 1596 3494 5070
548 5070 3446 2116 1621 52 -2237 -3108 -3145 -3922 -3024 -342 -1576 -3020 -966 170 611 2261 1352
565 1352 -42 887 2316 1488 1267 3591 4533 634 -2084 -42 163 -1881 -3578 -4055 -4037 -3116 -2802 -1387
583 -1387 791 2617 2997 1383 2172 5337 3896 1391 953 622 -986 -2310 -1866 -1193 -2118 -1946 -1041
600 -1041 -2088 -1467 1062 756 -1055 396 186 -420 965 2209 1823 1782 2721 1445 -1071 649 2394
617 2394 -1620 -4170 -2143 -2000 -3259 -2090 -416 394 321 525 1264 1678 2784 2953 -152 4 1501
634A501j591j495J319J000j315j523J453J050j296N64J076k094l04K004l33m03
650c87J869K2j114J39M76k96p57J327j012k767J048K272k241l48K515J80j777
667h51l17J942Q63r94p86k5j27N38N21j594J215J078j711j075J200J539j146j471
685a201J043Q66j839K05J681o35k60L91m28m07N08L50o65K25K16p52k43J723K99
704A077j717J040J462k153r00J831N88j722j430J387R96q74j83P01J15O88j311
721d05r58J789R46j064j543R71J799j260j535J981J292j853j115J000k58j95k30
738f38l53K66M3K53J2M88J402n98j116J714l23k172J254J316j582j512Q06J900
756A160r94j488J610L10j071l08o04J073N51r33q92J417J610n13j275J148K161
$$ plain form
634 1501 -90 -1585 -266 734 -581 -2104 -651 399 -897 -333 743 -1351 -1655 349 16 -387
650 -387 1482 1504 390 529 1005 709 -48 1279 267 -2500 -1452 820 -1421 -1769 746 926 -851
667 -851 -1168 774 1637 643 -143 -168 -295 243 764 -830 385 1463 -248 -1323 -123 1416 270 -1201
685 -1201 -158 708 -1131 -926 755 120 -140 251 -177 -584 -76 274 -391 -166 50 -702 -945 778 1077
704 1077 -640 400 1862 -291 -1191 640 1228 -494 -1924 -537 459 -415 -598 103 218 906 -405
721 -405 -1363 426 1372 308 -1235 -264 1535 275 -1260 721 2013 160 -955 45 -213 -408 -638
738 -638 -991 -725 -682 -429 -417 71 1473 875 -241 1473 1150 -1022 232 1548 -34 -1546 -740 1160
756 1160 166 -1322 288 598 -473 -781 -1385 -312 239 -694 -1586 -169 1441 928 -347 801 2962
773B962j744k598J497J595k148r96Q2Q56n81k26P29M69N85K20j311P53J219p74
791E89j370J406N08j699J49J558J76j883N13R23j048j286P06J01m79j94l61P51
809i40J748l47n47J196J448p05j543k8J807j370k243M46Q66m38p54P6J067K90
827B9p27j82L17J100k29r52J89J993p26q55J161R30j042q94J34K46j435k98O45
846e96o08p93N69L53K83P82K52L22R17q1q91K75J211l63k287l71J827p01j540
865a440L50R52j87r40j43O46R90p25M5J86R67N81j451M85J867q21j341J0N26m15
885A42r51l18M06l79l5N60k06N33M95j31J55N35J22k00N0m9q46k59R18J60j736
906a034K52J248n89j323N51P99J27p27K80O09K5J92k64j84O37Q64j707m97J515
$$ plain form
773 2962 1218 -1380 117 1712 -436 -1432 -1350 -494 -1075 -1301 -572 -103 482 702 -609 144 1363 589
791 589 -781 625 1133 -566 -417 1141 1317 -566 -53 870 -178 -1464 -758 -657 -1136 -1330 -1691 -940
809 -940 808 461 -86 1110 2558 1853 310 282 2089 719 -1524 -1078 -212 -650 -1404 -1328 -261 29
827 29 -698 -880 -563 537 308 -644 -455 1538 812 -43 1118 2048 1006 112 246 492 -943 -1241 -596
846 -596 -1204 -1997 -1428 -1075 -792 -10 242 564 1481 1400 509 784 1995 1632 -655 -1026 801 100 -1440
865 -1440 -1090 -138 -325 -1265 -1408 -762 228 -497 -452 -266 701 1282 -169 316 2183 1362 21 31 557 142
885 142 -809 -1127 -721 -1100 -1135 -575 -781 -248 247 116 271 806 928 728 778 729 -117 -376 542 702 -1034
906 -1034 -782 466 -123 -1446 -895 -96 31 -696 -416 193 218 410 146 -38 599 1463 -244 -741 774
925G74j63j091m73L81J54m20M70N39j29J45j13j67J28M97j18n84L74Ml55j60P20
946D13k10o27K73K39n84K38P90l21n56O6J047r7j093M21M08m23M8q10j89O88O17
967C38p01l59O77N99m68l10Q28L44q42m2M16o08N18m18n06L14J35l43k73l6P49
988A2k6r41M32N76j37N94J33l34L64K97n3n87J03K54j043n54J86j53k45O64k56
1009g14r6P61O17k85K11L72M37m42q03M57K92p91k11n2l18L26O7n02o2K9M76q19
1031a050J23J346M08p34K30O67k58N40k00j85m41j1o50j248M46P19r32N6M77K37
1051d60R4P52K23o3M6R0o8k43k4L97n05n39M99m79k60M81l39q8j27J33k62n5R34
1074A37M76o57k22R45K65o4k3l72j29k07l36j95k5K92n04o74N15Q87m26J61N18
$$ plain form
925 774 611 -480 -953 -572 -418 -838 -368 171 42 187 74 -93 35 532 414 -170 204 208 -147 -307 413
946 413 203 -424 -151 88 -496 -258 532 211 -345 -279 768 671 -422 -1 407 -16 32 -778 -967 -279 338
967 338 -363 -722 -45 554 86 -224 604 948 106 64 480 -128 390 -28 -534 -220 -85 -428 -701 -737 12
988 12 -14 -955 -523 53 -84 510 643 309 673 970 917 330 433 687 -356 -910 -724 -877 -1122 -458 -714
1009 -714 -810 -49 568 283 494 866 1303 861 58 515 807 16 -195 -247 -565 -239 -172 -674 -736 -707 -231 -1050
1031 -1050 -927 419 827 93 323 990 732 1272 1072 887 446 435 -215 -1463 -1017 -298 -1230 -1174 -697 -460
1051 -460 -366 386 609 546 592 682 614 371 347 744 239 -300 199 -280 -540 -59 -398 -486 -613 -480 -742 -797 137
1074 137 613 -44 -266 679 944 880 857 485 356 149 -187 -382 -407 -115 -619 -1293 -778 109 -317 -156 362
1095C62J18k97l33L34L21k6k79l21j74M39K7k89j37N97o64k93M34J58l4M0l6l81
1117d34jO47J91K8k85L08l23mNk66K91l32m27j1N77L65j17l65R3O16n23n70O54
1140A17L45j16r63j77P58j12K48j48J06L77k26m49L79Q11m96p90L13RN3k52L41
1161A28l54l64K79M6j08L44L79k94k46L87j29L41M28o25R8rk9l49l68M45L13r96
1183f83l66O75M56j46k84J35O10m20J18R7K42L58m04p16K27O67o21k59K52j28
1203a90o53PK06N20p4j50R8k1M63M16L2j89l19j33J43k74M55k70k67J68J05o00
1225e27N33P4k57m37R8N90j1k49M30M20j19k16k63Q0M72j19p27n6L70l67n35M14
1247d02J80L30o42K87K79K77K5J87k23k22R9q4P4k61J75r5j57k8J13r8O99n21
$$ plain form
1095 362 480 183 -150 184 505 479 200 -121 -295 144 171 -118 -255 342 -322 -615 -181 -23 -57 -17 -53 -434
1117 -434 -435 212 403 431 146 454 131 127 132 -134 157 -175 -602 -613 -36 329 212 -153 -60 556 33 -537 117
1140 117 462 346 -617 -794 -36 -148 100 -48 58 435 209 -240 139 950 454 -336 -23 -14 39 -213 128
1161 128 -226 -590 -311 -265 -373 -29 350 56 -190 197 68 409 837 212 310 301 272 -77 -445 0 313 -683
1183 -683 -1049 -374 82 -64 -348 -213 397 -23 95 192 434 792 388 -328 -101 566 -55 -314 -62 -190
1203 -190 -843 -836 -630 -110 -184 -334 -236 -257 206 622 654 465 146 13 156 -118 337 67 -200 -32 73 -527
1225 -527 6 80 -177 -614 -516 74 63 -186 244 664 545 329 66 146 618 499 -228 -284 86 -281 -816 -402
1247 -402 -222 108 -534 -247 32 309 334 521 298 76 175 91 165 -96 79 -16 -173 -201 -88 -186 513 -8
1269hn02L33K61l04r5l3M62J36n01M38K95k33k3m39j22M57k19l60J74J01N1l48
1291d79K88M98k9m29N8L0p3N9l8L8K88k66j66K37R3M21k30k45j36K6l0J45j48
1314h8k67M9J67N4k52R2N63k86m59O29J83l24lp3R8K64m12jJ33K19N5m43k75L84
1338Gk59n0k4J46j52p7K90L33K1m1K45L7n9J32l73j4k96j23K14j74j48L0l09M53
1362a91j55k56N55K46j86j27L19J41k41J45j73M32N9l76Ll98K36L0m06l53L03
1383c93K07l12M98j4K01n6J15J84j70K13j14j10l30L64k72P5k07j79K05r6j13
1404c04p2o7M30K12j93J94M92k82o26N04J2k45M9j95L56m68OJ14k3p2P2k09J91
1427a24J32k43J78k0M09j33j27J05J03j22l3p5M9k65K24j78L0J30l23L17k9k10
$$ plain form
1269 -8 -510 -177 84 -220 -315 -348 114 250 -251 187 482 249 226 -213 -335 122 -97 -457 -283 -182 -131 -479
1291 -479 -191 307 278 -151 -93 -63 -136 -77 -115 -77 211 -55 -221 16 109 530 300 55 -81 -55 -85 60 -88
1314 -88 -355 -306 -139 -85 -337 -245 318 32 -427 202 385 61 58 -15 83 347 -65 -66 67 286 341 -102 -377 7
1338 7 -252 -302 -326 -180 -332 -409 -119 214 235 194 439 476 417 549 176 162 -134 -257 -43 -217 -365 -335 -644 -191
1362 -191 -346 -602 -47 199 13 -114 205 346 105 250 77 509 568 192 195 -203 33 63 -343 -696 -393
1383 -393 -186 -498 0 -14 187 131 246 430 260 473 359 249 -81 283 11 86 -121 -300 -95 -191 -304
1404 -304 -376 -443 -13 199 6 200 692 410 -216 288 300 55 104 -91 265 -203 -197 -83 -106 -178 -106 -315 -124
1427 -124 8 -235 -57 -77 332 199 72 177 280 158 125 50 99 -166 58 -120 -90 40 -283 34 5 -205
1449b05L03N9J7j87k37J86M05k40j24n8J50Q1k84J97m9K63j84k73K60R4k07k40
1471b73J20K53k77J46k16N25l96J63j10L9j01K90J76k66q9J8l1R7L44l53k2N8
1493I5lj56j67N42l35k74K46m5K78k58J78P5n4j57Q1M00j73q7k86j69N95k95k80
1516b49O0K49l9m41Q5L32K32l83J03M2P4P9n0O5N35m03m34J09L20k68l13K9J04
1539a62j59k41K67K67k3joK99k40J07M24m31j08M5K2o8QM4m44M17k50p5q3M54
1563F3Q2n05J1L37K02m11L04MK78k04k48LM23k65j92Pr1J69j53K01J7l59N2M0
1587b35L33m2K0m9K19k89K9J63P1j98M5l81M76j66j6O0J75k5n77K96j6L28n75
1610c54K26K90Q8o64M80K39j06n7r4m62O44l93q7K85R2M0l09P3K34k8j88j65J37
$$ plain form
1449 -205 98 157 174 -13 -250 -64 341 101 -23 -81 69 150 -134 63 14 277 93 -180 80 174 -33 -273
1471 -273 -153 100 -177 -31 -247 278 -118 45 -65 -26 -127 163 339 73 -16 2 -29 68 412 59 37 95
1493 95 92 -64 -231 311 -24 -298 -52 -97 181 -77 101 176 122 -35 46 446 273 186 -100 -269 326 31 -249
1516 -249 -189 60 21 -420 -335 -3 229 -154 -51 -9 65 144 94 159 694 291 -143 -34 286 18 -295 -266 -162
1539 -162 -321 -562 -295 -28 -51 -52 -58 241 1 108 532 101 -7 38 60 -8 0 44 -400 17 -233 -308 -391 63
1563 63 145 -360 -349 -12 190 -221 83 87 365 161 -87 -84 339 74 -118 -111 -202 -33 -186 15 32 -327 -275 -235
1587 -235 98 56 76 27 246 -43 -14 149 220 22 67 -314 162 -4 -20 40 215 190 -387 -91 -107 221 -354
1610 -354 -128 162 250 -414 66 305 199 142 48 -414 230 -163 -250 35 127 167 -142 -69 165 137 -51 -216 -79
1633g9K13N0M5k68l9J48J26j05k67M31k31J95k15j56K56l6K57k33o03M80k14L52
1655A07k69J19o0k31L76OL9O9k25Q1J83M6k02J89k27N9k47j76K89K03j79k51K62
1678c9q3m8j15L17j14N7J47M1j04M4j19J4K64j55k10k51L97k02r8P6r8J13l01
1701d67O27k6O7rk45K72k65p4L10j16J24n11j6J92K38k17k9Q9o4K02m46L08L3
1724b3O5Lj51O3L82l78P4l56M07N1j69K87l34K39l48k59J84L23Om3j10Q5J44l16
1748a74M86k77q6J5o5k93O28j51K09k60n6k21K93J48o6k15l0J53o4k2j27J60J90
1771A75k6k0j04J78k45K37q7k04Q0J29l45K94j95j0J39J9k15K69N6k00K38j85
1793b2k80J80K48k47K17R8J90l28l2L59l97j19J67l23L92k91M23k54MR5l34L84
$$ plain form
1633 -79 134 184 229 -39 -78 70 196 91 -176 255 24 219 4 -152 104 68 325 92 -511 -31 -245 107
1655 107 -162 -43 -103 -334 42 48 87 156 -69 12 195 241 39 228 1 60 -187 -363 -74 129 -50 -301 -39
1678 -39 -122 -170 -285 32 -82 -25 122 163 59 103 -16 -2 262 107 -103 -354 43 -159 -257 -181 -279 -166 -467
1701 -467 160 134 201 192 -53 219 -46 -120 190 74 198 -313 -329 -137 101 -116 -145 -56 -120 82 -364 -56 -23
1724 -23 42 45 -106 -43 339 -39 35 -321 86 137 -32 255 -79 160 -188 -447 -263 60 66 23 -87 -2 142 -174
1748 -174 312 35 -51 -36 -101 -394 234 83 292 32 -24 -245 48 196 130 -85 -115 38 -26 -48 -175 -15 175
1771 175 149 129 25 203 -42 195 108 -96 -16 113 -232 62 -133 -143 -4 15 -200 69 125 -75 163 -22
1793 -22 -302 -122 126 -121 96 194 384 56 24 383 -14 -133 34 -289 103 -188 235 -19 -15 80 -254 130
1815A30k20O2J61O9k35j34K5J24K21k50J92j94j82J42l1J37j24N2%r2k0K93N9
1838A85k75L62J04j27q6j6lj5l18J97P6j31J18l27K8K36m4J15j31L12j3k72KJ36
1862A13J1K8j47J51j66p2R6J10r5N6j44j33q8o7J39N9J29K15R3k51RJ25L4O0j13
1887A52j90mJJ07k48J3J01J19j42ln1j49K84j95J02J43j52N54m25j9k03K79j36
1910f2J46j22MQm2m5p7J66J26j67k45K5K69J21j69L34l56J36l21N2L89J39k17
1933I2p7L31l81k39r0O26k4m01J86p1J50J18k75j1j01J01j45L47Q6m18K61k28
1955a63M80k52K1k89L09J10l35J93j47J79m83O02m33K19k75L82n0k04j44J94K50
1976A64k13J6J86J80m92K27k20J08k22K62p0n1K36k52k50K17K12L22p8m53M15
$$ plain form
1815 130 -90 -28 133 202 -33 -167 -142 -18 203 -47 145 -49 -231 -89 -120 17 -107 -55 -55 -147 -167 126 185
1838 185 -90 272 376 249 163 147 144 129 -189 8 84 -47 71 -256 -228 8 -36 79 -52 260 247 -25 -23 113
1862 113 124 152 5 156 -10 -82 14 124 29 85 -59 -192 -280 -347 -208 -149 -20 195 288 37 46 171 205 265 152
1887 152 -38 -42 -41 66 -182 -169 -68 51 -91 -94 -145 -294 -10 -205 -103 40 -112 442 17 -2 -205 74 -62
1910 -62 84 -38 -34 -26 -68 -113 -190 -24 102 -65 -310 -285 -16 105 -64 270 -86 50 -271 -219 170 309 92
1933 92 15 346 -35 -274 -364 262 238 -163 23 -48 102 220 -55 -66 -167 -66 -211 136 222 -196 65 -163
1955 -163 317 65 86 -203 106 216 -119 74 -73 106 -377 225 -208 11 -264 118 68 -136 -280 -86 164
1976 164 -49 -33 153 333 -159 68 -152 -44 -266 -4 -74 -125 111 -141 -391 -174 38 360 282 -171 244
1997B44k03o2K22l17OJ75l62K07j46M02k03J39k3L9p8Q1n5J79k06K10p4k70n6
2020a51K44j7l84M61j97J23j05n7kJ64J18l06o4JK32l3J30M1O6l70L38j01rj51
2044b9K8l6j43L70Qn19L92j22k54M67r6k86L86k80J40j96J55J70j02J09k04J16
2066G4J27l91M08k86N7NJ2m31L62o8j01K10p0ML0J93j27k74J70J96Lj54L35q1
2090B03j90N5o9L23o45M26q7J1n9n1J42k58J65K68l77J14J29N0k20J15K51k05
2112I1m7j04P9J99l07K5O0N2j30O0J93j99P8M0k50J67q7LRR8J89l13o8J93M3j08
2138c4r2J17k85J31J97J34l21n5J94k99K77jJ78k57Q1o5N0P6QJ46J15n8m64L70
2162A43l23K05j62K81k49j00J91q9L00k94L03J7q3O3q7j86J67k17N7P6j9k82L47
$$ plain form
1997 244 41 -21 201 -116 -110 65 -297 -90 -236 166 -37 102 79 118 40 121 66 245 39 249 175 -95 -151
2020 -151 93 76 -308 153 -44 79 -26 -83 -85 79 197 -109 -173 -172 60 27 157 198 264 -106 232 131 122 -29
2044 -29 -1 -37 -180 190 198 -321 71 -51 -305 162 66 -220 166 -114 26 -170 -15 155 53 162 -42 74
2066 74 201 -190 218 -68 -11 -6 6 -425 -63 -131 -232 -22 -92 -88 -58 135 8 -266 -96 100 103 -51 284 203
2090 203 13 68 -1 322 -323 103 16 27 -32 -83 59 -199 -34 234 -143 -29 100 150 -70 45 296 91
2112 91 44 -60 19 218 -89 -64 -4 48 -82 -22 171 -28 50 90 -160 7 -80 -77 -68 30 219 -94 -162 31 74 -34
2138 -34 -126 -9 -294 -163 34 168 -153 -208 -14 -313 -36 -37 141 -116 -35 -100 -50 26 34 180 295 237 -227 143
2162 143 -180 25 -137 144 -105 -205 -14 -103 197 -97 206 223 140 203 116 -70 97 -120 -63 13 -6 -288 59
2185E9m8q3j20K51l13K85N5K28k13j78J19o5J77j7J95l47J02l01J83J57J43n33
2207b64J14R5pj26n8K3L71M9l66J26J20n3K71m24K72pj95K21R0m5J7R6o00K28
2231e2lk2O5Lm7J58l23K79J5n4r3Q9j54O0N6J3j70J75J39l1%m0n2j68J56j73J02
2258g2L78n39K51N2j33K06Mm35L78p9j41l6M00m22N27l91l7L57m13Q0J89k71L18
2281A71j92O6k04J34n9J08j04J40J23np2P8j6nj42q5J33j35J32j29Jj38K35Q3
2305A18oo9j97Pr8J90O5K16k46q6M3J72l57L7J44J8K32l77L49k97J43q4n5J04
2329c4k9k2J61j05K24k12j6P9oJ49j86J3p7J03k26n0K70mk54J27K2L5J85N2j9
2354A80j98J89j26n3J12j58P2j92N8K01MJ17%k95K61j36K35k68l02M31p2N2k94
$$ plain form
2185 59 11 -72 -192 59 -254 31 86 314 101 -77 42 -23 154 137 332 -15 87 -214 -31 126 269 -264
2207 -264 -150 -55 -62 -188 -246 -223 148 197 -169 -43 77 24 295 -129 143 136 -59 162 252 207 224 320 -280 -52
2231 -52 -55 -77 -12 -9 -56 102 -221 58 73 19 -74 15 -139 -79 -23 -10 -180 -5 134 103 103 63 11 -157 -1 -174 -72
2258 -72 306 -233 18 70 -63 143 147 -288 90 11 -130 -166 234 -188 339 -52 -89 268 -145 -65 124 -147 171
2281 171 -21 45 -159 -25 -84 24 -80 60 183 178 106 184 168 163 21 -64 69 -66 66 -63 -62 -200 35 118
2305 118 112 43 -154 -147 -245 -55 10 226 -20 -106 -63 109 -248 -211 -67 -49 183 -194 155 -142 1 -83 -138 -34
2329 -34 -63 -85 76 -29 195 -17 -33 46 40 189 3 16 -61 42 -184 -234 36 32 -222 -95 -73 -38 147 199 180
2354 180 -18 171 45 -8 104 -54 18 -174 -116 85 89 206 206 -89 172 36 271 3 -299 132 60 112 -182
2377a82K55k3K61N9l53q8j90J04n8J18J66m23K00j05P6J37J19k76M37k71L4j67
2399a70K68q1j01J24j89J97kn3j90J68j0K30k08J32k46J87K0l76J95J44l5m8R9
2422E5j02PJ82j19J72k58K19M7o2l75O5O1M60k94J41k81n5J25q3K92l32K99l68
2445b04J9K61l26R6M46k91R4k5j32j3L63n88K57k8r3K86k20K39l9j41j27L80k23
2468iJ07k0j39Q3J0J18m0j44L0JL7N2k7K08k27k06J11M8j59J60K31k61M28m02
2492a0j16J85k32R2N7N4p5j09q2J85k39J84K25j05r6L2j4R4o0J56J21l32L92k53
2516E4k96J95K30l8J0k50n5Pr2L18j77J65l75K25J01k6K13k45K48k84K51J7l3
2539A63j28j29j9k5pR8j51M84m41J02KM7p2J79N6j66J97j61lK06j53j31Jj5l54
$$ plain form
2377 -182 73 50 311 370 17 -71 -261 -157 -215 -97 69 -354 -154 -259 -183 -46 73 -203 234 -37 -3 -170
2399 -170 98 17 -84 40 -149 48 46 -7 -197 -29 -39 191 -17 115 -131 56 76 -300 -105 39 4 -44 55
2422 55 -47 -40 142 23 195 -63 156 203 141 -234 -169 -108 352 58 199 -82 -137 -12 -95 197 -135 164 -204
2445 -204 -185 76 -250 -154 292 1 95 70 -62 -75 288 -300 -43 -71 -164 122 -98 141 102 -39 -166 214 -9
2468 -9 98 78 -61 22 32 150 110 -34 -4 -3 34 86 59 267 40 -166 -55 -7 -166 -6 225 -36 392 -10
2492 -10 -126 59 -173 -81 -24 30 -45 -154 -236 -51 -290 -106 119 14 -82 -50 -64 30 -30 126 247 -85 307 54
2516 54 -242 -47 183 145 155 -95 -150 -143 -235 83 -94 71 -304 -79 22 -4 209 -36 212 -72 179 196 163
2539 163 35 -94 -113 -138 -145 -47 -198 286 -155 -53 -51 -4 -76 103 159 -7 190 29 26 232 79 -52 -51 -66 -420
2564d20K30J14j36K63J6k78Q8n5J81j03J6J6Q2r1J03Q8j37Q0m2J08j84K01N0M
2588A94l04O4k19J22O0P8j7J48j42J55j60K21k48P5j43nQ7k96N15j64j48O8j21
2611a80J10L13j57k27K46j85o5R8K38l31M0J87j81K13r6J4o6N3k48N7J01K29j77
2634a4l6J44J25l94J74k02J93Q2Ok59L11r9p7K22k19m4O6L17l12N5k6J1k8q4O8
2659b0L2k11K17k63J24k95L79M1Mj68P9K26k6M0k8k08K59k14K43M4j29q9p4R3
2683E6o3J45rn1j45Q1j12N4j81J20J7J81l53L09k13%K05Pk12L3J83J22j17j32
2707g5m6K82L4k03p8o9K20r8J5j2J58j21M4P1oj1j46J53j33J48k35L5q5K43p8
2732GN7R2q2J39n4j19m2J09k74K66p3j45P0Q2K1j6M5l20M29j01O9k55n9K71j42
$$ plain form
2564 -420 -190 -76 -212 51 67 -211 -123 -178 3 -100 -84 -68 14 -77 26 114 -23 57 15 123 -61 140 190 194
2588 194 -110 -46 -265 -143 -83 -5 -22 126 -16 139 -21 200 -48 27 -116 -121 -34 -330 185 21 -127 -59 -180
2611 -180 -70 243 86 -141 105 -80 -145 -47 191 -140 -100 87 -94 119 23 37 -29 24 -224 -167 -66 163 -14
2634 -14 -50 94 219 -175 -1 -203 -10 72 78 -181 130 31 -46 176 -43 -87 -21 296 -16 39 13 24 -4 -88 -20
2659 -20 12 -199 18 -245 -121 -416 -37 4 8 -160 -81 145 119 159 131 -77 182 -32 211 255 126 37 -37 56
2683 56 -7 138 129 78 -67 14 -98 -44 -225 -105 -88 93 -260 49 -164 -164 41 48 -164 -131 52 174 57 -75
2707 -75 -121 161 195 -8 -86 -155 65 -33 -18 -30 128 7 51 122 116 105 -41 112 -21 127 -108 -73 -158 85 7
2732 7 64 156 74 213 159 40 -2 107 -167 99 26 -119 -49 33 54 38 83 -237 192 91 160 -95 -154 117 -25
2757b5R6M9K6Mj63M1o6K22j28r9j57K26L2j98K1K37J42k32k08M62l11K56j07p6
2781D4q5J28k76L31l94K79Nl19M26m4k67K76k58N8K82j27J2J12j82J47k33p1j01
2804b57M83k74K62l55K33L7%j42Kn4o5M86k98j23M30l61L0J45j32k3l38L28l8
2827b4Q4P6j77j93L17k7q8P6l9J02m2j8K1k37J34nj26K24p4r7L42r6j27r4O0K55
2853B27l0k62j07J73N6l31K97o4K49k55K03mj16j48L27j23j60M03m81L72l14K86
2875A98m56K24N2k6p0K3L12n14K02Q9J08k47K85r9l78O7N00m00K04j33J60l3o7
2898AR2J92n4k26J59n6j77J95o0j07K23j69J58k36%K90j10Q5j22k49l8K04k9j44
2922a78J0K58m7l08L27K03l97M5l8M2O6p9K20m5J56j45O5m7m3k0j72J76K73k94
$$ plain form
2757 -25 71 120 146 150 -13 28 -38 184 56 -43 -200 26 58 -140 -119 118 260 28 -180 282 -29 227 120 44
2781 44 -41 87 -189 142 -252 27 32 -287 139 95 -172 104 -154 -96 186 59 71 183 1 148 -85 -156 -257
2804 -257 226 -48 214 -141 92 129 129 -13 -11 -65 -130 356 58 -65 365 4 34 179 47 24 -314 14 -24
2827 -24 60 136 -41 -234 83 56 -32 44 5 107 65 47 68 -169 -35 -40 -166 58 -16 -113 229 133 6 -88 -28 227
2853 227 197 -65 -172 1 57 -274 23 -41 208 -47 156 152 36 -112 215 92 -68 335 -146 226 -88 198
2875 198 -258 -34 18 -8 -78 -55 257 -257 -55 34 142 -105 180 81 -297 -230 270 -130 74 -59 101 68 1
2898 1 93 285 231 5 164 108 -69 126 66 -41 182 13 171 -65 -65 225 115 200 78 -171 -209 -5 -34 -178
2922 -178 -168 90 43 -265 62 265 -132 -87 -125 -83 -17 -96 124 79 235 90 155 108 65 45 -127 49 322 28
2946B8k23K76j46L9J00j86kN3O0j6K10p1k33K23j11K53j38j26R4J12j65P4j93
2969h8j3mJr7J41J20O8k8q6j1jJ30J88j12k07J25q5K27k86j40M2j9K22l2j92o9
2995b06J87K02j72Rq2J55j13r8J52K89k56jJ03l07K94m15K54n3j53j0K07K8k14
3018b00J46P2MJ46l53J8m4M12l16QL3m8J24Oj90L01l88P9N42m67N9j01N0KP2j14
3044a47L59m75N39l46l9J98j41K6J28j05o6L4n1j4K1QO6k01L32k26N8O6q3J36
3068G7k37K5K0o4M8K20j72P5L2j70O2K11qj06k1p5P8o5k9j01L2J18o3K73l26P5
3094i1j7J29K5j92O2K74l96M6J02J1Q6k6J59m7k39K20l6n4j19L65l34n3J74M7
3118I6n2J13K9k72M55j72n9m5j91MK53Rl5o3J2k10n6K58L6n0j1k48K29L7n8J93
$$ plain form
2946 28 -195 81 -65 -26 74 -112 -114 -61 -1 -17 193 122 -111 112 1 254 116 -10 84 196 31 105 -88
2969 -88 -101 -105 -104 -201 -60 60 128 100 14 3 2 132 320 208 1 126 41 268 -18 -158 -116 -135 87 55 -137 -206
2995 -206 -19 183 11 20 -62 93 -20 -118 34 323 67 66 169 -138 156 -259 -5 -58 -211 -221 -14 14 -200
3018 -200 -54 18 22 168 -185 -167 -211 201 -115 -107 -74 -122 2 8 -182 119 -269 -190 352 -115 -56 -157 -107 -105 -33 -147
3044 -147 212 -263 276 -70 -109 89 -52 -26 102 -3 -69 -35 -86 -100 -79 -71 -5 -206 126 -100 -42 24 -59 77
3068 77 -160 -135 -115 -179 -131 89 -83 -8 24 -146 -84 127 119 13 -8 -83 -5 -70 -99 -200 -168 -50 -113 160 -166 -91
3094 -91 -108 21 46 -146 -84 190 -206 -160 -58 -47 39 13 172 125 -114 106 70 16 -103 262 -72 -125 49 96
3118 96 44 157 186 -86 369 197 138 93 -98 -94 159 168 133 70 82 -128 -184 74 110 60 49 -199 30 67 9 202
3144B02l0j24j13n5m1K71Mj63r5K06j07n8K34m61L47J3N6j86K78M1j20M3j99j5
3168g2n4K29M3k28J03k32L90q1P0J2j70k40J14N6L1q8J0MqJ56o2j49L09l08P0
3193i5M9MjJ18j57l8L25l74J14l3K87k02K02k62n9O2j38O3K12j42j11J28R7o8
3217a9J13J24m59Q7q1O3K87J28k22J48k18r9O7K65J20k50j77Q9J57j63J79p4m2
3240B3k07L36j74J13kJj60Q4K29j33j50J81r6l6J3m5j47K53k34k1M02K3l41J67
3264G9J10k34k5m7j06J80j88o3K04k5O2P4M6j13K99k89J71j86R7R6k57J12j62
3287a65J3p7K03K18j81j03L50j81J58k47k38L08j5l41M28o2L5O4k20J23p3o0l81
3310d44J86K04Q3L1k47N03k78k62K39q3o8N4j13k0J32j31K17j03P3j15M36n10
$$ plain form
3144 202 172 48 -65 -120 -161 110 114 -49 -144 62 -45 -103 131 -330 17 30 86 -100 178 219 99 142 -57 -72
3168 -72 -126 103 146 -82 21 -211 179 98 168 180 10 -230 -116 -60 -29 -117 -107 -103 -111 45 -17 -166 143 -165 -95
3193 -95 -46 -42 -43 75 -82 -120 205 -169 -55 -88 199 -3 199 -63 -122 -60 -198 -135 77 -65 -176 -48 49 -19
3217 -19 94 218 -241 -154 -235 -172 115 243 21 169 -49 -148 -81 184 304 54 -123 -34 123 -40 139 65 23
3240 23 -184 152 -22 91 89 90 -70 14 243 110 -40 141 45 9 22 -23 -170 83 -151 -172 230 253 -88 79
3264 79 189 -45 -70 -117 -223 -43 -231 -294 -90 -115 -53 21 67 -46 253 -36 135 -51 46 142 -115 -3 -165
3287 -165 -152 -229 -26 192 11 -92 258 77 235 -12 -250 58 43 -298 130 68 103 167 -53 70 -3 -63 -444
3310 -444 -258 -54 29 60 -187 316 38 -224 15 -68 -136 -82 -195 -215 -83 -214 3 -100 -27 -142 294 -216
3332b16k7M8N8Q9k4Q3k4J64l17J31K92k46j54K4P0K69k77j54L09l58L04j58J57
3355D3pO0l03K02O8k61L40j25j17J13q4j61K16j65J30J70k03KJ78N8l6l2l92K84
3379b2P7k87M00k23o0O1L4J32k32M85n30J10J56K3k30r6J47m47N91l76L69n09
3401d27L70n3m3K27R3l5j89J68k13j0n6L3j01J0N4K57j40J93j41r4j19J97j92
3424b11K36p8M0O9r2K83k62mk16L37l48L01l21K88j51K17l44K92J6k83K40N8j21
3447e4J11Pj82J89j39L49k35k40N93q01M59Q7l59J59qJ76J40k69k1l5l7O8L6r
3471a5J5r9j97M08l30j7J41m4J07N0n8O1JN2k0j83M7o9N9p4M13j22M5o0N3Q3o40
3498c93M08r6K89j75j67O3J19j95R9q3J99R4l99K08o8L9J90p8Q6j10OJ87j99K5
$$ plain form
3332 -216 -243 -195 -137 -48 -72 11 -13 151 -166 -35 257 11 -143 -119 -49 220 -57 -211 98 -260 44 -114 43
3355 43 36 96 -207 -5 63 -198 142 17 -100 13 -71 -232 -16 -181 -51 119 -84 -82 96 154 118 86 -306 -22
3379 -22 55 -232 168 -55 -115 -54 -20 112 -120 365 -165 -55 101 124 -106 -202 -55 -502 89 -287 82 -427
3401 -427 -57 -110 -153 74 167 132 -57 111 -102 -112 -168 -135 -236 -226 -172 85 -55 138 -3 -97 -216 -19 -211
3424 -211 25 -53 -13 56 -36 247 -15 -19 -235 102 -246 55 -266 22 -129 88 -256 36 52 -231 9 67 -54
3447 -54 57 64 -118 71 -68 281 46 -194 399 -402 57 144 -215 -56 -64 112 252 -17 -38 -73 -110 -42 -6 -15
3471 -15 0 -99 -296 112 -218 -235 -94 -138 -31 19 -39 22 23 75 55 -128 -81 -150 -91 -165 248 126 171 111 164 247 -393
3498 -393 15 -81 208 33 -134 -71 48 -147 -48 -131 68 162 -237 -29 -97 -58 132 54 140 30 36 223 24 49
3522D9J5J7r6l4j37K26R9j41j63J13qJ86k94o0K21l9m7J43mj12J89q8J67l81K45
3547F6k65L66n5l24J34N8J9n2j42P5j3O2P6n45M21K36r7k6j15K25k18L9J9jJ57
3572A00J31l68J61k73on2K11K89j41k57K2k6J85K0M2O3j79k3K15j61k91N93m46
3595a91J72O0K7N3J67l37p6J2j23L26j05O5J8k53K09j60K86j52k13J49N6l1R9
3618E8rj24k5K80k64j25M8L37J6k84p2J06l0k7J75q0j52J68M17m87J45n0O8k12
3642a23J70r9k71L79j10q1N0k4M24j24q6l24K75m9j53k9K06k73J52O0q2kL3K10
3666A29j33O5n9j64KL8J42l8Q8p2J49m38K21j16J61Kn7Q5o6j14K69p7n6R6oL56
3692D07k67J5k37J21n0l7l2J19L6J4j10Jj38P7L8j24J26j29J44k0K61j04k6K1
$$ plain form
3522 49 64 81 -15 -49 -186 40 139 -2 -165 -52 -60 126 -168 -228 -7 -46 -93 50 46 -66 123 35 202 -179 66
3547 66 -199 167 112 -212 -78 -20 -1 -53 -195 -120 -133 -71 5 -540 -119 117 20 -6 -121 104 -114 -75 -56 -57 100
3572 100 231 -137 24 -249 -255 -307 -96 193 52 -205 -183 -209 -24 -4 38 101 -78 -101 114 -47 -338 255 -191
3595 -191 -19 41 68 121 288 -49 -125 -113 -236 90 -15 50 68 -185 24 -136 150 -2 -215 -66 -10 -41 58
3618 58 49 -75 -100 180 -84 -209 -161 176 192 -92 -164 -58 -88 -115 60 -20 -172 -4 413 -74 71 21 89 -123
3642 -123 47 -52 -323 56 -54 -135 -85 -109 315 191 105 -219 56 7 -146 -175 31 -242 -90 -30 -112 -114 -81 129
3666 129 -4 61 2 -162 -160 -122 20 -18 70 -2 147 -291 -70 -186 -25 -23 -80 5 -61 -175 94 17 -39 57 51 407
3692 407 140 155 -82 39 -11 -48 -80 39 75 89 -21 -20 -158 -81 -43 -167 -41 -170 -26 -46 215 111 85 106
3716A06k59L92k64n3L71l27JJ8j63J25LJ76k88M17j88j61k8n1R3K11j81O7q1p6
3740a40K0K26r0R6j96J07m7J12l73K45j59k63N14m3K87m12K09j23J31l03M30k46
3762a8J96l34L15k92M38m89L06%n96N53k28L8J51q2O6K78l03J19j41J1N2k93N36
3785B83q7m6l40K20j4L15m00M5J61j52J26P5o9k35M6p4M10k23J38k50j00K86j73
3808e8J00j51P5P9m7j09l1J92K06j27o9l8R9l26K95j10o1J80Rl65L93o8l08L92
3832A52r1j16Q7Q5q7Q9j71j20K11j2j96L01k79J04r0l6Q0L7r5O2k1l0j5J42O8
3857E9j82K91j27j3M8j20k13M63j63l62J08K13R8M8q6K41k83j82K35l21K90k6
3879A6j89J74k50K58j14J02q4j24J64N4J91J67l49Mj42k85K53J86kJ95l59J60
$$ plain form
3716 106 -153 239 -25 -78 293 -34 -33 -15 -178 -53 -50 126 -162 255 67 -94 -122 -173 -80 131 -50 17 -64 -140
3740 -140 -120 106 16 112 -84 23 -24 88 -285 -40 -199 -462 52 9 296 -116 93 -30 101 -202 228 -18
3762 -18 178 -156 159 -133 305 -184 122 122 -474 79 -149 -111 40 -42 24 302 -1 118 -23 -12 40 -253 283
3785 283 196 150 -190 30 16 331 -69 -24 137 -15 111 186 117 -118 -72 -146 264 41 179 -71 -171 115 -58
3808 -58 42 -109 -34 45 -2 -111 -142 50 256 129 60 22 121 -205 90 -20 -81 99 108 -257 136 68 -240 152
3832 152 61 -55 32 117 30 119 -52 -172 39 27 -169 132 -147 -43 -133 -169 -89 -52 -147 -85 -106 -136 -151 -9 59
3857 59 -123 168 41 28 76 -44 -257 206 43 -319 -211 2 100 148 62 303 20 -162 73 -248 42 16
3879 16 -173 1 -249 9 -105 -3 -87 -211 -47 7 198 365 16 20 -122 -407 -154 32 30 225 -134 26
3901B6K34l40k3K41jM4k12J16K76k00j63r8R5Q0j42p7J83J13l24K01J1k50M35
3924B25k29J75k05k47L14j05R8J34m49L67r4j01K99K8J40l12j8N5q8K30l3l18
3946a34K53l07J36M2M0J09j55k43M0M53m68Q7J68jk32J22J14k15oJ54k36J85J22
3969B8l07M44l28L40j02j47K13j15q4k40J00J77o9j08L20j65j59K19J0m9k3j71
3991b16L58k36l8J07q0L74q4l4k78L29k20j56K81J70k54j19o1J15j59K02k0J8
4013aq1q3J25L07k45n7J80nl07K71rO9k35l9m02P42j98j5K71l61J46j12j08j4
4037a61lK15L2o7OM4j08J3NL2O0q3L1j36L6M8K59k55J19J38l70K49k38J07k17
4062b44J65L77m02K54j54K33j79M0j58J10k19K43q2J28r6K69k17l1L9l5K5J6j61
$$ plain form
3901 26 260 -80 -103 138 137 181 -31 85 361 161 -2 -100 -5 75 -67 -144 39 152 -172 29 40 -210 225
3924 225 -4 171 -34 -281 33 -72 26 160 -289 78 -16 -117 182 210 350 38 20 75 -13 217 184 -134
3946 -134 119 -188 -52 -10 30 139 -16 -259 -219 234 -234 -147 21 20 -212 -90 24 -191 -197 -43 -279 -94 28
3969 28 -279 165 -163 177 75 -72 141 26 -58 -298 -198 -21 -90 -198 122 -43 -202 17 27 -22 -45 -216
3991 -216 142 -94 -132 -25 -105 269 185 151 -127 202 -18 -174 107 277 23 -96 -157 -42 -201 1 -19 -1
4013 -1 -82 -165 -40 267 22 -35 145 140 -167 104 95 164 -71 -110 -512 230 32 17 288 -73 73 -39 -147 -161
4037 -161 -164 51 83 16 22 66 -42 -29 -24 8 68 -15 16 -120 -84 -36 223 -32 87 225 -145 104 -134 -27 -244
4062 -244 -79 298 -104 150 -4 229 50 90 -68 42 -177 66 -16 112 16 285 68 37 76 41 66 82 -79
4085g9o6K99k33MqK6j33mM4J01J26l9l1j32K77p1q3oJ25N3l5j83j10O8j16K50
4111D4J59j90N1K5j94N11m74N1J08kl2n0J42p5q7p5J00J72R0k86K11oJ4l54n8
4136b05J96k7J05K43l40J10l28K55M4k2N6l58m0N68j67j31n1O8J94k50J26J43
4158A89K9l78K05k75Q9R1J64L2j65j97J38j29L44J24j04o1j12N4nj64K67P0m60
4181b54J96j81n9K36L1J24k38j22J33J63J5l4j46J47n4J15J94l69J33L6m8N69
4203E87o71J39J23J26l11O0k24J80k20l0K89k14K31J24k35Q5K1j47P6k0L4N6n6
4226Cr2o7N5p5K83j02J25m43M89j61j60J9p0L25k04N8J67j83L40k35k8k76J56
4249g6j20J46J22j22k72K47q5M7K98k22M0P9J27k1k58J81p0M2j88K08p0j47lJ58
$$ plain form
4085 -79 -145 154 -79 -75 -83 -57 -190 -194 -150 -49 77 38 7 -125 152 81 -2 -8 117 170 135 -48 -158 -90 -206 44
4111 44 203 13 64 89 -105 406 -68 -17 91 89 57 7 149 74 -13 -88 12 184 274 -12 199 193 207 -147 -205
4136 -205 -9 -36 69 312 -28 82 -246 9 53 31 87 -271 -311 257 90 -41 -92 -24 170 -80 46 189
4158 189 218 -160 45 -230 -141 -50 114 146 -19 -216 -78 -207 137 261 157 96 -16 38 33 -131 136 206 -254
4181 -254 -58 -239 -298 -62 -31 93 -145 -267 -134 29 44 10 -136 11 -43 72 266 -103 30 66 18 587
4203 587 -84 55 178 304 -7 53 -171 9 -211 -241 48 -166 65 189 -46 39 60 -87 -11 -31 3 59 3
4226 3 -89 -156 -101 -176 107 5 130 -313 176 15 -145 -126 -196 129 -75 -17 150 -33 307 72 44 -232 -76
4249 -76 -196 -50 72 -50 -322 -75 -160 -113 185 -37 3 82 209 188 -70 111 41 83 -105 103 33 -114 -117 41
4273D1r5R5l27M31j06k34J33J36j92O6L35m13K64o2j72R5m3K15m20L96J66k09
4295A00r7j37R1l29K25m1N0J81j16R7j91L88j97o8l37L30M2NJ43k30K19l25M06
4318B09l9l13J62q4j42O6J50P2j15Q2j22J11k43O08m34q4M4K46K9k45j04J70j
4341B3k9k07J3K14P9j86k2R8N9o9J3K28l73P1J96m97L69j15k32L28j78J50N7n8
4365f8MK24r8J05k47k7K23ok41L59J84l36P0k80L04k08j06K66p7P2Q2j31k4p1
4389b7L9q4K8K3j87K10K46n11M26n34N97k04k7j4q1q8J56O9k86K81j26nJ32K49
4413B82l99J32J62j88K21j42m5r5J12n0q8r8J69M2nJ6K4j65J27k87L57L6J7J52
4437B87k46M5l04K38O7j55K2m5K21m08K01K83j22k02j51K79J19J3j67j10K06j62
$$ plain form
4273 41 -54 41 -286 145 39 -195 -62 74 -118 -52 283 -130 134 72 -100 -5 -48 167 -253 143 309 100
4295 100 3 -134 -43 -372 -147 -188 -138 43 -73 24 -167 221 24 -44 -381 -51 -9 -4 139 -91 128 -197 209
4318 209 170 -143 19 -65 -207 -141 9 81 -34 48 -74 37 -206 402 -32 -116 -72 174 203 -42 -146 24 23
4341 23 -6 -213 -200 14 93 -93 -115 -17 42 -27 -14 214 -159 -88 108 -389 -20 -135 -367 -39 -217 -67 -10 -68
4365 -68 -64 160 62 167 -80 -107 116 110 -131 228 412 76 146 -134 170 -38 -144 122 45 117 199 68 44 -27
4389 -27 12 -72 -44 -21 -208 2 248 -263 163 -371 226 22 -5 -19 -100 -188 -32 37 -249 32 -94 -99 33 282
4413 282 -117 15 177 -11 210 68 23 -72 40 -10 -98 -196 -27 15 10 26 50 -115 12 -275 82 118 135 287
4437 287 41 86 -218 20 87 -68 -46 -91 130 -278 -77 206 84 -118 -269 10 129 142 -25 -135 71 -91
4459i1K82j86jj91M88m46K85J8k85L27o6j98K8K52J65k95k16m5L51k18q8K98P3
4482B41m70J94Lk6qJ99J43j77k6l5P5K2l85L12j08j06J50M3j06Q1m7oQ9j88K72
4507A36L6q6l6m3M6j64j5K53r8j06J41L3n6l13M67o9l67K55J05j31J7O6J17o8
4531A20k40L58n86M56n7q5L8%M8r1l46O35j24l99L21M7o5k29J94n4J89l45J56
4554e9k3P8M7r0J67k92j39L14k50L60j39k17L28m28N04j41K0J11l38P6L52k08
4576C3k22M86k15j19m2K39p5J42k12k39K65j82K35j40j56L59j6j00l3O1O0j20
4598IO7j57n0J73j46Q1j29K02j67J58m9J20l7j40P4k58J31J4K11j0ok81L22Q3
4622B15k52n5L17k98J05J19L6l67L19j11j89J13j4J77P8l36j3p9J66J58kj0J35
$$ plain form
4459 -91 191 5 4 -187 301 -145 140 158 -127 200 134 -64 -36 216 381 86 -130 -175 176 -42 -130 168 241
4482 241 -229 -35 -32 -58 -66 133 276 99 73 38 113 135 -250 62 -46 -152 -2 41 -65 16 -31 -37 52 -136 136
4507 136 172 86 50 7 53 -111 -126 127 29 -77 64 97 41 -272 195 126 -241 14 119 -12 5 71 188 120
4531 120 -120 238 -348 108 51 -34 4 4 52 -39 -385 250 126 -273 48 95 30 -199 -5 -59 130 -215 -59
4554 -59 -82 -4 43 -47 120 -172 -311 3 -247 113 -26 -243 85 -343 161 20 40 151 -187 -111 241 33
4576 33 -189 297 82 -37 -79 160 85 227 15 -224 41 -141 94 -46 -202 157 141 41 8 69 129 9
4598 9 76 -81 -131 42 -104 -23 -152 50 -117 41 -8 112 75 -65 9 -249 -118 -104 107 97 91 -190 132 215
4622 215 -37 -92 225 -73 32 151 187 -180 139 28 -161 -48 -62 115 193 -143 -156 -235 -69 89 87 77 212
4645B12m6j30K55k33L1l39K95k42j69L62J47k68q4L22j35L1J15j23K3K3j72o2
4667a87K87j9k17R5o9J91p5j72K06j72J42M2l3j36Q4J18j18j06J51o3n5pJ58K23
4691B68j96R4P5k6k63J51l07j9k2K66K09j14k26K70O2k35J80J49m82q5J15K03
4713F7k75L0N7o3N7M23j75j50N5J80m31K41q0P3m0J17K3M9K5k08J6K5J04o0K6
4738H6J9qj11J5K8j09kM3k99L34n9M4j79J88N1n9j24k4K35k56R0o0K35j62J25
4763D1o6n9P1K24k50l11M76l94J55K42k55J4M7j8K26k37K30k87K69j87j4M29k66
4786H0j8k11R7j3MJ65M6l34L51q9k61J97N0j92K9J14P9J9l05L11m9j2j74mJ86
4811F6k5R6l62J37L75j02k34P6n2K72j59k43L36j92Q7Q0k04m1K30m78K54j92J85
$$ plain form
4645 212 166 36 291 58 89 -250 45 -197 -366 -4 143 -125 -209 113 -22 9 124 1 24 47 -125 -187
4667 -187 100 81 -136 -41 -110 81 6 -166 40 -132 10 52 19 -117 -33 85 -33 -139 12 -51 -106 -113 45 268
4691 268 72 166 241 215 -48 103 -204 -223 -245 21 230 116 -110 160 222 -13 167 316 -166 -251 -136 67
4713 67 -208 -178 -121 -184 -127 296 121 -29 26 206 -225 16 -64 9 -31 86 109 158 183 -25 -9 16 120 60 86
4738 86 105 97 -14 1 29 -80 -82 -39 -338 -4 -63 -19 -198 -10 41 -18 -142 -166 69 -187 -97 -157 78 -84 41
4763 41 -25 -84 -13 211 -39 -350 126 -268 -113 129 -126 -112 -65 -83 143 -94 136 -151 118 -69 -83 346 80
4786 80 62 -149 -52 -65 -61 104 150 -184 167 78 -183 14 64 -128 -99 15 94 113 -192 119 70 58 -116 -120 66
4811 66 41 137 -225 -88 287 185 -49 27 -25 247 88 -155 181 -11 76 156 -48 -89 141 -337 -83 -275 -90
4834i0m6K54j3j98mK70J26m08l8K08k20L66o06L98K00l07K7K00k5l6k55l8K49
4857A4P1p0k39J45J33k21K30K07n40M22J19j7k62M20l07j80R4N1n2N1J72n06L22
4880E7J86Pj64N2k19K76p5L5o2J13j70R0j71J3J43o1J50j43J97k20r8r9L01j4
4904A24k86K18o7P6k15K54j90K35j41k72M41k04r9K75j68J18k76O3J20J28p8l4
4926B2M9j24k8m6K55j84k9M52k79j92J44j75J03K05k58J54j79j41K50j19K01J50
4948B31k69j27R3P5N9J17k93J89q8Q2N5j65o1k6J92q3N0j59M40m12J37J03l05
4971a65J66r0K11J67k47l6l30K51j34P1R1K70p3p8J15Jm67J77qL15k07K38j63
4994G5l54M34k81Kr1L94j31r6P3j12k82L14J94l99K32k8M4q5J18L6j01J30M5l10
$$ plain form
4834 -90 -136 118 105 -93 -97 173 299 -109 -147 61 -159 207 -399 -1 199 -108 -81 119 94 58 -197 -235 14
4857 14 85 15 -224 -79 54 -167 63 270 -270 152 271 254 -8 412 105 -75 19 70 18 69 241 -265 57
4880 57 243 250 86 138 -81 195 120 155 93 206 36 126 -45 -32 111 50 200 57 254 34 -64 -163 138 124
4904 124 -162 56 -11 65 -150 104 -86 149 8 -264 177 -27 -126 149 -19 99 -177 -114 6 134 56 22
4926 22 71 -53 -81 -127 128 -56 -85 367 88 -104 40 -135 -32 173 -85 69 -110 -251 -1 -120 81 231
4948 231 -38 -165 -72 3 62 179 -114 75 -13 69 124 -41 -102 -128 64 -19 31 -128 312 -100 37 140 -165
4971 -165 1 -89 122 289 42 6 -324 -73 -207 -136 -45 225 152 74 189 190 -277 -100 -108 207 0 238 75
4994 75 -279 155 -126 -124 -215 179 48 -48 25 -87 -369 -55 139 -260 -28 -56 -12 -97 21 57 -44 86 131 -179
5018a79j53N71j03K06k47q3K01n08P31m41j3j24L49k27ko0m3oK37Pj21L3j19J5
5042g9q2K24J37k37j11K98q9j38j01M8O5J97j74k6M4J32q1k59L84m02L73j23r6
5065i6n7K30k1K05m89J09K11k55K86K1l02L03k50J13m7r9L19j59Q3j36O8r2r2
5088a47Q0rk35K55J67J37l97K73j27j85k7J5M19k89q6J83p5K10l93J97j3N2lk05
5112b03K44Q0j80l4j10J40o2K45j13J28l84J11K45l03J70j92K26j1j74J08L23
5133B54l60pR1P1J45l79K62k05O0M08j98l80L14k40J23l4l0J52j16K60k25K19
5155A85j54J51k38M0J4j37J07L4j35J6m8L11j29j91J99Q7P4l99J8rM63m52K0J81
5179Hq2K26l51J61L2j15L05O4k64m3j5L54k04r1J59k48l5KL92l96L12k50J30m0
$$ plain form
5018 -179 -332 239 136 342 95 12 213 -295 436 -5 -18 -142 207 -20 -22 -82 -125 -131 106 113 -8 25 -94 -79
5042 -79 -161 63 200 -37 -148 150 61 -77 -178 -130 -65 132 -42 -68 -24 108 27 -232 152 -250 123 0 -96
5065 -96 -153 77 56 261 -228 -119 92 -163 123 144 -158 145 -105 8 -39 -138 181 22 105 -31 37 -55 -147
5088 -147 -67 -76 -311 -56 111 248 -149 124 -3 -188 -215 -200 219 -70 -156 27 -48 162 -231 -34 -47 5 2 -203
5112 -203 41 121 -59 -93 -203 -63 -125 120 7 135 -249 -138 107 -196 -26 -218 8 -3 -177 -69 254
5133 254 -106 -113 -22 49 194 -185 77 -128 -68 340 142 -238 76 -164 -41 -75 -105 47 -69 191 -34 185
5155 185 31 182 -56 -16 -2 -139 -32 2 -133 -117 -165 146 17 -174 25 112 186 -213 -195 -204 259 -193 -173 8
5179 8 -74 152 -199 -38 -6 -121 184 248 -16 -59 -74 280 76 -15 144 -104 -139 -137 255 -141 171 -79 51 11
5203A1P9l34J14M43l24k0R7ON2j11j74K33l78K38j52K60J98j08k77K49j53o9J87
5226F7k25O4Nr9N81o63O0L43k79J82J63n4j00J87l32K7m9L30k14L0K12k96J10
5249E0O2j02m04M01J12L9l54J41J66n2j97K18oj87o7K78J10k44J53r0j8%K15k92
5273f8J21k3j13m5J83j17R8K3j38j67K77O1j75J54k19r7K98l25J11L00m0k32K93
5296A60k70N7J49o2O3q9m0PK23J37m41J64j71N0M2m3J03m01J67K12m1j05J45k01
5320a85J14j2J75J35k45r4J92R8l62Q2K38j77Q4o2q9j76L10L5p0k20O6K56j13
5343b0j12p1L06oj57M1J55o1J3qL0o9N9O2j53Q5j30lQ2r4p4J47K08l10P6J2J66
5370A74k38r9l1L8J16J63j12r1J27j03o3K54n8k85M95m78L92j59q1K98N4r8j88
$$ plain form
5203 11 90 -244 -130 313 -11 -31 66 72 124 13 -161 72 -306 -68 -220 40 238 130 -147 102 -51 -120 67
5226 67 -158 -94 -89 -188 393 -270 -210 133 -146 36 199 145 45 232 -100 -73 -122 208 -6 24 236 -60 50
5249 50 112 10 -394 7 119 158 -196 -55 111 59 -138 80 74 -113 -180 98 208 -36 117 27 9 9 224 -68
5273 -68 53 30 -83 -128 55 -62 36 59 -79 -246 31 92 -83 71 -148 -245 53 -272 -161 139 99 -133 160
5296 160 -110 -53 96 34 97 8 -32 -25 198 335 -106 58 -113 -63 -21 -64 39 -362 -195 17 -24 -129 16 -185
5320 -185 -71 -83 92 227 -18 -112 80 178 -184 -102 136 -41 43 -19 -108 -284 26 61 -9 -229 -163 93 -20
5343 -20 -132 -203 103 97 -60 -19 136 75 88 80 110 41 100 162 9 94 -36 -39 43 -51 -125 22 230 -80 -4 8 174
5370 174 -64 -163 -194 -156 -40 123 11 -80 47 -56 -119 135 77 -208 287 -191 201 42 -39 259 313 215 27
5393B7l3j98K47j05o4J06N7o0J22p3K11q5j31n9J52l17K9J65j52k7J64j5P2j11
5417g8j4J08J95l31P8k9M8l13K52n4K29kj73l3j99L04j53N0J5r3J86j10J7j17
5441b17O3l2%J85K02k52l11L86M4J49m62J45O3O2l0r4L7K18q0K13l82Rqp4K55
5466H9m5K21n08L15n1J44l32J40o6P2o3Q3l0j49O7K35K14n15O8k14O6K86Om4m2
5491e3K26k05qM98o95J51j4J16j12J78j71K9J68k4q9P2j46M8L73k58K0O0p9k67
5515a82o3Q4N2pJ3J75j56K59k59M0l1J46l5J9r8J74l5j74J23j61K21k36Q2K9J22
5540A02n7o7K9l68J98rK31L39n20M9Q2j63P5j6J04j13J62m1Q1k72R7R6N1l39M16
5565A47k06J4O2Q8O1l59L7L64j78q3K80m22K18Oj35J90P5L8k40M5m6K52j23J07
$$ plain form
5393 27 -6 -204 43 -62 -126 -20 37 -23 99 26 237 152 21 -38 114 -203 -174 -9 -161 -188 -24 -39 33 -78
5417 -78 -92 16 211 -120 -42 -71 -23 -336 -84 -138 91 89 -84 -117 -316 -12 -165 -115 -100 -193 -7 -117 -100 -217
5441 -217 -154 -186 -186 -1 201 -51 -362 24 68 217 -245 -100 -37 25 -5 -99 -62 156 76 289 -93 -84 -92 -166 89
5466 89 44 265 -243 72 21 165 -167 -27 -93 -21 -84 -1 -31 -180 -113 122 336 -179 -111 -325 -259 27 33 -11 -53
5491 -53 173 -32 -40 458 -237 -86 -100 16 -96 82 -89 -60 108 84 -5 67 -79 -31 342 84 104 164 85 -182
5515 -182 -245 -161 -109 -116 -103 72 -84 175 -84 -44 -75 71 36 55 -43 131 96 -78 45 -116 105 -131 -49 -20 102
5540 102 45 -22 7 -361 -163 -172 59 398 -122 -73 9 -154 -79 -95 9 -104 58 17 98 -174 -77 19 70 -269 147
5565 147 -59 -45 17 105 166 -193 -156 208 30 -53 227 -195 23 29 -106 84 159 197 -43 2 -44 208 85 192
5589A92k59n7J14n0J26j02N0J86n2M2r1nj92j07K89l01K20k0J07j8l5m1Q6Jj55
5614g2j5j44L38J7j50J95m60L60Q7k03O1n1j03q1N11k18k66K13J08k18r0K2j16
5637b75L80k27K05k48M95p5j04J03Q1m01k4J76o8M2J65m02K18k05J59l9J25J00
5659A81p8k30N4J02k16K04j24K16k22m6L48m62K88K55l12O7j92o4J51J5Om2J46
5682D5l64O46o72L94mO3k43O1J43p2M00l37R5j29p1p9m4o5L26k71J87J32k75m
5706a38k24K27M6oL11l98J26J10p5j22K19K70m19J75l34L56r7p2j55R1K05j91
5728i5L33m11K12k66K78Q4j50r6J05M5M8q3J1O4p7k3j2K0q8R1j07O7rl3J11L0
5754D9J78m46J18J68j1J33l51J50j18k5L09k5K5O5k41k4n0M6R0M7q8k69L20or8
$$ plain form
5589 192 -67 -124 -10 -60 66 -36 14 200 148 190 99 94 -98 -205 84 -217 3 -17 90 72 37 -4 82 83 -72
5614 -72 -87 -231 107 124 -26 169 -291 69 156 -47 14 -37 -140 -221 290 72 -194 19 127 -91 -181 -159 -275
5637 -275 105 -122 83 -165 330 255 151 254 335 -66 -90 86 18 60 225 -177 41 -164 -5 -44 81 181
5659 181 103 -127 -73 29 -187 17 -107 109 -113 -159 189 -273 15 270 -42 25 -167 -231 -80 -65 -59 -101 45
5682 45 -319 327 -345 49 45 108 -135 -74 69 -3 397 60 155 26 -45 -124 -168 -233 93 -178 9 141 -134 -138
5706 -138 -362 -135 -89 -95 216 -182 -56 54 -21 -143 76 346 -73 102 -232 124 27 -45 -200 -109 96 -95
5728 -95 238 -173 39 -227 51 135 -15 -111 -6 39 87 4 15 79 2 -21 -33 -13 -101 -10 -117 -50 -59 -92 19 49
5754 49 227 -219 -101 67 56 189 -162 -12 -130 -155 154 129 154 219 -22 -46 -96 -50 40 87 -1 -270 50 44 -54
5779e4M3k7J70j75J00j28j91L00P7O5k28L3q2j36L61j70j7k8L4k0J83N1k09M9
5803An5J84k29o9K21k32K78l1k61K45k06M4M26j65m1k23R8j03M92n27J72k08L4
5826a55J46k65L74j5l5j74Q4J06K7j23j61L42j98mJ32l0n3r4J86j86J37M4m26
5849c41L58N5Q9k98K84k63j41J79k83N33j44r1J80m6o0k33M44j94O9J10l31J51
5871B7NJ8jK47l11l41M36j10k44L98K14m35J79j24j76J79jL22k27j16K31l41J64
5894gj27K97k3k77N62n15K13o2j86J47J23q1j44K71m58K13P3L8j10j18P3m5L03
5917A60j64j19K85l34J48o8J92P9l17kJ16j34N0K98j59J22k70J68Mr7R2j05L56
5940C01l00mj67J02K76r8p7k9j57Q9N5K0J5j59J56j6J1l00L33k03P5O9L58j69
$$ plain form
5779 -54 -11 -38 132 -43 57 -71 -262 38 115 180 -48 -15 -97 -233 128 -42 -59 -87 -53 -73 110 161 -48 1
5803 1 -54 130 -99 -168 53 -179 99 68 -193 52 -154 -110 316 151 110 -113 -15 -118 374 -153 19 -189 -155
5826 -155 -9 -274 100 85 50 -124 -40 66 93 -30 -191 151 -47 -51 81 51 -2 -96 90 -96 41 85 -341
5849 -341 17 72 161 -137 147 -116 -257 -78 -361 172 28 -63 117 71 11 -222 222 28 97 207 -124 27
5871 27 32 50 49 296 -15 -356 80 -30 -274 124 338 -97 82 -42 -218 -39 -40 282 55 -61 170 -171 -7
5894 -7 -134 163 140 -137 425 -90 123 61 -125 22 145 64 -80 191 -267 -54 19 57 -53 -171 -98 -143 160
5917 160 -4 -123 162 -172 -24 -92 100 179 -138 -140 -24 -158 -108 190 31 153 -117 51 55 -42 50 -55 301
5940 301 1 -3 -170 -68 208 110 33 4 -153 -64 -9 11 26 -133 23 7 18 -282 51 -152 -77 -8 350 181
5964A81kj99J67j07l91L45j07J16O9M7L5l48K84J40k04l5N7PKk8J59l95J76K6
5988ek27L5K78l77K10K12qKk83J64j29q2L46R6k80J69j49J20m1q1j70K22K5j10
6012f3j84K19K5Q8j23K90k71Q6k08K34l89K12l4k4J05J00k64L61j72j27M3J94
6034I8j23M1j78j37P5N0J99J57n6k17L38l17r0N66n47K3L2J73j07j27K16j94J52
6057B7ML1j35j3K21k46J84L3r9J2k26J56J81k00J39j89m6J43q0j39K97Pj03J29
6081H8j11j4J32Q1r7r7M6j31j1L06j12pK62n51N91r0k29k45K35j13J59j49JK92
6105B36j70j08MM0k56L04J98l14K10o9J38j52j66K01l65K30m9k15M94j93l00M81
6127A79l71p9L01Lj37K17l11O5L79j58j21j60N5L8Q6m4J36n9l2O0J47j89j72J22
$$ plain form
5964 181 179 -20 147 40 -351 -6 -113 3 72 119 154 -194 90 230 26 -9 48 55 57 29 188 -207 -31 -5
5988 -5 -232 -197 81 -296 -86 126 118 120 -163 1 -128 -210 136 232 -48 121 -28 92 51 -30 -200 22 47 -63
6012 -63 -247 -28 -3 85 -38 252 -19 67 -141 93 -296 -84 -118 -142 -37 63 -201 160 -12 -139 -96 98
6034 98 -25 16 -162 -299 -224 -174 25 182 126 -91 247 -70 -160 406 -141 -118 -86 87 -20 -147 69 -125 27
6057 27 31 62 -73 -86 135 -111 73 106 7 19 -207 -51 130 -70 69 -120 -166 -23 -103 -242 55 62 -41 88
6081 88 -23 -37 95 176 79 -18 28 -103 -114 192 80 73 335 -216 375 285 56 -189 46 -67 92 -57 -56 236
6105 236 66 -42 -38 2 -254 50 248 -66 144 75 213 61 -105 96 -269 -39 -88 -303 191 -2 -302 179
6127 179 -192 -271 30 33 -104 113 -198 -133 246 88 -33 -193 -138 -100 -14 -58 78 19 -13 47 194 5 -167 -45
6151d5Q5L61m03K2J85k55J64o6J51q4P3l09j21R5J05K60m71O1K15J34j07J6k71
6174b05k58L50L07j60O5n73M94j29K04J31j13k30K95j4Nj39j20J60J71l93j87
6195c39J72J3qJ20J01J74l58J56j39M0q0O8N2L5K1l48L03k04M21n1j44R9j9J26
6219B11j9l92l9j9J06M74j89l40K05n6J90k20J81m8j44j40J69Q8P1k77J36J46
6241I4k32J72j07k3j29K12Q1n5O2k13K96j58k50P1L27L5j61j38L3j13J89J10m74
6264c71L67q0J27M4j74L03j89O7l00L6M61j44k07K31l26L03l83J43J25j08p1J06
6286d0J27j84M5o0J37r3K68l22L4O0M7K16j06k90J00L90l12j20M4J28J17n16L25
6309em7J01j70J04L43l83R8J07k24q6J83k10n7K96k6L9K3r2L1J66p2n7m8K85k60
$$ plain form
6151 -45 40 401 -2 20 205 -50 114 48 199 115 188 -121 -242 -147 -42 218 -253 -192 23 157 50 66 -205
6174 -205 -463 -113 194 34 99 -474 20 -109 95 226 113 -117 178 164 169 30 -90 70 241 -152 -339
6195 -339 -167 -154 -162 -42 59 233 -125 31 -108 -68 -148 -80 -28 7 28 -320 -17 -221 200 149 5 104 85 211
6219 211 192 -200 -239 -258 -152 322 133 -207 -2 -58 132 -88 93 45 -99 -239 -70 18 89 -188 -52 94
6241 94 -138 34 -73 -96 -225 -13 68 13 75 -138 158 0 -250 -179 148 183 22 -116 -83 -196 -7 103 -371
6264 -371 -4 -84 43 87 -87 216 27 94 -206 -170 291 147 -60 171 -155 148 -235 -92 33 -75 -146 -40
6286 -40 87 -97 -52 -112 25 -68 200 -122 -88 -28 19 235 129 -161 -61 329 17 -103 -59 69 186 -330 -5
6309 -5 -52 49 -121 -17 326 -57 41 148 -76 -162 21 -189 -246 50 24 63 86 -6 25 191 119 62 14 299 39
6334C9j86K05j00L9j52o7J17m9J82j51L36J4l0k47o2J88R4l9NJ81j11k9p9pj50
6359e9k03O7K5K68kk20K40k04P9j63K84j1m5j00l6j2J30J3k05J08R4l76J90J01
6383c7o7J42O8j32j40N8K5J57Q2m15J34J33j2J02k26o3M51q2n99M56m7Q1k13O8
6407g6J89O5k53k6j32J28J76j33L5j1j09L4Q9j22K43k11l0O1K84L5r7j56k3RJ29
6432I8mj64N6K5m62M25Nk5J43On4M9n2j09R0J48j96l0N1J92j21j83M36l64Q6l50
6458c04K76K80k56J21j21q9K30j08K5R9j36K03k78J34m6k05j2M31k85J13J3J21
6480B06k79R1Q7r8j96jK95j66J82j98J64k52J47K75l60K50J12n51N05M7k43J13
6502A30L6o9l2mj81R6j52J49L45k65j90L1N4r8R6L16m03J28p3J43l8j21l4N03
$$ plain form
6334 39 -147 58 -42 -3 -155 -222 -105 -154 28 -123 213 227 197 -50 -112 76 170 131 136 317 206 177 98 91 -59
6359 -59 -262 -195 -170 98 96 -124 116 -88 -9 -172 112 101 56 -44 -80 -92 38 51 -154 -46 48 -328 -138 -37
6383 -37 -104 38 106 -26 -166 -108 -83 74 156 -259 -125 8 -4 98 -128 -191 260 178 -421 35 -12 69 -144 -76
6407 -76 113 178 -75 -101 -233 -105 71 -62 -27 -38 -147 -113 -24 -146 97 -114 -144 -83 201 236 139 -17 -40 -31 98
6432 98 94 -70 -14 11 -451 -26 -21 -46 97 103 49 98 46 -63 27 175 -21 -51 0 192 71 -112 324 -40 46 -304
6458 -304 -28 252 -4 117 -4 -93 137 29 54 153 17 220 -58 76 30 -175 -187 244 -41 72 85 206
6480 206 -73 18 105 7 -189 -190 105 -61 121 -77 87 -165 -18 257 -103 147 259 -292 213 260 17 130
6502 130 166 97 65 61 -120 -24 -176 -27 318 53 -137 -106 -52 -150 -54 262 -141 -13 -86 57 19 -102 -136 367
6526C67k57k47Q3K44k1j38O9k59K3q7J79Q4O6k2r8K3j82O7pK36k22J52Q7n1k40
6551a51L13k3k7J6k76J00J49j06K58m16J05J62k17L35l21J26l3K10k93K2J35j01
6573c3j47J20j05J95K1j42r3j4K16J09n8j84K52m0j27q9J94p9J24l4l97K78N5
6596B2m8n6J49k0N7r2j02L14j00k16J89q6pJ40j15K3O9k84Q6O0m2R9L3j13o9K63
6622A54o1q5mk37L96l6j88R4k81K66j25J15o7K37m55K53J56k56K25k26k2K07l10
6645b50J2K91j38J27j52K27J47m17K25j62L22j02r0o5J73l33L03j71J24J20k51
6666f0O8j41J62k87J65N3K28j78q0k66K38O2J53k23K76k58J40k72l0O17j46k56
6688c5J3K82l96K07j92J01K8q5J38l7p6k62R6L27n3mk71J96q5K31r2K30m96L79
$$ plain form
6526 367 110 -137 -54 190 169 31 100 -159 -136 -223 -44 40 106 84 -14 9 -173 -106 -113 123 -99 53 140 89 -151
6551 -151 162 139 112 128 -148 -48 101 -5 253 -163 -58 104 -113 222 -99 27 -6 204 -89 -67 68 -33
6573 -33 -180 -60 -165 30 51 -91 -184 -198 18 127 69 -115 137 97 -30 -119 75 -4 120 86 -311 -33 22
6596 22 -26 -82 67 47 104 12 -90 224 124 -92 97 11 4 144 29 52 121 -163 -77 -17 -59 40 73 -40 -109 154
6622 154 93 8 4 -233 163 127 -61 33 -248 18 -107 8 -59 178 -277 -24 132 -124 101 -125 -147 60 -250
6645 -250 -238 53 -85 42 -110 117 264 -153 72 -90 232 130 40 -25 148 -185 118 -53 71 191 -60
6666 -60 8 -133 29 -258 -93 -40 188 10 -70 -336 -98 -36 117 -106 170 -88 52 -220 -250 367 221 -35
6688 -35 -22 260 -136 71 -121 -20 8 -77 61 24 -52 -314 -218 109 56 52 -219 -23 -108 123 31 261 -235 144
6712A44J0l42O5k38L6L04J98k73J81l0k14M2J47n0j99p1M31Kk14Q1kK18l42J85
6736F9k1k41N8JJ28m7K02m17N58j43n5r1M8K10l12K29j99Q4k4m0j48J21J77j47
6760@L11l11m3m0J82j03K31l12J66q2p8J6n9J39j82r6j8N19k20Q6J85j99k03o5
6784a76K56o1J4j12Jj12J97L6l3L8j49M74l40k07L63k38k08O06n40K70o9o4J21
6807F7j33J46j45K37l84J13Rk39M61l29K19j92K52k2N9J56k50K34k72J15j80j51
6829b29K05lR2j79q4L71k71J2J38o7K50j08l10j38N00k22j94J60p1L56j19l0M
6852F3P9p7k39N7J16n2J6L21k43k04K16j78J55Qk30K34M7p5j16M9J02l0j44L44
6876B19n08J38N8K58k7M2k62j00N8L67l79J38o8J06R8j94J22j06J33jq8J78j06
$$ plain form
6712 144 154 -188 -123 -361 -325 -21 177 -96 85 55 -159 -117 30 -20 -219 -290 141 143 -71 10 8 226 -116 69
6736 69 48 -193 -135 -134 -6 -53 149 -268 290 147 92 1 49 259 -53 176 -23 61 37 -3 -151 -30 147 0
6760 0 311 0 -43 -83 99 -4 227 -85 81 -1 -79 -63 -122 17 -165 -261 -279 240 20 106 291 92 -111 -176
6784 -176 80 19 33 -79 -78 -190 7 43 10 48 -101 373 33 -174 189 -49 -257 349 -191 79 10 -54 67
6807 67 -66 80 -65 172 -212 -99 -90 -329 132 -197 22 -170 82 60 119 275 25 259 -13 102 -78 -229
6829 -229 -24 -27 65 -114 -198 173 -98 -86 52 -15 235 127 -183 -321 179 -43 -237 -77 -148 208 89 59 63
6852 63 142 65 -174 -117 -1 -53 -37 284 41 -163 53 -125 30 38 -192 42 89 14 -102 -53 49 19 -125 219
6876 219 -289 -151 -93 165 138 180 -82 -182 -124 243 -136 2 -66 40 138 -56 66 -40 93 92 4 182 76
6899G6M5J9P3j53N7j13J45k26L61l25o3L10k36k7J64j59K31J61n27J90o2K45L
6922A89k87j40K25n5R3K32l2k49J46l0j96L5Q0Jo1JK21r7k08P8p2K2N1J50m8R1
6948A40m9j91j15K96l29L99k79L41l45L22j40j54J33j32K06j83l9L4qL03j96J56
6970A70l36J27l6M17l20j54j31L12J16j86N2j74Q8r8J52j00Q3J27j33j1k35N56
6992B86m13O7K42p3l4j52J24j81P8K00j35m0J85r0j87J97j47r2Q3J01J87k62K62
7015B06j40k11q4L01L9l8J75l70J88j9j99n7M6K29o0O7P3j21J36j07M1k27N10
7038C78m75r5J54l8L46k10k18K47q8j12N1N1J42o1p2p1J17RL1J2l33K70J61k3
7062A73k37O7J0r9k3K8P8P8l18L82N5j10P8m8m6l48M60k70J58Q1l25J90J7o7m0
$$ plain form
6899 76 121 140 213 60 117 4 149 -77 284 -41 -104 206 -30 -57 107 -52 179 340 -187 3 -59 186 189
6922 189 -98 -238 -13 -68 25 257 225 -24 122 92 -104 -69 11 12 -49 -48 173 76 -132 -54 -126 -104 -53 97 49 140
6948 140 91 -100 -215 81 -248 151 -128 213 -132 190 50 -104 29 -103 103 -80 -119 -85 -93 210 14 170
6970 170 -166 -39 -75 342 22 -132 -263 49 165 -21 31 -143 -55 -153 -1 -101 -18 109 -24 -35 -270 286
6992 286 -127 -60 182 109 75 -77 47 -134 -56 144 9 -31 154 64 -123 74 -73 -165 -82 19 206 -56 206
7015 206 66 -145 -229 72 111 73 248 -122 66 47 -152 -209 -163 66 6 73 146 25 161 54 95 -132 378
7038 378 -97 -192 -38 -76 270 60 -158 89 1 -111 -60 -9 133 72 0 -71 46 55 86 98 -235 35 196 173
7062 173 -64 3 13 -86 -109 -81 -3 75 -243 139 194 84 162 114 68 -280 180 -90 68 149 -176 14 31 -36 -76
7087g6L34k03N0k75L64m61J50L55q6k45lm4N5m2N9O1NM0j86J59j3K7k94K17K20
7112A68j95M2p3K79J74m83N8K45n2O9l45Q0K3J2K8j98K67k09K48j58l8K20l09
7135a47O5Q8n9L43j56j78k3n4r0K89j22oN4J51K2l74J81k81J88J6J81j39j24l5
7159b10mQ8K66m81N9K68J94m14J10Q2K39j65J52l16j94L01R1l79K67J4m8l3J13
7182@K4j46J63o5J52j24k02J31R7J08J0k55o4J11k5K0L05k89J11k36K17M2l90
7205c05M41j01k00J18j40J14O6J22n1j8k76J73J66k9j07M4L3R6k38J67j71l39
7227d35N67k47j15K83J73m15Q0K33m3J02l81N08j82l11J25j35J47J42K3J9o9r8
7249b9j49L34k42K81m6k48O7r7k0K58j31o8J96j22n5N5k4M5J38k74L02pl80J74
$$ plain form
7087 -76 258 55 105 -170 194 -267 -117 238 152 -93 -96 -140 -85 -127 -68 -7 -2 38 -148 11 -2 25 -269 -52 168
7112 168 -27 15 -58 221 395 -88 -30 215 163 232 -113 -33 -10 2 30 -168 99 -110 138 -20 -58 162 -147
7135 -147 -82 6 -53 290 134 -44 -67 -121 -211 78 -44 -50 4 155 177 -197 -16 -297 -109 -93 88 -51 -175 -210
7159 -210 -214 -126 140 -341 -282 -14 180 -234 -124 -42 197 32 184 -132 -326 -25 66 -313 -46 -32 -80 -113 0
7182 0 24 -122 41 -24 128 4 -198 -67 30 138 148 -107 -171 -60 -85 -65 240 -49 62 -174 43 85 -305
7205 -305 136 35 -165 -47 -187 -73 -7 115 64 46 -230 -57 109 80 -27 17 50 146 -92 75 -96 -435
7227 -435 132 -115 -230 53 226 -189 -109 124 81 183 -198 310 128 -183 -58 -193 -46 96 119 138 69 -29
7249 -29 -178 156 -86 195 149 -99 -32 -129 -149 109 -22 -90 106 -16 -71 -16 -40 5 143 -131 171 164 -216 -42
7273d2j13p7K98J88k45J18q3k0j58j73M16o1j8j36K14l6K2j54j02qJ70%L3p4Q
7298c3L2L37n97L20m3L1j85L08k1l10L7K89m15K63q4K52j07l7K9N2k4k69J72k34
7322b37M55j7j35k16q5N4L71l48q4K76oK70n3m04L21p2p5L3J27l31J00L5o7J8
7346g0k13L50L5l1k49J09j22J16K52l81K59K28j52l09K29k90K48J76j68m1l9q
7368g1m3N9L33k49M3l14J32M22j85k96R1L31j50l51K59n9R9J06j09j31L53l14
7390d4J99l10j08J99JJ32k43K89o1l16M0l9K27M0J06q2j13Q2K4j29J32j84J91
7413C3Nj45K76j49R5J77m45kK36r6lR2k88J69m9qN3Q6m8J50j89m1J20l27K44Q6
7439C2J8l26Q2L9K40q4j21Q8j48K36j89R9J86j23K73k66PN8q8j52K35m64J64J63
$$ plain form
7273 -42 -155 -232 66 254 9 127 44 24 -134 -307 109 48 30 -106 108 72 94 -60 -162 -170 0 0 33 -41 -33
7298 -33 -1 336 -261 59 16 47 -138 170 149 -161 -124 165 -250 13 -71 181 74 37 66 118 94 -175 -3 -237
7322 -237 218 201 66 -150 -235 -181 190 -158 -242 34 28 298 245 -159 162 90 15 48 175 -156 -56 -21 -88 -70
7346 -70 -283 67 102 71 -178 -69 -191 -75 177 -204 55 283 131 -178 51 -239 9 185 17 -24 -63 -71
7368 -71 -114 -55 278 29 72 -242 -110 312 127 -169 -78 253 103 -248 11 -48 51 157 48 -83 270 -44
7390 -44 155 -155 -263 -64 -63 69 -174 115 54 -262 -222 -261 -34 6 112 30 -83 -1 23 -106 26 -158 33
7413 33 38 -107 169 20 115 292 -153 -155 81 -15 -18 74 -214 -45 -94 -102 -49 37 -11 139 -50 -91 29 -298 -54 32
7439 32 50 -276 -194 -155 85 1 -120 -32 -180 56 -133 -34 152 29 302 36 43 101 13 -139 96 -368 -204 -41
7463d1J29l38K68K00j3k31o2J98J45j14o5k33j79N79n61L73Q0R5l18Q1j70K94
7485A17k42L8P1k12J77M5K81l56j68K72r6J06j95J13K61k65J04o6k56O4J17m3
7507a33J29N3l49J40M7J5K6J36Rn9PP4m1j09J67k4j94J61Or4J9M0j96J97O4K06
7533B97k77k70J14J1j23K67j84J84j69J70pJ18M6j82QJ02j54R7K5l36K09ML20
7556B70k99J1L14m27qJ62j3K3mj09O1Q9j86K49m3r3K74n31L01j2j31J37N5r7J20
7581A13m1L8j44P4R9n37O03k66j15K7J23j76m1L19p5J28j87M26j40l71P7N76o26
7604a16K59l80m4L84k63K16q1P4m42M32J47n4j20j28J44Lj71K58k1j38J53j8l19
7627b25R1N2J63j84m7K06j86R1J71j34m7M1k8J9r2R7K0Jk02J12J0N62n66o9J68
$$ plain form
7463 -41 88 -250 18 218 205 -26 -88 110 255 141 76 -157 -336 243 -318 55 135 230 -88 -7 -177 117
7485 117 -125 -87 -16 -228 -51 -6 275 -81 -249 23 -73 33 -162 -49 212 -53 51 -15 -271 -207 -90 -133
7507 -133 -4 49 -300 -160 -113 -98 -72 64 73 14 21 95 54 -55 112 88 -106 55 61 -33 -14 26 -170 27 91 297
7533 297 20 -250 -136 -125 -248 19 -165 19 -150 20 13 131 177 -5 3 105 -49 48 73 -263 -54 -50 270
7556 270 -29 -18 296 -131 -139 23 10 33 29 -80 -19 70 -116 133 90 -3 271 -260 41 29 -102 35 90 -7 113
7581 113 72 110 -34 40 139 -398 205 -61 -176 -149 -26 -202 -243 76 1 129 -58 368 228 -143 -66 510 -116
7604 -116 143 -237 -281 103 -160 56 -25 49 -393 39 186 132 12 -116 28 31 -140 118 97 -41 112 94 -225
7627 -225 -134 -82 81 -103 -150 56 -130 -39 132 -2 -49 -8 -36 -17 -109 -12 8 9 -193 -81 -71 491 -75 -144 24
7652B4j32N7j70K81N2j0j02J21k15J71m1k03K84j7L4k56J54J0k35K85o5L18rl78
7676d2O2R1N1k02k36K83r4k8j96L42P8qQ1m91N60l18P5q3L09m80J45J26N5M7j49
7701b2m6K69j23Pq6q8L20j60j90L26j22k56M8N58l22k69J93N4l2J0J52l45J50
7724B6K40j58j65o0J24k57m3L76j21j98K05J54m0j01l35J54J07q5J7mQ0J62k8
7747E0j9k8j56J21j8m6Q0K5J64k46K80n0k07n4Q9L59k11Jp1j09J13J09l07J60
7771B9J58j95J19J7j01N4k83K63J91m49m7R0J66R4l25K01J77j11k65J72j31K49
7793G3K09l56J22j38L0M0j22J25j81J55M02j43l46J43J7k03K37l83L25L54l23
7814C7KK04k69K79m15k4j02K82qJ73j00k19lK71j17J1L17m37K12k07Q6K47l80
$$ plain form
7652 24 -108 -51 -221 60 112 102 0 121 -94 77 36 -167 117 100 134 -122 32 42 -193 92 27 345 336 -42
7676 -42 20 111 162 -40 -276 7 -87 -115 -311 31 109 101 182 -309 251 -67 8 -75 234 -246 -101 25 80 127 -22
7701 -22 -68 201 78 85 -1 -89 231 71 -119 207 85 -171 -123 435 113 -156 37 91 59 69 221 -124 26
7724 26 266 108 -57 -117 7 -250 -293 83 -38 -236 -31 123 83 -18 -353 -199 -92 -177 -160 -164 -84 78 50
7747 50 31 3 -153 -32 -50 -96 -16 9 173 -73 207 157 -50 -104 -15 344 133 134 63 -46 67 176 -131 29
7771 29 187 -8 111 128 27 81 -202 61 252 -197 -244 -154 12 106 -219 -18 159 48 -217 -45 -176 73
7793 73 282 -74 48 -90 -60 -20 -142 -17 -198 -43 359 216 -130 13 30 -173 64 -319 6 360 37
7814 37 39 243 -26 253 -162 -186 -288 -6 -14 159 59 -160 -163 108 -9 2 319 -118 94 -113 -27 220 -160
7837a60k4K25j67J95n6p2Pn3L64m03k66O77l19J11j93K25Q8k39J54k97K04M1N1
7860I3J8l10J94l25N28m7P3k81j4o7J93P1l07R1J00J13j82M7K24j44l11L26l40
7883b57J40J39j59K5l0K45l03K88j66L02l06j5N4J60j17R4k40n4L18k66N9K05
7905A16Q2O3k61J99j06k67K46J67k50l9m5K64j51%j5l02L70L8J84m52%L13j07
7928D7K6j26K77l14k73M16m1L2Q0L0k26l2J46j13J27l4q9j07M54j37m09K15J53
7951A02J18k96Q2NP7K4l37K95j63K35j18q0l2K1J12l2k4J0J44R4j59o71O76j79
7975i6l3KL02K06k94l0k44J26L26k92r6M75m00j70L95k00J48k18J51k00R6m4j22
7998b12L69k83K8J09J69j67l5k04o2N75l96l1R9j26K20l8L9K26l34Q5K2K7PMr2
$$ plain form
7837 -160 -184 41 -126 69 13 -59 -52 -105 259 -144 -410 267 -52 59 -134 91 179 -60 94 -203 1 42 93
7860 93 111 -199 -5 -330 198 151 224 -57 -71 -138 55 126 -181 -90 10 123 -59 -12 212 68 -243 83 -257
7883 -257 -117 22 -137 -112 -142 103 -200 88 -78 224 -82 -97 -43 117 0 94 -146 -200 118 -148 -89 116
7905 116 198 261 0 199 93 -174 72 239 -11 -50 -95 169 18 18 3 -299 71 109 293 -159 -159 154 47
7928 47 73 -53 224 -90 -363 53 12 44 124 154 -72 -104 42 -71 56 22 -67 -174 280 143 -266 -51 102
7951 102 220 -76 6 11 88 112 -225 70 -93 142 24 -56 -88 -67 45 13 -11 -1 143 237 78 -593 83 -96
7975 -96 -129 -127 175 381 87 57 -187 -61 265 -27 -123 352 -48 -218 177 -23 125 -93 58 -142 -46 -90 -212
7998 -212 157 -126 -98 11 180 13 -22 -226 -288 287 -109 -140 -41 -167 53 15 54 280 -54 31 53 80 87 91 -1
8023aj73J84l4L34l72J76n3j26j42K18P6k4k32J23o8j60L81j31r0K82p5m56Q37
8046D74l10K4k36O6k14J70L23L5m53M8J88p3j85K0K1K29k50K99q1j22N2nJ34j65
8070a1k16K08J21k01K8J2J09j32J09p0o7P3J39Q1k02J4j66K24N3l98L79mk64M3
8094a38Q3J83m8j63L32k32n8j4N8K09l6j01n7O1K16j14l02J69j18j84J67N%R0
8118Ho1M4p6J57O8j18qR1j68O5j18R2qJ46N6k46K41j70k6O7j5k77K35k72L54j61
8144a00o0L08j98R5l8J04L2j08L8k13K19j58j3L92k69j04J15R2j48J12j29l49
8166c80L52m0k31L45N8n2j79N0L1o6O5Q8K1j4j41J13Rj92k23K41J21j77J57K59
8190B15l4
$$ plain form
8023 -1 -174 10 -24 310 -62 114 61 -65 -207 11 87 63 -169 -46 -114 -274 107 -24 -114 168 93 -363 474
8046 474 164 188 -48 18 -196 -26 297 332 -121 -73 115 42 -143 -123 -102 127 -123 176 95 -27 25 20 154 -11
8070 -11 -227 -19 102 -99 -71 -59 50 -82 27 -43 -110 -37 102 183 -19 -5 -171 53 106 -292 87 83 -181 -138
8094 -138 -55 128 80 -83 249 17 -41 -55 3 212 176 75 18 79 295 181 -121 48 -70 -254 -87 -82 -82 8
8118 8 -53 -9 -85 72 140 22 14 105 -63 2 -116 -24 -32 114 170 -76 165 -5 -31 36 21 -256 -21 -293 61 -100
8144 -100 -160 148 -50 45 7 111 143 35 73 -140 79 -79 -92 300 31 -73 42 134 -14 98 -31 -380
8166 -380 -28 -68 -299 46 104 52 -127 -77 -46 -112 -47 41 62 48 -93 20 29 -163 -386 -145 -24 -201 -44 215
8190 215 181
8191A81
$$ Imaginary data points
##PAGE= N=2
##DATA TABLE= (X++(I..I)), XYDATA
0@%%%%%%%%%%%qJ6j6J6k4L2l2M0n0N8p2Q8j04J20j42J67j93K24k57K95l35L80
33B03m33M91n56O23o95P80q74R72j078J198j331J472j625J795j982K187k409K654
51A392k923L221l554L923m338M809n349N971o697P562q611R913j1584J3817j6970
66i418K1794l0177M8902j71007L8568J73746k12533L3444J52933j5580q2197R6092
78D4567L0993n1820J6918L9369q9209j1408Q5620k5450q5887N4109K6223q8876
90e4851k4061Q1527j380o6298J8175O8740k6938k7437P4197L8439m9999J1127
102D1241M1059l3509k7785K1235l3663n9287J4973J0171o0871J1539Q8682j9853
114f068p0439N7836P0602l6596j5894M4640o106l3588R672O826j4087J4081O570
$$ plain form
0 0 0 0 0 0 0 0 0 0 0 0 0 -8 8 -8 8 -16 16 -16 24 -26 32 -40 48 -56 64 -78 89 -104 120 -137 158 -177 203
33 203 -230 261 -295 328 -367 413 -461 511 -567 631 -700 772 -853 942 -1040 1147 -1262 1392
51 1392 -1531 1690 -1864 2059 -2279 2530 -2819 3152 -3545 4017 -4594 5319 -6265 7552 -9418
66 -9418 12376 -17801 31101 -139906 -101338 72408 -140125 -106681 46252 30672 -51525 44567
78 44567 75560 23740 40658 80027 -9182 -20590 65030 39580 -46307 7802 34025 -54851
90 -54851 -78912 2615 1235 -65063 -46888 21852 -5086 -32523 41674 80113 30114 41241
102 41241 82300 48791 21006 42241 8578 -50709 -35736 -25565 -86436 -74897 13785 -6068
114 -6068 -76507 -18671 51931 15335 -559 44081 37975 4387 14059 20885 6798 20879 27449
127B7449m0761j6480K4445p433k1390K0750J0709l1532o792L6683J5379j1809
139g82J6172K7620j0252j7635J2924R172j6250j6244r517j7529r610P122k838
152b7647m173K3903P462k5641J3196M3991o112k7379J4890J5226k0015q568J7853
165A6986M41j5970j510p463j1842J3442N874k2223L15J7342j1532q869K6448K0729
179B2168j2528p116J8547L779j6482M757Q731j8246j5729K29m501l334R011M325
193f389p055P35J4578R98o625J7468R477k2756m005J9878m549j5313R605Q215
207A4262j6918j2062J1064L573j0995J204K093q577N550J0620l402O249J5392
220A8053l521j1303P140J2383r081j5211K773r9j5390k516R674j244k286M606
$$ plain form
127 27449 -13312 -29792 -5347 -12780 -34170 -13420 -2711 -34243 -41035 -4352 11027 -782
139 -782 15390 43010 32758 15123 28047 37219 20969 4725 -4792 -22321 -31931 -24809 -27647
152 -27647 -31820 -7917 -455 -26096 -12900 31091 24979 -2400 12490 27716 7701 -867 16986
165 16986 17427 1457 -53 -7516 -19358 -5916 -42 -22265 -21950 -4608 -16140 -25009 1439 22168
179 22168 9640 2524 21071 24850 8368 13125 21856 3610 -12119 -11890 -16391 -19725 -10714 -6389
193 -6389 -13444 -12709 1869 2867 -3758 13710 23187 431 -3574 16304 11755 -3558 6047 14262
207 14262 -2656 -14718 -3654 -81 -11076 -9872 -7779 -16356 -10806 -186 -3588 2661 18053
220 18053 14532 3229 10369 22752 13671 -1540 1233 1134 -14256 -16772 -7098 -8342 -10628 -6022
234f022J410r08O294Q690k008n647M715J176p465N038O908q061l500M709m610
249G19q557L310N358r211j0191P278N826l661M754Q514J470K993K489k277K530
264A1344L944n861j1590l018M295m736p420N763M228n669Q02O615R79N74K915
279C165m03l923N62O677M9l840M470J282n627J214K165o005l016O07n009p126
295a4758L248Q587k579l772R467O707k931J962N165n64k646l549m309j084J940
310H84j214o621k08P070j751n593O346M599o704k632M407J007k369L451M474k817
326B329o98P019k15m637K035l66p044l314M17k299j140K128P21l035L981R153
342E035j388l596O154K234o506j694L389O44l217k218J38k00K030J831m441j807
$$ plain form
234 -6022 -4612 -5520 774 9464 7456 1809 6524 7700 235 5273 12181 4120 620 5329 719
249 719 -7838 -4528 830 -8381 -18572 -11294 -5468 -9129 -4375 4139 5609 8602 11091 8814 11344
264 11344 15288 9427 -2163 -5181 -886 -5622 -13042 -7279 -3051 -8720 -7918 -1303 -324 250 3165
279 3165 2762 -1161 -599 6078 6127 2287 6757 8039 2412 3626 5791 -214 -3230 -2623 -7632 -14758
295 -14758 -11510 -2923 -5502 -9274 193 6900 3969 5931 11096 10532 7886 4337 28 -1056 884
310 884 -330 -6951 -7159 -89 -1840 -7433 -1087 3512 -3192 -5824 -1417 -410 -2779 672 5146 2329
326 2329 1631 8650 8435 3798 5833 5467 -1577 -4891 -4474 -6773 -7913 -5785 -5064 -8099 -4118 5035
342 5035 3647 51 6205 8439 1933 239 3628 4272 1055 -1163 -1025 -1225 805 2636 -1805 -3612
358c612M507l983o069M794N134l467k309N018L544j380K548N186l680m365K790
373D656k184m815J153L45l640j978J486J430P20L439J629m386Q53N550k660l381
389a783N073K080n064k432M043K701k507j045j66l384l30J253k972N4M560k311
405b230m332M681O474q63k278L039J192n143l30L828k717l167J022j597k769K755
421b435K939j019j263J443k98j725L275K399l173k72L220k804j744M493K499m495
437A040l427J638L03k815L57K723k197l99J768q96J789N111p93m568N08L738k517
454A363l636L274K109o225j493L969l35p5K437j008l172J222K441k52n08K260
470B371k29l498J604K530j887Q89J531m763l728L092K201k801j539M037O78l401
$$ plain form
358 -3612 895 -3088 -9157 -4363 771 -2696 -5005 13 3557 2177 4725 9911 6231 1866 4656
373 4656 2472 -2343 -1190 -845 -4485 -6463 -4977 -3547 -2827 612 2241 -2145 -1292 4258 1598 -1783
389 -1783 3290 5370 306 -2126 1917 4618 2111 1066 900 -2484 -2814 -1561 -4533 -4479 81 -2230
405 -2230 -6562 -1881 4593 3730 1452 4491 5683 540 210 4038 1321 -1846 -824 -2421 -5190 -2435
421 -2435 504 -515 -1778 -335 -633 -2358 917 3316 143 -129 3091 287 -1457 3036 5535 1040
437 1040 -2387 -749 -446 -3261 -2904 -181 -2378 -2777 -1009 -1905 -116 4995 4202 -366 142 3880 1363
454 1363 -2273 1001 3110 -3115 -4608 -639 -974 -1049 1388 380 -2792 -1570 871 619 111 2371
470 2371 2142 -1356 248 2778 891 1780 3311 -1452 -5180 -2088 113 -2688 -4227 -190 488 -2913
486b913K241M836k21J27p94l230k54K741j138l816k0K999l026l927N001L810l316
503i00j047J979j375N60K638P23j851L40J931j644r05L089L22l851j077p49k921
520d738J161K098k243j516K858K732q54P18N216J261m212j157J051l4m47j462
536D32k480m30M57n10p58J441K780j911l209J933L096n25k92J583Q6n94Q59J318
554C276l25j94O44k436l257J46L58j379m10n85o08J701K401J258N25K450J804
571E369k983j844K899Q95l107j856n90n9k5o24O6O67L51j000j253O70L124k27
589D73j969J388J851k04J0J310Q61j113j317K84j694j380J309j612k785J065Q00
606b723k6J681J817K37K33J096p3j592J518J888l354k625K548O76k343K84J058
$$ plain form
486 -2913 -672 4164 3943 4070 3276 46 -208 2533 1395 -2421 -2441 558 -2468 -6395 -1394 2416 -900
503 -900 -1947 32 -1343 -783 1855 2578 727 1067 2998 1354 449 3538 3860 9 -1068 -1817 -4738
520 -4738 -3577 -1479 -3722 -5238 -2380 352 -502 216 5432 6693 2481 1324 2375 2341 1894 432
536 432 -2048 -2478 -2021 -2531 -3289 -1848 932 -979 -4188 -2255 841 316 24 1607 1693 1099 1958 3276
554 3276 2951 2757 3401 965 -2292 -2146 -1788 -3167 -3577 -4162 -4770 -3069 -668 590 1115 3565 5369
571 5369 2386 542 3441 4336 1229 -627 -1217 -1276 -1301 -1925 -1859 -1192 -841 -1841 -3094 -2424 700 473
589 473 -1496 -108 1743 1539 1549 2859 3720 2607 1290 1574 -120 -1500 -191 -1803 -4588 -3523 -2723
606 -2723 -2749 -1068 749 986 1219 2315 2242 650 2168 4056 702 -1923 625 1301 -1042 -758 300
623C00o61j384k19O93J50Q68J50j830K31L050l90j016J797J486j826j341J017
640A075O12j793q29Q13j614r20J824L75r58J771N13q94k46J134K8n81N44l14k096
659a556J066K885k225j425K241M47k520j35J250Q97j429p74P20J84L83M54p05
676b42O80J021j273j283J377J228j254j632Q77J621j658q1J697k50j143L78k47
693a84k61N79K89q93l92N75J4m23J333M35j936L36J963j597j266K158R32j925
711b63j010J329J524j188n55N12j74O3j199q04J598J166j637j110J499J429m18
728G62j688J505J514j948r49J223J35o55J85m14q6L83o6j93j6R93p69j478J337
747b25N98j701R52J547p80j178J343J527m93j630Q48M86j714q13K41O20K96j059
$$ plain form
623 300 -361 -1745 -1964 -1271 -1121 -253 -103 -1933 -1702 1348 958 -58 1739 3225 1399 58 1075
640 1075 1687 -106 -935 -122 -1736 -2656 -832 -457 -1415 356 869 -25 -271 863 891 310 854 540 -1556
659 -1556 -490 2395 170 -1255 986 1433 -1087 -1222 28 925 -504 -1278 -558 -374 9 463 -242
676 -242 438 1459 186 -1097 280 1508 254 -1378 -501 1120 -538 -619 1078 828 -315 63 -184
693 -184 -445 134 423 -470 -862 -287 -273 -696 637 1072 -864 -528 1435 -162 -1428 730 1662 -263
711 -263 -1273 56 1580 392 -163 349 175 238 -961 -1765 -167 999 -638 -1748 -249 1180 762
728 762 -926 579 2093 145 -804 419 554 -101 84 -330 -416 -33 -99 -292 -308 685 -84 -1562 -225
747 -225 373 -1328 -376 1171 391 -787 556 2083 1590 -40 808 1294 -420 -1233 -992 -372 -76 -1135
765a135q05J314J810q20j132Q27J803j329k278J808J735j547r63J090O11p7n93
782C19J48L81n16m50j055k10J032m45j601J623J134q69M00J922K34j185l97J147
800A612q36j368P09L81n31r15l95P22J087q33r13R32Q52o63j388Q86K299p86j689
819h37Q84K353o05j113M7L79N2j649q42L83jl74j088M16J840kr50J417J784r24
839A170p24N46O35j036m39P43n01j361N55K22l02j7k79l84Q55k10p10M99J123
858C85J91j022K24K409r4j792P47Q60r71j313l69O72k96j099l09L20Q18Q56j119
877i02K49K043l77j099L25J258l75p65k87P13m12p17O74k59p22L72l20l26J18
896h09L15j21L61K39j84L53O70O47j234pJ164m95j242n1N83l93n46n35R83J39
$$ plain form
765 -1135 -1940 -626 1184 364 -768 59 1862 533 -1745 63 1798 251 -712 378 989 912 319
782 319 467 848 332 -118 -1173 -1383 -351 -796 -2397 -774 360 -509 -109 1813 2047 862 465 1612
800 1612 776 -592 117 498 -33 -948 -1343 -621 466 -367 -1280 -348 504 -159 -1547 -661 1638 852 -837
819 -837 47 2400 1795 682 729 1108 1160 -489 -1331 -948 -949 -1323 -2411 -1995 -155 -157 -1107 310 2094 1170
839 1170 446 992 1627 591 152 895 394 -967 -412 -190 -492 -509 -788 -1172 -317 -527 -1237 -738 385
858 385 576 -446 -222 2187 2093 301 1048 1908 937 -376 -745 -73 -369 -1468 -1777 -1457 -639 217 -902
877 -902 -653 1390 1013 -86 239 1497 1122 357 70 783 371 -346 328 69 -653 -281 -601 -927 -809
896 -809 -494 -615 -254 -15 -199 154 824 1471 237 230 1394 899 -343 -394 189 -204 -750 -1285 -302 -163
916a63m25K00j0O86M28q73j83J366K22j390o5R23K34j457n7Q13l46k80J85k88
936d80K64N13j59m17K56L18K12n27L27K2p09K31K86p54K65R72l88n52k23Q19J0
957B86m26L37J24k95j38J72r4L30J87o74o27Q06J40n12l52L35O32o85n8O55K15
978C58K1L71m27L30J77k61m59j36M0j48j018R2P66m70N82Q6k03J57R34j06m03
999B83L39L86l60n96PN53n59J35m24j92j0J45k38k60K96K82n38j74J155Q81n52
1020E59K20J97k09K52J46o88q99M31m85l62o27Q40J22o08K33N84L47M99J87l72
1040C67K32j7k89q0L62K72l40j038N69L46j059J20L04p84j5L64k57N34O15K45
1060D51J06l77Q22K85n33J46l48m28n86o2o08M88K07Q6p61k40J456K72o01K05
$$ plain form
916 -163 -588 -388 -398 288 716 -157 -340 1026 1248 -142 -207 716 950 -507 -564 249 -97 -377 -192 -480
936 -480 -216 297 138 -279 -23 295 507 -20 307 329 -380 -149 137 -617 -352 620 232 -320 -543 276 286
957 286 -140 197 321 26 -112 60 -34 296 483 -191 -818 -12 128 -384 -736 -401 231 -454 -512 143 358
978 358 379 750 323 653 830 569 110 -26 14 -134 -1152 -1060 -294 -764 -182 -96 -299 -142 792 686 283
999 283 622 1008 648 52 59 612 53 188 -236 -428 -438 -293 -531 -791 -495 -213 -751 -925 230 1111 559
1020 559 779 976 767 1019 1165 477 -422 9 -476 -838 -1465 -625 -503 -1111 -878 -294 53 552 739 367
1040 367 599 582 293 213 575 847 507 -531 38 384 -675 -555 -251 -1035 -1050 -686 -943 -409 206 451
1060 451 557 180 1002 1287 754 900 552 124 -462 -524 -1132 -644 -437 -351 -1112 -1352 104 376 -225 -20
1080b0M10j95J2k1q0N08K27o20q42N09Q15p08m91K80K08q63M9N08M48j17p1n8
1102a12KO17N25n87k70O50o88o81M96L18n06K19m02j54M19K53M98m71m06K71K47
1123B38j81R3J71j9l86l46J69K84N46j94n20L3N47p25j52P86j04l20m06L12L08
1144A34K89l04k43o4k4J99m53M15Q05m56p54K53J19K93J83r1j13k95j19N21o48
1165c53M12J6k02l67j35P02K13k72l3l11N12L07J46m23K45L88p77n19M04L67l00
1186B0p79K18R5M6L43l29L31J33Q5l04K68O18J18p57J1P3J56n00M43R6l52o11
1208e78L26l67N0M53o8k34N2J40M70L73k54J08j73J78j89n37M60M16p50n55J67
1229e12M19k81j85L44N98o39J97J33J23M19j03p19L18L7M9l8r9K62O8o23j90N91
$$ plain form
1080 -20 390 195 207 186 106 614 841 221 -621 -112 703 -5 -496 -216 -8 -871 -822 -314 134 17 -54 -112
1102 -112 -110 507 1032 445 175 825 137 -544 -48 270 -236 -17 -419 -573 -154 99 597 126 -280 -9 238
1123 238 57 150 321 302 -84 -430 -261 23 569 375 -145 -112 435 -290 -442 344 240 -80 -486 -174 134
1144 134 423 119 -124 -188 -212 -13 -466 -51 754 298 -456 -203 -84 209 392 301 188 -107 -226 295 -353
1165 -353 59 75 -127 -494 -629 73 286 14 -19 -330 182 489 635 212 457 845 68 -451 -47 320 20
1186 20 -759 -541 -446 -400 -57 -386 -55 78 163 -141 127 745 863 106 117 190 346 -154 289 385 33 -578
1208 -578 -252 -619 -569 -116 -184 -418 -366 -226 244 617 363 471 298 476 287 -250 210 626 -124 -679 -512
1229 -512 -93 -374 -559 -215 383 -256 -59 74 197 616 513 -206 112 149 198 160 61 323 391 -232 -422 169
1251A69k41o1k11j03M1N68J22l10k5R3K17j86K55J4j49ml24j90J73K67j07l45
1273c37OM46l26l92N26O38o6n76r1J85J23m8k39J94K70j76k93K34N15l36l74k64
1295c81L64l60R0N02k45j26J67m3K0M0J42k46j56J29J00j52M44j45l8J43N9j02
1317B06l19J30L91k21o45L45J48k59j57K44M5K67k91L10j23L28r1ml82L68L2p55
1339d33M34k1o5j62r3J54N1J32%r6k97O77l94j44N28m2J9J9K28l14J17j88j20
1362a0o42N5M97l03j60K89K0L0R9J06K70ok30K63j89J97K50l42k16K83Om23k54
1385d10N31j89n16K13N3J90L6QK63k25L81n0N1Kq5L6j50k7j85j09K19k59j72J53
1409b41J49K6m69L08O17l69J55j04K88r3O7j08j82J36J32n22p5N65l24m97M75
$$ plain form
1251 169 -72 -133 -344 -447 -406 162 284 -26 -51 42 259 73 328 342 193 189 -135 -325 -152 115 8 -337
1273 -337 -331 115 -211 -603 -77 561 495 -81 -172 13 136 88 -151 43 313 137 -156 78 593 257 -117 -381
1295 -381 -17 -377 -287 215 -30 -156 11 -32 -12 28 170 -76 -232 -103 -3 -155 289 144 106 249 308 206
1317 206 -113 17 408 187 -458 -113 35 -224 -381 -137 -92 175 -116 194 71 399 308 304 -78 290 322 -433
1339 -433 1 -20 -85 -247 -340 -186 -135 -3 -3 -99 -396 281 -113 -257 271 229 248 267 495 181 298 110 -10
1362 -10 -652 -597 -100 -403 -563 -274 -254 -224 -125 -19 251 245 15 278 89 286 536 194 -22 261 267 -156 -410
1385 -410 121 -68 -584 -371 -318 -128 -92 -84 179 -46 335 285 336 338 253 289 139 112 -73 -182 37 -222 -394 -241
1409 -241 -92 -66 -535 -227 390 21 176 72 360 267 334 226 44 180 312 -210 -285 280 -44 -541 -66
1430f6K82l29j30K27L43k64O9k30J49j58L79k06k34P3J17lJ5K8j60P0L5J7n54
1453e30N87K09m04k78J47M74P3n23Q1N13l01l67M36j6k79ml38M58M80l35r6J76
1475A63L42p52R5j5M4O1k3k01KK42m14M56J97p4m6l8N1nk36L12O6k35J5r1L39
1500B55l91O7r6K3J59l82K06L77j55j08L3j66M86Q3j12l73K54M8l69k8K46j23
1522f6j79l72L57j51K81k9O9L95m69K87J3Q1L27k03l13p2m5j5L27j9k76k02K44
1545c0pJ8j11J19j0j70o9J89K67K44k50k6J70m30J17N2k1m03k40l5N12j21q1L
1569c13P0K19j69K54R5J81J01n63L36k20L12m78Q4L87k63k61J24P1O6j14j41M1
1591a81R7J58K0K30l12L63k83R9K75k62l09K50kk44k9N8K47m14J44j15J00P5P5
$$ plain form
1430 -66 216 -113 -243 -16 327 63 132 -98 51 -107 272 66 -168 -95 22 19 34 62 -98 -28 7 24 -530
1453 -530 57 266 -138 -416 -269 205 278 -245 -164 349 48 -319 117 101 -178 -182 -520 -62 418 83 -13 163
1475 163 505 -247 -152 -167 -123 -62 -85 -286 -284 -42 -456 0 197 123 77 39 90 85 -151 161 227 -8 7 -84 255
1500 255 -136 -69 -165 -142 17 -365 -159 218 63 -45 -12 -178 308 391 279 -94 160 208 -161 -189 57 -66
1522 -66 -245 -617 -260 -411 -130 -159 -90 305 -164 123 136 217 544 341 28 -44 -89 -104 223 204 -72 -274 -30
1545 -30 -37 -19 -130 -11 -21 -191 -260 -71 196 440 190 164 334 -96 21 73 52 -351 -591 -626 -114 -235 -316 -313
1569 -313 -243 -24 -193 61 156 337 438 -125 211 -9 303 -175 -91 296 33 -228 -104 -33 33 -81 -222 -181
1591 -181 -84 74 94 324 12 375 92 191 466 204 -105 145 143 -101 -130 -72 175 -239 -95 -210 -110 -35 40
1614D0J12L6l92L01k40M13K1j70L1l44N19l58q4M96o4k93j59k28K75J70o7k5n7
1637f7nK37j28K35n6j59j26K41j95K95J30k43j19k9J07p6k26K77j22Q9l46M8J97
1660d1n8K3k59M00o1J65J5j40KK16k84k5r8L04K8j49n5J62j08k88K2j1J66J85
1684A11k50K47O9j2k2m4J20k15P7O0j56r4K66k42j11J66j80k4N9L7K17j18p3L8
1708g4J23o4R2K9k11Q0J88K62m80O1qj29n5p8j00M04k90J38j60J97K06j59q0J25
1732A7K00j51l3l44K57J63k49L7M69j00m85K8J12K39m77M22k62O3j1p1K32l9P5
1755I2j63K41m1K1l16K26k14J35J35k19P9j42k36O10m78j10L41K58q2p1j66J23
1777B3J0j37N0K58l54K29j22N9m5L42n82L26j53J02j72O1P8m2K16l89K13J1n5
$$ plain form
1614 40 152 188 -204 97 -143 270 291 121 152 -192 327 -31 -115 381 317 24 -135 -363 -88 82 15 -10 -67
1637 -67 -72 165 37 272 216 57 -69 172 -23 272 402 159 40 11 118 42 -184 93 -29 60 -286 -238 -41
1660 -41 -99 -76 -335 65 4 169 184 44 46 262 -22 -47 -145 159 187 38 -17 145 37 -251 -229 -240 -74 111
1684 111 -139 108 177 165 143 99 219 4 81 141 -15 -109 157 -85 -196 -30 -210 -234 -175 -138 79 -39 -112 -74
1708 -74 49 -15 77 106 -105 -25 163 425 -55 6 -2 -131 -186 -264 -364 40 -250 -112 -272 -75 131 -28 -108 17
1732 17 217 66 33 -311 -54 109 -140 -103 366 266 -219 -191 -79 160 -317 105 -157 -94 -105 -176 56 17 92
1755 92 -71 170 129 150 -166 60 -154 -19 116 -103 -24 -166 -402 208 -270 -380 -39 219 137 66 -100 23
1777 23 33 -104 -54 204 -150 79 -43 16 -29 313 -269 57 -96 6 -166 -105 -27 -69 147 -242 -29 -18 -73
1800g3M4K9M0j17K79n4ln2j36J66j90J03j0k74M08l18J03l10M58j84p0J11M12
1823C62l44l7L88l13j11l9N1r8M4J5Ll9l4N7p2K17j96K98J28l16J64k14O2L68
1847C44o51M51J4l00J91p3J27N1m07J30Q4j02J8m5Q8J03P9r6J85k22K80j57N1
1870A43J00k14J06k42j9M2l1o4L18k85M08k81k69l3N03j05q5J51j51K2N6J31m83
1893b82N54l48L12j44J02k54j14j47K96l63O7j2K41L69l35L08N9k56J06j97l2
1914g0j94K26J89k97K06k08j05L10J04j40l7LQ8j54J72m3k20J75N0R8L8l49K93
1937A35l3L56n65Kj37M33j05l76J80J42j03j61J72q4K08k27J77K22j79j44Q0k22
1959b29MK91r8n8K86l8J16l46K09j21j39J54k22p2J99J28m88L26J16K4K61l55
$$ plain form
1800 -73 -29 0 40 -77 202 148 145 93 -43 123 -67 36 26 -248 160 -158 -55 -365 93 -91 -161 -50 362
1823 362 18 -19 369 56 -55 -94 -43 -141 -97 -82 -79 -118 -152 -95 -167 50 -146 152 280 -36 128 -86 -24 344
1847 344 -307 144 158 -142 49 -24 103 154 -253 -123 -39 -141 -123 -168 -80 23 102 6 191 -31 249 92 143
1870 143 243 29 135 -107 -126 -84 -115 -179 139 -146 262 -19 -288 -321 182 77 -8 143 -8 14 70 201 -282
1893 -282 272 -76 236 92 194 -60 -174 -321 -25 -388 -321 -333 -92 277 -58 250 309 53 159 -38 -70
1914 -70 -264 -38 151 -146 60 -148 -253 57 161 21 -16 -13 75 -79 93 50 -170 5 55 153 191 -158 135
1937 135 102 458 -107 -105 -242 191 86 -290 -110 32 -71 -232 -60 -144 64 -163 14 236 57 -87 -7 -229
1959 -229 -225 66 -32 -90 196 158 274 -72 137 16 -123 31 -191 -263 -64 64 -424 -98 18 42 303 -52
1981e2m8L75m15K65k23J37Lk07L15n55O24l82l4O6P3N5o9R2k60J45J97p1j05K04
2005A30J44m0k23J1J80j38j08M6k44P4j71N28k20j89J59o2L06j42J64J12k81N4
2027I0J09l12j20J95J96p4p4l8k4ok11K31k00K38K03l03J27Kq9J9p4K76J11j92
2051H0n0m5J68j71Q9k20J09q4n5q5M06j27J18j03K08k9k57J71p0j83%J74j69j34
2075b59K55M1l38R2O9M1J50j27J6K17k90J19P9lk41N57j21m08Q9j6J66m1M5l1
2099F1J1j7j22O2N7l44L10n6k23L8K71k9k04K96o2q0l3J29K62L9j25k90N5K12
2123B18lk66J33j92K05J17j50j69k87K98j87L12p4P7j40j10M22J57k92J10j70
2144IJ25o6l3nqj44J31o2j29K01Qj17N9Q0o9K44k10K0k0K58m49r3JL32l19N4K62
$$ plain form
1981 -52 -100 275 -140 125 -98 39 42 -165 150 -405 219 -163 -197 -131 -58 -3 -72 20 -240 -95 102 31 -74 130
2005 130 274 234 11 22 202 64 -44 2 -242 -168 -339 189 -31 -220 -61 -123 183 41 205 317 36 90
2027 90 199 -113 -233 -38 158 84 10 -28 -52 -58 -269 -38 -238 0 203 -100 27 29 -60 -41 -115 161 272 80
2051 80 30 -15 153 -18 71 -149 -40 -124 -179 -264 142 15 133 30 238 209 -48 123 53 -130 -130 44 -125 -259
2075 -259 -4 37 -301 -209 -140 -99 51 -76 -60 157 -133 -14 65 62 -179 378 257 -151 -62 -78 88 47 92 61
2099 61 72 55 -67 -5 52 -292 18 -38 -261 -223 48 19 -185 111 49 -31 -64 65 327 366 241 -49 6 218
2123 218 215 -51 82 -110 95 212 62 -107 -394 -96 -283 29 -45 32 -108 -218 204 361 69 179 9
2144 9 134 68 35 30 22 -122 9 -53 -182 19 27 -90 -31 49 -20 224 14 34 14 272 -177 -270 -269 63 -256 -202 60
2171F0k07P8RK36k17J43K4r3M09j04M4l89J83l09M21k71m1J1j71L06j82J83p8
2194D5r4K07k23J20K64k35J04j13J91j29k71L88l17K12j60j73Q4J69M1M4l37m
2216a87L8K73k93PK61m7J54p5j47J00nk13o5O1J51pj21j34K39J0j03R0o7J47M2
2241A09k7j97J37JR5j42J25j07J58j90K8K09j49J41k62J30j10k15O58m74J38j46
2263i0J85k33J06J73m67J50K76m30K87J48Q3J7r4M2m09K40M7r0J51K56j97Q6m24
2286a87L13j13J06l57L49k88J98k7J30k03J34k11K40L4J0m6M4J35k98Q3O4Nj87
2309g2j28J41m3L2j3J37k4om0K02k56J56j90J25L40l63L43m44J62n9r8J03n3r4
2333a42j08L39j96j30M02j62k4O2k45J61J06m7K5n3J80J14m89J8L58k95k3N1J98
$$ plain form
2171 60 -147 -69 -60 176 -41 102 126 33 442 338 382 -7 176 -133 288 17 -24 -13 -184 122 -60 123 45
2194 45 -49 158 -65 55 319 84 188 75 266 137 -134 254 -63 149 -11 -184 -100 69 110 154 -183 -187
2216 -187 -149 124 -169 -162 99 52 206 131 -16 84 79 -134 -199 -138 13 6 -115 -249 -10 0 -103 -13 -80 67 109
2241 109 82 -115 22 23 118 -24 101 -6 152 -38 -10 199 50 191 -71 59 -51 -266 392 -82 56 -90
2263 -90 95 -138 -32 141 -326 -176 100 -330 -43 105 188 205 111 153 -256 -16 31 -59 92 348 151 237 -187
2286 -187 126 13 119 -238 111 -177 21 -6 124 -79 55 -156 84 118 128 82 126 261 -37 46 110 115 -72
2309 -72 -200 -59 -102 -70 -83 54 30 24 -16 186 -70 86 -104 21 361 -2 341 -103 59 0 -98 5 -48 -142
2333 -142 -250 89 -107 -237 165 3 -21 41 -204 -43 63 16 41 -12 168 282 -207 -189 169 -126 -149 -98 100
2356A00l21J37j3J64K62m28o4M23l22J9j59K61l1k70K14j9k35L11l09K35K66k06
2378A5J88m5k86J69K23k12j39Q1K2l56K50Q4L8o8K86n15K23N4n4q3K03J62m3l27
2402a30J58j04P4qM0k43M70K3l20k25J52K07m51K31L1P1R6Kj54J21J00k52L16
2425B05l91K93J1q6pO3j6j11J06P1j08J65l70K05M9J00k66n9jL7J88j24j19R2
2449g3K05j02J29k47R5P5M8k18K68j92M7JJ9jK10k88r1n4M8L5L68n12J17L3k40
2474c20K7J10J48jpl2L2m2K73k47K67j77j85R2k03K29j01L54l44j46J93P0j5m1
2498f6K44k6kj26l6k58L18j69K7m4Q8k86L12n5L09J8j72m87K45J30L3N0k02J25
2522c0k1R2J17j25k48M23l27L41j15l81J12J74p0L4K4p0M6r3K00o1m24L64K45
$$ plain form
2356 100 -221 -84 -97 67 329 -99 -163 260 -62 -43 -202 59 28 -242 -28 -47 -282 29 -280 -45 221 15
2378 15 203 158 -128 41 264 52 -87 -6 16 -340 -90 -6 32 -36 250 -265 -42 12 -42 -125 78 240 197 -130
2402 -130 28 -76 -2 -10 30 -213 257 280 -40 -265 -113 94 -357 -126 -95 -24 72 74 -80 41 141 -111 205
2425 205 -186 107 118 32 25 88 72 -39 67 138 30 195 -175 30 79 179 -87 -146 -147 -110 78 -46 -165 -73
2449 -73 132 30 159 -88 7 82 130 -88 180 -12 35 36 55 54 264 -24 -115 -169 -121 -86 282 -230 -113 -80 -320
2474 -320 -293 -183 -35 -36 -43 -75 -43 -85 188 -59 208 31 -154 -62 -265 -36 -137 217 -127 -273 -80 -10 -25 -66
2498 -66 178 152 150 24 -12 -270 48 -121 -94 -138 -50 -336 -24 -79 230 248 76 -411 -166 -36 -3 47 -155 -30
2522 -30 -51 41 158 33 -215 208 -119 222 107 -274 -162 12 -58 -24 0 -70 -24 -117 83 22 -402 -38 207
2545B07m81J75M3J46k1j27K34l65KnK65N1J22k54j23J65j52K74q8j02q0m5K76
2568A17J31k07kn0o8J69j2o3m2k54J80K3L1NQ1Jk8L52n20L40j83p8J18K0P7j03
2594C5n3R0P6k74J01p6J1K53k5k86k1L74k99o5L63k55Q1j41k9J13o5P9j01K6P9
2619ij58n9JJ43M8p3j44K23n9K8J48j88K1J61n6K90k68j6k33L18k68n6K43k58
2643b21K13OJ00n5p4n0L9LK09l44M36m42K21j1k02J37N9J49p5m42K79K34k42M0
2667c3l5O3J21K0l04L0K58k08k57J64J60j2r8K19m7j39J19K2k7J1k30K01k64L57
2691I1j6p5NR0J57P5l3j71%l68J43n1j2K35r2L17n47M54j93N3O0l02K22m5J80
2716A77j66N7j3R3Q1m47O1M41j50nJ5j82K14k68j70K87J6p6J39Q3Oo4m4q1j04
$$ plain form
2545 207 -274 -99 -56 90 69 -58 176 -189 -187 -192 73 124 246 -8 -131 34 -118 156 68 -34 -114 -159 117
2568 117 248 41 39 -11 -79 90 78 15 -27 -281 -101 -78 -47 -42 39 40 12 364 -156 184 1 -77 41 61 138 35
2594 35 -18 72 148 -126 -25 -101 -90 163 138 -148 -169 205 -94 -159 204 -51 30 -111 -140 -27 -92 -13 -114 -88 -9
2619 -9 -167 -226 -225 -82 -34 -107 -251 -28 -87 -59 89 -99 -78 83 27 317 49 33 -200 118 -150 -206 37 -221
2643 -221 -8 -2 98 43 -31 -81 -42 -39 170 -174 262 -180 41 30 -172 -35 24 173 98 -344 -65 169 -73 -33
2667 -33 -68 -5 116 136 -168 -138 120 -88 -345 -181 -21 -33 -131 88 41 -98 21 43 16 27 -203 -2 -266 91
2691 91 75 0 5 95 252 327 294 123 123 -245 -102 -153 -165 70 -22 295 -252 202 9 62 122 -180 42 -3 177
2716 177 11 68 55 148 229 -218 -157 284 134 129 144 -38 176 -92 -262 25 41 -35 104 187 193 129 85 4 -100
2741a00Q7K5oo5O0J64J52m96J55N8p0r0M80p2k48M0j73k2L96j46p3J17k02k00
2765b29L79j83K76j23k85K84k43K83k23j23j15K07Q7K5k1j60N28n04L10j84P0
2786E6j09J65m00K21j15L64k9P9m1l22J43l09O29m63M2l2P2R1j1Q3j49J40q1r8
2810g4J10J08j30p1J38k93K32j62J08k41L46j4k31j7K85O2l68K58j53q3K44J36
2832A90j76j63L65j84J66k14O9o2J5j60K39o4J54j23n6J73l06P1k15L51k30M37
2854B77J16l42J47l15K20r6n5k74M82j9k6j95j74J44K31J4j31j44j38J81Pm4J90
2877E6j57L05Q3l07J40N5j34p9l66K51J94Ml8J71j53j29pJ0k7K8J12l3J92l14
2901a43K35j27J75j87o6R8j05K14j39Q3N8j01R3O4q2n4j30K16JQ1j57m1K63q6
$$ plain form
2741 -100 -13 12 6 -59 1 165 317 -179 -24 34 -36 -126 354 282 34 74 -99 -121 275 129 56 173 -29 -229
2765 -229 150 -33 243 120 -165 119 -124 159 -64 -187 -302 -95 -8 17 -4 -164 364 -140 170 -14 56
2786 56 -53 112 -288 -67 -182 182 153 232 191 -131 12 -297 332 -131 -89 -121 -49 42 31 114 -35 105 24 -74
2810 -74 36 144 14 -57 81 -212 20 -142 -34 -275 71 57 -174 -191 94 156 -212 46 -107 -190 54 190
2832 190 14 -149 216 32 198 -16 53 -9 6 -154 85 21 175 52 -4 169 -137 -66 -281 70 -160 277
2854 277 393 51 198 -117 103 7 -48 -322 160 141 115 -80 -254 -110 121 135 4 -140 -278 -97 -90 -134 56
2877 56 -101 204 287 -20 120 175 41 -38 -404 -153 41 45 7 178 25 -104 -111 -101 -128 -100 12 -21 171 -143
2901 -143 92 -35 140 -47 -113 -15 -120 94 -45 38 96 -5 88 152 70 16 -114 102 103 184 27 -14 249 163
2925A63k29q1M1L25l73J97M6J02j2l86k6O2JL81l6m74L97J11j69p5Q6J05%L0j56
2950C0k46J83K1k03L17k07Qj2K19k52j42L32k06L24j16k29J64J88L5k76j59L44
2972A17j76J73o3J17j23l48L38J60l09J58K88o32M96l66K08Nn0K42r4k45K30j51
2994b5N1K01l78J11K0M3J15j71PpJ71k25K23N6l45K95Qn3O4k59JK04J54l68P4
3019c3Kj13P1J47j36K68m24K39J2O3M5j35qj97L38K9k41L00m30M29k76N2n9j6
3043g3K02j24l7k47J71j8L35j31j11J2R5j35O2L34m38j07J23l6L39j54j66M3J67
3066A06k24K55q3m8N2N1l2l20K30j89K80j55j00J76J30p5k71L04k6k38J8Q8Q9
3089A8q1J45l4M9l52M72k00k2p5l6J84j85mJ16K84k11j73R2l4Q5N1J48k50k28
$$ plain form
2925 163 -66 -147 -106 219 -154 43 89 191 179 -207 -233 -171 -170 211 175 -299 98 209 40 -35 51 156 156 186 30
2950 30 -216 -33 -12 -215 102 -105 -97 -109 110 -142 -284 48 -158 166 50 -179 -15 173 208 -68 -227 117
2972 117 -59 114 51 168 45 -303 35 195 -114 44 332 -300 196 -170 38 43 -7 235 141 -104 126 -25
2994 -25 26 227 -151 -40 -20 23 138 -33 -26 -33 138 -87 136 192 -153 142 150 97 161 -98 -97 107 261 -107 -33
3019 -33 -31 -144 -73 74 -62 206 -218 21 33 96 141 6 -2 -199 139 168 -73 227 -203 226 -50 2 -57 -73
3043 -73 129 5 -32 -279 -108 -126 209 78 -33 -21 74 -61 1 335 -103 -210 -87 -123 216 62 -104 -61 106
3066 106 -118 137 54 6 58 109 77 -243 -13 -202 78 -77 -177 -1 129 54 -217 87 61 -177 -159 -71 18
3089 18 -63 82 48 97 -255 217 17 -5 -80 -116 68 -117 -121 -5 279 68 -105 -13 -47 38 89 237 -13 -241
3113b41N7K22j86l6K64j07K00o0k88K36n5j6L0L3R7K00j30O5l48j3P3k38J61L01
3137B21l25K36o0k26pK11r4k05L10l2k35J87J78j42J65k20N2J27k38j07J64K3
3159a7L41Nj41r9K9N5j66p9K38l6J16k1k60J29k12J64Jm08M82k44J32j18Q4nJ51
3184A21k41K96k90q2R9J60j99J77j9l8J31l41J63oj51Q5K24j06J45j88j05K93
3206A28j23n7J2j06M07j48r0J13l58l4K20o3k55J12L71l3m4j44K71l52J09N1Q9
3229G6k05Q3jo2J62M0p8j53q9K58M2K3R7l99N4l4K6N3R0Pk71N25k77l20M33j92
3255a12r9L71j48n4Q3M5k27K19k7K0k69L78m03J7M41k82o5P4J46m19K74j4L22
3278B71j87k00K55j84n7k75L66n4j15J81k00J05K31K8m22J71J97P1k60j79L95
$$ plain form
3113 -241 -184 38 -148 -184 80 -27 173 113 -175 61 6 -10 20 53 150 350 220 285 -63 -76 -3 -241 -80 221
3137 221 -104 132 72 -154 -161 50 -44 -249 61 29 -206 -19 159 17 182 -38 14 141 -97 -204 -40 -17
3159 -17 324 329 188 89 118 173 7 -72 166 130 246 225 -35 94 -118 46 47 -361 121 -123 9 -109 -25 -30 121
3184 121 -120 176 -114 -196 -97 63 -136 41 22 -16 115 -226 -63 -69 -220 -135 89 -17 128 -60 -165 128
3206 128 5 -52 -40 -146 261 113 23 136 -222 -256 -36 -99 -354 -242 129 96 52 -92 179 -173 -64 -13 76
3229 76 -129 -46 -47 -109 53 93 15 -138 -227 31 73 96 193 -206 -152 -186 -160 -107 -17 -10 -281 244 -33 -353 80 -112
3255 -112 -211 160 12 -42 41 86 -141 78 51 71 -198 180 -223 -206 235 -47 -112 -38 108 -311 -37 -51 271
3278 271 84 -116 139 -45 -102 -377 -11 -65 -180 1 -199 -94 137 165 -257 -86 111 182 -78 -257 138
3299A38j77j19N7J85p2n4K4k00K43J07j84j92J47K17o6Q9P0j55Jj87M70k52K3
3322A13j48j89J19J04l7K8J32r4m71O10l6j07l1N8j53M1J3k2J09j65M4j15K40
3345D3o0J76r0l43K69k20K35M1j60J71q3j39K44J41m01J18k4J23jO8p4j65L54
3368B23j4j84JN4k76K14J36l17J74J04j56k0p4L7J06j83L4K63o7k04L19l25N9
3391i6J50J56l47K11p4K43k54j2k34Q1K24N8j00p1R9j28RJ11K4l53M15j88K48
3414A72q7N8J6o6q9m2noR6p0J06J5j28o1J02R4m11K69j2K04k67J86m8J8j70L75
3440B49k65K21j97j22K19l25M3L27j2k5j21lJ60k56K5K1j70M0R8J35j49J21q7
3463g3K81Q2j38Kj7n7k29j41J4J68L86k7m96L30J32k55M1J69J67m58K04k14L13
$$ plain form
3299 138 -39 -158 -101 84 12 -42 -18 -218 25 132 -52 -244 -97 120 54 143 213 58 59 -128 342 90 113
3322 113 -35 -224 -105 -1 -38 -10 122 28 -443 167 131 24 -7 51 -102 -61 -48 -70 39 -126 -82 -197 43
3345 43 -17 159 69 -274 -5 -225 10 51 -109 62 -21 -160 84 225 -176 -58 -82 41 40 108 34 -131 223
3368 223 209 25 26 80 -196 18 154 -163 11 115 -41 -61 -135 -98 8 -175 -141 122 55 -149 170 -155 -96
3391 -96 54 210 -137 74 0 243 -11 -23 -257 -176 48 106 6 -65 34 -94 -85 26 50 -303 112 -76 172
3414 172 85 143 159 93 4 -38 -43 -49 47 -23 83 98 -30 -91 11 105 -306 -37 -49 155 -112 74 26 44 -126 249
3440 249 -16 205 8 -114 105 -220 -177 150 138 113 -8 -11 149 -107 -82 -61 -231 -191 -93 42 -107 14 -73
3463 -73 208 290 152 154 137 80 -149 -290 -276 -108 278 251 -245 85 217 -38 3 172 339 -119 85 -129 184
3486A84l85K11L9PN0Q3l20N6P2j60K02k22K98k33K4K20k23OJ31r4j60K12m1j62
3510b05N56j85Lk86o1K23m08J93J75r0R2o8L28k23qj84J07K22k79K46k9J32J1
3533B62k13m5O0o1k66K42j92M04j42j0P6j59R0o3K44k33NP1R9k46j3J21qkMj07
3559h2K50j22J00r3k0j04r7j17K30RQ0j63K68j33O1j43J05k0m5J93j88j80N3K68
3583A10j64m4J2K07r8J06K3p5l23n1M08j20j27QL58l19N9j31K78k16r8J61m1J77
3607A00k35K80k03J46m9j56pK31n8K0L9j96K03j69N9J12n8l5P6k05L2j89M22m57
3631b97K35K02m00K40L06k25K32m50K17J47j97L48l12j21r6J13K62j43J54k39
3651b4P9j40M7N7N6Q3n1j25k8r5J51q6J72l25K05j3J95k59k3n6M4J88K74l63L67
$$ plain form
3486 184 -201 10 49 56 106 189 -131 -75 -3 -163 39 -183 115 -118 -94 126 -97 -91 40 -54 -214 -2 -43 -205
3510 -205 351 166 169 -117 -178 45 -363 -170 5 -85 7 -61 267 44 36 -148 -41 181 -98 148 119 251 262
3533 262 49 4 64 3 -263 -21 -213 191 49 39 115 -44 46 -17 227 -6 -1 70 169 -77 -90 31 23 21 25 -82
3559 -82 168 46 146 53 33 -71 -168 -285 -55 -46 34 -129 139 6 67 -76 29 9 -36 157 -31 -211 -158 110
3583 110 -54 -98 -86 121 23 129 152 77 -246 -297 111 -9 -136 -128 230 -89 -30 -161 117 -99 -197 -36 -77 100
3607 100 -135 145 -58 88 39 -117 -124 107 49 69 108 -88 115 -54 5 117 59 24 100 -105 -73 -262 160 -297
3631 -297 -62 140 -260 -20 286 61 293 -157 60 207 10 358 46 -75 -171 -58 204 61 215 -24
3651 -24 55 -85 -38 19 75 158 107 -18 -46 -141 10 -76 96 -229 -24 -37 158 -101 -124 -180 -136 52 326 -37 330
3676C30l94L16k25j15Q8j24J82P6k62m2L44k25J09l1K1O1j81K5P0K3J22m82K16
3699i8J92j77M06k04j73j43j26N99n39L08p2Q2o4jn4j51J31p8K90k61J45q1j63
3722b32Q8J37k27K18P8l23K15J04k14J75J76k92J05j08R5o1qK10m13M81k84r5
3744a75J55R3M3j09n9j20J86n2p0k8K49l1l53L36j32K9J84j07k37lL87l54J33
3767c5j35L52j84k8J05l44K17j0R8K53n3m5j90l18J05J50K16k3k36J03K17l63
3789a48n1J59k9K52J1l74L24j60j08J92j35l6J08j42J27J53j01k3J47l90K43K14
3811B33k63nJ29M0M9j07k1n9q7J50l44M91m70K89J8j72J24r9k4K2K64k66J00J13
3835A05P2j51J02n9O9q8n2K13k17o6L4L49l89l5K72p4j13k8K16k92J08j53J97
$$ plain form
3676 330 -64 252 27 -88 0 -124 58 134 -128 -170 174 -51 58 27 48 109 -72 -47 23 46 168 -314 -98
3699 -98 94 -83 323 119 -54 -197 -323 276 -263 45 -27 55 -9 -10 -64 -215 -84 -162 128 -133 12 -69 -232
3722 -232 -144 -7 -234 -16 62 -261 -46 58 -156 19 195 -97 8 -100 -5 -66 -74 136 -277 204 -80 -175
3744 -175 -20 73 116 7 -52 -172 14 -38 -108 -136 113 82 -271 65 -67 -38 146 39 -198 -201 186 -168 -35
3767 -35 -170 182 -2 -30 75 -269 -52 -62 36 289 236 191 1 -317 -212 -62 154 131 -105 -2 215 -148
3789 -148 -199 -40 -69 183 194 -180 144 -16 -124 68 -67 -103 5 -137 -10 143 42 19 166 -224 19 233
3811 233 -30 -35 94 134 183 76 55 -4 -91 59 -285 206 -264 25 43 -129 -5 -104 -128 -106 158 -108 -8 105
3835 105 177 26 128 69 138 50 -2 211 -6 -72 -38 311 -78 -113 159 85 -28 -56 160 -132 -24 -177 20
3858B0j28M13k68k04K57l8j65L6o4J28j84J28R1j79qL57j28n5J15l03L13j04K94
3881C24l68j39M6K90J84o27M36o9p9J00j97j0J38K12k28Oj05l5m3L92j57J84k17
3904C8O5j52k8j80K13j31J72O3j68Oj91L87j91NK08l22L0P1j1J6J25j28J80j38
3928f1K00O7j81K30k19o1J93j75J55o6j29O3j32J77j82K70j45K0k1p0k58P05o58
3951b78L69k18r6J08R8K16k78K67n0j62n8K8r3RN6J74k80r2N05m3k16j33j8K08
3975B3J04k47%L20r6j98J35j66m9L01j63q0Q5j35J4k8M32l01M5J57m55K04N5L2
3999a1j42K43l13O1J90j72O2M49k75k04O7oJ38k00K41j99O9P1Q3p5J77k42J17
$$ plain form
3858 20 -108 305 37 -167 90 52 -113 -77 -141 -13 -197 -69 22 -157 -165 192 64 9 124 -179 134 30 324
3881 324 -44 -183 -137 153 337 -290 146 77 -2 98 -99 -109 29 241 13 19 -86 -121 -164 228 71 255 38
3904 38 103 -49 -77 -257 -44 -175 -3 60 -108 -102 -293 94 -97 -92 116 -206 -176 -105 -116 -100 25 -103 77 -61
3928 -61 139 206 25 255 36 -25 168 -7 148 82 -47 16 -116 61 -121 149 4 24 3 -67 -325 380 -278
3951 -278 91 -127 -223 -115 -17 199 -79 188 138 -24 -82 -54 -147 -138 -82 92 -188 -280 225 182 -34 -167 -185 23
3975 23 127 -120 -120 200 104 -94 41 -125 -174 127 -36 -116 -31 -166 -152 -180 252 -49 -4 153 -302 -98 -43 -11
3999 -11 -153 90 -223 -162 28 -144 -82 367 92 -112 -45 -51 87 -113 128 -71 -2 69 152 77 254 12 129
$$ [...]
8191A75
##END NTUPLES=NMR FID
##END=
