##TITLE=1H_DE-95_oil2_TFA
 200.13MHz, CDCl3,
 8 sc
 
 5.8.2025
##JCAMPDX= 6.0         $$ Bruker NMR JCAMP-DX V2.0
##DATA TYPE= NMR FID
##DATA CLASS= NTUPLES
##ORIGIN= UXNMR, Bruker Analytische Messtechnik GmbH
##OWNER= pz
$$ XWIN-NMR		Version 3.5
$$ Tue Aug  5 14:35:54 2025 Russian Standard Time (UT+4h)  she@DPX200
##.OBSERVE FREQUENCY= 200.1313
##.OBSERVE NUCLEUS= ^1H
##.DELAY= (6, 6)
##.ACQUISITION MODE= SIMULTANEOUS
##.ACQUISITION SCHEME= undefined
##.AVERAGES= 8
##.DIGITISER RES= 18
##SPECTROMETER/DATA SYSTEM= spect
##.PULSE SEQUENCE= zg30
##.SOLVENT NAME= CDCl3
##.SHIFT REFERENCE= (INTERNAL, CDCl3, 0, 14.3821)
##AUDIT TRAIL= $$ (NUMBER, WHEN, WHO, WHERE, WHAT)
$$ ##TITLE= Audit trail, XWIN-NMR		Version 3.5
$$ ##JCAMPDX= 5.01
$$ ##ORIGIN= Bruker BioSpin GmbH
$$ ##OWNER= she
$$ F:/spectra/data/she/nmr/H-C/1/audita.txt
$$ ##AUDIT TRAIL=  $$ (NUMBER, WHEN, WHO, WHERE, WHAT)
(   1,<2025-08-05 14:34:23.54 +0400>,<she>,<DPX200>,
      <created by zg, POWCHK disabled, PULCHK disabled
       configuration hash MD5:
       00 E9 B6 7A A2 85 ED C7 34 08 36 98 17 FE 4E 26
       data hash MD5: 16K
       93 34 08 CC C9 AF 84 D5 49 36 57 BC 81 D9 91 75>)
$$ ##END=
$$ 
$$ hash MD5
$$ 2A DE A4 25 7F FE 7C 89 7A 38 B5 13 F0 38 5D A8
##$RELAX= 
##$RELAX= 
##$RELAX= 
##$RELAX= 
##$RELAX= 
##$RELAX= 
$$ Bruker specific parameters
$$ --------------------------
##$DU= <F:/spectra>
##$EXPNO= 1
##$NAME= <H-C>
##$PROCNO= 1
##$TYPE= <nmr>
##$USER= <she>
##$AMP= (0..31)
100 100 100 100 100 100 100 100 100 100 100 100 100 100 100 100 100 100 
100 100 100 100 100 100 100 100 100 100 100 100 100 100 
##$AQSEQ= 0
##$AQ_mod= 1
##$AUNM= <au_zg>
##$AUTOPOS= <>
##$BF1= 200.13
##$BF2= 200.13
##$BF3= 200.13
##$BF4= 200.13
##$BF5= 200.13
##$BF6= 200.13
##$BF7= 200.13
##$BF8= 200.13
##$BYTORDA= 1
##$CFDGTYP= 0
##$CFRGTYP= 5
##$CHEMSTR= <none>
##$CNST= (0..31)
1 1 145 1 1 1 1 1 1 1 1 1 1 1 1 1 1 1 1 1 1 1 1 1 1 1 1 1 1 1 1 1 
##$CPDPRG= <>
##$CPDPRG1= <>
##$CPDPRG2= <>
##$CPDPRG3= <>
##$CPDPRG4= <mlev>
##$CPDPRG5= <mlev>
##$CPDPRG6= <mlev>
##$CPDPRG7= <mlev>
##$CPDPRG8= <mlev>
##$CPDPRGB= <>
##$CPDPRGT= <>
##$D= (0..31)
0 0.7 0 0 0 0 0 0 0 0 0 0.03 0 0 0 0 0 0 0 0 0 0 0 0 0 0 0 0 0 0 0 0 
##$DATE= 1754390062
##$DBL= (0..7)
120 120 120 120 120 120 120 120 
##$DBP= (0..7)
150 150 150 150 150 150 150 150 
##$DBP07= 0
##$DBPNAM0= <>
##$DBPNAM1= <>
##$DBPNAM2= <>
##$DBPNAM3= <>
##$DBPNAM4= <>
##$DBPNAM5= <>
##$DBPNAM6= <>
##$DBPNAM7= <>
##$DBPOAL= (0..7)
0.5 0.5 0.5 0.5 0.5 0.5 0.5 0.5 
##$DBPOFFS= (0..7)
0 0 0 0 0 0 0 0 
##$DE= 6
##$DECBNUC= <off>
##$DECIM= 32
##$DECNUC= <off>
##$DECSTAT= 4
##$DIGMOD= 1
##$DIGTYP= 9
##$DL= (0..7)
0 120 120 120 120 120 120 120 
##$DP= (0..7)
150 150 150 150 150 150 150 150 
##$DP07= 0
##$DPNAME0= <>
##$DPNAME1= <>
##$DPNAME2= <>
##$DPNAME3= <>
##$DPNAME4= <>
##$DPNAME5= <>
##$DPNAME6= <>
##$DPNAME7= <>
##$DPOAL= (0..7)
0.5 0.5 0.5 0.5 0.5 0.5 0.5 0.5 
##$DPOFFS= (0..7)
0 0 0 0 0 0 0 0 
##$DQDMODE= 0
##$DR= 18
##$DS= 0
##$DSLIST= <SSSSSSSSSSSSSSS>
$$ [...]
##$SUBNAM0= <"">
##$SUBNAM1= <"">
##$SUBNAM2= <"">
##$SUBNAM3= <"">
##$SUBNAM4= <"">
##$SUBNAM5= <"">
##$SUBNAM6= <"">
##$SUBNAM7= <"">
##$SUBNAM8= <"">
##$SUBNAM9= <"">
##$SW= 18.0517328524113
##$SWIBOX= (0..15)
0 0 2 0 0 0 0 0 0 0 0 0 0 0 0 0 
##$SW_h= 3612.71676300578
##$TD= 16384
##$TD0= 1
##$TE= 0
##$TE2= 300
##$TE3= 300
##$TEG= 300
##$TL= (0..7)
0 120 120 120 120 120 120 120 
##$TP= (0..7)
150 150 150 150 150 150 150 150 
##$TP07= 0
##$TPNAME0= <>
##$TPNAME1= <>
##$TPNAME2= <>
##$TPNAME3= <>
##$TPNAME4= <>
##$TPNAME5= <>
##$TPNAME6= <>
##$TPNAME7= <>
##$TPOAL= (0..7)
0.5 0.5 0.5 0.5 0.5 0.5 0.5 0.5 
##$TPOFFS= (0..7)
0 0 0 0 0 0 0 0 
##$TUNHIN= 0
##$TUNHOUT= 0
##$TUNXOUT= 0
##$USERA1= <user>
##$USERA2= <user>
##$USERA3= <user>
##$USERA4= <user>
##$USERA5= <user>
##$V9= 5
##$VALIST= <valist>
##$VCLIST= <CCCCCCCCCCCCCCC>
##$VD= 0
##$VDLIST= <DDDDDDDDDDDDDDD>
##$VPLIST= <PPPPPPPPPPPPPPP>
##$VTLIST= <TTTTTTTTTTTTTTT>
##$WBST= 1024
##$WBSW= 4
##$XGAIN= (0..3)
0 0 0 0 
##$XL= 0
##$YL= 0
##$YMAX_a= 213436
##$YMIN_a= -170190
##$ZGOPTNS= <>
##$ZL1= 120
##$ZL2= 120
##$ZL3= 120
##$ZL4= 120
##$ABSF1= 10
##$ABSF2= 0
##$ABSG= 5
##$ABSL= 3
##$ALPHA= 0
##$AQORDER= 0
##$ASSFAC= 0
##$ASSFACI= 0
##$ASSFACX= 0
##$ASSWID= 0
##$AUNMP= <proc_1d>
##$AZFE= 0.1
##$AZFW= 0.1
##$BCFW= 1
##$BC_mod= 2
##$BYTORDP= 1
##$COROFFS= 0
##$CY= -3
##$DATMOD= 1
##$DC= 2
##$DFILT= <>
##$DTYPP= 0
##$F1P= 0
##$F2P= 0
##$FCOR= 0.5
##$FTSIZE= 0
##$FT_mod= 4
##$GAMMA= 1
##$GB= 0.15
##$INTBC= 1
##$INTSCL= 1
##$ISEN= 128
##$LB= 0.25
##$LEV0= 0
##$LPBIN= 0
##$MAXI= 10000
##$MC2= 0
##$MEAN= 0
##$ME_mod= 0
##$MI= 1.114404
##$NCOEF= 0
##$NC_proc= 0
##$NLEV= 6
##$NOISF1= 3.799351
##$NOISF2= 2.8
##$NSP= 1
##$NTH_PI= 0
##$NZP= 0
##$OFFSET= 14.38212
##$PC= 1
##$PHC0= -1202.649
##$PHC1= 17.9923
##$PH_mod= 1
##$PKNL= yes
##$PPARMOD= 0
##$PSCAL= 0
##$PSIGN= 0
##$REVERSE= no
##$SF= 200.129724274929
##$SI= 16384
##$SIGF1= 3
##$SIGF2= 2
##$SINO= 400
##$SIOLD= 16384
##$SREGLST= <1H.CDCl3>
##$SSB= 0
##$STSI= 0
##$STSR= 0
##$SW_p= 3205.1282051282
##$SYMM= 0
##$S_DEV= 0
##$TDeff= 0
##$TDoff= 0
##$TI= <>
##$TILT= no
##$TM1= 0
##$TM2= 0
##$TOPLEV= 0
##$USERP1= <user>
##$USERP2= <user>
##$USERP3= <user>
##$USERP4= <user>
##$USERP5= <user>
##$WDW= 1
##$XDIM= 8192
##$YMAX_p= 0
##$YMIN_p= 0
$$ End of Bruker specific parameters
$$ ---------------------------------
##NTUPLES= NMR FID
##VAR_NAME=  TIME,          FID/REAL,        FID/IMAG
##SYMBOL=    X,             R,               I
##VAR_TYPE=  INDEPENDENT,   DEPENDENT,       DEPENDENT
##VAR_FORM=  AFFN,          ASDF,            ASDF
##VAR_DIM=   8192,          8192,            8192
##UNITS=     SECONDS,       ARBITRARY UNITS, ARBITRARY UNITS
##FACTOR=    0.0002768,     1,               1
##FIRST=     0,             0,               0
##LAST=      2.2672688,     0,               0
##MIN=       0,             -170190,         0
##MAX=       2.2672688,     213436,          0
$$ Real data points
##PAGE= N=1
##DATA TABLE= (X++(R..R)), XYDATA
0@%%%%%%%%%%%%%%Qj6J6j6J6k4L2l2M0m8N6o8P6q8J04j20J36j54J76j99K23k52
36a34K84l17L54l95M40m88N42o01O65p36Q12q93R82j083J193j315J451j601J768
55I28j957K174k422K710l052L463l965M601n433O565q213J0837j5640K7168j05639
70h7875p5539K65112m8902j60091J69294J51437j81385p5070J04828j8799n0263
81g253O8160n8016j23957O2131N5383j16508P243J41255M734o1378L7744L4261
93D3799k97K5856J163m5345j643K2590m2866n4062K0977K3650k5717j9395R159
106d2131J9829K2241K54p976P489L820O600K1093J07j2513R478M859k9089j6742
120a2681K7214J2903l2326j9229L48k1244l036L4106Q519j1363J9074J6202j6199
$$ y = [0, 0, 0, 0, 0, 0, 0, 0, 0, 0, 0, 0, 0, 0, 0, 8, -8, 8, -8, 8, -16, 16, -16, 24, -24, 32, -36, 40, -48, 56, -64, 72, -82, 94, -105, 118, -134, 150, -167, 187, -208, 232, -256, 286, -315, 350, -386, 426, -467, 515, -568, 625, -690, 761, -840, 928, -1029, 1145, -1277, 1433, -1619, 1844, -2121, 2480, -2953, 3612, -4601, 6236, -9404, 17764, -87875, -163414, 101698, 52796, -107295, 61999, 213436, 32051, -43019, 61809, 43010, -7253, 60907, 2891, -121066, -58935, -3552, -120060, -112817, 28438, 33172, -28206, 9538, 43799, 43502, 69358, 70521, 25176, 23533, 46123, 3257, -50805, -29828, -6178, -31895, -51290, -42131, -22302, -61, 193, -7783, -294, 3526, 10126, 31219, 31326, 18813, 28291, 33150, 4061, -12681, 14533, 27436, -4890, -24119, -23771, -45015, -48051, -13945, -5426, -16789, 2285, 18487, 2288]
133B288J824L5985P658k3789r3m278l9292p063K5213j4543j7620K2694P7k5831
147c6770J9052L5094q307m499K7136r019l2280J9446J9017k8555l872J9753k3348
160g152k0227K3994N514j9852O067J2577j7051m549K3441K844q655J4098M683
173A5732j1830Q285R659r502k472L34j4619j1369K153J599k364P96Q19p52M546
188h985Q877O459R818M807r308k879K203q170o54P710r629j2387L133j985p499
203a8489R137J2862o348n911J0189J5r252J2150J2941r617k601P876p797p567
217b412Q754J862j1535k878K467q544n376J0358K347o520Q765R005n949L256J2257
232A5857k618o806K956N22r491l076M665o506q428N076K449n287M834Q460l326
$$ y = [2288, 4112, 40097, 47755, 23966, 23873, 19595, -19697, -26760, -1547, -16090, -33710, -11016, -10939, -36770, -17718, 17376, 9069, 4570, 31706, 22687, -9593, 9853, 28870, 315, -3557, 16196, -7152, -27379, -3385, 2129, -17723, -11656, 921, -16130, -20679, 2762, 5606, -3049, 11049, 15732, 3902, 12187, 21846, 12344, 9872, 10206, -4413, -15782, -13629, -12030, -14394, -13598, -12779, -13531, -8985, -108, 6351, 16169, 20976, 11668, 8789, 10992, 2822, 2168, 9878, 249, -12138, -9005, -10990, -18489, -9352, 3510, -2838, -8749, 1440, 1455, -7797, 4353, 17294, 7677, 5076, 12952, 5155, -2412, 6342, 8204, -3331, -6209, -3742, -12286, -17662, -7304, -4957, -11477, -2712, 6293, 344, 3600, 15857, 13239, 6433, 9389, 9911, 420, -2656, 2009, -4497, -12925, -7849, -5400, -10687, -5853, 2607, -719]
247g19k133M847J356k048L264N167l421n315J386L99l499K173J882m029l864r93
263e547j286n02J733L648P65r06L074K321q42L770L755k563l582k69k219m612
279c262j525K764k578l657L756K259k341L798N159k222j240L553q2l467R65J918
295C798m132k560L660L9l735K727K198m539m13K865p87j696K304J410k600K73
311a188L327K11q17K987l64m096J1J012k619j682J404p9k511J26L692M70K04L235
329C323J001k915J043R88k070j207O1p28k707j85J923q70m9K888N17k157J344
346B00J654q02p09J382p69j668M22J863j329n37J774j177j846Q84P09k229j36
363b314J351k45q88J330K384r52M64K285q31j722J054L6k500o59L22j147j533
$$ y = [-719, -2852, 1995, 3351, 1303, 4567, 9734, 6313, 998, 2384, 2783, -716, 1457, 3339, -690, -4554, -5547, -6833, -7335, -5602, -1954, -1189, -2095, 979, 3300, 2458, 6228, 9983, 7420, 3838, 3569, 1350, -3262, -4787, -2023, -4601, -8258, -4502, -2243, -4584, -786, 4373, 2151, 911, 4464, 4382, 915, 1880, 3798, -334, -2894, 766, 805, -2930, -203, 1995, -2544, -2957, -92, -879, -2575, -271, 1139, -1461, -1188, 2139, 2350, 1533, 4520, 4156, 60, 71, 1083, -1536, -3218, -1814, -1893, -4404, -4278, -586, -116, 88, 3323, 4324, 1409, 2452, 3440, 1370, 163, 224, -504, -3211, -3396, -1473, -2343, -2392, 496, 1013, -1144, 200, 1854, 1052, 343, 1725, 956, -712, -290, 1573, 244, -293, 1481, 304, -1542, -658, 51, -2178, -2314, -963, -1208, -2096, -766, 1618, 666, 1130, 3415, 2584, 862, 1916, 1952, -548, -1207, -885, -2032, -3565]
380c565J012J589n07L21J894j31m67J899L86j421J21J32j128r38J100N8j347j22
398a114J413j657n31J918o1j279Q72P90j287n9J974P20q96L86O78j078p49J339
416A379p27j661M7j53q45k44J317N85l83P36P41k19p4J564r67n77M37o25j336
435a005M85O89j41r09Q73j46q22N41J034n26m08N90j40p21N74R67p69j38L36K23
455E87j061O68L77p53n47M27k83k37M07N81J1j76L84NO6j29O25p76m76J81m47
476e66k41L48L23N1j40P0M69m20L68M40k98n78r1p7j29J20P63k61n56N24J64n00
498b17K99N02n38p00M38O1m37O55M95m46j95K64L18m44k1M02r03j14L14l92K50
519d09L34L30k81l1N65Q2l08K14N93r45n92K17j59k00N70J21l39l23N39J86k96
$$ y = [-3565, -2553, -964, -1471, -1150, 744, 613, 146, 2045, 2431, 1010, 1131, 1263, 135, -803, 297, 355, -992, -1114, 299, -1358, -1889, 29, -32, -1311, -439, 351, -936, -995, 979, 1699, 803, 1189, 1867, 789, 40, 1379, 652, -1009, -962, -1115, -1960, -2204, -887, -302, -685, 51, 792, 573, 499, 2063, 1096, 519, 956, 331, -1005, -520, 169, 28, -881, -8, -154, -976, -435, 599, 73, -335, 255, 115, -606, -32, 935, 166, 28, 364, 587, -474, 194, 571, -182, -729, -302, -585, -822, -415, 166, 177, 1, 385, 390, 456, 327, 952, 176, -300, -119, -566, -807, -459, -136, -85, -225, -155, 314, -106, 262, 702, 404, -174, -265, -342, -471, -351, 412, 151, -405, 119, 283, -217, 82, 584, 46, -654, -216, -155, -592, 63, 558, 112, -83, 181, 499, 55, 34, 436, -467, -581, -267, -659, -409, -75, 255, -26, -57, 508, 590, 282, 496, 1089, 144, -448, -231, -390, -590, -20, 101, -238, -561, -22, 164, -132]
540a32L79N32p23n25M84O2lJ80K47p11RL69q9k52O03r0j225K62L17k05k40Q31
562H0K22n00K18K99j99n9N20j37n01k69L22l76k12N32Kk42L09M9j50l5P08k21
584C60o29J74L64l70M2L64k82l87L27M36l11M05l08m49l7J24K24k51J21M39m32
605g6l46N99J27m6K74q9m14m65M21j14k86M35l5m34K00J82M47n66L66K22k31m72
627c01L54k09l52M47n8%l85M12j3L02J63j72j22M6L3k60p8K06N4n03J7N87j44
650B4L77k43K1k05R6qJ44k06K4l2j46P8l5J45J00J33m2m78K66k70J50Pj22j64
674c86M5O0L03k97M23K76l98J26k05L28l0l48np6m2J85o7J49J57j84j74j43L17
697A4K09j43J60m83K60j29M46l17K27k80Lk8o7J8K17M6k48p3L34j25j54Q5K6L40
$$ y = [-132, 247, 779, 56, -469, 15, 77, 74, 254, 501, -210, -201, 168, 79, -173, 430, 340, -885, -623, -306, -511, -751, 80, 302, -198, 20, 319, 120, 61, 581, 444, -57, -326, -4, -380, -592, -60, -58, -300, 9, 58, -92, -127, 581, 360, -269, -95, 269, -101, -59, 305, 23, -364, -37, 399, 88, 493, 185, -264, -301, -177, 47, -204, -83, 356, -76, -422, 177, 304, 258, 532, 443, 29, -436, -15, -129, -415, 20, -15, -449, -249, -67, 380, -186, 180, 402, 171, -301, 53, -156, -508, -61, -119, -119, -504, -92, -105, 197, 360, 188, 66, 112, 145, -115, -193, 13, 67, -436, -419, 168, 24, 401, 158, 179, -26, 70, 62, 206, 0, 24, -8, -154, -76, -111, 34, 134, 267, 225, -253, 13, -257, -107, -100, -222, -386, -341, -281, 22, -275, 148, 424, 26, 152, -53, 275, 245, -103, -108, -184, -226, -41, -108, 41, 198, 14, -160, -303, 14, 223, 80, 240, -243, 17, -112, 334, 17, 244, -36, -33, -61, -128, -110, 107, 153, -95, -168, 166, 41, -113, -28, -2, 338]
721C38l44L01n12L11k65M52n42K98j4k82M55k69N5j83L58q4m95N83q2j24k07M15
743A63l09J24J08Q6K2J5n4r7l89L12%j34J95j11J13o6J54R6r6r6j8J37k03J1J77
768A40m4k28J11M4k35K04Qk1n9K73m9j38J87q4j99r9J11M3k21J89J62K5o0n3l80
793c73L59R0K60j71m1j13r5J43O4p4m7P8J05k59m5m2K43J47k56JJ6J65J76j54
817A77n14N48j93j41K38j93l1n7r0J69Q4p5j72L71J72p8j66j11K85q4j84J31j05
840a9N9j0K18k11J31l08R8K71j45K12k90J31l32J77j57L51J47l17K2m0J98k5k46
863h5J17M9j97p3J82j49P3J68j23P1Rj89K40o3k7m1K32k78K13K9k52m8J64k46
887b24K99o1J69j13j61J63j41N9j96K75j55K69o0M3n1k7l69M0J16l7J72l02O4
$$ y = [338, -6, 295, -217, 94, -171, 281, -261, 37, 23, -259, 196, -73, -18, -201, 157, 73, -422, 161, 79, -45, -252, 163, -146, -22, 86, 172, 194, 209, 155, 58, -331, -19, -19, -153, 42, -69, 44, -22, 132, 228, 132, 36, 18, 155, -48, -37, 140, 96, -132, -21, 23, -212, -8, 0, -21, -80, 193, 144, 6, 193, 109, -90, -189, -78, -35, -256, -67, 95, 120, 60, 7, -373, -14, 76, 336, 165, 124, 11, -84, 59, 123, 49, 2, 80, 185, -74, -119, -161, 82, 229, -27, -26, -10, 155, 331, 177, -337, 211, 18, -123, 115, -78, -109, -166, -256, -87, -3, -78, -250, 121, 293, 215, 49, -62, 223, 139, -45, 86, -19, 40, 30, 248, 37, 168, -140, -42, 229, 84, 296, 6, 137, -195, -18, -175, 176, 323, 6, 28, -12, 186, 161, -85, 32, 81, -116, -189, -7, -156, -83, 85, -38, 33, 42, -147, 93, 30, 3, -38, 194, -84, 129, 158, -94, -142, 22, -224, 75, 14, 183, 70, -91, 72, -69, -10, -206, 69, -86, 183, 123, 166, 115, 88, -281, -241, -125, -162, 10, -292, -228]
910b28N7K39J21j54J35q8j39j70M07n6k49n5L96q2j50j39K68M9l45K16j68L74
932B39Q5j80k37j59L99J09j54k90J57J50j28J04l14R5K75j61L8J53L7k46j07K24
954H9k19N9P9J81j0k21J1l7K06j60P8L3J61j92K9R3r5L1j8j81J70r1l58N52j69
979B1q4p7J13K66m05K08q2J32q9k7J08k75J28R8J45j67j1n4Q2K68l87r9J52K9
1003gn1K03r3N2o5J29J0k01P9Q2O3j62j14L47j74R1j92r2N3o3K18k21J2M9m4m1
1029a32J9L12j58j87K01j19K21k06j30N0J63j80L2J94j09k4k97K78M55m39K72
1050B16l83K08k19L22j56l0j04J89p1K91l90K84j45j22m2O3R6lJ9k80J82O2J70
1073A57l57L59k84J4J38J87l65M7L42k91r7K6j68L35k36o0K99k5J43j60n9k18
$$ y = [-228, -171, 68, 189, 35, 170, 82, -57, -227, 180, 124, -125, -180, 216, 134, -16, -155, 113, 162, -183, 33, -135, 239, 324, 144, -93, -252, 147, 256, 102, -188, -31, 119, -9, 95, -219, -124, 151, -10, 28, 181, 218, -28, -135, 89, -130, -71, 8, 189, 179, -42, -31, -68, 138, -22, 56, 89, 250, 58, 87, 180, 85, 116, 98, -83, 87, -4, -362, 190, 21, -63, -140, -27, 239, -166, 42, -40, 92, 3, -24, 84, -191, -63, 35, 180, 13, 2, -52, 30, 298, -89, -188, -36, -7, -58, 145, 52, 104, 39, 168, 178, -23, 56, 138, 201, 39, -75, 272, 98, 189, -3, -95, -42, -105, 113, -108, -96, -47, -91, -132, -113, 199, 41, -146, 55, -64, 157, -49, -179, -129, 34, -146, -114, 80, -29, -53, -350, -72, 383, -56, 216, -167, 41, -178, 144, -12, -42, -146, 43, -28, 263, -127, 157, 12, -110, -152, -89, 7, 4, 23, -257, -75, -13, 157, -200, 159, -125, -111, 27, 214, -151, -104, 238, -53, -150, -124, -292, 43, -193, -253, 46, 21, 164, 4, -55, -273]
1095b73L83p9j61K94q3l0p6o8j11K57j90K22m31N02j73p2M9j33K95k24K43k51
1117a10J97J4k94l6J2J07J25j33qK69j73Q0j85L26r2l4J33j12Q9K1M2l65J2K94
1141A79m8J86o30L12J09j65L9n8K14L5k44N9q0J09K31m59nL19j22k5n1K78l38
1164a55k5K71r8O4J02k55K41k45L71k05l9o8K16j22J59q4j33J84K6j7k17j16J5
1187a30K96j57J54l98M33m2k14m50P25l7l25K36q7M1m7N5J30m8k78L15n3l0j78
1210h9j2J62K8j3j24N9j54R7O3j27p8J6j30K22qk40K60n1K8K0oK10n5m08K13L88
1236B71l43J75j86m2O9O8M9r2q0j86M18j7j65j73K35j36R9o7LK54J7l48O1j91
1260c07n7L84O1qk0j7m9N2q4n5K60k95R4M9j36J52l2K21j97p3j44l1J49k4R2o4
$$ y = [-273, 110, 31, -130, 164, 81, 51, -25, -93, -204, 53, -137, 85, -346, 156, -17, -89, -40, -173, 122, -102, 141, -110, 87, 101, -193, -229, -217, -110, 15, -118, -126, 143, -30, 50, -135, 191, 99, 65, 198, 86, 175, 196, 238, -127, -115, 179, 131, 317, -313, -1, 108, -57, -18, -76, 138, 173, -71, -12, -92, 17, 248, -211, -216, 103, -19, -44, -95, 183, -155, -180, 91, -7, 57, 159, -96, 145, -100, 271, 66, 27, -41, 175, 53, 212, 128, -5, 179, 205, 188, -29, -145, -130, 166, 9, 163, -235, 198, 156, -58, -508, 217, 180, -145, 91, 4, 45, -2, 53, 183, 135, -143, 172, 119, 89, -89, -101, 61, 89, 76, -48, 11, -143, -46, 17, -110, -188, -172, -302, -80, -88, -328, -68, -119, -91, -71, -77, 133, 78, -330, -117, 271, -72, 103, -83, -125, -56, 12, 61, -31, -111, -297, 121, 104, -61, -234, 1, -135, -36, -103, -100, 154, 171, -177, -116, -307, -364, 20, 81, 73, 53, 36, -13, 39, -45, -100, 160, -135, -41, 8, -128, 24, -8, 213, 16, -57, -201, -232, -83, -107, -15, -79]
1286g9n7o7J0K00M2k85J21K02r3j51J76k25N00l33J97k8p4j63K52P0j71l09P1
1309a94K51m5o6J34l9k4J75k25j14o1K82j82Q3p1R1r7Qj09k1J17J79j53N6N4k55
1334b26J91K0K35k58K63q8j92Jj89J39K97r9r7l9j01R0K3l79N14m4Oj42J88Q5
1358A98k1p3K30k73j82O6j68K17j7j27L2J41P6j38j94N96n61L87j12j07j00R3
1380c7K81n6j70j65q6M27j40k54K84k13K10j2j09K25k04l3j44K19J50R7l67K00
1402A03J09l93M83m0k64J41k02J14r9J27j30l8M4o9J60k44M12j22l6l92L5K75
1424b6J16j68J61J06l78R4M4r4n3M79m60K52K77k43n1q6p7L7L24m80J75r6J83
1447C6j03j01j22L69J28k96K7q5RJ49j19N6J23j0P8k19j07M25k9j87O5rj02K71
$$ y = [-79, -136, -203, -193, 7, 49, -236, -115, 87, -6, -157, 19, -206, 294, -39, 158, 130, 56, -107, 145, 215, 44, -265, -194, 57, 12, -54, 80, 41, 17, 192, -33, -147, -208, 74, -108, -25, -96, -5, -102, -94, -203, -224, -107, 72, -81, -25, 29, -226, -35, -15, 220, -38, 225, 137, -55, -54, -243, -104, 193, 94, -3, -42, -143, -53, -30, -409, 105, 61, 67, -75, 113, 198, 177, 104, 334, 61, -121, -55, -223, -6, -23, -150, -118, 23, 99, -39, -233, 363, -198, 189, 77, -30, -130, -37, 244, 188, 18, -147, -233, 194, 54, -200, 84, -129, 81, 69, -40, 185, -19, -52, -196, 23, 173, 270, -97, 103, 212, -181, 302, 262, -2, 139, -63, 51, -48, 79, -51, -89, -45, -114, 46, -198, 214, 92, 56, -336, -301, -26, 90, -78, 83, 189, -189, -95, -51, -145, -198, 281, -179, 73, 350, 107, 56, -30, -107, -70, 254, -226, -51, -147, 36, -67, -168, -290, 79, 207, -89, -62, -147, -138, 11, -108, -52, 71, 61, 139, -80, -187, 238, 209, 22, 87, 78, -24, 247]
1471B47o7j48N8R8j94K9N5Rl82K12r9L44l82K97J4R1k49K23k32L07l45J80nJ48
1495B09j72J14j77J67k49K74k50J18j37rJ03R8j80l7K09q4N7k26K19N0j09K22
1517B10j01j24k03K13K5o0j1K6K35j61r1J49q5R1k8k02j64M16k47J84k51K38o4
1540ej33O8P4j61K71J0k14j7MJ26RL24k70o7P0k28J76J29l1m7k9j60K14r0K8J1
1566F2Q3j56Rl0r4L70j00o7%N5j6k24L35l47P9j23K36k26J7J54m1J13k47L96l99
1591a61M96m46J17k3j43K75j05K64m45L50j70kJ36j78J02K5l70M46l43J21L4L02
1613B82j38K3m1k04o4L37o8l04o5M15j55j30J24K8k3j42m8kJ23J79p8j82J6n7
1637a74L2J9K72NJ09q4j3n7l88L37J9p1k02l8L30j81j8J98K48n42K79j33m5OJ43
$$ y = [247, 180, 32, 90, 188, -6, 23, 78, 87, -295, -83, -182, 162, -220, 77, 91, 182, -67, 156, -76, 231, -114, 66, 61, 209, 37, 151, -26, 141, -108, 166, -84, 34, -103, -112, -9, 89, -91, -128, 81, -3, 54, -172, 47, 97, -12, 210, 109, -15, -218, -5, 20, -40, -51, -25, 210, 49, -42, 107, 22, 113, 85, -117, -281, 135, -112, 72, -179, 59, -5, -138, -70, 4, -157, 114, 124, -90, -107, -103, 23, 32, 356, 86, 19, 89, -139, 37, 166, 135, 88, 59, -101, 113, 23, 51, 62, 145, -11, -2, -32, -126, 244, 144, 77, 77, 132, 116, -108, 227, -120, -41, -164, 72, -154, -137, 17, -24, 89, -158, 238, -161, 335, -111, 6, -17, -160, 115, 10, 274, -171, 179, 9, 7, 143, -35, 67, 92, -278, 168, -175, -54, -20, 282, 144, 167, 126, -78, -142, 195, 127, -177, -242, 173, 18, -112, 12, 40, 17, -125, -173, -175, -52, 127, 49, -133, -117, -174, -142, -123, 149, 154, 263, 179, 166, 109, -279, 58, 77, 6, -196, -234, 96, -85, -103, 95, 343, -199, 80, -53, -98, -92, 51]
1662E1p6M7l3n5n8J52K6L2k9J41l11J92J43N5l23R3Q0j30J14o6j29M00n89L83
1686A10j71J15n4l25K48R3j65K40l7J0j22j01J54j73N42n60L81l20K6J1J48K24
1708B74n46L01J50Ll26K05j62M8J41l0K13m68M45k04k35K45O6j46L29m4l03j40
1730a84J02J9p6L69k60j6K0J94m9k45L70k22j08J8M34k15k20O3o6q4K74J3l9l0
1754F2j05k30K95R8P0l15R5M0r0j11N9OJ21kM6o4o3J33k36L51k61K13J29O0n32
1779b31J94P9P1j49J18p5R1k72k19L57J63l22J90j82L12k0j47J02NN9j71j6k8
1802i1M15l95Q0L92k94j05N0k59L72j91l36M84r7L0o9l7J02j35J21j51M83l84
1824a5p6K63n74K58l0K60k60J04J68o0j09J26O0L8k10LL8j22RqL14M9M0l13L0
$$ y = [51, -25, 22, -11, -66, -124, 28, 54, 86, 57, 198, -113, 79, 222, 277, -46, 47, 127, -3, 111, 45, -84, 316, -273, 110, -61, 54, 0, -325, -77, 16, -149, 91, 54, 64, -58, -159, -5, -178, 364, -196, 185, -135, -109, -98, 50, 274, -272, 29, 179, 182, -144, 61, -101, -53, 88, 58, 271, -197, 248, 44, -191, 54, 120, -26, 303, 259, -44, -184, -82, -63, -139, 230, -30, -46, -26, 168, 119, -126, 244, 22, -86, -68, 366, 151, -69, -6, -72, -156, 118, 131, 92, 62, -43, -273, 22, 120, 190, -125, -30, 10, -80, -191, -132, -126, -5, -7, 39, -25, -88, 45, -191, 160, -101, 112, 241, 301, -231, -37, 42, 113, -36, 82, 7, 98, -174, -393, -36, 127, -195, -5, -187, 125, 105, -42, 60, 65, 124, -47, -63, -91, 324, -71, 9, 401, 107, 2, 52, -207, 165, -26, -362, 122, 25, 55, -14, -51, 51, -84, 37, -114, 369, -15, -91, 172, -402, -144, -174, 86, -174, -70, 98, 38, -71, 55, 115, 153, -57, -54, -16, -138, -129, -137, 177, 226, 266, -47, -17]
1849a7J70j55j87L17k59J58j76K04k69L14N1k92L25k67P5j26j38K87J67l07K12
1870H7l2K2j2k56K38J74p6p1n8J56Q2k30J21j75R9q2K6o2M4K12k75l53K98M6k38
1895c15J66L44p7p6J00K32k13l13J14j19L03j76j1k03J28M21l41J55l06M55k90
1916b2j2P0J7o1P1K66l22o6J72j58lK08j72j43J45R3k5n1k71K08L6O6j06J12L8
1941I0QnP7k81q1L70r6r5m78N48J04J10l27M7J93k17L27m00J90J15l7kl73K38
1965B5J53j28J7k47J45K73m86M75k98q0J47J44k29p0J48KJ79j43p5m0K34j78J62
1988A30j54K25o4k18pP2m7j19J26K84l29L8K33k66J64r6m6L07p6M2r8k12m7L73
2012B15m7J2P4k71J22N2k56k2J85o4Ln5M4K01j90K3J06J6j17j24J47q3o4J5L12
$$ y = [-17, 153, -2, -189, 128, -131, 27, -149, 55, -214, 100, 151, -141, 184, -83, -8, -134, -272, 15, 182, -125, 87, 55, 77, 65, -191, 47, 221, 145, 74, 16, 172, 254, 24, 145, -30, 69, -13, 13, -49, -5, 207, -68, -421, -123, -77, -315, -149, 195, 118, 42, 142, 374, 161, -152, -38, -157, 146, -30, -41, -244, -116, 305, -36, 119, -187, 268, -22, -34, 36, 53, -8, 63, 329, 7, -59, 113, -45, -48, 160, -12, -155, -10, 83, 58, 7, -264, -56, -20, 46, -60, 52, 90, 98, 93, 170, -111, -192, 178, 82, -13, -491, 57, 161, 271, -56, -9, 184, -33, 294, -106, 84, 199, 162, 160, -213, 25, 178, 50, 67, -180, -35, 238, -248, 227, -71, -151, -4, 140, -89, -159, -11, -9, 170, 27, -48, -88, 146, -32, 130, -24, 201, 137, -81, -88, -16, -63, -182, -56, 228, -101, -63, 170, -96, 68, -28, -74, 233, 157, 199, 101, -111, -158, 215, 168, 180, 254, -17, 105, 157, -99, -121, 64, 0, 3, -52, -8, 193, 3, 26, 132, 148, 31, -93, 54, -29, -93, -78, 234]
2037B34k41j14P5j15R9L7L18k90j4R7Q7J76k36J58k84m2l8L38l40o2J60M2L8q5
2061bk08R4K44r7n6K67k71R4J04J9l1J14k84J28Mo8J18j88K63j90r0NJ30k24R8
2086b7J06j40J63q0L7k60K27K49j45n1J35l13N1J40k47k01L35j62L50k50l6K28
2108A09k58P7K2j62J07J66J90J57m01L7j01j54K64j54J8R3lP6r3P3j88K39j54
2131d0J59N1n90O79m87L50m8n6j36Q1j79J94K0k63L19l16K85O2k5j33N8q2L5j5
2155g7K98l57j2K15k3k02K60P0j16r0J78j55j54L57j35n2k1k14L4N07l67P8NJ33
2179A60l16M8K04K2j04L08n05P1K50M7l30L37k41k54N17k45O9%k52L7L33j69O6
2202E3K2K66k11r0J58j35J81o7k38J20k09R6ro5Q9J58q6k84P6J90j14p9J14P1
$$ y = [234, -7, -121, -46, -161, -62, -25, 293, 3, -11, 86, 173, 349, 113, 271, -13, -55, -93, 245, -95, -157, 3, 45, 83, -2, -210, -116, 128, 31, -25, 242, -29, 65, 169, 188, 157, 271, -13, 115, 119, 51, 169, -19, 244, 54, -36, -31, 99, -125, -27, 79, -61, 102, 22, 59, -201, 26, 275, 130, 79, 214, -99, -48, 92, -155, -356, -21, -183, 167, -83, -119, 109, -149, -72, -50, -212, -105, 61, 251, 408, 7, 44, -57, -211, 53, -101, -83, 10, 7, 83, -10, 63, -125, 114, -40, 119, 170, -420, 259, -228, 122, 74, 18, -118, -37, -216, -22, -2, -265, 54, -262, 23, 85, 60, -73, -15, -97, -62, -77, 221, -136, -148, 67, 44, -158, 102, 172, 56, -34, 144, -11, -165, 192, 57, 5, -16, -230, -196, 311, -56, 22, 27, 160, -156, -108, 96, 118, 14, 322, -183, -112, 138, 185, -145, 192, -49, -303, 214, -31, 38, 38, -214, -177, 156, -13, 53, 75, 341, 130, 40, 198, 63, 244, 177, -61, 59, -150, -54, -63, -128, -39, 119, 33, -251, -175, 15, -99, -178, -64, 7]
2226GJ55m0J3p8K28j74k06J79r9K75l25L13l33L6J27K3k95M25j69L4k77L9k5K08
2250D1Q9k70L0M5N7K0J31k29J85l99K33J26r1O5r9J83j45N5j2L26k30m4L9p8j57
2275a29J15J41k87J96N2l3j09M7k23K13n6J03J0r3O6l3k25J73O5J06N1k53N6j42
2299a89J14j26M15K1l64j18K71j26K73j85L7r7K00k88M50l61n0Q9p9o8J44K03
2321A66l9Kk18J17l37K31k18L19J26k37J09J04k99K73k73L0K7O1M06k87L8l91
2343b90L82j64R7J9n8R0j5j70O4K12l28k00K12j10M00j83N7k8j07L48k15j3j0
2366a0L18k42J45l53K18J66m4k29r0R9L52l76r2M4K70l28L30l40J97R6K3o6o2
2389B6J98l82K38J16l98J16M9j67J31K04JJ37k1n16L90J00m06K34j1Q6p6J4l6
$$ y = [7, 162, 122, 135, 57, 285, 111, -95, 84, -15, 260, -65, 248, -85, -49, 78, 101, -194, 231, 62, 96, -181, -142, -167, 41, 130, -140, -110, -65, -8, 12, 143, -86, 99, -300, -67, 59, -32, 33, -66, 117, -28, 27, 15, 341, 111, 67, 106, 28, -129, -14, 127, -160, 36, 88, 55, -54, -7, -230, -17, -73, 30, 40, -53, 13, -20, -245, -72, -7, 99, 150, -103, -47, -189, -75, -201, 214, 235, -129, -247, 24, -102, 171, -14, 23, -74, 126, -162, 288, -73, -123, -34, -113, -181, -37, 166, 127, 129, -89, 28, -309, -78, -296, 23, 149, -88, 21, 125, -174, 99, -174, -144, -117, -56, 350, 63, 101, -290, 92, -72, 25, 44, -14, 76, 61, -109, -45, 167, -161, -361, -149, -259, 141, -42, 15, -13, -120, 228, 13, 0, -10, 308, 66, 211, -142, 76, 242, 198, -31, -121, -22, 330, -46, -138, -94, 176, -152, 178, -162, 35, 131, 154, 88, 26, 224, -158, 80, 196, -202, -86, -37, -204, -73, 131, 132, 269, 248, -268, 122, 222, -184, 50, 39, 125, 49, 63, 27]
2412B7j55L73l60P6MJ50kJ16j79j87p7Q1K01k72M1J41O4K5M1j50J44J21l65N9
2436h3J17j08m8K01r7j65L25q0o3J54R3O7l55J03q0r3K53MJ6m5j31j19J70j02
2460f6J5J03L3q4m4J56l00J44k02K90k16R2M3l2j21K00J19j76K15k05q9P3r2J69
2484B5K61j90K1K69j17k27J1j8j01R9P2j7Q9j77J79O8k12m17J84K12l0l8J05l57
2508c06m6O09k77N9j38K31K52m10j22L32l01M6J36j29Qj11J70j4k28L73P4k94
2530h6M2j28J90NJ28k2j62J36j60K16j41J2J28k15K65j49j70K97k55K45k52j21
2552a97K60m6j54K8j05J88J60k98K90j55J18j79J43k47J96j2K4l84L24J0j46J20
2574f2o1j28L40j36Q8j85K46l54L86p6j37q5M00k27q8Q8j43j92L72j57J30j93
$$ y = [27, -128, 245, -115, -39, -35, 115, 113, 229, 50, -137, -214, -133, 68, -204, -163, -22, 42, 67, 108, -42, 102, 223, -142, -83, 34, -74, -122, 79, -18, -183, 142, 62, -1, 153, 246, 313, -42, 61, -19, -112, 141, 145, 161, 116, -15, -134, 36, -66, -51, 52, 85, 1, -43, 113, -187, -43, -245, 45, -171, -79, -36, -68, -189, 11, 130, -46, 169, -36, -125, -52, -144, 25, 286, 96, 117, 386, 269, 42, 53, 35, -66, 33, 105, 88, 177, 0, 179, 247, 35, -382, -198, 14, -16, -54, 51, -306, -352, 257, -20, 39, -99, 132, 384, -26, -148, 184, -117, -71, 65, -64, -56, -167, 3, -11, -239, 134, 208, -86, -44, -172, 18, 23, 151, 129, -33, 103, -57, 159, 18, 30, 158, -57, 208, 59, -111, 186, -69, 176, -76, -197, 63, 17, -137, -109, -214, -26, 134, -164, 126, -29, 89, -90, 53, -194, 2, -10, 14, -370, -46, -36, -182, -62, -123, -251, 89, -47, 41, -144, 102, -252, 134, 58, -79, -164, 236, 9, -79, 9, -134, -326, 46, -111, 19, -174]
2596a74J91k5m1r4J37J81k1l32K17k48K45p9l5j30J50J2J54N7l3j08j93J50k6
2619d5J37Q0k55L71j90k13l21L64J23N3j72j58N19l98J90j98K70m22K47l8j39
2640a95L03l16L03J06j44k7qr9P5k81J87L0o2P6L72k95m1L9K99l65o9K68k05j57
2664b06L12k73J5K71q3J53l97M17m16P5M5K61k48NN5j44J27O7j08K48j76j04j8
2687a22J19k00L00k04K66l54L53K4k50oL6J06J69l61J16R9j35N9Q0j79R8p7O5
2710BN9K9j96j37J47K7J29M2j76J60r4k3j50r2N21r9o5l21J28J53j21n2K29r0
2734A0m3oN0K61K2j50Rl10Q2j15m0L66o2m3r6K02j09R8Q7k24K85l45J15r8J39
2759H5k52K47M2j4j30J72Q8m20N4J79Q6k52L13J50k86k62K28%%K2J06j88R6m09
$$ y = [-174, 17, -8, -49, -143, -6, 175, 154, -178, 39, -209, 36, -43, -78, -208, -58, -46, 108, 165, 132, 24, -169, -19, -45, 92, 172, -83, 288, 98, -115, -436, -72, 51, 104, -68, -226, 293, -105, 85, -113, 157, -265, -18, -56, -195, 108, -208, 95, 201, 57, 30, 22, -77, -2, -283, -96, -66, -128, -52, 320, 25, -16, 23, 322, -43, -112, 156, -49, -206, 106, -167, -152, 119, 36, 189, -208, 209, -207, -132, -87, 174, -74, -69, -14, -158, -31, 36, -72, 176, 0, -104, -122, -3, -203, 97, -107, 159, -195, 158, 182, -68, -74, -38, 68, 237, -124, -8, 91, -44, 15, 95, -84, 14, -63, 2, 61, 90, -106, -243, -96, -69, 60, 102, -74, 86, -8, -31, -181, -273, 248, 149, 84, -237, -109, 44, -77, -129, 100, 10, -33, -39, 11, 272, 294, 144, 153, -157, -75, -190, -230, 136, 74, 31, -65, 137, 28, 126, 213, -11, 274, -71, 44, -54, 85, -167, 80, 122, 108, -22, 150, 238, -182, -128, 51, 137, -115, 198, 348, 62, -200, 28, 28, 28, 50, 156, -32, 64, -345]
2783c45J73K31l34J49J51J6J18k37K35r7k13J15n0J82k56j20L47q0o1J53k7l97
2805c47J45Q8J4j66L59o2J6Nj7j33j8m8L70k09K4o8R1K7j71J63PK34l11j5O5J44
2831A87l9j47K3l4J92l90K46n7K69k13Q3k51K60J28R7o59L14L8j12Q6j05J86j16
2854a4P6M3M6k47J04Oj42O9J23P3j77P5M1J27k26R5j43O5j01J08K68l49J69J16
2878B05j44K65o41L46K41j65O0j96n5j24Q5J72k27L27q9Q2k31J26L8j70R2J02
2900I9P8k55J87j90K55j72J89j41o6Q0k45K94l91J73L43j07k11jlJ95J0k30J61
2923E2Q0j52p5k8J96j09J64M7m28K81M5k40J40m16K05K85n4j09L12r5k37K78l9
2946A03J05k48P4r7J84k74J94K21J30l64L08m08K07j67N1J09q2j67K0J88k67Q
$$ y = [-345, -172, 59, -275, -126, 25, 41, 159, -78, 157, 60, -153, -38, -88, 94, -162, -282, 65, -15, -76, 77, 50, -347, -202, -114, -100, -266, 93, 31, 47, 52, 35, -98, -116, -164, 206, -3, 21, -47, 44, 71, -100, 63, 70, 304, -7, -22, 43, 187, 148, 1, 24, -10, 182, -208, 38, -19, 250, 37, 120, -131, 129, 257, 354, -305, 9, 47, -65, 21, -84, 102, -14, 62, 105, 151, -96, 8, 14, -128, -59, 64, 137, -40, 35, 76, 203, -23, 72, -71, -6, -107, 1, 269, -80, 89, 205, 61, 326, -315, 31, 272, 107, 167, -29, -84, -208, -123, 49, -178, 149, 60, 142, -89, 37, 75, -95, -3, 99, 177, -78, 109, -81, 174, 2, 191, 50, -16, 64, -181, 113, -278, -105, 238, 131, -80, -81, -84, 111, 121, -109, 52, 132, -20, -95, -123, 73, -36, 128, 175, -253, 28, 73, -167, -27, -443, -238, 47, -7, -116, 196, 101, -136, 142, 103, 208, -40, 34, -63, 121, -153, 41, 262, 392, 28, 336, -72, 135, -32, 19, 128, 46, -121, -101, 87, -180, -172]
2968a72L59k79j9P0mm4j09K37ko1M7J61k27K05o9o1p3N2J5k33J90K57m5p8R3j25
2994H5L7j83J3J08m11L86k62K91l42R5N70l70O7r5N4Oj70m6J63j00O2Q5j13K13
3018A43m8L6J29k98L3R4j99p0J27J13j37QJ03P4j68j9M0q0K69j34l40M64k00L10
3042B50j74j26J48K1M3m7m0Q8o2k96J87J62k08J57l01M50l65K1J01o6L1Q1j18
3065f3R2MJ8k57N3J34R2N4k06K50Mk86J76R0l38J54J52j64O9J52k07j95K73j91
3089a40R3j22K47l04L11k9j2kk42K64j8J24j8J04j33k57j00J28n1j0M66k72r0
3112f3K8J24j24KrJ62N3k57J20J08Qj63J43m20j14L84j76K48j08K14k2m0j48J75
3136A25n16L47J70j19O6j0j80o0K03J97l11l4k2K71KO7r4J99n48L41j31r8Qj47
$$ y = [-172, 187, -92, -111, -41, -45, -89, -198, 39, 37, -24, 23, 184, -43, 162, 93, 32, -41, 11, 26, -207, -17, 240, 195, 117, 210, 85, 122, -61, -48, 60, -351, 35, -227, 64, -278, -183, 387, 17, 84, -11, 43, 49, -121, -167, -4, -104, -42, 43, -70, 143, 95, 131, 260, -38, -5, 89, -110, -180, -53, 60, -77, -69, 34, 108, -60, -79, -39, -119, 150, 16, -324, 140, -60, 250, 76, -50, 98, 119, 162, 115, 75, 163, 101, -195, -8, 154, -54, 103, -198, 252, -113, -92, 9, -57, -26, 55, -63, 29, 33, 51, -206, -153, -19, 73, 127, -79, 171, 175, -111, 65, 155, -183, -29, 123, -41, 28, 180, -27, -222, 51, -140, -47, -169, 78, -226, 85, 56, 44, 42, -200, 64, 46, 170, 152, 256, 123, -134, -234, -106, -157, -167, 299, 27, -63, -35, 89, -35, -33, -42, 120, 173, -84, 36, 144, 152, -11, 132, -288, -402, -18, -194, 54, -54, 160, 138, 98, -50, 125, -391, -44, 126, 7, 73, 63, -117, -177, 26, 223, -88, -122, -144, 127, 129, 196, 102, 301, -247, 94, -37, -135, -127, -274]
3160b74M19j62M6p8O6k1R8j88M6k1J7L66k78p7O9p7K8J51j19J61l10J28j06LJ45
3185C2j44K68k70J03J99k02j02K50k43R9j11o4J28l5j39L65O4j14n6k94M35J50
3207C19k84J73Q1l70J98j20K19j56n7r5m1J03L51m22oQ3J31k9Np0m5j5n5J99l25
3232b28J15J12J84l50K98J9j94O5K14k10j8j10m5m2J62J04k45J46L37o09K81l
3254a7k67M19j57J00j09o1J36j28J24J4j84J89j43O2J34k68Q0J19q7l9m2R0K08
3277A73k3j4J05n0l44K24O0m30K04J21k95L28o2J09p3j65M9K44j33Q2m2k01K06
3300G3m2L02p6k93l13K26L61j26k09K23j09O7O5k46K30k94J16J69k47K24k38Q7
3322e0J04K28j23j01K46k93k94O43l32J36o7r3P6j91O7j57J26K09P6k80m16O96
$$ y = [-274, 145, -17, 29, -49, 17, -4, 94, -94, -48, -69, -52, 314, 36, -41, 28, -49, -21, 130, 11, 172, -138, -10, -116, -113, 32, -112, 156, -114, -11, 188, -14, -116, 134, -109, -10, -121, -185, -57, -92, -231, 134, 198, 84, 28, -266, 169, 319, 35, 208, 289, -81, 117, -3, 216, 60, 3, -92, -133, -30, 321, -101, -107, -24, 107, 78, 83, 13, -32, -47, -102, 97, -228, -113, -1, 183, -167, 131, 150, -44, 21, 235, 25, 7, -103, -148, -190, -28, 76, -169, -23, 314, -295, -14, -17, -284, 135, -22, 78, -31, -92, 44, -84, 40, 54, -130, 59, -84, -22, 112, -156, -76, 43, -44, -83, -125, -35, 173, 150, 136, 241, 191, -153, 71, 131, -299, -95, 26, -269, 59, -3, 106, 33, -132, -83, 161, 28, 110, 68, -133, 73, 31, 333, 257, -36, -349, -123, 238, 112, -97, 126, 17, 84, 149, -97, 133, -161, -45, 124, -123, 101, -137, -50, 54, 282, 159, 58, 304, 11, -283, 360, 28, 164, 97, 4, 80, -111, -44, -201, -75, 134, 210, -70, -486, 210]
3344B10m6q8k87J40k42O73l22n4j30K47Q8j00r4k15K19j53K53P7n7q5J02r7k96
3367b57J35J17j24N2J35L1j13R9r9J64O3Q5l44J24j21L3O7j47R8k94L95l6k45
3390a82J29k24M53j22j25j19P1J85j12J43p1kl65O1K72K4MJ9m2j38R3L06l26l8
3414a06j61M92k04K62k87K58rk59J56l62J99O0j52L03l29J91nK74k66j53J18j23
3436a03P3j73J60k4M55n30J47K0K4J56j13j48O9K71k81Jq1l5Q3K05k75J60j16
3459e5j36L36l19J83RR9j19J2k91M27k01qK00k36K09l50L93n0m0l44J54N4j4O4
3483b3m9K95k31L2k89J31R2n9k0n6L41K3j21oq5J63j43J87l10K55j85r6N24m71
3507a01J41Q4k47P6o6j59K56RJ4j14J31p3n6l6J8Q2k39K18k5p5L44j88N1J80L4
$$ y = [210, 164, 76, -211, -71, -313, 360, 38, -16, -146, 101, 189, 89, -5, -220, -1, -154, 99, 176, 119, 34, 136, 39, -257, -122, -5, -129, -77, 58, 89, -24, 75, -24, 140, 203, 288, -56, 68, -53, -20, 47, -100, -2, -296, 99, 63, -182, -53, -277, 176, 54, -71, -190, -119, 66, -46, 97, 26, 24, -341, -280, -8, 16, 20, 39, -3, -141, -48, 258, -68, -106, -267, 225, 21, 283, -4, 254, 245, -14, 142, -220, -21, 39, -113, 190, -139, 52, 47, 321, 55, -98, 20, -103, -30, -203, -43, -67, 388, -142, 5, 25, 49, 205, 92, -56, 13, 284, 3, 4, -77, -112, -29, 176, -99, 61, -55, -191, 145, -174, 9, 18, 117, -2, 10, -281, 146, -55, -63, 137, -99, 110, -240, 153, 103, 63, -281, -127, -73, -87, -23, -72, 223, -8, 24, -265, -134, -42, -101, -121, -177, 164, 187, 66, 60, -25, 138, -5, 182, -128, 127, -58, -154, 370, -101, 40, 124, -123, -47, -113, -272, -16, -7, 7, -107, 24, -49, -105, -141, -123, -41, -280, -62, -87, -162, 182, -6, 45, 225, 259]
3532B59m67L4m8J53J14K1J23l63J34k5j2MN9K4J18r2j10J28l6j27q7L10j7r9K23
3557B21j08j61R3k42K03j23o6L44n9j08j95K89k00K07k56K3J62o6M6J1J11k00
3579g4N7K27k66k35M34L7Ro8j57O4Rl49J66J58j10J96k09M95l38o8R2N4o8R6J70
3604C22m78L26j65P8j88J12k00J77j45M9R7j02L07n09K87l9J33j15j0n8J5k7r2
3627b25L06k60K14OK09k80j8J1J11kJ94l93r6M00m25K7K52m3J89k47N5j18p0J97
3651fj62K16O4j45N8k8J32k27J07L2j58J73m07K41K2J52P9r8j4o9P4J33k40J65
3675I4j00J96j25Oj05k2k6J00L4o6j71J2K84k48J62R9j89J27m7k01N4N4M5k27
3699b60K64j0j58M9K50j76n1L00k96O2K16m47K76p9p3J4J6N4M8o2j58K12KJ7K18
$$ y = [259, -208, -174, -222, -69, 45, 66, 189, -174, -40, -65, -77, -73, -14, 10, 128, 36, -74, 54, 18, -109, -196, 114, 97, -2, 221, 113, -48, 45, -197, 6, -117, -183, 161, 102, -6, -201, 88, -112, 95, -161, -138, 24, -42, 4, 15, 126, -74, -17, 210, -56, -291, 143, 180, 189, 121, -36, 28, 37, -312, -146, 12, -98, 98, -111, 384, 46, -22, 70, 124, 56, 152, 322, -156, 170, 5, 83, -105, 7, -193, -16, -161, -112, -15, -117, 190, -319, -32, -71, 62, -53, -63, -121, -106, -133, -225, 81, -179, 35, 41, 250, -30, -48, -37, 74, 72, 266, -127, -223, 177, -248, -221, 31, -12, 177, -70, -15, -133, -203, -6, -168, 48, 112, -33, 25, -3, 129, -98, 9, 41, -117, 56, -351, -110, -88, 64, 143, 45, 31, -38, 36, 169, -71, 94, -6, 190, 65, 71, -34, -56, -82, 18, 52, -14, -185, -173, 111, -137, 25, 124, -65, 62, 15, -186, -132, -78, -33, -260, 4, -6, -164, -115, 135, -41, -92, 208, -88, -26, 190, -257, 19, -60, -133, -119, -103, -49, -1, -63, -221, -9, -7, 10, 228]
3724B28k70J92k00K39k02J22k53J57j12J60j12J28j48K97j92k67L98l68L82n9
3744A20j14j57k05N65j47j31K6K69l60J18K05k72J09j82J38k65L29o2m1k0L4n7
3766a00K72n7j64m3J06m48N13k76J24J76m0l20N1L88k83J69m02N06n1j52J14k34
3788a51J07L1l71N17m84L01k0K03q2j62J35l4mJ46j02K5J18k09P4j30jR5k31M84
3812B55l64J82l16K96k38J02J24r8nK6M0J9j34J52o9j03K80j93K32j71J89k55
3834d9jJ08j71J76Q3l10M49n98L47k46R2K12Q5j69K59l06o4L0j71K56J37j26q2
3857e9K13j87j7Nj59K90k04K73k65K94k15n6L42k90N1j69J1K12j15J2R7j4k32
3880a82K08j93K19n2J8K8N1j91J66K00k74J69j68Q8k06J66K7o7OQ0p2o2j28M04
$$ y = [228, -42, 150, -50, 189, -13, 109, -144, 13, -99, 61, -51, 77, -71, 226, 34, -233, 165, -203, 179, 120, 6, -151, -356, 209, 62, -69, -43, 226, -134, -16, 189, -83, 26, -156, -18, -283, 46, -16, -57, -77, -43, -100, 172, 115, -49, -92, 14, -434, 79, -197, -73, 103, 63, -257, -206, 182, -101, 68, -334, 172, 121, -31, 83, -151, -44, -13, -384, 133, -351, -50, -70, 133, 51, -111, 24, -10, -14, 132, 30, 55, 173, -36, 38, -92, -93, 2, -229, 255, -109, 73, -243, 53, -185, -83, 41, -57, -62, -36, 4, 23, -111, 41, -28, -131, 149, -44, 188, 17, 206, -49, -50, 58, -113, 63, 146, -164, 285, -313, 34, -212, -120, 92, 177, 8, 267, -39, -103, -73, -244, 12, 149, 23, -59, 154, -33, -50, -45, -204, 86, -118, 155, -110, 184, -31, -87, 255, -35, 16, -153, -142, 70, -45, -33, 64, 50, -182, 26, -167, 52, 0, 18, 46, 97, -94, 72, 272, -2, 167, -1, 87, -119, 47, 74, 7, 13, 93, 21, -41, -169, 235]
3904B35l31N9K24j79J42m20J34k1K70j68L76m03J54j21J40j23P5k19j5K49N3J00
3926B11j79j30J60M1j24K20m31K1J37K88j56n3M4J94l70J58j89O2Q7l82M24o1
3948b8K16m1k01j24K18J59j95j31K03j75r2P3J23k39J45J82P0j81K2j00L7N5m8
3971e2j61M01l50j63L21J86l95L10j9l07R6J62j30m5J58k3k34M00k21j20J87j06
3993a05r5K16j10Q3K82jl28j57L8K56j3j48j7j92L78%j56J48k63K17l0L28m25
4016i4l5J10j68M30l33K52m77J35J23Ln5N7M2K30j48l27n9R1L41l75P8P8K01P7
4040A77l24O2j54L08J14O0j45j98pO0j54K31n4j25J06j4Q4O3n4jJ2k30M05j09
4064A13k67J72J21J07k66l0K12m67K10J54P4J34j78o5j26J12l9mj02K20m1l88
$$ y = [235, -96, -37, 187, 8, 150, -270, -136, -157, 113, -55, 321, -82, 72, -49, 91, -32, 43, -176, -191, 58, 111, 211, 32, -98, 62, 103, -21, 199, -232, -211, -74, 214, 58, 5, 49, 243, -127, 31, -158, -96, -9, -391, 33, -28, 188, 147, -54, -178, 40, 199, 4, -127, 76, -99, -191, -118, 5, -234, -89, 93, 163, -18, 4, -96, -59, -4, -52, -213, 188, -162, -325, -4, 182, -213, 97, 78, -229, -133, 29, -101, -146, 12, -11, -245, 155, -66, -186, 1, -105, -200, 16, -94, -11, 271, 270, -58, -215, -177, 79, 66, -82, -99, -291, 87, 87, -69, 79, -184, 33, 3, 331, -94, -129, -19, -187, 243, -90, 162, -315, -180, -57, -54, -109, -52, -10, 220, 72, -255, -314, -223, 118, -257, -179, -101, 100, 177, -147, -85, -239, 69, 183, 243, 98, -100, -107, -47, -201, 30, -24, -149, -43, -57, 27, 90, 36, 35, 47, -183, 222, 113, -154, 18, 139, 246, -20, -50, 162, -305, -95, 59, 133, 267, 89, 24, -102, 10, -29, -33, -135, 85, 44, -344]
4086c44K28K23l1J59k50L15j31M0m77L68n0j38L8N0j57K37pJ9Kl06M10k0l48J96
4110B6p4J3m5Q2kK4J8M2j01J00j73K25m8n7K94m58m1M05o7ll47J68N9k03K93k98
4136a68K76Q0L40o48L79r2P0q2l11K45L1q5j34J09j54R6K09k74o9M82m90K49j28
4159f9J09o5r1J18l8J4Q9L2k04L00m55L58MJ12j39l14K31J20m21L73l8P5o5k18
4183a82L45j69j55L1J65j21O3p6N5K7K9J2M8K16k91j25k1n8L53q1R5r1k06R2j0
4208e5M1J02j11J91j84R9j42K49m03K5K76j23n6P3n3j41K35p0N9J02j07J25k76
4231a44K3K07J77j17l69K22j04K73j24J23j2j08J1m78M25l8J69o9P4k51J42N1
4253H3o9J2kJ59k59p3J50O8n3o5J77k51L37k16R6J93l83O4r9M2J98ql3o1%j35
$$ y = [-344, -116, 107, 76, 235, -15, 300, 169, 209, -268, 100, 50, -88, -50, 0, -157, 80, 73, 92, 94, -212, 198, 178, -170, 26, -48, -35, -80, 2, 0, 24, 42, 84, -17, 83, -90, 135, 87, 30, 324, -134, -175, 230, 163, 160, -187, -19, 40, -163, 130, -168, 108, 188, 528, -120, 259, 167, 237, 155, -156, 89, 120, 35, -99, 10, -144, -48, 161, -113, -182, 300, -190, 59, -69, 40, -25, -116, 2, -36, -22, 67, 99, -105, 195, -260, 98, 102, 214, 75, -239, -8, 112, -309, 64, 26, 101, 36, -182, 163, -6, -161, -130, 35, -86, -23, -99, -44, -17, 12, 24, 72, 288, -3, -128, -149, -207, 146, 65, 160, 69, -137, -45, -55, -14, 88, -23, 168, -16, 83, -59, 190, -213, -188, 88, -35, -91, -18, -71, -212, 23, -47, 12, 114, 7, 132, -144, -121, 86, 263, 146, -223, -1, -105, 168, 44, 167, 155, 47, 58, -420, 5, -33, 136, 67, 141, -110, 32, 83, 14, 26, 24, 183, -76, -149, 1, 69, 16, -49, 128, -123, 214, -2, 94, 287, -96, -32, -131, -89, 109, 101, 68, 7, 7, -128]
4279a28K95l25L24j63j63N6j49N30m51M35j04J3k21j34J49O5l12L05j12m7K39
4300A02l61M59l02J12j9j6K20k25Q6rJ44j75m9K8K0J18k80L01j12l79J59M17k12
4323B7j51O3J13K01j93L3PR9k05r5J63k42k6J97q5o4J38J38j57M3n4k1J56r6J79
4348A68j12k07M7L71l46Q6O5j08P2K3R3k67L8N6o5K51k01N7R9k20j58J73J70k65
4372a80J09J40r0M7J90m9K2l0j13m38M17K55j69k55J15P1j2j41J32N0j60p4L7
4395a26J37n5o4J52O9k56K38j31K2K25J05k36j21q3N73n21Ml0L26l35K24k56K3
4418a16J12j4N6N8n0l8L9J03k10P8R1r3Q8Q2k96R4k3JP2k45M9K84q8l16L22j23
4444h3K41l02J41K21k13j07O2J04j01J37J45l27J04m0J43K9q9j13K0m6l8N0j45
$$ y = [-128, 167, -158, 166, 3, -160, -104, -253, 277, -174, 261, 157, 170, -51, -185, -36, 29, -283, 22, -90, -137, 102, -259, 200, -102, 10, -9, -25, 195, -30, 56, 47, 191, 16, -33, -5, 15, 133, -147, 154, 42, -337, -178, 239, 27, -124, -61, 52, 253, 60, 93, 100, 199, -6, -101, 62, -180, -206, -9, -94, -158, -20, 118, -39, 4, -50, -71, 85, -11, 168, 56, -151, -104, 267, -79, 7, 72, -36, 36, 59, 152, -115, -77, -21, -86, 165, -36, 21, 120, -100, -258, -85, 85, -180, -71, 69, -21, 26, 216, 167, 189, 159, 46, -392, 25, 280, 111, -144, -29, 42, 30, -111, 21, 71, -89, -163, -126, 11, -44, -108, 44, 113, -143, 95, -36, -14, 211, 316, 80, -41, -124, 449, -72, -68, -98, 228, -107, 117, -139, -116, -4, -18, 38, 96, 46, 8, 47, 150, -60, 18, 109, 16, 104, 186, -110, -16, -39, -38, 34, -211, -162, 122, 34, -282, 40, -83, 158, -144, -3, 218, 5, -102, -40, 64, -37, 100, 245, -82, 22, -18, 125, 154, 65, -48, -28, -74, -112, -62, -207]
4467b07j57J79R8PQ3O6j05k30L33n8r3j00K6J42m5L7J60j91K5J53j30k35L31p9
4491A0j17j65K6J49p8K66l6J81l25J50k32J13qRP4j97j41K22J79q9n2L55l39j3
4515e8k35K19K54N1k72o9K5l7L61q2l12J62l79J92M20n08L61j53J72n5k25j1J91
4538A2R8p8j96J70J01p8J16J66k03l27K68q3Q0k56J26LJ34j64M71l57J2J60j53
4561B2J69N1j95P5l48L8J94qJ06j99jj3L48l92M8K37l13N2k27K81R5K52n1n71
4585c50J50M72l95L93j22k56r5K85O5k06k5J07j36k01K94q2K3j53L58m71N84p0
4607A69k5j81q8K22j37k0m4j18K96R6j17j11J40k35K60P1Kp8L9J46l82J11p3j41
4631a98K15j19m0L4K17j69j26J52j19M52k72m3J09j65K30Lj79k8j36K60j81K54
$$ y = [-207, -364, -185, -87, -80, 3, 69, -36, -266, 67, 9, -84, -184, -158, -16, -61, -24, 136, -55, -30, 123, -7, -242, 89, 10, -107, -272, -246, -97, -175, 91, 55, 236, -89, 61, -171, -58, -66, -57, 17, -180, -321, -99, 80, -9, -61, 294, -45, -58, -293, -74, 180, 231, -41, -110, -85, -122, 239, 157, -155, 7, -372, -180, 240, -268, 93, -60, 112, 57, -168, -179, 12, 110, 32, -164, 6, 107, 29, 145, 311, 108, -219, 49, -34, 46, -210, -84, -81, 53, -111, 360, 3, 15, 175, 22, 191, 242, 47, 122, -226, -188, 6, -2, 104, -95, -96, -109, 239, -153, -105, 132, -181, -129, -356, -75, 20, 272, 221, -350, -200, 272, -123, 270, 148, -108, -203, 82, 147, -59, -84, 23, -113, -314, -20, -102, -79, -232, 126, -345, 239, 169, 144, -37, -125, 97, -40, -60, -104, -222, 74, 170, 53, -58, 82, -153, 107, 178, 180, 102, 141, 287, -95, 16, -57, -198, 17, -102, -142, -108, 109, -60, -186, -34, -153, 299, 27, -16, 93, -72, 158, 161, -18, -46, -182, 78, -103, 151]
4653A51k68J04K77k84o6J44k04n9J82J88l06J33k6j17L78j50r4q2n5K68L2l58
4675b12j17K41J06J06M2j04k48P3k7J70l4Om4J81m09L83J03k72K08j35j56M80
4697C41k20k81J44K54J17k17r1j36K39k89J7k22Oj79M66J75j13j74K78j88J13
4718D0j41J04rj31L56j60Nm9k3K38k87J47j47j23K72%m3j64j0J26K94k96O3j92
4742a30K9J9K5J56k61K44P6j33K1k13K95qn5j92K04k42J78l2j97K42M9j79N9q8
4766a33J90J16k85J54j79J18j09J06k7j82K18J45M6j27j5R0l7k09J36K02r2j46
4788b0K07j18j77J66l16J07K59q7l97M67J7p2L8l07L86k76J55k2k56M26j69R0
4810A01R4l32L08m20K49pK2n2j78L37m67K33q4L21l13L43k37o8r2L39j62J0J15
$$ y = [151, -117, -13, 264, -20, -86, 58, -146, -205, -23, 165, -141, -8, -34, -151, 227, 77, -17, -99, -154, 114, 146, -212, -329, -88, 18, 124, 166, 62, -186, -113, -140, 30, -4, 2, -42, 139, -270, 113, 216, -56, 152, 17, -139, 341, 121, -160, -16, 238, 355, 138, 47, -89, 150, -139, -122, -344, -338, -517, -51, 124, 11, -163, 115, -73, 40, -101, 3, -6, -137, 219, 59, 64, 15, -8, 230, -57, 90, -57, -180, 92, 92, 49, -115, -125, 1, 295, -1, 62, -130, -101, -82, -57, 99, -162, 82, 158, 25, 46, -167, 128, 120, 65, -127, 77, -165, 13, -19, -216, 26, 75, -104, -45, -133, 57, 173, -112, 42, -137, -19, -128, -22, -49, -231, -13, 132, 178, 51, 36, 126, 89, -120, 16, 218, 126, -20, 187, 69, -108, 58, -258, -151, 108, 21, -376, 91, 108, 36, 74, -233, 153, -123, 32, 10, -246, 180, 11, 101, 195, -137, 171, -249, 0, -7, 15, -37, -215, 122, -345, -112, -196, 125, -188, 155, -82, -150, -242, 97, -65, -55, 60]
4833F0N1J6k59K4J10o3q0L44l61K78j92J93j78K58n61J96K12k05J13P1m6o6ON4
4857b5l1o8K97j43m3j34J48R7j48J62k58K76j94J44r8j27J25p4J72p4jj02L4q2
4881a47O3L1P1J83o7k58L79j32J0j36q6l7K25j82K43l67L67%q8j86J16K61k18
4904D5k84R3K41k60J94L2M2J07l92K79j10r2J75M2j99Q4Ol2l35K55K70N1j64j25
4928g7J37J34l66kJ76k13K48k70j01M12k08K00Kj64r3P7J92j22J15k9l7R1j24
4951b2J05J18j66K1Lq1J05N0r9N3N2Q8r7j31m6J33r7j13j39K55K20K5j84n0L2
4976C5Q1k75K97j06J23l34J10R5r6J32J13k17j24K62k45J15K33n9k15L5jq9L43
4999B13l95L1K47j98K52j45M2R4m0j89k84L94L8K2k87Jl9O5L55j65l2J19o0j99
$$ y = [60, 111, 127, -132, -108, 2, -61, -141, 203, -158, 120, -72, 121, -57, 201, -360, -164, 48, -157, -44, 27, -19, -85, -79, -25, -56, -124, 173, 30, -13, -147, 1, 98, -50, 112, -146, 130, -64, 80, -18, -145, -20, -94, 78, 4, 3, -99, -65, -147, -84, -53, 18, 201, 134, -124, 255, 123, 133, -3, -89, -126, 99, -83, 160, -207, 160, 160, 72, -114, 2, 263, 45, -239, -146, 95, -165, 29, 61, 103, 210, -182, 97, -13, -105, 70, 112, -87, -3, 3, -29, -364, -109, 161, 212, 48, -77, 60, 194, -172, -174, 2, -211, 37, -233, -334, 78, -130, 70, 72, -92, -185, -108, 84, -38, 77, 48, 11, 102, -22, 83, 201, 35, 56, 59, -22, 83, 133, 34, 87, 139, 227, 130, -1, -47, 86, -11, -124, -263, -8, 212, 237, 53, 3, 35, 116, -159, 138, 32, 155, -179, -69, 26, -70, 62, 175, -42, -166, 96, -149, -34, 199, 140, -75, -40, -41, -130, 213, -182, -151, 96, -102, 150, 5, 47, 141, 101, -88, -372, 22, 60, 82, -205, -204, -243, -178, 177, 12, -20, 99, 39, -160]
5023a60J39Lj3J07j99J99r8P4L19m44Q5j46L61j25mj40q0j17P9j05L84k98K63
5046H4j13k79M06m6N9j8k37l0K98l36K03j8J18j50O5J06J2m65M56j91K2J03mn6
5070a1L2K49j82j63J31o7k18K10L4L5L0O6o7q1rm5J34j76L2J61K7j83J15k28K03
5095B9M9o0j35K5N54l72q5K14m41K25J84j04J65O9l43K4k70L92J13j60o4r3r9
5118a83J0K72r7k37L58j19k29K46J03Q4l61K07k7j68J1R5R0j30o2M69k09j40P1
5141E4q9j02L31k64K27k44J73j4J17q4%K2j88J05n7k07L14j95Q9K02o7l33M86
5164B76n19J8K25j04JL74l53n1k7K66j4l06J54J00k85J99k62J18K64k65K0j00
5186b71L39j9J96j21j35k18M7K43k66K37n6j16J58k68M25p0l25L90j36j38J42
$$ y = [-160, -21, -18, -31, 76, -123, 76, -22, 52, 371, -73, 12, -134, 227, 102, 98, -42, -122, -239, -160, -265, 119, -179, 84, -29, -308, 98, 52, 111, 93, -144, -174, 124, -212, -9, -27, 91, -59, 6, 112, 124, -341, 115, -76, -54, 49, 45, -11, 21, 270, 88, -75, 56, -11, -229, -19, 15, 50, 80, 146, 79, -2, -11, -56, 78, -98, -66, 95, 122, -61, 54, -174, 29, 78, 18, -117, -92, 462, 90, 5, 219, -222, 3, 187, 83, 248, 317, -26, -2, -272, 120, 233, 73, 9, -84, -183, -173, 99, 2, -235, 123, 4, -225, 21, 124, 208, -153, 54, 27, -141, -130, -35, 55, -75, -137, 332, 123, -17, 54, -35, -137, 194, -70, 157, -87, 86, 72, 189, 105, 105, 127, -61, 44, -13, -220, 94, -101, -12, 190, 123, -210, 276, -243, -225, 0, -104, -103, 271, -82, -133, -160, 106, 92, -214, -60, 40, -245, -46, -308, -190, 74, -191, -171, -271, 68, 49, 245, 124, -11, -229, -182, 61, -205, 32, -24, -140, 18, -250, 175, 105, -220, 170, 34, -104, 38]
5207C8k7J28m2Q0j03j15j26O2L33J48j51k90K27k07Pj53r0J7K16N8Q4l3l8J4l7
5232@K8r6J49k21J21K48l96L14l99N61k76l5J6L9k03L57l75K14J73j35k18K16
5254H2m0k42L52j87Q0o3P9l73N17l51N0K99l38K32j04l7P6J00k90L33k25j38M4
5277a44K2J27R4j86K97j68j14P6m0P8j07j14Q1P9K79n15L79m1k84L6j12K81m0
5300c6J19j68K82n4l13K65qj35K42j11j96j78L29o0O9p3lQ7J8n2L7M3j06J13k36
5325a25K2N2j63O0L30j30P3l02O2K09l7k6j86N6L8J09J4JK4n8J56m21K84k7Qn8
5351c5j54L25kl59K81k0j14J1K34j39l13O45n23K92j95R0l0M2L10m30j86K58M5
5374C3j27R3pj5n6j95L63j27j09K31K1n6lj14l2R0J6lP5j73K28k6j97J69J80j24
$$ y = [38, 11, 139, 97, 177, 74, -41, -167, -105, 228, 376, 225, -65, 162, -45, -38, -191, -281, -264, -48, 10, 94, 61, 23, 37, 0, 28, -68, 81, -140, -19, 229, -167, 147, -252, 309, 33, -2, 14, 53, -150, 207, -168, 46, 219, 84, -134, 82, 42, -200, 152, -35, 45, -18, 61, -312, 205, -146, -96, 203, -135, 97, -7, -44, 32, 132, -158, 175, -50, -188, -144, -122, 5, 99, -87, 210, 42, -72, 4, -36, 42, -65, -179, -98, -19, 260, -255, 124, 83, -201, -165, -277, 4, -36, 83, -85, 197, 143, -170, 95, 87, -48, 194, 83, -113, -291, 38, -22, 47, -26, -29, 58, 76, 24, 61, 104, -2, 111, -125, -103, -51, -214, -154, 176, 46, 119, -183, -121, 88, 51, 25, -161, -105, -67, 42, 56, 57, 81, 23, 179, -242, 42, 15, 23, -35, -189, 136, 134, -225, 56, 36, -78, -67, 167, 28, -285, 360, -163, 129, -66, 24, -6, 36, 346, -84, -270, -12, 33, -94, -1, -8, -23, -79, -274, 89, -38, -147, 84, 105, 49, 46, -68, -100, -10, 6, 3, 78, -95, 133, 107, -90, 79, 259, 135]
5400A35k18K07k04J65r4M0m8J02j28l62M49Kj87K16j09j31K82q7j94L02j07J15
5422A46k65P7j01Q1J2L44k53Q4P2j65n6K13l26J24P8J43L0l37K05L7k13R7j0K00
5446B17j99j14K05j10O3P4l55K87J65k31J38K1n82K87j41M69k4j81K63l06O4k09
5468a99Q8K35J21l01j49K6O0K53k12P8R9l9J31l4J02j57l29R0K08q2O6j28K87
5491B14j40j7j95l7J58J60k90J37p5K25l5l4j92K28j80p6K05r5m1J77n7r4J07
5514E3j6J14k53J54j95Q9P1rk97K09k33K89K8j4k8M4P9k62J47j04N5J3K7J16l30
5539b53K79Nj77M4q%j73M25K5k50o4NP4J09j90j7K25o6j8r6J76k03K10j16m4K01
5565A03k58J90r0K05j92Qm8K34J72n25K24l5j4R1m3k74K51j94J02j60J25j28L20
$$ y = [135, -83, 124, -80, 85, -9, 31, -17, 85, -43, -405, 44, 46, -141, 75, -34, -165, 117, 30, -164, 138, 31, 146, -119, -42, -143, -62, -50, 294, 41, 125, 197, 32, -24, 189, -137, -13, 65, 208, 238, -99, 106, 143, -70, 27, 17, 217, 18, -96, 109, -1, 62, 136, -219, 68, 233, 2, 140, 161, -421, -134, -275, 194, 170, -11, 252, -54, 10, -199, -111, 124, 245, -56, -205, -179, -119, 134, -78, 0, 99, 60, 191, 157, 259, 102, -227, -137, 71, -11, 55, -73, 214, 74, 57, -138, -175, -17, 143, -147, -10, -85, 140, 105, 71, -121, 107, -73, -149, 56, -39, -80, 97, 40, -54, 53, 37, 151, -102, 52, -143, -54, 17, 8, -289, -80, -313, -24, 4, -10, -38, 6, 85, -177, -30, -134, -79, -66, -39, 77, -253, 26, 31, -146, -102, -110, -110, -283, 142, 167, -83, -147, -142, -68, 41, -149, -166, 59, -7, -25, -121, 55, -148, 62, -54, -98, 103, -155, 35, -55, 150, -42, -34, -82, 152, 324, -201, 23, -12, -26, 65, 22, -252, -1, -195, -93, -253, -128, -256, 64]
5588F4o9J86k02r6n0L54k3k53p0J69LJ83j96k06j43N16j81n2L9M7k6j1q5K78k92
5613a16L16k21J30j49J8K1O4P8j25J14j87n5o2j00K40J94m90K75%L55l68k03J59
5636a12K85n4K7k54j07L17j05j33O9J66j3m5m2k15K60M3k63j06K90J3N3j70P6
5659b0J85n5j48K9K12k80k29L32l2L38m73Q2L58k02j59m9K82l09J19M5k46L37
5681A17j58p3OJ54J07o7M4J17j07j54l9J19r3j8l8J32q8K34k07j34L8J37pp0k4
5706g2jO6M8O7j45L10j08L9m39L82q6n4K0k41M31j86K0j89J85o0q7K7m3j10J93
5731c3K61n19J74M12k42k41R6m8J59J1K36k01J6J97m58K5J15J25j99L33j42lj40
5754f6K54q2j97j9K13N9Kl19L17m6j33J61j78K9Rr0l8J20L1M2Q9k47n5L88k80
$$ y = [64, -5, 181, -21, -117, -167, 187, 164, -89, -159, 10, 13, 196, 0, -206, -349, 167, -14, -66, -27, 20, -6, -17, -102, 176, -116, 200, -21, 109, -40, -22, -1, 63, 141, 16, 130, -57, -112, -174, -274, -34, 160, -330, -55, -55, 300, -68, -271, -112, 173, 119, 146, -108, -215, 102, -3, -136, -67, 99, 86, 41, -1, -216, 44, 87, -176, -282, 8, 21, 74, -96, -20, 165, 110, -38, -9, 203, -77, -306, 26, -6, 332, -141, -59, 299, 97, -62, -111, 171, -138, -19, 26, -220, 117, -41, -114, -108, 46, 153, 86, 130, 247, 140, -14, -53, 66, -27, -45, -83, 49, -39, 195, -12, -146, -108, 29, 22, -48, -72, -73, -7, 41, 108, -37, 273, 165, 204, -235, 147, 61, 7, 27, -214, 217, 31, 51, -138, 47, -13, -100, -73, -116, -226, -33, 228, -291, -117, 295, 53, -188, -92, -140, 19, 30, 266, 65, 81, 278, -180, -155, -40, 85, -114, 219, 77, 74, -66, 188, 106, -91, -110, 103, 162, 164, -155, 162, 116, -17, 144, -34, -5, 4, -86, -124, -4, 27, 69, 158, -89, -144, 244, -36]
5779c6p3J63j43j00J74k61J24J33o1K0j98L65n2j9o1J2rK04k59L4J33j17J62k19
5803h4J33j57j0K13k46K14j58K48p3qK34k20j76K85m16K38l9j28Q8P1rN3k99J37
5827a09J77r3p2J39P3j76J10k14Q8J74L5m05j8M25p0j86J4J28m4J20m7j23n3M60
5851C33k63J3j29j79K33j69K3J45o7L1J97k62M33l95n5L21k22JO7j8l0k08L5M0
5875a25K16k70O7K20M6P2k56pO7k32n2K70j91J34j06K69r6P0n5J03m9l2j50Q1
5899fkM4M3l28N56m51J53l8KL73j69j92J80k18j78J76j27J85p6J3R9J36lm22L47
5924I7j09J67J16l10J96p3l40M61q4k54J63r9K10l20K89k18J17m5J27K2o6k36
5946a89R6K21k71O9j09J36o9l6R8j30L56j01j12o6J35p0j71L03j79k46J26K73
$$ y = [-36, -109, 54, -89, -189, -15, -276, -152, -19, -80, -60, -258, 107, 55, 36, -25, -13, -22, 182, -77, -43, 90, -27, 135, -84, 49, -108, -118, 95, -151, 63, -95, 153, 80, 72, 306, 86, -90, 195, -221, 17, -22, -150, -62, 9, 0, 53, -246, -109, 68, -25, -97, 42, 115, -61, 49, -165, -77, 97, 132, -273, -291, 134, 64, -122, -108, 20, -24, 96, 49, -74, -127, 333, 70, 83, -46, -225, 8, -161, -138, 7, -60, -29, 168, -94, 339, -56, -111, 210, -12, -11, 56, 38, 8, -200, -165, -125, 91, -179, -112, 108, 154, 226, -30, -37, 30, -202, -254, 16, -175, -41, -147, 122, 26, 96, 41, 144, 95, 63, -87, -6, -8, 36, 79, -249, 307, -144, 9, -29, -27, 346, 177, -15, 165, -53, -231, -55, -182, 3, -73, -60, 39, 175, 172, -250, 97, -12, 155, 271, -39, 157, 84, -256, 205, 121, -133, 30, -69, 141, -179, 110, -108, 9, -36, 91, 113, 47, -189, -93, 128, -143, -74, -183, -47, -116, -152, -54, -184, 172, 71, -41, -107, 28, -42, -213, 90, -89, -335, -209, 64]
5968F4J39k51r4K13p6J80l06L72l05N7P1P2j87K14k17P2m6j02K37k0l85L53r7
5991d2p2l7pJ74p2j7N3R4p3K47r1p6m1q3K47m84R8K45k20K43k27J79K5j82m2j
6017a62J69J00K32j80L1j25l80M17k56J28j33M80k77j98J99J39j84j06O4P8j02
6038f6n7K08j98pJ31N1K4j28k1m8J13j33J52L4O3J34k1L3k16k77J45J90n5o8r4
6063a11m0K03M7j66L60l60K81l3j48K97k2k46l68L33K3p7L2m23O02k90K15m22
6085c13P3K67p6n3J66k97K65j8Q8j19J70n3k29J44k40J52L6K02k44j11K09J8j08
6108g1J70m43N13j00J6Q0j06j04k68L69k38K13J13O7k68K12r6l17M27r6k9j19
6130g5Q4J37n8j79K90k45r8J07k30M48k10R4k4j48L34l71j17M0K02K7p6k52N98
$$ y = [64, 203, -48, -142, 71, -5, 175, -131, 241, -64, -7, 64, 136, -51, 163, -54, 18, -28, -130, 107, 87, -298, 55, -42, -114, -151, -158, 16, -56, -73, -20, 74, 1, 248, 157, 81, 40, -43, 204, -280, -182, 63, -157, 86, -141, 38, 63, -119, -161, -162, 7, 107, 339, 159, 190, 65, -315, 102, -154, -26, -159, 321, 44, -154, 45, 184, 0, -106, -42, 36, -66, -123, 85, -113, -120, 11, 62, 86, -42, -63, -111, 2, -131, 21, 55, 118, 252, 231, 264, 48, -229, -84, 106, 51, -17, -111, -151, 52, 99, -67, 293, -67, 214, 181, 33, 330, 308, 62, -306, 27, 50, -27, 5, -418, 184, -106, 109, -313, -240, 27, -49, -102, 64, -233, 32, 14, 102, -17, 153, 100, -129, 15, -225, -73, -37, 165, -79, -190, 19, 37, -71, 99, -344, 169, 69, 85, 165, 59, -45, -313, 56, -182, 31, 144, 211, -57, 155, 59, -258, 169, 73, 44, -75, 9, 146, 88, -91, 199, -46, -144, -37, -267, 181, -29, 65, 41, -107, 227, -144, -261, -221, -19, 8, -68, -320, 278]
6153B78j41o0j27J13J83n00L88J48j97j60R0O6m9p8q0j77J07J45J80j46K1r1Q1
6176fr6p8PK46l8j15K73j77K4K30O1j60m36L18J58l01m4K62j48j8J17L26n11M3
6200f3K3O6K8r4L14l90J24r7O6P9J17l5l71O0L36j14P4k02k30L37K0k59K25Q8
6224A02j43K0l8nj8L32k50L06k23K40j89q9o3ok56K66Q7m29N39q3R5k69K37k08
6248d5K42k61l4J23o0J70J35o07K45L7P4N1k59J20M3k6r9J54j59J84K10p5N4m01
6272a84K45l30K18J78j02p5J93j7R4m05L4J12j22PK12K45k07jJ59k86j07j7K55
6295I9k56J30o6J29j65K1p5K36j38J7J73j42K02q4r1o3N8j48O0J35J69j81O3j51
6319f8O1r2K10r7j0l5j3J3j62N09j49j0N5j02L64m10k57J78K84n83K22q9O2K02
$$ y = [278, 137, 77, -50, 63, 246, -254, 134, 282, 85, -75, 15, 81, 32, -46, -126, -303, -196, -51, 129, -17, 4, -87, -6, -102, -180, -173, 73, 35, -80, 193, 16, 40, 270, 331, 171, -265, 53, 211, -90, -134, 128, -20, -38, 79, 405, -106, -63, -40, 26, 54, -40, 274, -116, 8, -89, -23, 56, 173, 138, -233, -173, 163, 49, 123, -79, -309, 28, 48, -211, 14, 102, -41, -21, -59, -64, -82, 250, 0, 306, 83, 323, 134, 45, -18, -24, -280, -14, 73, -356, 183, 100, 195, -74, 163, -45, 197, -64, -98, 25, -35, 135, 270, -337, -92, -55, 19, 70, -189, -69, -26, -52, -151, 3, -156, 28, 238, 163, 217, -184, 61, -269, -51, 127, 25, -50, 143, 126, 220, -185, -151, -39, -161, -154, 58, 303, 96, 95, 254, -32, -139, -156, 99, -157, -27, -93, 36, -129, -108, -183, 53, -85, -68, 105, -37, 165, 81, -10, -73, -15, -163, -103, 32, 201, 20, 83, -68, -7, -99, 111, 14, 4, -31, -44, -31, -193, 316, 167, 157, 212, 110, 474, 64, -193, -15, 269, -314, -92, -181, -119, 83]
6343H3l71N63l34K67j78q6m2N3J5k60K93j09K2Q1o8j2J02o8J44j08K93l99K24
6366A05p9J98j77n0l9O5p9J48k57J65J00j80L36k52nP5rr7J33j3j63j18m1J68
6390f6M9p5K38q7j09O3R7j77j4K63j65m2P1LN5l5k63K33k08n1J48K16R8k88Q0
6415C4j16L1J08q9K59k94JJ68k09J84N4J69m28p9K17J17q9M5O7l07rJ93m1n8o3
6440a35M13l52N0j33J28m0j97L38j47R8M1k1j44NL66m23J58J03j9j95K06m0k85
6463b25J94K27k34J46L6l06k0M9K77j16nj14L15k49J53k7j3Pj36J6J07N6on2J81
6488B61N1k81j20P4L76m90K11q1%j64R5J80k65L6j20J61Q9J57l17K30P2l25L62
6511A92j47k30J36Q9n6L52k20j38Op7J06j19K15j62J84j7J3J03k16N1j40J75j82
$$ y = [83, -288, 275, -59, 208, 30, -56, -98, -45, -30, -290, 3, -106, -84, -3, -71, -83, 19, -49, 95, -13, 280, -119, 105, 26, 224, 47, -3, -42, 23, -56, 92, -165, 0, 100, -80, 256, 4, -1, 74, 65, -32, 101, 88, -75, -193, -234, -66, -17, -92, 146, 59, -50, 13, 110, -67, -81, 182, 17, -25, 46, 49, 104, 69, -194, 39, -169, -220, -72, 144, 242, -46, 34, -82, -51, 57, -32, 227, -67, -66, 102, -107, 77, 131, 300, -128, -207, 10, 127, 38, 83, 150, -157, -166, 27, -14, -72, -135, 278, -74, -24, -157, -29, -69, -266, 72, -75, 23, 64, 43, -101, -96, 270, -153, 5, 108, 89, -106, 100, 60, -225, -31, 196, -38, 108, 144, -162, -182, -133, 144, 28, 23, -91, 224, -25, 128, 101, 88, 95, -41, -25, 82, 138, 132, 80, 261, 312, 31, -89, -15, 361, -129, 82, 1, 1, -163, -68, 112, -153, -117, -237, -76, 13, 170, -147, 83, 155, -170, 192, 45, -185, -49, 40, -16, 336, 116, -22, -16, -93, 13, -106, 109, -53, 131, 114, 127, 230, 14, 65, -75, 100, -82]
6534h2j19K04j27K74j51K9j8j12J14P4K5n3l1K19l35K93m30J09K02m6j24J01j94
6557a78L3K69j04K13j78k46K87j99Q4Q1o8J48l06K50k04o4K24k13J36R1j21Rj82
6580b38J80k75K8K35Q1j2j5m4P6R3n0j35j64K20k9J3j50J80J63j64j16O3K03j88
6604d5n9K27k33L9R9J0k0jL11l57L8o1k5P3K32l92J74K75l52nJ79m9o0m1R6j13
6630f0K6j3Rj15L0J90k22L22l0k45k17L40K04k93L4j34M7J92N2k5o7n0q5J8Q4
6655hK7J09r0p9n9J76o6P8K3m22K50M0K6R5k11J74j24P9J45l82J65P5K10l39Q
6680a00J07m4j58K54k78K12j0j8L7rJn4K39j37q6K20l52J63O4k23J42k7L44r5
6704A92k96L85l65P6j22J5m7J20J42j45L7l4O5J86l88K46j80K79k22Jl3j98J92
$$ y = [-82, -201, 3, -124, 150, -1, 28, 10, -102, 12, 86, 111, 58, 27, 246, -89, 204, -226, -117, 85, 39, -85, 16, -178, -145, 124, 20, 233, 55, -191, 96, -103, -19, 62, -6, 142, -164, 86, -118, -182, 42, -171, -35, 56, -65, -56, -238, -58, -333, -305, -70, 11, -1, -16, -60, 16, 109, 59, -76, -240, -20, -49, -36, -186, -6, 157, -7, -123, -60, 143, -45, -104, 123, -110, -71, 28, 38, 18, 17, 328, -29, 9, -52, -77, -4, 228, -164, 10, 285, -67, -72, 107, 58, -2, -43, 53, -60, -34, -47, -38, -153, -123, 67, -155, 167, 137, -108, -325, 15, 219, -74, -40, -174, -127, 65, 117, 92, 25, -25, -110, -92, -8, 19, 128, 38, -41, -100, 76, 10, 88, 111, -311, -61, -21, 5, 100, -111, 63, -61, 18, 163, -219, -54, 21, 231, -108, -100, 7, -37, -195, 59, -219, -7, -17, -35, 2, -7, -6, -60, 179, 42, -44, 176, -176, -13, 51, -172, -30, -57, 287, 192, -104, 281, -84, -8, -130, -115, -162, -42, 100, -45, -8, -42, 23, 209, -179, 67, -113, 166, -56, -55, -88, -286, -94]
6727i4N5O1L5lj58R9J36k85O9J95j19J6M9Q9j34L9P5l70L35n9m4J62q2j07K22
6752A82j82j12K93o7l70M87k96J6L61n22K84RJ26P8j23k09Kn3K2l02N47pk72J51
6776D3k76L53l82J77L38j38j07j25m2K90J36l68j74K86Q7r9J6J02k99J56k8J85
6798A31j27lk45K75j25J79J60j41P7k36P1o0K23O0l61J56N3k7J23m10L73j91%
6821d5rJ6j71J45k27J51J41j60K06M0p1J19l0j48j32K50k28J7J22J35k74q0L83
6844A50m23K10N3J07j52J25k47K33k35L11m44N86l21M1j22K01j64J0J22LJ7k54
6866a93O1K30J01r8m5J30n8l11J40M5J42k39N2q9O6J90P0k83K90j49m9j28R6j55
6890a84K19l16J75J14j11K80J63k31J0J4j21J1l52L03j0KJ49k69j19K31p4L74
$$ y = [-94, -39, 22, 57, 54, -104, -5, 131, -154, -85, 110, -9, 7, 56, 145, 11, 50, 125, -245, 90, 31, -13, 149, 67, -40, 182, 0, -112, 181, 114, -256, 231, -65, -49, 312, -210, 74, 83, 209, 287, 164, -45, -43, -96, -74, -376, 171, 164, -108, 43, -233, 120, -262, -85, 253, 115, 8, -117, -159, 131, 267, -101, -275, 11, 98, -1, 15, 117, -182, -26, -54, 131, 4, 1, -244, 31, -94, 85, 245, 104, 181, -55, 16, -44, 179, 239, -122, 34, 87, 60, 183, -227, 146, -45, -45, -54, -38, -209, -64, -291, -140, 1, -159, 47, 87, 16, 135, 105, -43, -175, 75, -153, -136, -14, 121, -153, -233, 150, -273, -63, -10, 97, -55, 70, -177, 56, -179, 132, -312, 274, -47, -6, -128, 73, -91, -81, 41, 44, 61, -193, -132, 98, 199, 101, 56, 186, 128, -183, -43, 2, 144, -95, -43, -132, -66, 124, 194, -89, 201, 52, 3, -125, -29, -184, 35, -281, -106, 8, -103, 177, 340, 109, 119, 133, 12, 23, -329, -26, -36, -34, 115, -154, -273, -42, -116, 258]
6912B58l2j60j02r3L14j47Jj4Q3k71K01K28k83M47l80j0k75J39j62L85q4j57K7
6935h7J6J64k16J32o1R3o1op4L31r7k74P01q08J82L17j60p2j12qJ68J58k94J44
6959G6r1L5N0p0J79k59J72j56J08K51k74N5k78K55o4M0k69K08L3m6qK5q8J26m5
6984c5L6N4L8j98m8L37j80l0k02K98j58J69j90o7J84J89l23l5J4J81q0j74Oj37
7008c51O15m78j0l4K69j3J09J46k76N3k78L06j57l7K03k63J67n1J37oj74K68r6
7031D9j96J35k3k00R3L8M25k75R0k06J3kl58K28K66r7o7J13m8j10M0K1j41J92
7055b0M2k22J68J53j90j02J22K2O0M4N2j34N3k50K69K60k39l40K79j50J53k16
7077a86k4J19O9k81L08J37k05J44j75J05j10O1k34M06l13K50j78N0m6J1PK2K11
$$ y = [258, 226, 66, -36, -129, 185, 38, 39, 25, 108, -163, 38, 266, -17, 430, 50, 40, -235, -96, -258, 127, 43, -114, -87, -71, 93, -123, 9, -52, 41, -20, -26, -100, 231, 134, -140, 561, -247, -65, 252, 92, 20, -92, -100, 68, 226, -68, 76, -15, 20, 70, 0, 179, -80, 92, -64, 44, 295, 21, 76, -202, 53, -11, 29, -240, -32, 1, -45, -53, -28, -116, 10, -35, 1, 55, 93, -105, -153, 184, 4, -26, -228, 70, -88, 81, -109, -176, 8, 197, -126, -161, -147, 34, -46, -220, -214, -351, 264, -214, -224, -258, 11, -2, 107, 253, -23, 30, -248, 58, -99, -136, 67, -196, -29, -80, 57, 51, -123, 145, 49, -147, -12, -35, -235, -142, -104, 321, 46, 136, -70, -57, -59, -417, -189, 77, -20, -87, 26, -22, -132, -92, -71, -212, -20, 22, -200, -32, 121, -69, -171, -49, -27, 33, 77, 129, -5, 48, -202, 67, 327, 88, -252, 27, -123, 30, -186, -210, -91, -22, -303, 5, 142, -63, 81, -94, 11, -99, -38, -272, 134, -179, 71, -107, -57, -103, -92, -85, -63, 148]
7100A48p2L7p8k48K76J39k87J26R3Pk22L64n59L13j98K84l7o4pK42j80R8j31M1
7124H5l80K47J43j86J78l98K27K55k64M1o4m3Rp8K86o6J87m47K76p0N3j45K80
7147A26k38K05K34l30J82j41Q5P8q7n3J23o6jj1N8k01o0J36j76M17k41m7K1L4
7171D7q1r5J65j28j4J8l62L44J14j47j3J16O7l1K9q1K27K4r7j61J33k76J49q4
7195a37J38m4j34K44L3k73K85j4j09j27KJ79j34N0L1o6O7m1L99k81l35K66K2k26
7219b05L63r9K1k26K13l17L51m75K25K1J44P3p0L8nj61Q4M5r4j0K10o4K8j89J45
7244D6k35J55m2J23L15l78p1k87L97K79l78L36k02k0K4n9J62p2k30M41j94J31
7266B41k25j26K03J5k3j28P5J17r5q1p7k6K02l0j93J50nK4N1k02J81j79P7O1J28
$$ y = [148, 76, 113, 35, -213, 63, 202, -85, 41, 134, 141, -81, 283, -276, 37, -161, 123, 86, 22, 15, 257, 77, 175, 44, 85, -295, -48, 95, -91, 87, -311, -84, 171, -93, -52, -116, -159, -150, -228, 58, -8, 179, -268, 8, -62, -9, -154, 126, -112, 93, 327, -3, 179, 38, 123, 201, 114, 61, 184, 118, 117, 106, 164, -37, -97, 39, -137, 280, 39, -8, 13, 47, -34, -129, 36, -92, -106, -88, -450, -106, 8, -139, -152, -36, 31, 0, 29, -52, 175, 199, 102, -59, 74, -202, -53, -137, 1, -43, -177, 67, 100, -173, 112, 98, -11, -138, -136, 43, -91, -41, -10, -76, -9, -50, 349, 68, -267, -1, 21, -205, 158, 59, 80, -146, 67, -250, 101, -374, -149, -128, 16, 89, 19, 57, 52, -109, -25, 20, -74, -84, 126, 62, 90, -99, 46, -189, -34, -76, 47, 362, -16, -87, -374, 23, 302, -76, 260, 58, 38, 62, 3, 165, 93, -137, 304, 110, 241, 16, -110, 93, 108, 85, -43, 32, 149, 54, -27, -104, -130, 72, 42, -151, -1, -6, 18, 69, -133, 48, -131, -54, 7, 135]
7291A35j30M1K64j26r1p7j65K37N3l50K47N6k78K23j0K8J54o3l94K09n0K25m2
7314I6k43M9K92l26N8m9P0J76l40L08j73K26j77m9o7K02j71O3r3q4L08k44L84
7337B16j77k24K33o6k8K1P9K4m2r0J67j69J76k54J44O2n9k44M17q4l49J92L1j94
7361b18K03j13RJ79m8Q3R8j03J02j71Pj83j3K56j59J53O4m0k45ok27M29j6j15
7385g4o7L50l73n4M67k11J96k61O7K35j60m87N79l50l4K10j52K08k33J58k2p5
7407h3j76J90j06L03o5l00M85l29K84M2k75J11m4K27k96J74m97J39M7L8J21q2
7429i2J17j99J90K35m48J49K02j46j4J50k76K86k39p1K12l4J37k12J70k05q1K40
7451G1l6J02k39jR4Lk7q5L00j43j42J58k14K85j6j64L83m24L63l25J49l26K03
$$ y = [135, 5, 46, 310, 184, 93, 16, -149, 88, 141, -209, 38, 94, -184, 39, 29, 57, 211, 148, -246, -37, -87, 138, 96, -147, -98, 194, -132, -74, -123, -53, 123, -217, 91, -82, 144, -33, -82, -149, 53, -118, -55, -148, -232, 76, -168, 216, 39, -185, 48, -18, -46, -25, 54, 78, 36, -54, 113, -56, 120, -134, 10, 72, 13, -231, 186, 102, -247, -55, -24, -218, -15, -128, -119, 60, 12, 95, 193, 90, 192, 21, 28, -155, -168, 88, -71, 82, 146, 106, -139, -145, -372, 57, 41, -74, -141, 209, -164, -218, 249, 38, 234, -27, 40, 275, 115, -372, 207, -143, -177, 33, -119, 89, -144, 14, -8, -83, -259, -69, -175, 128, 63, -237, 248, -81, 203, 245, -30, 81, 37, 264, -32, 142, -355, -216, -169, -131, -10, -92, 25, -174, 16, 251, -197, -48, 154, 8, -6, 144, -132, 154, -85, -156, 56, 22, 159, -53, 117, -88, -169, 71, 35, 137, -102, -103, -9, -6, -33, -118, 182, 39, -103, 55, -159, 126, 110, -54, 329, -95, 268, -57, 92, -234, -31]
7474c1K25l28K33j85J31K5M9n7j14J22j32j86K42k27K16R8n5L3j13P6p7r5N21
7497C71m79J5l4Q6J09k32L71k04Q8k26L9J04K19k60n0J09j22J88k21l7J0K31M8
7520A23rl5j69J46l13J37K12k19J72k35K36j29k2L86l41j55K57Lo9J2J22j07J40
7543A43j92J45j43J69Q3k27j66L55J8L0l94J24Q0j38J24K26k87n0K2k11R8L49
7565A58j90O7k71J95K44m78K86pK92j44j19O9j79J84k22j0P3N5m8k38M02k59J81
7588D1j76kj3J99l9J70k64J26J57j01l16L13l23j0L05j90K34K8J3M8k81K33k36
7611h4N1M3j18j14K07n5k4O5j96J20L46j08Q1k36o7L12k03K44k37l2L6O5j59R9
7635C6k98N71m52l0L70k12J49o8k94L03Jk57J83J10o3j9k03K24o1J37k28j9R1
$$ y = [-31, 194, -134, 99, -86, 45, 70, 119, 62, -52, 70, -62, -248, -6, -233, -17, 81, 26, 59, -54, 22, -55, -150, 371, -108, -93, -127, -41, 68, -164, 207, 3, 91, -135, -96, 8, 227, -33, -83, 26, -96, 92, -129, -166, -156, 75, 123, 114, 79, -90, 56, -257, -120, 92, -127, 45, -190, 46, -83, -105, 281, -60, -215, 42, 45, -24, -12, 110, 3, 143, -49, 96, -47, 122, 205, -22, -188, 167, 185, 215, -179, -55, 25, -113, 11, 237, -50, -100, -78, -289, -191, 158, -32, 35, -236, -41, 203, -275, 11, 4, 296, 152, 33, 102, -77, 107, -115, -125, -52, 3, -45, -283, 119, -140, 41, -135, -137, -150, 49, 10, 180, -84, 42, 199, 98, -218, 95, -228, -238, 67, -123, 111, 139, 152, 200, -81, 152, -84, -33, 10, -108, -222, -15, -70, -94, -29, -225, -105, 241, 133, 214, -22, -89, 223, 20, 264, 27, -5, 31, 96, -63, 36, -262, 309, -143, -173, 197, -15, 134, 66, -228, 75, 76, -181, 2, 112, 49, 30, -173, 51, -10, 127, -101, -120, -29]
7658b9L05k54k20K05j27J73r9K50n6k29j2J2J32j9j96J13n7L01j88j64K06j11
7680f4q2K76j64m4M35m24j8R6K13q9j32R1j38K49o9k07L6l4J85J9k15L57k53O1
7704H5k76L39l00K34o6j8Q6p6j44K94m5QM66p39q8J45o1Q1j21R2q8K33r4J40J26
7729B13j11j19K30k28J39k54K37k08L5L74m52L76k99J4j7KK8K7O8k4l15K03J89
7752A08j36k2Q5o5o5K59j22O0k10kq9K87j50J08J0j06j7%K55l69J35J38j39j30
7776a77k6m1Q9k8K94L0j68J43k9l6k5j1P7j09N6l4M3j06n8M7K23R9j69o9Q8p5
7802B8J09j1q5K10O4k51k64J35J45J37j48K6k55L23l19M7K2K03k55q7N94n40J36
7825c6K33k9j58j07j02O5j7P8M1j48L12p3j68p1L65k76J90p7O6l68K89kj66M09
$$ y = [-29, 276, 22, -198, 7, -120, 53, -46, 204, 148, -81, -93, -81, 51, 32, -164, -51, -108, 193, 5, -159, 47, -64, -146, 130, -34, -78, 357, -67, -85, 11, 224, 135, 3, 94, -44, 205, 136, -71, -35, -69, 116, 135, -80, 277, 24, 85, -191, 148, -152, 82, 16, -2, 84, 8, -136, 158, 113, 121, 587, -152, -240, -95, -156, -75, -196, -104, -192, 41, -53, 87, 213, 102, -17, 213, -15, 124, -130, 107, -101, -66, 308, -144, 232, -67, -53, -70, -68, -40, -13, 55, 31, -284, -81, 108, -28, -50, 35, -30, -95, 164, 42, 102, -108, -110, -199, 88, -62, 46, 56, -50, -67, -67, 188, -181, -46, 92, -47, -177, -203, -244, -155, -183, 111, 141, -27, 116, 87, 51, 26, 15, 92, -17, 39, 5, 48, -58, -116, -69, 154, 253, 84, 15, 103, 28, 137, 126, 41, 251, 315, 64, -200, -65, 80, 217, 69, 95, -160, 163, -156, -109, -87, 116, -139, -226, 368, -172, -36, 197, 168, 10, -97, -199, -134, -151, -73, -32, -180, 132, 59, -109, -180, 185, -91, 99, 22, 88, -280, 9, 7, -159, 250]
7849B50m70P9J68J07j07l85L34o8J07j79l0J33K6K27k10q4J24J54l14J29j20K70
7871A41Q2l58J93j0j04K12n79L01j51K95j66K57J2O9j05k49R1K04l05J60j85J89
7893fp6J20J99j81j01j00K74p0Q5m41K45O6q6M5K03k00o1K42j97K07k01J90l98
7916b42L00K0M2j63j24J21K49Q8l14j6k41K45O3J67k30k7p0J13o2R4j07K37l60
7939b17K34r5mK27j48J32ON8j96J18J4j78J69O4j77k6j73J78j20K54r9l3n9j01
7963a72j3J27N5J2J25l8m25K1L05k58N80o04K14j52K37j90K6K27K08L4m28J34
7985B5J60k98L67l86J84M3k11K06k08L47l19J92jj44K76l27L0p6L25n7m7j41R0
8008C0L5J81k59j06j05L11m9J28k68L38m42K92P6k78NJ00J80l01J38l3l1j98L83
$$ y = [250, -220, -141, 27, 134, 27, -358, -24, -92, 15, -164, -194, -61, -35, 192, -18, -102, 22, 176, -138, -9, -129, 141, 223, -135, 58, 48, -56, 156, -423, -122, -273, 22, -144, 113, 125, 194, 89, -160, -69, 135, -170, -10, -195, -6, -82, 38, 237, 56, -45, -145, 129, 59, 144, -297, -52, 14, -72, -27, 176, -24, -85, 157, -40, 167, -34, 156, -242, 58, 78, 120, -43, -167, -46, 203, 291, -23, -39, -280, -35, 28, 195, -35, -62, -132, -19, -81, 13, -94, 143, -217, 17, -78, -82, 145, -3, 129, 135, 193, -3, 115, 129, -49, 120, 184, 7, -19, -192, -14, -134, 120, 21, -12, -71, -172, -185, -58, -3, 9, 134, 96, -329, -308, -3, -261, 319, -285, -71, -223, 14, -176, -150, 77, 285, 319, -109, 25, 185, -113, 254, -132, 52, 95, -116, 90, -118, 229, -90, 102, 101, -43, 233, -94, -64, -140, 185, 128, 81, -60, 30, 65, 246, -13, -119, -224, 87, 38, 166, -102, 236, -206, 86, 162, -116, -111, -11, 169, -132, 6, -27, -58, -256, 127]
8031A27k26nM4J60Q4n01K02J43j55K31Q3j62L9j6P7K8j83J85k90KK89k43nN5J44
8056A07j26J42o4n7j4o1k24M81j20j84L62j40j10j18Q4j6N2oj38K32N2m10O55
8079C79l68Qj82J11K40j08rj20J59k53P2K2o3k77K75j1J85LQ2l12J99qm1j13J6
8104a14L09l22K42k47J39nJ01n1l12L12K00j89j96J23k7k08K80M0j65J04j1K16
8126B19k72p0J44lj07J62j61L43k85j67J98k91K74n8pL6J30q7K%k38L63j83P8
8150B0J64J5j07j69L2J71O2j74j08R0r4r1K03j49L00L3j85M3M6j24K9j87p2L66
8174A14o0J11j90J11j61L37q3j74r6J90j47o4K33j32l6L06m19
$$ y = [127, -99, -104, -60, 100, 184, -317, -115, 28, -127, 104, 187, 25, 64, 48, 125, 153, -30, 155, -135, -133, 156, -87, -92, -37, 107, -19, 123, 59, 2, -12, -73, -297, 184, 64, -120, 242, 102, -8, -126, -42, -58, -6, -12, -150, 82, 134, -276, 379, 11, 19, -163, -52, 188, 80, 71, -49, 110, -143, -71, -49, -112, -389, -114, -125, 60, 63, 145, -167, 32, 24, -17, -130, -114, 195, -127, 115, -132, 7, 2, 103, 52, -260, 52, 252, 63, -133, -10, -37, -245, 35, 75, -90, 14, 3, 219, -53, -123, 21, 18, -89, 73, -88, 255, -30, -197, 1, -290, -16, -74, -81, -45, 85, -2, 0, 0, -238, 125, -58, 20, 184, 199, 92, -77, -45, 126, 188, 14, -94, -4, -98, -189, 14, -135, 165, 198, 13, 56, 102, -22, 7, -180, -252, 114, 54, 165, -25, 86, -75, 262, 179, 5, -91, 99, -48, -112, 121, -11, -47, 259, -160]
8191a60
$$ Imaginary data points
##PAGE= N=2
##DATA TABLE= (X++(I..I)), XYDATA
0@%%%%%%%%%%Qj6J6j6J6k4L2m0N6o4P2q8J04j28J52j76K08k40K72l12L60m11M67
33B48n28N98o76P61q54R54j066J190j323J469j629J801j992K200k426K676k947
50a544L245l576L942m349M802n310N885o545P307q195R255j0540J2138j4190J6929
65I254k0798K6722l7036O0102k08434M3243K58474k06334J0378P9854l9838J2087
77a2326J37490q7205o8262J43987M0054k00148k2550J09621k4274m4923N1711
88B3175m6998n5532N7935K0756p0086J7989O4604m339k6462K0663J3297Q560L2676
101E6238O595m0159n366K0716j3517l1905k0939r504n99j3371n321L2544K5232
114F44r388M171K1964P294N241K3087K640l4313j8482M109k2686j6208K7366O284
$$ y = [0, 0, 0, 0, 0, 0, 0, 0, 0, 0, 0, 8, -8, 8, -8, 8, -16, 16, -24, 32, -32, 40, -48, 56, -72, 80, -96, 112, -128, 144, -168, 192, -219, 248, -280, 318, -358, 403, -451, 503, -563, 627, -696, 773, -856, 945, -1047, 1153, -1273, 1403, -1544, 1701, -1875, 2067, -2282, 2520, -2790, 3095, -3450, 3857, -4338, 4917, -5623, 6515, -7675, 9254, -11544, 15178, -21858, 38244, -170190, -126947, 131527, -74807, -64429, 15425, -24413, -12326, 125164, 37959, -30303, 113684, 153738, -46410, -68960, 40661, 16387, -28536, 23175, -23823, -79355, -21420, -664, -70750, -52761, 11843, 7504, -18958, 1705, 15002, 23562, 56238, 62833, 22674, 17308, 38024, 24507, -7398, -28337, -37841, -38440, -51811, -57132, -24588, 644, -8744, -4573, 17391, 24685, 29926, 53013, 55653, 21340, 2858, 6967, -15719, -31927, -4561, 1723]
128A723l0519l540J5463o971L454L3226R355k0907M689J3279k1433N71L8562m495
142C2457l0720Q261J475k9306M212K3975k0014k1798K0122K90k7434K1182L7071
155A9773j5287n430L0083p671j9423K3242Q377k9412o496Q101k0770j4998J8571
168a1340M542j4971Q328J0325p260J0342J7991n397l324O340o923p200O627K449
182A0529o881n520l736m967q51M539M83N77J238p055n93J1103K439L398J3147
197A7850k744j0535M746K747p441J961M886j3649j5558M608J479r226Q541J4798
211B463p777l657J4450J403m183J1613N286j0963m404L672o597q391O732R23j0960
226a0390J570P126p662j537J1890r28o889N440O853l585M37Q487j505p954M843
$$ y = [1723, -28796, -32336, -16873, -23844, -20390, 12836, 22191, 1284, 5973, 19252, -2181, -1610, 36952, 32457, 1737, 9998, 11473, -17833, -13621, 10354, -9660, -31458, -11336, -11046, -38480, -17298, 19773, 4486, -944, 29139, 21468, 2045, 25287, 33664, 4252, -2244, 5857, -14913, -29911, -11340, -6798, -21769, -13441, -3116, -10376, -34, 17957, 12560, 9236, 15576, 8653, 1453, 8080, 10529, 3648, -1872, -5608, -10575, -11426, -6887, -6404, -5827, -4589, -11644, -12237, -1134, 1305, 4703, 17850, 15106, 4571, 9317, 12064, 4623, 6584, 11470, -2179, -17737, -13129, -11650, -20876, -12335, 2463, -5314, -8971, 5479, 6882, 2699, 14312, 19598, 8635, 4231, 7903, 1306, -7085, -353, 570, -10390, -8820, -1694, -9356, -10893, 997, 69, -6820, -1380, 5473, 1888, 2325, 10812, 9307, 1353, 6196]
241F196L894q277j961M034q441p393L094J678k185K577N646K30k647N631N849
256G925q35K411K203m925n094j805j319j722k39O68j449l201J694L162j58K790
272A06L554j732k735K114J799j766Q7L716j461m254K027J740m902j91K636m082
288c344l514L629Q86k761K202M726r68r79M994J681l551R55J556n765k358K122
304d89j281k933P50J378j628K89M647J360j456K534R38l386m78K647j846j993
320i47J043O03k966JL043k37k045J794O64l132M16K262p73p13J759N75j297O39
338F89K560m87j942O53n60l084j17J427j341j039J424R92p62J622K664Jp77J576
356C499o26k289J9N72k269j316R42l96j051Q66K370n61q07K441l7j644J368J102
$$ y = [6196, 10090, 1813, -148, 3886, -4555, -11948, -8854, -7176, -9361, -6784, -1138, -908, -3555, 2076, 7925, 7090, 9501, 11704, 6779, 1685, -120, -1439, -3161, -3400, -2732, -4181, -7382, -5688, -2526, -2684, 106, 3660, 1928, -807, 1307, 3106, 1340, 1427, 5143, 3682, -572, 1455, 3195, -1707, -1898, 738, -3344, -6858, -3229, -2343, -5104, -2902, 1824, 856, -123, 4871, 6552, 3001, 3956, 5512, -253, -2611, -489, -1770, -4703, -3953, -2575, -4203, -3914, 733, 2093, 637, 3171, 4109, 723, 245, 2892, 1046, -947, 96, 699, -2267, -2266, 777, 540, -1505, 289, 953, -2179, -1763, 499, -274, -987, 772, 1347, 50, 689, 3249, 2762, 820, 1473, 913, -2171, -2288, -861, -2202, -3241, -1817, -825, -1587, 35, 2699, 2700, 1923, 3499, 2873, 584, 603, 1175, -1094, -2410, -1468, -1864, -2915, -2049, 321, -240, -1047, 1394, 1357, -287, 1081, 2183]
374B183j592k73Q18l20j134Q54J000j257q67N71o26j679J257L42j173K68J390
391b38j8k73K037R47o94n57J149r06j891R13k40k325K31O74q59k64J665J036p96
410d09N17J383o87n42J426j64j859L72N33j010k85R04K56j002l14O41n50n42J612
429B80l85q67O93M79l63N95J201l67o16Q9K49r45m28N89r66q05P36R4n79O44J031
450C59j3l78M69L16m27J6M41n73o48O3L48p45N82M85l93j66kK09K00jM10m20o32
473e00N73k17J8N33J87k87j84j87K24k04j87O15m66q47O41K57Q9J54P76k31r49
494a92J30M20n47j48N91n02r10Q10M05l94K65O71n99j21L50O13o77L87Np07n57
515g07O26j77j5J13L87k75m41L44N53k60K8J94r07J36Q51j08k53L75J6m66k10
$$ y = [2183, 591, 318, 1136, 816, -318, 536, 1536, 279, -588, -17, -643, -2322, -1065, -723, -1896, -1628, -238, -256, -529, 1508, 2455, 1761, 1204, 2353, 1447, -444, 469, 229, -2096, -1865, -1191, -2050, -2314, -649, 387, -409, 108, 1491, 804, 262, 1688, 1524, -335, 37, 570, -440, -725, 179, 435, -567, -881, -240, -790, -1332, 280, -105, -972, -279, 200, -163, 432, 1633, 1266, 650, 739, 988, 43, -385, 204, -762, -1567, -831, -737, -1316, -672, 359, 346, -32, 437, 753, 326, 342, 783, 210, -438, -375, -27, -772, -190, 295, -98, -264, -266, -57, 143, 142, 552, 132, -500, 73, -144, -126, 407, 594, 307, 123, -64, 160, -44, -231, 384, -82, -929, -288, -31, 58, 212, 988, 757, -192, -62, 358, -189, -337, 254, -248, -1158, -348, 57, -337, -72, 599, 0, -121, 229, 842, 165, 552, 557, -150, -707, -81, -258, -273, -160, 227, -48, -489, -145, 408, 148, 176, 370, -537, -401, 450, 342, 89, 464, 480, 14, -196]
536a96M32p1o08R9K02p73j27R14J74PK79L95n26j96M78J78m33J98J17j099k00
557g56N28K34m72M34N0o39L91P75l45j63M26l92n95L06L33LJ8L66j42p01K74M97
579D30m13m34M54pp16J01M02K4K7L99O6m78L06J58J19l12q2j65l79m9N77k25p8
602b75M65l23j58P31k70k8M2K78n04l61K76K9j51M12m9K16n92L45J57k25PJ65
624A87l15m76M57N62o99M7P53o24j0J02J69k5Q6j84j83N8Q4J52J24m40O99n91
646f7p3M06j19l08K75j71j62J10l6P7j87M85k89l5J52R5M2n2O5l53q4K97q4l2
670d8R1j71k07L13Q0J15j90j32K89n4m48J43K53J86n9j5j9K7q7J49J3j23j85k79
694c58J31r1N0J91J48j43R5q6J37K52j35k0j9k5q5k15L85j57k08k50N70k34K32
$$ y = [-196, 236, 165, -443, -344, -142, -915, -1042, -128, 46, 53, 332, 727, 201, 5, 483, 661, 228, 426, 543, -556, -756, -228, 6, -466, -32, 18, -621, -230, 545, 200, 37, 463, 71, -524, -218, 115, 118, 136, 502, 360, -341, -67, 430, 17, -417, 37, 30, -686, -585, -183, -159, -132, 267, 333, -145, 161, 319, 438, 126, 44, -121, -500, -549, 28, -197, -275, 190, -133, -291, 440, 170, 142, 184, 462, -42, -403, -127, -98, -249, 163, 114, 330, -262, 83, 240, 15, 22, 187, -128, -604, -147, 415, -284, -237, 516, -108, -118, -16, 153, 128, 214, 30, -153, -95, -11, 141, 265, -175, 524, -67, -140, 266, 147, -161, 114, -57, -219, -109, -145, -68, -255, 230, -59, -94, 58, 153, 195, 143, 208, -145, -229, 68, -16, -48, 43, -128, -335, -22, 58, 173, -17, -149, 140, 86, -362, -219, 34, 220, 161, 146, 127, 154, 67, 216, 229, 106, -79, -358, -227, -318, -268, -77, 71, -72, 23, -63, 74, 326, 191, 171, 152, 127, 42, -173, 212, 55, -153, -403, 167, -67, 165]
717A65j41L6j78K11j86l3K82j95J65k25L08r6k65L78O8k56OJ62m38J30J25j76
739a53K79j37rN5kJ48O6l43K25j45J8j47M54l77N8K00m7j95L20l63NJ88Ml97o
764c01L90j17J30l48L07J16k70K98K18k70p3j63j81L15j76K00Q6k22m9J68K2j82
786a02J27J21q7j8o5j33J70L5J90j27k56l6L7J98L54j88n0k27J8m8j35N08m45
809a59J72m17J79J72J34q1q8O4m1M6K3P9k%j41J44o9O3J21J7Lj99j01R7l20L69
835F5p5L3J5k96K02J22J72l0m4k48K32j55n8j48J08J39l62M62r2p0M4Mj42J58
859C6j51N16m95K06M5m24M3N10k96l82J27M5K96j6k71J88k9Q4k31J27J02q1Q3
882C2P0N2J00l65J05K75l3k39j44k09O0N00J08l59po6J64l3P3No5m3K05m05R1
$$ y = [165, 24, 60, -118, 93, -93, -126, 156, -39, 126, -99, 209, 113, -152, 226, 294, 38, 44, 206, -232, -102, 23, -153, 126, -11, -20, 35, 33, 181, 247, -96, 129, -16, 2, -145, 309, -68, -10, 190, 143, -52, 268, -95, -90, 98, 102, -295, -301, 89, -28, 102, -246, 61, 177, -93, 205, 423, 153, 80, -83, -264, 51, -125, 75, 161, -61, -110, 58, 80, -102, 25, 146, 59, 41, -24, -157, 13, 48, 238, 111, -145, -181, -144, 54, 408, 220, 170, -57, -39, -87, -222, 286, -159, 13, -404, -225, -53, 81, 0, -88, -24, -65, -19, 4, 83, 81, 81, -60, 84, 15, 78, 199, 216, 219, 20, -81, 16, -304, 65, -10, 23, 38, -258, -56, 66, 238, 208, 164, -84, 148, -7, -65, -213, -105, 34, -328, 134, 42, -28, 16, 20, -122, 36, -115, 401, -94, 112, 157, -267, -224, 286, -10, -392, -265, -220, 76, 60, -211, -23, -52, 32, -199, -72, 30, -51, 32, 102, 154, 254, -111, -6, 269, 236, -3, -147, -356, -296, 204, 312, -47, -54, -120, 44, 11, 84, 89, 24, -19, 186, -219, -128]
907a28l4J38j64J28N7o2j36Q7N3L30m31N5L23m31j1K90J27k16k90L03j6q8R7K03
931A84j51j42J35j43K05m5J5j08L24m96p9M16j66J33j73n7j62K02J15J93m2j32
953B6l1k28L22j05J26j25j79K42j42J62L0j59J84J4P3n58L56K44l88K54J3m9j73
976i1o7P3j13L72p7j10J87k95K40n3l2j56L8m6j24K15o0J8q0J09J36L7J41j4n2
1001A96l59m2J16J38j47J24O6Ol1j52N4O7m0L48m38k5J67j56o7J09J66j79p7j10
1025b66K56j53L17j66j92K36L2R6k09J21j61j38K61KJ29m69J46J20L7j43L71k95
1047f8p1J44j98K23Q0k88N7L33j21o6P8M4J74r9O8k99J67k67P4K0k79K74k28J94
1071e4K56j22k97J02M60n07k09L00J16M9mk88R8J44R5l64L89q5%q1k18j00L52
$$ y = [-128, -162, -24, -188, -60, -3, -65, -201, -114, -61, 269, -162, -107, 216, -215, -226, 64, 191, -25, -315, -12, -28, -116, -19, 184, 33, -109, 26, -117, 88, 43, 58, -50, 274, -222, -301, 115, -51, 82, -91, -148, -310, -108, 7, 200, 158, 26, -5, -233, 89, -16, 110, -15, -194, 48, -94, 68, 98, -61, 123, 137, 210, -348, 8, 252, -136, 118, 131, 82, -91, -158, -85, -198, 174, 97, -13, 174, -121, 119, 66, 34, -122, -84, -130, -254, -39, -99, -81, -161, -52, 84, 121, 262, 248, 196, -163, -205, -89, 49, -98, 26, 92, 98, 67, -85, -31, 36, -4, 344, -94, -119, 48, -108, -175, -66, 100, -79, -156, -266, -10, -163, 154, -12, -204, 32, 64, 160, -49, 72, -89, -227, 34, 36, 165, -304, -158, -38, -1, -144, 227, -68, -139, 5, -193, 30, 110, -178, -121, 212, 91, 25, 103, 147, 321, 222, 290, -9, 158, -109, -35, -15, -294, -20, -248, -54, 202, 80, -217, -115, 345, -162, -371, -71, 45, 94, 90, -198, -100, 44, 139, -225, 164, 79, 79, -2, -220, -320, 32]
1094C2j76K04l0J47m8K6l64K21k2oJ21m44M37K5l25K15j09Q5p2J35Pj98L53k54
1118d0M2l8rr7J77J69j53l6M9r6Q3J96k10o4k9J50j84L57m94O3L08k13K25j77
1142b1P2P7l32J9j0j97L27j20M16m67L25l19M46r8k44J8Q8n0K45m24M33Km66L80
1166A00r8j6J00R1k13P9J70j07k05J72k29L16k86K96k19J08N8%j8r5j98J17J62
1189H5r4J58k06J90o7j34K49j33N4j70P9j36K82j05k73J52J09l02J33J36j32J11
1211a4Q9o1j85K6M2J51r6K78k66P9k90L52k46J46R7M7l20J01K09j9j05j12O3m46
1235d80O53j40J12j44j7j13J33m6O8n3R0PO2l07K49j52j5K67l2mR7P2m19K37k84
1260a59L71j5k96J26j9k37M05k94L92j82k13L60k48o4j59L31L8k61K07r7p8o4
$$ y = [32, -144, 60, 30, 177, 129, 155, -209, 12, -10, -16, 105, -339, 98, 123, -202, 13, -96, -11, -83, 52, 59, -139, 214, -40, 2, -36, -45, -142, 35, 204, 51, 15, 64, -32, 51, 247, 37, -27, -56, 94, -90, 267, -227, -164, 144, -69, 156, -21, 51, 128, -204, -185, -195, -392, -65, -185, 231, -236, 89, -230, 216, 118, -126, -108, -20, -70, 175, -249, 184, 186, -280, 100, 2, -14, 86, 177, -36, 43, 213, 106, -99, 73, -156, 160, -126, 170, -49, 59, 117, 117, 99, 4, -194, -77, 85, -9, 149, -57, 133, 66, -68, 181, 48, 102, -68, 11, -125, 157, 52, -221, -69, 40, -262, -129, 7, -125, -14, 75, 14, -171, -145, -103, 48, -48, 230, -36, 43, -247, 105, -141, 5, 102, 149, -171, -70, 139, 120, 15, -97, -34, -480, 173, 33, 145, 1, -16, -129, 4, -42, 26, -27, 63, 70, 132, -175, 74, -78, -93, 174, 142, 138, 235, 307, -112, 125, -159, 212, 197, -99, 27, 8, -229, 176, -118, 274, 92, -121, 239, -9, -73, -232, 99, 137, -124, 83, -14, -92, -156]
1282a56K0K13L5l88K19J92Qq1n5k66R5M39k98k65M21k79K29j34N3R5j24J40j02
1305A1J96j23l43M80m19L89q9j11J12j54J27j74J50k7jP4lj62J2Q2o0J03j84K85
1329A71N5j01l34K01O3k77P6J84j57Q0r2j17K82m8R2j68K03J4r9j30R1j08k50
1352c69L06J89m9k13L3M26j16p2n2Q3j14Qj21Nk12M95j03j43K30m45K05J95p7
1375H9J77j35O7l50J71j05J78p0J01k48L2J34L0N9l67M16k31K22l40J43j57L44
1397A60m04K13l6l4P3K9k16M39l69K21j25q1L14k47J45O8pj31m9j12O9J36O1k19
1421a02K03j03l3J75j70KJ17Nj1j34j51K0J01J94l21N4k7O3K65k61rK56l2k01
1445a00J12q9K41o06K44K0M43j74j07K81m25L17n50O24l12L01k93K80j93k6K1
$$ y = [-156, -136, 77, 112, -276, -57, 135, 143, 62, 7, -259, -164, 275, -23, -288, 133, -146, 83, -51, 2, 97, -27, 113, 11, 207, 84, -259, 221, -198, 191, 102, -9, 103, -51, 76, -98, 52, 25, 24, 98, 95, -67, -55, 27, -33, 70, -114, 171, 226, 125, -209, -8, 55, -222, -146, 38, -119, -39, -131, -248, 34, -14, 78, -90, 113, 127, 28, -102, -11, -119, -369, -63, 126, 77, -136, -103, 323, 207, 135, 83, 166, 52, 60, -61, -56, -268, 227, 124, -19, 211, -234, -29, 166, 89, 266, 131, 198, -152, 19, -86, 92, 22, 123, -125, -93, 41, 71, 130, -237, 179, -52, 170, -170, -27, -184, 160, -244, -31, -67, -101, -28, 1, -215, 224, -145, 76, -49, -130, 184, -63, 82, 150, 143, 12, -37, -149, -80, 56, 117, -102, 101, -2, -35, 140, -30, -28, 89, 94, 83, -51, -202, -182, -81, 113, -208, -154, -181, -118, 147, -114, -123, 133, 101, -100, 12, -77, 164, -442, -198, -178, 265, 91, -16, 265, -160, 157, -393, 231, -81, 220, -73, 207, 14, -12, 9]
1466Iq3n1J84k37Q3P0K12J08l39P1J8j00K44k33k13L57r5n4J30l72L17J1j00n6
1490a19N1K11n1Lk03R1J21j20J65k17J11k96J36j9k36L55k4K20j75j72L8P9O2
1513A1j79J59k23K9K73k21K52j87N7q0K84k3O3n3kj79J4M7n6k38qJ02J20j5J54
1538A01l04P4l3p9oML11q1J91N6n19K95L23j91l5M8ro9O5j58j5K62k24K7j24K48
1564A58k22K05k76rK99j50j63K93j33m7J15j38j02pR6K26l90K40k9n7k83K14K00
1587D0k9l63L75J06k74J56mL36n05J19PK34n29K73K85k32K6R1o6N6j21k79L41
1610D3p2J68j93J22O6l9Q6j62J70k38J16j55J04K25k32q0J59M3j49M4k23k69N96
1633A30n2J10j58qk17P2R6k4L65k30m05K88J00k5k66M09r6l40L08J44L8J75k33
$$ y = [9, -74, -125, 59, -178, -95, -25, 187, 295, -44, 27, 45, -55, 189, -44, -257, 100, 5, -49, 81, -291, 26, 37, -63, -119, -68, 143, 92, 95, -108, -17, 104, -16, 149, -68, 43, -253, -117, -136, -372, -17, -41, 179, 4, -168, -130, -51, 11, -168, -9, -232, -203, 70, -151, 101, -86, -29, -109, 175, 152, 215, 162, 160, -19, -5, 42, -14, -252, -260, -158, -38, -53, 101, -203, -129, -162, -241, -247, -243, 68, -13, 178, 234, -285, 10, 333, 142, 107, 155, 146, 77, 142, -16, -31, 231, 7, 34, -90, 158, -64, 141, -135, -144, 155, 5, -158, 135, 2, -45, 70, -68, -170, -177, -81, 145, -245, -5, -34, -91, -374, -160, 40, 11, -352, 23, 129, -145, 11, 7, 343, -162, -43, -36, 198, -331, -58, 227, -5, 21, 112, 46, 102, -19, -298, 43, -29, 139, -54, 68, 134, 95, 181, 19, 189, -49, 67, -88, 16, 241, 9, -71, 88, 131, -18, 26, -197, -466, 130, 78, 188, 30, 22, -195, -123, -27, -51, 314, 84, -321, -33, 67, 42, -224, 185, 89, -251, 57, 201, 239, 414, 181]
1656A81j01M6j61J27k02L23k33k96K17J94j04k07J18O4Q2J02l80M13K3j4l4m65
1678c07O30q4j78J37J17l91K3J55m96K20P7M7Q6k04J54j06K8L88j95k07K81o8
1700A07l20M05ok32J27j02n2M2K78j70k41L46l17RJ87j78N4J23Ll59K75k17L33
1723I5q6L8k12K87j25J28j94J91PJ39j51j73J18j35K13J21l10K8rk9J0O3p7M7
1747a6J66p8mJ62k50n5p6Q9k89L07L34k39K7j09J10n2L5R0k58R6ll3r1Q9J27k33
1773a54L71m2j56J94j94j3lk5K78m35k3J89l0k29L00n9k60L43Ol26J79Q1j15M
1797a19l6j01L26j49P1K10k94L7n5J72N5k91L51l30M80l30N6k4k19K32k5N0k72
1820b05j87J80J74J51K7o0j65M2l7J79j73J37j97K53k2m59K57q9M27j59l7M6j80
$$ y = [181, 80, 126, -35, 92, -110, 213, -20, -316, -99, 95, -9, -216, -98, -34, 48, 150, -230, 183, 206, 192, 158, -307, 323, 239, 61, 198, 315, -76, -53, 102, -394, -174, -97, -50, 36, -168, -14, -120, -92, 296, 101, -106, 175, 107, -213, 192, 186, -46, 81, -21, -73, -31, 247, 77, -164, 182, -135, -126, 61, -117, -63, 60, 63, -296, -21, -238, 95, 9, 47, -165, 122, -3, 125, -69, 122, 129, 268, 117, -56, 62, -73, 140, 261, -49, -21, -30, -59, -49, 14, -63, -16, 150, 72, 68, 230, -20, -75, -151, -62, -351, -44, 290, 51, 78, -31, 79, 27, 62, 152, -106, -10, -13, -46, -137, -48, 79, -154, 217, 175, 19, 213, 19, 6, 3, -22, 256, -179, -202, -13, -43, -272, 28, -31, -291, 52, 58, -268, -89, -8, -123, -119, -155, -256, 70, -79, -8, 202, -92, -55, -110, 62, 117, -174, 177, -153, 327, -3, 53, 29, -190, 42, 17, 67, -205, -392, -212, -38, 113, 140, 80, -85, -43, -80, 99, -74, 63, -134, 119, 97, -362, -105, -194, 233, 74, 37, 83, -97]
1843i7L2K5j22K99j17l03L79Q3l59L72l22q7L87k15j47M7J36J50q9k2k4k63Q1
1866a76LJ58L8k78L16J16j21J7J50j87J32j08j41N7J01o8j53J82J34k82pMj44
1889b57L09k21J00L1l7J94j62K63l52K1Q8q4J9M36m62r7K02j20j30L6K77o9K01
1912A86k67L5L2P9j81K77l72J79P2o4N6K3J26k10J93p3j31l61N12j92jJ26J31
1935A75k61n2Q5qp3Q4KP0K52q9q7j33K07j74R9l18J53k06J91p9K25k04M5k9K21
1960I6k41J90L3k13J82j09J00l0Mo2J90j0j73K51j66j03J00P6l69J54L4m7j18
1983b31M45j01m07M50j36j44J43r9J10j35L22l45L70l71j59N39k79K87m70K25
2003A4J31J10l83J41J23l32L16j8p7p3L9J95m3j62J04k5l34K77j14J06K68l89
$$ y = [-97, -65, -40, -162, 137, 20, -283, 96, 179, -180, 192, -130, -217, 170, -45, -192, -145, -9, 141, 52, 30, 6, -257, -176, -173, -15, 23, -255, 61, 177, 56, 73, 223, 36, 168, 60, -81, -24, 77, 9, -144, 38, 172, -110, -117, -113, -257, 52, -169, -69, -38, -75, 119, -43, 220, -132, -111, -23, -107, -88, 348, -114, -211, -9, -129, -259, -223, 54, -15, 186, -81, -46, -14, 65, -116, 161, -211, -32, 40, -24, 32, 55, 181, -29, 164, 91, -40, -401, 111, -81, -82, 44, 175, -86, -138, -53, -61, -134, -50, -48, 22, 274, 185, 98, -35, 172, -2, 97, -221, -68, -274, -83, -162, 63, -141, -96, -125, 96, -145, 45, 78, -135, 47, -62, 38, 8, 12, -50, 140, 130, -43, 208, 42, -61, 39, 115, -254, -100, -66, -113, -231, 214, 113, -294, 156, 20, -124, 19, -80, 30, -105, 217, -128, 242, -129, -288, 251, -28, 259, -211, 14, 145, 255, -128, 13, 136, -196, 120, 102, 25, -48, -9, 186, 143, -19, 85, 60, -274, 3, -111, -5, 263, -126]
2025a26J88j12J43j23P7M4j28J39k97k8M29k07J60j95j48J48L01k53L1K1O1j11
2047A4pJ54k53J58Q6P5j56j62P3Q5K92l15Ql8p4K40j89j52K96M8j93n8l2J62r1
2072b9L53l36R0l21K20j09J23j77L2M8R8L1qj36J36Lk34K35M5k79J98k12J00J62
2096C3o5Q4J41k07L8m9M6N8j13k22K15R0J91m18%L86k84n3J46L2L0j72Q8K98l22
2121b9L67l89J49k58j35K11j16K97j46P1Q8k27j8L07J65l77j22J06n2J06j7J61
2143A42j07J48k42L74pn44K67r0Mr4l9J2J82J03k70K99L4j03l2Q2l6l6k02p8K25
2168hN7L14n40J76K10j65j24LJ08Q4p1k7MK50m91Q9J18N5j75K29m28K77j96K02
2192d9J29j03J7J24K69m80n4K95M7j53jK01l06N9L06j96P4j98k47M19j29k27M10
$$ y = [-126, 62, -50, 93, -30, 47, 91, -37, 102, -195, -223, 206, -1, 159, -36, -184, -36, 265, 12, 43, 64, 125, 14, 7, 161, -92, 66, 152, 227, 71, -91, -18, 67, 359, 44, 52, 14, -60, 180, -9, -161, 135, 183, -10, -68, -100, 62, -29, 324, -12, 78, -243, -23, -132, -9, -186, -154, -106, -8, 23, 15, -121, 15, 18, -216, 19, 64, -215, -17, -229, -129, 33, -32, 52, 193, -14, 24, -25, 21, 79, -34, -256, -41, 49, 240, -178, -178, 208, -76, -129, 17, 49, 79, -93, -5, 293, -29, 338, -51, 98, -160, -295, -84, -200, 97, -49, 22, 110, -117, -135, 172, 337, -40, -162, -56, -108, -2, -19, 142, 35, 183, -59, 315, 308, -236, 31, -59, -55, -149, -188, -176, 6, 109, -161, 138, 172, 69, 37, 119, 83, 47, -155, -233, -8, 49, 363, -177, -1, 209, 44, -80, -77, 31, 115, 44, 17, 21, 271, -220, -131, -13, 42, -133, 96, -332, -55, -251, -49, 80, -23, -6, 118, 387, -93, -147, 148, 195, 42, 41, 242, -64, -5, 301, 105, 179, -19, -266, 153, 24, -203, 207]
2215B07k98J53J12l03K64k22l4K13r2J3p6O7R1j44J99J17Kk77k9P3j0n3KQ2J26
2240A83L7k9N5m98J19K30n6nRP8j23J24q6q8O2j32L90l68K06QJ6n9l63J43J74
2265B7J23k27L25m79K38K01j02o4j69M13l59k2P9r9J89K28m92N6K63j28k23L23
2287A01k9J44J5j27k40K13l44L18J44l14n9L2n7O5J90l12L55l5Q6r7J69q9q4r5
2311e0j39K39Q1n2k12J47J32j31k47K08K15k61K13n5%J68q5O5j97R0q0l9K20j23
2335A07k74J17J88p1j96j6J81j67J5m2PK23p7j33R9k3J51J8j65q8J1L16n9j37
2359a5Q0m5q3J80O4j87k09J48k48M75j44nl6q0N9J66r1j63R6K20l98J35K3R1M9
2384H2r9p0J22kJ40j20k75J88K92k44KK04l50K37j89J33j63J37m3k23K78n4j36
$$ y = [207, -91, 62, 174, -129, 135, -87, -121, 92, 0, 13, -63, 4, 95, -49, 150, 267, 269, -8, -37, 36, 26, -27, -25, 57, 183, 220, 191, 246, -252, -133, 97, 41, 36, 45, 123, 0, 124, 38, -50, 12, -120, 270, -98, 108, 116, 132, 73, -290, -147, 27, 150, -77, 248, -231, 7, 208, 106, 42, -127, 286, -73, -95, -16, -115, 74, 302, -190, -134, 129, 1, -222, 101, 72, 216, 231, 104, -136, 77, -267, 51, 195, -119, -178, -146, -203, -138, 52, -260, 95, 60, 146, 49, 218, 129, 45, -50, -189, 50, 131, 79, -133, 14, 146, 15, -232, -24, 191, -70, 143, 88, 88, 256, 171, 236, 39, 129, 49, 10, 230, 107, -167, -50, 138, 67, -129, -145, 36, -131, -116, -158, -151, 72, -5, -138, -39, -62, 89, 107, -58, -146, -135, 181, 122, -15, 65, 20, -63, 117, 181, -6, -215, -67, -315, 160, 16, 11, -25, -105, -46, 120, 29, -134, -38, 182, -216, -81, -58, 33, 82, -17, -87, 35, 33, 173, 53, -222, -34, 258, 14, 16, 220, -130, 107, -82, 51, -112, 25, -18, -241, 37, -17, -153]
2407a53L45j86J15k99q0M48p6p7j97K11r2q8K21n4n2j55K62K3k36J81j31P2L16
2430C18m43K61k49N5J90j85P9J37j54N0j88J77J79j0k08k13L87j76o0o0J73j93
2452a33N9K8R8n1k54K3M16j16l59M09P6k33k77L60N2r1J29j71k4o7J68J77n27
2475c08K67o3J57r1j56j59L42J9K4J02k07J83m97P14l56J5p4L2M1m8n7J97j09
2498c2r4K6rO0j61N79m73J65K0P5l0r6P2l01Q7L71j35j62J71j66k42r4M26J24
2522A81j20j72K58m53L36k1k9j29J06N7m5J6J19j19k9J21J30p6k31K22r7L2j60
2545a03J14j43Q6M2J69m8p6j69J67K30n20K81J60m53K05J10n8p2P1k24J13K5K5
2568f8O4J24k23r4J99k41J60L35k54J12l37J77Q2k5j16QPj11K23p6j5N4M5o0p8
$$ y = [-153, 192, 6, 121, -178, -258, 190, 114, 37, -160, 51, -41, -129, 92, 38, -14, -169, 93, 116, -120, 61, -70, 2, 318, -125, 136, -113, -58, 132, -53, 26, 163, 9, 59, -129, 48, 227, 217, 9, -204, 183, 7, -53, -113, 60, -133, -74, -46, 52, 1, -253, -230, 186, 70, -289, 120, 196, -37, -314, 46, 98, 7, 136, -35, -59, -126, 42, 219, -308, -41, -104, 53, -38, -194, -353, -11, 8, 32, 134, -73, 110, -387, 327, -29, -14, -88, -56, -15, -63, -120, 77, -32, -126, -100, -109, -49, -210, 369, -104, 61, 81, 156, 126, 30, 102, -199, -112, 259, 124, -38, 133, -33, -275, -369, 57, 181, 61, -111, 147, -306, 30, 9, -20, -149, -43, 14, -31, -15, 104, -15, -44, 77, 207, 131, -100, 122, 25, 57, -103, 11, -132, -46, -4, 165, 117, 41, -128, 39, 269, -251, 30, 190, -263, -58, 52, -6, -78, -7, -231, -118, -93, -68, -4, 120, -103, -197, 2, -239, -79, 256, 2, 114, -223, -46, 36, 11, -105, -97, -90, -201, 22, -54, -69, -15, 30, -30, -108]
2593a08LP8j4k75L52K13k53j50O2L95k20j38k6J35L2J93j70q3L4n5N2K9l07M00
2617A79j47j94K97j10j55K10k7p5K65p6m3j26K8k1P4j13K14o02K90L25k36m3K54
2640A68k28Q1j9M5rj12J60l76K54J15p8M4ol5j79M1j4L3M12m2pL2m66nL99Qm36
2667b20L55LJ7j55O5j30l4n2J56o3J29m39L09K37m87K73J4J62k46J06P9Q6j53
2690A2J97j59K3l1o4pM4j28j10R5K84j46J1j24J47O7j36K00j66J63j61J3K4j10
2714f2J56l1j27K13k79K58p9j02Q9L8j22J50j0J49k50J89r7NP8k75K50k68NJ75
2738E3N3l51M07l94L24j79n9K35l67J70M8J01Q2j98J04m5j8j8K66jj82J0k75L35
2762A01j31l95L13L80l36J24p7J80p5J56k04J14k03k01J83P8K30j81j05J2n6R8
$$ y = [-108, -105, -27, -41, -316, 36, 249, -4, -154, -92, 303, 83, -55, -81, 54, 86, 279, 109, 26, 60, 5, 57, 86, -221, 179, 32, -162, 135, 25, -130, 80, 53, -22, 243, 167, 124, -2, 26, 5, 79, -34, 180, -422, -132, 193, -43, -86, 168, -60, 21, 2, 47, 38, -74, 86, -290, -36, 79, 1, 45, 39, 4, -175, -134, -148, -115, 297, 255, 248, 280, -186, -191, 208, 216, -220, 135, 138, 155, 0, 65, -65, -99, -151, 5, -58, 71, -368, -59, 178, -309, -36, -22, 140, -106, 0, 79, 165, 12, 209, 50, 73, 42, -22, -29, 15, -113, -223, -128, 156, 10, 21, -103, 44, 111, -25, 175, 9, 172, 11, 24, 48, -62, 94, 63, -64, 149, -130, 128, 49, -53, 36, 74, -48, 102, 92, 241, -9, 180, 83, 88, 166, -109, 141, -127, -122, 53, 106, -245, 162, -232, 92, -87, -146, 89, -278, -108, -60, 41, 123, -75, 29, -16, -34, -52, 214, 213, 31, 41, -234, 101, -30, -425, -112, 268, -68, 56, -21, 159, 84, 240, 36, 150, -53, -254, -71, 7, 237, 56, -49, -37, -93, 5]
2784Ej40K44j63Q7j72j11J55q7M1j48M79r0K0M9j29l8k7K03l23J99q7k20L99j30
2808A6jR2P0n2m7k61J08O8K11j27j78K89l16j33O7J09J62m9K7k10J32K29p7k44
2832a15M2J67K09m01K19P4o0k51J41k7k2N9J81j29j1N4k44Q3N8Q5k50M12j98p6
2856@j6J23Jk36K09j67M29m92J23L6n7J16l33J23R7L20k78l8J34l12L91j78l9
2879d4J58r0J97k81r5J83J48n24N29l00L2N3q7J82k63J87%n5j25K11j84L75j01
2902A06k82J91k51J10J33j43O1M3J08p6J85mKk04P8QN1r1Q5j95P9Q8L42j43m04
2927a23J94n5N7N6j97K39Q1l65J22o5J05J5l33K95J05k75K13k8m5k0J48k36L32
2950B20j16o2j27J9m9k3J86j70J36J69o6j3l2r5l2J87n1k16K62Oj53R7k58K57
$$ y = [5, -135, 109, -54, 33, -139, -250, -95, -182, -141, -289, 190, 100, 120, 169, 40, 2, -25, 178, -145, 54, -33, -253, 146, 16, 15, 107, 177, 125, 78, -183, -75, -7, 204, 77, -101, 188, -128, -261, -194, -85, 77, 28, 55, -155, -23, 206, 129, -115, -73, 94, 303, -98, 121, 195, 135, -116, 25, -2, -24, 35, 216, 87, 76, 130, -114, -31, 27, 112, -138, 274, 76, 0, -16, 107, 108, -128, 81, -86, 343, -149, -26, 10, -47, 69, -264, -141, -44, 276, -2, -40, 94, -218, 173, -5, -44, 114, 24, 221, -60, -155, 28, 176, -348, 181, -119, -87, -34, -121, 61, -202, -15, -15, -70, -195, 16, -168, 207, 106, -176, 15, -236, -126, 7, -136, -75, -32, 76, 0, 185, 181, 183, -21, 57, 65, 116, 25, 110, -85, -6, 82, 424, 281, -123, 71, 16, 73, 129, -68, 171, 252, -113, 9, -56, 49, 64, -269, 26, 131, -144, 69, 41, -4, -24, 124, -112, 220, 104, 42, -85, -66, -115, -138, 48, -122, 14, 183, 117, 104, 72, -23, -55, 132, 81, -135, 127, 133, -20, 77, -181, 76]
2974G6J80j39j5l13K77m2l9J10K4k86J69l6Q6R8k46P3P9j35J62j45J49j14n1J87
2998A09k1Ql38L55j0q4J9K95l08OJ40l34R8n7K81k78K37j58j94J56J20j96L03
3021A49Pp0j45j2K54j42l06L02K4j24J28J2OJ52l60J40pJ26j53J03j25J16pj38
3045g0L9n1J4J40O4k55J68r4K55N6l07j22J56J4j05r1K10K38l72J74j10L17l36
3068f8J15r6J59M9j81p9P6l5j23J10m1L43j17n8l11K15R1j77J96l7q3L23k89J99
3092A81j95k8Q9j11o7N0J67n2n7J20k07K56j90n0n6K20l49K02J31k05O7j1nJ53
3116E3l51L32K08m55L18o3p1M17m17j3M7k38L93j25Q2L8j51j92K99j98J71m4K48
3139B88l40J1J45P9j23P5Mk57K36j12J05o7j29L10l98P0M63l08j8j26k9n8K49
$$ y = [76, 256, 117, 102, -211, 66, 24, -15, 95, 119, -167, 2, -34, 52, 150, -96, -23, 56, -79, 83, -62, 87, -27, -78, 109, 88, 96, -242, 113, 103, 19, 38, 333, 25, 31, 171, -163, -65, -122, 159, -119, 118, -40, -234, -78, 42, -154, 149, 156, 86, -59, -71, 183, 41, -265, 37, 61, -63, 65, 77, 83, 235, -125, 15, 8, 134, -19, 84, -41, 75, 68, -70, -31, -82, -68, 72, 136, -119, 49, -45, 210, 266, -41, -163, -7, 7, -98, -189, 21, 259, -113, 61, -49, 268, -68, 47, -49, 110, 159, -22, -101, -25, -60, -183, -73, -114, 229, 112, 54, -257, -42, 49, -128, 68, 31, -52, 271, -18, 181, -14, -42, 47, -64, -131, -81, 86, 34, -23, 97, -110, 146, -44, -94, -150, 70, -279, -77, 54, -151, -84, -95, -100, 53, -298, 34, 242, -213, 105, 42, -29, 388, -29, -42, 5, -233, 160, 35, 117, 155, 4, -188, 111, -87, 84, 40, 288, -52, -41, 104, 183, 60, 135, 139, -118, 118, 6, 111, 44, -85, 225, -173, -103, 360, 52, 34, -92, -121, -179, 70]
3162G0k03J61l89K68K26m5k36J70P8k12L51k01J92k87K2Q3q3Q8LL8k50R5P4j36
3186a23K45l05J63p1N2L9J58j29o0n1L11j05J90k46m8J94k91K04j59J90j76K52
3208B34k53J17m6Q6k5k80k4R2K05k64J91n8j13J55p3J94k73J47J01j20j78L96
3230B11l51J46Q4Mk46K66j71L09j86k78J31l4R0j50qL07j39Rj41l3Q4N4J03j52
3254i1p3J18k8l2K04r7j90J94K42k70N1p5j38j83O31k18j77K42l0k27J47J79l10
3277a31O1j59K19j45P7J94j89K30p4j19m0P6M0j76K5K1K69ok64J17J02k63J2J65
3301D2k95J68J73j47M9l6Q1k6j62J05k7J0L00k15J25j77J03j84J57j73j3o8N08
3324B98l24K24l28J97j90K17j62J92j45J04K0K9O9k71R9j08l6j3K05n6k49K40
$$ y = [70, -133, 28, -361, -93, 133, 88, -148, 22, 100, -112, 239, 38, 230, -57, -35, 48, -35, 53, 56, 94, -156, -61, 13, -123, 122, -183, -20, -91, -39, 0, 158, 29, -31, -82, 229, 124, 314, 68, 20, 214, -77, 127, -32, 158, -18, 234, -19, 98, 52, 138, 113, -167, -191, -99, 106, -158, 33, -25, -138, 17, -56, 138, -135, 12, 113, -7, -185, 211, -140, 6, 90, 94, -152, 114, -57, 252, 66, -212, -81, -115, -25, -175, -183, 124, -15, -6, -147, -180, -96, -42, 61, -91, -164, -46, -74, -106, 98, 1, -189, 5, 247, -23, 28, -47, -185, -368, 263, 45, -132, 110, 80, -147, 0, 179, -131, -70, -229, -10, -155, -78, 116, -73, 157, 83, -36, -76, 0, 40, -136, -111, -90, 179, 173, -91, 26, 128, -135, -123, 42, -253, -85, 88, -59, -10, -46, 35, 9, -153, -48, -75, -65, 235, 20, 145, -32, 71, -113, 44, -129, -142, -210, 298, -26, 198, -130, 67, -123, 94, -68, 124, -21, 83, 103, 132, 201, -70, 29, -79, -115, -128, 77, 21, -228, 12]
3346A2J55l20K64j28j7K09j98m5p8J08J7N0qp8J73k86J74q9p6L6J93J33o2j55
3370a6k06N9J32k21M09j50L13j81k42m2j29N9M20K6l39J33m9J4k9K72J7k81R6
3393F5r1n2J19J25K6j00k06K80j54k28K15O3k01JJ41j57M8LM6N0k9J03m2j3q5
3418g3l8K70K66n18R8j41P8j5L60k25N6r8k29K73N03m70j35R8j19N4j9J77j05
3441D8k22J83k85K11j6J55j1J5j27R6K5M1l3k63K04k23L09j2j97J32O6L9oj80
3465e1M0p2k3j36O9J65p0K07l47J84J44J12k40j27N5j72L43r9j93J73J50o2J35
3488A85m24K75qk62K17J6L19o6l15m8K14N1l54L27k72P4J26p7n5J15j19K47k47
3511h1k18J63K18r4%M4L4j99K36j55j90K94j36O0p1J1j25L83j76q6k65M51r3Q
$$ y = [12, 167, -153, 111, -17, -34, 175, -23, -68, -146, -38, -21, 29, 21, -57, 116, -170, 4, -85, -161, -125, 68, 201, 139, -16, -222, -163, -31, -252, 157, 7, 320, 139, -103, -145, -274, -215, 205, 231, -108, 25, -24, -10, -39, 233, 250, -31, 65, -26, -78, 41, 166, 192, 92, -114, 166, 12, -216, -1, 62, -139, -138, 3, -154, -106, -103, -57, -7, -36, 67, 25, 12, -73, -111, 159, 425, -93, 5, -136, -58, -73, 287, 62, 118, 20, -209, 64, 567, 97, -38, 60, -59, -5, -24, 153, 48, -174, 9, -276, -65, -81, 74, 63, 78, -49, 47, 72, 113, 80, -183, 21, -202, 107, 95, -102, 30, 96, 135, 129, -51, -11, -83, -106, -242, -173, -8, -78, 129, -218, -34, 110, 222, -18, -145, -90, -262, 81, -18, -211, -38, 112, 50, 185, -239, 36, 28, -234, -17, -1, 318, 252, -63, -111, 103, 154, -200, 127, -145, -71, 55, -22, -77, 38, -81, 166, -81, -299, -136, 82, -12, -12, 32, 66, -133, 103, -52, -242, 52, -84, -24, -95, -84, -209, 174, -2, -88, -353, 98, 5, 13]
3535A3j37N5j43L36N9j06j00R5l03K55j12K64j98j22K25L36l49j02k4L77k86k8
3557Ep7j98J92j84L51r3m3L8pM1r9K55l95ML54j97J41p2k15L82J05j49k69K24
3581I4l13K70k32k2K65k03J31j4J63j43M0k7J32j74R6k92J25J92j55J90O4k75
3603h8K75k03J04rj58Q6M6M9l7k14K50k70nL37r4K7k64J14m1K02n9jk2j96M4N7
3629g0L26k88m4J38j43L22l89K56j40K47k40N4q7k70O00l40p8M9M12k31K08l32
3651d0n1RL55m22K01k39p2K86J02M8Q3o32K33Q1L6K6J65k50K93l47L10p3l58L27
3675G1M5j83P7J71j42N4k35K58l28M80j20j94j76L55o1M8n2j31K34j51k87M09
3697A42l21J82q4K61j05r3J44j98K68l16J82k85M78k12j06r4L98j50l51J68P5
$$ y = [13, -124, -69, -212, 124, 183, 77, -23, 72, -231, 24, -88, 176, -22, -144, 81, 417, 68, -34, -58, 319, 33, 5, -72, -270, -78, -262, 89, -4, -47, -9, -16, 25, -74, 181, -214, -210, 144, -53, 88, 16, -199, 183, 288, 139, -130, 94, -219, 51, -181, -203, 62, -141, -10, -24, 139, -4, 36, 9, 141, -33, 63, -229, -104, 88, -67, 123, 187, -88, 187, -16, 88, 79, -79, 7, 53, 102, 65, -149, 101, -169, -174, 163, 69, 96, -168, -54, -95, 107, 48, 47, 25, -171, -127, -70, 256, -32, -76, 62, -81, 241, -148, 108, -32, 215, -25, 29, -58, -328, 272, -68, -146, -97, 315, 84, 292, -40, -91, -82, 273, -149, 52, -187, -259, 27, 129, 177, 260, -372, -139, -58, -22, 4, 169, -81, 212, -135, 175, 102, -256, 71, 116, -67, 10, 181, 39, 93, -142, 116, -212, 268, 148, -46, -222, 133, 72, 120, 68, -63, 171, 20, -267, 142, -179, 3, -81, 180, 75, -18, 126, -72, 196, -120, 62, -223, 255, 43, -63, -157, 241, 91, -260, -92, -17]
3718a7K68j12j35R1k6J5j31o5J32J02n5k81K49J06k00k5K57j20j56P8K1l5K08
3741A69k25K91R2m38L37j86j8J43nk9j20J69k61N1K61k39K15m7k88O3P0l9J19
3764H5k4kj56J63n6k47K75j11P3l0j2j66J96K5m2Q2m6J52l0m8J80l00J22m4n5
3789a6j26K97m0l7j58L2J83J6J97j07m0n5p7p1r8O5Pl7K34m3j40P1J11r2n8K12
3815B30k02j74L52k47JQ6k63J1j3K9J93j26K28O2m68K46K43k63q9K50j08k26K21
3838b7Q8k76M77k3j03l76K89m7j57K43N5j5Ko5K0k10J8M5J44J57l82P8r7M79j13
3863B04j50k8p0Q3M2P8j68K91k37P7P5j26r1o9J16K65l06l2L10k85j13N4J40N
3887F5k8k01J48o5J51J13n09O88k76M7k71QpK70j20oj90M05L3m04L0J75j54K40
$$ y = [-17, 251, 139, 4, 95, 69, 84, -47, -112, 20, 122, 67, -214, 35, 141, -59, -84, 173, 53, -103, -25, -4, -39, 169, -56, 235, 327, -111, 226, 40, 22, 165, 160, 131, 11, 180, -81, -30, 231, -8, 207, 160, -128, -65, 5, -34, 85, 61, 59, -97, 66, 10, -237, 38, -73, 0, -30, -42, -208, -12, 13, -29, 53, 7, 159, 129, 81, 261, -39, 83, 39, -16, -142, 155, 115, 78, -80, -48, 135, 151, 348, 241, 201, 146, 69, -2, -100, -35, -28, -65, 169, 126, -14, 57, 168, 76, 18, 230, 28, -146, 206, -41, -40, 46, -217, -206, -219, -190, 3, -123, 105, 167, -301, -55, 188, -75, -164, 86, -22, -248, -27, 61, -215, 262, 239, 136, -240, 49, 2, -155, 88, 143, 128, 130, 65, 85, -125, -107, -62, 82, 239, -143, -65, -162, 317, 204, 54, 26, -44, 39, 81, 159, -9, 282, 45, 122, 197, 71, -20, -89, 27, 292, -14, -46, 264, -21, -134, -80, 60, 65, 37, -164, -16, -81, 70, 183, -326, 362, 86, 133, -138, -130, -137, 133, 13, 7, -183, 222, 255, -149, -119, 56, -98, 142]
3911A42j84Q6j4j06N7K4j95J51k5K9J53k22l2K24L59l99J20l09P8K9k15L09q1
3934b1M98n87J09j07rK22M3J16k91r1K74J99l52j84n7J88p1J31q1P6j03J20K0
3957D2j92M13k97O6K3j9k8P8k6K05m6J6l26M5J67m6R3Lk82l8J79p2K91l97J31
3982a7q0J86j46J29k58J36J16n5q0k49M15j33j30J80n7O9r1K04n7j91J29j16J40
4005D4k18J17K17j95J36p4m1k55K29m3J5J82k99Q2J16Q0j91LJ17R8oj85j09K60
4029H0k00p5K83j59J80j37j5k4J12l7k0r2j11P8j66L54l7J57K6l96K62J84l74
4052a27l1Q3L8m9J54p3l4K72k42J52j36j56J89q4m1M32l13k68M39k84P7N5j69
4075a16J81O5l8j81k8J38%J36j19M2j53K96k70j23P4J28k96l4j0J40K41r4j57
$$ y = [142, -42, 44, 30, -76, -19, 5, -190, -39, -64, -35, 118, -104, -136, 88, 447, 48, 168, -141, -63, -34, -249, 60, -21, 477, -110, -1, -108, -117, 105, 148, 264, -27, -118, 156, 355, 3, -181, -238, -50, -121, 10, -71, 5, -98, 22, 42, -150, 263, -34, 32, 55, 36, 8, 86, 60, 265, 219, 235, -91, -46, 121, 75, 168, 171, -111, -149, 30, -42, 249, -148, -17, -97, 89, -57, 72, -186, -50, 66, 11, -69, -318, 97, -36, -166, 14, -43, 26, -65, 139, 82, -109, 20, -96, 44, -174, -57, 160, -35, 101, 27, -14, -269, -40, -83, -68, 114, -185, -103, 13, 93, -98, -95, 22, 120, 114, -71, -180, 80, -120, -195, 88, -71, 109, -28, -43, -67, 45, 8, -12, -104, -215, -137, -303, 51, 14, 171, 197, -199, 63, 247, -127, -158, -75, -37, -86, 68, -5, -39, 233, -9, 143, 7, -149, 40, -44, -85, 347, 34, -234, 205, -79, -2, 53, -116, 65, 130, 92, -89, -117, 21, 21, 157, 38, 80, -73, 223, -47, -170, -96, 32, -264, -298, -308, -168, 73, -21, -178]
4098a78J68K9P5k59K17m7l02M09L6j72j55mM71j82l84K5L52k14o5K19L9r3QN2
4122D5j8R5k08p1J44Q2k67k1J60P2l54L20O5K27k47q9J68r4J19j33q6J2M1m9M86
4147C99m81J77j28j03J85J52k74o2kR5n7K01l05QK75n4L6j74l3Q8J82r2PJ96p0
4172A66j19J10r2l28M84k88R0L9k52J83l13L84p6knj1O3J15l7J39p03N88j79m9
4196i3O0p7J6K15J08l92k7Q1k19J11L46j52K00l13R8J20m2j8k04K95p7M6k62L72
4220A92k45K55k3q4r6J23r6O6k23J41P5k08N2L2J57j3j31K33j00j20J92j54j79
4243a54K49j4j07J39j53J43r7K3M8j91L79l51J76k2l9k08J29O6P9N9p0k96O4k60
4267d08K45K24l18J57J83J01j06k47J59K89k71j81J26R2j00r0K28l3j5mj89L58
$$ y = [-178, -10, 19, 94, -165, 52, 5, -297, 112, 148, -24, -179, -183, 288, 106, -278, -253, 99, -115, -180, 39, 78, -15, -7, 45, 27, 122, -86, -157, -13, 69, -198, -219, -59, 13, -341, -21, 44, 271, 24, -65, 103, 9, 128, -5, -91, -79, -38, -87, 399, -82, 95, -33, -136, 49, 201, -73, -135, -137, -42, -99, 102, -203, -195, 80, 26, 62, -112, -145, -57, 125, 33, 40, 236, 166, 47, 157, 65, -263, 221, -67, 23, 62, -190, -7, -320, 64, -12, -14, -19, -30, 33, 148, 111, 250, -453, 135, -44, -93, -33, -110, -94, 121, 229, -163, -190, -109, -328, -217, 129, -23, 177, -136, -38, 82, 40, 22, -182, 113, 36, 82, -180, 192, -53, 202, 179, 95, -1, 122, 26, 92, -131, 10, 85, -123, -71, -39, 118, 105, -26, 207, 107, -13, 179, 25, -154, 95, 81, -26, 113, -40, 103, 6, 29, 77, -114, 265, -86, 90, 68, 29, -179, -50, 16, 95, 154, 84, -212, -148, -408, -163, 61, -257, -100, 83, 184, 78, -169, -10, 279, 8, -173, -47, 45, -55, -145, 83, 50, 35, 31, -158, 200]
4289B00l17N6o5N7q0L00l25L59l73J00J99j29J5R1k38KJ37L1j00N5K27m19K38
4312B1j7l08J69L04l81K05r3o1km1OK63q5k8L10l59o3J47k02K03J08j11j32K55
4336A08J13k36J85j19m8k57J55j47K6L04k78J53j02M0o2L88j61j24N5n2J38j27
4358d8j5L01n19L37J58j0m6j40j21K52k61o3K03k7k2O6O6j39n2LJ1K1k5K24m31
4383b77o0K53j18L44j31j90o8K22J51m5J07k16K63j75j85L09l55M6J38J21r7r7
4405f0J18q3j81k22L18k8p9L66j81P1j28L47k23J71k21N8K4M8k58J98p6J84r0
4428G3j92Q6k24K90k14M11j77j6j94jk3L1J07M6J03j46J41L9kk9k64O41n66L22
4452B42k59J54r9l7j96K63q7o4M7k60K30J74r1%J34l54L48q5l9J21m08L42kk35
$$ y = [200, -117, -61, -126, -69, -149, 151, -174, 185, -188, -88, 111, -18, -3, 88, -150, -148, -11, 20, -80, -25, 202, -217, 21, 4, -304, -135, 169, -212, -7, -100, -161, -163, -204, -198, 65, -20, -48, 262, -97, -160, -13, -215, -12, 96, -15, -147, 108, 221, -15, 170, 51, 3, -254, -99, -246, -220, 84, -194, -41, -143, -103, -165, 223, 62, -62, -7, -59, 79, -48, -63, 238, -281, 56, 214, 204, 158, 18, -103, 149, -112, -175, 28, 1, -21, 45, 111, -28, -80, -77, -66, -45, -70, 154, -277, -337, -84, -202, 142, 11, -179, -247, -25, 126, 81, 188, -28, 235, 60, -125, 184, -171, -125, 13, 134, 37, -60, 58, -25, -206, -428, -110, -138, -217, 149, -32, 39, -89, 258, 35, 206, -15, 43, 67, 115, -143, 55, -21, 163, 73, -119, -33, -257, 33, -181, 230, 53, 37, -157, -158, -181, -150, -43, 3, 106, -40, 101, 140, 138, 109, -155, 486, -80, 242, -17, 137, 38, 1, -195, 68, -19, -83, -36, -296, -66, 108, 17, 17, 151, -203, 145, 60, 21, 142, -266, 76, 74, -161]
$$ [...]
8191e2
##END NTUPLES=NMR FID
##END=
