##TITLE=1H_DE-95_oil2
 200.13MHz, CDCl3,
 8 sc
 
 5.8.2025
##JCAMPDX= 6.0         $$ Bruker NMR JCAMP-DX V2.0
##DATA TYPE= NMR FID
##DATA CLASS= NTUPLES
##ORIGIN= UXNMR, Bruker Analytische Messtechnik GmbH
##OWNER= pz
$$ XWIN-NMR		Version 3.5
$$ Tue Aug  5 14:02:26 2025 Russian Standard Time (UT+4h)  she@DPX200
##.OBSERVE FREQUENCY= 200.1313
##.OBSERVE NUCLEUS= ^1H
##.DELAY= (6, 6)
##.ACQUISITION MODE= SIMULTANEOUS
##.ACQUISITION SCHEME= undefined
##.AVERAGES= 8
##.DIGITISER RES= 18
##SPECTROMETER/DATA SYSTEM= spect
##.PULSE SEQUENCE= zg30
##.SOLVENT NAME= CDCl3
##.SHIFT REFERENCE= (INTERNAL, CDCl3, 0, 14.3821)
##AUDIT TRAIL= $$ (NUMBER, WHEN, WHO, WHERE, WHAT)
$$ ##TITLE= Audit trail, XWIN-NMR		Version 3.5
$$ ##JCAMPDX= 5.01
$$ ##ORIGIN= Bruker BioSpin GmbH
$$ ##OWNER= she
$$ F:/spectra/data/she/nmr/H-C/1/audita.txt
$$ ##AUDIT TRAIL=  $$ (NUMBER, WHEN, WHO, WHERE, WHAT)
(   1,<2025-08-05 14:01:16.90 +0400>,<she>,<DPX200>,
      <created by zg, POWCHK disabled, PULCHK disabled
       configuration hash MD5:
       00 E9 B6 7A A2 85 ED C7 34 08 36 98 17 FE 4E 26
       data hash MD5: 16K
       B4 1F E4 AB 80 D1 76 49 66 11 C8 A4 87 91 D7 4E>)
$$ ##END=
$$ 
$$ hash MD5
$$ 58 39 D8 1C 01 F8 D1 92 5A D2 4C 41 00 B8 DB 3E
##$RELAX= 
##$RELAX= 
##$RELAX= 
##$RELAX= 
##$RELAX= 
##$RELAX= 
$$ Bruker specific parameters
$$ --------------------------
##$DU= <F:/spectra>
##$EXPNO= 1
##$NAME= <H-C>
##$PROCNO= 1
##$TYPE= <nmr>
##$USER= <she>
##$AMP= (0..31)
100 100 100 100 100 100 100 100 100 100 100 100 100 100 100 100 100 100 
100 100 100 100 100 100 100 100 100 100 100 100 100 100 
##$AQSEQ= 0
##$AQ_mod= 1
##$AUNM= <au_zg>
##$AUTOPOS= <>
##$BF1= 200.13
##$BF2= 200.13
##$BF3= 200.13
##$BF4= 200.13
##$BF5= 200.13
##$BF6= 200.13
##$BF7= 200.13
##$BF8= 200.13
##$BYTORDA= 1
##$CFDGTYP= 0
##$CFRGTYP= 5
##$CHEMSTR= <none>
##$CNST= (0..31)
1 1 145 1 1 1 1 1 1 1 1 1 1 1 1 1 1 1 1 1 1 1 1 1 1 1 1 1 1 1 1 1 
##$CPDPRG= <>
##$CPDPRG1= <>
##$CPDPRG2= <>
##$CPDPRG3= <>
##$CPDPRG4= <mlev>
##$CPDPRG5= <mlev>
##$CPDPRG6= <mlev>
##$CPDPRG7= <mlev>
##$CPDPRG8= <mlev>
##$CPDPRGB= <>
##$CPDPRGT= <>
##$D= (0..31)
0 0.7 0 0 0 0 0 0 0 0 0 0.03 0 0 0 0 0 0 0 0 0 0 0 0 0 0 0 0 0 0 0 0 
##$DATE= 1754388076
##$DBL= (0..7)
120 120 120 120 120 120 120 120 
##$DBP= (0..7)
150 150 150 150 150 150 150 150 
##$DBP07= 0
##$DBPNAM0= <>
##$DBPNAM1= <>
##$DBPNAM2= <>
##$DBPNAM3= <>
##$DBPNAM4= <>
##$DBPNAM5= <>
##$DBPNAM6= <>
##$DBPNAM7= <>
##$DBPOAL= (0..7)
0.5 0.5 0.5 0.5 0.5 0.5 0.5 0.5 
##$DBPOFFS= (0..7)
0 0 0 0 0 0 0 0 
##$DE= 6
##$DECBNUC= <off>
##$DECIM= 32
##$DECNUC= <off>
##$DECSTAT= 4
##$DIGMOD= 1
##$DIGTYP= 9
##$DL= (0..7)
0 120 120 120 120 120 120 120 
##$DP= (0..7)
150 150 150 150 150 150 150 150 
##$DP07= 0
##$DPNAME0= <>
##$DPNAME1= <>
##$DPNAME2= <>
##$DPNAME3= <>
##$DPNAME4= <>
##$DPNAME5= <>
##$DPNAME6= <>
##$DPNAME7= <>
##$DPOAL= (0..7)
0.5 0.5 0.5 0.5 0.5 0.5 0.5 0.5 
##$DPOFFS= (0..7)
0 0 0 0 0 0 0 0 
##$DQDMODE= 0
##$DR= 18
##$DS= 0
##$DSLIST= <SSSSSSSSSSSSSSS>
$$ [...]
##$SUBNAM0= <"">
##$SUBNAM1= <"">
##$SUBNAM2= <"">
##$SUBNAM3= <"">
##$SUBNAM4= <"">
##$SUBNAM5= <"">
##$SUBNAM6= <"">
##$SUBNAM7= <"">
##$SUBNAM8= <"">
##$SUBNAM9= <"">
##$SW= 18.0517328524113
##$SWIBOX= (0..15)
0 0 2 0 0 0 0 0 0 0 0 0 0 0 0 0 
##$SW_h= 3612.71676300578
##$TD= 16384
##$TD0= 1
##$TE= 0
##$TE2= 300
##$TE3= 300
##$TEG= 300
##$TL= (0..7)
0 120 120 120 120 120 120 120 
##$TP= (0..7)
150 150 150 150 150 150 150 150 
##$TP07= 0
##$TPNAME0= <>
##$TPNAME1= <>
##$TPNAME2= <>
##$TPNAME3= <>
##$TPNAME4= <>
##$TPNAME5= <>
##$TPNAME6= <>
##$TPNAME7= <>
##$TPOAL= (0..7)
0.5 0.5 0.5 0.5 0.5 0.5 0.5 0.5 
##$TPOFFS= (0..7)
0 0 0 0 0 0 0 0 
##$TUNHIN= 0
##$TUNHOUT= 0
##$TUNXOUT= 0
##$USERA1= <user>
##$USERA2= <user>
##$USERA3= <user>
##$USERA4= <user>
##$USERA5= <user>
##$V9= 5
##$VALIST= <valist>
##$VCLIST= <CCCCCCCCCCCCCCC>
##$VD= 0
##$VDLIST= <DDDDDDDDDDDDDDD>
##$VPLIST= <PPPPPPPPPPPPPPP>
##$VTLIST= <TTTTTTTTTTTTTTT>
##$WBST= 1024
##$WBSW= 4
##$XGAIN= (0..3)
0 0 0 0 
##$XL= 0
##$YL= 0
##$YMAX_a= 149723
##$YMIN_a= -235165
##$ZGOPTNS= <>
##$ZL1= 120
##$ZL2= 120
##$ZL3= 120
##$ZL4= 120
##$ABSF1= 10
##$ABSF2= 0
##$ABSG= 5
##$ABSL= 3
##$ALPHA= 0
##$AQORDER= 0
##$ASSFAC= 0
##$ASSFACI= 0
##$ASSFACX= 0
##$ASSWID= 0
##$AUNMP= <proc_1d>
##$AZFE= 0.1
##$AZFW= 0.1
##$BCFW= 1
##$BC_mod= 2
##$BYTORDP= 1
##$COROFFS= 0
##$CY= -3
##$DATMOD= 1
##$DC= 2
##$DFILT= <>
##$DTYPP= 0
##$F1P= 0
##$F2P= 0
##$FCOR= 0.5
##$FTSIZE= 0
##$FT_mod= 4
##$GAMMA= 1
##$GB= 0.15
##$INTBC= 1
##$INTSCL= 1
##$ISEN= 128
##$LB= 0.25
##$LEV0= 0
##$LPBIN= 0
##$MAXI= 10000
##$MC2= 0
##$MEAN= 0
##$ME_mod= 0
##$MI= 1.114404
##$NCOEF= 0
##$NC_proc= 0
##$NLEV= 6
##$NOISF1= 3.799351
##$NOISF2= 2.8
##$NSP= 1
##$NTH_PI= 0
##$NZP= 0
##$OFFSET= 14.38212
##$PC= 1
##$PHC0= -1198.036
##$PHC1= 10.1923
##$PH_mod= 1
##$PKNL= yes
##$PPARMOD= 0
##$PSCAL= 0
##$PSIGN= 0
##$REVERSE= no
##$SF= 200.129724274929
##$SI= 16384
##$SIGF1= 3
##$SIGF2= 2
##$SINO= 400
##$SIOLD= 16384
##$SREGLST= <1H.CDCl3>
##$SSB= 0
##$STSI= 0
##$STSR= 0
##$SW_p= 3205.1282051282
##$SYMM= 0
##$S_DEV= 0
##$TDeff= 0
##$TDoff= 0
##$TI= <>
##$TILT= no
##$TM1= 0
##$TM2= 0
##$TOPLEV= 0
##$USERP1= <user>
##$USERP2= <user>
##$USERP3= <user>
##$USERP4= <user>
##$USERP5= <user>
##$WDW= 1
##$XDIM= 8192
##$YMAX_p= 0
##$YMIN_p= 0
$$ End of Bruker specific parameters
$$ ---------------------------------
##NTUPLES= NMR FID
##VAR_NAME=  TIME,          FID/REAL,        FID/IMAG
##SYMBOL=    X,             R,               I
##VAR_TYPE=  INDEPENDENT,   DEPENDENT,       DEPENDENT
##VAR_FORM=  AFFN,          ASDF,            ASDF
##VAR_DIM=   8192,          8192,            8192
##UNITS=     SECONDS,       ARBITRARY UNITS, ARBITRARY UNITS
##FACTOR=    0.0002768,     1,               1
##FIRST=     0,             0,               0
##LAST=      2.2672688,     0,               0
##MIN=       0,             -235165,         0
##MAX=       2.2672688,     149723,          0
$$ Real data points
##PAGE= N=1
##DATA TABLE= (X++(R..R)), XYDATA
0@%%%%%%%%%%%%%%JrJ6j6J6j6K4l2L2m0M8n6O4p2Q7j00J13j28J46j65J84k07K34
37A24k62K92l25L62m02M45m93N44o00O62p30Q03q85R76j076J187j310J448j605
56h45J784j989K231k517K864l291L834m551N542p008R385j3856K4994j02813j48929
71b35165K69255M0410j39153J12305J02071j44660q326J01286p2684m9898J02316
82G7757o0147j50411M8890O1590p5430L2326R0990m3097k2697P3244M838k0340
94A7513M2669J0858m1822p167j432k5793O521J8105l3546k3094J9627k313r743
107b9617J0814j4759m719K8760o126o915M8876J4696l2265J9298L5791k4807j3857
120B5170K7570l0227o5755J3174K3905m3709o820M0804j4746j7012M3833K2000
$$ plain form
0 0 0 0 0 0 0 0 0 0 0 0 0 0 0 0 1 -8 8 -8 8 -8 16 -16 16 -24 24 -32 32 -40 47 -53 60 -68 78 -87 97 -110 124
37 124 -138 154 -171 191 -211 234 -259 285 -315 347 -383 420 -465 511 -565 622 -688 760 -845
56 -845 939 -1050 1181 -1336 1528 -1763 2071 -2480 3062 -3946 5439 -8417 16577 -86236 -235165
71 -235165 34090 74500 -64653 47652 149723 5063 -3263 98023 25339 -24559 77757
82 77757 17610 -132801 -83911 -22321 -97751 -65425 25565 -17532 -40229 33015 37853 17513
94 17513 60182 71040 29218 22051 20619 -5174 1347 19452 -14094 -37188 -17561 -19874 -29617
107 -29617 -18803 -33562 -38281 -9521 -15647 -22562 26314 41010 8745 28043 63834 39027 25170
120 25170 52740 22513 -43242 -30068 -6163 -49872 -56692 -15888 -30634 -47646 -3813 18187
132A8187j1244K6053J9203l8476j6687L7279j916l7282J4148J1984m2998r130
144c0879L2888q054j7303J8130l076l1824Q547L3268m059m775K9471K754k2589
157B499J9141K1757j9652r555O847j9155k4935J256L919q926j504J0032K750M300
171a1226J5633O516k082N614K769j773l3k906l666o920j0316M174P319p910j495
186f302M545j3274j1389J5076J2349q969J942J6416r537j0232K6822J3400j7451
199A3396M928O022k8713j1907J8159m883j7721O363N408j6502K583K7156L602
212G891o800J2615O0j3743Q220R691r187l494J972r600p576P875N679q682m059
227i138M402o487n654J2235O301o092J520O622J411N32P699P601p839j0463L053
$$ plain form
132 18187 6943 32996 52199 13723 -2964 34315 32399 -4883 9265 21249 -21749 -30879
144 -30879 2009 -6045 -23348 -5218 -8294 -40118 -31571 1697 -2362 -7137 22334 25088 2499
157 2499 21640 43397 23745 14190 21037 1882 -23053 -21797 -17878 -26804 -28308 -18276 -15526 -11226
171 -11226 4407 10923 8841 14455 17224 15451 15418 12512 8846 1926 -8390 -4216 3103 -4807 -6302
186 -6302 -1757 -15031 -26420 -11344 1005 -7964 -6022 10394 857 -9375 17447 30847 13396
199 13396 18324 24346 -4367 -16274 1885 -2998 -20719 -14356 -8948 -25450 -22867 4289 7891
212 7891 1091 13706 13766 23 8243 17934 8747 5253 7225 -2375 -9951 -2076 3603 -5079 -9138
227 -9138 -4736 -11223 -16877 -4642 1659 -4433 -2913 3709 5120 5652 13351 20952 13113 2650 5703
242E703k984j0145K093K630j0327n867P141N384r53O295R660n161n347J0631L229
257A1982o464L131P96r766l342N030Q38l402L16j201q736j709Q631J14k920O325
273c77M2o122N828J0479O05j346K632k040j0232j129O660n087o971K649k502p565
289a4476N131Q262l52N6M356L58m545L651O782m149l251M300k476n748L878K319
305D096m968j927J305k173l854K587L239m414k26P133k39j124O228K123m202l9
321C545L147j861m719R20L39o272k009M966o88k447L706J086k595R85L587Q48
337B538j841J391P40k871J077L605k212k035J998j626l608J515J553k580j941
352d297J909j17j759L503L803k707n43M547j475k741L344Q01m379j828K507j040
$$ plain form
242 5703 2719 -7426 -5333 -2703 -13030 -18897 -11756 -6372 -7325 -1030 8630 3469 -1878 8753 11982
257 11982 5518 8649 9445 -321 -3663 1367 2205 -1197 -881 -2082 -10818 -12527 -3896 -3782 -6702 -377
273 -377 -335 -6457 -629 9850 10455 9109 11741 9701 -531 -1660 5000 -87 -7058 -4409 -6911 -14476
289 -14476 -9345 -1083 -1435 -1379 2977 3335 -1210 2441 9223 5074 1823 6123 3647 -2101 1777 4096
305 4096 -872 -2799 -1494 -3667 -7521 -4934 -1695 -6109 -6335 798 559 -565 5663 7786 3584 3545
321 3545 6692 4831 112 1032 1371 -4901 -6910 -1944 -2632 -5079 -1373 -287 -2882 -1897 1690 2538
337 2538 697 2088 2828 -43 1034 4639 2427 392 2390 764 -2844 -1329 224 -2356 -4297
352 -4297 -2388 -2505 -4264 -761 3042 335 -208 4339 2864 123 3467 4268 -111 -1939 568 -472
368d72k991K546K696l755j306M040l80j782K261J158k903j222K555J533j630J108
384A456J132l206k19K509j074j221Q38j214k120O87K635K88r95J679K8l011J676
401a32L140j925r99J524k233k204K015K591j381j478J817r19k765K977K976k857
417A47j310J976j386j589K682J769j153j272L98l35j149J653J077k124p08P40
433e84q91N77J620J061j546r94J249J01r33J541R63l157l55J518q44j37J609K52
451A050j953m44J728l12p56J743K07k837N60K163n52l97J576r84j658M37J051
468F22o37o92Q76j082j471J582J210q02Q02R13j211o97J398N73q17k97J093j245
486A18j560J525R67j400l5M86p36m31M15J159r12l93R35J41j287J793P45j216
$$ plain form
368 -472 -3463 -917 1779 -1976 -3282 758 378 -1404 857 2015 -888 -2110 445 1978 348 1456
384 1456 2588 -618 -837 1672 598 -623 215 -999 -3119 -2432 203 491 -504 1175 1203 -1808 -132
401 -132 3008 1083 84 1608 -625 -2829 -814 1777 396 -1082 735 -184 -2949 28 3004 147
417 147 -1163 813 -573 -2162 520 2289 1136 -136 262 -73 -1222 431 1508 -616 -1324 -584
433 -584 -1475 -898 722 1783 237 -757 492 593 -340 1201 2164 -993 -1348 170 -674 -811 798 1050
451 1050 -903 -1347 381 69 -687 1056 1263 -1574 -1014 1149 597 200 1776 792 -866 -429 622
468 622 -15 -707 169 -913 -2384 -802 408 -394 408 1321 110 -587 811 1384 567 270 1363 118
486 118 -1442 83 1050 -350 -385 101 -635 -1066 -651 508 -404 -797 138 279 -1008 785 1530 314
504C14K44R25j038o08O96n2j129k71N97m99l37J271J00j239P87N46n47M44O14
523H18o75k04O74K89q33K29O70p45r48Q55r0r67J30J06j1l20P28O27n66k32J036
544E71n2l77R74J65p89m20K51k21q07N52L18j045l76J120n67j01J073K01j288
563h18M15Q96k72J43O33j7j110K45P29p46m41Q88p77j142O32N44m99J94P26p87
583e64l17N26J190l14l26O56n05p30P73L06m25M0k25n07l54N78N73p17J9J49o74
604h48l06J160P55l47j68N9j30l57R15j07m98j10N1q14K08P07N4j186Q75j19k09
625d15M1N63L40o74J65L80l32R8O79n78k25k98N15n92J41N49r1p62L5J12J28J33
647h8O33m61l49N07o5j73M07J85n94l00K76J74o01M29M55r09rL70j41K54l9j2
$$ plain form
504 314 558 1483 445 -163 533 481 -648 -919 -322 -821 -1158 113 213 -1026 -239 307 -240 204 818
523 818 143 -61 613 902 69 298 968 223 -725 130 40 -927 -797 -691 -702 -1022 -294 333 -233 -465 571
544 571 519 142 1116 1281 492 72 323 102 -705 -153 165 -880 -1256 -136 -703 -804 269 470 -818
563 -818 -403 493 221 364 997 980 -130 115 844 98 -343 545 -232 -1374 -742 -198 -697 -503 223 -564
583 -564 -881 -355 835 521 195 851 346 -384 389 695 270 310 85 -422 -776 -198 375 -342 -323 -174 -848
604 -848 -1154 6 761 414 246 305 175 -182 733 626 128 18 69 -745 -537 170 224 -962 -87 -206 -415
625 -415 -374 189 529 -145 20 400 68 166 845 267 42 -256 259 -333 -192 357 266 -496 -461 -349 -221 -88
647 -88 545 84 -265 242 177 4 411 596 2 -298 -22 152 -449 -20 435 -474 -483 -113 -254 0 -39 -51
669e1J48m30L26M48l59J6K17k98j35J37n3P5l02J9M29m45K46M9l77P07j84m68
691b85L64M05m95k96M51J15o2m50O39m83l40M75M84o51J16M82m02o1J98k02l74
712c72O53k00l72J3O10m19k4P7L4n72K61K02J99j62l4M89j64l94P91k16k55j28
734A7j6l29L3K84m6m31J49Q4J60qK41R2k85J95o7o4j62P04m38j44J03n7J08j85
758f2n2o1l39J77R0qM39k44j67P9K65J78m1J54P4n62j0M50l77q2L13l39k44O9
782c00K05j44J05j66N9J17n3J52m6J89P4jk49L49m9J75m27j35K08k37j65L09J2
805a8k01Lr7j04J81J61J83k98M32j73j07L18p1k21j74L60q6l73M29pk30q5j46
828c24J87L9J16J50k67O1L12n9j66M6k43J85j54L82j67k67J61j81J38m7L22o0
$$ plain form
669 -51 97 -333 -7 441 82 98 315 17 -118 19 -34 41 -261 -242 187 -258 -12 37 -340 367 183 -285
691 -285 79 484 -11 -307 144 259 197 -253 386 -97 -437 38 522 -129 -13 469 67 6 204 2 -372
712 -372 281 81 -291 -278 332 -87 -111 -34 0 -572 -311 -109 90 -72 -106 383 219 -175 616 400 145 17
734 17 1 -328 -295 -11 -57 -488 -339 -255 -95 -103 138 230 -55 140 73 9 -153 551 113 -31 72 15 123 -62
758 -62 -114 -175 -514 -337 -247 -255 184 -60 -227 -148 117 295 254 408 482 -80 -90 360 -17 -99 214 -125 -369 -300
782 -300 -95 -239 -134 -300 -241 -124 -177 -25 -71 118 192 191 -58 291 242 417 -10 -145 63 -174 -339 -30 -18
805 -18 -219 -216 -313 -417 -236 -75 108 -190 242 69 -38 280 209 -12 -186 174 88 -285 144 137 -93 -178 -324
828 -324 -137 -98 18 168 -99 -38 274 215 49 95 -148 37 -117 265 98 -169 -8 -189 -51 -98 224 164
850A64l22K39k71M38l95N66l1k04p2q1k61J11J92O6j72K36k04o30R02k29J22j94
872c0K09J81o33N12m2q3k16R2m1K9o6K37k71J63j04O7k20L12r3l38J03L94l34
895a72J91j00J54j09J7K73j03j93L7J12m9m2p7N8j31R2j38K97K73j88m34Q1K95
918A44o4j67L03k30J61o0k54K50J82j42j86J43l9k8p2Q9j8r3L35k59j36Q5J11
941E5M1m9N6m29L88Kp3J13k32J36l4J21M4J47l85K54QRj6rl72K76o7k0J26Kk42
968a50O7k0MO3J13O4Q9l79O7K22j09Q1K30m69J94k03j09L36j1k3lKm7l5K7J3R4
995A08j24L51l8m89J02k4M4R9q4L0j4j12N4K12l54J86K4Q7K10j28j14m7K5L9N5
1020I8L0mJ73k17J7Q7j46j48P7L7j61m3J85L1jJ29R0j34K4J4l23L55N0j93J33
$$ plain form
850 164 -158 81 -190 248 -147 419 388 184 112 31 -230 -119 73 139 -33 203 -1 -631 271 42 164 -30
872 -30 179 360 -273 239 197 114 -102 -10 -51 -22 -88 149 -122 41 -63 4 -216 96 3 -335 -232 162 -172
895 -172 19 -81 73 -36 -19 254 151 -42 -5 107 58 16 -61 -3 -134 -42 -180 117 390 202 -232 -151 144
918 144 80 -87 216 -14 147 87 -167 83 265 123 -63 80 41 13 -59 30 12 -81 254 -5 -141 -56 55
941 55 96 47 103 -326 62 64 -9 104 -128 8 -26 95 139 286 -99 155 163 172 156 147 -225 51 -16 -36 90 92 -150
968 -150 -83 -103 -99 -36 77 141 230 -149 -82 140 31 112 342 -127 67 -136 -245 91 80 57 54 56 9 -26 1 14 108
995 108 -16 335 297 -192 -90 -114 -70 29 -55 -25 -39 -151 -97 115 -239 -53 -29 58 268 140 26 -21 4 43 98
1020 98 128 124 297 80 97 184 38 -110 -33 4 -157 -200 -15 16 15 144 234 100 124 138 -185 170 220 27 160
1045A60j89R0k69K11J66l99n5L2J77N6J25N3j48l31M63J25k93J99j73j15k0J53
1067A8J15rj10m2J53j66L0R3j28l4J39m1q1K70j54M6j12j0J42kn0m2J6P4j20j1
1093a6k8k20J11Q4K53l66j80L70n8j5n1J60j11j55K75m58O21l5k81O7JJ32r4j95
1117a89L87k51k18K94j75K68j81J32n2p5J72n2ro1j13L19k41j32K42L6l45K93
1139D9OO5k64L71k09l5j13j0J6l3l3p8K57L13k09j58j15Q4P9J05Mj07l3j42M45
1164B55k74M2k27J34k13K85R3J8l54j1J56q9K48k09K76o7MJ86j53n5R4k15l5J13
1188BK3m02L69k4j03K59r0k1nJ79j73nk67N02l73K47o5j5k35J33J06k80K48j00
1212i0L07l88R2J15O5Q1k87L4K06k1J56j4L3j14l86K75k0k36O1O0L03j20j9J62
$$ plain form
1045 160 -29 61 -208 3 169 -230 -285 -253 -76 -20 105 158 10 -321 142 267 -26 173 0 -115 -135 18
1067 18 133 124 14 -28 125 -41 -11 82 -46 -80 59 18 -63 207 53 99 -13 -23 119 117 67 25 41 115 -5 -16
1093 -16 -44 -264 -153 -69 184 -182 -362 8 -50 -65 -116 44 -67 -222 53 -405 216 181 -100 -33 -32 100 6 -189
1117 -189 198 -53 -271 23 -152 116 -65 67 15 -60 112 60 51 -10 -123 196 -45 -177 65 101 -244 49
1139 49 55 120 -144 227 18 -17 -130 -140 -124 -157 -190 -268 -11 302 93 -65 -180 -96 -17 88 92 -15 -48 -190 255
1164 255 -19 23 -204 -70 -283 2 95 113 -241 -252 -96 -185 63 -146 130 63 67 253 100 45 139 -76 -111 2
1188 2 25 -377 -8 -32 -135 124 34 13 8 187 14 9 -258 244 -129 118 53 38 -197 -64 42 -238 10 -90
1212 -90 217 -171 -79 36 101 182 -105 -71 135 114 270 256 289 175 -211 64 44 -192 -131 -71 232 112 93 255
1236B55l52J00j3P0M7k40o5j6K41n5L80m91L74j76j40J19j0J3p1j21K87o7l79
1259c10N28k52J64K6m18L54j5q1J25j96q7L84l01J08j27J80k17L30j75j29K6k64
1281c47K67J46j5j7j79J48N4r0K5J42j32M5M5J01k33R5j36J63j7j68J71k00K0
1304a12K83o00N60k4j43L78l20l64K1J74j25N28l66P7k07K29j10J46J20n7j51
1325f3K9j77K03P6l25O25k62j96J51q1r3K8r6J45j94K44RN2K22n95K92R9J1l95
1349b91J57R7p4p8L53j84p9j18N59j36k37o4n0N1J12k60K2L08k92K33J10k87J33
1372a5J12j89M1m3L6L86l03j42qK06J60l61J35j57K22j88M0K46k26RO8m25M33
1395C7o5k40J93K74j09j38r1P3R9j30m0K06j39K12r2j46M1p4K07J4J03p3N9l57
$$ plain form
1236 255 -97 3 -10 60 107 -133 -198 -214 27 -28 352 -139 235 59 -81 38 28 41 -30 -151 136 69 -310
1259 -310 218 -34 130 156 -262 92 77 -4 121 -75 -162 222 -79 29 -98 82 -135 195 20 -109 -83 -347
1281 -347 -80 66 51 34 -145 3 57 -33 -8 134 2 47 92 193 -40 55 -81 82 65 -103 68 -132 -112
1304 -112 171 -429 131 107 -36 342 22 -342 -321 -147 -272 256 -110 -33 -240 -11 -121 25 145 88 -63
1325 -63 -34 -211 -8 68 -257 368 106 -90 61 -20 -113 -85 -181 -36 -230 14 23 75 297 -298 -6 93 104 -291
1349 -291 -134 -37 -111 -189 164 -20 -99 -217 342 206 -31 -95 -145 -94 18 -242 -220 88 -204 29 139 -148 -15
1372 -15 97 -92 -51 -94 -58 328 25 -117 -125 81 241 -120 15 -142 80 -108 -68 178 -48 -39 29 -396 37
1395 37 -28 -268 -75 199 90 -48 -139 -66 33 -97 -137 69 -70 142 50 -96 -55 -129 78 92 195 122 181 -176
1419a76J64J08K2n6k31J77L6q9o5k11K93J49k85Q6J79n3K5j85L03m32K43m6j21
1442a65L13O2l22P5r8K08K07k98o4p1J15j55r6J77J51J07j64J34kl08J73j54K03
1465B8q6J97k84N24J04m41l3q4q0K09j34J96r3J45k50k12M58j69J25j53N3km7
1488b9j60J19M2k74K95j27K06j53Q9L7K96k86l03L12l47L15j78P4O1J7J20k13
1510h7J31n2J90J0l99L75rk25J03k7K12l5k57J74j90J14o1K66j34j18Mk7j7qL47
1535B80L2l46l5j70K57l5R5j71M9K20j18j73l0K61K81l07j12mr2Q3K14k13k15
1558b49L48j87K93k48j93J11K3q7K31N6j5K46m55OJ22J07n1q0j65Q9R0J64J06
1581B62j03l46K4L23j40J99j08l54K30K29l16K6K8L40n30K56K89m42J65j15K32
$$ plain form
1419 -176 -12 96 118 62 -169 8 44 -45 -110 -321 -28 121 -164 -78 101 48 73 -112 191 -241 2 -44 -165
1442 -165 148 210 -112 -37 -135 73 280 -18 -82 -153 -38 -193 -289 -112 39 146 -18 116 114 -194 -21 -175 28
1465 28 -58 139 -145 379 483 42 9 -75 -155 54 -80 116 23 168 -82 -294 164 -5 120 -33 20 18 -29
1488 -29 -189 -70 -28 -302 -7 -134 72 -81 8 45 341 55 -248 64 -283 32 -146 -72 -11 6 126 -87
1510 -87 44 -8 182 192 -207 168 159 -66 37 10 222 187 -70 104 -86 28 -33 233 99 -19 -15 -42 -59 -67 280
1535 280 312 -34 -69 -239 18 -17 78 -93 -44 176 58 -115 -145 116 397 90 -22 -26 -118 -35 179 -34 -249
1558 -249 99 -88 205 -43 -236 -125 -102 -189 42 98 83 329 -126 -120 2 109 58 -22 -187 -98 -8 156 262
1581 262 159 -187 -163 160 20 219 111 -243 -13 216 -100 -74 -46 294 -236 20 309 -133 32 -83 149
1602A49j94R2Q5nj61K0J20K3j27Lk29L25j2l1M0j76Q1J17J54k01o5J44j06K10
1626B56l25O7J21j51J27M1j24Jl6JJ67j01j23L5P2K73l14p1J67r3J42j29k64K77
1650A6kk2J05q6J2r8M3K53l86L45l74M52j17j97J10m9QK64l77L0L2OJ85n6Q4j55
1676B6J12l24J32K89j63k08J24o3J1KJ39k23k1L33j39j45J42rK6K3l71N63o7j75
1700A4j78J48m6j12k45N43j0k9L0r8L28m83L4J60J4K7n6N5J50l39K04j17J61l15
1724a60K47l7j62K2l5J90r1R6L3K55m68J25N1j57J0K34j42j41J48K4J48l81L40
1747A49m43J80k8K35L61l34k15k34M56p3M3k32L57J7k86K78o2p5j03L0P0m9J07
1770A49K5k48j01J89qK35k61p0J96n9q0K06L4k27K98l89l15L49J47L9k7j53k3
$$ plain form
1602 149 -45 47 132 127 -34 -14 106 129 2 5 -224 101 89 58 98 -78 3 120 274 73 8 152 46 256
1626 256 -69 -2 119 -32 95 136 12 13 -23 -22 145 44 -79 -44 28 301 -13 -84 83 -10 132 3 -261 16
1650 16 14 -8 97 11 23 -75 -32 221 -165 180 -194 258 141 -56 54 5 13 277 -100 -70 -38 -32 153 97 181 26
1676 26 138 -186 -54 235 72 -136 -12 -75 -64 -62 77 -146 -167 166 27 -118 24 15 41 64 -307 256 189 14
1700 14 -164 -16 -62 -174 -419 124 114 85 115 17 345 -138 -104 56 70 97 41 96 246 -93 111 -6 155 -160
1724 -160 87 50 -112 -90 -125 65 -26 70 103 358 -110 15 66 -91 -81 153 11 -130 18 42 190 -191 149
1747 149 -294 -114 -142 93 454 120 -95 -329 127 54 97 -135 222 239 -47 231 169 94 -9 21 91 42 149
1770 149 174 -74 -175 14 6 241 -20 -90 106 47 -33 173 207 -20 278 -111 -426 -77 70 109 82 -71 -94
1793i4j29J49K24j94K56k30o2L81k29j93q8K24M8j05p4L20j43M7l48M27j9j34
1815C4j79K51k39K5K53l15L54p9k02J42k5k06R6lJK72j66j31J64m5R8l7O5k71
1839a43K23L0n8pk95L38o3l06Q7J44J24L1j74J63l02J60N0O5j10N7k9J29k53j17
1863b56L45j99lQ2m3J58o4p9N6q0p1K16k05K01L4k59K6j04L59l67K18k1l6J17
1887B5o3K0J29j04J81l96J63n3Q5m3k3q7J57n5J77L2l35L29k19J24k47Q8Q5J42
1911A12q2k17N4J73K6j16J06j98k0q4n2L32J17j84j28J97J28j29J15N3j25n5q0
1934e7rk00M01j21k26J43J23j72K56k94P2J16r5j42L73k8k32J55l99K23J95nj23
1957d6J41j38o1J15J66j70J65J6j68J07K2j79J47j91L30j63j36J14j95P5n2K12
$$ plain form
1793 -94 -223 -74 150 -44 212 -18 -80 301 72 -121 -209 15 63 -42 -116 204 61 108 -240 187 168 34
1815 34 -145 106 -133 -108 145 -170 184 105 -97 45 20 -186 -90 -93 -92 180 14 -117 47 2 100 63 128 -143
1839 -143 80 110 52 45 -250 88 25 -281 -194 -50 74 105 -69 94 -208 -48 2 67 -43 14 -15 114 -139 -256
1863 -256 89 -110 -113 -31 -74 84 20 -59 -3 -83 -154 62 -143 58 92 -167 -141 -245 114 -253 -35 -56 -92 25
1887 25 -38 -18 111 7 188 -208 -45 -98 -13 -56 -79 -166 -9 -64 113 145 -190 139 -80 44 -203 -115 -30 112
1911 112 30 -187 -133 40 66 -50 56 -142 -162 -246 -298 34 151 -33 -161 36 164 35 150 203 78 23 -57
1934 -57 -66 -266 135 14 -212 -69 54 -118 138 -156 -84 32 -63 -205 168 140 -92 63 -336 -113 82 77 -46
1957 -46 95 -43 -104 11 177 7 172 188 20 127 149 -30 117 -74 256 93 -43 71 -124 -49 -101 111
1979A11N8j66J97m0k09L44j76k11K44j34j55K31j23mp6q2J73j27N15k89k03J29
2001Gj05J20k33j00L36J25l7L6k17L4n6j21K12j8k19L74Q1J7j84M2pm13J35J11
2025h0k39M80j79q9L8K44j81j06K36k20j03J76n7L20l47K06l38M12m01L08l7J61
2047B04l70K57j97J61N7r9rk5L6Q8j7j35J49k66J61K09j02k03J10Q7o1kl7k0Q2
2072E8j52L87j46k0R2m09L62k13j37K15J92j59o6J74l0l12K56k48J65k1j8J53
2094A23j77K67l74K48qj32J07J88J01l42k81J68M3M19n24K07O9l3q0N2j30K3K22
2117A56k83l1j17L35k43N20l62Q2J2L04m22j07K49k64J32j8L37k86q3K0O7M6Q2
2140A26n6R7j02N4k24K66k2N6k57m6J26j3j0K00j86j3J9k87K17k21M53k42m3K1
$$ plain form
1979 111 169 3 200 160 -49 295 119 -92 152 18 -137 94 -29 -33 -109 -191 -18 -145 370 81 -122 7
2001 7 -98 22 -211 -311 25 150 113 149 -68 -34 -90 -211 1 -17 -236 138 219 236 52 94 87 -326 -191 -80
2025 -80 -319 161 -18 -107 -69 175 -6 -112 124 -96 -199 -23 -80 240 -107 99 -239 173 -228 80 43 204
2047 204 -166 91 -106 55 112 13 4 -21 15 103 86 -49 100 -166 -5 204 102 -101 9 96 35 33 -4 -24 58
2072 58 -94 293 147 127 219 -190 172 -41 -178 37 229 70 4 178 148 -164 92 -156 9 -12 -30 123
2094 123 -54 213 -161 87 79 -53 54 242 343 1 -280 -112 -69 350 -174 33 102 69 -11 41 -89 -66 156
2117 156 -127 -158 -275 60 -183 337 -25 57 69 373 -49 -156 93 -171 -39 -57 280 -6 -89 -69 -2 44 126
2140 126 70 167 65 119 -105 161 139 195 -62 -108 18 5 -5 195 9 -4 15 -272 -55 -276 177 -65 -108 -87
2164h7L3J03K8M0k82K88p4j1j25k56J51J53L9l24J70L44r6j1l50N07K2k89j40
2187a67J74J5J55K66k04l21j68K38J71Rk23O0k59N09k7r2k61O0N4Q3P7k05L8J22
2211A04J94K8l72J45k4l36J08M49l33M8l19M27R6j39k2l04J15K37Nr8j13K24o9
2234E1k30J08J87Nk82J56o4J54Ol55J18K36j52j06J02J95o6l1j7m37J13N03l49
2257a55L13l33L32k32J43J85l94M55l38j53r1J36K64l07K22o4m9oJ10lp5q4J33
2280Ip2P0Qr7n7OJ37j01PJ3J23j09J04k96K15k8r8j79L68o4j10K6K31j0J30l47
2306a21J73J23m32L44j99j7M99l83Oo9L45l08K52m3l90M26l30l2lJ1Q3m0L72k88
2330b1n7M3Q5M1J40n61M57k8m5l9j7j80J2j20L23j94R1k16J34K50J6n0j32K21
$$ plain form
2164 -87 -54 49 77 117 -165 123 49 38 -87 -343 -192 -39 0 -324 -154 190 94 83 -267 240 262 -27 -167
2187 -167 7 22 177 443 239 -82 -250 -12 159 168 -55 5 -254 255 228 136 -125 -65 -11 72 149 -56 -18 104
2211 104 298 326 -46 99 75 -261 -153 296 -37 11 -308 119 215 76 54 -250 -135 102 107 9 -104 120 51
2234 51 -179 -71 116 121 -161 -5 -69 85 91 -264 -146 90 -62 -168 -66 129 63 32 15 -422 -309 194 -155
2257 -155 158 -175 157 -75 68 253 -141 314 -24 -177 -268 -132 132 -175 47 -17 -66 -72 38 35 -40 -124 9
2280 9 -63 7 15 -82 -139 -133 4 -97 -90 -77 46 -63 41 -255 -40 -68 -166 -345 23 -41 -151 -125 106 96 226 -121
2306 -121 52 175 -257 87 -112 -129 370 -13 -7 -76 269 -39 213 170 -220 206 -124 -156 -159 -148 -65 -105 267 -21
2330 -21 -78 -35 50 91 231 -330 127 99 54 15 -2 -182 -170 -290 33 -161 -70 -286 -152 98 114 64 -68 153
2354A53r7J5M6N8l99J21J58o1J3M7J30j34j88j24K82J91k4l70J90k34L57n3K07
2377B84k61q2J20m9J75n61L90J60k09oJ10j13K10l86L10J04n3p9o5K97m76L71
2399A91l23r6L29k39K33j88J6j6m6L19q1Q5J88k28Kj56J14j89J05J89j10R6j7
2422A78n7J01l07P6L8j33K64k24K94j86p5M3J11r8j09K6l5J14J93k70K22j10o6
2445a0L2j61L23o4L2j28j30L88l47r0k3j3L98r5l11K10L5rp5k4K39k44J74Rk29
2470a13l5J20mq5q4J80j10K79l88K18J46k61N2j0J81k59J03L38Jr8k21K58m01
2493a93N14m44M22k40j54K97l47J4M01p0k22K2m3M13l79q7L08l58l1L04m3Q0l8
2516A26j62n8j38J04L80k64j01o3K82j31N7MK5K3j73J8k7kJ20r1j03j02J18K96
$$ plain form
2354 153 56 71 117 175 -224 -103 55 -6 7 54 184 50 -138 -262 20 211 187 -183 7 -227 130 77 284
2377 284 23 -59 61 12 187 -374 16 176 -33 -39 71 -42 168 -218 92 196 143 64 -1 296 -180 191
2399 191 -132 -228 101 -138 95 -93 -77 -93 -139 180 99 184 372 144 146 -10 104 -85 20 209 99 195 178
2422 178 121 222 -85 -9 29 -104 160 -64 230 44 -31 12 123 25 -84 -58 -93 21 214 -56 166 56 -10
2445 -10 22 -139 184 120 152 24 -106 282 -65 -155 -178 -191 207 112 -199 11 46 37 -38 -62 177 -67 107 116 -113
2470 -113 -148 -28 -32 -117 -201 -21 -131 148 -240 -22 124 -137 -85 -95 86 -173 -70 268 269 171 -50 208 -193
2493 -193 321 -123 299 59 -95 202 -145 -131 270 200 -22 0 -43 370 -9 -96 212 -146 -177 127 84 164 126
2516 126 -36 -94 -232 -128 252 -12 -113 -176 106 -25 32 36 61 84 -89 -71 -98 -100 20 -71 -174 -276 -158 138
2540A38q3K8j20k2J34j21K32n25M81j4l92J70j63K87j4j77J42n0R6j19p8l4N7
2563a47MK09O0j78K09j0J06j44j27K70k79%q2PJ89m20M09K19l87o2K29j89n8J21
2587e1Q3M2m4P4k01k8j05K56j96P9M9J34j13j45L51k62J09J42j27mj07j15q1K45
2611a5K01J05k87l27L83L8J16l6J39k85Q4k94l7M15o3l63L54m11J16K36j85O6
2633e0K23k53j2K5K92J2j11k65J65Rk40M29n3j36kj91q5K29K2J34k73J53k06N11
2657C27k83j20L99j64j69j82K76j85K04k16J79J34l33j2M7L12k31q5L04j91r2
2678h1K64j32K3kj11k06K75k03K10o1j31K9J38o7R4q7Q0J2J08P0j26r5j08MJ73
2703G0l42K46K8O5j90l4J78k22K58j20LJ40j52J01k56N31l36j24P4Q2k31L1K12
$$ plain form
2540 138 55 83 -37 -59 75 -46 186 -339 142 128 -264 -94 -257 30 16 -161 -19 -69 27 -92 -170 -204 -147
2563 -147 -143 66 126 -52 157 147 253 109 -18 252 -27 -27 -109 -102 87 -333 76 295 -92 -154 75 -114 -172 -51
2587 -51 32 74 30 104 -97 -125 -230 26 -170 -91 -42 92 -21 -166 185 -77 32 174 47 43 -64 -179 -260 -15
2611 -15 186 291 4 -323 60 98 214 178 317 32 116 -178 -215 200 137 -226 128 -283 -167 69 -116 -50
2633 -50 173 -80 -92 -67 225 237 126 -139 26 35 -205 224 171 35 33 -158 -243 -14 8 142 -131 22 -184 327
2657 327 44 -76 323 159 -10 -192 84 -101 103 -113 66 200 -133 -145 -98 214 -17 -102 202 11 -81
2678 -81 183 51 74 72 -39 -245 30 -173 37 -24 -155 -126 12 -55 39 -48 32 44 152 222 96 1 -107 -103 70
2703 70 -272 -26 2 67 -123 -157 21 -201 57 -63 -60 80 -72 29 -227 304 -32 -156 -82 0 -231 -200 12
2726A2j81J62o3J5M8j09M25l83K29m17M82l58p1K26L07k85j19J4K79k21k78L66
2748H0k38J29K20m0l05K24J12k65k16M16j11k01Q3M7m9J27K68l35J29j13k56J43
2770a51j29N8L30k05K56k49K52j73O8J04l93M55j31P9j39Q5k91K01l2j09K23r
2792A00N1N3j55O7j98P6k1j75J45O6lJ24j03o4j03K81m3j28J83k15J65k13J10
2815@jk55K66O1J05NJ31j78j41M0j53K24j00K4O5j80K04j72J38J5k69J37j2l31
2839c77M46j8K06k77j4n1J55K9k56J99Q1k41j1P5j89L44k24L25j91L6O2P8q5l12
2863b10K73l40M55k69J8R4r6K72l19q9J24j52K6J07J12M7J00j04Nk31J09j69J91
2886d6J29j49J07j87Q0k09K89j02J13J73r2o8L1o7K49j63J23j15j50N3L4l4j5
$$ plain form
2726 12 -169 -7 -70 -55 -7 -116 309 -74 155 -262 220 -138 -209 17 324 39 -80 -66 213 -8 -286 80
2748 80 -158 -29 191 151 -154 70 182 -83 -299 117 6 -195 -112 -65 -114 13 281 -54 75 -38 -294 -151
2770 -151 -280 -222 108 -97 159 -90 162 -11 57 161 -232 223 92 171 32 117 -174 27 -5 -114 109 100
2792 100 151 204 49 116 -82 -6 -27 -202 -57 9 6 130 27 -37 -140 141 98 -30 153 -62 103 -110 0
2815 0 -1 -256 10 71 176 181 312 134 -7 33 -120 104 4 28 93 -87 117 -55 83 98 -171 -34 -46 -377
2839 -377 69 51 257 -20 -34 -85 70 99 -157 42 123 -118 -129 -54 -243 101 -123 202 11 47 109 187 102 -210
2863 -210 63 -277 178 -91 -73 21 -75 197 -122 -211 -87 -239 -213 -106 6 53 153 49 54 -177 -68 -237 -46
2886 -46 83 -66 41 -146 -66 -275 14 -88 25 198 106 38 69 2 251 88 211 96 -54 -1 33 -1 -16
2909a6Q2l11L03j85L4N1J02L2K96n02o9J97j0k42N2L03N0kk25o4J38o9J08R1k45
2934a01K07j11J28j96KJ10M2M9n1nk90M84m22M6J24J01km04N34j13k2j96K9m8
2958a05K94k52j2M28m43k6q2j5K53K42j0k39m18L35R6r9J24Q0m64M48j93O3K34
2981B39q8l08r1M08l03N4J02K31l27J19O5k99J73k63J47N7J05j49L43l47j78K13
3003i7J26J20l80J79j25J85q2J38Pq0N1o3n8K52m63J49M92l32l0K70k04J01J01
3026B57m05J96n5R0J43j49p2j66J97K4j98L0J49p3k8K94j83k63N4J16K01j30J64
3049A93j98J78O9k24l27M04j80M2J42j14r5L31k35K11j60k36P6J03O4l69L88k43
3071a80J83k5j27K49p3J65l05R4k9J44K45k92j30P6K62j58k14J64P2j09K33l87
$$ plain form
2909 -16 66 -245 58 -127 -93 -42 60 92 388 -114 -183 14 4 -238 -186 117 167 165 -60 -124 14 -55 53 144 -101
2934 -101 106 -5 123 -73 -71 39 81 130 79 74 -216 268 -154 -108 16 117 115 -289 245 132 110 -86 -57 -105
2958 -105 189 -63 -75 353 -90 -116 -198 -213 40 282 272 33 -385 -50 46 -53 71 151 -313 135 -58 5 239
2981 239 151 -157 -248 160 -143 -89 13 244 -83 36 101 -198 -25 -288 -141 -84 21 -128 215 -132 -310 -97
3003 -97 29 149 -231 -52 -177 8 -74 64 71 -9 42 -21 -79 173 -290 -141 351 19 -11 259 55 156 257
3026 257 -148 48 -7 83 226 77 5 -161 36 60 -138 -108 41 -32 -60 234 51 -212 -158 -42 159 29 193
3049 193 -5 173 242 18 -309 95 -85 -43 99 -15 -110 221 -14 197 37 -199 -123 -20 44 -325 63 -180
3071 -180 3 -22 -149 100 27 192 -113 -19 -48 96 341 49 -81 -5 257 99 -115 49 121 12 245 -142
3093a42L11k20j64L70O6j22m9K15Rk49k95K85n3K43k26J10p5j51M08n12K85j95
3115a51L29r4J59k25k77J96J46j31J8K63l92K14k37K21k1L6m1n6O9R1L7k68R6
3138a8n9r2O2K96l44J75J7K8L8l23J28j22K20J21j82Oq4K54k15L71k88k3J32r4
3162DP8j11J91k10j14K67J02l39KR0%K36O9n44J91j39M31j22k01J05j58P4k0J48
3186C0J7p6L24m76K95j46n0L13j89M4J10j39R3l10K75j40o6K40K3l1l90p2J92
3209a29K68j72L5j59J20p9j39J79q5N17l20J21j99k60J3M94Q4n04J05O8j10J02
3231e0J47j04J22J5l41M5K18J9o9K4qP9J17j62q8k0n7L23l36M02l54L09r3j71
3255c3Q3M33p56J89J65l53R0L7J18n2K5J71l5M8k85J91q0j05R6j9N0J86j99j86
$$ plain form
3093 -142 169 -51 -215 155 221 99 50 265 274 25 -270 15 -38 205 -21 89 14 -137 271 -241 44 -151
3115 -151 178 84 243 18 -259 -63 83 -48 -30 233 -159 55 -182 39 18 54 13 -43 26 117 154 -114 -18
3138 -18 -77 -169 -107 189 -155 20 37 65 103 -220 -92 -214 6 127 -55 -49 -133 121 -94 277 -11 -34 98 4
3162 4 82 -29 162 -48 -162 105 207 -132 -130 -40 -40 196 265 -279 -88 -227 204 82 -119 -14 -172 -98 -118 30
3186 30 47 -29 295 -181 114 -32 -82 231 42 86 196 57 150 -160 115 -25 -91 149 172 141 -249 -321 -129
3209 -129 139 -33 2 -157 -37 -116 -255 -76 -161 356 36 157 -42 -302 -289 205 289 -215 -110 -42 -152 -50
3231 -50 97 -7 115 130 -211 -166 52 71 2 26 18 97 214 52 -36 -56 -113 210 -126 276 -78 231 138 -33
3255 -33 50 483 -273 -84 81 -272 -182 -145 -27 -79 -54 117 82 130 -155 36 -44 -149 -53 -72 -22 164 -35 -221
3279b21K99j87o5K19r1j0K69k33mj7J7o5j5j34L27j70M2k4j56K09k2J83m29L64
3303H6l2m8J1j75p3K45j70L01l07K81k01K41J6j45j66J96J42k62j14L25l0m37
3325c16L78k08J43J6l1J38o3r8o4l3K26kk92K43l46M02n3K2K03l40L08l11R3Q0
3349I5m7o3j13r0k4L93k58K97j96j92J72l92N65j68M6J79l37rQ3k18M8K96l43
3372b76M78k35k58J86K09R7j28N7p1o4J03k38J57PKK28m43K58l52L81j67Q3R4
3395A08k26m6J69Q2j84J24j20m9L37k98M86k23m02J72J30j37J14J68m48L18j15
3416d0P9j61L13j33O6N2k95j04J90n8P1J56m36J55L3k64J28J31M7m7j14L98j04
3439F3r2q9K3K8Q4l8K05m8j71L2J83J44j49j67q7j26L17ql30K79R0l64K83j59
$$ plain form
3279 -221 78 -109 -174 45 -46 -56 213 -20 -24 -41 -24 -89 -104 -238 89 -81 -39 -63 -219 -10 -32 151 -278 86
3303 86 54 6 17 -158 -231 14 -156 145 -162 119 -82 159 175 30 -136 60 202 -60 -174 151 121 -316
3325 -316 62 -146 -3 13 -18 120 57 -41 -105 -138 88 86 -206 37 -309 93 40 62 265 -75 233 -78 15 95
3349 95 48 -15 -128 -218 -242 151 -107 190 -6 -198 -26 -418 147 -21 25 204 -133 -142 -59 -277 -229 67 -276
3372 -276 202 -33 -291 -105 104 201 73 130 59 -5 98 -140 17 24 26 254 -189 69 -283 98 -69 14 108
3395 108 -118 -164 5 87 -97 27 -93 -142 195 -103 383 160 -242 -70 60 -77 37 205 -243 75 -40
3416 -40 39 -122 191 58 124 176 -119 -223 -33 -91 -20 136 -300 -145 -112 -376 -248 -117 -70 -117 -231 167 63
3439 63 -29 -118 -95 -67 17 -21 184 136 -35 -3 180 324 175 8 -79 -205 112 104 -226 53 143 -221 62 -97
3463i7O5k19L38N1R6k56j11L52r8p3k54M0L21Nj14j9j94J4K23k00l7K16l4L2K03
3488B50l31M9M7m9k11kP2k0J24k07J40L14j74n6K25k71J73r5l6O9q3J43n1p4J56
3513A02n7l28K97r1j15K94k96L14L09l03l29P6N3R9q9N8PL38k86n4l25P5N51k04
3537I6Q5l6k1rj14j89o7J74K77k86j76K65j30J08K10K0k73J92K21l17k24j86K99
3560h1K44j08l85N91k90j37j51K50J64k59o2LM54l98K09l3k12M51l26mK89N7m1
3583B25j37k0k86Q2K08Lj08k17K45lRJ43j21J06m22M85j90K44l47K3J24j43K43
3606A46m35J98Q2J06r5O7p9j12Q6n8L74m17MJ7k5J24J41l35J93J17j28J74k19
3629g4o2K71k5j39K02k78J53K06o8j92j62J57J46k29j1l9J77j00J72j11Mj56K16
$$ plain form
3463 -97 -32 -251 87 138 234 -22 -133 219 121 48 -206 -166 155 160 46 27 -167 -153 70 -130 -167 49 15 47 250
3488 250 -81 -32 15 -34 -245 -247 -175 -195 -71 -278 -138 176 2 -54 171 -100 73 -22 -58 11 -72 71 20 -54 102
3513 102 45 -283 14 -77 -192 102 -194 120 429 126 -203 -127 -74 25 -64 -6 1 339 53 -1 -326 -251 300 96
3537 96 181 145 124 115 1 -188 -255 -81 196 -90 -266 -1 -131 -23 187 207 -66 126 347 30 -194 -380 -81
3560 -81 163 55 -330 261 -29 -166 -317 -67 97 -162 -224 -221 233 -165 44 11 -201 250 -76 -80 209 266 225
3583 225 88 68 -218 -136 72 75 -33 -250 -5 -8 1 144 23 129 -293 192 2 246 -101 -78 46 -97 146
3606 146 -289 -91 -9 97 2 69 -10 -122 -36 -94 280 -137 -133 -116 -141 -17 124 -211 -18 99 -29 145 -74
3629 -74 -136 135 110 -29 173 -105 48 254 186 -6 -168 -11 135 -94 -105 -144 33 -67 105 -6 -2 -158 58
3652E8M4Mk91M81j49j23Pj51K17j2l1k06K84Qk54q4J31p3K29l24K95j05O7r9J72
3677I5j46oK57n22N75l88k32J98M0K54k03K53r9j40L0r4j0L78k28p4P0R6k12q8
3701a96J56K38M4k91o5K63J57l10O8j10J32r2J66k13M5k89M85k59r7j49J13Q6
3723a18K44n5J60m9K04k94J79j43k34J72J98m55J80K12k89L01j11l15J26K78q1
3744A10N2k30K52j60j50L17k12j34L3J92J29k94J02k2q0j4p5M37m16L05j38L0
3766C4j06J3J35l07J50J49n6j06J93P9M1J42k82p6K27k43q4J18M8l3K7M0K12j59
3790A56j38r6J17k2k37K95j99l09K3O02k09k8p3K82k20m2K76k27K53n1k1j85J3
3813d0Q0j54J07K8NO2O5k8k49k2K39l5l87J78R5j16K38j67J03l52M18n1LR4j74
$$ plain form
3652 58 102 106 -185 296 147 24 31 -120 97 85 54 -152 132 140 -114 -198 -67 -140 89 -235 60 -45 22 -77 95
3677 95 -51 -57 200 -322 253 -135 -367 -169 -129 125 -78 175 76 -64 -34 -128 -138 240 12 -62 8 104 -108 -196
3701 -196 -40 198 242 -49 -114 149 306 -4 64 -46 86 -6 160 -53 -8 -297 188 -71 -168 -317 -204 -118
3723 -118 126 71 231 182 386 92 271 128 -106 66 264 -191 -11 201 -88 213 102 -213 -87 191 110
3744 110 162 -68 184 24 -126 191 -21 -155 -122 70 199 -95 7 -15 -95 -109 -184 253 -163 142 4 34
3766 34 -72 -59 76 -231 -81 68 12 -94 99 178 219 361 79 3 230 -13 -97 21 69 36 63 103 315 156
3790 156 18 -78 39 17 -220 75 -124 -433 -410 192 -17 -45 -118 164 -56 -98 178 -49 204 153 132 -53 -40
3813 -40 40 -114 -7 21 26 88 153 125 -124 -146 93 58 -329 -151 -56 -172 66 -101 2 -350 68 17 20 114 -60
3838f0J08o0M6J03j45m9N0j02j6K99J2j37l22L41K4k34M30k51KJ31l16J85l2K5
3862C2Q4k03j52K90m02O72l52MJ57m04O2K92j27n4K61l25K51L8k60K25m77K86
3884a02K40k96n1Q6J61K20l40K2K69k45r0qK38k28J04m8J24j04j25L01J94m9m12
3907a39PJ53k35J61J65j09j23J18K41m1k86J9n0Q5K39k56j20J71k4k2J24j62j23
3930b07P9K13O1k65o3L23J0L2j53m19N07k09o9p0K36J43k43L3JL06m17L46q7j09
3954b1rK8l4j03K44k04m4M1K71l03n0J29j33L03O9n5N3l40QK60N6m56J71J74j22
3979f7q0Jk8J75N7l6j20q0N34m81O0n2j36J08N6J21P0j74J38oj92K14j62L54k47
4004B7r4n5J40j72L07k41K47n7R6j90K9j41K13l05K27O5P4k25J91L4j03k03K59
$$ plain form
3838 -60 48 -12 34 137 -8 -57 -7 -109 -125 174 186 49 -273 68 92 -142 288 37 39 170 -146 39 7 32
3862 32 116 -87 -239 51 -351 321 -31 -27 130 -274 -212 80 -47 -101 160 -165 86 124 -136 89 -388 -102
3884 -102 138 -158 -209 -123 38 258 -82 -60 209 -36 -126 -134 104 -124 -20 -68 56 -48 -173 128 322 273 -139
3907 -139 -132 21 -214 -53 112 3 -120 -2 239 198 -88 -69 -119 -34 205 -51 -171 0 -24 -46 78 -84 -207
3930 -207 -128 85 146 -119 -182 141 151 183 30 -389 118 -91 -160 -230 6 149 -94 -61 -60 246 -171 175 88 -21
3954 -21 -30 -2 -36 -139 105 -99 -143 -102 169 -134 -184 -55 -188 115 184 129 182 -158 -150 110 166 -290 -119 55 -67
3979 -67 -147 -146 -174 1 58 22 -98 -178 356 -125 -65 -117 -253 -145 -89 32 102 -72 66 60 -132 82 -80 274 27
4004 27 -67 -122 18 -154 153 -88 159 102 198 8 37 -104 109 -196 31 96 170 -55 136 170 67 -136 123
4027A23l82k2L59j54K28l32K1K63M2j05j97J88j29J56K8q7lk26K85k64J14K58
4049A64J24j07l7l14K03j4M9J29k28j63K58L7k82R9l5K38K18n12K02J22j34k55
4071b38K94L2J35q4j04p8R2L4k56K47k7q9K09J02o36K29N28m58J2K44k88K13N5
4094A68O2j06n4j21L36l92j58N10k08J93k18p2j24K53k08K01j06M9j5q2KJ79l10
4117b21K3M47j93j07n4J43k77N45j94k93J46p9o6K39K41j58j02j2J5K1k02L11
4139A73k18J4k6J6M6j70K49k6Lj24K25j64J25K33l81L05l36j21j02N52l06J46
4161A13J5J8lm20L98n5K6j10J25q9K33k80J44j95R5L1mp3Lk7J40lJ56k64K9j04
4187a01J82j40N1j5J12m0j89J31J50j79Q4k58L30m9k63J75K11Lj68k15M9K92j41
$$ plain form
4027 123 -259 -281 78 -76 152 -180 -159 104 146 41 -156 32 -97 59 87 0 -3 -229 56 -208 -94 164
4049 164 288 181 144 -170 33 19 68 197 -31 -194 64 101 -181 -82 -117 121 339 -173 29 151 17 -238
4071 -238 56 88 223 139 35 -43 49 83 -173 74 47 -42 167 269 -367 -138 390 -68 -56 188 -100 113 168
4094 168 230 124 70 -51 285 -107 -265 245 37 230 12 -60 -184 69 -139 62 -44 5 -10 -92 -90 89 -221
4117 -221 -198 249 56 -51 -105 38 -239 306 112 -181 -35 -114 -180 59 300 142 40 28 43 64 -138 173
4139 173 -45 -31 -57 -41 5 -165 84 58 61 -63 162 -2 123 356 -25 280 -56 -177 -279 273 -33 113
4161 113 128 146 143 -277 121 66 92 -18 107 18 251 -29 115 -80 15 46 42 -31 -28 -55 85 82 238 -26 3 -101
4187 -101 81 -59 -8 -23 89 49 -140 -9 141 -38 46 -212 118 69 -194 -19 192 195 27 -188 -139 153 12
4210A2k1J9r6p4R2L5k94L50k4qq7N3P1M6j33K45J4j55k13K90r1l24O13o42N54
4235B32j49J04j62j17L4k11R2K99l14K89J5k99M6J39J21r5K4j3l04L90J6j3k50
4258a26R3j54K60Q1j71J80k37k1r8J80K48k12r7J35j36K39j25o0Q5M2j70L8pJ58
4282A25k31n5L45k34k3J64J14k75p8K40J75j21j13j00J20j46j12N16k52k62J82
4303b1r3J01J69K0k37k73O1J39J83k7r0j15K72j53K05l18J97m0k1L5R1l9J90k35
4327AQ7k29K25Q5m2L39n78M0J36N7Ok82J7L00l24N1K29J55m62QK12K7k02K51j1
4352I6J17m15L18J55m79J81j33J07o8R8p9r3J25j07Q4N10k65m08M40j35O8j50
4374c3J52K22l20R5n24O20m16j4L52L4k04Kq1L05k86K24q4j35K84k46J50l28J15
$$ plain form
4210 12 -9 10 -86 -160 -68 -33 -327 23 -1 -9 -96 -43 28 74 -59 186 200 45 -168 122 31 -293 320 -322 232
4235 232 83 187 25 -92 -58 -269 -177 122 -192 97 112 -187 -141 -2 119 24 48 35 -269 121 137 124 -126
4258 -126 -33 -187 73 154 -17 163 -74 -95 -193 -13 235 23 -74 61 -75 164 39 -21 64 106 -64 -26 -33 125
4282 125 -106 -161 184 -50 -73 91 205 -70 -148 92 267 146 33 -67 53 -93 -205 311 59 -203 -21
4303 -21 -114 -13 156 176 -61 -334 -273 -134 49 22 -68 -183 89 -64 141 -177 20 -20 -41 -6 85 46 236 1
4327 1 88 -141 84 169 127 466 -112 -72 64 121 127 -155 -138 162 -162 -111 118 273 -189 -181 31 58 -144 107 96
4352 96 213 -202 116 271 -208 -27 -160 -53 -121 -23 -102 -195 -70 -177 -93 417 152 -256 184 49 117 -33
4374 -33 119 341 21 116 -408 212 -204 -218 134 168 -36 -34 -115 190 -96 128 44 -91 193 -53 97 -231 -116
4397a16L19k30m1J71k29M28l90j07J48J4r4K10j75P2j57R2j16K62Q8k8J35r8j40
4420A8K72k09j4j65J2l9J88J63k50j68K49j7k08K04r6J65j99N1j39K45rk76L91
4443A69l1k20J63k27J42l88L86k39Q7J09L6J9n1J24j69J43k48M33j94j27L9J37
4465I3n2j29k2j13K22J72m32L84o2k5p3J7J67k80K03j30qn1L03j08J4P7M3j81
4489B9j58J20l8J85o6j72K28j1j25J24m19L44j71K31j79j73J70J06k58J93q5J97
4511G2J3k34L27j46n2j75R2J17J38k06J60j87K1j09k7K84lN2r1p6P1K03l90O7
4535g9J1K63m09L64k56K66M2k66k2J90J4J32m01j2J0N21m55Q8K29l47J59Rj83
4558a32K86l1j26l6J12J63k41K16k52k92K43L13j57j46R1l5J18j82m3L75l75L13
$$ plain form
4397 -116 203 -27 -68 103 -126 302 -88 -195 -47 -33 -127 83 -92 -20 -177 -85 -201 61 149 121 256 158 18
4420 18 290 81 67 -98 -86 -125 63 226 -24 -192 57 40 -168 36 -60 105 -94 -43 -182 63 54 -222 169
4443 169 138 -82 81 -146 -4 -392 -6 -245 -158 -49 -13 6 -45 79 -90 53 -195 238 44 -83 -44 93
4465 93 41 -88 -110 -223 -1 171 -261 123 61 36 -37 -20 147 -133 70 -60 -68 -119 184 76 90 167 210 29
4489 29 -129 -9 -47 138 72 -100 128 117 -8 116 -303 41 -130 101 -78 -251 -81 25 -233 -40 -125 72
4511 72 85 -149 178 32 -20 -195 -103 14 152 -54 106 -81 -60 -169 -196 88 85 137 46 -30 41 244 -146 -79
4535 -79 -68 195 -214 150 -106 160 202 -64 -86 104 118 250 -151 -163 -153 368 -87 1 230 -117 42 51 -132
4558 -132 154 123 -3 -39 73 236 -5 211 -41 -333 -90 223 66 -80 11 -24 94 -88 -131 244 -131 182
4580A82j35Kj64j15J12K74j53j3J04K3k14Q9j12K44k16j7J09p7p8K09M64n38k5
4603d5L69n18J19Q0N8nj77R6k9r4J13R9q4L9j06K54j64J89K2j70R0j91M7R6k52
4628a64K36q5qJ01m6O2K60l15k0J13r2m4Q6k68Q4j2M1Q7j08J54J65q5p7J49m05
4653a91J06K69p4K5Q2m13K84j96N4m0P8J69M6k20q0n4K17j01q8K50rn9k00K08
4677F3o7l73L31L5J63N8j1k78O4j88L26k88K14l17K34J57r5j91K19j52R8j3J58
4700A47k31M7J40k39R6o1J90l9L0j68O8J06o4mp6L7qK09j70O2k78J58R3O0J21
4725B26K07l74l86L31pJ10k45R6Q8P6K66k85j88K43k16L1J52K6k35J21j32K5J58
4748H8k2j29J24L1J2j08o5L97j59j41M6j00J60j73J62k38o9J10J95j28M2J14J31
$$ plain form
4580 182 47 49 -115 -230 -118 156 3 -10 94 117 -97 -8 -120 124 -92 -109 0 -77 -155 54 518 -20 -45
4603 -45 324 -194 -75 5 63 58 -119 -23 -52 -146 -33 66 -18 21 -85 169 5 194 216 46 136 -55 -8 88 -164
4628 -164 72 -13 -21 80 34 96 356 41 21 134 42 -2 84 -184 -100 -112 -71 16 -92 62 227 142 65 214 -191
4653 -191 -85 184 110 135 217 -196 88 -108 -54 -94 -16 153 199 -21 -101 -155 62 -39 -127 123 114 55 -145 63
4677 63 -4 -377 -46 -11 152 210 199 -79 -15 -203 123 -165 49 -268 -34 123 28 -163 56 -96 2 -11 147
4700 147 -84 -37 103 -136 -40 -101 89 50 80 -88 -20 86 22 18 -58 -21 -29 180 10 72 -206 -48 45 105 226
4725 226 433 59 -327 4 -3 107 -138 -42 46 122 388 103 -85 158 -58 -27 125 151 -84 37 -95 -70 88
4748 88 66 -63 61 92 104 -4 -69 328 169 28 74 -26 134 -39 123 -115 -184 -74 121 -7 35 149 280
4771B80l52r6J34p9K8m7m5j0J66j88L79j68K15j88l10k4L42Kj42O8J14p4J5J32
4795A52J82k33l46K98P7j20j82L90n1l62J93q3J53j77J24j56k8J24J30J4j74K20
4817A45j63J75o0J22J48n62K71m8J39n0m08K82j6l00M37j31J7N6j50qQ7L2J43
4840A58j52J47k04k77M82j02k75L70J3k12L7j88K19K7k12J80j36Q9J40M0j48m3
4862d7j64J38J48l91K81J77m4J0j97N80m33J26q9q3o2K72j0k31J09p8r8K69k26
4885d3Q2K1L6m6J89k15M8j77J33J92k25Q4k92M74l49J22j00q8J09P9j05J29m41
4908c83M47j00j50J00J15K02r4P1k69Mj89Q5K45j38K72l68L25l44K03j70J93l2
4930B5j39L09j05M0j41J25m3j6j00K68k17O6l76K48P5p3J26m1K09l0l28p3J91
$$ plain form
4771 280 -72 -168 -34 -113 -85 -132 -177 -187 -21 -209 170 2 217 29 -281 -305 37 39 -103 -35 79 5 20 152
4795 152 334 101 -245 53 130 10 -172 218 167 -195 -2 -85 68 -109 15 -141 -169 -45 85 99 -75 145
4817 145 -18 157 97 219 367 -195 76 28 167 117 -291 -9 -25 -325 112 -19 -2 54 -96 -104 -17 15 158
4840 158 6 153 -51 -328 154 52 -223 147 160 -52 -15 -203 16 43 -169 11 -125 -36 104 144 -4 -47
4862 -47 -211 -73 75 -316 -35 142 98 108 -89 491 58 184 95 12 -50 222 212 -19 90 12 -86 183 -43
4885 -43 39 60 96 50 239 24 72 -105 28 220 -5 79 -213 261 -88 34 -66 -154 -45 34 -71 58 -383
4908 -383 64 -36 -186 -86 29 231 137 208 -61 -57 -246 -161 84 -54 218 -150 175 -169 34 -136 57 25
4930 25 -114 195 90 130 -11 114 71 55 -45 223 6 72 -304 -56 19 -54 72 31 240 210 -118 -191 0
4953@J34m18J40NK36j06m0J49O3j10J24n16L34kj53L84l8j24j18K44m48J71jj85
4977b75K01K10j79k69L92q3p3L7L7p3J15j45Q4l5K38m5LR6j14j44j66L02l01K27
5001D0j49K79j41J97j62k16K0J10J1J9P7j55k2J23j81O4R9j09j74J78O9R1l03
5024b35K26K84k69M6k60K90j1R6K4r6j04Ojo2K02k71J74J52q5j74K22p3j40R3
5048C4k05j85K86N3O9j17K54l78M08j46o5K24n51Q2K77L7k60J72j48L34J62l06
5070C1l33J92O1R6rm1J46k11K34q3J27k43L45j34j88j47J43J27l31LJ69J20J29
5093B03l38M21l20K72k40j63L07j48j11j13K74j6J00k46L47j87J26j12l7J34J55
5114C08N4n4l87J31n5K28k67M9j19M5K22k91J82K12n45P4K49m9K4l1J06K30l75
$$ plain form
4953 0 134 -284 -144 -139 97 -9 -49 100 163 53 177 -339 -5 -7 -160 224 186 62 -56 188 -260 -89 -90 -275
4977 -275 -74 136 -43 -312 80 -3 -76 -39 -2 -75 40 -105 -21 -56 182 137 140 236 122 -22 -188 114 -187 40
5001 40 -109 170 29 226 64 -152 -132 -22 -11 8 85 -70 -92 31 -150 -86 13 -96 -270 -92 -23 68 -235
5024 -235 -9 275 6 52 -208 82 71 167 191 95 -9 -3 -4 -66 136 -135 39 191 106 -68 154 81 -59 34
5048 34 -171 -356 -70 -17 52 -65 189 -189 219 73 8 232 -319 -237 40 77 -183 -11 -159 175 337 31
5070 31 -302 -110 -49 47 38 -3 143 -68 166 83 210 -33 312 178 -10 -157 -14 113 -218 -215 -46 74 203
5093 203 -135 286 -34 238 -2 -165 142 -6 -117 -230 44 28 128 -118 229 42 168 56 19 153 308
5114 308 362 308 -79 52 -3 225 -42 7 -112 -67 155 -136 46 258 -287 -213 36 -13 11 -20 86 316 -59
5137e9P3J37k88M14k95J25l04J36O3j25k18L83j43o8K30Kk91J35%l8K07k08j9
5160a51P3J00L34m21O0K1j08J16M4l74M70k12q1J38N1j26j76J46J8J2p8J94j41
5183i1P1K9M2l3p4j2K03j17j92K21j0K4j65P0K48m06L83N0l18k8J83L2Q3k12j02
5208a21L35l69K83j18Lk9k05L80o0l51M57l53J74r6j03J84n3O4J2k60j22L70j8
5231DP5j93K43k09L18j69N3l85Q2J11q9J63K42j73J28oj00Ln12M69J22K8l14J93
5255H4M6k13JJ09l7j18Q1N3K4J67k25o9L32p2n07L17R6q3K03l76N3K29N8j18J
5280C6J40P2k2j15o4K3j69K79J0k59J63k2J7r0N2pj52n6L49o6m10L12k59K25j27
5305a40M81m89J39L5k0p8o4p3J09R7q1J56k23Q0K03k1j47J74k03K5J9j19o7K33
$$ plain form
5137 -59 14 151 -137 277 -18 107 -197 -61 2 -123 -341 42 -101 -169 61 63 -228 -93 -93 -131 76 -132 -151
5160 -151 -78 22 356 -65 -5 16 -92 24 68 -306 164 -48 -129 9 60 -66 -242 -96 -78 -66 -144 50 -91
5183 -91 -20 9 51 18 -56 -68 135 18 -174 47 37 61 -104 -34 214 -192 191 241 -77 -105 78 110 193 -19 -121
5208 -121 214 -155 128 10 13 -16 -221 159 99 -252 205 -148 26 -70 -173 11 -42 22 34 -226 -348 22 4
5231 4 79 -114 129 -80 238 69 122 -263 -181 -70 -159 4 246 73 201 195 95 98 -414 55 177 205 -109 84
5255 84 130 -83 -82 27 -10 -128 -47 6 30 197 -28 -97 235 163 -344 -27 69 -14 189 -187 -134 95 153 35 36
5280 36 176 248 226 111 47 70 -99 180 190 -69 94 72 89 -1 51 44 -108 -164 185 119 -291 21 -238 -13 -140
5305 -140 341 -148 -9 26 6 -72 -136 -209 -100 -3 -84 72 -151 -71 132 111 -36 138 -65 -40 -21 -140 -207 26
5329B6k05J66kJ29r4j1j94J36n1Q9J06j41L6L1j20L58j92j79J7n6J27J41o8r5
5353d6K7K0j20L3J5J72j22K14k62J99l34K09K08q2k90L76k18j47r2L59L5k56J04
5376Bn1L0J72j50J1k3nl8M0J49l72J99J1j27N7J24j88J59J54k00q9R8k55J35K44
5401H7l19J35k5Qj47O5K18j38pJJ07J15k43K36k52P1J76j68L3L1K09j58j09M4
5425c0J62LM4o6j40j07K35O2l66P7O0j66J91J83l32J10J56k80q7L34k4o2K51l8
5449A70n8n5j76M41k66j27K93j59j45K35Q6l09R3j85k8K66j88L33k51K66k73l0
5471f7l6o2K45k09L40O2n15J30j99M49j05L2j84K09l7Q9j96J51k2k37L81m25K40
5494C4J37n4m01J15J19Q7K0M3M8j14j62L12k84j71L17j65L77k5q0o0k18J90j30
$$ plain form
5329 26 -179 -13 -15 114 20 9 -185 -49 -100 -11 95 -46 -10 21 -99 259 67 -112 -95 -151 -24 117 49 -46
5353 -46 -19 1 -119 -86 -71 101 -21 193 -69 130 -204 5 213 131 -159 217 -1 -148 -240 119 154 -102 2
5376 2 -49 -19 153 3 14 -9 -14 -52 -12 137 -235 -36 -25 -152 -95 29 -159 0 154 -46 -135 -37 -292 -157 87
5401 87 -232 -97 -122 -114 -261 -196 22 -116 -123 -122 -15 100 -143 93 -159 -88 88 -80 -47 -16 193 35 -74 -30
5425 -30 132 135 179 113 -27 -134 101 163 -203 -126 -66 -232 -41 142 -190 -80 76 -204 -291 43 19 -43 208 170
5449 170 112 57 -119 322 56 -71 222 63 -82 153 239 -70 23 -162 -190 76 -112 221 -30 236 -37 -67
5471 -67 -103 -165 80 -129 211 273 -242 -112 -311 138 33 65 -119 90 53 142 -54 97 75 -162 219 -206 34
5494 34 171 117 -284 -169 -50 37 57 100 148 34 -128 184 -100 -271 46 -119 258 233 153 93 -125 65 -65
5517f5L22k69K1o2L0l9P6m7J43J37k83J25k52j87M11J23j67J14J55r0l35M34k49
5540D6j72J32J47k68nQ9K27k10p6J16l3P0j24J42P2o4k81Q9L47k55k5R7j98K44
5564A07L8R9l00L6J75l10l1N35l12p1j45J96O9J51l85K25j29J90n7k51K54k77
5586a93J91o1l4J22j30qK17k32L68l34oP4M7j73K62J1L08l32k33j25K62P1m7o
5610A9k19m1K50J2j22K33r5k17l4M44L8k58k24J28J50J8k50J95j09M8O9J16j79
5633b8j60J04l0J48j06J18J53p8l22J62q6J49j82j83J48L06j14K09ll44L57j96
5655B2K06l56J60J17k82J04M7j45K8J26P4j23k7R0N3J93l16J09O7j96J98K7j61
5678A5J12k60R4j3P0L45k18J0j93j59J06J61j99N3l8K10k8K3K04j19k90K72K3
$$ plain form
5517 -65 257 -12 9 -53 -23 -62 14 -33 110 247 -36 89 -163 -350 61 184 17 131 286 196 -139 295 46
5540 46 -126 6 153 -115 -120 -31 196 -14 -90 26 -7 63 -61 81 153 89 -192 -103 244 -11 -36 61 -137 107
5564 107 145 244 -56 -20 155 -155 -186 349 37 -34 -179 17 86 237 -148 77 -52 138 81 -170 84 -193
5586 -193 -2 -63 -97 25 -105 -113 104 -128 240 -94 -100 -26 21 -152 110 121 429 97 -136 -261 1 72 25 19
5610 19 -200 -241 9 21 -101 132 37 -180 -214 230 268 10 -214 -86 64 82 -168 27 -82 -34 35 151 -28
5633 -28 -188 -84 -114 34 -72 46 199 121 -201 -39 -125 24 -158 -341 -193 113 -1 208 205 -139 218 22
5655 22 228 -128 32 149 -133 -29 18 -127 -99 27 101 -22 -49 41 94 287 -29 80 147 -49 149 176 15
5678 15 127 -133 -39 -52 18 363 145 155 -38 -197 -91 70 -129 -76 -114 96 68 91 295 176 -114 158 181
5701A81j26K72j69r7J23O4j73J09j30p8j56L0P6J4j66J14J81j55l2K12j62L15
5723B47k3m55J04N2M0J79p5K46l19M0J04j61K14k94L37l55J87J08l83J02k24M90
5745A61k13j89J39K73j7m5j14n2j54Q9J87j88j69K26r9L71j81k47M0R9J08l45
5767c20L08j05J98k33j37L97R4j72K7j97L77m27J31O6k52O5J73J62l44M41k73
5788b1M0M1k38K29j46M7J31j8J42j99l7M1P0J00j56j31J47m6J52k27K31k86K64
5811A30j70j90L39j27N5n9Q9j00NN8j69J81J30j84K5k46L85L8k06j25J09J52k77
5834a57J56K7J26l28N1J36j12k1L09k05R3J48j91L7Q2o1q2j72J1J94L7N3k44K97
5858A84k69L5p9K03J22k64L19n02M83l40n5J8P4O8j89l7J43J33M3k17K36l14l2
$$ plain form
5701 181 55 327 158 61 184 248 75 184 54 -24 -180 -150 -74 -60 -226 -112 69 -86 -118 94 -68 247
5723 247 224 -231 -127 -75 -35 144 69 315 -4 36 140 -21 193 -101 236 -119 68 176 -207 -105 -329 161
5745 161 -52 -241 -102 171 154 109 -5 -57 -211 -122 65 -123 -292 -66 -165 206 25 -222 -182 -83 25 -320
5767 -320 -12 -117 81 -152 -289 108 202 30 57 -140 237 -190 -59 7 -245 -180 -7 155 -189 252 -21
5788 -21 19 60 -178 51 -95 -48 83 65 207 8 -29 12 82 182 26 -105 42 -4 148 -79 152 -134 130
5811 130 -40 -230 109 -18 37 -22 67 -33 -28 30 -139 42 172 -12 13 -233 152 190 -16 -141 -32 120 -157
5834 -157 -1 26 152 -176 -125 11 -101 -122 187 -18 75 223 32 69 151 90 8 -164 -153 41 78 131 -113 184
5858 184 -85 -50 -129 74 196 -68 251 -251 232 -108 -163 -145 -71 -3 -192 -229 -86 47 90 -127 109 -205 -237
5881b37M27l08L39j61J44k50R5j60O1k20K41J62k20Q4r7L3K17j44k0p5j39J55
5903g3p4J67k4Q0j30j89J74K25q9Rj03k9o9J68J07n8p6L4n9Rq5K50M9l30j56K97
5929B5m3jq4pJ99l00J86J41m3O6k46J51j5n2J69k32k9J25j59J55r4K09j60J89
5953A50j24J17k73L50k63j08K13Pm4M7M7m89M58j19p7ro0J37K33m27J57L9l27
5976c65K01J88%Ol6J32j13k14K54J31m12P1L2K53M8j15j37j55K89j11N8J54k24
5999f5j6K05Q6j61m4l8K4L24l98O6o5J38j4j33Q5k95L96k12l1M10k60K67j75J38
6023B32k51Q1m06L91l08R0J13j26K24L56l09j95L5K36j96l0RJ03m63L59K6q8K66
6046A49Lj9j3j35j11J7J01l9lK22J40l65j13J37J35j02m5j13L30k80j8L08k67
$$ plain form
5881 -237 190 -118 221 60 204 -46 49 -111 -50 -270 -29 133 -87 -3 -100 -67 150 6 -14 -89 -228 -73
5903 -73 -147 20 -4 76 -54 -243 -69 156 67 76 -27 -56 -125 43 150 92 16 50 -9 0 -85 165 214 -116 -272 25
5929 25 -18 -19 -103 -110 89 -211 -25 116 73 139 -107 44 29 -23 146 -86 -115 10 -149 6 -88 121 -39 150
5953 150 26 143 -130 220 -43 -151 62 69 25 72 119 -370 88 -31 -108 -117 -177 -40 193 -234 -77 -38 -365
5976 -365 -164 24 24 30 -6 126 13 -201 53 184 -228 -157 -125 128 176 61 -76 -231 58 -53 5 159 -65
5999 -65 -81 124 210 49 5 -33 -9 315 -83 -17 -82 56 42 -91 -6 -301 95 -117 -148 262 2 269 94 232
6023 232 -19 62 -344 47 -261 -171 -58 -184 40 396 87 -108 -73 163 -33 -63 -54 49 -414 -55 -29 -117 149
6046 149 152 133 120 -15 -126 -109 -8 -47 -50 172 312 -53 -166 -29 106 4 -41 -154 176 -104 -122 186 -81
6069h1j4K43k08j3j15J24j17J40k7O1k58L27j19K66q6j49k9K36j00j38J98k20
6091g9J34l48Q2J27L53k93l3Q7O0j82O8j16M9J33L3k13K72m2q1j5J09j74K05J59
6115B95k81n3pL6j4N2J52q2j44P6K4l61L82O7k32J73j2Q0j99k4QK25q4k17K77
6140A37j14L7j44r7L4K41Rk09L08l08N3l6L6J18J36j81pJ57l60L52nJ07l38m8
6164a22J81K2K5p7L05n82K73J6m8rj18J33q9L4J2J19RL5k63J75O8j08m5J03k73
6189b24K32Q2m72N55j34j27oJ76j58m3K19K26k71k13K86m7j80M3P7k50K06jJ97
6212A73n14R7o8L66j75L4L26J6k08j87L7J0o7M22p3k55J06j22K4K35k19j5J55
6235I8L1k37K55j10j57O4M3J77m0j17L17l62J44j47o4K3K55l12J63j07nJ99o0
$$ plain form
6069 -81 -95 148 -60 -73 -188 -64 -181 -41 -68 -7 -265 62 -57 209 123 -26 -55 181 81 -57 141 -79
6091 -79 55 -293 -211 -84 269 -24 -57 30 90 -92 -24 -140 -91 42 75 -138 134 92 11 -4 105 -69 136 295
6115 295 14 -39 -46 -10 -24 28 180 98 -46 30 54 -307 75 142 -90 83 71 151 -48 -72 -64 161 77 -140 137
6140 137 23 60 -84 -181 -147 94 103 -106 202 -106 -53 -89 -53 65 201 20 13 170 -190 162 157 264 -74 -122
6164 -122 59 81 106 29 334 -248 25 41 -7 -16 -134 -1 -90 -56 -44 75 84 119 -144 31 99 -9 -54 49 -224
6189 -224 8 90 -382 173 39 -88 -94 82 -76 -119 100 326 55 -158 128 81 -99 -56 21 -229 -23 -24 173
6212 173 -341 -244 -312 54 -121 -87 239 255 47 -140 -103 -93 -160 262 189 -66 40 -82 -58 177 -42 -57 98
6235 98 129 -108 147 37 -120 -56 -13 164 124 7 324 -38 106 -41 -105 -82 173 -139 24 -83 -88 111 51
6258E1j52r4O4R3K35k38K66j00r9p0m7J0J74J0j40J36J81j64l4n3l3o0J4P8oP2
6284I4l8j11J45j9P7j52k54O8J59K15k69Q8Ok15r0L61o6p0n7K95p8p9J37k1M0
6309A66j10k29l3K30j92K30Pj5j97J08J76k75P4P3j3L9j22K72j72j06o9J97l2
6332GO3k2j27O1L4R0r8L8rk68J97J05j01J80j31k37K34k69K75j44N0N7p0j07m4
6357b36N08k32m3L7j8o9J60j78n6J52j30K38m9P9l12N9k27K81n4R4K62l70P2R9
6381F7j41p2p8q8L21J7j25ML50k85L3q4K56P4n04J12J25R1%l00J97R2j12J56K31
6406C37n28m1K06k06M72j13o8J28Ql02K94l5J74j52k26r9K62j78j06L72l72K53
6428H0j07m9k3J63q0l1N1P1j4j57K84k65mM4M0O0q4j05l54M69n7L00N2j90nj7
$$ plain form
6258 51 -101 -195 -131 -38 197 -41 225 125 26 -44 -91 -81 93 103 -37 99 280 116 82 29 -4 -64 -50 28 22 94
6284 94 56 -55 90 71 148 -4 -258 -190 -31 184 -85 3 9 -206 -296 65 -1 -71 -128 167 89 10 147 126 166
6309 166 56 -173 -206 24 -168 62 69 54 -143 -35 141 -134 -60 13 0 39 -83 189 17 -89 -158 39 7
6332 7 70 48 -79 -18 16 106 8 46 37 -231 -34 71 -30 150 19 -218 16 -253 22 -122 -72 -15 -85 -192 -236
6357 -236 272 40 -3 34 16 -53 107 -71 -127 25 -105 133 84 163 -149 -90 -317 -36 -90 4 266 -104 -32 67
6381 67 -74 -146 -224 -312 9 26 -99 -95 255 -30 3 -81 175 249 -255 -143 -18 73 73 -227 -30 62 -50 106 337
6406 337 -191 -232 -26 -232 240 127 59 187 195 -107 187 152 326 174 -52 -151 111 -67 -173 199 -173 80
6428 80 -27 -76 -99 64 -16 -47 4 75 61 -96 188 -77 -81 -37 3 63 -21 -126 -480 -11 -68 232 284 94 89 72
6454G2j58K4q4M33j98j19j75L06K9k89P5Q9j80L10k58L7QL6J08L45m25O7l07R3
6478a61L57j92P2k3K0k94J43K16l73L40j17j08J94j77K00j46J59j82K77j12l62
6499b69K08J03J57j18j3J20l47K39rp9K98k20j54K5L7P9j45K70m34J57O8j79L46
6522A40L5k59J11oJ36p2l39K29N7M7l08M3%j3L13j79j38L32o1j3l62M77j09n5
6546FN1p8j90K03K05l80K13j33j50M27q9J81k04l71N22j79lj01j01J55rJ65q9
6569E1k01L93k46p7M34l28m06M46K19m88O4J10j43P0R5O6m3Q3j42Q6O9j08j57
6592a53J72m0k3K28k32J61k03J69j66L20l10P7j24Q6j74M26n1l11Q2OK86k54j7
6615d5m9R4q1N9j69L66k26N3J51j48j70K51m8K0j5j95L77l33j2J88j06j54J21
$$ plain form
6454 72 -86 -62 -146 287 89 -30 -205 101 130 -159 -84 5 -175 135 -123 -86 -78 -42 66 411 -14 53 -254 -161
6478 -161 196 4 76 53 73 -221 -78 138 -235 105 -12 -120 74 -103 97 -49 110 -72 205 93 -269
6499 -269 -61 42 199 81 68 188 -159 80 71 -8 290 70 -84 -59 -22 57 -88 182 -252 -95 -27 -206 140
6522 140 175 -84 27 21 157 85 -254 -25 32 79 -229 -186 -186 -199 114 -65 -203 129 68 55 -307 170 61 6
6546 6 57 -21 -211 -8 197 -183 30 -103 -253 174 85 266 62 -309 213 34 31 -70 -171 -16 -25 140 51
6569 51 -150 243 -3 -80 354 26 -380 66 285 -203 -139 -29 -172 -102 -7 59 16 99 -43 43 112 4 -153
6592 -153 19 -21 -44 184 -48 113 -90 79 -87 233 -77 0 -124 -38 -212 214 163 -148 -66 -60 226 -28 -45
6615 -45 -94 0 -81 -22 -191 175 -51 2 153 5 -165 86 38 58 43 -152 225 -108 -120 68 -38 -192 -71
6638g1J39o3q9J56k9p2K01o5r2j06M6K5j49oK42K54n15N7J52j82J47j31J41Q9
6662G9o8j44R8j17M00m21l2K93l7J02k34j19L24m02J78J58n1j24K15r4J41m14
6684b69M69l24r8K82K54j71k30r8J05L08k41L30l32K65m46K29j02p3J16q2m05
6705e13M65K56m9J26m58M02k15k44K84O6l86L53O4r7k13J43j66L57k92L78l4l88
6727a61K05ol4J8Nj09k4K42l33K92k2P8j33j0K05l94K56j76o9R1j02K35J4J04
6751A72o7J99n60L21Rn6k30J96k36K40j17M55l43j16P7J07j71m8l4J36p6J01L1
6774a0k61K87J24j74J64j69J84J84l74m1L08o0k38M32l08m49M57k33N1L46j36
6795H4j46L1l0j60K49J8J7j46J85p0J98j45j50j7K15o6o6j79M06j89l03K60J65
$$ plain form
6638 -71 68 5 -84 72 43 -29 172 107 15 -91 -45 -20 -169 -175 67 321 -194 -137 15 -167 -20 -151 -10 79
6662 79 11 -133 -35 -152 248 -173 -205 88 51 153 -81 -200 124 -278 -100 58 7 -117 98 4 145 -269
6684 -269 200 -124 -222 60 314 143 -87 -185 -80 228 -13 317 -15 250 -196 33 -69 -142 -26 -108 -513
6705 -513 -48 208 159 285 -173 229 14 -230 54 120 -266 87 151 54 -159 -16 -182 175 -117 261 227 -161
6727 -161 44 38 4 22 27 -82 -106 136 -197 95 73 151 18 8 213 -181 75 -101 -170 -79 -181 54 68 172
6751 172 105 304 -256 65 74 18 -212 -16 -252 -12 -129 326 -17 -133 -56 51 -120 -168 -202 -66 -142 -41 -10
6774 -10 -271 16 140 -34 130 -39 145 329 -45 -86 222 162 -76 356 48 -401 56 -177 -126 220 84
6795 84 -62 -31 -61 -221 28 46 63 -83 102 32 230 85 -65 -82 133 67 1 -178 228 39 -264 -4 161
6818A61j15k18P4L1K6J16j43n3K12n6r2J21J10j92J1R1m8j9ml35K35L80j64j95
6842f6R2%m4p9jj87M59j47j08L02m34P1lK01K55k92k35L0J60r1M43m55R7o5R0
6867gq2J41r1k02M24j87j07p5K01P6K0k12rN3K00n3Q8j86K35k59j12J12N1R3j02
6892A0j64o8q4K52M8p9K53lk02j87J71K9RQ1l5j33J30J19j98J27j64n0J23N4m5
6917fP4k54J66k5j7l3K9O2L22l11j45L54O4j78J39k63L7R5L0l25Q8K88j28J3m14
6942c38L08j76L83k84M2K08l06L41PLj75N3j02J13k2J3j54J50q7J59j05J36o5
6965A02k45K10k8k9p1R1NK1p1J08k37m8Qn4o6M81l25K61N2k52K22j28j75K89q7
6990C4K3JO2M9k67j41K30j08j6K42l9N0k63J32rK9j95K87m9j24L3L1K2J04j0j56
$$ plain form
6818 161 46 -172 -98 -67 -41 75 -68 -121 91 35 -57 64 174 -18 -7 84 36 17 13 -322 -87 293 129 -66
6842 -66 26 26 -18 -97 -98 -285 174 27 -81 221 -213 -142 -145 56 311 19 -216 -186 -26 -117 326 -129 -32 -97 -7
6867 -7 -89 52 -39 -241 183 -4 -111 -186 15 91 111 -101 -110 -57 143 90 178 -8 227 -32 -144 -32 19 112 10
6892 10 -154 -222 -306 -54 -6 -85 168 165 -37 -224 -53 -24 -15 66 31 -102 28 147 -51 76 -88 -138 -15 39 -6
6917 -6 68 -186 -20 -45 -62 -95 -66 -4 318 7 -138 216 280 102 241 -22 15 110 140 -185 -97 191 63 76 -338
6942 -338 -30 -206 177 -107 -65 143 -163 178 185 188 13 66 -36 77 55 68 -86 64 -23 136 31 167 102
6965 102 -143 67 39 10 -61 30 35 56 -15 93 -144 -192 -184 -238 -304 177 -148 113 165 -87 135 7 -168 121 34
6990 34 57 58 120 169 -98 -239 -9 -117 -133 109 70 120 -143 -11 -20 9 -186 101 52 -72 -39 -8 14 118 108 -48
7016d8K54j45N7k83J32K69k36J35k38L20l13J7K08n6j30K4mK5j03K36l09K61k32
7039a59n2j18L15K27k62j6K8o8l4J3L17j59K3K61m49M2P7J31L7k49J90j90j41
7062b36L17k07j03L80j07j36j34K62k80M45K8j04m0jj41L58m64J11Q5P4M4O6m58
7085b41N55k5j59m12K67L1j30K50n45K31L88m21k3K29N6o8j22J51J20j33R7P9
7107A75j76k26K70j24J74J5j63j6P4N6j38J25P1j43j02N1j6jQ3j06K06j31l9J17
7131C6j01j64M73l52r0K01RJ56p4r5K06%j75j31L68j92j26p8J65J39j66oo4LK05
7156A47j79J49r0k46L66k28K37k38j70L93J2L1l73K83j59P6k00L66j69p5JO1P4
7179F9l20K23L45l00j8L04j55P1k01k4Q5N7k08J45k32OR5K39k27L9m7L6J12j80
$$ plain form
7016 -48 206 61 118 -165 -33 236 0 135 -103 217 -96 -79 129 73 -57 -33 -37 -12 -115 121 -188 73 -159
7039 -159 -211 -329 -14 213 -49 -65 -37 -105 -139 -126 191 32 55 316 -133 -91 -14 117 154 -95 95 -95 -236
7062 -236 81 -126 -229 151 44 -92 -226 36 -244 201 229 125 85 84 -57 301 -163 -52 33 107 151 217 -241
7085 -241 314 289 130 -282 -15 16 -114 136 -409 -178 210 -211 -234 -5 51 -17 -139 12 132 -1 96 175
7107 175 -1 -227 43 -81 93 108 -55 -71 3 59 -79 46 117 -26 -128 -77 -93 -94 -11 -117 89 -42 -81 36
7131 36 -65 -229 244 -108 -198 3 12 168 94 -1 205 205 30 -101 267 75 -51 -129 36 175 9 3 -61 -58 147
7156 147 -32 117 27 -219 147 -81 156 -82 -252 141 153 184 -189 94 -65 11 -189 177 8 -67 -66 -5 69
7179 69 -251 -28 317 17 -1 303 148 219 18 -6 79 136 -72 73 -159 -153 -58 181 -46 -7 -54 -18 94 -86
7203h6R8R6j04j4J20j20n8K5L11j61k0o2j18L90k92j58L04j18K37m26j12J67n4
7226a55J60O6M9j58J13J64k64P1L7k39K41Qj05K13j98j3j48M04k39k47J82k2M71
7249C91m36J45j85J09J9k76L02r5jK07m05J87m2J3K65r1j22pM6r1K43k59n5K79
7273A41k40j40K57k69l3L44L62k11k71m2o0j85M57k86j07jN40l06j33L00j53K35
7295A99m7J93j95J8J06j54j70L7M4J76l07L41k60M6K34k39j80M7J02J49l4j88
7317h2L94m91n5J39j29L89p4r8J00n01M45k02K58k31Q6P5P0m7J16J7l20K32p0
7340B1j12L3J82K15m62L21r9K7J05j34k16J08k7R6j05M9p3K5J57r5R7j47j49M46
7364B63o22M31j91L15k37O1J47o9k41L43m5j40o0j26J30q7n7J25J08J22m13Q1
$$ plain form
7203 -86 12 108 4 -10 110 -10 -68 -43 268 107 87 25 -93 297 5 -153 151 33 270 -156 -268 -101 -155
7226 -155 5 71 120 -38 75 239 -25 46 83 -156 85 93 -12 201 3 -10 -158 246 7 -240 -58 -80 391
7249 391 -45 100 -85 24 43 -233 69 -26 -27 180 -225 -38 -80 -67 198 107 -15 -22 24 -67 176 -83 -138 141
7273 141 -99 -239 18 -251 -284 60 422 211 -60 -102 -162 -347 110 -176 -283 -284 256 -50 -183 117 -36 199
7295 199 152 345 150 168 274 120 -50 -13 31 207 -100 241 -19 27 261 22 -158 -111 -9 140 106 -82
7317 -82 312 -179 -234 -95 -224 165 91 -7 93 -408 37 -165 93 -138 -52 23 93 46 162 179 -141 91 21
7340 21 -91 -58 124 339 -123 198 99 126 231 97 -119 -11 -38 58 -47 2 -71 -46 111 16 113 -34 -183 263
7364 263 -359 72 -119 196 -41 20 167 98 -143 200 155 15 -45 -171 -41 -128 -185 -60 48 170 -243 -162
7386a62%J68Q0J20j28q3Q5L0l22J17K52j08k16k9J94J50j96o7k1K20k01R6M5J8
7410D2J6k09J92n9j92J26K24k05M21m77N1O0L49k15l32K16k47J00L9J94j3j03
7432b2J33l6j10K1k00M29k05J2m8q7N5k3J35J77j81k62Q1N5J58k90K40J1r9k8
7456h4J16K59l37L14o22K99J90k00R1J59j23j92J44p2P7M0J06j38k7J42r8qk97
7479b61K22M8k05J84j77M04k66L53l87P0K10k15Q1P2k2k35J84P8j43L0O6j29p3
7502a11j83K40j2N3j30n0L25k65J75n5Q2K9N1r5j23j23K16n3j62J17J36n7M8r9
7526d6K1J85l9r3Jk38J64j05P9r6J94J32k63j28P0K38k02P8J41qk83K56N5j69
7550e6j05J32L78k61j18J17q8j14K96l61M54j72P9l02L6j65M17j36j96J79m6k5
$$ plain form
7386 -162 -162 6 86 206 78 -5 80 110 -212 -95 157 49 -167 -196 -2 148 -48 -115 -136 84 -117 -21 24 42
7410 42 58 -151 41 -18 -210 -84 140 -65 356 -121 -70 -10 339 124 -208 8 -239 -139 -100 94 81 -22
7432 -22 111 75 -35 -14 -214 215 10 22 -26 -113 -58 -81 54 231 50 -212 -131 -76 82 -208 32 43 -56 -84
7456 -84 32 291 -46 268 -354 -55 135 -65 26 185 62 -130 14 -58 19 59 165 27 0 142 44 36 -261
7479 -261 -39 9 -196 -12 -189 215 -51 302 -85 -15 195 -20 61 133 111 -124 60 138 -5 25 91 -38 -111
7502 -111 -294 -54 -66 -13 -143 -193 132 -133 42 -13 69 98 149 54 -69 -192 24 -29 -191 -74 62 5 53 -46
7526 -46 -25 160 121 28 29 -209 -45 -150 -71 -167 27 159 -104 -232 -162 76 -126 -48 93 85 -198 58 113 -56
7550 -56 -161 -29 349 88 -30 87 -1 -115 181 -180 274 102 181 -121 -85 -250 167 31 -165 14 -32 -57
7572e7L32k27rj81J76K69k86J28k91J51M1j51N4K2j07P8j42J20j21K46R6j81P7
7595C7P6j60R5j42Ql29M01J19q4J28l26K61j08n4j73K74j82M04k29k39L16J8l76
7618b65L60pK26J1l30J24r7j94L40k54L00k26K6m4j57K09R4q1j82J19j23j08K8
7641b31L65l33K53j64j09K25K61l8j83N5J61j22l7l42J26J49O5k34L68j86m4j2
7663gL9Q0J63L0l50K87m16l2q1J56j14K36J43Lj56j33j20M94k70O8R8j16J4J57
7687A73j24q2K33j28L5J52l54j0N9R4K95m67L8o2R1J08n5k13k49K64K11j21L57
7710B45m09J32Q8n0J8j65K1J14Q1J24j98K6J72l23K56j49P9q1Q7m7J54k42J37
7733G0o3j16j77L35L7Q2Q0j67p8p2L33r8r2l36L47l12K33K16k10l68O32j01R5
$$ plain form
7572 -57 275 48 39 -142 34 303 17 145 -146 5 46 -105 -51 -29 -136 -58 -200 -80 -201 45 141 -40 37
7595 37 113 -47 48 -94 -86 -415 -14 105 21 149 -177 84 -24 -78 -251 23 -159 245 16 -223 93 111 -265
7618 -265 95 88 314 325 -5 119 22 -172 168 -86 214 -12 14 -30 -187 22 116 35 -147 -28 -151 -259 -231
7641 -231 134 -199 54 -110 -219 6 267 229 46 101 262 140 103 -239 -113 36 101 -133 235 49 5 -7
7663 -7 32 112 275 305 -45 242 -174 -206 -287 -131 -245 -9 134 137 -19 -152 -272 222 -48 20 118 2 16 173
7687 173 49 -33 200 72 107 259 -95 -105 -46 48 343 -124 -86 -148 -57 51 -4 -217 -466 -202 9 -112 245
7710 245 -164 -32 56 6 24 -141 -120 -6 75 199 1 27 199 -124 132 -17 62 -19 68 21 175 -67 70
7733 70 7 -109 -286 49 86 168 248 81 3 -69 264 166 74 -262 85 -227 6 222 12 -356 276 175 270
7756B70k76o5l48N39R8k92L68m45o6j7K34j1N7k22K74R1j53J39m46P7L05j18J36
7779A29k30J29k61L06k3J5n7m1J21n3J85k32m8J78j90J96m07J95RJ46j73q5K77
7802H6qk62K17J6j94M4J63l7J96l52J58p8j46K65j7j92J9L62m29J66K39n7l86
7825b27K21K13k23K21j99k88K10OO0j85J29J86j60p9J83J53j38J20j2k06K05p5
7847A15k63L29Q6k65K56l32k1J20J17j34J08j3j09j84K71K90l72L05k82M9j40
7868f9P8m0R6J79k36J01k44K24N5l19J39J72k0j10j49J06l2J07j25K44o6k90J14
7891h5J74J07j13k9j71K61K27m51N9k1O4n2K54m2k40P7q7J61j22l0j13K67R4j38
7915E1k20J86p7N0K71j81j61j1jM5K92l51K25k79K96p1p6l63K16O18o18L6J31
$$ plain form
7756 270 -6 -71 -419 120 218 -74 294 -151 -217 -234 0 -11 46 -176 98 189 36 175 -271 -194 111 -7 129
7779 129 -101 28 -233 73 50 65 8 -33 88 35 220 -12 -60 118 -72 124 -283 -88 -79 67 -106 -191 86
7802 86 78 -184 33 49 -145 -101 62 25 221 -131 27 -51 -197 68 51 -141 -122 240 -189 -23 216 159 -227
7825 -227 -6 207 -16 205 6 -282 -72 -66 -6 -191 -62 124 -36 -115 68 221 83 203 191 -15 190 115
7847 115 -148 181 267 2 258 -74 -95 25 142 8 116 103 -6 -190 81 371 -1 304 22 71 -69
7868 -69 9 -31 65 244 8 109 -135 89 144 -175 -36 136 116 6 -143 -37 -69 38 -87 157 91 -199 -85
7891 -85 89 196 83 54 -117 144 371 -80 -21 -42 22 -30 224 182 -58 19 -68 93 -29 -59 -172 95 189 51
7915 51 -169 17 -60 -10 261 80 -81 -92 -93 -48 244 -107 118 -161 135 64 -12 -375 -159 459 -159 -123 8
7938HJ17J31m42K87K04j55P1k30J81m64K06j49K02K1J6p7O7K24l42L8N1J55k41
7961a21Q5m5m0J48P1q2j90J33O1j29P7J13J54l14P9Q8J80j53j76j98R5L30k60
7984i4J95l09O67n91J20N0k59K10K08j70j88J71j67N5Kk2K01l32M14j63j12K30
8006A16K4l2j47J45j02RQ1j73K24j08p2O3K97n87L58k34K01j52J81j41J08j49
8028i0NL73m50K29l3j52N2K19J55l13J57j19j87P1K32K4n08J58m7K37k61J33L37
8051B22m3j47j21Q6R9O7l0k04j08N07l28M4o5J9J41l39K46j88n6K22k25J78J96
8074A73o1M3j73j20J67j92PJ37M8P2j82J14k21K27j70J73J95o7j68K90nj55k35
8097a03L84k47j86J91J96o5l02J23K08k3j45K24l65J39o3j11J62p8n6m4J85k79
$$ plain form
7938 8 125 256 -186 101 305 150 221 -9 172 -292 -86 -235 -33 -12 4 -73 -6 218 -124 -86 -35 120 -121
7961 -121 -36 -81 -121 27 98 16 -174 -41 20 -109 -32 81 235 -79 0 88 268 115 -61 -259 -164 166 -94
7984 -94 101 -208 459 -132 -12 38 -221 -11 197 27 -161 10 -157 -102 -100 -122 79 -253 161 -2 -114 116
8006 116 140 108 -39 106 4 13 94 -79 145 37 -35 28 325 -262 96 -138 63 -89 92 -49 59 -90
8028 -90 -85 288 -162 67 34 -118 -66 153 308 -5 152 33 -154 -83 149 173 -335 -177 -224 13 -248 -115 222
8051 222 179 32 -89 -3 96 163 133 -71 -179 328 0 44 -21 -2 139 -200 46 -142 -198 24 -201 -23 173
8074 173 112 155 -18 -138 29 -163 -156 -19 29 101 -81 33 -188 39 -131 42 237 170 2 292 287 132 -103
8097 -103 281 34 -152 39 235 170 -132 -9 199 176 31 255 -110 29 -34 -145 17 -61 -117 -161 24 -255
8119b55L74j83K27l63o1J22J04nK33j20K3o9j87o3J23M48m06q4N9j04J10Op3J47
8143Cm7M95l71j79L60k44J94k42J55j63j53L4K18r4k17L92k52K3j94J89K29j26
8165A0O2m5J5p6m1N0j01K47m13K33K94k27Q4j46Nj57K72J05M2j77P9n0Nj28O4
$$ plain form
8119 -255 119 -64 163 -200 -261 -139 -35 -40 193 73 96 27 -160 -223 -100 348 -58 -142 -83 -187 -77 -71 -144 3
8143 3 -44 451 80 -99 261 17 211 -31 124 -39 -192 -158 60 -34 -251 141 -111 -88 -282 -93 136 10
8165 10 72 27 42 -34 -75 -25 -126 121 -292 -59 235 8 92 -54 -49 -206 66 171 213 36 115 65 70 -58 6
8190Fn4
8191d8
$$ Imaginary data points
##PAGE= N=2
##DATA TABLE= (X++(I..I)), XYDATA
0@%%%%%%%%%%%qJ6j6J6k4L2m0M8n6O6p4Q8j09J33j52J76k08K40k74L14l59M09
33B18m64N23n91O66p46Q34r32J039j157J285j423J576j741J922k122K339k578
50a352K840l126L446l801M195m641N146n719O380p157Q082r201J0591j2373J4749
65H059j8095K3200l2048N1691j77789N2817J68266k17759R2088J30982r7648m0927
77e7163J64030k6068o0662Q4703q248j51293M9760R2359p6519l4251P2128o4552
89a5776p1009N1124J1562m7653L2681K4962k7695R757M3298R110K3347L3247j6605
102F0350k5641J9141n308l4595j3376k2609k8112J1859o017j9736L3941K1863
114h240k9346J7786N2005p560j4089L3974m761m7621K0193M2413l6948k5947L2454
$$ plain form
0 0 0 0 0 0 0 0 0 0 0 0 0 -8 8 -8 8 -16 16 -24 24 -32 34 -40 48 -61 72 -80 96 -112 128 -146 168 -191 218
33 218 -246 277 -314 352 -394 440 -492 547 -610 675 -748 828 -913 1009 -1113 1226 -1352
50 -1352 1488 -1638 1808 -1993 2202 -2439 2707 -3012 3368 -3789 4293 -4908 5683 -6690 8059
65 8059 -10036 13164 -18884 32807 -144982 -92165 76101 -141658 -49570 81412 -16236 -57163
77 -57163 106867 80799 20137 104840 96592 -54701 -4941 87418 10899 -23352 48776 -15776
89 -15776 -86785 -35661 -24099 -71752 -39071 -14109 -41804 -32047 11251 20361 43708 76955 60350
102 60350 34709 53850 48542 13947 571 -22038 -50150 -38291 -44308 -64044 -30103 -8240
114 -8240 -37586 -19800 32205 24645 10556 44530 39769 -7852 12341 54754 17806 -8141 24313
127B4313j7678m0802K2173J2608l3423J66J5706k7796q675N2255K2586k5068J8939
140A5304L3601k5626r545L7051p066l7304J81p094l7834j947K9499p251j7809
153c5840K0731J0413j8774J8014L2858j2203j1188J7216m720j6201R410J1500
165B1216r534q498K833m749r697J495l351j2085M40N304Q12N502O900N348O026
180G962K884R759J1536q185r803k92j4258j5271P941P282j6123q208J3121k867
194a4522r505K5247J9400j8433o38J5245j5637p048K4994K809k0987J551P341
207I817j5843n324J9418k351k1432K823L303j2482Q019J7226m255j301J0654O90
221H962j737J0744N852j1335r901J910o941j0270O208L513j1808k643P833L202
$$ plain form
127 24313 6635 -34167 -11994 614 -32809 -32643 -16937 -44733 -53408 -1153 21433 -3635 15304
140 15304 48905 23279 13734 50785 43719 6415 6596 -498 -38332 -40279 -10780 -18031 -35840
153 -35840 -15109 -4696 -23470 -5456 27402 15199 4011 21227 16507 306 9716 21216
165 21216 11682 3184 6017 1268 -8429 -6934 -10285 -22370 -21930 -16626 -15814 -10312 -3412 1936 7962
180 7962 10846 20605 32141 23956 14153 13861 -397 -15668 -7727 -445 -16568 -24776 -11655 -14522
194 -14522 -24027 1220 20620 2187 1549 16794 1157 -5891 19103 21912 925 2476 9817
207 9817 -6026 -11350 8068 5717 -15715 -12892 -9589 -22071 -14052 3174 -1081 -2382 8272 8962
221 8962 7225 17969 23821 12486 2585 4495 -2446 -12716 -6508 -2995 -14803 -17446 -9613 -6411
235f411O99P654P441m593p046P664N358n882K498M854r225o616N993K532o551
250a631k818K511q026q030Q663P081n670L113P479k710J713J0476L858m175k223
265I611j761p953l764N742k240q663Q50O66o540M756J0915M83l785L056J288m166
281a505K180J0185j148p680K807M82p097K746N436m766o605l9j246m864K228P564
297a322j652l242P136L373l499N629M999m778k519J414k300m744M49J346n269
312d979l032N515k29l466M663K507m485L56N309N05k603K142L186l966j380N517
328E560j39n021R20K36m976r98K273o74k458P39K473p13J250N031j01k285K857
345C974L03l596J629J527l294k706J475M51k696J361L486l643k449M326j79k854
$$ plain form
235 -6411 -5712 1942 9383 4790 -2256 5408 10766 4884 7382 12236 3011 -3605 2388 4920 -1631
250 -1631 -4449 -1938 -9964 -17994 -9331 -2250 -7920 -4807 2672 -38 1675 12151 16009 11834 9611
265 9611 7850 -103 -3867 1875 -365 -9028 -8178 -7512 -14052 -9296 1619 2102 -1683 1373 2661 -1505
281 -1505 675 10860 9712 2032 4839 5321 -1776 970 6406 1640 -4965 -5004 -6250 -11114 -8886 -1322
297 -1322 -2974 -6216 920 4293 794 6423 11422 6644 4125 5539 3239 -1505 -1056 290 -4979
312 -4979 -8011 -2496 -2725 -6191 -1528 979 -3506 -3150 2159 2664 61 2203 5389 1423 43 5560
328 5560 5421 400 1320 1556 -3420 -4418 -2145 -2819 -5277 -4538 -2065 -2778 -1528 3503 3402 1117 3974
345 3974 4277 681 2310 3837 543 -2163 -688 -237 -2933 -1572 1914 -1729 -4178 148 -31 -2885
361b885L203K276l410j126L945J082k395J054K877l906k826L474n23l393J007
376a546J130k530o60L042J871j563K31J821j617o75L056n16k223P99n58j838Q78
393h98K403K4k285J2R25k570P88L969k262j881J898l09j925K808K726k026k128
410g31J067K07k190J356K917l009j945J944j38j202K335J581j344j752O59Q26
426E81r22J116Q03k083j200J417M3k19J477J27j817p67J088J172j332J063R61
443A508k363p54K394K16o03J022j62k337o18J917M40j818J064O74k764N33K899
460A248p98m96J304q50j220Q49J218n45r86P47m57j678J509J339j541j44R33j436
478a004l58J238P40p79m88R92j00j132J849J212j642m97O88o06o50M35P04j139
$$ plain form
361 -2885 318 2594 -816 -1942 2003 3085 690 1744 4621 715 -2111 1363 840 -2553 -1546
376 -1546 -416 -2946 -3606 -564 1307 -256 -25 1796 179 -496 2560 2044 -179 620 62 -1776 -898
393 -898 1505 1529 -756 -744 181 -2389 -1601 2368 106 -1775 123 -186 -2111 697 3423 1397 -731
410 -731 336 543 -1647 -291 2626 -383 -2328 -384 -522 -1724 611 2192 848 -904 -245 581
426 581 -341 775 1578 -505 -1705 -288 -245 -464 1013 1140 -677 -1444 -356 816 -516 547 1508
443 1508 -855 -1609 785 1001 398 1420 1258 -1079 -1697 220 660 -1158 -94 580 -2184 -1651 1248
460 1248 450 -46 1258 408 -812 37 1255 710 -276 471 14 -1664 -155 1184 -357 -501 432 -1004
478 -1004 -1362 -124 616 -163 -651 341 241 -891 958 2170 528 31 719 113 -537 -102 602 -537
496e37r44R74L74j271J005J467j414k51J203k65n85Q41L11p93k97J145k38o20
514A05P15j93j319J39N46q28j07N42j47m45Q96P30m12j66J087k27q30P09N12j369
534f2l5K71n60l19L92N98r48n04R27M38q05L87P30j008J36P83K78j57J74N34r27
555C23o97R59l12r31O20j0j227K52O65l09K56N23J00o68K49J237m85k29R37n30
575G23j067N45O70o12m99L21n43l71K91P70l48o26O60l38l92J171P57n96j45K68
595F39k08jK50L43p73m47q3j41m05P92K6m73qJ99MQ5P05J82o75k06O00k60j49
618dR36j62j116j09M82j26K0p8J91n82m05N05O20r2L52O6o00r0L47K43J60Qk45
641C21q44J74L96k52l3M26o07l29P04m3J1O6M11m24l44K81Q53m94j75K04n96o4
$$ plain form
496 -537 -1481 -507 -133 -1404 -399 1068 -346 -597 606 341 -244 597 908 115 -182 963 725 105
514 105 820 627 -692 -553 -7 -835 -942 -400 -547 -992 -96 634 222 56 1143 916 86 795 1307 -62
534 -62 -97 174 -386 -705 -313 285 -663 -1167 -240 198 -607 -220 510 -498 -362 421 699 542 716 1250 323
555 323 -374 585 273 -658 -38 -48 -1275 -1023 -358 -667 -411 112 212 -456 -207 1030 545 316 1253 723
575 723 -344 201 871 259 -240 81 -462 -833 -542 228 -120 -746 -86 -424 -816 355 1112 516 371 639
595 639 431 430 680 1023 250 -197 -280 -421 -826 -34 -8 -481 -489 -290 -286 -201 504 686 11 -195 405 145 -4
618 -4 932 770 -346 -455 27 -99 -79 -157 34 -548 -953 -448 172 80 432 498 -102 -192 155 398 558 566 321
641 321 -523 -349 47 -205 -238 188 -419 -748 -44 -87 -76 -10 401 -23 -367 -86 767 273 98 302 -294 -358
663c58L49l5l06L25j07r5N2J61L33j79j93N18l58l70L86J79j20n25L65L14m20
684h4L71K92o88k39N84m82K27J92P1m34J62N9j52Q2K87j32k64P8K1n05L55K67
706F8l08j77N73n9k95L14L08j37m34L45K75n82p1J92k34J25J57m6k10j5j46K39
728a18k43M92N5l25J05K50k10R7L91k10j29r6J46j19r2L62n75l51k1N10n7q3K15
751fj02J52J29L73j79p6j62j88m5Q2J36j49J28rl54l6J53M3K46k38J79l60J40
774a43M12J2m0M9J7k54NN53l60l09q7k80J19k06N81k08j60L79l88L24q8K24J40
797B92k8p6j43j69L80j5o3m73k2M31k51jJ60j43l58N1J10L94%L80m25m8q3J8L46
822B64M8k90j5K6m7J1j73k3M05k39p3j32R9Q7J8K86k55j46M09p7l75M15R9l88
$$ plain form
663 -358 -9 -44 -350 -25 -132 -227 -175 -14 319 140 -53 465 107 -263 123 302 182 -343 22 336 -84
684 -84 287 579 -109 -348 236 -246 -19 173 244 -190 -28 31 -121 -39 248 116 -148 -70 -49 -554 -199 68
706 68 -240 -417 156 97 -198 116 424 287 -147 198 473 -109 -180 12 -222 -97 60 14 -196 -211 -357 -118
728 -118 -361 131 186 -139 -34 216 6 103 494 284 155 59 205 86 -6 356 -219 -570 -591 -81 -138 -221 -6
751 -6 -108 44 173 546 367 291 129 -59 -104 -22 114 -35 93 84 -270 -306 -153 -110 136 -102 77 -283 -143
774 -143 269 281 241 290 307 53 58 611 251 -58 -145 -425 -306 -512 69 -139 -299 80 -308 16 -72 152 292
797 292 264 188 45 -124 256 241 178 -295 -317 114 -137 -138 22 -121 -479 -428 -318 76 76 456 31 -17 -100 -82 264
822 264 312 22 7 33 -14 -3 -176 -199 206 -33 -106 -238 -139 -52 -34 252 -3 -149 260 183 -192 223 322 -66
846f6J64O0j12l09M9K57k41j1L2R7j11K88k22J79j12K80J43n41K87P3n75L60J45
869A14j78k2M1j06k44L06J56n0r2j22L94l04Q5O6j21MJ49o2k02J25J99k72Q0j7
893g3j31K12l15L46p6n3l0J86l16m0M44j13j39J96Q4k02l9K40l47K14j91K84m04
916b63K56R9j38oQ8j65j20L17k25L6J75Q1j88ok12K71k86M06J03l40M7r5J95j20
940i0J84l5k65L77j39M4k56N72l34m5k30J49K41j83o2q8K02K7J77l57K16j99J82
963H8l09L45J14l55J26r3Q4o2j6O3R5j64j18L98j68J7R1j77N7K31j8q3q1n1L44
988C58n27K24j7m03K40K39p2l28M41j21l07L13J8j15j12K73q1J86k72L3PJ5j45
1011a53O3N4Qj4r5Q1M2J67m1j1j70j11N3j36L77J3J28k39L5j28J76j43M9j16q
$$ plain form
846 -66 98 158 46 -263 -214 43 -198 -209 -177 -80 -191 97 -125 54 -58 222 365 -176 111 184 -391 -31 114
869 114 -64 -86 -45 -151 -395 -89 67 17 -75 -197 197 -107 -22 44 -77 -73 76 14 -188 -63 136 -136 -56 -73
893 -73 -204 8 -307 39 -37 -90 -120 66 -250 -290 154 41 -98 98 182 -20 -59 181 -166 48 -143 141 -263
916 -263 -7 92 -46 -52 36 -129 -249 68 -157 -121 54 135 -53 -59 -271 0 -286 120 223 -117 -70 -165 30 -90
940 -90 94 59 -206 171 32 76 -180 392 58 13 -217 -68 173 -10 -72 -160 42 69 246 -111 105 -94 88
963 88 -221 124 238 -117 9 -84 0 -62 -78 -15 80 -84 -202 196 28 45 136 -41 16 247 229 146 65 14 358
988 358 -169 55 38 -365 -125 114 42 -286 155 34 -273 40 58 -57 -169 104 23 209 -63 -30 -23 -8 -153
1011 -153 -90 -36 -28 -42 -137 -56 -14 153 112 101 -69 -180 -127 -263 114 127 255 16 51 -77 99 -44 5 -111 -119
1036a19J23k58J13J00j6K9p5J73R1q4K77j86R9l06o8K74Q3k21J5j88J94l11K44
1059a7PkK3j8P4%j86J03J34k44J57o1p5J46j2j77K32j81j79L13j29K01J66m10
1083a35Q8k48N9L68j13N2o0J68k14J99k44M5R4o5j65P9m3K44K3j04j13J32l8l81
1107c72K07L65r0j32J09k25r8j59K90K87L0k89k74N12J50l45lJ59k4m29J72l5
1129a94K69J13O0k94j91L54Q3k44q3M8J08j17J73k33K04j7j11L5N6Qn4r9L47j22
1153I9j98J86j62k0j18l0L76Q6j94O7k40K19j91N9M8O3N3k56L9O1j27j00j57K86
1177a51L40l86PK40O1j61N9O8k23M11j02O5l62M30j55k85M18m0j96j4O1m9j8L2
1201E0j18J11j4J34o1mn6n6Q6p6p9K69j12j86KJ33k2M2j69j19K09J70j64J10j14
$$ plain form
1036 -119 4 -254 -141 -41 -57 -28 -103 70 161 77 354 168 267 -39 -107 167 250 29 44 -144 50 -261 -17
1059 -17 -10 -12 11 -7 67 67 -119 -16 118 -126 31 -30 -105 41 29 -148 84 -97 -276 37 -92 109 275 -135
1083 -135 -47 -295 -236 132 19 71 11 179 -35 164 -80 -35 59 -6 -171 -92 -135 109 132 28 -85 47 9 -372
1107 -372 -165 200 110 -22 87 -138 -236 -395 -105 182 212 -77 -351 161 311 -34 -37 122 98 -331 -159 -194
1129 -194 75 188 248 -46 -237 117 200 -44 -127 -79 29 -88 85 -148 56 39 -72 -37 19 27 -27 -126 221 99
1153 99 -99 87 -75 -95 -213 -243 133 219 25 92 -148 71 -120 -61 -13 50 103 -153 -114 -53 -180 -280 -437 -151
1177 -151 189 -197 -190 50 111 -50 9 77 -146 265 163 228 -134 296 141 -144 274 234 38 24 85 36 18 50
1201 50 -68 43 29 163 102 98 42 -14 72 -4 -83 186 74 -112 -110 23 1 43 -126 -245 -36 134 -30 80 -34
1226c4m2J54q0MK90j83j08M2j9K27m5n4m32J57J73Q6l22L21n3P2o4L4j38J34l67
1251b47L52k23J00J16k63N09n28j04L21o7%l36K42L26k12k2L7J45k99J71P9j20
1273b3j6Q0k77M74l69J28L70l86j43J55M7N9j0l11J06kj7K35J28j41j71L28j02
1296A42r7j28L17k08O4P7J40m62Q5R7l00L05K39m13R8Q9J2M9l71p3K57nJ23J03
1320A40K60m21Q0j29L3J54j23k08L26M7k87k9M38j94m2K7n4k26J64L46k95R7Q5
1343A89l30J41k51K72O7k95K10j30m1J66Km9K17k29K44j82K0J85r0R4o2k00L10
1366B58l00J2J17j79J23J0J11l47L83r9j37J06l6Q0J10k66O5p6K71m19L06l24
1388b31K44j80L57j93J64k78Q1n7J37J56k57p7M9K9J5L04l35J40j08L1mk5K62
$$ plain form
1226 -34 -76 78 -2 2 292 109 1 43 24 251 206 152 -280 -123 50 136 -186 135 82 154 90 124 -14 120 -247
1251 -247 105 -118 -18 98 -165 344 -184 -288 33 -34 -34 -370 -128 198 -14 -36 1 146 -153 18 97 -23
1273 -23 -39 41 -236 238 -131 -3 367 -19 -162 -7 40 99 89 -222 -116 -118 -135 100 228 87 -84 244 142
1296 142 45 -83 234 26 90 167 307 -155 -70 27 -273 32 271 -142 -44 45 57 106 -265 -338 -81 -86 37 140
1320 140 400 -21 59 -70 -37 117 -6 -214 112 159 -128 -157 281 87 45 72 18 -208 -44 302 7 104 189
1343 189 -141 0 -251 21 88 -207 3 -127 -168 -2 0 -49 168 -61 183 1 21 206 116 210 148 -52 258
1366 258 -42 -30 87 -92 31 41 152 -195 188 89 -48 58 22 102 212 -54 11 -65 206 -213 93 -231
1388 -231 13 -167 190 -3 161 -117 -36 -93 44 200 -57 -134 -85 -56 -41 263 -72 68 -40 -9 -13 -38 224
1411B24k02j08K45l79J69J10o9j61K86P0o9q1M79p64L75l60K84O7r3J17k86K06
1433F0j85j86K60R1P8J54k49m7l56J87J86j12R8J41k83j43K31k3P7L9m3l2J3J65
1457A21k00J41o6K78o4m48j40M13j06K57q5j08Lm8K38k96J54k22K59m6O4M0l04
1480a65L42j51k3Po7J93K40n13O2j10l0J92L10j68j25O3j7J19N1k60l4J25M4j72
1504h7o4J08j42l4J98J76j27j01J82N5n6l23n5K33k7K16j02K34l57O7K22o6j21
1527B9k32K19j62L72j77L3p1j31k08L14j37J12J87k83LM6mJ68P5j54K9r9j52J38
1551h5J21k4j41L89k37j14R7J43q7Mj26j46K93J57oj32m2lj76L44k28J16j83K00
1575A34j8k73j02K42M7j30L51k33P5l46M43j42L0j39j4J30J03k76J55m0L7j31
$$ plain form
1411 224 22 -86 159 -220 -51 59 -10 -171 115 185 116 35 514 -250 125 -235 49 116 23 140 -146 60
1433 60 -125 -311 -51 40 118 272 23 -24 -380 -193 -7 -119 -21 120 -163 -306 -75 -98 -21 18 -25 -57 -44 121
1457 121 -79 62 -4 274 210 -238 -378 35 -71 186 101 -7 -4 -52 186 -110 44 -178 81 35 99 139 -165
1480 -165 177 26 3 10 -57 136 376 -137 -75 -185 -215 -23 287 119 -6 57 40 159 210 -50 -84 41 85 -87
1504 -87 -151 -43 -185 -219 -21 155 28 -73 109 164 108 -215 -270 -37 -64 152 50 284 -73 -6 216 150 29
1527 29 -203 16 -146 226 49 82 11 -120 -328 -14 -151 -39 148 -135 -132 -86 -90 78 153 -1 28 -71 -223 -85
1551 -85 36 12 -129 260 23 -91 6 149 62 66 -60 -206 87 244 238 106 64 61 -115 229 1 117 -66 134
1575 134 116 -157 -259 -17 30 -100 251 18 93 -253 190 48 78 -61 -75 55 158 -118 37 -3 34 -97
1597i7p6K17M0j66K81m24M15q4k99K49j35j5K14j76q4L3J78j89J13j04K67k23
1619f5K35j60PQ4j52kJ49J56m17L48l10J89j77J83j68K02N3k77K90l96K36J33
1641A41l7m6j65J55J53k99K03q5R8n50P92m10l63M65k07P6j36J70L01Ol45oP1
1664a8J49j33N1J53j22jO7k30J12p9K17k07p1j36K59J47J02l39M09o8j56P1k19
1687d2j8O5J29n2j42o2J58j61L91j80J23q1l9q8n6j39nL52lj91j27l0M14m19K98
1712I5j98Q9K19j75j53l5J79j72J77q2J20N5k52L8j11J38L25k2k11l01N01j59
1734F5j22J90j01K7m7p6M8j00J33L77k99mJr2o4Q3LR3k88J81j13J89O5o5p2k8
1760a6P4j30J02l5J07j59M8M5j25K95k45O5j2j76J7K37j14M7P1m51M80o5l1k01
$$ plain form
1597 -97 -173 44 84 -82 199 -225 190 106 -193 56 -79 -94 120 -56 -140 -107 71 -118 -5 -109 158 -65
1619 -65 170 10 17 101 -51 -53 96 252 -165 183 -127 62 -115 68 -100 102 155 -122 168 -228 8 141
1641 141 104 58 -107 48 201 -98 105 20 118 -432 360 -50 -413 52 -155 -79 -215 -45 256 262 -83 -89 -18
1664 -18 131 -2 49 202 80 79 146 -84 28 -51 166 -41 -112 -248 11 158 260 -79 330 262 106 177 -42
1687 -42 -60 5 134 82 -60 -122 36 -125 266 86 209 128 89 1 -55 -194 -199 153 150 -41 -168 -198 216 -203 95
1712 95 -103 -14 205 30 -123 -158 21 -151 26 -56 64 119 -133 -95 -206 -68 257 235 24 -277 224 65
1734 65 -57 133 32 59 12 -64 -16 -116 17 394 95 91 92 0 -64 19 22 115 -173 8 -105 84 149 84 12 -16
1760 -16 58 -72 30 -5 102 -57 -9 36 -89 206 -39 26 14 -162 -145 92 -22 25 96 -355 125 60 29 -172
1784a72K58j41K19j87n0J08J9j65O6j62R0K4k42K66K4k1J8q6J69P1j72pK6n2N5
1809d4R0q6J27J92k29j15MJ69j82J17q6k0j29q7L42J00j32j01k89L88k40K57k49
1832b03J15rK11J79l91J03O2k9M1n8L6L6k79K61p3J6K69k93P5J78k96K14k21J52
1856I6l12O5K05J17k43J00j44J07j59L16j10m2n6k9o7J97l2J93j93j36L17k64
1878g4M5J65k03J94j31kK1R0kk31P9k46J03J00j5l8K87j39J04k40O5r8L85k03
1902A6k8K19l26K76j95J04k88K96P7P7k60K28n0k37J45j67jK72k16K10l35K85
1924A02r0J68j7k22K92k55J0J16j72L21m71N99l92J6p0j26M80k72K0k67K50J80
1946B00k15J35k42L04k24K02k94l5J31j05j8J51J37J31j36k49J09r1M10m33L9
$$ plain form
1784 -172 86 -55 164 -23 -73 35 54 -111 -45 -207 -117 -93 -335 -69 -45 -66 -48 -134 35 106 -66 -73 -47 -99 -44
1809 -44 46 -40 87 279 50 -65 -61 108 -74 43 -43 -63 -192 -279 63 163 31 -70 -359 29 -211 46 -203
1832 -203 -88 -97 114 293 -98 5 67 38 79 21 57 93 -186 75 2 18 287 -6 69 247 -49 165 -56 96
1856 96 -216 -151 54 171 -72 28 -116 -9 -168 148 38 -4 -60 -89 -156 41 9 202 9 -127 190 -74
1878 -74 -29 136 -67 127 -4 -6 15 105 103 -128 -49 -295 -192 -92 -107 -145 142 3 107 -133 -68 -166 219 16
1902 16 -12 207 -119 157 -38 66 -222 74 151 228 -32 196 146 -91 54 -113 -114 158 -58 152 -183 102
1924 102 12 180 163 -59 233 -22 -12 104 -68 253 -218 381 -11 5 -65 -191 289 17 37 -230 20 200
1946 200 -15 120 -122 182 -42 160 -134 -169 -38 -143 -161 -10 127 258 122 -127 -18 -109 301 -132 -93
1967i3jL22k25k88K36K96m0k38o8J28Mn2nM4K94m30K37J3n3pP0j07K00j95k0j13
1993i1k5K35k01J61N8j36J83j76J8J96k11N0J06j92r8J76j18k59K27M3J95j84
2015d3k1J00m7M1lQ7q0J16j14n8K58k75J21J16J01K4k72j07n1j5K54l03J08J21
2039E8j0j77L42k11M3k11K11J26k0k10P5k55L66m14M44mN9l23K84l80K32j07J98
2062A16k37J20J4J55k25J06Q7r0M8k76K57J16k44j42K21J06rj40Q9j92o3N7M77
2085C51l67K1N5n3k9q6K43j35P3k91K10J16k28L74k66J13k6j28M0l5N4n3o1R3
2109a5K73l68p2L10j62k59P9K34j24K9J01j1K5R3o3o3M3J59j16nk56K31l01J66
2133g2M1j9Q8q0j13P4j35J58K6Q6K1K17l27R8J42j99K17k23j64q0J05J01k34J32
$$ plain form
1967 -93 -94 228 3 -285 -49 247 207 -31 -99 29 33 -19 -24 20 314 -116 121 134 81 74 144 37 237 42 22 -91
1993 -91 -116 119 -82 79 137 1 184 8 26 222 11 61 167 -25 -123 53 -65 -324 -97 -54 141 -43
2015 -43 -64 36 -11 30 27 114 34 150 36 -22 236 -39 82 198 299 323 51 -56 -107 -122 132 -171 -63 58
2039 58 48 -129 213 2 45 -166 45 171 151 -59 16 -239 127 -287 157 153 212 -111 173 -207 25 -82 116
2062 116 -121 -1 13 168 -57 49 136 46 94 -182 75 191 -53 -195 26 132 123 -17 72 -120 -183 -126 351
2085 351 -16 5 60 7 -22 -108 135 0 73 -218 -8 108 -120 254 -12 101 75 -53 -13 -48 6 -47 -108 -15
2109 -15 258 -110 -182 128 -34 -293 -214 20 -104 -75 26 15 40 133 70 7 50 209 93 88 -168 63 -238 -72
2133 -72 -31 -50 38 -42 -155 -81 -216 -58 -32 54 75 292 -35 63 205 6 223 0 -164 -244 -139 -38 -272 -140
2157a40J99Q3k32n3M10l30J4J60K9n25N74q7j44J56k21K52k27o7J9j47J5K64q4
2180h2j83K18k1K2n8J87j16J50J00j29m8j52L11m22L38j31O0J2P1p6j54K20j96
2203g9L19k27R7k62L92j04k70J51OJ88k48J1m5l9P9J53o8J76k15J07q5PK56l02
2227bK24k41J03m5L2Jl6l16K36J08q2j34K84q3r3m1n1L43K4L8p0l37J79J3j91
2252a37K33K00Q5l50q0O1J46r4p2n7nJ59j0k77J81j91P1K10l13K31q6M6J73k98
2276a74J49NJ87k07q4N2Q1j36J00K58l82n0K19k03J94P2k48J60M8k6K1nJ22j52
2300Ak5Jjp5K88k16J40k0j90K3L7m7L79j88kn9n0J04M0j79M2l02R4L61m55L26
2326B7J8l6pJ34r6R6j58l2p2J81m5k04L50q3j7j55j15J11L3j24J90k17O1O7L21
$$ plain form
2157 -140 59 142 -90 -143 267 -63 -49 111 140 -385 189 102 -42 114 -107 145 -82 -149 -130 -277 -262 2 -82
2180 -82 -265 -47 -68 -46 -104 83 -33 117 217 88 40 -112 199 -223 115 -16 44 56 127 51 -103 117 -79
2203 -79 240 13 110 -152 240 136 -134 17 23 211 -37 -26 -71 -110 -31 122 54 230 15 122 37 44 300 -2
2227 -2 222 -19 84 39 71 72 36 -280 -44 64 -18 -152 132 49 -44 -85 -136 207 231 269 199 -138 41 54 -137
2252 -137 96 296 381 31 -49 12 158 64 -8 -65 -70 89 79 -198 -17 -208 -137 73 -240 -9 -95 -49 124 -174
2276 -174 -25 -20 167 -40 -124 -72 9 -127 -27 231 -151 -201 18 -185 9 81 -167 -7 41 15 36 31 153 1
2300 1 -24 -23 -24 -99 189 -27 113 93 -97 -74 -37 -84 295 107 105 46 -4 100 140 -39 3 -299 -205 156 -299 27
2326 27 45 9 2 136 40 136 -22 -54 -126 55 10 -194 156 73 56 -99 -214 -103 -70 -194 -4 -221 -160 -93 228
2351B28j71j10m4OL03j89l5j45M00q8j24j21J97l29N4O5l4J72J19j91l9J22q3
2374c7K0K60l07j72K93k8l1Q8k67K04j33L6q2K50k7k56L23k12J06j40K17k51J60
2397A4j03J53N3j82J29j33o4O0L83l72j22K89l25J87p2Q1p5J99PJ19k74K41k94
2420a01J47k10J16K71o01K51K07j79R6k3J18j15P1Nj95J28j15K20r6%j20K5P6
2443b4J24q3Oj61R7j51K29j48K5Q5m51M70j19K44k92J81o3k06J16J0K55O9k66
2466e3j43L41j01j46R4K6Q4j30j8m4J26l0P7L9k60K92l29K97j27j81J20j71n7
2489b94K33J63o7J72m3k80j91K31p5J64J4k92K85k45J09M0K33j44n3K3J28k64
2511a53P7J45J36j36k19R9J65k66L6J38j44Q7M8m8k1K55K54m21o6K8J68ok41J9
$$ plain form
2351 228 57 -53 -97 -91 212 23 -12 -157 243 155 31 -90 107 -222 -168 -103 -137 35 154 -37 -76 46 -37
2374 -37 -17 243 -64 -236 57 29 -2 86 -181 23 -110 -74 -156 94 67 -189 134 -78 28 -112 105 -146 14
2397 14 -89 64 117 -65 64 -69 -133 -73 310 -62 -184 105 -220 -33 -105 -24 -99 100 107 226 -48 193 -101
2420 -101 46 -164 -48 223 -378 -127 80 -99 -3 -26 92 -23 48 53 -142 -14 -129 91 -5 -5 -125 -100 -24
2443 -24 100 17 23 -138 -41 -192 37 -111 -86 -1 -452 18 -101 143 -149 32 -31 -237 -121 -111 144 213 -53
2466 -53 -196 145 44 -102 -8 18 102 -28 -46 -90 36 6 83 122 -138 154 -175 122 -5 -186 -66 -237 -294
2489 -294 -61 102 35 207 164 -116 -307 -76 -151 13 27 -265 20 -225 -116 -76 157 13 -40 -17 111 -153
2511 -153 -76 69 205 69 -150 -51 114 -152 -116 22 -122 -35 13 -35 -56 199 453 32 -34 -6 162 156 -85 -66
2535f6K9J24r6J28j48J06j29O1Q2r2j8J68l31m0J81N2J54k74j09O22l35oj47q0
2559a64L75k36j43O6J11k04L25j76L1K68m91M52l01J50O2Kj98K49k57K08j41J05
2581I3Q9o29R86o58j24K36j21L8O4J08J67j37J0j53J29j57Q0k04J77J26l98K71
2603gj0L54m69L21j56j12q8J58j35J28p8L14l03j64P9O6J11Oj30J58J94j28q1
2626B8j19J74N3q4j50J14K0J4N8M3n0L0M2k45K31l43K75k06M5R2j03J97k36l2
2650a52J38R1l78N02l08J81j74K7J99l41L38q2j49J66j24L50k39k7k25K89J76
2671B58m59J2L76j04k52R9J11j46J82k37L86l03r5R8J64k02Q7K5k94K32K31j83
2693a4O4l3k5L07k74P9j86j18J79K49l12J35J05k52l39N30m31M12j39P3K40k12
$$ plain form
2535 -66 -37 87 -9 119 -29 77 -52 9 91 -1 -19 149 -182 -222 -41 11 165 -109 -218 404 69 63 -84 -164
2559 -164 211 -25 -168 -102 9 -195 130 -46 -15 253 -238 214 -87 63 125 127 -71 178 -79 129 -12 93
2581 93 182 -447 539 -119 -243 -7 -128 -90 -26 82 249 112 122 -31 98 -59 21 -183 -6 120 -278 -7
2603 -7 -17 337 -132 189 33 -79 -167 -9 -144 -16 -94 220 -83 -247 -168 -102 9 15 -115 43 237 109 28
2626 28 -91 83 136 52 -98 16 36 50 108 151 101 131 173 -72 159 -184 91 -115 -70 22 -81 116 -120 -152
2650 -152 -14 77 -301 201 -107 74 -100 -73 126 -215 123 41 -108 58 -66 284 45 18 -207 82 258
2671 258 -201 -189 187 83 -169 -70 41 -105 77 -160 226 -77 -172 -74 90 -112 -25 0 -294 -62 169 -14
2693 -14 50 17 -8 299 25 104 -82 -200 -21 228 -84 51 156 -96 -435 95 -336 76 -63 10 250 38
2715C8J72j67o3J09k31L28q6p4j6r1J5r2L32j96J3j72L50n27K21L09n08L50K4
2738C8O1m5j54J94r5j8n2K15o4N0K1j8k44K22k08j25L93m50O78m06j46M09k69
2761a3m5J83j96L2r8M38l97J08J91k88R5K51j34L2Mj48J49k14K69L8m43O2k7J5
2785a36K71k68J29J89m45L69m7N9j94k31K44L08j31k68JK18Q1m09pJ61J34J28
2807A56j63p1K64l82L77m9j70K21L2j84%n6K12K1P2n2l42K54k62J47j38j9K3J43
2831C4j3O5k19K02k61K88k17n6J07j53M93k35l1N2j26J04n7n2n8J91K57k49j19
2854e3K19j53n9R3LO0l20L25N4r4J06r6J91k68O4L2k20K10J86j49M7Mj48N8j59
2879f7K36l84M11j45J68n4j85J5l4J5j19J81J15j33k80K77p2N0J22j57L4k7j17
$$ plain form
2715 38 210 43 -20 89 -142 186 100 26 10 -81 -66 -158 174 -22 -9 -181 169 -358 -137 172 -336 14 38
2738 38 99 54 -100 94 -1 -19 -71 144 80 130 151 133 -111 111 -97 -222 171 -279 399 -7 -153 256 -13
2761 -13 -58 125 -71 -39 -137 301 -96 12 203 -85 10 261 127 159 163 15 164 -50 219 257 -186 -124 -151 -136
2785 -136 135 -133 -4 185 -260 109 62 121 -73 -304 -60 248 117 -151 -150 68 149 -260 -267 -106 28 156
2807 156 -7 -78 186 -196 181 132 -38 183 215 31 31 -25 187 208 280 228 -114 140 -122 25 -113 -132 -109 34
2831 34 21 86 -133 69 -192 96 -121 -177 -70 -223 270 35 4 56 -70 34 -23 -75 -133 58 315 66 -53
2854 -53 166 13 -46 47 50 110 -210 115 169 75 181 85 276 8 72 104 -116 94 280 131 178 182 34 92 -67
2879 -67 169 -215 196 51 219 165 -20 -5 -39 -24 -143 38 153 20 -260 17 -55 -5 117 -40 -6 -33 -150
2902a50j04o1L25j96K34m48O46l43k47N26j91n5J52k18J16J26j76K0j69J33J5
2923f5j66K70k2j27J68J59j33n5J48l39o7L25k44K30k6j14L0J61m08L88r7k94
2945b78L33r0K30k68J23K18k65j36R9K11r3L4k79K83k53J14P7n2JJ12N4qj83N9
2969D3k42J74p8J90j62K37j81J7R3l83J14J86j8j23J09J23j84k7k3N1J76q8J56
2992A60j82J57j59P4j35K4L71l20L0j23MK42k58K85ol82J2J92j37j5J47Kj18J97
3016F2m4j52M9M4K42k64K35J5j85K27k80L38m40L2Q9j34Q8K47j42p9m1JL09m2
3040A75r4k05O5J34J79l01K5l5J9j34J54Q5j65J4oo9K92j51MQ5N8j28k9n0j19
3065a97K77K06k86k81K42J37J41k17r8J32P4j74k83K61J16q9J1r2L4p3J46K3j95
$$ plain form
2902 -150 -254 -315 10 -186 48 -400 246 -97 -344 182 -9 -64 88 -130 -14 112 -64 -44 -213 -80 -65
2923 -65 -231 39 17 -110 58 217 84 29 177 -162 -229 96 -148 82 56 -58 -28 133 -275 113 16 -278
2945 -278 55 -35 195 -73 50 268 3 -133 -34 177 84 118 -161 122 -131 -17 60 8 9 121 175 167 -16 43
2969 43 -199 -25 -103 87 -75 162 -19 -2 91 -292 -178 8 -10 -133 -24 99 -85 -112 -135 -84 92 4 160
2992 160 -22 135 -24 50 -85 -61 310 -10 20 -103 -99 143 -115 170 164 -218 -206 -14 -151 -166 -19 -17 -135 62
3016 62 18 -134 -85 -41 201 -63 172 187 2 229 -51 287 -153 -121 -32 -166 -78 169 27 -52 -93 -92 217 175
3040 175 81 -124 -59 75 254 -47 -22 -57 -38 -172 -18 67 -98 -84 -90 -159 133 -18 -14 71 129 1 -28 -78 -197
3065 -197 80 286 0 -281 -39 98 239 22 -76 56 130 -44 -327 -66 50 -39 -28 -120 -86 -159 -13 10 -185
3088a85j01L00J29q9j09R1k04L06j37j75M14p9J25j8m88N28j81m7k58K9n0K10
3110A1q1n6r7n0M26O3l74N00m04j17J84O2J88m30K67j05K01j11j48j4J26QJ00
3133A49j00j40P3K00j37k36K84k21L19j55k66L12o8p7p1K74o7J2k55K24j43K03
3155A14n26M28r1m4J82k86M54l96K53Q7l02L29j54k47J61K02m25K70J42j69m0
3176e8K0J39k56L51l87K21m1J31j4J33o6j97J82l62J55J35K22k96L9k6j36J03
3198hJ44j81L0j28j40L07j25r5K71l7JP6k18L32r2M8j45L2k3j08Q9p3q8j42P8
3223a95K89N4o3r1J41J23k24j20J73j7k13K30J46j35k6k24K3J69J84j58k16K51
3245A01j06K08j17J11k27j60M61j79j05J5k03K16Pk19L02k44M39l63M2J26l20
$$ plain form
3088 -185 -286 14 143 54 -55 36 -168 138 1 -174 240 161 286 268 -220 308 127 80 -178 -149 -199 11
3110 11 -70 -126 -223 -273 153 216 -158 342 -62 -179 5 67 255 -175 92 -13 188 77 -71 -85 41 49 149
3133 149 49 -91 -18 182 45 -191 93 -128 191 36 -230 82 14 -63 -134 140 73 85 -170 54 -89 114
3155 114 -412 16 -75 -119 63 -223 231 -165 88 175 -127 202 48 -199 -38 164 -261 9 151 -18 -58
3176 -58 -38 101 -155 196 -191 30 -11 120 106 239 173 -24 158 -204 -49 86 308 12 51 25 -111 -8
3198 -8 136 -45 -15 -143 -283 24 -101 -196 75 38 39 115 -103 229 137 185 40 72 49 -59 30 -43 -131 -273 -195
3223 -195 94 148 85 -6 135 258 34 -86 87 70 -143 87 233 98 72 -152 -129 40 224 66 -150 101
3245 101 -5 203 86 197 -30 -190 271 92 -13 2 -201 15 22 -197 105 -139 300 -63 -21 105 -215
3266b15L05J3j36N4j77Qm5J95M62m00r4L13l16N6jl7N5j51P9j6J07k51J48J53
3290A09k5N9m48M27m67L01o9R5p9j15K87k18nK37J7j68L60k32j60oJ52N9r3j51
3314a33P8p3M3q0L54j34k65J60L5J82k15oRL64l14j66lm4L58j58N8j91lj38O3
3339b19L86l06K18j07j74K2J66J8J62k07r3P8L6l8K11K6k1j30j34K50j01L6l9
3362D0m2O2J17l21J31r2N7J09M5p8J79j56J47j88j57J06l31K97J36k7j46j26J35
3385a03J76l17J25R8j07K08q5j08j45K66j03o3J93M6k40J16Q3j79K81j55j24J66
3407B9q5o5R3l4j6n9L12l38P4R8k71J63J58k64K45k04n8K59j79MK27j13K18l16
3431a22MK14k62K04J37k45j61K56R4j89L6K09j52k00PMJ98J7o0J23j58J59j99
$$ plain form
3266 -215 90 103 -33 21 -156 -148 -193 2 464 64 -30 283 -33 23 22 -15 40 -111 -32 -48 59 -192 -44 109
3290 109 84 143 -305 122 -345 -44 -113 -18 -97 -212 75 -143 -148 89 106 -62 298 66 -94 -100 52 111 18 -133
3314 -133 -55 -128 -85 -165 189 55 -210 -50 -15 167 -48 -54 -45 319 5 -161 -164 -208 150 -8 50 -141 -144 -282 -219
3339 -219 167 -139 79 -28 -202 -180 -14 4 166 -41 -134 -56 -20 -58 153 179 158 28 -106 144 43 79 40
3362 40 -2 60 177 -144 -13 -105 -48 61 106 28 207 51 198 10 -147 -41 -372 -75 61 34 -112 -238 -103
3385 -103 73 -244 -119 -21 -128 80 -5 -113 -258 8 -95 -158 35 81 -159 -43 40 -139 142 -13 -137 29
3407 29 -56 -121 -28 -62 -78 -137 175 -163 -89 9 -262 -99 59 -205 40 -164 -222 37 -142 -138 89 -24 194 -122
3431 -122 -118 96 -166 38 175 -70 -231 25 119 -70 -34 175 23 -177 -170 -166 32 49 -11 112 -46 113 -86
3454h6n0J49Q2k17J16m0N0M07l84K48l61M7jK6Lj30L18j74j11J23m3N5J78m70
3478b65L05L5j18N3Kj91K75j59j89K3Q1K99%l51J90J01p7j18N1L41k04k0r6P8
3502D6j90j7K13q8k5q3J72N3J60q0m9m43J46j4J51N2J10J24j47m63L57J79l61
3525a97L46k17j31J28o8J32J01j87P6K97l54J24J44j89M3Q0n3j5q2P0K66l35j10
3548a31J5p3M81j00k24J21j04j87K95j38j40K82l10L02j35l94L59J68jM4l07K45
3570F8k85K14o2K30Jk24pM4L6k92L09k56K10J08j59k53L25M29l66o3j28K00o6
3593A3K8J29J1j62j83q9M83l87K99j68Pr7j13J06p3P3j84K20K01j01m6o1N1O5
3617B2J4k52K43j55J04J22k00J18J64l41J03N10l30j22K85j66l48K22j48l3K19
$$ plain form
3454 -86 -136 13 95 -122 -6 -46 4 411 27 275 -86 -39 -40 -14 -11 -141 177 3 -108 15 -28 27 205 -265
3478 -265 40 75 -43 10 12 -179 96 -63 -252 -229 -148 151 151 -200 -10 91 14 -104 -53 288 84 64 -32 46
3502 46 -144 -161 52 -36 -61 -144 28 81 241 161 112 -331 -185 -199 -48 4 114 238 91 -372 -15 164 -197
3525 -197 149 -68 -199 -71 -139 -7 94 -93 -17 280 -74 50 194 5 48 128 75 60 -22 48 314 -21 -131
3548 -131 -116 -189 292 192 -32 89 -15 -202 93 -45 -185 97 -213 89 -46 -440 -81 87 86 130 -177 68
3570 68 -217 -3 -65 165 166 -58 -65 -21 15 -277 32 -224 -14 94 -65 -318 7 436 70 7 -121 79 13
3593 13 41 170 181 19 -164 -253 230 -157 142 -26 -19 -116 -229 -123 -196 -123 -307 -87 114 13 -33 -94 -43 22
3617 22 36 -216 27 -128 -24 98 -102 16 180 -161 -58 452 122 0 285 119 -229 -7 -155 -188 31
3638C1j04q4M48o15K4N16l07K45k84Q1K90l72KK13nl24L28k0J04j50j43K81k52
3661i7N4K16m0j63m9rJ57l3j05k82L14j38r8R8K64J77l60M35n84L99p1L5j1l34
3685b25n5L31j95K59j73o8o3N1j94K89N9m6J5l25L74l18L04J26j39O8J46j64j27
3708g0J24l72L73l04R9J71j23Q5kL68n38N7J45J41k20K91o1M2j69j56j36M22k99
3731a32K81n8k05ML21o7k32K23j89J46J11j78O6j48K7j26K36J16l80j8K45j37
3753i4Q3Lkk63K31r5L03l19l8M60k24j27J70M3l30K80k17l0J77L4J74J14m31K25
3777A27j34j34J82J04J31k67l5j18L40r7m55J15K33O6k17M60j23k90j27J23L41
3798B25l40J76J72Q9n35M89Pj50j40K5J57J29o8j34m2l7K67l40J95r9l3k5kj42
$$ plain form
3638 31 -73 -157 291 -324 -300 216 -91 154 -130 -49 241 -131 -129 84 79 -245 83 63 167 17 -126 155 -97
3661 -97 -43 173 133 -30 -79 -88 69 36 -69 -351 -37 -175 -273 -175 89 266 -94 341 -243 156 85 120 109 -225
3685 -225 -280 51 -144 115 -58 -126 -189 -138 -332 -43 16 -30 -15 -340 34 -284 20 146 7 75 221 57 -70
3708 -70 54 -318 55 -249 -150 21 -102 -17 -19 349 -189 -132 13 154 -66 225 164 206 37 -119 -255 167 -132
3731 -132 149 91 -114 -110 211 144 -88 135 -54 92 203 25 91 -57 -30 -156 80 196 -184 -202 43 -94
3753 -94 -11 -8 -10 -273 -42 -137 166 -153 -191 269 45 -82 88 131 -199 81 -136 -166 11 45 219 333 -98 127
3777 127 -7 -141 41 145 276 9 -26 -144 196 99 -356 -241 -8 58 -159 301 178 -112 -239 -116 225
3798 225 -115 61 233 322 -213 276 283 133 -7 18 175 304 236 102 60 23 290 -50 145 46 13 -12 -14 -156
3822a56J79o6R2n2n5K11k69p7L29l14N9K06m8M2o0j18rK13r8M6j0l01L81j1m0
3847G4j20O3k04K91k47L97j75j62P4o5p1J47j18L4J34k4N2j16p3k29J03L35j05
3870eLJ97j08MJ03m08K5L00k15%o4N6J53P8j03l8K40m14K43k31L88j24j90K2K9
3895e9K00Ok88J41K86k81M86l98p2K19k11O0j90l5J75k0j8J09J22m89K62O1J10
3918A76M1k99J11%r0k6K20qj74J95m3n4J15m9j17J25k94L44n9k5l03j0J66Q9j8
3943A3l10L47j58L9j4K38j41J88k62q3K13N5k14Onk1j82N58k44J21j73k9j0O4
3967dj6L2P5Q0p1o0k18J81K96l52J15j34j20J78j09O8j0K55l07K09k5j30L6J19
3991H8j46J28J92l24J11JJ34q9j29K26k31j16K32j71R8j02P2j73K25K62k07k2
$$ plain form
3822 -156 23 -43 49 -3 -58 153 -116 -193 136 -178 -119 87 39 81 21 -97 -106 107 9 55 45 -256 125 114 74
3847 74 -46 17 -187 104 -143 254 79 -83 -9 -74 -145 2 -116 -82 52 28 80 -36 -109 -338 -235 100 -5
3870 -5 -2 195 87 91 194 -214 -189 111 -104 -104 -168 -112 41 119 16 -22 218 -196 47 -184 204 80 -110 -88 -59
3895 -59 141 147 -141 0 286 5 491 93 21 240 29 89 -101 -136 39 19 1 110 232 -257 5 66 176
3918 176 217 -82 29 29 -61 -87 133 125 -49 146 103 49 164 115 -2 123 -171 173 114 89 -214 -224 -58 31 13
3943 13 -297 50 -108 -69 -83 155 14 202 -60 -143 70 125 -89 -83 -88 -109 -291 267 23 144 -29 -58 -68 -4
3967 -4 -20 12 87 167 96 36 -182 -1 295 -57 58 -76 -196 -18 -127 -59 -69 186 -121 88 63 -67 -31 88
3991 88 -58 70 262 -62 49 50 184 95 -34 192 -39 -155 77 -94 4 -98 -26 -199 26 288 81 59
4013E9J9J03j04O9j3M7j15k28J73k3O0j94Q8r4J80rN6l13q3N45l63j45L33J0L1
4038H9J63k06k16N9q5L65j43k4N2j11j19K21O3J3l2k12M2L9J9k09J64K3K84m96
4062b57K33p4J11p6M6J97m55J5L09K3p1k84L78m3j98K60l15L17k45N0J08l74L56
4085A1J31j25J08N7k11k6j0J2J95m08L95k43J79k1K7m8o6J09l4j20Q9j16M29k14
4109A00m56N85j67j11j4l8k3L97p4m30L60k51J45mJ63j4p7k58J38J65Kj40j32
4132a34N31n26J19P5K25p1n6k33j53L02l8M2k38J68j00K08k09L5K8j47K76l2j79
4155a07R9J24q3k70L39k2j86L3j34Q7J45k26J99l7K85k75Q0O3j56J59l06L26l73
4178b36M15l55K4J4j45L20o5L87n04L40l7p0o2l28L26k2k26J32K89l58J09J9j37
$$ plain form
4013 59 78 181 77 146 133 180 65 -163 10 -13 47 -147 -59 -153 27 18 74 -239 -322 223 -140 -285 48 58 89
4038 89 252 46 -170 -111 -196 169 26 2 54 -57 -176 45 108 121 89 -123 -81 -42 -23 -232 -68 -45 239 -257
4062 -257 -24 -98 13 -63 -17 180 -275 -260 49 72 1 -283 95 52 -146 114 -201 116 -129 -79 29 -345 11
4085 11 142 17 125 182 -29 -55 -65 -53 142 -266 129 -114 65 44 71 23 -43 66 32 -88 1 -115 314 100
4109 100 -356 229 62 -49 -63 -101 -124 273 199 -231 129 -122 23 19 182 168 91 -167 -29 136 138 -2 -134
4132 -134 397 -129 -10 65 290 219 163 -70 -223 79 41 83 -155 13 -87 121 -88 -53 -25 -172 104 72 -107
4155 -107 -8 116 33 -237 102 80 -106 -73 -207 -120 25 -201 -2 -39 246 -29 51 114 -42 117 -189 137 -236
4178 -236 179 -176 -152 -138 -283 37 -28 359 -145 195 158 88 26 -302 24 2 -224 -92 197 -161 -52 -33 -170
4201a70K03M3m8k36K90j72L36k10R7j34K26K1k95K70k85J41L24m44MP9O7p5R6
4224A28j52J38m6J03k91j04K86j02k66n7M57j13N2Q6k79K7J20q4J07N1M7j51m9
4247i2K08Qj70J03j00Q3k08L82l16k5L05j12J1P5r4j11L9j5J39R3l18k57K93J52
4271G3p4k25K12j08J40j9L8Q5l14K18j72M3J45o0q8q6j5j0L09Q7j71J19R9n12
4295b86K68N5M2k03M14l43j21J08R2n8P8J0j09k17L52Q6l11K18N7l5j23j3r0J66
4319C7j61j51n3L44K69k85k4j64J29j24K50k16J75q1J14N9j89K1K38J82l02l5
$$ plain form
4201 -170 33 76 28 -208 82 -90 246 36 133 -1 225 246 -49 221 -64 77 401 -43 -39 40 107 32 128
4224 128 -24 114 68 171 -120 -224 62 -40 -306 -363 94 -19 33 119 -160 -133 -13 -97 10 61 108 -43 -92
4247 -92 116 124 -46 57 -43 40 -168 214 -102 -127 178 66 77 152 58 -53 -14 -29 110 203 -115 -372 -79 73
4271 73 -1 -226 -14 -122 18 -1 37 122 -192 26 -146 -103 42 -18 -106 -192 -207 -217 92 179 8 127 226 -286
4295 -286 -18 37 79 -124 290 -53 -174 -66 26 -32 46 56 -53 -270 82 168 -143 75 132 97 -26 -39 -129 37
4319 37 -124 -275 -328 16 285 0 -24 -188 -59 -183 67 -149 26 -55 59 118 -71 -50 188 370 68 33
$$ [...]
8191c
##END NTUPLES=NMR FID
##END=
