##TITLE=1H_DE-95K_TFA
 200.13MHz, CDCl3,
 8 sc
 
 9.6.2025
##JCAMPDX= 6.0         $$ Bruker NMR JCAMP-DX V2.0
##DATA TYPE= NMR FID
##DATA CLASS= NTUPLES
##ORIGIN= UXNMR, Bruker Analytische Messtechnik GmbH
##OWNER= pz
$$ XWIN-NMR		Version 3.5
$$ Mon Jun  9 14:43:58 2025 Russian Standard Time (UT+4h)  she@DPX200
##.OBSERVE FREQUENCY= 200.1313
##.OBSERVE NUCLEUS= ^1H
##.DELAY= (6, 6)
##.ACQUISITION MODE= SIMULTANEOUS
##.ACQUISITION SCHEME= undefined
##.AVERAGES= 8
##.DIGITISER RES= 18
##SPECTROMETER/DATA SYSTEM= spect
##.PULSE SEQUENCE= zg30
##.SOLVENT NAME= CDCl3
##.SHIFT REFERENCE= (INTERNAL, CDCl3, 0, 14.3821)
##AUDIT TRAIL= $$ (NUMBER, WHEN, WHO, WHERE, WHAT)
$$ ##TITLE= Audit trail, XWIN-NMR		Version 3.5
$$ ##JCAMPDX= 5.01
$$ ##ORIGIN= Bruker BioSpin GmbH
$$ ##OWNER= she
$$ F:/spectra/data/she/nmr/H-C/1/audita.txt
$$ ##AUDIT TRAIL=  $$ (NUMBER, WHEN, WHO, WHERE, WHAT)
(   1,<2025-06-09 14:42:50.10 +0400>,<she>,<DPX200>,
      <created by zg, POWCHK disabled, PULCHK disabled
       configuration hash MD5:
       00 E9 B6 7A A2 85 ED C7 34 08 36 98 17 FE 4E 26
       data hash MD5: 16K
       41 F2 74 E6 DD AF 96 F1 F0 F8 24 F1 98 53 87 47>)
$$ ##END=
$$ 
$$ hash MD5
$$ 5D 48 52 A1 0B B9 DB A7 2F 42 69 35 17 FF BB 9F
##$RELAX= 
##$RELAX= 
##$RELAX= 
##$RELAX= 
##$RELAX= 
##$RELAX= 
$$ Bruker specific parameters
$$ --------------------------
##$DU= <F:/spectra>
##$EXPNO= 1
##$NAME= <H-C>
##$PROCNO= 1
##$TYPE= <nmr>
##$USER= <she>
##$AMP= (0..31)
100 100 100 100 100 100 100 100 100 100 100 100 100 100 100 100 100 100 
100 100 100 100 100 100 100 100 100 100 100 100 100 100 
##$AQSEQ= 0
##$AQ_mod= 1
##$AUNM= <au_zg>
##$AUTOPOS= <>
##$BF1= 200.13
##$BF2= 200.13
##$BF3= 200.13
##$BF4= 200.13
##$BF5= 200.13
##$BF6= 200.13
##$BF7= 200.13
##$BF8= 200.13
##$BYTORDA= 1
##$CFDGTYP= 0
##$CFRGTYP= 5
##$CHEMSTR= <none>
##$CNST= (0..31)
1 1 145 1 1 1 1 1 1 1 1 1 1 1 1 1 1 1 1 1 1 1 1 1 1 1 1 1 1 1 1 1 
##$CPDPRG= <>
##$CPDPRG1= <>
##$CPDPRG2= <>
##$CPDPRG3= <>
##$CPDPRG4= <mlev>
##$CPDPRG5= <mlev>
##$CPDPRG6= <mlev>
##$CPDPRG7= <mlev>
##$CPDPRG8= <mlev>
##$CPDPRGB= <>
##$CPDPRGT= <>
##$D= (0..31)
0 0.7 0 0 0 0 0 0 0 0 0 0.03 0 0 0 0 0 0 0 0 0 0 0 0 0 0 0 0 0 0 0 0 
##$DATE= 1749465769
##$DBL= (0..7)
120 120 120 120 120 120 120 120 
##$DBP= (0..7)
150 150 150 150 150 150 150 150 
##$DBP07= 0
##$DBPNAM0= <>
##$DBPNAM1= <>
##$DBPNAM2= <>
##$DBPNAM3= <>
##$DBPNAM4= <>
##$DBPNAM5= <>
##$DBPNAM6= <>
##$DBPNAM7= <>
##$DBPOAL= (0..7)
0.5 0.5 0.5 0.5 0.5 0.5 0.5 0.5 
##$DBPOFFS= (0..7)
0 0 0 0 0 0 0 0 
##$DE= 6
##$DECBNUC= <off>
##$DECIM= 32
##$DECNUC= <off>
##$DECSTAT= 4
##$DIGMOD= 1
##$DIGTYP= 9
##$DL= (0..7)
0 120 120 120 120 120 120 120 
##$DP= (0..7)
150 150 150 150 150 150 150 150 
##$DP07= 0
##$DPNAME0= <>
##$DPNAME1= <>
##$DPNAME2= <>
##$DPNAME3= <>
##$DPNAME4= <>
##$DPNAME5= <>
##$DPNAME6= <>
##$DPNAME7= <>
##$DPOAL= (0..7)
0.5 0.5 0.5 0.5 0.5 0.5 0.5 0.5 
##$DPOFFS= (0..7)
0 0 0 0 0 0 0 0 
##$DQDMODE= 0
##$DR= 18
##$DS= 0
##$DSLIST= <SSSSSSSSSSSSSSS>
$$ [...]
##$SUBNAM0= <"">
##$SUBNAM1= <"">
##$SUBNAM2= <"">
##$SUBNAM3= <"">
##$SUBNAM4= <"">
##$SUBNAM5= <"">
##$SUBNAM6= <"">
##$SUBNAM7= <"">
##$SUBNAM8= <"">
##$SUBNAM9= <"">
##$SW= 18.0517328524113
##$SWIBOX= (0..15)
0 0 2 0 0 0 0 0 0 0 0 0 0 0 0 0 
##$SW_h= 3612.71676300578
##$TD= 16384
##$TD0= 1
##$TE= 0
##$TE2= 300
##$TE3= 300
##$TEG= 300
##$TL= (0..7)
0 120 120 120 120 120 120 120 
##$TP= (0..7)
150 150 150 150 150 150 150 150 
##$TP07= 0
##$TPNAME0= <>
##$TPNAME1= <>
##$TPNAME2= <>
##$TPNAME3= <>
##$TPNAME4= <>
##$TPNAME5= <>
##$TPNAME6= <>
##$TPNAME7= <>
##$TPOAL= (0..7)
0.5 0.5 0.5 0.5 0.5 0.5 0.5 0.5 
##$TPOFFS= (0..7)
0 0 0 0 0 0 0 0 
##$TUNHIN= 0
##$TUNHOUT= 0
##$TUNXOUT= 0
##$USERA1= <user>
##$USERA2= <user>
##$USERA3= <user>
##$USERA4= <user>
##$USERA5= <user>
##$V9= 5
##$VALIST= <valist>
##$VCLIST= <CCCCCCCCCCCCCCC>
##$VD= 0
##$VDLIST= <DDDDDDDDDDDDDDD>
##$VPLIST= <PPPPPPPPPPPPPPP>
##$VTLIST= <TTTTTTTTTTTTTTT>
##$WBST= 1024
##$WBSW= 4
##$XGAIN= (0..3)
0 0 0 0 
##$XL= 0
##$YL= 0
##$YMAX_a= 116527
##$YMIN_a= -126046
##$ZGOPTNS= <>
##$ZL1= 120
##$ZL2= 120
##$ZL3= 120
##$ZL4= 120
##$ABSF1= 10
##$ABSF2= 0
##$ABSG= 5
##$ABSL= 3
##$ALPHA= 0
##$AQORDER= 0
##$ASSFAC= 0
##$ASSFACI= 0
##$ASSFACX= 0
##$ASSWID= 0
##$AUNMP= <proc_1d>
##$AZFE= 0.1
##$AZFW= 0.1
##$BCFW= 1
##$BC_mod= 2
##$BYTORDP= 1
##$COROFFS= 0
##$CY= -3
##$DATMOD= 1
##$DC= 2
##$DFILT= <>
##$DTYPP= 0
##$F1P= 0
##$F2P= 0
##$FCOR= 0.5
##$FTSIZE= 0
##$FT_mod= 4
##$GAMMA= 1
##$GB= 0.15
##$INTBC= 1
##$INTSCL= 1
##$ISEN= 128
##$LB= 0.25
##$LEV0= 0
##$LPBIN= 0
##$MAXI= 10000
##$MC2= 0
##$MEAN= 0
##$ME_mod= 0
##$MI= 1.114404
##$NCOEF= 0
##$NC_proc= 0
##$NLEV= 6
##$NOISF1= 3.799351
##$NOISF2= 2.8
##$NSP= 1
##$NTH_PI= 0
##$NZP= 0
##$OFFSET= 14.38212
##$PC= 1
##$PHC0= -1550.19
##$PHC1= 0.5922
##$PH_mod= 1
##$PKNL= yes
##$PPARMOD= 0
##$PSCAL= 0
##$PSIGN= 0
##$REVERSE= no
##$SF= 200.129724274929
##$SI= 16384
##$SIGF1= 3
##$SIGF2= 2
##$SINO= 400
##$SIOLD= 16384
##$SREGLST= <1H.CDCl3>
##$SSB= 0
##$STSI= 0
##$STSR= 0
##$SW_p= 3205.1282051282
##$SYMM= 0
##$S_DEV= 0
##$TDeff= 0
##$TDoff= 0
##$TI= <>
##$TILT= no
##$TM1= 0
##$TM2= 0
##$TOPLEV= 0
##$USERP1= <user>
##$USERP2= <user>
##$USERP3= <user>
##$USERP4= <user>
##$USERP5= <user>
##$WDW= 1
##$XDIM= 8192
##$YMAX_p= 0
##$YMIN_p= 0
$$ End of Bruker specific parameters
$$ ---------------------------------
##NTUPLES= NMR FID
##VAR_NAME=  TIME,          FID/REAL,        FID/IMAG
##SYMBOL=    X,             R,               I
##VAR_TYPE=  INDEPENDENT,   DEPENDENT,       DEPENDENT
##VAR_FORM=  AFFN,          ASDF,            ASDF
##VAR_DIM=   8192,          8192,            8192
##UNITS=     SECONDS,       ARBITRARY UNITS, ARBITRARY UNITS
##FACTOR=    0.0002768,     1,               1
##FIRST=     0,             0,               0
##LAST=      2.2672688,     0,               0
##MIN=       0,             -126046,         0
##MAX=       2.2672688,     116527,          0
$$ Real data points
##PAGE= N=1
##DATA TABLE= (X++(R..R)), XYDATA
$$ [...]
1932B8l8N96n75K95K87j84L76r3p97p5k12q6j48K57j59J30k51P3R06n01P8P23
1954F30o92K32J99j23QJ92J59m19k90r7R6l73J15K63q54M62L54k53J93M94k86
1975A0K11J05L94K0n27M04k28p18K45K52r71J81K60k79L66r5L21J47J6K47J23
1996D84m00L33L7k69O01j42n10j43J84m04J26Oj53k73q5M61j82j55O03q1K7L22
2018C87J55J79n23jK01l96j01N5k89k10P15l88k38K72K34J17J22K15l47k08j44
2039a93K76j06J55O7m83k08L79Q4J87K72k57k73j99K73L7j60M67p0o44L20K16
2060A40k32J46L42n73j58J09mJ24k73K09L25k9k11O12n6k36K76l42k66J35m05
2081c67p1M92k48k98L7L34L77j72L25J47l62Q2L65m13J0K44o14M6J16k06K39m21
$$ plain form
1932 28 -10 586 11 306 593 409 785 692 -105 -180 -392 -478 -626 -369 -528 -398 -649 -576 330 -171 -93 630
1954 630 -62 170 369 246 254 446 605 186 -104 -201 -105 -478 -363 -100 -954 -492 -138 -391 -198 296 10
1975 10 221 326 720 740 213 617 389 -329 -84 168 -803 -622 -362 -641 -275 -370 -49 98 114 361 484
1996 484 84 417 454 185 786 644 134 -9 175 -229 -103 -97 -250 -523 -608 -147 -329 -484 119 38 65 387
2018 387 542 721 198 197 398 2 -99 -44 -333 -543 172 -216 -454 -182 52 169 291 506 159 -49 -193
2039 -193 83 -23 132 199 -284 -492 -113 -29 158 430 173 -100 -299 -26 11 -149 318 248 -396 -76 140
2060 140 -92 54 396 -177 -335 -226 -230 -106 -379 -170 155 126 -85 527 471 235 511 169 -97 38 -367
2081 -367 -438 54 -194 -492 -455 -121 256 84 409 556 194 276 641 228 238 482 -132 -86 30 -176 63 -358
2103c58J30j62l71N31J74l82K57J77L43l20K94J71J64k97J58q0n59n3o9o84M05
2124e31J92m09M94K46l60N08L53j42k81Q6J03Q1M7P6k56n80M92k38k10J41Q2l95
2146e01l7L08J77j11j07M04j98K4P06k18l47M10M2m34o6n4j9m45Q6L60o31j05
2168g56P48k13j4L38J93m24N69o6r3L6j78j09j33K04J85o11P8L60m72K03r9Rq1
2191c26M24r8j83m5O19j9j74K53J51p14m3L37k70j19J55k97K8n1K11M18l56L84
2213B85j36l38K69L21m35K88r3l84k04M18k85m6L72K64n4k30J59J67m00N09k00
2234B47l65j29J96P3L1j10Q0L4o2J31k05p3K51J00m77J03J37K0K51J48k14R3l53
2257i3L70n75j65L68k63j89L48j40K10L5J91j2q6L77O4m6k98K36l81j32L49m3
$$ plain form
2103 -358 -228 -390 -761 -230 -56 -438 -181 -4 339 19 313 484 648 351 509 429 -130 -183 -252 -936 -531
2124 -531 -339 -748 -254 -8 -368 140 493 351 70 156 259 340 387 463 207 -373 119 -119 -329 -188 -106 -501
2146 -501 -538 -230 -53 -164 -271 133 -65 -41 665 447 100 510 552 118 52 -2 -21 -466 -380 -20 -651 -756
2168 -756 -8 -221 -235 103 296 -128 441 375 282 318 140 31 -102 102 287 -324 -246 114 -358 -155 -254 -245 -326
2191 -326 98 0 -183 -228 391 372 198 451 602 -112 -155 182 -88 -207 -52 -349 -321 -372 -161 257 -99 285
2213 285 149 -189 80 401 -34 254 161 -223 -427 -9 -294 -340 32 296 242 12 171 338 -62 447 247
2234 247 -118 -247 -51 22 53 -57 23 57 -5 126 -79 -152 99 199 -278 -175 -38 -18 233 381 167 260 -93
2257 -93 277 -298 -463 -95 -358 -547 -199 -339 -129 -94 97 85 -1 376 440 394 96 332 -49 -181 168 125
2279A25l92M7j39J74o9J40J83n7K45l8J8j80L28j41Q9K82m88J15l57R3l2q4M1
2302i7n00k8L11L36k37m0M43k49K15K27j00J08J36k44k23j24J9K79m90Q7R9k17
2324b89n6J30q4K25L29l69J64R1M3K33r0m01N52m92J98k05j11K81j41m73N2J03
2346c10j70J83j11J97L03P5k61K59l07L39O0k76j86Q4k4K01k22p5L44l53J48k
2368a04m2J07o8j27k3L26j84j87J85J55J89l27L01m3j84K17k93k54K86k97M68
2389A01K97m56r1K96k13K53k19L9K93m07O9M0j79M3q9J14R6K5p3J98j4j10j6j63
2413a66j61K28%j58Q5j0l11N03p7L39j20j73M85l89J7Q7j77J6L8J81j97P9m3k66
2437a90j40R1P4k25L3L17n9p9N78k19j40J41n3J12J09k00O8l19j24M19m82N5j8
$$ plain form
2279 125 -267 -220 -359 -185 -254 -114 69 12 257 219 237 57 385 244 333 615 127 242 -115 -22 -54 -138 -97
2302 -97 -597 -625 -314 22 -215 -255 188 -61 154 381 281 389 525 281 58 -66 -47 232 -258 -171 -72 -289
2324 -289 -345 -215 -299 -74 255 -114 50 141 184 417 327 -74 478 -14 184 -21 -132 149 8 -465 -413 -310
2346 -310 -480 -297 -408 -211 92 167 -94 165 -142 197 257 -19 -205 -121 -145 56 -166 -241 103 -250 -102 -104
2368 -104 -146 -39 -107 -234 -257 69 -115 -302 -117 38 227 -100 201 158 -26 191 -102 -356 -70 -367 101
2389 101 398 -58 -149 147 -66 187 -32 7 300 -107 -38 2 -177 -134 -223 -109 -13 12 -61 137 123 13 -3 -166
2413 -166 -327 -99 -99 -257 -172 -182 -493 10 -67 272 152 -21 464 75 92 179 2 18 56 237 40 119 76 -190
2437 -190 -330 -239 -165 -390 -357 -40 -99 -178 400 181 41 182 129 241 350 150 218 -101 -225 194 -288 -233 -251
2460b51j10L05J54l45K92p4L2P8n5R3L61n37J52j71L91m61K65k28K49p3k69j85
2482c87K54pL52l25J14K78o00K24J25Q6J38J0k14J4nj27m4j29O4K54k27L06j18
2505C6J2l31L11q1nO1M82m77q2J47J88l14J94j62K4L3J10k28r3j07J53J01o7K82
2529A87k74k29K99k2R3L15j50j88J2k10J62R1j66l1k6J38M8r0M8J32l74J72R2
2552B9M0L4l07o1R3M8N30k73j09j3L31k45j25K01j10k47K28r9k55K23J64q4k91
2575b98J58K20m96O39j97j33K36J14j18j26L12n6j62j66L52k85r4l2J96k77R9
2596a14j75M8J62J3K0L18q9j21K27l9M8k65k58l3K63N8j29j23J5J9q7J39j35J04
2620a34R8jp1jJ51j71L16l69K73P8K30j16k64L34m29L0J25j85j31R7n2K66p8Q7
$$ plain form
2460 -251 -361 -56 98 -247 45 -29 3 81 26 119 480 -57 95 -76 315 -146 119 -109 140 67 -202 -387
2482 -387 -133 -140 212 -113 1 279 -321 -97 28 114 252 262 48 62 57 -70 -114 -243 -179 75 -152 154 36
2505 36 48 -283 28 -53 -58 3 485 8 -74 73 261 -53 141 -21 3 36 146 -82 -175 -282 -129 -28 -95 187
2529 187 -87 -316 -17 -39 54 369 219 31 43 -167 -5 86 -80 -111 -137 1 49 -41 7 139 -235 -63 29
2552 29 69 103 -204 -265 -172 -124 406 133 24 11 342 97 -28 173 63 -184 44 -55 -310 -87 77 -7 -298
2575 -298 -140 80 -416 223 26 -107 129 243 125 -1 311 255 93 -73 279 -6 -100 -132 64 -213 -114
2596 -114 -289 -241 -79 -66 -46 272 183 62 289 250 298 33 -225 -258 5 63 -66 -189 -174 -155 -242 -103 -238 -134
2620 -134 -36 -37 -108 -109 42 -129 187 -182 91 169 399 283 19 353 -76 -46 79 -106 -237 -140 -192 74 -4 83
2644H3j21o8L49k65J58j27O8j46k53J2L44l1j21J43j86K00J2K4k11J0K52k70J40
2667dJ39J2l16L8M38j82K92k05k21j93M10l03j32J13J31Q5l67L84j18N2j13J40
2689H0j21j18M04j52k58M52k63J59p4l4R2l40p7N16l19l2O8j19n1P5O8R4K88j62
2713A76j22j29J90j95r3O7L76m28q7L46o7q5O3j98O3J09j80J17L9J34j21j47L5
2736a37L68k09j44K62O4j7Q6k85J41j58k07j01J14k89K46J28L49m06k1K51K35
2757B70j16n8J95n09M60j22K04m80K55j11J3J3R4l55K81P5k6j67J29j26M7j04
2779a38K14M1L4j07L1J21m38P21n39L1q2k34K09O1n5J23j54m6K46R0q2J92k33
2802FkM9j15l0J04j35K19k42K16M7j32k96L83l07J89o9K83m26M79l59J53p7J8
$$ plain form
2644 83 -38 -106 243 -22 136 9 77 -69 -322 -310 34 3 -118 25 -161 39 51 75 -136 -126 126 -144 -4
2667 -4 135 147 -169 -131 307 125 417 212 -9 -202 208 -95 -227 -114 17 102 -265 119 1 53 -60 80
2689 80 -41 -159 245 93 -165 287 24 183 109 75 167 -173 -250 266 -53 -85 -17 -136 -187 -112 -44 50 338 176
2713 176 54 -75 115 -80 -173 -106 270 -158 -245 101 34 -51 12 -186 -123 -14 -194 -77 -38 96 -25 -172 -137
2736 -137 231 22 -122 140 204 187 273 -12 129 -29 -236 -337 -223 -512 -266 -138 211 -195 -216 35 270
2757 270 154 96 291 -218 242 120 324 -156 99 -12 1 14 108 -247 34 109 83 -84 45 -81 -34 -138
2779 -138 76 117 151 44 75 196 -242 479 -60 -29 -111 -345 -136 -75 -130 -7 -161 -207 39 129 47 239 6
2802 6 4 53 -62 -92 12 -123 96 -146 70 117 -15 -311 72 -235 -46 -115 168 -258 221 -138 15 -62 -44
2825d4J61m6q8n2L16k95o5K12k94L42j46J03L0k06J59m74L85j03j14J44J37j58
2847i6K99l21J10J42K09j48j8j68r6J85j59k92J86q5M02k64J09k34L53k55M70
2868C29l17p1M14l63J80l80nN07l37m3R1qJ62q2jj56N9k31J98Q6j58L00k2k04
2892e2J06m5L2LK05j30K75n93K43J50j18k02J24l15J92l6J43o4M9m7J56q8j82
2915a94K43n1n7o8K20Q3k51k50N24j00o2m77J06K46j9q4J85j08O6K62k02L3K71
2938C16k01p9N3L18m76J54j44P1o0m8J63l56K55jL4m8p2J34J4J39m53L16K28m38
2962a81L78j08Rj47J08j84Q3Q7r4k80M25k89K00l5L17n34K49K0j94K8K52k7q1
2985BJ6pm4k21M13Q2k25k00L04l81L44m56J82MR8J8K74J06l45K10j19J8M1q1k83
$$ plain form
2825 -44 117 71 -17 -69 247 -48 -113 99 -195 147 1 104 134 -72 87 -387 -2 -105 -219 -75 62 -96
2847 -96 203 -118 -8 134 343 195 177 9 -87 98 -61 -353 -167 -252 150 -114 -5 -239 114 -141 329
2868 329 12 -59 355 -8 172 -208 -213 294 -43 -86 5 -3 159 77 76 -80 -21 -252 -54 32 -126 174 152 -52
2892 -52 54 9 41 44 249 119 394 -199 44 194 76 -126 -2 -317 -125 -161 -18 -82 -33 -80 76 -12 -194
2915 -194 49 -2 -59 -127 93 176 -75 -325 199 99 37 -440 -334 -88 -107 -191 -6 -114 -48 214 12 45 316
2938 316 115 36 89 407 -69 85 -59 12 -48 -96 67 -289 -34 -35 -1 -49 -121 13 27 166 -287 29 257 -181
2962 -181 197 89 98 -49 59 -125 -42 45 -49 -329 96 -193 7 -28 289 -245 4 24 -170 -142 110 83 2
2985 2 18 11 -33 -254 159 241 16 -184 120 -261 83 -373 -191 -187 -89 -71 203 309 -36 174 55 73 114 33 -250
3010b50J79L9Q8j00M8l67L42k69M23l90L62j32j47K38M1j63M0L28k10K16m25K89
3032A80j02r3j40J30J92l82L64j47k55M4j19K73P0j55j28L49J47l09K33L3k2J88
3054C51l95O8L3K4j1o4j53M1J28k40K14J82l25J51J28j22j88K72j39o6j21L96
3076A64p7j0l96M27K5j96p4k7J86J42k91O6J52k0j02O7j57l0L89O8l66k64L76
3099E2J24j88K9K25m67r0L35M6l32K67j45P3O9o0M12l73P0K55m43M6N64n68j56
3122b55N17k27k91K98j03o8k8K14k40n8J39J8n2L8K01L7l29J3K25P2j33J23m6
3145F5k55L24j63j89L19J36m12K16K80l19Q8j64NK56o1j20L20l01J96j52R4q9
3167G4l9j22p5K26p0j27J47J36j00J5J02m24P0J01K56l05J73J71k6k13K88j25
$$ plain form
3010 -250 -71 -32 56 -44 4 -363 -21 -290 133 -257 105 -27 -174 64 105 -58 -18 310 100 316 -109 180
3032 180 78 -15 -155 -25 167 -215 149 2 -253 -209 -328 -55 15 -140 -268 81 228 -81 152 185 163 351
3054 351 -44 24 57 81 70 6 -147 -106 22 -218 -4 178 -147 4 132 10 -178 94 -45 -111 -232 164
3076 164 87 77 -319 108 133 -63 -137 -164 22 164 -127 -61 91 71 -31 36 -121 -151 238 306 -60 -324 52
3099 52 176 -12 17 242 -225 -315 20 66 -266 1 -144 -71 -2 -62 350 -23 47 302 -141 -95 469 -99 -255
3122 -255 262 35 -256 42 -61 -129 -157 57 -183 -241 -102 -84 -136 -98 103 140 -189 -176 49 121 -12 111 65
3145 65 -190 134 -29 -218 101 237 -175 41 321 2 90 -74 -69 187 126 6 326 25 221 69 163 74
3167 74 35 -87 -162 64 -6 -133 14 150 50 65 167 -257 -187 -86 170 -135 38 209 183 -30 258 133
3189A33q0j53J67j35l4K94r3j11n3R3l54K07L09Q4k83o7N8K1L04k76J5m8P6l46
3213b72K08Q4J20k61J84j85Ol5n0K72l4j96J2nJ7K28Jj37L62n23M43j34j94J40
3237E1J09M1k00p8K05Oj02J61l73rj0L91q9M0r3J0K21l79M32O7m60J71n1m8k19
3262b06L45j66j63K51j89j29J63J08j70K76j91J55q1j40L77j64m1q2K06p7n5R
3284C6j46R3p7J76l72j4N19k61J23k37Q9J29O0J06j32oL6j61Pj21R8K48J22k44
3308G1q9O2m1J72l12J62N0Pq9J72l2k27K5L4M7r4r6M44n37J03K37j28J41K7mk35
3334a30j6N04m02J18k89J92orqk8K08M0P0k89K16r7k97M55l85K9Q7k38J54M4p6
3359a53K05j50J56J00j88K2K05m3Q9m00n1J14J64k91J68P6j12O7j42J33p4O4K44
$$ plain form
3189 133 53 -100 67 -68 -102 192 99 -12 -65 28 -326 -119 190 274 -9 -76 -18 3 307 31 46 -2 74 -272
3213 -272 -64 20 140 -121 63 -122 -116 -151 -201 71 37 -159 -147 -152 -135 93 94 -43 319 -204 239 105 -89 51
3237 51 160 201 1 -77 128 134 32 193 -180 -189 -199 192 103 143 50 60 281 -98 334 401 -59 112 61 13 -206
3262 -206 139 -27 -190 61 -128 -257 -94 14 -156 120 -71 84 3 -137 240 76 35 -47 159 82 27 36
3284 36 -110 -17 -94 82 -290 -304 215 -46 77 -160 -71 58 118 224 92 86 122 -39 -32 -153 -55 193 315 71
3308 71 -18 44 3 175 -137 25 75 82 -7 165 133 -94 -69 -35 12 -82 -178 266 -271 -168 69 -59 82 109 105 -130
3334 -130 -146 358 -44 74 -215 -23 -29 -38 -46 -74 134 174 244 -45 171 74 -223 232 -153 -124 -37 -275 -121 -77 -153
3359 -153 52 -98 58 158 -30 -8 197 154 243 -157 -208 -94 70 -221 -53 23 -89 -22 -164 -31 -105 -41 203
3382B03k83j31K15R1J53k62J15N4p3N7l24L83k27k69K95%j79O7L05k81j88R9j98
3405c78L39o9Q1J37l3j27K22j08o7p4K84m50L75k01L8P1K2j45L63k42j97L04j22
3428B3N0j00O3P4rJ2R0j87o8J0J22k12j05K30l53L96J63l37K69l2j74R2LR5J17
3453B32rq4j18j18L46k71L36k20k28O9P2k07n3L82k03l18P7K30K04m9k77L87l31
3476a51L1l4M5L52k85K1j83J30J77Q1j22j42K67j87k92J68l5M00l96K30j51J47
3498G1j62L72m03J06N9J73Q4j96M0p6K08l66N67n56r7QK6J09J64j9m3J44j5j07
3522I1n0r7m9O2L2P5K4J77j96j23o3Q8J8j25J61L5K6k77kJ74M7K35l87J12K01
3547A89m7n04M17K38P2k19k72J98k39J5J48K17m78J97P8j40K90N9j62j50J39k8
$$ plain form
3382 203 -80 -211 4 95 248 -14 101 155 82 139 -185 198 -29 -298 -3 -3 -182 -115 190 -91 -279 -180 -378
3405 -378 -39 -108 -27 110 77 -50 172 64 -3 -77 207 -243 132 -69 -31 40 62 -83 280 38 -159 145 23
3428 23 73 -27 36 110 101 113 203 16 -52 -42 80 -132 -237 -7 -360 36 199 -138 131 99 -75 17 20 115 232
3453 232 223 139 21 -97 249 -22 314 94 -134 -65 7 -200 -253 129 -74 -392 -315 -85 119 70 -207 180 -151
3476 -151 -120 -154 -109 243 -42 -21 -204 -74 103 184 62 -80 187 0 -292 -124 -159 241 -155 75 -76 71
3498 71 -91 281 -122 -16 43 216 300 104 144 68 276 -90 477 -79 -176 -168 -142 -33 131 112 69 213 198 91
3522 91 41 -56 -105 -43 -11 64 88 265 69 -54 -117 -29 -11 -136 25 60 86 -191 -193 -19 28 263 -124 -12 189
3547 189 142 -362 55 293 365 146 -126 72 -167 -152 -4 213 -265 -68 10 -130 160 219 57 -93 46 18
3569A8k49J35K06J2k08K4j06K50K6o2K7k32j2R8n2N6K74j63j48K87l4k8J47l62
3593i6L25j64Q4k57N0L14n5k07j20j12k2J19J97k88J85j7J78j51J87n0j59Rj58
3616b08J88K31l84R5l3L25l26J69j84J8K36k41K48l83L05j6n1j21K97j05o8j61
3638a69K64q0o3oK03O6j92J32m45L80l12R9K65l17J42n6J95j71K3j49R4L47n29
3661b79K79M5k27L19l57J22Q4j53J54O8N3l42K75J1J19j83M4O3l3j00J79k11Q2
3684A2J30j54J61j38J01jN6j49n4J63l04l2P4J82J93k53R3k4k02Q7P5j57Q9q9
3708a41R6K34k20l1q6J33R8j23J0j27J3K64Q1k21j28L25q2n0R8l9M6j69pO1j79
3733a44J49l17L80k68OJ97j97K38j03K15j67j8L10k78l74M96j09j32K09k88K48
$$ plain form
3569 18 -231 -96 110 122 -86 -62 -168 82 108 46 73 -159 -171 -73 -125 -69 205 42 -106 181 147 119 266 -96
3593 -96 229 65 149 -108 -58 256 201 -6 -126 -238 -260 -141 56 -232 -47 -64 114 -37 150 100 -59 -50 -208
3616 -208 -20 211 -173 -78 -111 214 -112 57 -127 -109 127 -114 134 -249 56 40 -11 -132 165 60 -8 -169
3638 -169 95 15 -48 -54 149 215 23 155 -290 90 -222 -123 142 -175 -33 -89 106 -65 -42 -191 -97 250 -279
3661 -279 0 45 -182 137 -220 -98 -14 -167 -13 55 108 -234 41 52 171 -12 32 95 62 -38 141 -70 12
3684 12 142 -12 149 11 112 111 167 18 -36 127 -177 -209 -135 47 240 -13 80 56 -146 -59 16 -141 -52 -141
3708 -141 -45 189 -31 -62 -148 -15 83 -40 -30 -157 -144 120 201 -20 -148 177 95 45 143 104 150 -19 -26 35 -144
3733 -144 5 -312 68 -200 -194 3 -194 44 -59 156 -11 -29 281 3 -371 125 16 -116 93 -195 53
3754E3j73n8LL3j06K69l4N8M7K2r6J50p7j42j6K76m46K02J58J00l43K57j05k69
3778b37L8K49j27Q9R2j64J36j1j66n7K56k00L46j37r2j30mJ98j04j15K82k56j76
3801b90L79Pk13RJ55j6K73j68k01r8K76j86K9j04P4J52M4j41j60M68l23m2P0r
3825a5K04k25K9N8k94J81n7O4J81j73O3j58L38P3m78J57PR6J16j32k32L4K55q2
3849A0p1K05j55q1J38M4o5k27L32m41L05M8K6m17M47j64j9J64R2l0p0m52M08l69
3873c42N26k25p2M05j99j12O7J95l26Q9q7j54R1j34L30L2Pq9l2J12Q4j77Mjl1
3898c9J04j41K19q6J15j22Kp4K66l33J18M3j44K45j70P5k10p6R9j51M49m41J05
3921a47K78P2Jj73O7r3k91K69O2j12J42Rk5k35M36j81l37J2L59L1l55j86K45K19
$$ plain form
3754 53 -120 -178 -175 -142 -248 21 -13 45 92 114 18 168 91 -51 -67 209 -237 -35 123 223 -120 137 32 -237
3778 -237 -199 50 -77 12 104 -60 76 65 -101 -158 98 -102 244 107 15 -115 -119 79 -25 -140 142 -114 -290
3801 -290 89 96 -117 -108 47 31 304 136 -65 -163 113 -73 -44 -148 -74 78 122 -19 -179 289 -34 -76 -6 -15
3825 -15 189 -36 -7 51 -243 -62 -119 -55 126 -47 16 -142 196 269 -209 -52 -45 51 167 35 -197 -163 92 10
3849 10 -61 144 -11 -92 46 90 25 -202 130 -311 -6 42 68 -349 98 -66 -85 79 171 141 71 -381 27 -342
3873 -342 184 -41 -113 292 93 -19 48 243 -83 6 -81 -235 -144 -278 52 84 91 2 -30 82 166 -11 -7 -8 -39
3898 -39 65 -76 143 57 172 50 52 -22 244 -89 29 72 -72 173 3 78 -132 -208 -109 -260 189 -252 -147
3921 -147 131 203 204 31 98 5 -286 -17 45 -67 75 84 59 -176 260 79 -258 -246 113 144 -211 -397 -152 67
3945F7j51j80L48k30L10k08Q6n5K7J03K9j79J62J40K5j82m8K3k66Q2J97jo7k7
3969EM4j31J64O1m17N39k96J41j38j30J43j89m2K81j87K30m15J85K05R1k63J04
3991a5J72l97M59m61K55k9K37l02K83l24K26j25j15J5K5m2J86l97L76j69J09J68
4013A35k20P7J16N0l8r0mk68M01K17n34K69l72K82l4K0J3n9k46J77j3Q9J50J48
4037B66m2j64Rj76N5J51k15l9k01K76j11O9J10L49l03j09J78k25J49nrJ02N8j14
4061E9o0Kj70m9L17j32J3j24J18p5O8k27K74r1j79J58J50j39m6J59R0k48K96j1
4085A53m43J43J36j99L34L3j86J76n7po8n1j64M17m22L78j22k11J88j60j45J25
4107a52J23Q1J05l14K93j61j53J48K05k08o9k02L18p0J48r9J34p7l5P1j30m6q3
$$ plain form
3945 67 -84 -264 84 -146 164 -44 42 -13 14 117 146 -33 129 269 294 112 64 87 -179 -97 100 99 32 5
3969 5 49 -82 82 143 -274 265 -31 110 -28 -158 -15 -204 -246 35 -152 78 -337 -152 53 144 -119 -15
3991 -15 157 -240 219 -242 13 -16 221 -81 202 -122 104 -21 -136 -121 -96 -138 48 -349 27 -142 -33 135
4013 135 -85 -8 108 158 120 30 26 -242 159 376 -158 111 -261 21 -13 7 20 -39 -285 -108 -121 -32 118 266
4037 266 224 60 69 -107 -52 99 -116 -155 -356 -80 -191 -122 -12 337 34 -75 103 -122 27 22 13 115 173 59
4061 59 -1 1 -169 -218 99 -33 -20 -144 -26 -101 -33 -260 14 -77 -256 -98 52 -87 -133 26 116 -132 164 153
4085 153 -290 -147 -11 -210 124 157 -29 147 90 83 15 -36 -200 217 -205 173 51 -160 28 -132 -277 -152
4107 -152 -29 52 157 -157 136 -25 -178 -30 175 -33 -102 -304 14 -56 92 -7 127 50 15 86 -44 -90 -173
4130a73K95q7r1J53j58J51j82J64j45J53j97kmJ11K20p0K4M4K47j56k13K9j16
4153ck05M64j58K21m07L7P1j64K14R3l12j42K13N6k26L47k55M45l55r8K69j22
4175a7J99k27L6J42p8L65l02O5j31k32J03J42k48J60j94J20R5o7J23K08o65J96
4197b07L20Q2l16K2O3NPJ1p8O1q4K25O0j8q2l5j06K45k33L14m00L13l20O8J21
4222C8k00J05J31J03m73M19j36j02j3J98l1O3m05J77R2J88m94L9J04L85j86J07
4244A09o2j61j90K59j57J86j35J07J27k9J94m40K06J20j84P6P1p9q5N9J49q8J88
4267B41l59N9nM3m9j65R8J06r5J90J30j53m6J00j22M5J03j05j05J79j76j36L61
4290A39k11N0k29K55r2J30M6J5k47J79o1j2J60j69R2J15RM3l97J13J80k89J76
$$ plain form
4130 -173 122 35 -56 97 -61 90 -92 72 -73 80 -117 -119 -123 -12 208 138 162 206 453 297 84 113 -3
4153 -3 -208 256 98 319 -88 -51 20 -144 70 163 -149 -291 -78 -22 -248 99 -156 289 -66 -164 105 -17
4175 -17 182 -45 -9 133 55 420 118 183 52 -180 -77 65 -183 -23 -217 -97 -2 -69 54 262 -403 -207
4197 -207 113 195 -121 -99 -36 -31 -24 -13 -91 -30 -114 111 171 153 71 36 -70 175 -58 256 -144 169 -151 -83 38
4222 38 -162 -57 74 177 -296 123 -13 -115 -128 70 39 102 -303 -126 -34 154 -340 -301 -197 188 2 109
4244 109 47 -114 -304 -45 -202 -16 -151 -44 83 54 248 -192 14 134 -50 26 97 18 -67 -8 141 53 241
4267 241 -118 -59 -64 -21 -70 -235 -137 -31 -126 64 194 41 -5 95 -27 18 121 16 -89 90 -86 -222 139
4290 139 -72 -22 -251 4 -88 42 88 103 -144 35 -26 -38 122 -47 45 160 169 212 -185 -72 108 -181 -5
4313ej06J42j94J46J76n26K99L4Q5j91J26j10p8J86K58q3O6j25k17K90l20k6N56
4336C83l15l32J69J91K0l2Lj05K29k65R1k18K65k01J62J15m15L68N2k66j91M62
4358A70m03K08K59r4m6k5j88K29j24q3J75O0m86K09J19P4J08k76M10m48L59k5
4380A82n2j96K07Kl29N45m03J56j18j88J79N2j68K79pL9J58n84N01l91K80m03
4402b59K90k02J65p7J48j64J49k62K74R0j67O1R2o2j01J45j69Q4q3j3Q2o9K66
4425B18O1o80N47j59j84j0M2J14K65l26K0j8K80l22N9J03L4Q3r3m3J97m92J50
4448a54M22l96L0Q0KK72k01P9j29J10k66N6j16j41J66K62k89OJ60J46n2o4J18
4471A01O4n3l28J74K34k2k98K86j36K42m4k34k5K09k53o6K80P3j63k12J44j39
$$ plain form
4313 -5 -111 31 -163 -17 159 -367 -68 -34 51 -140 -14 -124 -202 -16 242 159 225 100 -117 173 -147 -173 383
4336 383 68 -264 -95 96 116 84 87 -18 211 -54 37 -181 84 -117 45 160 -255 113 165 -101 -292 170
4358 170 -233 -25 234 140 94 69 -119 110 -14 -97 78 138 -348 -139 -20 54 162 -114 296 -152 207 182
4380 182 130 -66 141 143 -186 359 -44 112 -6 -194 -15 37 -131 148 141 180 338 -246 255 -136 144 -259
4402 -259 31 -171 -6 -83 65 -99 50 -212 62 152 -15 46 138 76 -25 120 -49 35 -48 -61 21 -48 218
4425 218 279 -401 146 -13 -197 -207 -165 -51 214 -112 -92 -110 170 -152 -93 10 44 127 34 -9 188 -304 -154
4448 -154 268 -128 -98 -18 -16 256 55 134 5 115 -151 -95 -211 -352 -186 76 -213 -207 -47 99 47 -17 101
4471 101 165 112 -216 -42 192 170 -128 158 22 264 220 -14 -39 170 -83 -149 131 204 41 -171 -27 -166
4493a66P9m2J12p6R9r9N0o5K16N8j07j61J45J83n3OJ09l42j39L25j15O7m1k6l50
4518c33L26j89M40j38l99M72L7m46M28k08q0J46O1o5k57M93k28N9k61j05k6L03
4540C0J3k04K52l79K20O4O2p1j55q1K89J71Q7L9j85o2j42K45P9k76j8m9J06k06
4564a71n3M33j69K7J4n8k2Jj0K25l59K56j48r6K06R7l23m9L78k20oP9m50P24j70
4589A36k41N9Pl1K37l51L84p9p2o5o6L04m30k1K81j22J35k14q1K72J34p3k33p0
4613b00J28K33j88M5q4J2o3K54j15k85K79J7j22q7O8K66l35K48j73P7L9M7j62
4636a01J62j03J57L9L3j68j02q1L29k25o1J33k47L40J13k48o7L05j19j36pj35
4658a89%K27j92J20QJ04m9J27l12L44r5l66M49J66k87l3k20J54k09J47Nk7r3J12
$$ plain form
4493 -166 -87 -129 -17 -93 6 -93 -43 -108 108 166 59 -102 43 226 173 179 288 -54 -193 132 17 84 43 17 -333
4518 -333 -7 -196 244 106 -293 179 216 -230 198 -10 -90 56 117 52 -205 288 60 119 -142 -247 -273 30
4540 30 43 -161 91 -288 -68 -4 58 -13 -168 -249 40 211 298 337 152 90 -52 193 272 -4 -22 -71 35 -171
4564 -171 -224 209 40 67 81 23 1 2 -8 217 -142 114 -34 -130 76 173 -150 -199 179 -41 -47 32 -418 306 136
4589 136 -105 -46 -39 -70 167 -184 200 121 49 -16 -82 222 -208 -229 52 -70 65 -149 -230 42 176 103 -130 -200
4613 -200 -72 161 -27 18 -66 -54 -117 137 22 -263 16 33 -89 -176 -108 158 -177 71 -102 -25 14 61 -101
4636 -101 61 -42 115 154 187 19 -83 -164 165 -60 -121 12 -235 105 218 -30 -97 208 89 -47 -54 -189
4658 -189 -189 38 -154 -34 -26 78 29 156 -156 188 93 -273 176 342 55 22 -198 -44 -253 -106 -101 -128 -221 -109
4682a09J9L22k71J11j21l3L4r6K39L0j87j5LK34k03J53k47J50pk99K29O4m5j9
4706f4J76K34l37kk7k52K19K76j90M8rk09m2J56k0o6j47K49j2j91L62o7l7L7K39
4731C24l27J77j12j35J48r4j58O6Q6q8J41l4l2j11J59J48p6k19O0J21l53K47j20
4754a82J27P9k38L76N5m82oL48j85N03l89m4o6P3jN4q8L79l63K21k66j02L8J59
4778@j00K33j20k73M2j7L41l03K31n6L3j52J20R3k47L28j78O9q7j07P4L9J40Q0
4802A83j96q6J97M7j85J68k31p7K12J44l37J90k23J34L04l47J88j39m2j18o6K55
4824b5k09J91J2j65J11o5K87k31J67L2k47J54k1l50N24j91J07O0l40QJ23j83K00
4847e1Q7K4k08M2K57k08k36L16k8R8l43L51j45K67j11J88m50n7L51j90j84K22
$$ plain form
4682 -109 -90 232 -39 72 -49 -82 -48 -144 95 125 -62 -77 -74 160 -43 110 -137 13 6 -293 -64 0 -45 -64
4706 -64 112 346 9 7 -20 -272 -53 223 33 81 72 -137 -179 -23 -43 -109 -256 -7 -19 -210 152 85 48 85 324
4731 324 -3 174 62 -73 75 -19 -177 -111 -25 -113 28 -6 -38 -149 10 158 82 -137 -77 44 -309 -62 -182
4754 -182 -55 24 -214 162 217 -265 -271 77 -108 395 6 -38 -104 -31 -32 22 -66 313 -50 171 -95 -197 -159 0
4778 0 -100 133 13 -260 -218 -235 106 -197 34 -22 11 -141 -21 72 -175 153 -25 44 -43 -150 -76 -37 103 183
4802 183 -13 -99 98 145 -40 128 -103 -180 32 176 -161 29 -194 -60 244 -103 85 -54 -96 -214 -280 -25
4824 -25 -234 -43 -31 -196 -85 -150 137 -94 73 105 -142 12 -9 -359 165 -26 81 141 -199 -191 -68 -251 -51
4847 -51 36 60 -148 -106 151 -57 -293 23 -5 93 -250 101 -44 223 112 300 -150 -207 144 -46 -230 -8
4869hl7N7j95J48k53J48J49L4j11L03j13k85M6k15L19k4J27k19l9J58r5J52J76
4892B23p5j3j97J18O0j07n8k81K2L35k27k1J09L08k55J12o8j13J38q0K60l36P7
4915f9L37o44J01K82k9j23N7K16j49l50J27Q2K2L4l44N50l21K4J36p4N7L86l19
4938a1J12k30N4J33l22K98k49j55M63q0k8l35K11K44n6Nk62L37J8j49j17J58K29
4961B68k85n9j14L73j64j21K59j4k1n7J43k97O1nn2J84j02k96N26j35km7n3k42
4985b52K15j82J57J32K9r6j91M8K92j59P0j35j95J60p0J18K36k07k06K89j01J10
5007F2j86K09J57m39L44j44N2k17J10J11r3k9O5r3p8J61p1J73Q2j86L17j88j52
5030c3J16j15Q9J28j70l5K9r6L9l9K58j68k08L7J43M8M3k4K71l07n0j9P7j21J25
$$ plain form
4869 -8 -45 12 -183 -35 -288 -140 9 43 -68 235 122 -163 -117 -332 -13 -37 90 -129 -168 -10 -105 47 223
4892 223 148 135 -62 56 116 9 -49 -330 -308 27 -200 -221 -112 196 -59 53 -15 -128 10 -70 190 -146 -69
4915 -69 268 -376 -275 7 -22 -145 -88 128 -21 -371 -244 -162 -140 -106 -450 100 -221 -197 -61 -135 -78 308 -11
4938 -11 101 -129 -75 58 -264 34 -215 -370 93 13 -15 -350 -139 105 49 54 -208 129 147 -2 -119 39 268
4961 268 -17 -76 -190 183 19 -102 157 143 122 65 208 -89 -28 -33 -85 99 -3 -299 227 92 90 43 -10 -252
4985 -252 -37 -219 -62 70 99 3 -188 -140 152 -7 63 -72 -267 -107 -177 -59 177 -30 -236 53 -48 62
5007 62 -124 85 242 -197 147 3 55 -162 -52 59 -34 -63 2 -91 -169 -8 -79 94 176 -10 307 119 -33
5030 -33 83 -32 57 185 15 -20 9 -87 -48 -87 171 3 -205 -168 -25 23 66 42 313 6 -44 -63 14 -107 18
5055A8m5l63K12N7J88j32j71L15j17n5jJ16M1p6J83j6k88K53j32o5p2n7L25K5
5079A43k36J32O9N8k52J68p4J56j75j80L61l23J24P4k95L30k39J84K4K00k83J32
5101I8K58l37J09j02Q9k33R4k5j9J28J60l99K52j49k5n8J33j61K8k4J96p4K1J44
5125A04m1k03n1L26k64K73j49j60P5L11l14j11k0N01k15J40j02j80K6J9k45J4
5147b66N5J83J27l03L8L81n9J00p3q5Q4K83m72q2K05j8l09M33n43K09J69j62M5
5170f0K76k29K05j57M2K3j25J7j6Q8r8J18p0L3q4O6j3L0j55K21k69J38J12k58
5194a65m7Q1K46k76K95j20J51j43j01L80k20J95k32q4l5O7J91J44m67M2j83J80
5216a01j6J66k59m2L42q0J18j08Q6q3n6K97j92j69K55k86k2L35j09n2j47o7J25
$$ plain form
5055 18 -27 -390 -178 -121 67 -65 -236 79 -38 -93 -94 22 63 -13 170 154 -134 119 -13 -78 -150 -207 118 143
5079 143 -93 39 108 166 -86 82 8 164 -11 -191 170 -153 -29 45 -250 80 -159 25 49 249 -34 98
5101 98 356 19 128 26 115 -118 -24 -49 -68 60 220 -179 73 -76 -101 -159 -26 -187 -159 -183 13 -61 -40 104
5125 104 63 -140 -191 135 -129 144 -5 -165 -90 221 -93 -204 -224 277 62 202 100 -80 -54 -35 -280 -266
5147 -266 -211 -28 99 -204 -166 215 156 256 183 98 182 465 -7 -89 116 98 -211 222 -321 -112 57 -105 -60
5170 -60 216 -13 192 35 77 100 -25 -8 -24 64 -34 84 14 47 -37 29 16 46 -109 112 -157 -19 93 -165
5194 -165 -212 -131 115 -161 134 14 165 22 -79 301 81 276 44 -40 -75 -8 183 327 -140 -98 -281 -101
5216 -101 -117 49 -210 -252 90 10 128 20 106 23 -33 264 72 -97 158 -128 -150 185 76 24 -123 -190 -65
5239f5K82k12N7J20l10PJ98j06P8p5k15J72j95J24P1Q9l30J67J10L3J10j22j5
5262b7k09K66j00N1L1m9m1j60N59p3l80J55J77j14J66qj85j29J03R6k81J2J38
5285bQ4k77J69J29j02j88O1J60n9K25r4P9j60l52K06K44P0j65k8J4p1K58j35r4
5309b8k50K72l25L06J66j96m5L06o9m41K19K78p4n3J60l72O5j2q1L93j88j44j3
5332a26N8L14j08j10j87K51j27K66k57P6k26M45m28LM44m98j0L76k99K56j75K99
5354B37m05K20J87m43K24j19J24J5j18J53k66K6P8J86r7P7j4k31K3K40J52j43
5376A06k59j21M84k42J1p8J2N5l1J73j29k32K62k10J03J7K20J12l7j87j30K02
5398A01p4J0k90J66K21j19k16J62j05k35M15J48l33K90r6k25L09j55K3N1j82J76
$$ plain form
5239 -65 217 5 62 182 -128 -121 77 -29 49 -26 -241 -69 -264 -140 -69 20 -310 -143 -33 0 110 -12 -27
5262 -27 -236 30 -70 -19 12 -37 -78 -238 321 248 -132 23 200 86 252 244 59 -70 33 129 -152 -140 -2
5285 -2 82 -195 -26 103 1 -187 -126 34 -25 200 106 185 25 -327 -121 123 193 28 0 14 -57 201 66 -28
5309 -28 -278 -6 -331 -25 141 -55 -100 206 137 -304 -85 193 119 66 226 -146 -81 -93 -174 219 31 -113 -126
5332 -126 -68 246 138 28 -159 92 -35 231 -26 50 -176 269 -159 -156 288 -210 -220 156 -143 113 -62 237
5354 237 -168 52 239 -204 20 -99 25 40 -78 75 -191 -165 -87 99 2 79 65 -166 -143 97 249 106
5376 106 -153 -274 210 -32 -21 -99 -87 -32 -63 110 -19 -251 11 -199 -96 -79 141 253 216 29 -101 101
5398 101 27 37 -253 -87 134 15 -201 -39 -144 -379 36 184 -149 141 45 -180 129 -26 -3 48 -134 42
5420D2J55l69J90m1Nj17J81l24J46J5J73j75K26r6k9R9OK1k62n2K53n1j66K66
5444I6n6l6o2K22k27J40j68J58J17m56K25k16R2JJ79O1J09l37M5K34l45J26K38
5467A40M9j88M7R4j22J58l42L22r7j81K65lk60NJ9j92O98n64K60j87K23j17J21
5490A48j32j22J23R1n5J04j79O6o2j12n9K53j37K06k39M8J91J3r2k30K59J41m91
5513b67J18M04l66P2J1M44n01J21j77L79l56M22k1n15J26K16k5J65l59L24l09
5534i4L57j88j97J85k40K75N8k14L73k20l91J43L05M6j06j24K2N0M7j49k25M51
5556A64k98K00K24l15J1j99L63j83J21k40l0n5L54l59K02J54j21k25P7R1J99j75
5578d0J49k23J15R3r7K02m05K62k8l3L0J99l90J8K08j27J44k6n8Jk5j19J52O6
$$ plain form
5420 42 197 -172 18 -23 -18 -135 46 -278 -132 -117 56 -119 107 11 -18 81 87 108 -154 -206 47 -4 -170 96
5444 96 40 4 -58 164 -63 77 -91 67 184 -272 -47 -263 -171 -170 9 70 179 -158 -113 121 -224 -98 140
5467 140 189 1 48 142 20 178 -164 158 61 -120 145 142 -118 -113 -94 -286 412 -152 108 -79 144 27 148
5490 148 16 -106 17 108 53 157 -22 44 -18 -130 -189 64 -73 133 -106 -58 133 146 54 -176 83 224 -267
5513 -267 -149 255 -111 -39 -28 416 -85 36 -141 238 -118 304 283 -232 -106 110 85 250 -109 215 -94
5534 -94 263 75 -122 63 -177 98 156 -58 315 95 -296 -153 152 198 92 -32 -10 40 87 -62 -287 164
5556 164 -134 66 290 -25 -14 -213 150 -33 88 -152 -182 -237 117 -242 -40 114 -7 -232 -155 -64 135 -40
5578 -40 109 -114 1 94 -3 199 -206 56 28 -5 25 224 -166 -148 60 -67 77 51 -7 -6 -31 -150 2 68
5602F8Q0j03r5j28m0R9J00j9J0O3J4j13J41j99m5L48j78q9J47J78l31Q3j33p2
5626b14L87j04o4n1K89k32N5j45m5K31m9J76j11l18M20l98M5L38k5l17p0K43j57
5649a16K20oj0O2p7j14m5j4J82j79K5j24J28l91M59j98K42L63m54j54k25N17o6
5672B5N9n9k40L52k02k8L06K05l38p0j2p6J01oj46J59K4l87K44O1LJ67J69k42
5696F9Lj80j00j14M36L1j39O4k10J71j82N8K33k43k87M03q6l75M96J92J58l20
5718G8k93K47k40J87j2J57j69R7k8J2p7k9j11J75j88M13l6l09k5J19r3k9J48j21
5742a27J11J23Mk47K73k75o7K98J78l58P8L45m37n1J35j45L69k07r6J3jk5K0l
5766i2L20n4qm33L32M6p4r2J09j37m8J34o5J20k41K28k88K29L75j09k86j4o7M6
$$ plain form
5602 68 148 45 -50 -178 -218 -119 -19 -38 -28 35 49 -64 77 -122 -167 181 3 -86 61 239 -92 -9 -142 -214
5626 -214 173 69 5 -46 243 11 66 -79 -124 107 58 234 123 -195 225 -173 -128 210 185 -132 -202 41 -116
5649 -116 104 98 88 150 73 -41 -86 -100 82 -97 -72 -196 -68 -459 0 -198 44 407 -47 -201 -426 91 25
5672 25 84 25 -215 137 -65 -93 213 418 80 10 -2 -78 23 17 -129 30 54 -333 -89 -28 -25 142 311 69
5696 69 72 -108 -208 -322 114 145 6 70 -140 31 -151 -93 140 -103 -390 13 -73 -448 48 240 398 78
5718 78 -215 32 -208 -21 -33 124 -45 52 24 36 -41 -70 -181 -6 -194 219 183 -126 -151 -32 -125 -154 -6 -127
5742 -127 -16 107 111 -136 137 -138 -205 93 271 -87 -9 336 -101 -152 -17 -162 207 0 -96 -83 -84 -109 -89 -92
5766 -92 228 174 166 -267 65 111 37 -55 54 -83 -131 3 -62 58 -183 45 -243 -14 361 252 -34 -48 -115 -69
5790f9n9j56M55q7j25K60k02k05L04K29m04J06p0j6K26r8j55J18m6J01q0l3J38
5813A32r5L6l32N07j82l66L70j29m5J21k70J74K94k11LJ77n3k93J82k12L67j40
5835C5k47L50j59J04l05K90k08j83K02M8J25J53l69R8J39l23K30r4M5L52k69O8
5857H2l23M20n27N11l15J12j21K05j1j9k48L82m1k8k22p7L41j5j67J83j86m7J10
5880ao4L5jK26k40J00m0J39m7j19j70J44L7p4J8N1k2L59j65L9k29j87P2K39k84
5905a84J16N3j25j06L72j86P0l1r0J79r0j88J86j30J82J11j63L4R2K6k7J0P1q2
5929A00j23o7K19K88l95J79k54J53j72n6M06l91o2L1j19L01j12K15l19M35k7j00
5951A30O9l94O2J9K30k35K27m9R5l14j6K33J4k0r0j49K02l07Q2J08K37l27J33
$$ plain form
5790 -69 -128 -284 171 84 -41 219 17 -188 116 345 -59 47 -23 -39 187 89 -66 52 6 107 27 -6 132
5813 132 37 73 -259 248 66 -300 70 -59 -104 17 -253 -79 215 4 7 184 131 -162 20 -192 175 35
5835 35 -212 138 -21 83 -222 68 -140 -323 -121 -73 52 205 -164 -66 73 -250 -20 -114 -69 283 14 82
5857 82 -241 179 -348 163 -152 -40 -161 44 33 14 -234 148 107 79 -143 -220 121 106 -61 122 -64 -111 -1
5880 -1 -65 -30 -31 195 -45 55 15 154 107 -12 -182 -38 -1 -75 -57 -6 -28 331 166 205 -24 -211 -139 100 -184
5905 -184 -68 -15 -140 -246 126 -60 10 -21 -111 68 -22 -210 -24 -154 28 139 -24 10 102 128 101 111 182 100
5929 100 -23 -90 129 417 22 201 -53 100 -72 -128 278 -113 -175 -144 -263 38 -74 141 -178 257 230 130
5951 130 199 -195 -133 -114 116 -119 108 59 154 -160 -176 57 71 51 -39 -188 14 -293 -211 -103 134 -193 -60
5974f0p2J85l6j92M3J10j6J17J49m28l4K38J16j20J44q5J2j1j53K46j48L0l9p8
5998h2R1j12k03L77p3R0q2J09J76l81J19Q0J55j52n27L33Q8L1j29L2P6j43L60
6021B33j82j6O4k71K42l18L20j9J52p5m1N2k41J74J03j1k23q7Q3K54l02p6K51
6044F6j06k01J02K07q8P9P0j31j70N48n12K55p4j81K7K9K37k18J98o8m7M53l05
6067A70M3k51p3L92k97J26l5r1r4K01K63k64j16j4J11j21J43p2m9R1N5k21j51
6090b54K17r8P8J25J60r5n3k3j50l7J20Q9j37R9j12Q9L6J50l76l8J67j06L20j08
6114F3j18q9J68K04p6j90O1J6m9r2J74m8NJ16k76J4n3J82o8J43l29M5K50j51J73
6139G5j68p9Q2p3J09J64k54K13P1j58j61K48j90R3o9M9K55l18J57OJ11p5m0R5
$$ plain form
5974 -60 -132 53 17 -175 -132 -22 -38 79 228 -200 -234 4 120 0 144 59 71 60 -93 153 5 35 -4 -82
5998 -82 9 -103 -306 71 -2 88 6 115 291 -90 29 109 264 112 -415 -82 6 37 -92 -60 16 -127 233
6021 233 51 35 99 -172 70 -248 72 53 205 130 89 141 -100 74 177 166 -57 -144 -61 193 -109 -185 66
6044 66 -40 -241 -139 68 -20 59 129 -2 -172 376 -136 119 45 -136 -109 -80 157 -61 137 69 22 475 170
6067 170 213 -38 -111 281 -16 110 75 -16 -110 91 354 90 -26 -40 71 -50 93 21 -28 63 118 -103 -254
6090 -254 -37 -135 -57 68 228 133 80 57 -93 -130 -10 79 -58 41 -71 18 54 204 -172 -210 -43 -149 171 63
6114 63 -55 -144 24 228 152 -38 23 39 -10 -102 72 24 29 145 -131 -117 -170 12 -56 87 -242 -197 53 -98 75
6139 75 -93 -172 -90 -163 -54 110 -144 69 140 -18 -179 69 -121 -28 -97 -48 207 -111 46 52 163 88 48 143
6163A43k86L05k23J67L2j55P3J45j44J58l65K38k71K58l3j49L85n37L97j7l59
6184b38L40l71J84j13K08n1O4K13k42J46m59q6K10L08p4K09k17p9K22p6n3L3J21
6207A99k90K3K98j4k06K22k75N1l51L43q4K59j54p3J88m8j87r4J40l8L19k56j07
6230a35N82l24k64J06J4l9j14K34%R1r2j7%k02J32J23R2l02J57n0j54K19K65j12
6254B10j97k2k4PJ6n7K6K83k28Q2j74p4J05J72J06j40j54O4j95O2J31m0n1J55
6278F3Pk00J45l01J48l1j22K99p8K15k18J14J30j56j15K0L53J16l87Q8l73L71
6300H8l6l20J84KK43j23j92J45K4k30J62J08O4j30K8M3j43J45R5j98n5R1J52q2
6324F5j67j2K72j62k7L31l77J49l06J78L7j02K13r7j89K09j16K41r4K01l47Q0
$$ plain form
6163 143 -143 162 -61 106 138 -17 56 201 57 215 -150 88 -183 75 42 -107 278 -259 138 121 -238
6184 -238 102 -269 -85 -198 10 -41 23 236 -6 140 -319 -405 -195 113 39 248 31 -48 174 98 45 78 199
6207 199 -91 -68 230 216 10 232 -43 8 -343 0 -84 175 21 -52 136 88 -99 -193 -53 -91 228 -28 -135
6230 -135 447 123 -141 -35 -21 -60 -174 60 60 151 59 42 42 -160 -28 95 187 -115 42 -8 -162 57 322 210
6254 210 13 -9 -33 -26 -10 -67 -41 242 14 96 -78 -152 -47 125 231 91 -63 1 -194 -132 -1 -41 -92 63
6278 63 70 -130 15 -286 -138 -169 -291 8 -70 145 -73 41 171 15 -100 -80 273 389 2 90 -283 88
6300 88 52 -268 -84 -82 161 38 -154 -9 15 -215 -53 55 119 -11 17 60 -83 62 157 -41 -96 -5 147 65
6324 65 -102 -114 158 -4 -31 300 -77 72 -234 -56 -19 -121 92 -5 -194 15 -101 140 46 247 -100 -20
6346b0j87J91J34j21po8j53L91j11j18J85k11M06j74n1J8r8j82k27L15K23j0k81
6369a56r4J81q9J97k17L69k80J46l03K7j23J72J17r4J8J65J90k76R3k17L07m13
6391b80J44J7L37k98J27K77l12J15j76Q2j54K64l1p1m7k15K70j34q8O8J39k58
6413b24K84j74n4J01N2K18k57K2J28j6PJ2l99L27J27n5m8J29Q3k82Q4J58l57J80
6437D6j40P2J12O5j76k46K40J26jj6l54L58R6j83j47J45l5j10K10l6j3j70J64
6460GL47k33j49K93k67J60O3k33q6P9J02M5j17K50j16k84K78r0m9Kq8r6J16J19
6484E3j59M3J22j01o6J40J08m93K21Q2j25RQ4j51L05j27j41L62j30j19J6J77j39
6507b9OJ58m01J59N4M45l08Qj66K73k18m37N64o1M8l90K61J0J78Mp2j04q7j10
$$ plain form
6346 -20 -207 -16 118 -3 -10 -78 -231 160 49 -69 116 -95 311 137 86 104 6 -176 -403 -88 135 125 -156
6369 -156 -250 -69 -158 39 -178 191 -89 57 -246 -219 -342 -170 -53 -147 -129 36 226 -50 43 -174 133 -280
6391 -280 -136 -119 218 -80 47 324 12 127 -49 33 -121 143 112 41 -6 -221 49 -85 -173 -105 34 -224
6413 -224 60 -114 -168 -67 -15 203 -54 -32 96 80 87 99 -300 27 154 99 51 180 263 -19 65 223 -134 46
6437 46 -94 -22 90 155 -21 -267 -27 99 98 82 -272 86 182 -1 -148 -3 -38 -148 62 26 13 -157 7
6460 7 354 121 -28 265 -2 158 221 -12 -98 -19 83 128 11 261 145 -139 139 49 0 2 -86 -182 -66 53
6484 53 -106 -63 59 -42 -108 32 140 -353 -132 -50 -175 -166 -82 -233 72 -55 -196 166 36 -83 -67 110 -29
6507 -29 -23 135 -266 -107 -53 392 84 92 -74 199 -19 -456 108 47 95 -295 -34 -24 154 158 86 -18 -105 -215
6531b15J56k2n5J82j05P5k27M61j95p5j08p3K96l38L45j25K1j9j17q5Q5K88k66
6554a16n5J19L51r9k6l66J96J12j16n6K2P3J63o36L67j48J23M2J70j75k19J79
6576i5k0K29k56R9l1O3j33K75k17j26N6p8Po6L53k61J28K03j90K88l87k3K72R
6600I9j85j11k4O6j2J07k89K93KK19J35m32L46o2k8K1k13J57m4j5m7k37K1K7J62
6625d4P8K1k05K09K8o0L9l7n3K12O3k33K63j51k20J06q0K5j08r5K61j14j87J30
6649a52M9L8K9k3R1M4P9j51Q2L9o5OL6l36RK38k0R9k77J63j24J12j54P4J57m1
6675Bq6m2L6K90k96K56j21j17K82j55lK4r0O0Q1k89L35k22J33R0j93J26j73J39
6699F7j39R3K2M8J53k8p7k66K46m30J62K22L4j62j68L20k67J4M2K3O2Q0M3j84
$$ plain form
6531 -215 -59 -81 -136 46 -59 16 -211 250 55 -20 -128 -201 95 -243 102 -23 -2 -21 -138 -223 -138 150 -116
6554 -116 -171 -52 299 200 174 -192 4 116 0 -56 -34 39 202 -434 -67 -215 -92 -50 120 -55 -274 -95
6576 -95 -115 114 -142 -43 -74 -11 -144 131 -86 -212 -156 -234 -227 -293 60 -201 -73 130 -60 228 -159 -182 90 99
6600 99 -86 -197 -221 -155 -167 -60 -349 -56 -54 165 300 -132 214 152 124 145 -68 89 45 30 -17 -254 -233 -206 -44
6625 -44 34 55 -150 59 87 27 66 29 -24 188 251 18 281 130 -90 16 -64 -39 -147 -242 19 -95 -282 -152
6649 -152 -103 -65 -36 -59 32 76 155 4 86 125 60 66 102 -234 -225 13 -7 92 -185 -22 -146 -34 -188 -114 43 2
6675 2 -84 -126 -90 200 -96 160 39 -78 204 49 46 70 -20 40 121 -168 167 -55 78 168 -25 101 -72 67
6699 67 -72 21 43 91 244 216 139 -127 119 -311 -149 73 107 -55 -223 97 -170 -156 -114 -91 -29 51 94 -90
6723i0K95k13m4N1J83j60Q7Qk43l7J93Rj37L04N0l09Q5r0J53k86N5J85j06k8M6
6748c9j51J40R3j30mkL8k8o8J65p6K84M6m72r6M74k12R7p8J74j21N6j1m6j97j29
6774b93J59q9M83r2k52K40l26J11r7J47N0k65M94n6j90N8r6M6O0j17j59J71J55
6797A42m60O7K75j35K69J6o8j21p2J94k0J10l49N0J49j78Q6m3J18k34K69J07k31
6820e9K52n9L0j82K46j25n6P1j56O0P6j37oPJ27J48q7m57L99k64N1L02k03O6J53
6845A97j5k77j52J28N3j28J03K55l47L12J9J5k24M27k56r1j13J10j28K20J13n02
6867b81K97K25k37K1N2j10l7k8K80k20j54P1L16l15K77k23n7K62j2k69J34j00
6889a08j02K33J36m78K02K16l31L04k29K42J63k63O6j37R1rk73J86K10j36j21
$$ plain form
6723 -90 205 -8 -52 -1 182 22 109 117 -126 -163 30 39 -98 206 256 -53 32 -58 95 -191 -136 49 -57 -85 -39
6748 -39 -190 -50 43 -87 -91 -93 -55 -83 -151 14 -62 222 268 -204 -300 174 -38 59 -19 155 34 90 79 33 -164 -293
6774 -293 -134 -223 260 168 -84 156 -170 -59 -156 -9 41 -224 270 214 24 82 -14 32 92 -25 -184 -13 142
6797 142 -318 -251 24 -111 158 174 106 -15 -87 107 87 197 -152 -102 47 -131 -45 -88 30 -204 65 172 -59
6820 -59 193 134 164 -18 228 103 47 118 -38 22 98 -39 -45 -38 89 237 150 -307 92 -172 -121 181 -22 44 197
6845 197 182 -95 -247 -119 -66 -194 -91 164 -183 129 148 163 -61 366 110 19 -94 16 -112 108 221 -281
6867 -281 16 241 4 25 77 -33 -70 -98 182 -38 -192 -121 195 -120 157 -66 -123 139 127 -142 -8 -108
6889 -108 -210 23 159 -319 -117 99 -232 72 -157 85 248 -15 51 -86 5 -4 -277 -91 119 -17 -138
6910a38R7k08J56M26l41r7J01K89l47N7J92l3O4j15j73j40J71N9j62P4K27m89
6932c30N03k81J19j53J61m9o3k8M9j21K9L66j7k2M7l2k00j84J55K73k93l8L52
6955B43k29k20K11L0k07K02K3k33N3K44j77J02k3m2K48l46O5J68j89j59L99l40
6977a77L83j78j51K54k7j63JlK36k58R4k52K26L0J35R2j25P6r5j72m9J11J02q6
7001Dj56qJ11L2J13Q9j54M9m7N3j07k2O6n7M3L00m19j12L19o9k48J60K60j47m
7026D9M1j04j95M36j67m9R4k80J39J73l1l5j83l3p6K03m2K17J5j95K34k04m5j39
7050a77L06m10J67o0L17o10K40J92J40k79L45p5k04O3R1m09L64r8K9J45R4r3j86
7073a08N3O8J21j94oJ25q4J44Kp4P1m4k1j06R7J62j47r4M98p74M40L7k64L7J67
$$ plain form
6910 -138 -41 -249 -93 333 -8 -105 -4 285 -62 -5 187 154 218 103 -70 -210 -39 20 -142 -68 159 -330
6932 -330 173 -108 11 -142 19 -30 -93 -121 -72 -193 -164 202 185 163 210 178 -22 -206 -51 222 -71 -109 243
6955 243 14 -206 5 35 -172 30 53 -180 -127 117 -60 42 19 -23 225 -121 -56 112 -77 -236 163 -177
6977 -177 206 28 -123 131 104 -59 -58 -61 175 -83 11 -241 -15 15 150 242 117 193 98 -74 -123 -12 90 4
7001 4 -152 -160 -49 -17 96 185 31 80 33 86 -21 -43 23 -34 9 309 -110 -222 97 28 -220 -60 200 53 49
7026 49 90 -14 -209 227 60 11 105 -175 -36 137 106 71 -112 -145 -221 -18 -60 157 172 -23 211 7 -38 -177
7050 -177 129 -281 -114 -174 143 -467 -227 -35 105 -174 171 96 -108 -45 46 -363 1 -97 -68 77 171 78 -108
7073 -108 -55 13 134 -60 -66 59 -25 119 121 47 118 74 53 -53 44 206 59 -35 463 -311 129 166 -98 -61 106
7098A06j99L19n86J76L05j87oJ41K8j07l0r0J24N6k2j51K88p3k6p3k47P2q4K87
7122B1L7J29k81K27l94M51k89K28J28l85J9r1J41L4K96n1l14K13J3k35M40k78
7144E9o4m1l3J06j29J98k43N2K71J13j44Q5l40K44k24L54k01j7M17n82J95J33
7166B09j24k54M2J2M1k96K48K10Oj77k0Q6L6J3m4J01j38n3J44K9j39L9Rj17M34
7191B97m09K58k32J50j12R7k77K09o7n4J3J31L1L39m50K67k41jP0j64R6M2K79
7214B72j11j95J64k47J2LK23J93k44J86k58q8K17J89l20q1K9j65K08J42j76O9
7236B2j01N4k02K62j80M5J28j29K6n3J42L3j65r9P8J78J65k92J87j44r2J70m0
7259gp7j81P5L80j22j09k2L41k04p0K5lJ38j7k14J70J81r2k20J31j41Q6j11O8
$$ plain form
7098 106 -93 226 -360 -184 121 -66 -72 69 97 -10 -40 -130 -6 50 28 -123 165 92 66 -7 -254 -182 -266 21
7122 21 58 187 -94 133 -261 190 -99 129 257 -128 -109 -200 -59 -25 271 220 -94 119 132 -103 337 59
7144 59 -5 -46 -79 27 -102 96 -147 -95 176 289 145 230 -110 134 -90 264 63 46 463 -119 76 209
7166 209 85 -169 -127 -115 -74 -370 -122 88 94 -83 -103 -17 19 32 -12 89 -49 -102 42 71 -68 -29 -20 -137 297
7191 297 -112 146 -86 64 -48 49 -228 -19 -86 -140 -127 4 35 374 -76 191 -50 -51 19 -145 -49 -7 272
7214 272 161 -34 130 -117 -105 -102 121 314 70 256 -2 -90 127 316 -4 -85 -56 -221 -13 129 -47 22
7236 22 -79 -25 -227 35 -145 -100 28 -101 -75 -128 14 47 -118 -217 -139 39 204 -88 99 -45 -137 33 -7
7259 -7 -84 -265 -190 190 68 -41 -63 278 74 4 29 26 164 147 -67 103 284 192 -28 103 -38 48 -63 5
7283EK32j48k04J5K37j67JK01j92n2J07qr4l09M46J8j35J49j43jJ12q6M6j65J14
7308b1Q7j52o7L53k92J01J33O6k16m8Q2r8N1N6j38K50k84n7J5J82j58J58j22K61
7332A42l26R8p1K32k09J80l5R7j89j65J65K59r2R4k0j37j04k27Q6J61pJ47k8Q0
7356A31J49m27Q7j8PL6j8N1n2R0qk01J02J09o3k79K34R7j89J31J69m38K84Q3m67
7381d00L92J92l52L15l61L32J64m29J08J26Jm32K54J21K43m04L15n3k26J44n0
7402@j22J36k99L00j59K15k43K28Q1mk95J34J73j28N8k07j43M32J1k69J67R5l41
7425a80J50J45J13j17j85j00K33j39j55J86kJ56J57m83L33j74J53K23k52k2L4
7446G4M8j83K2o4R1J83p0m8l26J73L10l89J51P8k78J08j57J52J71n3m9P7j45K37
$$ plain form
7283 5 237 89 -115 -100 137 -30 -29 172 -20 -72 35 27 -67 -376 70 88 -47 102 -41 -42 70 -16 30 -135 -21
7308 -21 66 -86 -153 200 -92 9 142 208 -8 -56 26 -72 -21 35 -103 147 -137 -194 -179 3 -155 3 -119 142
7332 142 -184 -86 -157 75 -134 46 11 108 -81 -246 -81 178 86 180 160 23 -81 -308 -222 -61 -68 79 51 131
7356 131 280 -147 -60 -78 -71 -35 -53 -2 -54 36 28 -173 -71 38 -25 -304 -70 27 -162 -31 138 -300 -16 67 -400
7381 -400 -8 184 -168 147 -214 118 282 -147 -39 87 88 -344 -90 31 274 -130 185 132 -94 50 0
7402 0 -122 14 -285 15 -144 71 -172 56 137 133 -162 -28 145 17 75 -132 -275 157 168 -101 66 161 -180
7425 -180 -30 115 228 111 -74 -174 59 -80 -235 -49 -51 105 262 -221 112 -62 91 314 62 40 74
7446 74 122 -61 -39 -103 -12 171 101 53 -273 -100 210 -179 -28 50 -228 -120 -277 -125 46 -7 -56 21 -124 113
7470A13J42j08M6j15m5o5K62j90m02K80m4L83l69K75j61K95l2m01J09j1J76m8
7492I0p8O9rj71Q2K18j40L8o2M3q7J21q3j93J2N0M3j59K85r3j3K4p5M19l89p1
7518a29K10J71k27K4n7k36L11q0J88N8j65j71Q0L64k61L6k98L76p7q8P5l58L22
7541F8K3Q5j04j87l3o7K76o6j79K28N2L7q4j0p7J22K4k97J16J46m01L05N1Mj14
7566h2l4K95j67oq0J51Kj12J22k10J4L11j44J08k23l4L73k91k2k6k54M23L4k63
7590a15J02j67L17k89K18L6l32K95n8j40Q4j3J21j05r0P8J03q1J20l3l00J90N2
7613gr3m0R2j0K23k40o5K60J70l03j1n9P0J60j02p2q4K17j44J89j55j9j38J28
7637c3n9Q5m7q3R2J39N3M1l24m2L14l44j19N43k35J43K41o09J33K35rj05k7N2
$$ plain form
7470 113 255 147 193 78 33 -32 230 40 -362 -82 -126 257 -112 163 2 297 265 -136 -27 -38 138 90
7492 90 12 81 72 -99 -17 201 61 99 37 80 -7 114 31 -162 -150 -100 -57 -216 69 -24 -37 -13 -88 331 -58 -129
7518 -129 81 252 25 49 -8 -244 67 -13 175 233 68 -103 -23 341 80 116 -182 194 117 29 104 -254 68
7541 68 91 176 72 -115 -148 -215 61 -5 -184 44 96 133 49 39 -38 84 108 -189 -73 73 -328 -23 28 32 -82
7566 -82 -116 179 12 6 -74 77 79 -33 89 -121 -107 204 60 168 -55 -89 284 -7 -29 -55 -309 114 148 -115
7590 -115 -13 -180 137 -152 66 102 -230 65 7 -133 -49 -62 59 -46 -136 -58 45 -36 84 51 -249 -59 -7
7613 -7 -100 -140 -48 -58 165 -75 -140 120 290 -13 -24 -83 -13 147 45 -27 -111 106 -38 151 -4 -23 -161 -33
7637 -33 -92 -7 -54 -137 -45 94 147 188 -136 -178 136 -208 -327 216 -19 124 365 -244 -111 124 115 10 -17 35
7661C5q7J84P5k31P6l83L29k39R6Q7o7J46J10j66pl8j47J12J04K4M8j37K07j40
7685ik98L79J17j95j16J62k11K38R3k67j8Q5j11RL18k18K42l12Kk98L51M9k72
7708b80K19j80J97K32l02Q3Q2N7p3k03J17J53Q8j68M7L3j91J48P4j28K51o6k30
7731d0Q2k8K3k59J08K6N4K05k49L19l41J4J99j11k84L05L15k07l20N3J20M6o3
7754c3J46K4j07K91m91R5L7PJ3l6o7K7n4J85l13K79j2j73K43l10J24L51j28K97
7778C95k87Kr5j18K01p3n1J64j09j84J38R3j45M7nK21j27p9n2K70k87P3kJ22k31
7803a19L06l12K67O0j2p9k1J78k57J72j52j13Po1R0J73k29L5P0K8J94l04M0n9
7827i8J20l26M31j91OKj20J49J22o2R9Jl34L27j96J15p3K32k55Q3j48K42k74K52
$$ plain form
7661 35 -52 132 207 -24 52 -331 -2 -241 -145 -58 -125 21 131 -35 -42 -80 -227 -115 -11 13 61 -76 131 -9
7685 -9 -307 72 189 -6 -122 40 -171 67 160 -107 -125 -40 -151 -142 176 -42 200 -112 -110 -408 -57 -8 -280
7708 -280 -61 -241 -44 188 -114 -31 51 108 35 -168 -51 102 190 22 69 102 -89 59 133 5 256 190 -40
7731 -40 42 14 37 -222 -114 -88 -34 171 -78 241 -100 -86 113 2 -282 23 338 131 -189 -136 -16 30 -33
7754 -33 113 137 30 321 -170 -75 -38 -31 -18 -54 -121 -94 -148 37 -276 3 -9 -182 61 -249 -125 226 98 395
7778 395 108 110 15 -103 98 25 -26 138 29 -155 -17 76 -69 -22 -27 194 67 -12 -64 206 -81 -8 -10 112 -119
7803 -119 187 -125 142 202 190 111 90 268 11 183 31 -82 -75 -136 -46 127 -102 -67 3 31 225 -79 -39 -98
7827 -98 22 -304 127 -64 -58 -56 -176 -27 95 33 132 133 -201 126 -70 45 -28 204 -51 32 -116 126 -148 104
7851A04j74K52k02J96j32j53J19k47J33R3O7j01j2p6K18n8k48J34L0r5j60M48
7873A36j39j97K29N0J28j80n9qK28j95r0k7j66K06K63l34J48K29J5m93J16L5J80
7896G5j33N7q9J34K4q0K1k03J14R9j4j13K55J8k18J41j37k1j91K27O2J1R6j08
7920B7J42k88L27j4l89J43j62J69k08J00J19k8L14l22J24K02m32J35o6O0L0k1
7942c8K04k17N2j9M56n18O3M0k2O0j56L77j23k17K00o2j87j0p1L54J19l20J19
7965H4j06l5L31l45J61q7k10L37k20J58l05N83k11k64J34N9J69k53J30j16K7R6
7987A17m7j31J73k23j30J17J43m8K98j60r8J23l6k31j0J44L06k76p4K38m18L42
8009A19j19mk3K19j39N8k60K57j70r2L64r9k09L39j73O2n0q3j33M5r4K00N5j02
$$ plain form
7851 104 -70 182 -20 176 44 -109 10 -237 -104 -11 56 -45 -57 -133 85 27 -221 -87 -57 -152 -312 136
7873 136 -3 -200 29 79 207 27 -32 -40 188 -7 -97 -124 -290 -84 179 -155 -7 222 237 -256 -140 -105 75
7896 75 -58 -1 -90 44 68 -12 9 -194 -80 19 5 -108 147 165 -53 88 -49 -70 -261 -34 28 39 135 27
7920 27 169 -119 208 194 -195 -52 -214 -45 -253 -153 -34 -62 252 -70 54 256 -176 -41 -107 -47 -17 -38
7942 -38 166 -51 1 -18 438 -80 -17 23 1 61 -95 282 159 -58 142 80 -107 -117 -188 166 285 -35 84
7965 84 -22 -57 274 -71 90 3 -207 130 -90 68 -237 346 135 -129 5 64 233 -20 110 -6 21 117
7987 117 70 -61 112 -111 -241 -124 19 -29 269 109 11 134 98 -133 -143 1 307 31 -43 195 -223 119
8009 119 0 -4 -27 192 53 111 -149 108 -62 -154 210 111 -98 241 68 130 80 -3 -136 -91 -185 15 70 -32
8033c2K85l15J87Mk3j76J67q0J56l21R8O8N3k6q0M3OJ28o2K37k46L7j33K41n11
8058b95N4j60L09k0M04m44K41J21q0k43p1O5L3J24J87k05j23L7p3Q8J0R5k63J67
8082d2kM8L32l70J69Rl06l8M88l62Q3l9m7J48j43K70l05K65l5k22J2J03L3K6m0
8107C5j48r1J51j48J89J68n63N19K5o2k78J41K08k40o4J49R5j0j87O0K37K6j22
8130I0l51L54m16L50J40n6j63Q1k39K8J79j3J58j07j39q8M61k35k93L05k8l3O4
8153D9j87K35k08m8K08M0N2l57J96k19J63K02J29j72j62K29l61M15j08k15K6J03
8175A0M6q8K98l61K50k04L0L11j23j96m6M0r6K72k3l30
$$ plain form
8033 -32 253 -62 125 129 106 -70 97 17 173 -148 -50 18 71 45 -35 8 14 142 80 317 71 108 -25 216 -295
8058 -295 -241 -401 -92 -112 292 -152 89 210 130 -113 -184 -119 -86 38 225 20 -103 -66 -139 -51 -41 54 -209 -42
8082 -42 -44 4 336 -34 135 144 -162 -200 288 -74 9 -30 -77 71 -72 198 -107 158 123 -99 -87 16 49 75 35
8107 35 -113 -204 -53 -201 -12 156 -407 112 137 75 -203 -62 146 -94 -158 -9 86 76 -111 -51 186 212 90
8130 90 -261 93 -323 27 167 111 -52 29 -210 -182 -3 -16 142 35 -104 -192 269 34 -259 46 18 -15 49
8153 49 -138 97 -111 -159 49 89 141 -216 -20 -239 -76 126 255 83 -79 150 -211 204 96 -119 -93 10
8175 10 56 -32 266 -95 155 -49 -19 292 169 -27 -73 -33 -129 143 120 -210
8191b10
$$ Imaginary data points
##PAGE= N=2
##DATA TABLE= (X++(I..I)), XYDATA
0@%%%%%%%%%%%qJ6j6J6j6K4l2M0m8N6o5P3q8J04j24J48j72J97k26K60k97L38l84
34b04M34m89N50o18O93p73Q59r54J059j175J300j436J588j754J933k128K344k582
52a353K845l138L464l833M251m726N274n917O682p612Q770j0256J2244j5055J9368
67A1008k6891M3773j53936L1135J95604j63280j5332R2875J8366l0539M1956k1582
79B3157J5055P0004m5107j29777O1993P7245j05836m3985J21164k0701j10181
90h6969K9823O1106l6177o932K8937k73J2545K7923l2327n516Q0245J1373q2712
103A046Q356N1369m5680m4077J7862k0844l1329J9306J1136p864K3662J8413j0767
116i411K2336M0137j6071j2390L8960j5460o3258N077K0075k9881l973J8682k2479
$$ plain form
0 0 0 0 0 0 0 0 0 0 0 0 0 -8 8 -8 8 -8 16 -16 24 -24 32 -33 40 -48 56 -68 80 -92 105 -121 139 -158 180 -204
34 -204 230 -259 291 -327 366 -407 452 -502 557 -618 682 -754 834 -920 1013 -1115 1229 -1353
52 -1353 1492 -1646 1818 -2015 2236 -2490 2784 -3133 3549 -4063 4707 -5549 6695 -8360 11008
67 11008 -15883 27890 -126046 -94911 100693 -62587 -77919 14956 33322 2783 44739 23157
79 23157 38212 108216 63109 -66668 -4675 72570 -33266 -77251 43913 23212 -86969
90 -86969 -57146 3960 -32217 -39149 -10212 -10485 2060 29983 -2344 -7860 72385 83758 1046
103 1046 9402 60771 15091 -28986 -11124 -31968 -63297 -43991 -32855 -40719 -17057 1356 -9411
116 -9411 12925 53062 36991 24601 63561 48101 -15157 -10080 9995 -19886 -23859 -5177 -27656
129b7656j4208K3811K416p717L4774K0848l3809m951L0909j4972j0578M0441O15
142C9923l8398N454P171k6242j138J5993j8793j7686J4562n191k0063K8688L2636
155A6916j4627N239K9234j1063r712K3699n701k6699l56n430k6750l353J5509
168a3094j0425j1202J8466O367o659K4119J5871j5737N845J2249j7288l232J7816
181B3096o915j6494O51l615j3802L635J1608r650n608J0416j0563r319K3825J1836
195I101m765J3713N982j4513K180J1378n429o650J546j4080k4119J126Q513j0491
209b6508M671J8954p949n178K1196P639k786J3674M704j5218n276M977p592j0687
223e379P107j206j8328K090R924j0662O91J4338m782o706J0231O478l44P196P919
$$ plain form
129 -27656 -41864 -18053 -15637 -23354 11420 32268 -1541 -6492 24417 9445 -1133 39308 39923
142 39923 1525 6979 14150 -12092 -13230 2763 -16030 -33716 -19154 -24345 -44408 -15720 16916
155 16916 2289 7528 36762 25699 15987 39686 33985 7286 6930 1500 -25250 -28603 -13094
168 -13094 -23519 -34721 -16255 -9888 -16547 7572 23443 7706 13551 25800 8512 5280 23096
181 23096 16181 -313 338 -3277 -17079 -13444 -1836 -11486 -17094 -6678 -17241 -26560 -2735 9101
195 9101 4336 18049 24031 9518 11698 23076 17647 10997 12543 -1537 -25656 -24530 -16017 -26508
209 -26508 -21837 -2883 -10832 -16010 5186 12825 10039 23713 28417 13199 7923 12900 5308 -5379
223 -5379 1728 522 -17806 -15716 -5792 -16454 -15763 -1425 -6207 -12913 -2682 3796 3452 10648 18567
238A8567n221n175Q356J023j1135M3k326j6456o928K004j808K687N501J039J173
253h656N038R352P548L768M147k035q984m596l874j754J389m337n463j920n029
268a5406J345Q764K637J011J776l290j153M693O287K396l05K291j387o307K732
283F084L659p682l221q94j0005m940M179K296rL937N920J077J815R684M178m157
299A1921J715k561j1207j940K271m480l618p72q53o16L410P584K464j681K501
314D138j846m740M985L589k516j035n00k461m69J648L741o52m174j896l833m477
330a0498L251L944q2J912J36J094K969M300N261r4n068k371m737o278J429R62
346c870m229j406M92J275L414N353N806J171j732J045l251l051L545n89n452j879
$$ plain form
238 18567 13346 8171 16527 17550 6415 6458 4132 -12324 -19252 -17248 -19056 -16369 -10868 -9829 -8656
253 -8656 -3618 5734 13282 17050 21197 19162 10178 5582 1708 -46 1343 -2994 -8457 -10377 -15406
268 -15406 -14061 -5297 -2660 -1649 127 -3163 -4316 377 6664 9060 8755 11046 9659 3352 6084
283 6084 9743 2061 -1160 -2054 -12059 -16999 -12820 -10524 -10533 -6596 -676 401 2216 11900 16078 11921
299 11921 13636 11075 -132 -2072 199 -4281 -7899 -8671 -9524 -10140 -6730 854 3318 1637 4138
314 4138 2292 -2448 2537 6126 3610 2575 2075 -386 -855 793 4534 3882 -292 -2188 -6021 -10498
330 -10498 -7247 -3303 -3385 -1473 -1337 -243 2726 7026 12287 12193 7125 4754 17 -6261 -4832 -3870
346 -3870 -8099 -9505 -9013 -7738 -4324 1029 6835 8006 6274 7319 4068 1017 4562 3973 -1479 -3358
362c358p45j449J150L187K599j396k267k91j471L50N539l60k962J776N63M41L947
379E253K897J72l022m370k095k990j719J973k574k898J871J122K162O211M770
394F763K321j032j597j74k362j033J571m533n560p51o40L70L801K079J61r42n60
411b118J967M01J710L082k952k824K412N39M87L068p2k120l003k955m59j040j06
428c983R23l743j309L145J421L988N337J406q13j291j107J124p68j487j340n287
444c784k865J402J90J674L020k4q12m90K06L044N93j30N58k989j263J912R31J774
462B947J494j342k107k357q88J883j37j995r9k519p6K968K910K331Q59p55k83
479B834j611j14L003j525m053m65j899j451L088K645K2M29L50l98k616J670M772
$$ plain form
362 -3358 -4103 -5552 -4402 -1215 1384 -12 -2279 -2570 -4041 -3691 1848 1488 -1474 302 865 1306 5253
379 5253 8150 8322 5300 930 -1165 -4155 -5874 -3901 -6475 -9373 -7502 -6380 -4218 1993 6763
394 6763 9084 8052 6455 6281 3919 2886 4457 -76 -5636 -6387 -7027 -6657 -2856 -777 -616 -1558 -2118
411 -2118 -151 250 1960 5042 2090 -734 1678 2217 2704 5772 5700 3580 577 -2378 -2837 -3877 -3983
428 -3983 -3060 -6803 -8112 -4967 -3546 442 5779 7185 6372 5081 3974 5098 4330 2843 1503 -3784
444 -3784 -6649 -5247 -5057 -3383 -363 -387 -1199 -1689 -1483 1561 2154 2024 2582 -407 -1670 242 1173 2947
462 2947 4441 3099 992 -1365 -2253 -370 -507 -2502 -2601 -5120 -5196 -2228 682 3013 3872 3117 2834
479 2834 1223 1109 4112 2587 -1466 -1931 -3830 -5281 -2193 452 474 903 1253 855 -1761 -91 4681
496D681k980l526J525k563k272N425K287j217K53K07k311j901L315L130m931j096
512a974J810l865k44O343O06k182J919K2l376q8L024k61m094M55P10m015K695
529b515N449j599p43L356j931k866K538J851k612l159J95j202k365L851L721k950
545i81J364K163m114R48M528m64k626j257o27j758K51M259P09j918J646p62m476
562c115K478L359k376j475m73k173q95K209L543Q30m61K068j068k768K861J622
578D166k612j298k024k214NJ005K331N80j081K421j46k298K675J941k113j402
594f4r15j331M31J527K429o91j594J908m81j605K908N29m412j168l4j949P62L287
612d63J801j550l20K519p24k11M416j132m657K2r46k400J698K419l02j008M14
$$ plain form
496 4681 1701 -1825 -300 -2863 -5135 290 2577 1360 1613 1820 -491 -2392 923 4053 -878 -1974
512 -1974 -164 -4029 -4273 2070 2676 494 2413 2435 -941 -1029 1995 1734 -2360 -1905 -1195 -5210 -2515
529 -2515 2934 1335 592 3948 2017 -849 1689 3540 928 -2231 -2036 -3238 -5603 -1752 1969 -981
545 -981 383 2546 -1568 -620 3908 3444 818 -439 -1066 -2824 -2573 1686 2395 477 2123 1361 -3115
562 -3115 -637 2722 346 -1129 -1602 -3775 -4670 -2461 1082 1912 1451 3519 2451 -317 2544 4166
578 4166 1554 256 -1768 -3982 -3977 -2972 -641 -61 -1142 1279 1133 -1165 1510 3451 1338 -64
594 -64 -979 -2310 -1879 -352 2077 1386 -208 1700 1219 -386 2522 3051 -1361 -2529 -2563 -4512 -3750 -463
612 -463 1338 -212 -532 1987 1263 1052 5468 4336 -321 -299 -1245 -3645 -1947 472 170 -838 -424
629d24j01j006J977L232k228k647N37k333q34L562J001j81J479q67r88J312J851
646C342J28k231j487j121k966J036J765j550R36K177j260J52L560O18j13q27l47
663A812k016j535K446L88k217J124L19k915J740L061j684n85P2k103k016J699
679b410K661m78n66K193n82j909M064J896k156K70p56m082j328J247N09n86K1
696a992Q45j872m0M361J428j181J314r93l101R14J204k79J26j01n42j457K43K416
714A293m32j113R58j680k032J535P36K2M62K03J47k53R79K527n81j609N94k100
732c44j896J560J98j036K43j02o09K96K124K630r09j249K65j758q32K368j28j147
750c26L72j340o62O99K327J125j338k88k27k023K0K576o35l85N96j525n33J661
$$ plain form
629 -424 -525 -1531 446 3678 1450 -1197 -660 -2993 -3827 -265 736 555 2034 1167 179 1491 3342
646 3342 3470 1239 -248 -1369 -4335 -3299 -1534 -3084 -2148 29 -1231 -1079 2481 3099 2986 2159 1812
663 1812 -204 -1739 707 1095 -1122 2 321 -2594 -854 2207 523 -62 10 -2093 -4109 -2410
679 -2410 251 -227 -793 1400 818 -1091 2973 4869 2713 2983 2227 -1855 -3183 -1936 -1427 -2013 -1992
696 -1992 -1147 -3019 -3059 1302 2730 1549 2863 1870 -1231 -317 887 608 734 633 91 -1366 -1123 1293
714 1293 861 -252 706 -974 -3006 -1471 -735 -713 -251 -48 99 -154 825 3352 2771 1162 1756 -344
732 -344 -2240 -680 -482 -1518 -1275 -1377 -1986 -1690 434 3064 2155 906 1171 -587 -1419 949 821 -326
750 -326 46 -1294 -1956 -1257 1070 2195 857 569 342 -1681 -1661 915 280 -105 491 -1034 -1567 94
768I4J478N67j101j067k36j978J81K345n90j47P31r83J29J554J067N76r71o87
786I62p82k072N35J398j588l40O54r02P61K401P72J79q63l26k47m63J217O11j933
805b6n51P4j374J219J335n18J6j077j163O88j63J199J191p71j89P44k16J584J486
824C488l20o85k090j138j28q83o5P59j829l55N27J91K175K027L15L16q77j59M29
843A698m36L25l1k100n39R7m84Q73R29p89o69q88K44R30k67J028O44j246Q89R23
863A131L79J589M05j365j234j002l97L1j055qo72j488O75J640O51J770R99p39
881A310K22j1k27L42k65k21j396j406J10O67j01J287j89j039l54K25J81R68Q4
900A87M2k6j104J172O48N11J156n66j893L56n13o73K05o27m04J9r51J230J067
$$ plain form
768 94 1572 2139 1038 -29 -265 -2243 -2062 283 -307 -454 277 -706 -577 977 2044 2620 1649 962
786 962 180 -1892 -1357 41 -1547 -1887 -1233 -2135 -1374 1027 1799 1978 1115 789 542 79 1296 1907 -26
805 -26 -577 -503 -1877 -658 677 159 175 -902 -2065 -1377 -1540 -341 850 79 -110 634 418 2002 3488
824 3488 3168 2483 393 -745 -873 -1756 -1821 -1062 -2891 -3246 -2719 -2528 -353 1674 1989 2305 1428 1269 1698
843 1698 1262 1587 1556 -544 -1083 -986 -1470 -597 332 -457 -1126 -2014 -1770 -840 -1107 -79 565 -681 208 1131
863 1131 1510 3099 3504 2139 905 -97 -494 -463 -1518 -1526 -2198 -3686 -3011 -1371 -720 1050 2049 1310
881 1310 1532 1521 1294 1636 1371 1150 -246 -1652 -1542 -875 -976 311 122 -917 -1271 -1046 -865 103 187
900 187 229 203 -901 271 919 1430 2586 2020 127 483 -30 -703 -498 -1125 -1529 -1510 -2461 -1231 -164
919a64J039R06k10p29O38n76J20K38j227p31p58l30M52J076L80N82r89j88J126
938F55p2J4P79j098q48K79j33J81R14J83o00r18l14O19n08P88P06j519n7O71j03
959c81J026J446n13j28q09K4k92l90J39n44j990N21P9p55J746J705j135N31J164
978A444m31L03O15N60j451j245N27j066j025J959k66j895P70M55r87P95J168K28
996D58j140N92O02l92R50K246j290j511J382j204j443J074j63j838q49K95l24
1013b555p9J585J923j093O19J650q70j9K085m43j944j23n76j031m45P17K52j319
1031a666k12N35m98O14K006o49o04J119m14M92N15R15m6j087l17R5j130J32K74
1050G4j340r83R6j83O61P27J186L41k84L00R19k41N27O50j576p82j61n61o66R36
$$ plain form
919 -164 875 1781 1571 842 1480 904 1024 1262 35 -696 -1454 -1784 -1332 -256 124 706 -283 -471 655
938 655 583 597 1376 278 -570 -291 -424 -243 671 854 254 -664 -978 -359 -867 -79 627 -892 -949 -278 -381
959 -381 645 2091 1578 1450 641 665 373 -17 122 -422 -2412 -1891 -1812 -2567 -821 884 -251 280 1444
978 1444 1013 1316 1931 2491 1040 -205 322 -744 -1769 190 -76 -1971 -1201 -746 -1733 -938 230 458
996 458 -682 -90 512 120 1070 3316 2026 515 1897 693 -750 324 161 -1677 -2526 -2231 -2555
1013 -2555 -2634 -1049 874 -219 400 2050 1180 1161 3246 2803 859 736 160 -871 -1316 -599 -347 -1666
1031 -1666 -1878 -1343 -1841 -1227 779 130 -474 645 231 723 1238 2153 2107 1020 703 798 -332 -200 74
1050 74 -1266 -2249 -2153 -2336 -1675 -948 238 579 295 595 1514 1273 1800 2450 874 92 -69 -630 -1296 -360
1070c60K57m96j246R66L99j18Q35J153j632k70J569r84L67J101j30j222n3K15
1088C51k48l15L23l82j643Q41K82r29J259J652j194L95P62j41m00P03K04j519
1106Ar54M08n44q04K166J51j786J160M98n49P83J300r52n26k42L03j323L92J857
1125A339j412j124R17m90n90J755lj004M99j55m98N04J459L29r11L11K25j033
1143A18L86R30j487j155M85r45n83Q72O79N9J15O24L63K05P54R69j053m41M03
1162A298j395k61K77n00Ko59o2N3L43O69M45m81L49J11n23Q52R06l89K91j70m81
1183F75m4k10K30l89j008p10j41p34O97J149l33K35Q54L8P29K81Q88L35j642J77
1203A077k33j697M71N01j086q89N31r3K64N98J067j30p37J067l06p96J564N98
$$ plain form
1070 -360 -103 -599 -1845 -879 -480 -598 237 1390 -242 -512 1057 73 440 1541 1411 189 136 351
1088 351 103 -212 111 -271 -1914 -1073 -791 -1720 -461 1191 -3 392 1154 1013 613 1316 1520 1
1106 1 -953 -545 -1089 -1893 273 424 -1362 -202 296 -253 530 1830 878 352 110 413 -910 -518 1339
1125 1339 -73 -1197 -280 -770 -1360 395 392 -612 -113 -268 -766 -262 1197 1526 615 926 1151 118
1143 118 504 1434 -53 -1208 -723 -1668 -2251 -1379 -700 -641 -526 98 461 666 1420 2389 1336 895 1298
1162 1298 -97 -358 -81 -581 -579 -1238 -1300 -1247 -904 -235 210 -271 78 189 -334 518 1424 1035 1326 1156 675
1183 675 631 421 651 262 -746 -1456 -1597 -2331 -1634 -485 -818 -583 271 309 1038 1319 2207 2542 900 1077
1203 1077 844 -853 -382 119 -967 -1856 -1325 -1418 -1154 -556 511 381 -356 711 405 -391 1173 1771
1221A771j629M82L35j026m4Q37m15j020m16K73q49k4J837j99j064J298M37m48
1239A36J086R03j000j62j21p51j106O02O36j087m41R04n96o8J729j95m67N98j12
1258D88n11n7N54M00r59j56L86p66K18R31m40l18J87o63k40M13N15L29l29j89
1278b07N04j12K75O79q32j93K7j086M67K93k70l8J67m07N58P57K79M21p67N4N3
1299F22j029M55O0n73L8n76l32R05J81L13J64j61m13O23k93N85L69m17R3j02m53
1320E9L43k06O7J62r54l71M2k90J15M98J08J71j03L17R97L4O08R3p61l08l14k78
1342B9k6k01p91j72q6j1N19J89L78P89q57M62L53j57P75l47l49j02k43M3N40m12
1364C23k26k66q27K0K47m34N62km09M42N69N30O70O5q2j05p08k0Q3o76m4l17o04
$$ plain form
1221 1771 142 624 959 -67 -111 726 311 -709 -1125 -852 -1701 -1725 112 -87 -1151 147 584 136
1239 136 1222 2125 1125 963 842 91 -1015 -413 223 -864 -1305 -401 -997 -1065 664 469 2 600 488
1258 488 -23 -80 474 874 -85 -241 145 -621 -403 528 88 -230 -43 -706 -946 -533 -18 311 -18 -207
1278 -207 297 185 460 1139 307 114 141 -945 -478 -185 -455 -493 -326 -733 -175 582 861 1282 515 569 622
1299 622 -407 48 108 -465 -427 -1003 -1335 -430 -249 64 228 67 -346 277 -16 569 938 521 614 512 59
1320 59 402 196 263 425 -529 -900 -858 -1148 -1033 -535 -427 -256 -359 -42 955 989 1597 1690 929 621 307 29
1342 29 3 -198 -989 -1161 -1247 -1258 -739 -550 -172 617 -240 222 575 418 1193 846 497 395 152 195 735 323
1364 323 97 -169 -996 -976 -729 -1163 -601 -603 -1012 -570 -1 529 1199 1264 1182 1077 369 349 432 -244 -288 -605 -1209
1387a209q6M15J89P87l9J71K73n36K41J02m1L46k89o91M44m9l8N47o03J14q2o06
1409f40K70L7O3J68k26n74Q08K35K6Q67l79l66L41l76Q3K20m17p04j57k45Q03
1430a63j34L92M99l59k33L40k09J19M6j80j35p76L27K01J28J45P55o34k68N12
1450C73l07K74K53m18k22m65K04J07J25N4L84q24nN87k08qM30k39n65j3L73N04
1472C94k70O66pq47L88J48p25M08K18j241n6J77qJ61L16O12J52q88R10L88n34
1493C62M25L7j184K98K01J7k28J12N8q05K47M91l98k41J007k87r04N00O68j66
1513B10L30N50o23k98K15K50m98j06L04r99q43J217m96l77J110M32r37O22K34
1532B97L17o05L89O31j135m49Q99m16l11P80j90j065M22N31k30l17M99N3o66r1
$$ plain form
1387 -1209 -1295 -880 -691 96 57 228 501 -35 206 308 267 613 324 -367 77 28 -10 537 -66 48 -34 -640
1409 -640 -370 -333 -270 -102 -328 -902 -94 141 167 1034 655 289 630 254 337 557 140 -564 -721 -966 -163
1430 -163 -297 95 594 235 2 342 133 252 298 118 -17 -793 -466 -265 -137 8 763 129 -139 373
1450 373 66 340 593 175 -47 -512 -308 -201 -76 -22 362 -462 -467 120 -88 -96 334 95 -470 -483 -110 394
1472 394 124 790 783 -64 324 472 -253 155 373 -868 -924 -747 -755 -594 -278 334 486 -402 508 896 362
1493 362 787 824 -360 -62 139 156 -72 40 98 -707 -460 31 -367 -608 399 112 -792 -292 376 210
1513 210 540 1090 467 169 384 634 136 30 334 -665 -1508 -291 -787 -1164 -54 378 -559 63 297
1532 297 614 9 398 1029 -106 -555 344 -72 -383 397 207 -858 -436 95 -135 -452 47 100 -566 -657
1552f57R85o63L15R49o29j02M58R8p09N23l25m65o18M71M3l1J8P57n47l10P84
1573C45k66J3J10J4m63j09mL41j25M12L69m73L1K69l57L6L12o83m56p5L00L39
1595a20k63N04K54p53L73K21J9L14J39q18q8K34m6K18j19K08m3m27J92n9k88N55
1617B07m30p39K24P99n61O34R8R7j83R6N79k19j69M51n31r41J91J58m02K10J60
1638b71k23Q9J51M23k49K31M83p05j45P40m52k55P77j6o12Q2L35m27J09K57m57
1659a35p72M7Q04n03r2P53k20l7O79L29l22J07K44n86m30N4j67k30K33J98m20
1680d66k31P05k38J88N06m13n2j66K6K76j63M11K52j025L06O57o03Q6O73p19l73
1701c63L36k45j27k3L39l1m78R45j27m07N75M39p95q1P7m3m46M07J58k06k42K78
$$ plain form
1552 -657 328 -335 -20 929 300 198 656 754 45 568 243 -222 -840 -369 -326 -357 -339 418 -129 -439 345
1573 345 79 92 202 216 -247 -356 -360 -19 -144 268 637 164 195 464 107 143 455 -228 -684 -759 -459 -120
1595 -120 -383 121 375 -378 -5 216 235 549 688 -130 -218 16 -30 188 69 277 234 -193 -1 -60 -348 207
1617 207 -223 -962 -738 61 -500 134 232 329 146 242 821 602 433 884 353 -588 -397 -239 -641 -431 -271
1638 -271 -494 -405 -254 169 -80 151 634 -71 -216 524 72 -183 594 578 -34 48 383 -44 65 322 -135
1659 -135 -907 -860 -56 -559 -651 102 -118 -155 524 853 531 638 882 296 -134 -80 -247 -477 -244 -46 -466
1680 -466 -697 8 -230 -42 464 51 -1 -167 -141 135 -28 383 635 -390 -84 573 -30 56 729 10 -363
1701 -363 -27 -272 -399 -422 -83 -114 -592 353 226 -181 394 833 38 -43 34 -9 -455 -48 110 -96 -338 -60
1723f0J92l62Q67m80m77KL20l92L7K91q5j00o3N64j11k88R44k98o86K25k2k64
1745b46K78j07k86J69p8R4n1J22L73n53j06K27K40n67N07J30k12K77J04L55m52
1766B18L01Om01m11J60j77j33K0J72m93L63J12J08L79o9L87k08K6R7J8j05q7l22
1789c9r8J84m01L16j20j21j35k38q1N31m6m2M61J6P6J93Q4K6M44l84l12n40j01
1812c27K96k84k99J56n65N56o2J08O74K54m48K68P1k97J58j24q0J10l45j8Q9j34
1834b43J43J76m65qL6o3M64j11J58j67J38K28P3l5L47j25m74j42J61m59L76n23
1856e15p7L13j54P2N65j13J70k6k10K37k89j67K31j31L8m8j31j22N38l84L11K45
1878C53m15N0j95J57K47r0m05L40k93K90M%P9j15l61L58Q4J64k57j22O3J68j85
$$ plain form
1723 -60 132 -230 637 157 -320 -318 2 -390 -353 -62 -147 -247 -310 254 143 -145 799 501 -185 40 18 -246
1745 -246 32 -75 -361 -192 -270 -176 -227 -105 268 -285 -391 -164 76 -491 16 146 -66 211 315 670 218
1766 218 519 525 124 -287 -127 -304 -437 -417 -245 -738 -375 -263 -155 224 155 542 334 360 457 475 370 283 -39
1789 -39 -137 47 -354 -38 -158 -279 -414 -652 -733 -202 -248 -290 171 187 263 456 540 566 1010 626 314 -226 -327
1812 -327 -31 -315 -614 -458 -1023 -467 -529 -421 253 507 59 327 398 101 259 135 55 165 -180 -198 -109 -243
1834 -243 -100 76 -389 -397 -361 -424 40 -71 87 -80 58 286 359 324 671 546 72 -70 91 -368 8 -515
1856 -515 -592 -279 -433 -361 204 91 261 235 25 262 -27 -194 37 -94 -56 -104 -235 -357 181 -203 108 353
1878 353 -62 -12 -207 -50 197 107 -298 42 -251 39 43 43 122 7 -354 4 88 252 -5 -127 -64 104 -81
1901h1K6M51k43K00J88m58k83j04M8M9r2j53M5j88N73K21o4J89j07r3M78k76l40
1924a4K62l06k21o7J46k31K59Lj13j94K29M01Q1l11N06k11j77K17M9K89j91k08
1946A98K21n14m9J55n39j33J09j44J32J09K1M66L74J67k05j32M21N2p8k08j29
1967B94m62l34M40m58n8K38j62m4K32K96K72k80L34J68n16L39N89n11r7K01l95
1988H6l44K30j7k80k90K01j82j50L43K66j12M04J55m12L79L58K0l18M0j35k86
2009d4l63L85k03k39N69r0o39K95M50M09m93O6j03m1J02J52J16j39K63j96n87
2030c30M94J86m93M5l6k14n5K64J68j7q0M40j90l30Q06n13l59M39m69l64M30l5
2052b13n7L96k98L00k85O9O94m89j3L86l90o98N96j36j18j34P1K66l33K60O22
$$ plain form
1901 -81 -55 396 153 353 541 83 -200 -304 -256 -207 -299 -452 -407 -595 -22 199 135 324 217 124 602 326 -14
1924 -14 248 -58 -279 -346 -200 -431 -172 -169 -282 -476 -247 154 235 -76 430 219 42 259 308 597 406 198
1946 198 419 -95 -144 11 -528 -661 -552 -696 -564 -455 -434 32 406 573 368 236 657 709 631 423 294
1967 294 -168 -502 -62 -520 -578 -340 -502 -546 -314 -18 254 -26 308 476 -40 299 888 377 280 481 86
1988 86 -258 -28 -45 -325 -615 -414 -596 -746 -403 -137 -249 155 310 -102 277 635 655 337 377 242 -44
2009 -44 -407 -22 -225 -464 105 15 -624 -329 121 530 37 103 0 -41 61 213 329 190 453 257 -330
2030 -330 164 350 -143 -98 -134 -348 -403 -139 29 12 -68 372 182 -148 658 145 -214 225 -244 -608 -178 -213
2052 -213 -270 126 -172 128 -157 -88 606 117 104 490 100 -598 -2 -138 -256 -390 -319 -53 -386 -126 496
2073D96n43RO41n96o8M77j58l59L10Nj33l67J85N60o29j3J15q39L68M76l43K54
2095a52O05m62K02L11K20j32l65P2K5q66J18J92m37J57M38l78K84j45L81J59k40
2116a3N95k36k30L20N2m39J86J25n59J25Jk13K77m56L87n40J35K15J23j55M46
2137A46K10l12O07L4l01J51O1n10l29J96j65m80L3M88l89l2L15N46m28L60K59
2158D60k67m6Q1K69m68L81j79k45Q5j91nm95P27k82l77L94k17J09K71J34J87k18
2180A08r3O00m10R6M88o09l76K77M6m20J92l3k45K4J08L86j99L87Lo43K09N27
2202D23o65K15K30k44j07j4J19J96k54J91k52k15K02L11j36j90L12k33p6K51J46
2223B10l09J0J70j66O1j43K72n88O14k47m7K00M89l00Ok21L83l69l3K85m02k55
$$ plain form
2073 496 -47 -38 603 7 -61 416 258 -101 209 214 81 -286 -101 459 -170 -183 -68 -907 -539 -63 -406 -152
2095 -152 453 -9 193 504 724 592 227 299 324 -542 -424 -232 -669 -512 -74 -452 -168 -313 68 227 -13
2116 -13 582 346 116 436 488 49 235 360 -199 -74 -73 -286 -9 -465 -78 -618 -483 -268 -145 -300 146
2137 146 356 44 651 685 384 535 596 86 -243 -47 -212 -692 -659 -171 -560 -592 -277 269 -159 201 460
2158 460 193 147 228 497 29 410 231 -14 71 -120 -125 -620 107 -175 -552 -158 -375 -266 5 139 326 108
2180 108 15 615 205 301 789 180 -196 81 127 -293 -101 -134 -379 -355 -247 139 -60 327 330 -313 -104 423
2202 423 -242 -27 203 -41 -148 -162 -43 153 -101 90 -162 -377 -175 136 0 -190 122 -111 -187 64 210
2223 210 -99 -89 81 -85 -24 -167 105 -483 131 -116 -163 37 526 226 232 11 394 25 -8 277 -125 -380
2245c80L76R2o07L17Q1ML04J12j16O8k13O06k09k19%k06l16l2N03m28j79M22p2
2268i2k4k35L49k07K49K80k36q1L88l33J41K45o9m98M09n25J69qm51k8J7J90M86
2291A36j97M9M26k92j62J59L28j06O5p9k14l34j87L04L8j9J8k65L5L69l64K03
2313h9L22j46k3J1L7M42m06K65l55j51K60J59o39J25j1l84M76l6j17L51R4j21
2335F4P5l2j6L85l22Q3k36m2r3N7n6K53j30j13P9j15p7K68l8J48K29q49P30k6
2359B26j79J45K11k76r3p3N4O1j56M6O1l77K36P7n2J52j28j59K25j21K73K4j90
2382a3J01j85o1n9L52k14Q4M27o48M62k2l48M12m18k17J96j46J66J36J0k38k7
2404b50JL78k37j28L40k82J38K0l8J59p0j6K23k89jo9L6K64j51j62k94J48J53
$$ plain form
2245 -380 -4 88 -519 -202 -121 -117 187 299 183 251 38 644 435 216 216 10 -306 -338 165 -263 -442 -20 -92
2268 -92 -116 -351 -2 -209 40 320 84 3 391 58 199 444 375 -123 286 -239 -70 -78 -529 -557 -540 -350 136
2291 136 -61 -12 414 122 -40 119 447 341 406 327 113 -221 -408 -104 -66 -85 -67 -332 -297 72 -292 -89
2313 -89 233 87 64 75 112 554 148 413 58 -93 167 326 -313 -188 -199 -583 -107 -143 -260 91 185 64
2335 64 139 107 91 476 154 237 1 -41 -134 -77 -133 120 -10 -123 -44 -159 -236 32 -6 142 371 -478 252 226
2359 226 47 192 403 127 34 -39 15 76 -80 -34 27 -350 -114 -37 -89 63 -65 -224 1 -120 153 177 -13
2382 -13 88 -97 -158 -217 135 -79 5 432 -216 246 224 -124 288 -130 -347 -151 -297 -131 5 15 -223 -250
2404 -250 -249 129 -108 -236 104 -178 -40 -20 -58 101 31 15 238 -51 -52 -121 -85 179 28 -134 -428 -280 -127
2427a27k1L76j43q0R1r8J73K8J22j22k68J1J64l06R9j16j08K14m1p0P6k2K62r3
2451Ao9L01j51j22L58J15n92K73L6j55k0j29O0N2J36k34k71J89K17q3l2J66O9
2474A15K15m4m6j04j69K45l11K26l54J75N7j46K38l92j24N14k37j51N08j36j33
2495e4k64O21K00n12K48R7m14o3M68n44K14j91k22Q2J85k4o5j3K49K71k22j02
2517e5J56p6P3J29l2k52J02k6P2k43M16n70q2L50J25k23K9K79l14K29N1k16J03
2540B5PP5m8o5K46j07L5j65M4l77K36R0pn7j22q3K7K71K11j53j70K37r5m29M75
2565A01K63j45J45pl57k3K86k37j93K14n9k01J85O4j32j96M79k14k96O20j19j73
2587EJ82m6J76j17k15K81m85L75k17q0Nk4J02j41J90j68L0o2L08p0j30K69J90
$$ plain form
2427 -127 -148 228 85 5 96 -2 171 199 321 199 -69 -58 106 -200 -101 -217 -325 -111 -152 -222 -146 -168 94 1
2451 1 -68 233 82 -40 318 433 -159 114 150 -5 -25 -154 -94 -42 94 -140 -411 -222 -5 -88 -120 46 115
2474 115 330 286 240 136 -33 212 -99 127 -227 -52 5 -141 97 -295 -419 95 -142 -293 215 79 -54
2495 -54 -318 303 503 -9 239 336 -78 -141 327 -217 -3 -194 -416 -334 -149 -173 -238 -251 -2 269 47 -55
2517 -55 101 25 98 227 195 -57 45 19 91 -152 264 -306 -388 -38 87 -136 -107 172 -142 87 138 -78 25
2540 25 32 107 59 -6 240 133 168 3 47 -330 -94 -4 -11 -68 -190 -273 -246 25 236 83 -87 150 55 -374 101
2565 101 364 219 364 357 0 -23 263 26 -167 47 -12 -213 -28 36 -96 -292 187 -27 -323 297 178 5
2587 5 187 141 317 200 -15 266 -219 156 -61 -141 -136 -160 -58 -199 -9 -177 -147 -209 99 29 -101 168 358
2610C58l43j43M77l46j90M52k69m86M52j30k1J09m2m4j18L00R3j89L46j59j3k4
2632G0J16r4N6k4p8k01k4L09k37p0K79l3m15O9K46k1j18j6K68o1j01K05J33j76
2656H2J85o9l32oK13k22M7K09m67L94j00M18m28R7j13J88j33J3K03m38N27k09
2678E9j32J81K33p5k36Lk4k98K9L28N0l19Q9r5qL29j79j25L63k14K04J17l87K45
2702A38L9j79O2K27n10K06P8p2J9q4J76l94K07O3k07R4M08l51J78K47j42j24R3
2725A72p3l28N52l87L55m55P1K50l33J22M3j84J34j9L03j69J94k32K33q2l7j23
2747GR3j05K1r7k13L43k88Q3Q8j52J12p1j2k63M26k16M18j24J27R7k98K57k3k47
2771c7L40k19k77L2o6P4J03J01j17j26L24J10n5m50K93K08l79K11l13L91Q6j19
$$ plain form
2610 358 15 -128 349 3 -187 265 -4 -490 -38 -168 -189 -80 -122 -166 -284 16 109 -80 266 107 94 70
2632 70 186 92 148 124 46 -155 -179 130 -107 -177 102 69 -346 -277 -31 -52 -170 -186 82 21 -80 125 258 82
2656 82 267 198 -134 -140 73 -149 -102 107 -360 34 -66 352 -76 21 -92 96 -37 -24 179 -259 268 59
2678 59 -73 108 341 266 30 33 9 -289 -260 68 118 -201 -112 -207 -215 114 -65 -190 173 -41 163 280 -107 138
2702 138 177 -2 60 287 -223 -17 61 -11 8 -76 100 -294 -87 -24 -231 -137 271 -80 98 345 203 79 172
2725 172 99 -229 323 -64 291 -164 -93 157 -176 -54 -11 -195 -61 -80 223 54 248 16 249 167 130 7
2747 7 100 -5 16 -81 -294 49 -239 -156 -68 -220 -108 -179 -191 -454 -28 -244 174 50 177 274 -24 233 210 -37
2771 -37 303 84 -193 -161 -227 -153 -50 51 -66 -192 132 242 187 -263 30 238 -141 70 -243 148 234 115
2793A15kJ6l41Q3J44j05o2J22j33J38j48K89J63l27J41l02M07j7j61r5o2J20l4
2816e1K99n36K31J04k86M49l01L93k52k11o4J34M1k54N74l47l2R4J48j75O4K3
2838D5K43l73j49K89j99P2qj36R6J29q7m2J21J06p7r0k0K1N7j06J59J1k45K71
2862H8k24r0K76k34K85l0j59r5K8J71j86K82k09L59k56m7lK08l1J30j64J16P0
2885B85n73N20m33j66M38M4r7Q6k74K61k48n4K36j39K73L22m47K99k89J42m8k4
2907A14p5m8J0J22m07J49j75Q4J99r7M4lK01l61M56J06k13J12m7J60l09j03Q7
2930FN8J63l48J89l05p1K96M39m33J99j33j91J4p6R1K52k2o7j27m2K54j8k40N4
2954e8J26j17J40j75K41jk07J15Q8J03j86M5k39L57k24l3J10k50M90l44o7J70
$$ plain form
2793 115 113 129 -212 -129 15 -90 -152 -30 -163 -25 -173 116 279 -48 93 -209 198 181 20 -75 -137 -17 -51
2816 -51 248 -288 -57 47 -239 210 -91 302 50 -161 -225 -91 -50 -304 270 -77 -109 -15 133 -42 22 45
2838 45 288 -85 -234 55 -144 -72 -80 -216 -120 9 -78 -120 1 107 30 -60 -80 -59 -2 -108 51 62 -183 88
2862 88 -136 -226 50 -184 101 71 -88 -183 -155 16 -170 112 -97 262 6 -41 -44 164 133 263 99 215 285
2885 285 -288 232 -201 -367 71 115 18 104 -170 91 -157 -211 25 -114 159 481 34 333 44 186 138 114
2907 114 39 -9 1 123 -284 -135 -310 -226 -27 -124 -80 -83 118 -243 213 319 106 218 171 331 22 -81 6
2930 6 64 227 -121 68 -237 -308 -12 427 -6 193 60 -131 -117 -193 -102 150 128 61 -66 -108 146 128 -112 -58
2954 -58 68 -49 91 -84 157 156 -51 64 152 255 69 114 -125 232 8 -25 85 -165 325 -19 -86 84
2976H4L70n47K23o5j87K00n5j65m3J44M1J38Q8k37L6j85K29k41L95j83j50k87
2998c97J81K26k55K62K6R3l83J76K24m61M01j66j96L20K3p2J02j39J59j36j68
3019a80J39J04p2n4K45j15j42M3m2j27L11k39j9N1J5J18l25L68J41k26j62L87
3041B19k26L1J16j18j30K17j46j34k14K05J38q2J71k49L4L14l76M51j61O8j77
3062d9j37J58j29m0K27j27l7j27m0L57k44J79P3q5l1N7n4K87j50M8j95K85j84
3085D2L2k83K18j28k01J06R2k3j61J30o8K02j16K20j8j69M03Mk09P1O3j46q6j57
3109a82J97J57l41K77m20K69k22K55k30K46O5m88N85k53K60j9l2J45l73J08J07
3130A11l75J70L20k88K43k37J01K9j12OLq1J1K79j46j63K38j38J12j10j35J97
$$ plain form
2976 84 454 -93 130 65 -122 78 23 -142 -185 -41 0 138 226 -11 25 -160 69 -172 223 40 -110 -397
2998 -397 -216 10 -245 17 43 136 -247 -71 153 -308 93 -73 -269 51 74 2 104 -35 124 -12 -180
3019 -180 -41 63 -9 -63 182 67 -75 -32 -74 -201 110 -129 -148 -97 -82 36 -289 79 220 -6 -168 219
3041 219 -7 24 140 22 -108 109 -37 -171 -385 -180 -42 -124 47 -202 -168 146 -230 221 60 128 -49
3062 -49 -186 -28 -157 -197 30 -97 -134 -261 -301 56 -188 -9 64 -21 -52 5 -49 238 88 136 -59 226 42
3085 42 74 -209 9 -119 -320 -214 -122 -145 -306 -176 -244 -42 -158 62 44 -125 278 282 73 144 207 61 -25 -182
3109 -182 15 172 -169 108 -312 -43 -265 -10 -240 6 71 -417 168 -85 175 156 124 269 -104 4 111
3130 111 -264 -94 226 -62 181 -56 45 74 -38 -32 -29 -110 -99 180 34 -129 109 -29 83 -27 -162 35
3152C5l8j54K38j4l93K55P4k01L85m42K86J19l39M35k09j9j31K54J31k58o3M05
3174C56l45J39J1l61N0K92k31l7j01J00o8J59j73L18k2m47M57j54k39M42P6m16
3196a94K11J60k60O2K15j81%o5o7m5K77k36J37j56L51l04J19O3j40K9O2k16K90
3219A12k47L30j55j37J52rk35q5K78k77j83L47KJ51k39N1J38L16l24J46j15j20
3241a03R0K05j00K0m84J95J62l1Q7l45K66j47j3J73K13j3j35L23j79j71J4o4R8
3264F1J66p1l27n0K80j87k90J08L29n0j60L87n4j22J17j29J30O6n3k65K6L18k08
3287B2K7Kj11m9j1J18j66L43j23p7k27r4N39q9q7J55p9J42lk22k0M2J87l05J23
3312C7J06k69K7l43M17R0M5j68j41L7K93J02l39J27Pj54J88j29Q1R0k35K97J11
$$ plain form
3152 35 -3 -157 81 67 -326 -71 3 -198 187 -255 31 150 -189 246 37 18 -113 141 272 14 -49 356
3174 356 11 150 161 -200 -150 142 -89 -126 -227 -127 -195 -36 -209 109 87 -360 97 -57 -296 146 222 -194
3196 -194 17 177 -83 -21 194 13 13 -52 -119 -164 113 -123 14 -142 209 -95 24 87 -53 -24 38 -178 112
3219 112 -135 195 40 -97 55 46 -189 -274 4 -273 -456 -109 -107 44 -195 -144 -6 310 -14 132 17 -103
3241 -103 -13 192 92 112 -372 -177 -15 -46 41 -304 -38 -185 -198 -25 188 175 40 363 184 13 27 -37 61
3264 61 227 156 -171 -221 59 -128 -418 -310 19 -31 -191 196 142 20 137 8 138 204 151 -114 -88 230 22
3287 22 49 51 -60 -109 -120 -2 -168 175 52 -25 -252 -346 193 104 17 172 93 235 232 10 -10 32 219 -86 37
3312 37 143 -126 -99 -442 -25 65 110 -58 -199 -162 131 233 -106 21 28 -126 62 -67 14 104 -131 166 277
3335B77l67J41P3k46Q6l67J94J56L6J3n7k60J99O0J75k7P2M9l65K6J62o7j0j43
3359a90L57k23Rq6j11O7m3M10j82j02Q8N7j54j0J08j25L63j08M4K6l33K61j74
3382e1R8l20K97N9k10M56j91j41o3j17M42j9k19K41m20L75j02l6P4j94q8J81m1
3405A1R3k22r9L67L4k23K6j42K42k4j59K8K78j75j31p9J25p0N9j60K59j16p4Q7
3429f5L67l67n7J99j57K32j07j48j13N36k67J9j79k60K24O3o5kJ77J0K20j57n0
3452E3k37J71k40M48k67J24j1J45k53J00Q8j27r8Q9l1J03k3J0N2K1K1k61J17m3
3476d9j41L45k83j3M75j72J0l5j59m4J0j13K77j27j36K45k1j72p2j6J98O4j70
3499i9K56l75L05k44qJ05nJ14Om9l75L65j27K07l04J74K62j26K68l72K8o6n1n8
$$ plain form
3335 277 -90 51 124 -122 -36 -403 -209 -53 -17 -4 -61 -321 -122 -62 113 86 158 207 -158 -132 30 -37 -47 -190
3359 -190 167 -56 -47 -133 -244 -177 -220 190 8 -94 -6 51 -103 -113 -5 -130 233 125 169 195 -138 123 -51
3382 -51 47 -273 24 83 -127 329 138 -3 -66 -183 259 240 21 262 -158 217 115 79 153 -41 -129 52 11
3405 11 104 -118 -217 150 184 -39 -13 -155 87 63 -96 -68 210 35 -96 -175 -50 -120 -61 -221 38 -78 -152 -65
3429 -65 302 -65 -122 77 -80 152 45 -103 -216 320 53 72 -107 -367 -143 -80 -145 -147 30 40 260 103 53
3452 53 -184 -13 -253 195 -72 52 41 186 -67 33 121 -6 -104 -15 -46 57 34 44 96 117 138 -123 -6 -49
3476 -49 -190 155 -128 -141 334 162 172 137 -22 -66 -56 -169 108 -19 -155 90 69 -103 -175 -191 7 71 -99
3499 -99 157 -218 87 -157 -165 -60 -65 49 55 6 -369 -4 -131 76 -228 -54 208 82 350 -22 6 -60 -111 -169
3523a69K36l11M58j56P0l04K94q2J14j74j09M75j16l55K74m77L18Pk93J90J80
3544G0L8p6J47j79M2Nn3o2L81l02l11K70m4J86k28Q8J07q1k5Q9j88J56k9Q1j75
3569i3K87J4j76P2Q7p8k98K67M8j74m8M5n3J93K36l08k56j87M97j20j84J25J37
3592C3M6l40N60l58L2QQ6pJ1M5J8o0P5k86j6K34k64J29J65k07J65j31j02J63M4
3617D3po7J87j10P8k48K93j11N6k21l1N75n43N02k56m0j04k08M48r6o5K11Pl55
3641f2m4J81j72k08L99n8m3j69J39k61K90M34q30N02p7J38m06Q6J99K45k31l4
3663A8Q3j48K7J37k05k28L58j74J74l6J14l54J37m4l8K40J1j4Ml1L53l62o2J48
3687A08k85K3J16J05k83J52k1n5L11j35j90K90n2l52J49L14q8k86L94j79N6N4
$$ plain form
3523 -169 67 -244 214 58 128 -176 118 36 150 -24 -133 342 226 -129 145 -332 -14 -7 -300 -110 70
3544 70 108 32 179 0 42 47 -6 -68 313 11 -300 -30 -74 112 -116 -28 79 -2 -27 62 -126 30 1 82 -93
3569 -93 194 208 32 104 191 113 -185 82 130 -44 -92 -47 -100 93 329 21 -235 -422 75 -45 -229 -104 33
3592 33 79 -261 299 -59 -27 -19 67 60 71 116 134 74 149 -137 -153 81 -183 -54 111 -96 69 -62 -164 -1 43
3617 43 36 -31 156 46 124 -124 169 58 114 -107 -138 437 -106 396 140 100 -4 -212 236 140 75 286 293 -62
3641 -62 -106 75 -97 -305 94 36 -7 -176 -37 -298 -8 426 -404 98 21 159 -247 -161 38 283 52 18
3663 18 101 -47 -20 117 -88 -316 42 -132 42 6 120 -234 -97 -141 -179 61 72 58 62 31 384 22 -40 108
3687 108 -177 -154 -38 67 -216 -64 -85 -140 171 36 -154 136 84 -268 -119 195 107 -179 215 36 92 146
3709A46J1j54J30l50M74n5l33R8K02q5j98L68k90P0l2L1k99K23M9k69J88J51%
3732G6k92K99k7k23J23K78l98L46j89k54M13J04m33O6N9J79J53k60J97k39K64
3753B42l28k43M35l82J76J19J92k35Q2j81L0J01lk59L84p2o6K28k20m35N41r6
3775A0J22R1l72J76q1J89k39K62j70K5J09q2k17J53j95K65ok3m0L6j34n8L16k65
3799a28J85j83n6L32k2N2M3k53lmJ37k31M5kK12J29j75J02r4k88L29j96J25J6
3823G2k5N6R3j38l75M08o5j89J27l7M47n04J26N1p8K2J72l36j4K57j21K3r6K87
3847A63l02QQ1p8n8J97k00L09j42K4Q3l02J57q8J46j46K37J6j28K77k27n2O2j92
3871a55LO1Q1l56M99l8k44L06m38L73r0Q9p3l4k6K08k20ml6nr0J49q6J57m3J9
$$ plain form
3709 146 157 3 133 -217 257 202 -131 -33 169 84 -114 254 -36 34 2 33 -266 -43 6 -263 -75 76 76
3732 76 -216 83 56 -167 -44 234 -164 182 -7 -261 152 256 -177 -111 -52 127 280 20 217 -22 242
3753 242 -86 -329 106 -276 -100 19 211 -24 58 -123 -93 8 5 -254 130 58 -8 220 0 -435 106 10
3775 10 132 223 -149 27 -54 135 -104 158 -12 13 122 40 -177 -24 -219 46 40 17 -23 13 -121 -179 137 -128
3799 -128 57 -126 -182 150 128 180 223 -30 -33 -37 100 -131 -86 -88 124 253 78 180 86 -202 127 -69 56 72
3823 72 47 103 196 58 -317 91 26 -163 -36 -73 374 -130 -4 47 -31 -9 163 -173 -187 70 -51 -28 -124 163
3847 163 -139 -131 -50 -128 -186 11 -189 120 -22 2 85 -217 -60 -148 -2 -148 89 105 -23 254 27 -25 37 -155
3871 -155 -152 -91 -10 -366 133 95 -149 157 -281 92 2 91 18 -16 -42 166 -54 -58 -94 -99 -189 -40 -126 31 -12 7
3897Gl3j10K74r7J74n40M87k88L04k10L38l37O7j94K70j57qJ22J36n06J15K34
3919D8j27K53k58Q6N9j23q4L28j73j0M20n01J46K85j1j30l6l13KJ30j57J83j93
3942a76K58J01k81JJ69k84j7N2L22k22J6O20l70m6J9k03K0j51K58k45L89k14l48
3965c32L75k15K0J05o1J35j55l4K41j19L21n05M08O1j69M6nk05J71k46J80j03
3987h6N9j75j4K19r8M0O7L2p8J0P5Q1j69k9NL20m0l52L35r4k17K80j98r7J90o5
4013AR8l12J98J66j63j84K75m90K32K85j17M8q4j8l7P4r3j3K17O4k10n9K18jk31
4038a36L84N3m72N14o42L01O9k41J02r5M67n95K63%l2m8k0J7J16M9R4l36J33Q
4062d7m8j5o2k4K18P2j10R0Jl8k01K58j15K1K8j82K50k02J41m0J4Np9K06j99J04
$$ plain form
3897 7 -26 -136 138 41 215 -325 162 -126 178 -32 306 -31 36 -158 112 -45 -53 69 205 -301 -186 48
3919 48 -79 174 -84 2 61 -62 -146 182 9 -1 419 -82 64 349 338 208 172 -141 -139 -9 -166 17 -176
3942 -176 82 183 -98 -97 72 -212 -229 -177 145 -77 -61 559 189 143 162 -41 -21 -172 86 -159 230 16 -332
3965 -332 43 -172 -152 -47 -108 27 -128 -162 79 -40 281 -224 184 245 76 122 117 -88 83 -163 17 -86
3987 -86 -27 -202 -216 3 -95 -55 12 44 -34 -24 51 132 -37 -66 -61 259 219 -133 202 108 -109 171 -27 -124 66 1
4013 1 99 -213 -15 151 -12 -196 79 -411 -179 106 -11 37 -47 -65 -102 -28 -121 -134 83 147 -63 -122 96 95 -136
4038 -136 248 301 -171 343 -299 2 71 -170 -68 -163 304 -291 -28 -28 -60 -108 -128 -111 5 54 148 -188 -55 -47
4062 -47 -95 -110 -172 -196 22 94 -16 74 75 37 -164 94 -21 0 28 -154 96 -106 35 -5 9 14 -65 141 -58 46
4088D6r2J18n1q9RK05K4j88j86L8J39M5n8J50J63l38J48J34l72M48l25j14R6P7
4112B7j13K44M1n5k03j28j71R5L59L95m16P9Q5l98J07K64k08j16K92j36r7J55
4134A02pk84K73k18j22R2J97J14m8k13J57J09k29K06k64J29N5r1p9k4j42N86l07
4157hn2p0n1J34PL5P0J81l30O8l1J44J56m28K40k58J8K81J32k22j14O5N1M5R9
4182A62J00k61K7J16j96K9J8k3O1l3o3m8l2L19k76mJ45K83n94K53k31J29p2L75
4206A84k17K36j32r4k68k5K02J32r3j1M6J84k14J34J28M9n93K84J15J58l00j58
4228b53J50J53L10n69K42j29ML9N8l4k20L16O7L47l15j65j22J39O6p7n0J35j62
4251g0l0L6j91L69O8k06o3K43l10K65J12j19j70Q9P7K04m72j01K84J34r5N3r3
$$ plain form
4088 46 -46 72 21 -68 -59 146 170 -18 -204 -166 -27 18 -40 110 273 -65 83 217 -155 293 -32 -146 -50 27
4112 27 -86 158 199 144 -59 -187 -358 -263 96 491 75 154 239 -159 -52 212 4 -112 180 44 -53 102
4134 102 95 -189 84 -134 -256 -164 33 147 99 -114 43 152 -77 129 -135 -6 49 -42 -121 -145 -287 299 -8
4157 -8 -60 -130 -181 -47 -40 -5 65 246 -84 -16 -47 97 253 -175 65 -193 -175 106 238 16 -98 -33 18 63 162
4182 162 262 1 28 144 -52 -23 -5 -28 33 0 -63 -111 -143 176 -100 -104 41 324 -270 -17 -248 -119 -191 184
4206 184 -33 203 71 -23 -291 -316 -114 18 -75 -86 -40 144 -70 64 192 241 -352 -68 47 205 -95 -253
4228 -253 -103 50 360 -209 33 -96 -92 -53 5 -29 -249 67 134 481 166 1 -121 18 84 7 -43 92 -70
4251 -70 -100 -64 -255 114 182 -24 -87 156 -154 111 223 104 -66 23 100 304 -168 -269 15 149 54 107 14
4274A4J97j00k98L59j05N0j38k05k1K11K12k20j73O7M4l2j2K00r7J58k3j55J67
4297A00j67K20l91J75j0J21k39K51p9O9J9L16o48K63k43J49J48%q3j07J14L30
4319C08j65m04K4l3K57l0j19LJ29r7J8j8J72P4k48J36J7j71j2K69n6o5k71L22
4343D0j41N3j10K85j39N7j88J76j58K46q8r9J55k7Q5n4j87N8j68M33l7k33l0p2
4367a43K53P8l06J90n3j04P5J20l84L14j0j61J61K53j71l03R5J13J34k44J32M3
4389H2J6j33J53q8O7k00K43k16o2N1K54m2m9j4k76j6K12m7J43k39k7P3R5k15J63
4414g2J19l6M1n7M3Rp0L6J8k15J32P7k67M30j65j61L06j17J2j11K57m21Q7j7Q4
4439e8j1J54j12P2J33m11L59r0j2K7k40K75m0K8J3m05M37k73LO0M6J62k38K59
$$ plain form
4274 14 211 111 -187 172 67 117 -21 -226 -247 -36 176 -44 -217 -150 -106 -138 -150 50 -47 111 88 -67 100
4297 100 -67 153 -238 -63 -73 48 -191 60 -19 50 69 385 -263 0 -243 -94 54 54 -29 -136 -22 308
4319 308 143 -261 -237 -270 -13 -43 -162 -159 -30 -127 -109 -127 45 119 -129 7 24 -147 -159 110 54 -11 -282 40
4343 40 -101 -48 -158 127 -12 45 -143 33 -125 121 33 -66 89 62 147 93 -94 -36 -204 229 192 -41 -71 -143
4367 -143 110 188 -118 72 19 -85 -10 110 -274 40 30 -131 30 283 112 -191 -96 17 151 -93 39 82
4389 82 98 -35 118 30 97 -103 140 -76 -138 -87 167 125 76 62 -214 -230 -18 -65 78 -161 -188 -115 -20 -235 -72
4414 -72 47 11 52 -5 38 47 -23 13 31 -184 -52 25 -242 188 23 -138 168 51 63 -48 209 -212 -125 -142 -58
4439 -58 -69 85 -27 45 178 -233 126 36 24 51 -189 86 46 74 87 -318 119 -154 -151 -91 -45 117 -121 138
4463A38M0m4n7M6q9K59k73L5P1r9o2Q9p6O5j69K11l2j92J96j02qJ60j63k15K79
4488HK67m71K24p5j10K76j05O9k5k18J59O8j28j36K07j65K1J34J79o9j83J79k71
4511a65J22m6J34j69K03P6%J7l65L29j53r9K72Pj35o4J0K7M8o5K01J57L1m33J08
4536D8RJ66k25n2J00n5j06K65k25J66J15j93J69j48j67O2j55K28j85L23j53j10
4558a23K18k64J79K3l1J05k76K62J5j81K60j62l81L16K09P1k56J28L1k4j60J07
4580F6m9K2Q7j76K18n3J15n2l08R9j5J39J09k97L34k01J64k88P2K50m92L14j71
4603a13K44n8J3M3p8Q1l03N49n57J30j66P9K00Mr5r8K48j61J98k97K99k37PL44
4627B76j86l42J36M8r7K78O1J87l30M5j18k7J00K7k53L43j83k35M72j72P4R4k94
$$ plain form
4463 138 178 134 77 123 34 293 20 55 126 27 -35 54 -22 43 -126 85 53 -139 57 -45 -53 107 -56 -271 8
4488 8 275 -196 28 -47 -157 119 14 83 58 -160 -1 67 -61 -197 10 -155 -134 0 179 110 -73 106 -165
4511 -165 -43 -89 45 -124 79 155 155 172 -193 136 -17 -116 156 163 28 -36 -26 1 49 -16 185 342 373 -60 48
4536 48 57 223 -2 -54 46 -9 -115 150 -75 91 206 13 182 34 -133 -71 -226 2 -183 140 -13 -123
4558 -123 95 -169 10 33 2 107 -169 93 108 -73 187 25 -356 -40 169 240 -16 112 143 119 -41 66
4580 66 17 39 126 -50 168 115 230 178 -130 -31 -46 93 202 -95 239 38 202 -86 -14 236 -256 58 -113
4603 -113 131 73 86 129 51 132 -171 378 -179 -49 -215 -136 64 68 -27 -125 123 -38 160 -137 162 -75 -68 276
4627 276 90 -252 -116 -68 -165 113 174 361 31 76 -42 -69 31 58 -195 148 -35 -270 202 30 104 198 -96
4650i6L56j87R2k28J37j27Qp3N9J67l6j68r3K27j72J82M8j01J4J05r2k6p0K33
4674A59k93K67j89K25l09L09l92J89j65L73j55j12j3R0J03L8k51R2J41p1k21L39
4696A54l25Q1J09l0n7KJ81l06K84l33L75R4j63j12Q9m5L73o6k58p9N9k00R0J4
4720f9N9j6pP7P9Q8m04L69p7J5m66M07m2J3J13l9L8M7k63J40k1JJ99l75K20k13
4746a27J54Q5Q9j27j98J59k29K92j78j01K33J13K5n55M79K38m45K13k56R5J88
4767A47k07N2J96J04m24k17K10j4J54L5J08m3j10j56N8K51K3k07J1O4Q0O0j79
4790dJ63j70J52k52M43l84r0N2J81N7j76j6j31K80o5j6lJ24j50P9r1K32j93OJ52
4815A80k67J08r0nK16m51K76N45m93J3J02j46p7j01K73O3j03k0l67N12O9k22J11
$$ plain form
4650 -96 260 73 165 -63 74 -53 -45 -118 -59 108 72 -96 -189 38 -134 48 96 -5 9 114 22 -4 -74 159
4674 159 -134 133 -56 169 -140 169 -223 -34 -199 174 19 -93 -106 -16 87 125 -126 -34 107 36 -185 154
4696 154 -171 -90 19 -11 -68 -66 115 -191 93 -240 135 229 66 -46 43 -2 371 305 47 -32 27 -173 -83 -69
4720 -69 -10 -26 -33 44 123 211 -193 176 99 114 -352 55 13 26 139 100 138 185 -78 62 41 42 241 -134 86 -127
4746 -127 27 112 201 74 -124 35 -194 98 -80 -181 52 165 190 -365 114 352 -93 120 -136 -41 147
4767 147 -60 -8 188 292 -132 -349 -139 -153 1 36 144 101 -9 -165 -107 144 167 -40 -29 35 115 175 -4
4790 -4 159 -11 141 -111 332 -52 -142 -90 91 148 -28 -44 -175 105 40 24 21 145 -5 74 -17 215 22 28 180
4815 180 -87 21 -69 -74 142 -309 -33 512 19 32 134 -12 -89 -190 83 146 43 23 -344 168 237 15 126
4838A26kn1j51j1R9K2J7j46M4K41j43M88o63K19k16K73j7q4r1K74k75J04k48K33
4862D2L0k61R4j06J89N8k56L83j46J5O0j61K60P7l26N6j27J29J86K3j52j33pj8
4886i1J63J34k85K16o9k00R7J54K77l06m5j41K0J24l06K97k85R0o9K10j11J77
4908E1K00m22L63k67J30k02L93k12M3q2J55m6k03R1jk9LJ26m41M71j46l28j03
4931d56N49%j7J27m28J49k10K38P9q6n1J00R0J35j75p8j25K30p4j22J03O6P4R2
4955B10l80R7l7L24m25N02l39J04j74J45O7m07K98j1j6k23K46J2L7q1J20j53K5
4978e9l3J44L0k03M4O6k3P8l0R7l18L21j28l0K40j83j35m5J83L3j72M21l30J88
5002A56k10kM04j01l00p6J80r2J34J50k21N1m27M22n0j03j37J31J92j40J20j92
$$ plain form
4838 126 124 73 -78 -89 10 32 49 -97 -53 188 45 533 -130 89 -127 146 129 45 -46 228 -47 57 -191 42
4862 42 72 -189 -95 -201 -12 46 -210 173 27 42 102 -59 201 278 -48 8 -119 10 196 219 67 -66 -73 -91
4886 -91 72 206 -79 137 68 -132 -35 119 396 90 45 -96 -76 48 -258 39 -246 -156 -225 -15 -126 51
4908 51 251 -171 192 -75 55 -147 246 34 77 -5 150 104 -99 -8 -9 -38 -35 91 -350 121 -25 -353 -456
4931 -456 93 93 76 203 -225 -76 -286 -48 31 -55 -106 -6 84 219 44 -34 -159 71 -3 -125 -22 44 118 210
4955 210 -170 -73 -110 214 -211 291 -48 56 -118 27 94 -313 -15 -26 -42 -265 -19 -7 30 -51 69 -84 -59
4978 -59 -92 52 82 -121 -77 -11 -34 44 14 111 -207 114 -14 -44 196 13 -122 -167 16 49 -123 298 -32 156
5002 156 -54 -56 348 247 -53 -129 51 -41 93 243 22 73 -354 68 18 -85 -222 -91 101 -39 81 -111
5024a11K16jp6k3l8J0J16k37J44j82J36Q8j28j52j2K98J74l07K74j92jk1j1K2
5048a4p8r3R0K69j14l44N23j22k28m6K91k84J97Q5o0j66P3n2j20P3J39j1r2J86
5072A02j61M3J82l14J84p1K56k42J82O1l33J33%J71l63J02N5M2K08o8q3r7J80
5095A69l74J36J80k87J06j2k26J62k9K22j28J58r2J57k19J75j33P7l73J00m2J68
5117a05L64k62rJ1K20N8l43j2K55j43rk0R4Q9j34p7L98m23k2n8K38j67j02P6J25
5142D2P6k45p4J45M0L1P4k34p5J64j05R9o4M2K0N6kK96k18j29j7J09P8m12K24
5167g9J85j15k27K20J11j13J26j0lJ7j5k31L32j60j35j52J93R1O1j44K4j56J56
5190b4r0J49k62J76N28n01R0l05M83l42m4M06k89q9K27j3j27l6J73J2j16j02O0
$$ plain form
5024 -111 105 104 28 5 -33 -23 93 -144 0 -182 -46 42 -86 -238 -250 48 222 -85 189 -3 -4 -25 -36 -14
5048 -14 -92 -185 -95 174 60 -284 239 117 -111 -157 134 -150 47 132 72 -94 -21 -73 -193 -120 19 8 -84 102
5072 102 -59 -16 166 -148 36 -35 221 -21 161 222 -111 22 22 193 -170 -68 -13 29 237 169 86 -11 169
5095 169 -205 -69 111 -176 -70 -82 -308 -146 -175 47 -81 77 -15 142 -77 98 -35 42 -331 -231 -273 -105
5117 -105 259 -3 -12 -1 219 277 -66 -78 177 34 25 5 99 188 54 -23 375 -48 -70 -128 110 -57 -159 -83 42
5142 42 118 -127 -201 -56 -16 15 89 -145 -220 -56 -161 -62 -126 -84 -64 -8 -10 286 68 -61 -78 31 109 -303 -79
5167 -79 106 -9 -236 -16 95 -18 108 98 95 112 97 -134 198 38 -97 -249 -56 35 96 -48 -24 -180 -24
5190 -24 -114 35 -227 -51 477 -24 66 -239 244 -98 -142 264 -25 -114 113 100 -27 -63 110 122 6 -96 -36
5213c6N2j5R5j35J26J01j50P0j22o0J43k98J75L8M6J07j00o0r5J35NK04k81K98
5237B43l29M9j58M5L00n0j65Q1l62L08K70l62R2J73j07j8P0j10P8J44p6J27j96
5260D7k60L12k49J70Rj21L03l84L64mm3j83l78M58R7k43J22j88K20j53J56j63
5282a11L58l02P8j0k21K15k0j42K3K24j35j54J8M4L23j71p6Rk88M47j55O1J88
5305B03k43K7Rk63M01l7l40L65m52N05j74q7Lnp5k5O0nJ49jK10j48K20l61j25
5330a89rJ73k6j9k9o6r2K80J5k73Q1L24r3k90O5M12l62J0J04J75j06k65K95Ln0
5355F8j4j30J82l67M14k86J31J99k57p2K5K04l85K66j02J56j11k88L27J43k82
5376a79L3n0K00J0j19P4J03k71pJ81J38o9J26j45j47K3l2K58j57J18k78L04j19
$$ plain form
5213 -36 16 1 96 -39 87 188 38 108 -14 -74 69 -229 -54 -16 30 137 37 -23 -118 17 22 226 -55 243
5237 243 -86 -37 -195 -150 150 100 -65 16 -346 -38 232 -130 -38 135 28 10 80 -30 48 192 116 243 47
5260 47 -213 99 -150 20 29 -92 211 -173 191 187 144 -39 -417 41 138 -105 17 -171 49 -104 52 -111
5282 -111 247 -55 23 13 -208 7 -13 -155 -132 92 -43 -197 -179 -135 188 17 -59 -50 -338 109 -46 15 203
5305 203 -40 -13 -4 -267 134 97 -243 122 -330 175 1 -86 -83 -88 -163 -188 -128 -133 16 15 225 77 297 -64 -189
5330 -189 -198 -25 -51 -70 -99 -165 -257 23 38 -235 -154 170 77 -213 -148 264 -98 -88 16 191 85 -180 115 118 68
5355 68 54 -76 106 -261 153 -133 -2 197 -60 -132 -107 97 -288 -22 -124 32 -79 -367 -40 103 -179
5376 -179 -146 -196 4 14 -105 -31 72 -199 -206 -25 113 44 170 25 -122 -99 -131 127 -30 88 -190 114 -5
5399ej89K26k27K82r3J51L1k00LN17l70p1j65J42J27j55j36J03qM6O2N5k76K29
5423G9j64J75j2J55k7k37J98l56J82k9K87k12j2r6J34p0j43J37J75k30J25l1k84
5446b56M03q7k61L04k47J15j17J99l11N35q8j07k6j36K1O7N2k7J37J49o35P0K87
5469D1n4Q6k29J07r2J38J55N6j57j1l09K14K7J14m8q8J12j38J03k55J24M23k30
5492H9J3j49r1J29j95L10j42Q4m2J23j56j85M14n5k88J47j76K57j21k7mJ65p1
5515B9j13j16L67k64J49j51J06m7M0J47m05M61l80l2K9K26j65L83%k60j50l5L53
5538A72k42O8j10O6K93M9O8m15R0K64l75J01j70J55J16j66J47j1j62k4R5K5K5
5561E9l33K98k5J37k88L26j17Mj84p9p0J62L2K37m6j47l7L13l72P1K06l0r3n4
$$ plain form
5399 -5 -194 32 -195 87 -6 145 176 -24 -21 496 126 55 -110 32 159 4 -132 -29 -37 9 71 126 -150 79
5423 79 -85 90 78 233 206 -31 167 -189 -7 -36 251 39 27 -69 65 -5 -148 -11 164 -66 59 28 -256
5446 -256 147 60 -201 103 -144 -29 -146 53 -258 277 189 82 56 -80 -59 8 60 33 170 319 -316 -246 41
5469 41 -13 73 -156 -49 -141 -3 152 208 51 40 -269 -55 -28 86 38 -50 62 -76 27 -228 -104 319 89
5492 89 102 -47 -138 -9 -204 106 -36 48 6 129 -27 -212 202 147 -141 6 -170 87 -34 -61 -65 100 29
5515 29 -84 -200 167 -97 52 -99 7 -40 0 147 -258 203 -177 -209 -180 46 -119 264 264 4 -146 -181 172
5538 172 -70 -2 -112 -46 247 296 364 -51 39 303 -72 29 -141 14 130 -36 111 100 -62 -86 9 34 59
5561 59 -274 24 -1 136 -152 174 57 61 -123 -202 -272 -110 -78 159 113 -34 -71 242 -130 -59 147 117 24 -30
5585c0r5K01J4l97L06J10J37q7q4j39J59o1j25N2o9p4M6J68J58j30j92J34j16
5608a14K62j83J56j05M2K13j89n0K47n65M43j53j14J16j45J93Q1N4m05K40L3j06
5630d9R7j07%j6q5M43j97k24J78k79L57k87J42n3j2M22k22l08K87k75L55n52K14
5653a71K43K4j00K33l65K55q7J06j70k06J35J71r1J77k78k3J37r6j39Q5J25J64
5675A29l3j74K42m25K76J63J50k70j44L9m3J43R4K96l43J16j93j17K52k65K5o1
5697a43O6J45oj71N3J36l51L08p2N6K99o53L09J81L5J9k84J13pq4K75m17R3J87
5721H7p2j59L00k66k83N26l14Q0n3j48M71k65K11P3j10n5j31L50n01M14p7q0K05
5744B03k06Q5o6j23K6m4J12J28k86Q0P1J50q9j31J29l3N5j87K73j34J07j59Q3
$$ plain form
5585 -30 -125 76 90 -307 -1 109 246 159 75 -64 95 34 -91 -39 -108 -182 -136 32 190 60 -132 2 -114
5608 -114 148 -35 121 16 58 271 82 32 279 -286 157 4 -110 6 -139 54 135 189 -216 24 57 -49
5630 -49 48 -59 -59 -75 -160 283 86 -138 40 -239 118 -169 -27 -80 -92 330 108 -200 87 -188 167 -385 -171
5653 -171 72 96 -4 229 -136 119 32 138 -32 -238 -103 68 -23 154 -124 -147 -10 -106 -245 -160 -35 129
5675 129 96 -78 164 -261 15 178 328 58 -86 -47 -90 53 147 443 100 216 23 -94 158 -107 -82 -143
5697 -143 -77 68 62 -109 -56 80 -271 37 -35 21 320 -333 -24 157 192 211 -73 40 33 -51 224 -193 -100 87
5721 87 15 -144 156 -110 -393 133 -181 -101 -154 -302 169 -96 115 188 78 23 -108 242 -259 155 78 -2 203
5744 203 -3 82 16 -107 -81 -125 -13 115 -171 -91 -20 130 41 -90 39 6 61 -126 147 13 120 -39 44
5767D4p0j98K26l8K2n0nm6l7J25j14K18k24l7J52J65o3k67K75l81L80l9l4Q0j09
5792b5J84j25M7j80K35k15K0K02l40M28m34RL99k56k6J35k16K98j65K62k45O7
5814E9k78m6L24r8J07J8Qn7j94J77l7l8J04L2J22j24k17J28j76K03J91k01M3o9
5838a9k34M84k25J50j76p4R8k8k63K53Rj6M1j86J50l71N19j87J38j51k01J88J19
5861A8Qk14K72j81J64q5L4K64m35P4r1J77m8j28M23j64J12j65o8L73m57L09p5
5884A17r1p1o5L83k52K29k61j45K36j76J75Q1l06J82n7k08J93j14K59Q6m03K81
5906G3n8j96P4k1n9J71J18k36r4J80J35q6k6L9O6m1J79j74j95L70m74P2K35KO3
5931A17j70J68j70j11M07Qk69N0r7j63K10q8J93ko7j17K49r4k21J54LJ39n2J63
$$ plain form
5767 44 -26 -224 2 -36 -14 -64 -69 -115 -152 -27 -141 77 -147 -184 -32 133 70 -197 78 -303 77 38 4 84 -25
5792 -25 159 34 81 -99 136 -79 -59 143 -197 231 -203 -194 205 -51 -77 58 -158 140 -25 237 -8 59
5814 59 -219 -265 59 -39 68 86 94 37 -157 20 -17 -55 49 81 203 79 -138 -10 -186 17 208 7 50 -19
5838 -19 -253 231 6 156 -20 -94 4 -24 -287 -34 -25 -41 0 -186 -36 -407 112 -75 63 -88 -289 -101 18
5861 18 26 -188 84 -97 67 -18 16 280 -155 -81 -172 5 -43 -171 252 88 200 35 -33 340 -117 192 117
5884 117 26 -45 -110 273 21 250 -11 -156 80 -96 79 160 -146 36 -21 -229 -36 -150 109 195 -208 73
5906 73 15 -181 -107 -128 -187 -16 102 -134 -228 -48 87 1 -25 14 80 39 218 44 -151 219 -255 -183 52 54 117
5931 117 -53 115 -55 -166 241 249 -20 30 -67 -230 -20 -108 85 83 16 -101 148 54 -167 -13 -10 129 77 240
5955B40k81k0J3j80J99K44l58J04M7n7Q9j26l9k6J35K2j52L58j2Ol90o6M86m35
5979a99J99J04K5j95K21l52J41J89j91P3J69k31J29J15k5k15q4K14k68L34m7m39
6001c33K14L2J85j15qN4J3J88k88j03J02P5j3k0m3P2%p1MK95l63J44l5j01n3K35
6027F7J03k39m1J8k25J96J62n2o0K9P4k10M68k67k20K37LJ38j14o2l47L05j8k8
6051h3J54Q6J0l07K45j51K1np9j35J05P7J22%P5p0k58L4P2J89qj94L76k76L05
6076C05m06O0QQ9J8J65j84j37J45j49M07k95j28j61L72j96J45j86K88k54J10l22
6098c06M93m19L61k38J18o9K06r4P0l29J54nR2M1M5j08K28k06j46Q4P1J8j67L31
$$ plain form
5955 240 -41 -61 -48 -228 -29 215 -143 -39 8 -49 40 -86 -125 -151 -16 6 -146 212 200 206 -184 -250 236 -199
5979 -199 0 104 129 -66 155 -197 -56 133 -58 15 184 -47 82 197 172 -43 -127 87 -181 153 106 -333
6001 -333 -119 -87 98 -17 -25 29 42 230 -58 -161 -59 16 3 -17 -60 12 12 -59 -55 240 -123 21 -14 -115 -168 67
6027 67 170 -69 -110 -92 -317 -121 41 -11 -71 -42 32 -178 290 23 -197 40 43 181 67 5 -342 -37 -55 -83
6051 -83 71 157 167 -140 105 -46 -25 -30 -109 -244 -139 -62 60 60 135 65 -193 -159 -87 102 94 -100 276 0 305
6076 305 -101 -41 -33 56 74 239 55 -82 63 -86 321 26 -102 -263 109 -87 58 -128 160 -94 16 -306
6098 -306 187 -232 129 -109 9 -60 146 52 122 -207 -53 -58 34 75 120 12 240 34 -112 -28 43 61 -106 225
$$ [...]
8191H3
##END NTUPLES=NMR FID
##END=
