##TITLE=1H_DE-94_oil
 200.13MHz, CDCl3,
 8 sc
 
 7.5.2025
##JCAMPDX= 6.0         $$ Bruker NMR JCAMP-DX V2.0
##DATA TYPE= NMR FID
##DATA CLASS= NTUPLES
##ORIGIN= UXNMR, Bruker Analytische Messtechnik GmbH
##OWNER= pz
$$ XWIN-NMR		Version 3.5
$$ Wed May  7 14:08:22 2025 Russian Standard Time (UT+4h)  she@DPX200
##.OBSERVE FREQUENCY= 200.1313
##.OBSERVE NUCLEUS= ^1H
##.DELAY= (6, 6)
##.ACQUISITION MODE= SIMULTANEOUS
##.ACQUISITION SCHEME= undefined
##.AVERAGES= 8
##.DIGITISER RES= 18
##SPECTROMETER/DATA SYSTEM= spect
##.PULSE SEQUENCE= zg30
##.SOLVENT NAME= CDCl3
##.SHIFT REFERENCE= (INTERNAL, CDCl3, 0, 14.3821)
##AUDIT TRAIL= $$ (NUMBER, WHEN, WHO, WHERE, WHAT)
$$ ##TITLE= Audit trail, XWIN-NMR		Version 3.5
$$ ##JCAMPDX= 5.01
$$ ##ORIGIN= Bruker BioSpin GmbH
$$ ##OWNER= she
$$ F:/spectra/data/she/nmr/H-C/1/audita.txt
$$ ##AUDIT TRAIL=  $$ (NUMBER, WHEN, WHO, WHERE, WHAT)
(   1,<2025-05-07 14:07:01.96 +0400>,<she>,<DPX200>,
      <created by zg, POWCHK disabled, PULCHK disabled
       configuration hash MD5:
       00 E9 B6 7A A2 85 ED C7 34 08 36 98 17 FE 4E 26
       data hash MD5: 16K
       49 1A 6F 38 F1 33 87 78 84 CA 38 66 B6 1B 06 4B>)
$$ ##END=
$$ 
$$ hash MD5
$$ ED 02 69 FD 03 21 F9 60 87 E3 3D 93 50 D6 D9 EC
##$RELAX= 
##$RELAX= 
##$RELAX= 
##$RELAX= 
##$RELAX= 
##$RELAX= 
$$ Bruker specific parameters
$$ --------------------------
##$DU= <F:/spectra>
##$EXPNO= 1
##$NAME= <H-C>
##$PROCNO= 1
##$TYPE= <nmr>
##$USER= <she>
##$AMP= (0..31)
100 100 100 100 100 100 100 100 100 100 100 100 100 100 100 100 100 100 
100 100 100 100 100 100 100 100 100 100 100 100 100 100 
##$AQSEQ= 0
##$AQ_mod= 1
##$AUNM= <au_zg>
##$AUTOPOS= <>
##$BF1= 200.13
##$BF2= 200.13
##$BF3= 200.13
##$BF4= 200.13
##$BF5= 200.13
##$BF6= 200.13
##$BF7= 200.13
##$BF8= 200.13
##$BYTORDA= 1
##$CFDGTYP= 0
##$CFRGTYP= 5
##$CHEMSTR= <none>
##$CNST= (0..31)
1 1 145 1 1 1 1 1 1 1 1 1 1 1 1 1 1 1 1 1 1 1 1 1 1 1 1 1 1 1 1 1 
##$CPDPRG= <>
##$CPDPRG1= <>
##$CPDPRG2= <>
##$CPDPRG3= <>
##$CPDPRG4= <mlev>
##$CPDPRG5= <mlev>
##$CPDPRG6= <mlev>
##$CPDPRG7= <mlev>
##$CPDPRG8= <mlev>
##$CPDPRGB= <>
##$CPDPRGT= <>
##$D= (0..31)
0 0.7 0 0 0 0 0 0 0 0 0 0.03 0 0 0 0 0 0 0 0 0 0 0 0 0 0 0 0 0 0 0 0 
##$DATE= 1746612421
##$DBL= (0..7)
120 120 120 120 120 120 120 120 
##$DBP= (0..7)
150 150 150 150 150 150 150 150 
##$DBP07= 0
##$DBPNAM0= <>
##$DBPNAM1= <>
##$DBPNAM2= <>
##$DBPNAM3= <>
##$DBPNAM4= <>
##$DBPNAM5= <>
##$DBPNAM6= <>
##$DBPNAM7= <>
##$DBPOAL= (0..7)
0.5 0.5 0.5 0.5 0.5 0.5 0.5 0.5 
##$DBPOFFS= (0..7)
0 0 0 0 0 0 0 0 
##$DE= 6
##$DECBNUC= <off>
##$DECIM= 32
##$DECNUC= <off>
##$DECSTAT= 4
##$DIGMOD= 1
##$DIGTYP= 9
##$DL= (0..7)
0 120 120 120 120 120 120 120 
##$DP= (0..7)
150 150 150 150 150 150 150 150 
##$DP07= 0
##$DPNAME0= <>
##$DPNAME1= <>
##$DPNAME2= <>
##$DPNAME3= <>
##$DPNAME4= <>
##$DPNAME5= <>
##$DPNAME6= <>
##$DPNAME7= <>
##$DPOAL= (0..7)
0.5 0.5 0.5 0.5 0.5 0.5 0.5 0.5 
##$DPOFFS= (0..7)
0 0 0 0 0 0 0 0 
##$DQDMODE= 0
##$DR= 18
##$DS= 0
##$DSLIST= <SSSSSSSSSSSSSSS>
$$ [...]
##$SUBNAM0= <"">
##$SUBNAM1= <"">
##$SUBNAM2= <"">
##$SUBNAM3= <"">
##$SUBNAM4= <"">
##$SUBNAM5= <"">
##$SUBNAM6= <"">
##$SUBNAM7= <"">
##$SUBNAM8= <"">
##$SUBNAM9= <"">
##$SW= 18.0517328524113
##$SWIBOX= (0..15)
0 0 2 0 0 0 0 0 0 0 0 0 0 0 0 0 
##$SW_h= 3612.71676300578
##$TD= 16384
##$TD0= 1
##$TE= 0
##$TE2= 300
##$TE3= 300
##$TEG= 300
##$TL= (0..7)
0 120 120 120 120 120 120 120 
##$TP= (0..7)
150 150 150 150 150 150 150 150 
##$TP07= 0
##$TPNAME0= <>
##$TPNAME1= <>
##$TPNAME2= <>
##$TPNAME3= <>
##$TPNAME4= <>
##$TPNAME5= <>
##$TPNAME6= <>
##$TPNAME7= <>
##$TPOAL= (0..7)
0.5 0.5 0.5 0.5 0.5 0.5 0.5 0.5 
##$TPOFFS= (0..7)
0 0 0 0 0 0 0 0 
##$TUNHIN= 0
##$TUNHOUT= 0
##$TUNXOUT= 0
##$USERA1= <user>
##$USERA2= <user>
##$USERA3= <user>
##$USERA4= <user>
##$USERA5= <user>
##$V9= 5
##$VALIST= <valist>
##$VCLIST= <CCCCCCCCCCCCCCC>
##$VD= 0
##$VDLIST= <DDDDDDDDDDDDDDD>
##$VPLIST= <PPPPPPPPPPPPPPP>
##$VTLIST= <TTTTTTTTTTTTTTT>
##$WBST= 1024
##$WBSW= 4
##$XGAIN= (0..3)
0 0 0 0 
##$XL= 0
##$YL= 0
##$YMAX_a= 132875
##$YMIN_a= -168088
##$ZGOPTNS= <>
##$ZL1= 120
##$ZL2= 120
##$ZL3= 120
##$ZL4= 120
##$ABSF1= 10
##$ABSF2= 0
##$ABSG= 5
##$ABSL= 3
##$ALPHA= 0
##$AQORDER= 0
##$ASSFAC= 0
##$ASSFACI= 0
##$ASSFACX= 0
##$ASSWID= 0
##$AUNMP= <proc_1d>
##$AZFE= 0.1
##$AZFW= 0.1
##$BCFW= 1
##$BC_mod= 2
##$BYTORDP= 1
##$COROFFS= 0
##$CY= -3
##$DATMOD= 1
##$DC= 2
##$DFILT= <>
##$DTYPP= 0
##$F1P= 0
##$F2P= 0
##$FCOR= 0.5
##$FTSIZE= 0
##$FT_mod= 4
##$GAMMA= 1
##$GB= 0.15
##$INTBC= 1
##$INTSCL= 1
##$ISEN= 128
##$LB= 0.25
##$LEV0= 0
##$LPBIN= 0
##$MAXI= 10000
##$MC2= 0
##$MEAN= 0
##$ME_mod= 0
##$MI= 1.114404
##$NCOEF= 0
##$NC_proc= 0
##$NLEV= 6
##$NOISF1= 3.799351
##$NOISF2= 2.8
##$NSP= 1
##$NTH_PI= 0
##$NZP= 0
##$OFFSET= 14.38212
##$PC= 1
##$PHC0= -1553.587
##$PHC1= 20.99222
##$PH_mod= 1
##$PKNL= yes
##$PPARMOD= 0
##$PSCAL= 0
##$PSIGN= 0
##$REVERSE= no
##$SF= 200.129724274929
##$SI= 16384
##$SIGF1= 3
##$SIGF2= 2
##$SINO= 400
##$SIOLD= 16384
##$SREGLST= <1H.CDCl3>
##$SSB= 0
##$STSI= 0
##$STSR= 0
##$SW_p= 3205.1282051282
##$SYMM= 0
##$S_DEV= 0
##$TDeff= 0
##$TDoff= 0
##$TI= <>
##$TILT= no
##$TM1= 0
##$TM2= 0
##$TOPLEV= 0
##$USERP1= <user>
##$USERP2= <user>
##$USERP3= <user>
##$USERP4= <user>
##$USERP5= <user>
##$WDW= 1
##$XDIM= 8192
##$YMAX_p= 0
##$YMIN_p= 0
$$ End of Bruker specific parameters
$$ ---------------------------------
##NTUPLES= NMR FID
##VAR_NAME=  TIME,          FID/REAL,        FID/IMAG
##SYMBOL=    X,             R,               I
##VAR_TYPE=  INDEPENDENT,   DEPENDENT,       DEPENDENT
##VAR_FORM=  AFFN,          ASDF,            ASDF
##VAR_DIM=   8192,          8192,            8192
##UNITS=     SECONDS,       ARBITRARY UNITS, ARBITRARY UNITS
##FACTOR=    0.0002768,     1,               1
##FIRST=     0,             0,               0
##LAST=      2.2672688,     0,               0
##MIN=       0,             -168088,         0
##MAX=       2.2672688,     132875,          0
$$ Real data points
##PAGE= N=1
##DATA TABLE= (X++(R..R)), XYDATA
$$ [...]
$$ plain form
1833 -176 -38 90 -116 186 -94 149 7 65 -81 157 -250 -21 -66 -176 -177 199 35 9 -56 98 -133 -21
1855 -21 124 -20 1 -67 -263 -78 -24 -169 -233 48 -16 -63 -34 -23 -91 60 185 225 30 -328 -242 -21 -31 -5 264
1880 264 43 160 -135 377 9 -2 229 -6 -69 -9 151 -6 177 143 -230 -232 72 -22 115 -225 -88 -73 301
1903 301 128 -7 184 -194 -80 133 8 -143 76 -93 -157 -81 -74 -110 -9 -308 -66 77 -12 107 35 273
1925 273 37 -138 82 143 161 71 85 -246 208 41 -83 -16 54 -83 187 234 -267 111 97 77 126 -7 16 -120
1949 -120 302 48 -95 132 -76 -30 163 196 -61 245 25 -148 342 110 -131 -69 -77 145 -113 183 34 -93
1971 -93 -52 -81 9 -23 -137 34 161 -224 -105 -4 -57 131 133 -64 65 128 34 -3 51 147 -111 76 59 160 0
1996 0 -21 73 160 43 -140 88 129 16 170 -171 193 100 185 40 162 -289 -177 51 -31 -21 -23 -241 -49 3
$$ packed form
1833a76J38J28k06L02k80K43j42N8j46K38m07K29m5j10jL76j64k6o5J54k31J12
1855b1J45j44K1o8j96J85N4j45o4K81o4m7K9J1o8J51J25M0j95l58Q6K21j0K6K69
1880B64k21J17k95N12l68j1K31k35o3O0J60j57J83l4l73kL04r4J37l40J37J5L74
1903C01j73j35J91l78J14K13j25j51K19j69o4P6Pl6J01k99K42J43q9J19p2K38
1925B73k36j75K20O1J8r0J4l31M54j67j24O7P0j37K70M7n01L78j4k0M9j33K3j36
1949a20M22k54j43K27k08M6J93L3k57L06k20j73M90k32k41O2qK22k58K96j49j27
1971i3M1k9R0l2j14J71J27l85J19J01n3J88Kj97J29O3r4l7N4R6k58J87j7J01j60
1996@k1R4Q7j17j83K28M1j13J54l41L64r3Q5j45J22m51J12K28q2J0kk18J92N2
$$ plain form
2020 3 -8 46 -60 -118 100 -67 241 -106 -58 185 4 290 198 55 177 235 -58 6 -180 -139 -16 -118 -5
2043 -5 -75 -271 97 104 -58 430 140 -34 214 -89 -305 -53 -253 34 -64 77 114 15 -13 -291 134 96 -102
2066 -102 204 20 -32 160 -99 -179 -232 13 -23 -97 -36 94 -97 251 128 47 -50 -64 234 87 18 202 -259
2089 -259 -219 -104 -24 64 -62 67 -117 163 105 -14 42 -28 15 298 34 -39 -70 -140 -182 30 -69 -165 175 27
2113 27 -103 -31 -205 -291 -37 -57 -91 -90 -164 -102 162 132 -92 56 -50 25 66 -234 114 137 121 -154 167 -2 -322
2138 -322 -213 -21 39 28 187 2 36 -5 229 1 -63 -119 128 74 -152 -204 73 7 -323 136 127 -160 65 -62
2162 -62 204 13 -49 32 139 -250 171 -62 18 286 -61 -48 -314 -93 -71 97 -88 5 14 263 -98 -104 88 58
2186 58 -328 37 -228 87 -123 -90 -70 -172 166 -115 109 30 -123 123 -324 -56 -107 56 15 -70 -109 134 -34
$$ packed form
2020Cj1N4j06n8K18j67L08l47M8K43j81K86r2j43J22N8k93O4j86M1J23j02J13
2043ep0j96L68Pj62M88k90j74K48l03k16K52k00K87r8J41L7r9k8k78M25l8j98
2066a02L06j84n2J92k59q0n3K45l6p4O1J30j91L48j23q1r7j4K98j47o9J84m61
2089b59M0J15Q0Q8j26J29j84K80n8j19N6p0M3K83k64p3l1p0m2K12r9r6L40j48
2113B7j30P2j74q6K54k0l4Jp4O2K64l0k24J48j06P5M1l00L48K3j6k75L21j69l20
2138c22J09J92O0j1J59j85L4m1K34k28o4n6K47n4k26n2K77o6l30M59rk87K25j27
2162f2K66j91o2Q1J07l89M21k33Q0K68l47J3k66K21K2J68j85R3RK49l61oJ92l0
2186E8l86L65k65L15k10L3K0j02L38k81K24p9j53K46m47K68n1J63m1q5l9K43j68
$$ plain form
2209 -34 55 34 11 51 134 452 -124 295 -185 25 -163 139 171 97 -81 -28 47 -37 -156 -45 122 -139 107 -53
2233 -53 -156 -112 -5 -59 -222 -12 105 -86 23 -115 -229 -85 -11 -232 -14 -71 265 -81 -72 -47 -60 226 127
2256 127 -189 -234 -138 -40 32 228 26 230 61 96 -417 -144 -91 161 81 -10 -83 34 233 -224 -159 -134 -167 -18
2280 -18 -112 -132 -134 130 -73 -139 40 1 -195 12 111 119 -52 73 -64 23 74 -88 -211 105 -35 90 77 -4 163
2305 163 -49 -7 -13 -46 -282 -34 -66 61 -206 -37 -146 146 -147 77 50 -270 -46 -7 -4 70 -105 116 156 125
2329 125 172 124 -256 -73 -33 -164 9 106 143 266 -43 48 221 102 80 295 131 69 346 -50 -161 -11 -27
2352 -27 -68 79 -212 121 47 81 -217 70 -62 -206 -128 -142 157 129 81 -243 123 -14 -94 17 -134 -70 -51 13
2376 13 -264 -32 178 28 169 -107 14 -48 -154 -20 -87 -141 -136 32 138 -138 57 -315 146 352 186 73
$$ packed form
2209c4Q9k1k3M0Q3L18n76M19m80K10j88L02L2p4j78N3P5q4j19J11J67k61K46j60
2233e3j03M4J07n4j63K10J17j91J09j38j14J44P4k21K18n7L36l46RK5j3K86r9
2256A27l16m5R6R8P2J96k02K04j69L5n13K73N3K52q0r1p3J17J99m57O5K5l3J49
2280a8r4k0kK64k03o6J79l9j96K07R9Qj71J25j37Q7N1j62j23L16j40J25j3q1J67
2305A63k12M2ol3k36K48l2J27k67J69j09K92k93K24k7l20K24L9LP4j75K21M0l1
2329A25M7m8l80J83M0j31J73R7L7J23l09R1J73j19k2K15j64o2K77l96j11J50j6
2352b7m1J47k91L33p4L4k98K87j32j44P8j4K99k8m8l24L66j37q0J11j51O4J9O4
2376A3k77K32K10j50J41k76J21o2j06J34o7n4NJ68J06k76J95l72M61K06j66j13
$$ plain form
2398 73 141 97 79 202 335 81 41 54 237 161 -182 107 -88 -88 6 -32 56 59 29 14 80 285 -88 -201 -22 -129
2424 -129 100 75 -39 14 -80 76 -97 -164 -249 -180 281 155 42 -226 -15 246 -8 -203 -134 62 28 -18 73
2447 73 -42 354 -61 -111 -141 -78 77 -291 131 -247 -9 48 -119 -118 16 -282 94 222 -134 106 172 -38 -28
2470 -28 91 -371 62 -51 4 -120 -30 79 159 -326 -104 202 6 -184 -11 77 -7 -89 -277 -115 77 129 87
2493 87 10 102 -130 224 -50 18 62 -57 223 64 216 -180 116 24 -241 -83 -44 141 -72 -13 51 31 22 24 34
2518 34 -51 -105 -122 70 98 58 14 35 135 -8 97 -13 -25 -91 -5 113 -145 -160 81 229 151 150 156 97 39 271
2544 271 2 143 -159 68 -293 163 52 181 51 -76 207 193 249 -195 59 -139 -118 185 134 -173 -195 88
2566 88 13 33 -149 -161 39 55 14 121 -132 -64 -200 -128 123 162 59 41 -185 -107 103 -96 178 147 -45 232
$$ packed form
2398G3O8m4j8J23J33k54m0J3J83p6l43K89j95%R4l8Q8Ll0j5O6K05l73j13J79j07
2424a29K29k5j14N3r4J56j73o7q5O9M61j26j13k68K11K61k54j95O9J96l4m6R1
2447G3j15L96m15n0l0O3J55l68M22l78K38N7j67JJ34k98L76J28l56K40O6k10J0
2470b8J19m62M33j13N5j24R0J09Q0m85K22L06j96j90J73Q8q4q2j88J62J92N2m2
2493H7p7R2k32L54k74O8M4j19K80j59J52l96K96r2k65J58L9J85k13N9O4k0rKJ0
2518C4q5n4j7J92K8m0m4K1J00j43J05j10j2o6Q6J18k58j5K41J48p8jOn9n8K32
2544B71k69J41l02K27l61M56j11J29j30j27K83j4N6m44K54j98K1L03n1l07k2K83
2566H8p5K0j82j2K00J6m1J07k53O8j36P2K51L9j03j8k26P8K10j99K74l1j92K77
$$ plain form
2590 232 69 52 39 -59 -40 -59 -237 172 -134 -154 24 -272 26 97 -30 14 -28 186 112 92 -212 -26 -12 -46
2614 -46 64 69 64 -189 154 107 -88 174 -18 19 -167 -17 -115 94 82 83 238 30 157 -226 -5 -115 -99 -9
2638 -9 79 140 -129 26 -282 -17 60 145 -145 84 67 274 -24 61 12 -23 -9 -125 61 125 -17 115 -21 21
2662 21 -12 -198 71 121 -169 -9 -56 88 -16 139 2 106 288 -13 272 76 -8 -159 -49 -39 -2 157
2684 157 85 -37 57 -53 -45 -20 38 -77 -206 81 183 -262 54 67 -9 -197 -249 -189 -118 -1 -124 184 202 -88
2708 -88 -128 -131 -151 55 -133 -75 36 -176 -96 78 -87 -41 -47 -86 79 -50 76 -64 454 -43 -175 244 46 12
2732 12 84 47 -137 44 58 50 25 -27 -222 134 -139 105 274 -25 -15 195 7 -119 15 324 -246 -31 101
2755 101 67 22 199 79 -384 0 52 98 -178 157 180 74 21 268 -153 224 127 -116 -67 -98 85 -229 255
$$ packed form
2590B32j63j7j3r8J9j9j78M09l06k0J78k96K98P1j27M4m2K14p4k0l04J86J4l4
2614d6J10Nnk53L43m7j95K62j92L7j86J50r8K09j2JJ55k08J27l83K21j10J6R0
2638iQ8O1k69J55l08K65P7Q5k90K29j7K07k98Q5m9l5J4j16J86O4j42J32j36M2
2662B1l3j86K69N0k90J60m7J44j04J55j37J04J82l01K85j96q4j51J10J0L7J59
2684A57p2j22R4j10QK5N8j15j29K87J02m45L16J3p6j88n2O0P1J17j23L08J8k90
2708h8m0lk0K06j88N8J11k12Q0J74j65M6ol9J65j29J26j40N18m97j32M19j98l4
2732A2P2l7j84J81J4qk5n2j95L56k73K44J69k99J0K10j88j26J34L09n70K15J32
2755A01l4m5J77j20m63L84N2M6k76L35K3j06n3K47m21L77r7k43M9l1J83l14M84
$$ plain form
2778 255 24 70 -217 146 222 -19 7 -13 -301 -98 116 -215 78 -7 -189 65 -180 105 -113 1 -115 -210
2800 -210 8 -115 120 -6 -3 122 -317 4 -17 -76 -172 -120 39 -71 43 -152 -42 -41 -55 126 -63 -178 177
2823 177 167 -6 -45 252 -90 273 254 -202 -111 1 -68 -104 178 -61 -63 223 -1 -108 129 75 -15 -178 0
2846 0 146 107 12 -151 -214 -178 0 -116 -104 177 -185 -70 87 151 -206 -19 245 -115 -5 55 -15 -97 -44 -99
2870 -99 22 103 -96 14 -232 -157 -221 -100 -142 -89 299 136 182 268 -142 79 -162 43 171 -222 -239 -175 -294
2893 -294 -51 162 -162 111 -430 -21 -158 -37 -46 120 -88 101 120 129 -158 134 -228 269 -60 133 149 -156
2915 -156 -198 -3 408 105 -133 -53 -152 -134 69 -223 52 47 -72 71 56 108 62 -111 -53 -42 91 194 186 316
2939 316 -27 -25 -11 150 125 -27 80 -285 -54 -82 -44 0 59 136 -324 -165 -227 221 157 191 52 -36 67 143 -83
$$ packed form
2778B55k31M6k87L63P6k41K6k0k88K03K14l31K93q5j82K54k45K85k18J14j16r5
2800b10K18j23K35j26LJ25m39L21k1n9r6N2J59j10J14j95J10Jj4J81j89j15L55
2823A77j0j73l9K97l42L63j9m56R1J12o9l6K82k39kK86k24j07K37n4r0j63J78
2846@J46l9r5j63o3L6J78j16J2K81l62J15J57O4l57J87K64l60J10O0p0q2N3n5
2870i9J21Q1j99J10k46P5o4J21m2N3L88j63M6Q6m10K21k41K05J28l93j7O4j19
2893b94K43K13l24K73n41M09j37J21rJ66k08J89J9Rk87K92l62M97l29J93J6l05
2915a56m2J95M11l03k38Q0r9J8K03k92K75nj19J43j5N2m6j73N8J1J33J03qJ30
2939C16l43KJ4J61k5j52J07l65K31k8L8M4N9P7m60J59o2M48o4L4j39q8J03P6k26
$$ plain form
2964 -83 174 16 117 201 160 6 -244 -5 76 -137 68 -45 285 64 66 29 203 -160 -54 124 71 102 99 -4
2988 -4 -127 73 -33 -62 64 -1 -342 13 -164 -82 -84 112 245 -53 91 -62 21 -157 -213 -125 -53 96 105 -194
3012 -194 175 -34 -89 98 70 -54 -247 8 195 -63 48 -185 -101 176 170 -39 -93 -132 22 -221 -23 35 135
3035 135 -281 -58 -118 46 61 -41 -222 -143 -142 150 -132 -64 41 -28 45 149 -102 -17 -227 -22 33 -91 -38 -99
3059 -99 48 157 -232 -100 68 54 171 -3 -87 -69 34 -69 59 -299 -24 160 -180 -101 158 26 32 -5 52
3082 52 -66 -106 22 195 6 188 -97 146 -57 76 -1 -111 57 -132 117 -70 -103 122 -40 134 68 173
3104 173 -127 -114 -86 -39 -39 187 -13 257 123 43 39 -211 -144 -27 -256 -11 120 -102 -23 1 -53 88 281 -243
3128 -243 -170 -100 -136 158 82 178 300 26 -134 241 33 -3 22 232 9 291 -47 -156 -7 92 150 -95 290
$$ packed form
2964h3K57j58J01Q4m1j54k50K39Q1k13K05j13L30k21Kl7J74l63J06J78n3L1lj03
2988dj23K00j06k9J26o5l41L55j77Q2kJ96J33k98J44j53Q3j78n6Q8P2J49Rk99
3012a94L69k09n5J87k8j24j93K55J87k58J11k33Q4K77ok09n4l9J54k43J98N8J00
3035A35m16K23o0J64J5j02j81P9JK92k82O8J05o9P3J04k51Q5k10K05N5j24N3o1
3059i9J47J09l89J32J68j4J17j74q4J8J03j03J28l58K75J84l40P9K59j32Ol7N7
3082E2j18m0J28J73j89J82k85K43k03J33p7j10J68j89K49j87l3K25j62J74o6J05
3104A73l00J3K8M7%K26k00K70j34q0mk50O7J17k29K45J31k22P9K4n4J41J93n24
3128b43P3P0l6K94p6R6J22k74j60L75k08l6K5K10k23K82l38j09J49R9N8k45L85
$$ plain form
3151 290 -67 -61 38 -161 19 -153 174 -163 -210 -93 126 -84 29 -190 8 93 -19 -84 -150 26 197 -292
3173 -292 190 31 -256 -265 72 88 153 126 232 38 -84 -59 158 276 -179 27 -98 -335 75 211 235 202 -246
3196 -246 -11 -127 128 -203 17 338 -363 -2 20 -79 -182 62 -6 -39 181 212 -24 131 4 -13 -28 59 183
3219 183 -96 129 23 -31 -139 -111 -201 -21 145 -248 55 59 130 -155 54 8 19 299 -50 6 -191 30 14
3242 14 -78 29 -96 -29 6 -357 -100 -66 18 -132 107 52 -178 -36 32 26 -155 151 -143 -201 52 -126 -37 212
3266 212 5 43 95 10 72 -149 -22 -93 -112 50 -8 -4 3 -17 83 -76 20 61 144 149 -64 12 -97 -36 -29 -81 111
3293 111 125 62 243 -42 -34 -9 61 -296 -43 -160 -232 190 281 112 -50 -193 241 -39 82 -52 204 147 -83
3316 -83 418 -3 -127 -21 56 258 -103 37 -242 -65 -114 -106 -46 256 -13 19 -234 119 -33 -20 17 -57 45
$$ packed form
3151B90l57OR9j99J80j72L27l37m7J17K19k10J13k19J98Q5j12o5o6J76J71m89
3173b92M82j59k87rL37J6O5k7J06j94j22K5K17J18m55K06j25k37M10J36K4l3m48
3196b46K35j16K55l31K20L21p01L61K2r9j03K44o8l3K20L1k36J55j27j7j5Q7J24
3219A83k79K25j06n4j08K8r0J80J66l93L03MP1k85K09m6J1K80l49N6j97K21j6
3242A4r2J07j25O7L5l63K57L4Q4j50K39n5k30J42O8oj81L06k94n8K53j78Q9K49
3266B12k07L8N2q5O2k21J27p1j9J62n8MPk0J00j59R6M1Q3Nk13P6j09O1Pn2J92
3293A11J4o3J81k85QK5P0l57K53j17p2M22R1j69j62j43M34k80J21j34K56n7k30
3316h3N01m21j24J06P7K02l61J40k79J77m9QO0L02k69L2k53L53j52J3L7p4J02
$$ plain form
3339 45 -156 40 -208 19 -192 167 -5 -186 119 -261 96 168 215 11 -259 -29 87 -18 -35 -20 -430 -148
3361 -148 -125 -9 -48 264 -265 81 79 66 48 76 112 244 130 -110 97 136 -110 200 -42 187 -117 68 -149
3384 -149 199 23 -17 -57 194 144 -331 -65 256 40 -9 127 80 224 31 -101 40 -157 59 194 -105 25
3406 25 -23 -120 151 11 106 93 219 -111 37 19 146 68 177 -72 68 120 250 -67 51 166 39 -16 -77
3429 -77 97 38 44 -18 173 -13 -51 -127 -72 52 32 90 78 -207 -34 -76 303 173 -390 -130 -131 -170 -95 -93 86 -33
3455 -33 45 -123 -24 119 -77 -186 120 44 0 -69 43 -291 -108 61 39 164 -18 136 -237 -236 22 153 -62
3478 -62 -26 27 82 51 71 25 53 89 18 -83 -140 -29 -59 169 -123 -94 -100 -50 33 -175 -89 -154 -162 233 -128 56 -400
3505 -400 -83 -93 -58 -100 -88 -138 -77 -41 81 45 26 -118 74 145 62 -11 -312 67 -303 -54 100 -39 -28 55 39
$$ packed form
3339D5k01J96k48K27k11L59j72j81L05l80L57P2M7k04k70K30J16j05j7J5m10K82
3361a48K3J16l9L12n29L46kj3j8K8L6J32j14k40K07L9k46L10k42K29l04J85k17
3384a49L48j76m0m0K51n0m75K66L21k16m9J36m7J44j93j32J41j97K16J35k99J30
3406B5m8r7K71j40R5j3J26l30J48j8J27p8J09k49J40N2J30l17J18J15j27n5o1
3429g7J74n9Oo2J91j86l8p6N5J24k0N8j2k85J73m2L79j30n63K60jl9P5KJ79j19
3455c3P8j68R9J43j96j09L06p6m4o9J12l34J83J69k2J25j82J54l73JK58J31k15
3478f2L6N3N5l1K0m6K8L6p1j01n7J11l0K28k92K9oN0Q3k08Q6o5qL95l61J84m56
3505d00L17j0L5m2J2n0O1L6J22l6j9j44J92P1q3p3l01L79l70K49J54j39J1Q3j6
$$ plain form
3530 39 196 -66 -205 -52 39 186 -2 -72 -16 108 3 -204 -148 -47 49 61 -175 235 207 26 155 -227 -20
3553 -20 184 278 95 175 -126 123 -128 -29 240 -501 -176 120 197 -65 -10 40 -19 54 -389 20 21 81 -162 89
3577 89 92 75 -87 -183 -167 86 95 -132 -104 -12 101 -159 117 196 15 176 3 99 83 -51 12 119 -270 -3 -294
3602 -294 -169 75 144 -175 65 357 -5 104 19 200 21 -224 -296 -126 -75 171 210 -156 -249 218 -69 136
3624 136 -12 -9 -96 -202 -159 223 139 -159 14 14 122 -160 -326 24 -97 -98 -170 -232 47 46 -6 -29 140 -59 87
3649 87 91 -232 268 110 -1 -71 212 -23 -39 94 123 -180 -140 -59 -233 -146 -118 -1 -290 -372 195 143 -37 -196
3673 -196 50 173 -96 -306 260 -71 277 -316 -90 144 -6 -127 51 155 -111 -192 160 290 233 -147 73
3694 73 18 269 -193 181 -7 35 -70 -177 -71 92 -12 135 39 -76 -318 5 -169 180 7 82 139 -7
$$ packed form
3530C9J57k62j39J53R1J47j88p0N6J24j05k07N6J01R6J2k36M10k8j81J29l82K07
3553b0K04R4j83Q0l01K49k51R9K69p41L25K96P7k62N5N0n9P3m43M09JO0k43K51
3577H9Lj7j62r6J6K53Rk27K8R2J13k60K76P9j81J61j73R6j6j34O3J07l89K67k91
3602b94J25K44O9l19K40K92l62J09q5J81j79k45p2J70N1K46L9l66r3M67k87K05
3624A36j48Lq7j06M3L82q4k98J73%J08k82j66L50j21jp2o2K79jn2k3J69j99J46
3649H7Ml23N00j58j11p0K83k35j6J33K9l03M0Q1j74Q7K8J17k89q2N67n2j80j59
3673a96K46J23k69k10N66l31L48n93K26K34j50j21J78J04k66q1L52J30n7l80K20
3694G3n5K51m62L74j88M2j05j07J06J63j04J47r6j15k42L23j74L49j73P5N7j46
$$ plain form
3716 -7 -36 -65 211 52 44 142 97 2 -181 -75 -245 -94 75 215 169 52 -133 2 9 69 7 113 30 -90 120
3741 120 99 3 -240 -41 56 -247 75 130 -359 7 -56 -135 91 -36 278 47 29 43 68 -128 32 -91 1
3764 1 25 98 55 -74 86 17 -270 317 217 -157 141 -3 11 36 104 -232 78 137 -160 63 -60 -187 27
3787 27 13 -156 189 -83 -4 -68 87 33 134 -25 38 35 62 -145 -9 -1 -139 67 -203 236 -182 20 -15 -55
3811 -55 336 -24 69 205 180 -56 86 -107 26 -88 -36 76 -49 -212 60 25 -188 46 185 253 20 114
3833 114 87 42 -82 136 133 123 -28 -26 128 2 -40 100 30 158 -45 20 5 162 -95 35 -50 63 85 -202
3857 -202 -282 -103 87 -141 -78 31 116 -209 -217 -73 -112 -188 21 84 16 14 184 -239 33 -178 2 248 4 -6
3881 -6 3 87 190 -123 72 -36 -126 123 163 -141 -103 80 32 74 -182 387 -174 -250 -185 -85 90 -2 101 -258
$$ packed form
3716gk9k9K76j59qR8m5r5j83J06j70J51J69J40m6j17j85J35PO0o2J06q3j20K10
3741A20k1r6k43J99R7l03L22N5m89L66o3p9K26j27L14k31j8J4K5j96J60j23R2
3764AK4P3m3j29J60o9k87N87j00l74K98j44J4K5O8l36L10N9k97K23j23j27K14
3787B7j4j69L45k72P9o4J55n4J01j59O3lK7k07J36Qj38K06k70M39m18K02l5m0
3811e5L91l60R3J36k5k36J42j93J33j14N2J12j25j63K72l5k13K34J39O8k33R4
3833A14k7m5j24K18lj0j51KJ54j26m2J40p0J28k03O5j5J57k57J30q5J13K2k87
3857b02q0J79J90k28O3J09Q5l25qJ44l9p6K09O3o8kJ70m23K72k11J80K46k44j0
3881fRQ4J03l13J95j08r0K49M0l04L8J83m8M2k56N69n61p6O5J00J75r2J03l59
$$ plain form
3905 -258 270 103 234 117 -92 242 -55 28 -9 48 19 -127 -62 297 187 85 -57 -142 74 133 31 283
3927 283 13 72 -46 -190 71 24 174 370 -71 -79 -34 -125 161 131 194 66 7 -149 25 -162 137 -213 -4
3950 -4 -233 -156 -11 45 183 -2 -316 81 -106 -32 252 -204 -9 -129 -14 190 143 -10 -19 15 -50 100 15 -39
3974 -39 -96 -279 185 149 50 106 72 41 169 -8 84 122 -22 -42 -157 229 83 -154 -39 77 -230 33 82 -211
3998 -211 43 59 67 -37 73 -167 -38 197 -24 257 -10 -163 8 -224 237 -3 92 -81 -148 33 -435 -108
4020 -108 -100 -98 -7 158 -240 156 25 -56 -119 130 -227 4 -113 -227 35 -164 -65 29 58 235 199 80 57 -248
4044 -248 90 241 -60 -152 161 9 -79 -52 -139 12 310 -5 194 -5 63 41 -47 -51 249 80 -48 -94 121
4067 121 -71 165 -189 -11 64 -253 -117 188 19 -63 -36 128 141 33 5 -171 31 260 -110 -76 -159 108
$$ packed form
3905b58N28j67J31j17k09L34k97Q3l7N7k9j46O5L59j10j02j42q5K16N9j02K52
3927B83k70N9j18j44K61m7J50J96m41qM5r1K86l0O3j28n9j56J74j87K99l50K09
3950dk29P7J45N6J38j85l14L97j87P4K84m56J95j20J15K04m7j53rL4o5J50q5n4
3974c9n7j83M64l6r9N6l4l1J28j77R2L8j44k0j15L86j46k37J15J16l07K63M9k93
3998b11K54J6Qj04J10k40J29K35k21K81k67j53J71k32M61k40R5j73o7J81m68L27
4020a08QKR1J65l98L96j31q1o3K49l57K31j17j14K62j99R9R4K9J77l6j19k3l05
4044b48L38J51l01r2L13j52q8K7q7J51K98l15J99j99O8k2q8mL00j69j28m6K15
4067A21j92K36l54J78P5l17J36L05j69q2K7J64J3j08k8j76K02K29l70L4q3K67
$$ plain form
4089 108 -178 -276 -16 111 33 228 -3 85 -75 244 22 100 -173 91 -91 -45 97 33 68 112 42 -63 -58 -32
4113 -32 55 -84 -71 14 74 30 -128 -91 -37 226 176 32 132 15 21 13 -38 200 37 147 94 -97 110 313 45
4138 45 -100 72 -85 29 -28 212 -12 -21 -4 20 67 132 178 -76 -226 110 -15 256 65 -306 60 -40 237
4161 237 -61 -17 37 -30 46 -227 35 -156 -80 -70 -33 42 -181 -151 -225 63 16 -71 -91 39 -103 204 -102 -288
4185 -288 -27 210 223 -264 123 -66 76 -153 -195 148 -169 181 41 -87 -200 208 -45 134 192 80 -326
4206 -326 -37 -64 34 440 -103 157 131 39 91 113 -17 -53 -53 -38 40 122 111 -130 -144 3 -79 -22 35 150 -37 18
4232 18 195 229 90 146 73 -258 125 -43 -28 230 53 36 154 -319 136 334 49 56 -235 -81 -155 212 -83
4255 -83 -102 -101 -128 -192 -81 48 -195 11 -87 -124 -37 229 -102 96 -177 181 -134 154 -49 -77 176 -90 -95 227
$$ packed form
4089A08k86r8K60J27p8J95k31Q8j60L19k22P8k73K64j82M6J42o4L5M4p0j05NK6
4113c2Q7j39J3Q5O0m4j58L7N4K63n0j44J00j17Oqn1K38j63J10n3j91K07K03k68
4138D5j45J72j57J14n7K40k24rJ7K4M7O5M6k54j50L36j25K71j91l71L66j00K77
4161B37k98M4N4o7P6k73K62j91P6J0L7P5k23L0p4K88m7q7k0J30j42L07l06j86
4185b88K61K37J3m87L87j89J42k29m2L43l17L50j40j28j13M08k53J79N8j12m06
4206c26K89k7R8M06n43K60k6r2N2K2j30l6%J5P8Q2j1k41j4J47q2N7N7J15j87N5
4232A8J77L4j39N6p3l31L83j68J5K58j77j7J18m73M55J98k85Pk91J54p4L67k95
4255h3j9Jk7o4J11J29k43K06r8l7Q7K66l31J98k73L58l15K88k03k8K53k66nL22
$$ plain form
4279 227 173 -191 68 71 -43 -101 22 -78 -13 -24 119 -116 -146 -168 -21 91 -107 153 -163 187 95 32 318
4302 318 -203 -151 275 -21 -102 -164 5 54 -95 -36 98 -134 153 109 -7 -138 -114 -15 114 162 -67 -24 13 195
4326 195 -73 51 -278 -260 -70 14 37 -10 -132 105 -174 5 74 -44 -96 154 50 118 46 -101 -29 -164 -147
4349 -147 533 131 15 64 -123 -99 -105 15 306 273 124 197 -33 -179 -118 -6 -51 -145 -32 -191 -173 13 -399
4372 -399 -40 -228 180 -71 185 238 -36 -11 131 -303 121 -62 -23 75 -199 -6 -129 287 108 7 222
4393 222 -23 -115 206 214 -13 -10 376 0 14 9 -75 65 53 164 -94 -168 -211 306 65 12 -11 83 147 104 258 16
4419 16 -80 11 -15 -34 -165 48 -68 -186 -2 -14 101 87 6 205 5 233 93 163 68 -38 -65 155 123 92
4443 92 196 20 -33 -30 -102 66 -179 -142 -196 80 -145 51 47 -253 -117 38 70 216 -267 168 -30 46 14 222
$$ packed form
4279B27n4l64K59Lj14n8J23j00O5j1J43k35l0k2J47J12j98K60l16L50r2o3K86
4302C18n21N2M26k96q1o2J69M9j49N9J34k32K87m4j16j31K4R9J29M8k29M3L7J82
4326A95k68J24l29J8J90Q4K3m7j22K37k79J79O9j18n2K50j04O8p2j47P2j35J7
4349a47O80m02j16M9j87K4oJ20K91l3j49P3k30j46O1J12m5r4J13j59J8J86m12
4372c99L59j88M08k51K56N3k74K5J42m34M24j83L9R8k74J93j23M16j79j01K15
4393B22k45r2L21Qk27LL86l76J4nq4J40j2J11k58p4m3N17k41n3k3R4O4m3J54k42
4419A6r6R1k6j9j31K13j16j18J84j2J15j4q1J99k00K28j40P0r5j06k7K20l2l1
4443I2J04j76n3Lp2J68k45L7n4K76k25J96ml00J36J55L2J46m83M35j98P6l2K08
$$ plain form
4467 222 189 -197 -99 5 199 -102 112 -114 128 137 -127 66 -203 -16 46 -133 -228 -90 -272 8 -101 88
4489 88 85 30 -87 88 425 -63 211 -83 -137 -72 -23 -380 -27 143 -311 83 146 -265 -87 206 19 -37 -182
4512 -182 118 -159 183 155 -65 -173 -88 -22 150 -23 102 -53 -163 -62 -141 -207 -63 -72 -101 -21 -100 197 -248
4535 -248 -166 -18 -166 212 -65 -96 -304 -72 -133 -77 -96 138 -165 24 60 215 268 146 -17 -54 212 128 290
4558 290 31 -122 -1 110 -203 -160 -58 39 123 185 -21 -30 -115 -15 -103 -13 59 178 141 202 -23 294 -306 29
4582 29 -125 -228 192 -302 11 -185 146 79 71 -300 -68 1 234 206 -130 84 47 60 -112 -29 -191 222 184
4605 184 -226 -98 327 380 200 61 -32 64 -107 13 14 254 -90 233 112 -168 180 -232 -70 190 -119 133
4627 133 0 -12 -52 -143 12 -42 11 47 258 -111 93 9 -166 16 372 53 -1 145 -30 35 169 42 290
$$ packed form
4467B22l3l86R8J04J94l01K14k26K42Rk64J93k69J87O2j79r5J38j82K80j09J89
4489H8ln5j17J75L37m88K74k94n4O5M9l57L53J70m54L94O3m11J78K93j87n6j45
4512a82L00k77L42k8k20j08Q5O6J72j73J25j55j10J01p9o6J44rk9Q0p9K97m45
4535b48Q2J48j48L78k77l1k08K32o1N6j9K34l03J89L6J55N3j22j63l7K66q4J62
4558B90k59j53J21J11l13M3J02R7Q4O2k06rq5J00q8R0P2J19l7O1k25L17o00L35
4582B9j54j03M20m94L13j96L31o7ql71K32O9K33k8l36K14l7J3j72Q3j62M13l8
4605A84m10J28M25N3j80j39r3R6j71J20JK40l44L23j21k80L48m12J62K60l09K52
4627A33j33j2m0r1J55n4N3L6K11l69K04q4j75J82L56l19n4J46j75O5J34j27K48
$$ plain form
4650 290 -27 41 60 -48 107 74 -162 117 -94 49 -115 -50 262 -79 160 -124 -76 -123 -16 88 -103 29
4672 29 205 261 7 28 -69 -35 186 279 -13 54 106 154 -10 118 6 44 56 157 244 82 -271 122 62 117 -342
4697 -342 265 129 -181 269 130 69 -86 149 -85 35 -135 30 75 -12 -240 -124 -12 91 152 150 -66 37
4719 37 179 235 -185 -99 -59 -48 5 -73 346 246 59 196 109 148 -25 205 -220 -122 69 13 69 -148 121 -143
4743 -143 79 -84 -90 -176 -149 -250 223 -60 119 -59 -378 146 15 -125 -113 -72 1 -87 110 46 36 -117 -238
4766 -238 115 90 -241 82 -30 146 179 106 15 181 -198 -192 -215 149 -90 162 75 -88 -388 81 72 -248 -188 -159
4790 -159 72 -212 94 -184 -120 -203 27 -19 -54 11 -188 53 167 116 -144 12 257 -119 149 -269 89 75
4812 75 -41 5 -95 142 -207 -13 47 41 -106 -218 -134 -26 -129 -139 -100 19 -42 237 -41 406 121 94 -62
$$ packed form
4650B90l17O8J9j08J55l3k36K79k11J43j64O5L12l41K39k84M8m7J07J04j91J32
4672B9J76N6k54K1r7L4K21R3k92O7N2M8j64J28j12L8J2J01Q7j62l53L93o0N5m59
4697c42O07j36l10M50j39o1j55K35k34J20j70J65M5q7k28J16J12J03O1kk16J03
4719C7J42N6m20Q6M0J1N3p8M19j00j87J37q7L9j73K30m25R8J91n6N6k17K69k64
4743a43K22j63oq6K7j01M73k83J79j78l19N24j31j40J2M1P3q8J97o4j0j53j21
4766b38L53k5l31L23j12J76L3p3r1J66l79Ok3L64k39K52q7j63l00M69rl20O0K9
4790a59K31k84L06k78O4q3K30m6l5O5j99K41J14n1k60J56K45l76K68m18L58j4
4812G5j16M6j00K37l49J94O0oj47j12Q4J08j03j0L9J19o1K79k78M47k85k7j56
$$ plain form
4835 -62 69 29 81 140 65 60 -93 70 138 173 -150 58 -53 -166 80 210 -254 173 -36 146 -137 -132 127 -199
4859 -199 -108 36 -15 -103 -168 12 -83 -117 104 212 -158 -285 -33 27 -500 138 -52 -45 -145 7 -155 80 -220
4882 -220 -57 57 -5 150 92 -121 -174 -72 -531 29 -55 -12 -36 22 40 131 -99 -55 -17 150 90 -214 -226 -22
4906 -22 77 218 55 -49 -36 100 -182 38 -78 315 -155 14 158 59 47 291 -2 -279 47 -75 326 -235
4928 -235 -16 159 -198 229 143 -150 -151 54 132 -124 -114 -77 132 177 128 -31 271 274 8 134 99 26 14 -181
4952 -181 -189 118 -102 29 79 122 25 32 -286 178 8 -37 106 -96 -57 -226 142 40 75 158 84 -25 73 -358
4976 -358 -36 185 131 -5 17 -4 -12 -21 6 -209 26 211 -10 221 -204 -165 -61 186 -35 139 18 -219 -153
4999 -153 -49 -148 -116 -251 -200 -33 -180 -100 -368 89 -45 -178 282 -161 274 298 23 -183 -85 258 -122 178
$$ packed form
4835f2J31m0N2N9p5nj53J63O8L5l23K08j11j13K46J30m64M27k09J82k83NK59l26
4859a99R1J44n1q8o5J80r5l4K21J08l70j27K52O0n27O38j90Pj00J52j62K35l00
4882b20J63J14o2J55n8k13n3J02m59N60q4M3k4N8J8R1k30M4L8J67o0l04j2K04
4906b2R9J41j63j04J3J36k82K20j16L93m70J69J44r9j2K44k93k77L26j22M01n61
4928b35K19J75l57M27q6k93jK05P8k56J0L7K09M5m9j59L02Lk66J26l5p3j2j95
4952a81qL07k20J31N0M3r7Pl18M64j70m5J43k02L9j69L68j02L5Q3p4j09R8m31
4976c58L22K21n4j36K2k1qrK7k15K35J85k21K31m25L9J04K47k21J74j21k37O6
4999a53J04r9L2j35N1J67j47Q0k68M57j34j33M60m43M35K4k75k06R8L43l80L00
$$ plain form
5021 178 94 146 -100 -177 -261 -58 -187 -13 2 -23 -306 269 308 -189 0 313 -151 -75 -83 231 -267 10 393
5044 393 -166 99 -191 112 37 0 -18 -138 17 -174 55 50 -238 115 -356 -42 -88 30 -142 -51 -53 -118 261
5067 261 -274 -61 -30 242 162 -29 5 74 20 83 47 50 108 -8 -223 -48 181 -49 -59 1 25 -211 21 78 32
5092 32 202 49 28 47 -151 18 -23 93 -10 -20 -143 134 -28 -32 28 -176 -246 96 26 56 237 -138 35 -324
5116 -324 -6 -71 95 -139 -290 157 -40 187 16 11 -115 -45 193 63 -267 125 15 -124 -135 183 -41 50
5138 50 -109 -22 37 65 -242 -141 -80 -108 187 250 -35 34 -136 99 111 -34 0 -51 -83 -109 172 10 -180 -53
5162 -53 -128 -76 -3 -187 142 89 -48 1 -90 115 246 110 99 -240 26 -166 24 83 -22 129 36 118 33 183
5186 183 166 14 -297 -219 -5 -122 75 26 85 -51 -143 92 51 121 61 110 -22 210 146 94 160 -99 -121 31
$$ packed form
5021A78q4N2k46p7q4K03j29J74J5k5k83N75L9m97J89L13m64P6qL14m98K77L83
5044C93n59K65k90L03p5l7j8j20J55j91K29nk88L53m71L14m6J18j72R1ko5L79
5067B61n35K13L1K72q0j91L4O9n4O3l6LN8j16k15J75K29k30j0O0K4k36K32N7m6
5092C2J70j53k1J9j98J69m1J16j03j0j23K77j62mO0k04p0L42p0L0J81l75J73l59
5116c24L18o5J66k34j51M47j97K27j71nj26P0K38j30l30L92j10j39j1L18k24R1
5138E0j59Q7N9K8l07J01O1k8K95O3k85O9j70K35J2j45L4n1l2k6K81j62j90J27
5162e3p5N2P3j84L29n3j37M9r1K05J31j36j1l39K66j92J90N9j05J51r3Q2q5J50
5186A83j7j52l11P8K14j17J97m9N9j36r2K35m1P0o0M9j32K32o4n2O6k59k2J52
$$ plain form
5210 31 -179 128 -63 -21 151 83 69 -225 -188 -68 -114 120 -7 49 21 154 -12 0 61 141 253 -30 5 118
5234 118 120 -29 9 -213 13 141 15 -142 6 -48 165 40 178 69 -97 -54 153 209 441 35 -103 -54
5256 -54 -112 -53 -20 150 -311 -83 -224 -194 -160 -81 295 -196 -124 -140 15 109 -233 49 171 -484 -245 41 309
5279 309 13 19 -134 29 53 98 -120 -163 -19 -51 -2 101 -189 25 2 47 289 19 -103 131 -375 91 -158
5302 -158 -90 -26 -197 -46 110 13 -95 -136 -232 -56 -206 6 76 -81 115 -56 62 -37 107 -77 15 166 53
5325 53 50 108 177 -94 137 -40 -111 86 48 10 -265 -292 -211 5 -104 201 327 -16 327 -145 53 -145 146
5348 146 35 -239 -21 -202 74 87 146 -85 21 98 -207 193 159 17 201 5 -8 64 -44 -59 30 -83 15
5371 15 -116 147 -141 11 78 -99 145 -53 -173 181 48 -110 104 -12 -95 17 -76 80 -56 162 124 -23
$$ packed form
5210C1k10L07j91M2J72o8j4k94L7J20m6K34j27N6k8J33j66J2O1Q0J12k83L5J13
5234A18Kj49L8k22K26J28j26j57J48n4K13j25J38j09j66M3K07N6K32m06j38M9
5256e4n8N9L3J70m61K28j41L0L4P9L76m91P2j6J55R4l42K82J22o55K39K86K68
5279C09k96Oj53J63K4M5k18m3J44l2M9J03k90K14k3M5K42k70j22K34n06M66k49
5302a58O8O4j71J51J56r7j08m1r6J76j50K12P0j57J96j71J18r9J44j84R2J51j13
5325E3lN8O9k71K31j77p1J97l8l8k75k7Q1K16j09L05J26l43L43m72J98j98K91
5348A46j11k74K18j81K76J3N9k31J06P7l05M00l4j42J84j96j3P2j08j5Q9j13R8
5371A5j31K63k88J52O7j77K44j98j20L54j33j58K14j16q3J12r3J56j36K18l8j47
$$ plain form
5393 -23 -12 44 62 188 -86 75 -78 257 -209 -151 -200 -217 198 57 152 181 -61 174 140 -197 -158 -284 148 -123
5417 -123 11 191 -39 140 -50 -5 -19 -29 134 108 -4 -121 -69 43 199 220 69 -26 -108 -11 64 188 107 67
5441 67 -4 -28 16 157 60 70 28 16 -15 54 -71 23 81 -7 -31 -20 253 -8 67 95 -52 110 -10 -21 -47 281
5467 281 91 -94 -139 27 253 -7 147 -88 -159 115 41 -94 38 23 -190 -38 154 16 -43 -159 -124 132
5489 132 -27 -70 -59 -68 259 -89 -83 -139 69 137 48 83 101 285 -99 -113 -112 67 193 67 67 -49 -25 -68 -125 -91 41
5516 41 -154 -34 -303 -77 -129 -104 -203 -277 195 -436 -20 29 -93 19 93 132 63 -143 -8 174 -175 -134 -192 -37
5540 -37 41 -286 -41 -8 134 -35 -238 -160 -250 -21 -206 238 -256 -95 -142 -114 -49 -167 74 76 159 -116 44 116
5564 116 206 -104 -23 -166 135 -143 64 -15 43 206 318 6 179 92 17 59 -55 -57 -87 -115 -123 -54 -34 176 145
$$ packed form
5393b3J1N6J8J26k74J61j53L35m66N8m9j7M15j41R5K9k42K35l4l37L9j26M32k71
5417a23J34J80k30J79j90M5j4j0J63k6j12j17N2J12J56K1j51r5q2R7P5J24q1m0
5441F7p1k4M4J41r7J0m2j2l1O9j25R4N8q8k4J1K73k61P5K8j47J62j20j1k6L28
5467B81j90j85m5J66K26k60J54k35p1K74p4j35J32j5k13J52J92j38n9j16L5K56
5489A32j59m3J1rL27l48On6K08O8q9L5J8J84l84j4JJ79J26j26%j16K4m3n7L4J32
5516D1j95J20k69K26n2K5r9p4M72o31M16M9j22J12P4L9o9k06J35J82l49M1n8J55
5540c7P8l27K45L3J42j69k03P8r0K29j85M44m94J61m7K8O5j18K41KQ3k75J60P2
5564A16R0l10Q1j43L01k78K07p9N8J63J12l12J73q7p5M2j14kl0k8qO9K0K10l1
$$ plain form
5589 145 29 158 -62 -48 -117 -147 -150 66 -122 -166 -3 -252 153 85 68 -196 -154 -175 313 -152 -19 171 -149
5612 -149 -147 -179 114 -253 260 53 -171 -208 -2 68 28 188 -144 -199 183 142 202 -13 51 -79 -97 -187 -199 -50
5636 -50 4 -191 -209 -127 -46 81 51 -178 171 -248 -80 17 3 -159 -219 26 -226 -164 -41 -67 -93 260 -251 -43
5660 -43 241 263 484 -191 -265 94 -168 53 -9 -190 -76 -17 -2 215 -71 -90 314 17 -69 -112 -46 88 44 -328
5684 -328 -305 86 285 83 -23 40 300 135 -105 170 28 73 140 30 75 -13 -42 87 -326 74 122 -103 -66
5707 -66 115 -68 78 153 20 -192 70 186 38 -143 -36 193 -185 -227 12 19 -155 -3 43 93 20 218 23
5730 23 -144 -12 -176 198 13 -189 -73 52 -136 21 0 98 -166 154 67 -44 -75 -162 -298 69 -127 -236
5752 -236 92 -259 30 -305 16 6 107 -149 71 -52 11 196 -124 103 90 -145 343 -50 -202 18 -257
$$ packed form
5589A45j16J29k20J4o9l0lK16j88m4J63k49M05o8j7k64M2k1M88m65J33J90l20
5612a49Kl2K93l67N13k07k24l7K06P0m0J60l32n5L82m1O0k15O4j30j8r0j2J49
5636e0N4j95j8Q2Q1J27l0k29L49m19J68R7j4j62o0K45k52O2J23k6k6L53n11K08
5660d3K84K2K21o75p4L59k62K21o2j81J14N9J5K17k86j9M04k97q6m3O6J34m4l72
5684c28K3L91J99k02j06O3K60j65k40K75j42M5O7j10M5q8k9J29m13M00M8k25L7
5707f6J81j83J46P5j33k12K62J16j48j81J07K29l78m2K39Pj74J52M6N0p3J98j95
5730B3j67J32j64L74j85k02J16J25j88J57k1R8k64L20q7j11l1q7j36L67j96j09
5752b36L28l51K89l35L21j0J01k56K20j23O3J85l20K27j3k35M88l93j52K20k75
$$ plain form
5773 -257 -46 106 -32 56 -172 -184 1 -166 142 -249 -26 278 -56 135 1 -5 24 -19 72 -111 286 41
5795 41 40 134 -61 46 -64 103 -124 261 193 53 182 15 112 96 -120 6 184 -315 3 -50 218 -1 -55
5818 -55 -22 -45 107 246 258 -119 56 -26 215 -171 -276 5 -180 -117 25 6 -70 151 -37 137 146 30 -310
5841 -310 -120 85 233 6 71 125 -185 -148 16 38 10 362 122 30 -28 89 132 -267 -69 19 -77 -82 -176 100
5865 100 263 -26 50 -87 86 7 96 -74 76 1 147 -15 95 -62 -156 -159 -320 -9 -183 105 99 -19 144
5888 144 -39 74 153 -66 -50 -145 18 -86 66 -94 -62 -10 -81 4 137 61 70 -50 50 -211 -245 -47 64 124
5912 124 96 96 90 -270 108 -52 6 167 -323 104 380 -115 -230 136 34 -29 8 61 -81 43 -116 -46 218
5935 218 53 11 143 -15 47 -95 -232 61 110 151 -1 56 -26 253 -77 -156 56 284 118 -83 110 42 -9
$$ packed form
5773b57K11J52j38Q8k28j2J85j67L08l91K23L04l34J91j34oK9m3R1j83L97k45
5795D1jR4j95J07j10J67k27L85o8j40J29j67R7j6k16J26J78m99L18n3K68k19n4
5818e5L3k3J52J39J2l77J75q2K41l86j05K81j85O3J42j9p6K21j88J74Rj16l40
5841c10J90K05J48k27O5N4l10L7J64K2k8L52k40r2n8J17M3l99J98Q8r6nr4K76
5865A00J63k89P6j37J73p9Q9j70J50p5J46j62J10j57r4lj61L11j74K88oj18J63
5888A44j83J13P9k19J6r5J63j04J52j60L2N2p1Q5J33p6Rj20J00k61l4J98J11O0
5912A24k8%ol60L78j60N8J61m90M27K76m95j15L66j02o3L7N3j42J24j59P0K64
5935B18j65m2J32j58O2j42j37K93M9M1j52N7q2K79l30p9K12K28j66k01J93o8n1
$$ plain form
5958 -9 -9 -187 97 -121 -215 -159 -104 142 175 2 -107 81 229 -274 -9 215 247 308 -184 54 -378 268 -120
5981 -120 277 61 -102 -176 91 19 96 -214 -28 55 -91 -125 -45 14 -69 -40 5 72 275 98 -7 300 -83 57
6005 57 -80 -149 180 104 -40 -251 -173 93 27 66 76 -80 -125 -34 -73 71 -78 16 -122 -173 81 131 -101 13
6029 13 -117 -92 43 129 -19 48 28 398 -57 165 -33 -208 52 55 -69 -180 114 -153 -60 88 -256 237 2
6052 2 -44 68 0 -175 124 -24 122 -9 161 -165 -229 159 221 74 -79 -184 -375 295 143 -205 -301 161
6074 161 45 3 -388 192 47 -287 153 9 -187 12 -82 -49 -224 -39 -264 -174 -183 156 49 -126 117 -158
6096 -158 -32 3 66 -30 -57 -99 -280 -16 130 34 225 -2 179 -406 -110 120 115 207 -48 -201 301 75 -311
6119 -311 -157 90 67 113 86 -125 -4 -65 -80 90 8 67 34 76 35 -92 -50 -42 235 125 75 29 -320 67 -366
$$ packed form
5958i%j78K84k18r4N6N5K46L3j73j09J88J48n03K65K24L2O1m92K38m32O46l88
5981a20L97k16j63p4K67p2P7l10J86Q3j46l4Q0N9q3K9M5O7K03j77j05L07l83J40
6005E7j37o9L29p6j44k11P8K66o6L9J0j56m5R1l9J44j49R4j38n1K54N0k32J14
6029A3j30K5J35Q6j48O7k0L70m55K22j98j75K60Lj24j11K94k67R3J48l44M93k35
6052Bm6J12o8j75K99j48J46j31J70l26o4L88O2j47j53j05j91O70j52l48r6M62
6074A61j16m2l91N80j45l34M40j44j96J99r4L3j75J85k25R0rL39j07j75K43k75
6096a58J26L5O3r6k7m2j81K64J46r6J91k27J81n85K96K30nR2k55j53N02k26l86
6119c11J54K47k3M6k7k11J21o1j5J70q2N9l3M2m1j27M2QK77j10n0m6l49L87m33
$$ plain form
6144 -366 -33 22 124 -112 75 117 65 -52 72 15 113 13 185 14 30 -1 12 5 -161 95 -18 -216 252
6167 252 -36 82 81 -152 -528 -41 -82 -153 58 10 -188 9 -327 230 -31 -327 -27 -19 -98 148 26 -39 277
6190 277 -123 270 5 6 -81 77 -99 -7 -17 281 -190 6 97 -119 63 -32 -52 236 -71 0 -33 139 -33
6213 -33 32 150 -132 -112 121 -146 47 -76 43 -260 -8 52 -335 -25 159 159 177 42 -105 -163 125 -6 -45
6236 -45 -85 -267 91 -64 54 -144 66 -223 -127 147 19 -56 -249 193 10 -139 -172 50 15 -149 150 -116
6258 -116 112 -189 112 26 212 189 -47 9 180 -39 -107 32 20 -1 -22 173 76 91 -14 -80 -1 164 279 -50
6282 -50 291 115 135 -103 117 -36 -151 -23 154 70 157 92 74 -101 238 -248 112 -118 -105 212 -37 -38 42
6305 42 -79 -114 -127 -52 144 -109 -58 78 -42 -53 -153 117 -74 101 20 45 -2 8 76 241 -49 -78 -306 -418
$$ packed form
6144c66L33N5J02k36J87M2n2j17J24n7R8j00J72j71J6l1J3pj66K56j13j98M68
6167B52k88J18jk33l76M87m1p1K11m8j98J97l36N57k61k96L00Qp9K46j22o5L16
6190B77m00L93k65Jq7J58j76R2j0K98m71J96R1k16J82r5k0K88l07P1l3J72j72
6213c3O5J18k82K0K33k67J93j23J19l03K52O0l87L10J84%J8j35j47n8K88j31l9
6236d5m0j82L58j55J18j98K10k89R6K74j28p5j93M42j83j49l3K22l5j64K99k66
6258a16K28l01L01q6J86k3k36N6J71k19o8J39j2k1k1J95r7J5j05o6P9J65J15l29
6282e0L41j76K0k38K20j53j15J28J77q4Q7o5j8j75L39m86L60k30J3L17k49jQ0
6305D2j21l5j3P5J96k53N1J36j20j1j00K70j91J75q1K5m7J0O8J65k90k9k28j12
$$ plain form
6329 -418 -104 -55 176 -147 52 -66 -185 -80 -292 -2 -40 116 -18 -150 -93 144 -643 -13 -8 246 -161 -52
6351 -52 177 59 -110 268 -40 -66 -131 274 207 12 -161 -294 155 -144 -134 152 -113 99 -61 65 -19 -113
6373 -113 -24 1 -95 -31 20 35 -59 -164 89 5 0 -2 -18 -258 186 123 37 -87 15 92 -58 100 -321 -5 224
6398 224 -12 -144 -164 56 51 45 66 75 -32 125 151 -42 128 -25 -77 97 -142 -14 250 -208 -139 -309 -93 136
6422 136 44 -245 131 -369 74 -319 -36 69 47 -86 -19 -28 -105 237 -121 -204 -162 -228 198 -37 182 28 -123
6445 -123 100 180 68 -41 51 -28 94 189 53 -162 -62 -129 -144 -48 -62 24 -192 -200 19 314 26 -115 87 -176
6469 -176 -506 -17 27 372 -151 -12 276 31 -16 -19 -349 -353 -101 -51 -164 -114 -96 -227 -37 5 106 29 10 -113
6493 -113 116 245 108 -274 -68 -18 -4 -29 -49 -32 36 -97 74 256 -67 -64 -90 -5 26 52 176 60 -126 3
$$ packed form
6329d18L14M9K31l23J99j18j19J05k12K90l8J56j34j32N7K37p87O30NK54m07J09
6351e2K29j18j69L78l08k6o5M05o7j95j73j33M49k99J0K86k65K12j60J26q4r4
6373a13Q9K5r6O4N1J5r4j05K53q4nkj6k40M44o3q6j24J02P7j50J58m21L16K29
6398B24k36j32k0K20noK1Rj07J57K6j93J70j53n2J74k39J28K64m58O9j70K16K29
6422A36r2k89L76n00M43l93K83J05k2j33O7rp7L42l58q3M2o6M26k35K19j54j51
6445a23K23Q0j12j09R2p9J22R5j36k15J00o7j5R6j4Q6k16qK19K95k88j41K02k63
6469a76l30M89M4L45n23J39K88k45m7ll30mK52N0j13N0J8j31J90M2J01p7j9j23
6493a13K29J29j37l82K06N0J4k5k0J7O8j33J71J82l23Lk6Q5L1K6J24j16j86J29
$$ plain form
6517 3 95 20 -124 57 -74 186 -171 124 282 198 9 5 -246 56 -41 -118 92 -104 186 -5 39 -63 45
6540 45 -181 -88 206 8 -67 5 -4 132 -141 -161 -133 -61 -114 -246 32 -117 -158 -67 79 51 -263 8 -4 -70 -40
6565 -40 -129 78 114 -179 213 77 -26 41 -57 -187 3 100 171 118 132 -115 -406 -69 48 -194 -445 16 4
6588 4 92 77 -192 13 53 -15 -125 73 -18 -143 -1 -97 44 -102 -78 -92 59 176 99 -7 -121 -193 -15 -104
6612 -104 -31 -164 -223 11 -158 -9 18 28 78 -59 225 -25 -20 -179 -139 14 -11 12 159 -53 -121 -207 -48 -53 -130
6637 -130 71 -81 -118 162 1 -146 -143 -177 -56 77 -117 121 99 262 61 -89 -40 -78 74 19 231 82 -257
6660 -257 31 21 171 269 -4 -3 -184 260 -177 -219 89 -140 10 166 -153 288 -107 151 89 -124 -205 -19
6682 -19 -2 169 61 138 -49 -157 18 -64 -5 -216 -158 6 78 66 236 -63 -532 -52 -8 147 -42 -224 -26
$$ packed form
6517CR2p5j44J81j31K60l57K95J58q4j89mk51L02r7p7K10j96K90j91M4j02J08
6540D5k26R3K94j98p5P2rJ36k73k0K8P2n3j32K78j49m1R1J46k8l14K71j2o6L0
6565d0q9K07L6k93L92j36j03O7r8j30J90R7P1n3J4k47k91L37J17k42k51M61j2
6588DQ8j5k69K05M0o8j10J98r1j25J42r6J41j46K4j4J51J17p7j06j14p2J78q9
6612a04P3j33n9K34j69J49K7J0N0j37K84k50Nj59M0J53k5K3J47k12o8q6J59np7
6637a30K01j52l7K80j61j47Ll4J21J33j94K38k2J63k01j50M9l8J52n5K12j49l39
6660b57K88j0J50R8k73Jj81M44m37m2L08k29J50J56l19M41l95K58o2k13q1J86
6682a9J7J71j08P7j87j08J75q2N9k11N8J64P2j2J70k99m69M80M4J55j89j82J98
$$ plain form
6705 -26 18 -72 -20 -67 -52 97 -54 258 327 -25 45 -339 46 230 -95 -28 -146 -215 -233 -16 93 -27 -76 50
6729 50 -237 142 186 -119 84 -210 33 118 -50 -130 88 79 -93 45 16 91 152 78 83 -48 -114 -5 209 272 -306
6754 -306 186 115 59 -71 -124 196 -194 -48 174 -162 66 -122 54 -194 -57 -37 -205 145 285 60 84 -36
6776 -36 -98 -182 77 -93 -157 -262 27 36 94 -218 -255 -94 -101 55 23 89 53 228 137 0 47 193 -225 100 346
6801 346 56 -68 101 -79 -129 -65 -136 22 95 -298 40 160 -18 41 -81 1 -44 -47 -72 21 39 110 -164 71
6825 71 129 -224 -71 -4 52 113 -46 -142 -83 -7 -208 -230 62 210 -91 17 -248 39 196 78 202 -127 -34
6848 -34 111 22 -149 -7 91 329 76 55 -24 -216 -81 20 122 158 -254 -112 -93 0 29 -120 129 -208 -124
6871 -124 -34 -258 -173 243 -43 111 -206 74 -282 227 -75 -144 222 -85 -291 -51 -112 148 309 315 139 47
$$ packed form
6705b6M4r0N2m7J5J49j51L12O9l52P0l84L85J84l25O7j18o9j8K17J09j20m9J26
6729E0k87L79M4l05K03k94K43Q5j68q0K18rj72J38k9P5O1p4Nj31o6J09K14O3n78
6754c06M92p1n6j30n3L20l90J46K22l36K28j88J76k48J37K0j68L50J40k25K4j20
6776c6o2q4K59j70o4j05K89RN8l12l7J61pJ56l2O6l6J75r1j37M7J46m18L25K46
6801C46k90j24J69j80n0O4p1J58P3l93L38J20j78N9j22Q2m5lk5R3J8P1k74K35
6825G1N8l53J53O7N6O1j59r6N9P6k01k2K92J48l01J08k65K87J57j18J24l29R3
6848c4J45q9j71J42R8K38k53k1p9j92J35J01J02L6m12J42J9R3K9j49K49l37Q4
6871a24R0k24Q5M16k86J54l17K80l56N09l02o9L66l07k06K40o1K60J61Oj76r2
$$ plain form
6893 47 -152 -39 -176 103 230 146 -30 103 77 33 -136 36 62 -137 16 -200 103 79 147 -108 -416 240
6915 240 168 107 -65 -7 -87 -30 -5 25 -71 366 229 -10 102 284 104 -215 104 25 6 -516 15 106 66 -66
6939 -66 -125 340 146 16 63 -113 -91 -172 43 106 110 -125 -147 20 23 43 338 -26 123 -197 -99 -157 -240 -238 53 17
6965 17 -210 -52 -115 -90 -240 86 23 -58 328 65 -165 197 -40 184 -63 28 -150 0 17 -156 -144 20 78
6988 78 58 -27 87 -157 -5 -50 238 -4 -2 -143 231 100 58 35 17 83 -66 109 -236 -5 -188 57 -77
7011 -77 -15 -67 -307 -240 37 -138 -113 -1 146 150 58 -36 263 289 54 -37 -121 102 83 -2 -115 -153 -89 166 14
7036 14 216 111 -71 -81 -112 -185 45 -97 -40 61 78 310 186 118 -104 -236 168 169 223 185 -8 -277 -57 -314
7060 -314 -22 -53 114 -144 -46 -40 120 63 -30 13 -80 -85 148 71 -67 88 -129 -195 182 207 58 34 -58 -82 61
$$ packed form
6893D7j99J13j37K79J27q4j76J33k6m4j69J72K6j99J53k16L03k4O8k55l08O56
6915B40p2o1j72N8q0N7K5L0r6M37j37k39J12J82j80l19L19p9j9n22N31R1m0j32
6939f6n9M65j94j30M7j76K2q1K15O3Mk35k2J67LK0K95l64J49l20R8n8q3KK91l6
6965A7k27J58o3K5j50L26o3q1L86k63k30L62k37K24k47R1j78J50J7j73J2J64N8
6988G8k0q5J14k44J52m5K88k42Kj41L74j31m2k3j8O6j49J75l45K31j83K45j34
7011g7O2n2k40O7K77j75K5J12J47Mr2r4K99K6k35r1q4K23j9q5j13l8O4K55j52
7036A4K02j05j82j0l1p3K30j42N7J01J7K32j24o8k22j32M04JN4l8j93k69K20k57
7060c14K92l1J67k58R8OJ60n7r3M3r3nK33p7j38J55k17o6L77K5j49k4r2k4J43
$$ plain form
7085 61 134 66 -13 143 191 -133 203 -121 -141 -29 -42 123 265 53 89 -79 -31 -4 157 -210 134 271 31
7108 31 -46 15 285 -68 206 -25 5 -111 -167 108 -142 -113 -137 17 -35 -87 123 -218 -42 199 288 40 192
7131 192 234 -59 -174 -91 -3 71 -258 87 4 160 -39 355 -164 -348 104 21 200 -42 92 11 62 127 -43
7154 -43 -135 -104 229 54 -38 19 140 -37 -22 -306 99 270 25 -25 45 -102 -73 -43 -23 -42 -136 44 263 -240
7178 -240 -237 -345 -37 265 -60 -149 45 33 -29 28 77 -14 -281 -74 -291 104 1 -231 91 -192 15 35 7
7201 7 -55 -142 235 208 -3 132 -401 149 -30 -185 143 -29 -113 -172 18 62 -196 119 41 152 179 -182 -4
7224 -4 -79 -42 26 -27 -4 -85 -178 -82 -212 10 -96 -30 237 169 -113 24 -141 47 66 223 -3 277 -135 -44 -4
7249 -4 -52 -192 -241 -124 -39 96 65 -116 -20 -17 161 -70 68 117 -64 148 -48 183 -171 -332 144 -226 -77
$$ packed form
7085F1P3o8p9J56M8l24L36l24k0J12j3J65J42k12L6j68M8K7J61l67L44J37k40
7108C1p7O1K70l53K74k31L0j16n6K75k50K9k4J54n2n2K10l41J76K41Q9k48J52
7131A92M2k93j15Q3Q8P4l29L45q3J56j99L94n19j84M52q3J79k42J34q1N1O5j70
7154d3r2L1L33j75r2N7J21j77J5k84M05J71k45n0P0j47K9L0K0j9r4J80K19n03
7178b40Lj08L08L02l25q9J94j2o2N7M9r1k67K07k17L95j03k32L22k83K07K0k8
7201Go2q7L77k7k11J35n33N50j79j55L28j72q4n9J90M4k58L15p8J11K7l61J78
7224dp5L7O8n3K3q1r3R6j30K22j06O6K67o8k82J37j65J88J9J57k26K80m12R1M0
7249dm8j40m9J17Q5J35l1j81R6LJ78k31J38M9j81K12j96K31l54j61M76l70J49
$$ plain form
7272 -77 -174 104 -94 138 276 -151 -183 -148 168 230 0 539 -115 155 -1 92 -124 -57 35 73 33 -13 -231 -59
7296 -59 -186 33 -41 166 -160 190 48 32 -58 53 350 33 -324 -227 -4 -222 214 39 -215 68 17 -133
7318 -133 -167 -182 -124 82 -3 -7 115 142 -172 8 -8 -12 29 247 -216 217 139 -5 -211 -71 8 -29 41 -26 213
7343 213 -111 266 -316 42 102 -116 331 116 -8 -147 -188 -90 -22 -43 -129 -98 -155 -278 -74 161 111 12 215
7366 215 287 -2 16 -37 -174 -6 14 89 -173 331 -56 -239 -182 90 63 50 -98 -109 -112 -249 -83 120 97 228
7390 228 -86 51 284 25 -148 -58 76 -18 -62 192 19 -67 81 264 -70 -118 -224 -82 20 13 -140 100
7412 100 14 219 -15 -150 -95 -137 -203 -158 157 44 -267 -100 49 159 182 -27 33 125 0 2 23 294 -110 -200
7436 -200 85 183 146 267 75 -161 143 3 181 12 -52 101 287 207 -70 -21 63 -253 118 138 -220 73
$$ packed form
7272g7r7K78j98K32J38m27l2L5L16O2k30N39o54K70j56R3k16O7R2L8m0m6k18J72
7296e9j27K19p4K07l26L50j42j6r0J11K97l17l57R7K23k18M36j75k54K83n1j50
7318a33l4j5N8K06q5mJ22K7l14J80j6mM1K18m63M33p8j44k06J40P9l7P0o7K39
7343B13l24L77n82L58O0k18M47k15j24j39m1R8O8k1q6L1n7j23K04K35n0r9K03
7366B15P2k89J8n3j37J68K0P5k62N04l87j83N7K72k7j3j48j1lj37J66K03k3J31
7390B28l14J37K33k59j73R0J34r4m4K54j73q6J48J83l34m8j06J42J02pj53K40
7412A00q6K05k34j35N5m2o6M5L15j13l11J67J49J10K3k09O0R2j25KK1K71m04r0
7436b00K85R8l7J21j92k36L04j40J78j69o4J53J86q0k77M9Q4l16L71K0l58K93
$$ plain form
7458 73 -163 56 136 -224 107 -165 -245 65 69 -126 -64 89 -3 78 -96 65 -51 -107 6 -122 100 163 37
7481 37 220 28 130 179 -92 164 -60 -71 -2 -167 -88 158 -20 40 143 -72 -73 -3 93 -51 51 -108 36
7504 36 -12 -92 170 -80 -84 168 37 304 -40 -189 94 -167 50 -38 -89 382 130 -50 -100 -110 247 227 -175
7527 -175 -33 -47 -39 -175 -75 -102 -171 105 -25 -42 56 262 -19 -180 -75 118 96 -276 120 207 -52 70 118
7550 118 -172 -96 108 -204 -253 18 -195 98 -5 11 42 -72 168 25 -43 -17 86 -88 13 358 -271 -95
7572 -95 -72 -20 -88 81 -98 -156 91 68 -4 76 71 -252 -10 306 80 -2 -179 -6 -53 267 -2 241 -98 -4
7596 -4 107 -37 25 -23 -78 43 -180 -29 104 134 -17 -192 -56 -74 30 80 34 60 86 -173 -30 -178 139 -48
7620 -48 282 -261 116 38 -166 -133 -88 69 142 88 17 155 39 -254 2 21 45 85 206 -10 -309 -66 -138 -48
$$ packed form
7458G3k36K19Q0l60L31k72q0L10Mj95O2J53r2Q1j74J61j16n6J13j28K22O3j26
7481C7J83j92J02M9k71K56k24j1O9j65P9K46j78O0J03k15jP0R6j44J02j59J44
7504C6m8q0K62k50mK52j31K67l44j49K83k61K17q8n1M71k52j80n0j0L57k0m02
7527a75J42j4Qj36J00k7o9K76j30j7R8K06k81j61J05J93k2l72L96Q7k59J22M8
7550A18k90P6K04l12m9K71k13K93j03J6L1j14K40j43o8K6J03j74J01L45o29J76
7572i5K3N2o8J69j79n8K47k3p2Q0nl23K42L16k26q2j77J73m7L20k69K43l39R4
7596dJ11j44O2m8n5J21k23J51J33L0j51j75J36j8J04N0m6K6K6k59J43j48L17j87
7620d8L30n43L77p8k04L3M5J57P3n4p1J38j16k93K56J9K4M0J21k16k99K43p2R0
$$ plain form
7644 -48 -54 31 96 60 59 -162 284 155 -76 244 29 12 -38 -2 282 -18 26 116 328 59 262 166 192 188 24 -17
7670 -17 471 2 -50 -131 -152 202 -199 -289 -28 -101 201 105 142 -254 94 -102 56 8 163 19 -175 246 -79
7693 -79 111 83 132 7 -151 -70 52 50 -50 -86 36 33 -272 -48 60 -349 -7 57 323 -252 -129 -272 114
7716 114 -129 201 -53 2 28 70 -70 149 -69 267 148 41 27 -53 230 132 277 -76 -23 -69 15 55 29 -275
7740 -275 83 72 -92 -131 119 28 317 -138 -96 204 106 -65 103 48 73 54 -123 -370 -210 271 329 -127 -115
7763 -115 -136 162 -40 -231 131 164 -5 31 -73 -29 -65 47 111 -107 301 172 165 -214 -220 35 59 312 -83 -383
7787 -383 -191 -25 191 85 71 -90 -14 124 -253 -103 -258 7 62 135 -154 17 128 191 -174 -100 -83 140
7809 140 -60 84 87 -105 11 105 159 -136 45 -2 -11 -223 203 -252 28 -85 220 -27 -8 -144 164 217 29
$$ packed form
7644d8oQ5O5l6jk21M46j29k31L20k15j7n0L6K84l00M4R0K12k69K03r6K6mj64m1
7670a7M88m69n2q1k1L54m01r0K61p3L02r6L7l96L48j96J58m8J55j44j94M21l25
7693g9J90k8M9j25j58Q1J22kj00l6J22ll05K24J08m09L42O4K66n75J23j43L86
7716A14k43L30k54N5K6M2j40K19k18L36j19j07j4q0K83r8J45l53N3m6Q4M0k6l04
7740b75L58j1j64l9K50r1K89m55M2L00r8j71J68n5K5j9j77k47J60M81N8m56J2
7763a15k1K98k02j91L62L3j69L6j04M4l6J12O4k18M08j29pl79oK55K4K53l95l00
7787c83J92J66K16j06j4j61P6J38l77J50j55K65N5P3k89J71J11O3l65P4J7K23
7809A40k00J44Lj92J16R4N4k95J81m7rk12M26m55K80j13L05k47J9j36L08N3j88
$$ plain form
7832 29 103 -169 36 126 94 -22 165 -182 84 -356 74 55 -71 -70 -73 300 13 4 -171 -30 -7 203 202 -149 -220
7857 -220 -128 283 -121 -99 160 -224 166 -3 30 0 0 -116 24 40 22 215 -84 58 28 -55 -86 -19 -307 -14
7881 -14 -127 -70 -182 130 -371 -88 -155 223 -43 -76 -87 9 -63 54 -92 19 -112 -278 103 -147 -185 282 26
7904 26 -20 -166 -51 -39 -94 0 102 -108 258 245 -4 252 -97 -154 -56 138 -33 105 -124 -157 -54 249 65
7927 65 -215 62 247 49 127 -9 -214 -124 -74 -279 -74 135 -58 -167 -47 -2 83 -51 -149 0 68 164 -64
7950 -64 -153 152 -99 -204 234 189 134 -194 -63 59 -93 106 113 21 -111 -165 133 -44 49 82 -302 48 -240
7973 -240 189 -60 22 -68 164 -40 180 -94 -93 -27 -5 -85 204 58 223 42 -103 -69 -19 -169 -141 -77 -135 -250
7997 -250 246 180 259 302 248 -60 -321 -75 -3 100 -167 -77 65 -206 -39 106 -64 -10 -129 -51 187 -65 244
$$ packed form
7832B9P4k72K05R0l2j16J87l47K66m40M30j9j26JlL73k87rj75J41K3K10jl51p1
7857b20R2M11m04K2K59l84L90j69L3l0%j16J40J6j8J93k99J42l0q3l1O7k88K93
7881a4j13N7j12L12n01K83o7L78k66l3j1R6p2J17j46J11j31j66L81k50l8M67k56
7904B6m6j46J15J2n5R4J02k10L66j3k49K56l49n7R8J94j71J38k29l3J03L03j84
7927F5k80K77J85j98P8j36k05R0N0k05K05K09j93j09J20M5Q5j34r8J49O8R6k28
7950f4q9L05k51j05M38m5n5l28J31J22j52J99Pr2j32n4K98j77R3L3l84L50k88
7973b40M29k49Q2r0K32k04K20k74JO6K2q0K89j46J65j81j45L4N0j50K8O4n8j15
7997b50M96o6P9M3n4l08k61K46P2J03k67R0J42k71J67J45j70N4j19P8K38k52L09
$$ plain form
8020 244 46 42 -273 -165 -33 24 68 -85 57 -163 31 234 315 292 -19 41 -81 -151 198 -32 21 151 -16
8043 -16 -156 -126 -138 -252 44 -242 -140 480 124 33 -115 -427 108 -145 -21 -233 127 -116 52 -101 -47 133
8065 133 35 -42 42 141 38 41 222 90 -191 -155 -235 -24 -90 -197 96 9 36 -66 247 -57 126 131 62 308 148
8090 148 -197 168 186 0 -389 56 161 17 -238 -118 81 -116 86 79 -106 -52 -210 47 -106 152 -10
8111 -10 -346 -113 -348 -84 133 216 -499 71 -168 172 212 140 -111 -127 65 -16 -17 -222 62 11 -259 -110 -300
8134 -300 169 -25 236 168 7 142 200 -120 96 -63 -30 -251 118 -77 -89 19 28 43 6 -20 -301 113 -289
8157 -289 -267 -143 -206 -1 1 49 40 -164 -54 263 44 -18 -309 -241 -69 -97 -98 -40 -338 65 -187 114 35 -85 12
8182 12 78 59 -115 13 -209 21 -339 132 -109
$$ packed form
8020B44j98ml15J08J32N7M4j53J42k20J94K03Q1k3l11O0j22p0L49k30N3J30j67
8043a6j40L0j2j14K96k86J02O20l56r1j48l12N35k53J24k12L60k43J68j53N4J80
8065A33r8p7Q4R9j03LJ81j32k81L6q0K11o6j07K93q7K7j02L13l04J83No9K46j60
8090A48l45L65J8j86l89M45J05j44k55J20J99j97K02pj85N4j58K57j53K58j62
8111a0l36K33k35K64K17Q3p15N70k39L40M0p2k51j6J92q1jk05K84n1k70J49j90
8134c00M69j94K61o8j61J35N8l20K16j59L3k21L69j95j2J08RJ5l7k6k81M14m02
8157b89K2J24o3K05KM8rk04J10L17k19o2k91O8J72k8jN8k98M03k52L01p9j20R7
8182A2O6j9j74J28k22K30l60M71k41
8191a09
$$ Imaginary data points
##PAGE= N=2
##DATA TABLE= (X++(I..I)), XYDATA
$$ plain form
0 0 0 0 0 0 0 0 0 0 0 0 0 -8 8 -8 8 -9 16 -16 24 -24 32 -40 48 -56 64 -72 88 -97 113 -131 152 -171 194
33 194 -220 249 -281 315 -352 395 -440 490 -545 604 -668 740 -818 901 -994 1096 -1207 1330
51 1330 -1466 1614 -1782 1968 -2180 2420 -2694 3015 -3391 3842 -4395 5090 -5996 7231 -9016
66 -9016 11850 -17047 29758 -132839 -94306 75087 -118480 -41549 99328 25727 -42222 82451
78 82451 79801 6659 37844 71659 -11668 -16235 26294 -646 -15762 15715 -22484 -41922 -26314
91 -26314 -45082 -37506 -4737 -36351 -28655 24262 10614 -4731 44341 48359 20706 47228 57256
104 57256 2748 2803 30912 -29847 -63793 -5995 -25089 -69178 -7174 6259 -54246 -12291 45668
117 45668 6166 3073 50926 23685 -14022 22097 29722 -9282 10288 31768 -14868 -25748
$$ packed form
0@%%%%%%%%%%%qJ6j6J6j7K5l2M0m8N6p2Q8j04J20j36J60j85K10k44K83l23L65
33A94m14M69n30N96o67P47q35R30j035J149j272J408j558J719j895K090k303K537
51A330k796L080l396L750m148M600n114N709o406P233q237R485j1086J3227j6247
66i016K0866k8897M6805j62597L8533J69393j93567P6931J40877p3601o7949J24673
78H2451k650p3142L1185L3815q3327m567M2529k6940j5116L1477l8199j9438J5608
91b6314j8768P576L2769l1614P696N2917j3648j5345M9072M018k7653K6522J0028
104E7256n4508N5K8109o0759l3946N7798j9094m4089O2004J3433o0505M1955N7959
117D5668l9502l093M7853k7241l7707L6119P625l9004J9570K1480m6636j0880
$$ plain form
129 -25748 2808 -16022 -23786 -1457 -18940 -32397 -10674 -10920 -10470 17142 20966 8745 22688
142 22688 30213 10754 12776 25282 -677 -17458 -2821 -18636 -33850 -6210 -6140 -26098 -5271
155 -5271 5640 -8036 8398 22912 3960 1130 17561 7146 -5028 13075 14798 -8795 -2280
168 -2280 6965 -13340 -8123 7850 -13131 -20310 -2567 -9548 -14722 5465 10461 1658 6474 14890
182 14890 10066 7887 15968 9331 -4548 -3472 -7042 -15044 -7529 -6395 -11673 -4857 -4620 -6930 5563
197 5563 8832 3872 8448 6649 338 3458 8286 3573 -854 3520 1276 -9248 -3373 3814 -7540
212 -7540 -9065 -1857 -9655 -9734 2088 1526 66 7207 7626 4735 7026 12137 8902 1053 543 -1759
228 -1759 -9349 -6481 -3172 -8199 -7163 -4617 -5134 -1174 1725 3856 6420 3036 1868 4942 3240
$$ packed form
129b5748K8556j8830p764K2329j7483j3457K1723k46M50K7612L824j2221J3943
142B2688P525j9459K022J2506k5959j6781J4637j5815j5214K7640P0j9958K0827
155e271J0911j3676J6434J4514j8952k830J6431j0415j2174J8103J723k3593O515
168b280R245k0305N217J5973k0981p179J7743o981n174K0187M996q803M816Q416
182A4890m824k179Q081o637j3879J076l570q002P515J134n278O816K37k310J2493
197E563L269m960M576j799o311L120M828m713m427M374k244j0524N875P187j1354
212g540j525P208p798p9J1822n62j460P141M19k891K291N111l235p849n10k302
228a759p590K868L309n027J036K546n17L960K899K131K564l384j168L074j702
$$ plain form
243 3240 3855 5459 2405 66 -409 -1064 -959 -3368 -2646 -3353 -9625 -7759 -2363 -3897 -1594 3266 1802
260 1802 3346 6534 7044 7857 7235 4448 1046 -2858 -2038 -2354 -5898 -4792 -4267 -7084 -4469 -1013 -390
277 -390 917 1946 1846 1697 708 4090 5610 2019 2996 3667 -252 682 1958 -245 -1944 -3507 -5157
294 -5157 -6043 -5589 -2368 -1448 -3109 290 2371 1925 5026 6262 4451 4149 2487 695 -164 -586 -812
311 -812 -2265 -4628 -2834 -2049 -3388 -736 140 -1362 -1336 -432 414 1240 1382 2954 2321 199 3005 3392
329 3392 1318 1894 1173 -1861 -2727 -2705 -2714 -2907 -3008 -2230 -2095 -1734 1662 2426 1448 3056 2749 819 1166
348 1166 1847 949 125 -1206 -908 -1144 -1471 -39 -334 -1571 -562 -816 -2168 -525 107 -109 -35 -76 1219
367 1219 1697 1197 2806 1905 -393 632 -486 -1660 -765 -764 -1728 -1819 -1917 -831 98 125 1432 982 -242
$$ packed form
243C240O15J604l054k339m75o55J05k409P22p07o272J866N396j534K303M860j464
260A802J544L188N10Q13o22k787l402l904Q20l16l544J106N25k817K615L456O23
277c90J307J029j00j49r89L382J520l591R77O71l919R34J276k203j699j563j650
294e157q86M54L221R20j661L399K081m46L101J236j811l02j662j792q59m22k26
311h12j453k363J794P85j339K652Q76j502K6R04Q46Q26J42J572o33k122K806L87
329C392k074N76p21l034q66K2rj93j01P78J35L61L396P64r78J608l07j930L47
348A166O81q98q24j331K98k36l27J432k95j237J009k54j352J643O32k16P4m1J295
367A219M78n00J609r01k298J025j118j174Q95Jr64r1r8J086R29K7J307m50j224
$$ plain form
386 -242 1106 600 19 1191 521 -237 -327 -150 476 554 -63 452 -674 -1136 106 -647 -1044 -175 -143 -959
406 -959 -90 1096 1196 499 678 869 -134 -624 745 -306 -1015 -281 -782 -1181 -62 538 405 557 86
425 86 195 204 40 634 -108 -207 -150 -713 -530 362 282 354 -236 -436 211 -413 -241 251 -153 -510 309 420 38
448 38 754 694 -10 -115 -141 58 -683 -714 152 -1088 -1120 253 53 93 1211 285 33 486 370 514 195
469 195 86 183 -671 -295 200 -461 10 403 -854 -473 -194 -280 -151 -141 -329 175 93 188 1003 563 636 298
491 298 57 -89 -113 -269 -221 -832 -976 -590 -1066 -464 420 -123 12 420 43 146 706 624 243 163 138 520
513 520 -94 351 258 -492 -203 -256 -827 -414 -281 -662 -541 -172 -63 33 350 867 900 439 655 572 366 392
535 392 -82 -610 -535 -668 -386 -158 -701 -168 40 -527 -359 386 109 261 611 518 391 276 68 365 130
$$ packed form
386b42J348n06n81J172o70p58r0J77O26P8o17N15j126m62J242p53l97Q69L2q16
406i59Q69J186J00o97J79J91j003m90J369j051p09P34n01l99J119O00j33J52m71
425H6J09Rj64N94p42r9N7n63J83Q92q0P2n90k00O47o24J72M92m04l57Q19J11l82
448C8P16o0p04j05k6J99p41l1Q66j240l2J373k00M0J118r26k52M53j16J44l19
469A95j09R7q54L76M95o61M71L93j257L81K79q6J29J0j88N04q2R5Q15m40P3l38
491B98k41j46k4j56M8o11j44L86m76O02Q84n43J35M08l77J03N60q2l81q0k5L82
513E20o14M45r3p50K89n3n71M13J33l81J21L69J09R6L17N17L3m61K16q3k06K6
535C92m74n28P5j33K82K28n43N33K08n67J68P45k77J52L50r3j27j15k08K97k35
$$ plain form
556 130 208 134 -422 -342 -39 -648 -686 -462 -512 -470 81 397 347 343 555 460 278 411 492 176 101 -216 -410 -281
580 -281 -305 -304 -109 -313 -151 -257 -198 -124 -97 -176 88 177 159 597 516 272 114 208 316 166 -298 -12 -381 -680
604 -680 -237 -101 -318 110 -118 211 294 384 181 253 148 -19 215 -315 -64 97 -134 39 54 -87 80 -77
626 -77 103 21 -305 -152 -224 -1 119 32 108 40 43 329 -10 17 135 64 -376 -136 -392 -264 -92 75 -59 24
650 24 -350 -42 -93 398 153 -75 149 40 -19 -224 206 163 -216 29 -289 -113 -34 -53 -142 -128 64 -137 -63
673 -63 -147 197 49 -2 -75 -158 -166 81 -517 -73 -113 -56 17 -159 47 321 -96 -140 156 154 -48 246 -139 -170 -9
698 -9 -109 -155 -138 -163 290 -229 -202 206 102 -44 -67 -284 -342 -107 58 200 74 -231 18 7 -348 141 14
721 14 -33 70 -142 -50 -232 119 -54 -169 -159 58 168 69 116 453 103 3 -244 -409 -200 24 277 -201
$$ packed form
556A30P8p4n56Q0L03o09l8K24n0M2N51L16n0mK12r5j82J33Q1l16p5l17j94J29
580b81k4JJ95k04J62j06N9P4K7p9K64Q9j8M38q1k44j58R4J08j50m64K86l69k99
604f80M43J36k17M28k28L29Q3R0k03P2j05j67K34n30K51J61k31J73J5j41J67j57
626g7J80q2l26J53p2K23J20q7P6o8LK86l39K7J18p1m40K40k56J28J72J67j34Q3
650B4l74L08n1M91k45k28K24j09n9k05M30m3l79K45l18J76P9j9q9J4J92k01P4
673f3q4L44j48n1p3q3qK47n98M44m0N7P3j76K06K74m17m4K96kk02K94l85l1J61
698ij00m6J7k5M53n19K7M08j04j46k3k17n8K35J65J42j26l05K49j1l55M89j27
721A4m7J03k12R2j82L51j73j15J0K17J10r9M7L37l50j00k47j65K09K24K53m78
$$ plain form
743 -201 -177 171 79 -29 50 145 -102 -61 -9 87 -34 454 94 167 241 439 238 -427 -191 -309 -355 23 -114 -74
767 -74 -30 -115 136 -204 -37 408 293 -25 292 67 -106 -201 30 -17 -8 50 -176 234 -12 -169 -440 -33 182
790 182 -417 30 258 -66 -1 99 -77 156 328 -67 263 195 -172 96 -435 -31 -91 -306 -107 -309 -15
811 -15 -37 -75 223 362 -169 121 2 27 -34 -176 262 -20 -275 125 -9 -169 -236 -311 -55 -134 -160 -281 -2
834 -2 157 116 -127 331 -150 64 196 -249 107 4 -26 296 28 -98 -277 -218 -225 -196 -54 -33 -388 -207 -120 -2
858 -2 140 -93 -186 -88 -232 -163 108 -29 -265 35 -86 -258 -227 243 -68 75 85 279 59 96 -71 214 150
881 150 -33 13 -159 104 49 -112 118 50 -168 -90 -185 -118 246 -64 -136 194 -165 -13 -132 -38 190 -117 -62
904 -62 -49 -257 -132 -82 12 71 -97 -110 326 -92 13 64 139 -95 274 -211 12 -33 -18 -227 -170 85 -337 158
$$ packed form
743b01K4L48r2j08P9R5k47M1N2R6j21M88l60P3P4J98k01o65K36j18m6L78j37M0
767g4M4q5K51l40J67M45j15l18L17k25j73r5K31m7RN8k26M10k46j57k71M07K15
790A82n99M47K28l24O5J00j76K33J72l95L30o8l67K68n31M04o0k15J99k02K94
811a5k2l8K98J39n31K90j19K5o1j42M38k82k55M00j34j60o7p5K56p9k6j21K79
834bJ59m1k43M58m81K14J32m45L56j03l0L22k68j26j79N9pK9J42K1l55J81Q7J18
858bJ42k33r3R8j44O9K71j37k36L00j21j72L1M70l11J43J0J94k20L7j67K85o4
881A50j83M6j72K63n5j61K30o8k18P8r5O7L64l10p2L30l59J52j19R4K28l07N5
904f2J3k08J25N0R4N9j68j3M36m18J05N1P5k34L69m85K23m5J5k09N7K55m22M95
$$ plain form
928 158 165 90 -81 214 -179 -147 -51 8 88 127 155 -143 83 -84 -29 -366 83 52 178 231 125 115 -47 25 52
953 52 -32 -113 205 -40 369 -7 173 -18 13 -56 -355 -262 -68 -33 -207 -19 -218 -132 122 108 50 72 104 172 111
978 111 19 -17 -37 21 -37 374 23 -119 -225 -157 -3 244 116 -62 -8 231 -89 -26 192 -26 23 -48 64 -162
1002 -162 -108 -118 -78 -83 5 -208 56 77 14 -12 124 49 271 130 136 19 126 148 -222 28 -23 -97 150 -9 -274
1027 -274 -19 -89 -35 -116 41 -60 119 27 13 -48 131 -173 -117 97 113 -322 -145 -45 -168 139 181 -134 121
1050 121 -99 -59 -118 -219 178 25 -16 -25 -134 42 91 189 197 58 104 -158 119 -73 299 27 278 -168 184
1073 184 45 100 -46 162 190 53 -114 125 -244 -30 -34 103 -193 -141 39 178 29 4 169 245 -66 -163 301
1096 301 -55 187 22 56 -174 -38 -209 -142 133 168 220 128 128 -188 -169 53 -57 -129 -289 -157 6 310 123
$$ packed form
928A58Pp5j71K95l93L2R6N9Q0L9K8k98K26j67N5l37M49l1J26N3j06j0j62P2K7
953E2q4q1L18k45M09l76J80j91L1o9k99R3J94L5j74J88j99Q6K54j4n8K2L2O8o1
978A11r2l6k0N8n8M11l51j42j06O8J54K47j28j78N4K39l20O3K18k18M9p1J12k26
1002a62N4j0M0nQ8k13K64K1o3k6J36p5K22j41Oj17J07K2l70K50n1p4K47j59k65
1027b74K55p0N4q1J57j01J79r2j4o1J79l04N6K14J6m35J77J00j23L07M2l15K55
1050A21k20M0n9j01L97j53m1rj09J76M9R8Qj39M6k62K77j92L72k72K51m46L52
1073A84j39N5j46K08K8j37j67K39l69K14mJ37k96N2J80J39j49k5J65P6l11r7M64
1096C01l56K42j65L4k30J36j71O7K75L5N2r2%l16J9K22j10p2j60J32J63L04j87
$$ plain form
1119 123 185 -88 269 23 -258 -139 -80 -46 -202 -5 166 71 -294 -169 -284 -133 108 64 118 -8 -85 -112 28
1142 28 -339 -275 -28 28 152 138 -89 -190 3 99 -14 -31 124 231 38 29 29 112 239 -352 219 -139 -281 -77
1166 -77 -5 -241 -9 -20 1 159 -104 216 -135 178 48 2 3 33 -286 39 -206 -344 -79 20 43 84 202 148
1190 148 -24 -152 -267 91 -65 -43 219 -70 332 55 258 -211 198 205 50 -279 -86 -27 -265 -59 114
1211 114 -80 141 -67 124 139 -206 -1 -46 -283 418 74 -16 306 -40 -83 -63 145 -113 -169 212 25 -81
1233 -81 -4 -35 32 -60 18 -8 -199 -238 -196 -306 54 118 -303 -107 -65 -209 -60 -334 88 -27 -37 261 -75 24
1257 24 -101 -187 -86 -83 -28 134 -184 54 139 41 -26 -255 -20 -89 41 -193 -12 59 442 39 85 -280 -44 -219
1281 -219 48 286 -124 102 41 58 151 -99 23 -121 25 -190 17 175 173 -71 -99 -27 -97 -180 -95 81 92 27
$$ packed form
1119A23O2k73L57k46k81J19N9L4j56J97J71r5l65J25j15J51K41m4N4j26p7k7J40
1142B8l67O4K47N6J24j4k27j01J93R6j13j7J55J07j93r%Q3J27n91N71l58j42K04
1166g7P2k36K32j1K1J58k63L20l51L13j30m6JL0l19L25k45j38K65R9K3M1J18n4
1190A48j72j28j15L58j56K2K62k89M02k77K03m69M09Pj55l29J93N9k38K06J73
1211A14j94K21k08J91J5l45K05m5k37P01l44r0L22l46m3K0K08k58n6L81j87j06
1233h1P7l1O7r2P8k6j91l9M2j10L60O4m21J96M2j44J49k74M22j15j0K98l36R9
1257B4j25q6J01LN5J62l18K38Q5r8o7k29K35o9J30k34J81P1L83m03M6l65K36j75
1281b19K67K38m10K26o1J7R3k50J22j44J46k15K07J58kk44k8P2p0q3Q5J76J1o5
$$ plain form
1305 27 -80 -69 -86 60 -123 -202 82 -196 -73 -116 -391 -296 -349 -1 31 121 -22 8 -101 86 -142 62 16 6
1329 6 191 -61 -120 -64 -35 88 -91 242 -5 29 -79 56 66 135 77 -62 46 -23 47 178 94 65 276 -226
1353 -226 -41 131 7 -124 300 -84 65 -65 3 -51 -390 -82 24 -104 -144 -92 177 144 -231 -45 448 -177
1375 -177 -65 199 27 -29 35 28 179 -70 -163 104 65 -51 194 -103 -174 105 333 -53 169 -35 116 -61
1397 -61 -143 -124 29 -28 -23 -8 -122 -159 -136 149 -142 -89 76 145 -53 225 166 -57 -244 -109 78 182 105 4
1421 4 -49 66 -88 131 -85 -44 69 -258 -100 -104 -60 125 49 94 -7 50 -400 -102 109 -13 153 -145 -200 -56
1445 -56 163 -78 33 68 -151 -97 178 156 93 -62 182 -34 101 -45 133 -281 221 -141 133 -168 -164 154
1467 154 -185 153 277 -186 138 109 -27 -82 158 289 73 -173 -116 -188 -68 97 -217 -10 -24 11 -65 94
$$ packed form
1305B7j07J1j7J46j83p9K84k78J23m3k75R5n3L48L2R0j43L0j09J87k28K04m6j0
1329FJ85k52n9N6K9J23j79L33k47L4j08J35J0O9n8j39J08o9P0J31q4k9K11n02
1353b26J85J72j24j31M24l84J49j30O8n4l39L08J06j28m0N2K69l3l75J86M93o25
1375a77J12K64j72n6O4pJ51k49r3K67l9j16K45k97p1K79K28l86K22k04J51j77
1397f1q2J9J53n7NJ5j14l7K3K85k91N3J65O9j98K78n9k23j87J35J87J04p7j01
1421Dn3J15j54K19k16M1J13l27J58mM4J85p6M5j01N7m50K98K11j22J66k98n5J44
1445e6K19k41J11L5k19N4K75k2o3j55K44k16J35j46J78m14N02l62K74l01ML18
1467A54l39L38J24m63L24k9j36n5K40J31k16k46N7p2J20J65l14K07j4L5p6J59
$$ plain form
1489 94 -33 -184 142 100 -236 -231 -47 106 -100 -58 88 13 185 103 9 26 37 -29 182 -130 261 -137 43 -52
1513 -52 -177 -52 -266 -70 -233 -164 -93 -124 257 -92 -39 12 -86 -95 -88 116 -140 50 -220 242 269 -33 -173 -127
1537 -127 -235 -22 -215 129 -51 -196 248 -86 -148 -267 178 -82 32 67 -1 305 340 -254 -183 -144 162 28
1559 28 -14 52 26 -71 -26 -12 106 -258 -148 119 -107 42 -77 0 86 109 -12 -198 16 -260 -130 130 -55
1582 -55 229 80 -24 34 167 -67 -153 5 -151 64 6 32 9 293 184 -138 113 -132 94 -38 200 -24
1604 -24 119 -188 -183 7 145 -118 -106 118 -76 -155 -23 236 -47 -21 148 252 16 221 -71 24 -223 68
1626 68 -280 159 -71 71 0 -42 -174 20 -37 168 -44 -143 111 28 63 66 -130 33 -39 66 45 -162 -93 -247
1650 -247 387 273 11 -230 -52 32 -276 91 179 -18 8 -61 16 -90 27 -45 225 -64 237 -25 156 12
$$ packed form
1489I4j27j51L26m2l36NJ84J53k06M2J46p5J72q2r4J7J1o6K11l12L91l98J80r5
1513e2j25J25k14J96j63O9P1l1L81l49N3N1r8rPK04k56J90k70M62K7l02j40M6
1537a27j08K13j93L44j80j45M44l34o2j19M45k60J14L5o8L06L5n94P1L9L06j34
1559B8m2O6k6r7M5J4J18l64J10K67k26J49j19P7Q6K3j21j86K14k76J30K60j85
1582e5K84j49j04N8J33k34q6J58j56K15n8K6k3K84j09l22K51k45K26j32K38k24
1604b4J43l07NJ90J38k63J2K24j94p9J32K59k83K6J69J04k36K05k92R5k47K91
1626F8l48M39k30J42p1m2j32J94n7K05k12r9K54q3L5Lj96J63p2J05k1k07O9j54
1650b47O34j14k62k41J78Q4l08L67Q8j97K6o9P7j06J17p2K70k89L01k62J81j44
$$ plain form
1672 12 129 97 160 7 -86 -7 -20 17 120 -61 140 326 122 97 29 -43 0 102 40 18 -94 -189 341 206 8
1697 8 155 -250 60 -98 -146 -118 99 -9 -76 119 -53 -99 -28 -22 197 163 26 -132 366 -257 13 182 -82
1720 -82 -84 -52 -70 180 155 42 164 17 277 174 117 18 93 -167 -52 -159 177 64 159 112 -48 -31 -232 91
1744 91 -49 115 181 -170 -25 -83 103 213 -123 -41 -84 -12 -48 25 23 124 -12 -247 -3 -115 104 -35 -82 57
1768 57 20 267 108 -113 -59 10 38 219 -395 108 -130 -108 -139 151 99 -142 -80 -138 10 -208 78 -180 91
1791 91 -112 -46 -38 22 -281 361 55 108 -10 -266 -313 -210 -268 180 -26 -58 -109 -45 325 -93 24 67 -201 114
1815 114 166 244 123 -37 -104 43 -32 232 -38 25 -61 316 399 -295 223 -228 -227 261 163 -156 168 46 -57
1838 -57 69 156 109 3 31 -7 -172 -185 -224 -92 -263 181 168 -7 -65 219 274 127 -80 56 231 -95 -77 -295
$$ packed form
1672A2J17l2O3j53r3P9j3L7J03j81K01J86k04k5o8p2M3J02o2k2j12r5N30j35j98
1697HJ47m05L10j58m8K8K17j08o7J95j72m6P1OK19l4j37j58M98o23K70J69k64
1720h2kL2j8K50k5j13J22j47K60j03n7r9P5k60J15j07L36j13R5m7j60J7k01L23
1744I1j40J64O6l51J45n8J86J10l36Q2m3P2l6P3kJ01j36k35K44j12K19j39m7J39
1768E7l7K47j59k21N4O9K8J81o14N03k38K2l1K90n2k41O2n8J48k18K86k58K71
1791I1k03O6QO0l03O42l06N3j18k56m7J03n8M48k06l2n1O4L70m18J17M3k68L15
1815A14N2P8j21j60o7J47p5K64k70O3q6L77Q3o94N18m51JM88r8l19L24j22j03
1838e7J26Q7m7j06K8l8j65j3l9J32j71M44j3j75n8K84N5j47k07J36J75l26J8k18
$$ plain form
1862 -295 154 -33 73 150 -143 174 18 -153 77 -107 -78 -162 -140 -89 151 48 -60 215 186 -133 -139 -35 -543
1885 -543 -134 325 147 3 61 101 32 -161 114 88 80 -74 -27 -120 72 -370 100 12 24 173 47 33 -359 194
1909 194 80 26 167 9 -113 171 18 31 -99 106 41 83 1 92 -7 -73 25 61 -299 108 17 12 107 5 -76
1934 -76 39 3 -87 -86 21 -218 -137 63 -163 -232 51 -13 18 -10 261 66 -170 7 194 -163 289 285 0 -221
1958 -221 -323 258 -23 159 -146 -17 -57 -307 178 162 92 92 -111 -38 -287 66 81 -68 -56 151 102 147 -146
1981 -146 113 121 -80 -3 -3 159 150 78 37 -126 -180 -96 -164 -34 49 -52 -203 -39 -301 146 -22 -88 -144 -34 25
2006 25 -154 215 44 -36 52 256 11 11 -54 -217 -128 42 -131 -294 273 179 55 58 88 91 -13 119 -63 33 170
2031 170 29 -101 99 138 80 -237 -154 -149 -82 202 57 71 86 -140 -173 88 -161 59 -281 387 -268 -194 -30
$$ packed form
1862b95M49j87J06P7k93L17j56j71K30j84K9q4K2N1K40j03j08K75k9l19oJ04n08
1885e43M09M59j78j44N8M0o9j93K75k6qj54M7r3J92m42M70q8J2J49j26j4l92N53
1909A94j14n4J41j58j22K84j53J3j30K05o5M2q2R1r9o6R8L6l60M07r1nR5j02q1
1934g6J15l6r0JJ07k39Q1K00k26o9K83o4L1k8K71j95k36J77J87l57M52mk85k21
1958b21j02N81k81J82l05J29m0k50M85j6p0%k03P3k49L53J5j49J2K07m9M5k93
1981a46K59Qk01P7%J62rp2m1j63n4Q4o8J30Q3j01j51J64k62M47j68o6n6J10N9
2006B5j79L69j71q0Q8K04k45%o5j63Q9J70j73j63N67r4j24LL0Lj04J32j82R6J37
2031A70j41j30K00L9n8l17Q3NO7K84j45J4J5k26l3K61k49K20l40O68o55P4J64
$$ plain form
2054 -30 38 269 -167 246 -275 -373 -94 -80 0 -48 146 52 50 -110 26 -38 216 -123 48 -41 10 -403 -66 -11
2078 -11 86 82 37 147 -77 141 135 -122 -204 30 41 27 34 -83 107 95 7 99 61 57 -158 -275 120 -230 240 -41
2104 -41 290 -46 141 39 -54 84 -93 6 -49 44 114 -137 -32 -62 -29 29 -141 65 -122 75 -221 -174 -186 -48
2128 -48 179 74 54 84 -310 -262 -94 -6 -124 -67 32 -67 -84 130 321 -119 74 -3 63 -232 -57 -57 103 55 -281
2153 -281 157 133 -71 -66 62 119 -74 73 320 -58 36 207 -84 115 36 -151 123 -161 -291 -52 -161 179
2175 179 -86 -136 -3 -162 -246 16 -132 62 -204 22 -44 -132 -80 -195 -102 -97 106 32 32 -194 -209 144 -177 -19
2199 -19 16 -99 240 47 170 48 -171 24 94 -132 202 7 -156 -194 2 79 -150 28 -2 -171 -22 134
2221 134 95 142 -232 51 87 -108 230 77 85 47 -43 -127 136 135 47 120 373 -25 -277 -45 168 1 61 -114
$$ packed form
2054c0O8K31m36M13n21r8K79J4Q0m8J94r4kj60J36o4K54l39J71q9N1m13L37N5
2078a1R7mm5J10k24K18ok57q2K34J1j4Pj17J90j2q8R2l8mk15j17L95l50M70k81
2104d1L31l36J87j02r3J38j77R9n5R3P0k51J05l0L3N8j70K06j87J97k96M7j2J38
2128d8K27j05k0L0l94M8J68Q8j18N7R9r9j7K14J91m40J93p7O6k95J75%J60m8l36
2153b81M38k4k04NJ28N7j93J47K47l78R4J71k91J99p9j87K74k84j30K39j09L40
2175A79k65n0J33j59q4K62j48J94k66K26o6q8N2j15R3NK03p4%k26j5L53l21J58
2199a9L5j15L39j93J23j22k19J95P0k26L34j95j63l8J96P7k29J78l0j69J49J56
2221A34l9M7l74K83L6j95L38j53Ql8r0q4K63jq8P3K53l98k52K32K13j67O0j75
$$ plain form
2245 -114 -181 -343 64 81 -19 158 -67 113 99 185 -198 254 28 42 -209 -106 -161 184 357 38 0 -51 239
2268 239 49 -93 -256 -200 -11 357 -21 93 86 86 -93 19 53 -147 -367 191 66 -148 -20 375 -3 52
2290 52 -101 -52 144 -131 -112 -67 122 -166 -94 -14 275 41 143 -257 106 29 -117 313 -12 -38 426 230 -215
2313 -215 18 -96 152 162 90 138 126 -16 -281 78 13 -74 143 66 -68 75 66 83 -86 -145 97 -94 236 36
2337 36 -2 57 65 257 30 -62 -118 124 38 -77 -24 140 101 -29 -174 -363 140 135 52 348 195 24 169 66
2361 66 282 70 -101 84 11 -59 -67 90 108 -29 -42 125 20 -232 -82 -66 71 -88 -85 -183 -21 171 23 159
2385 159 -205 159 -76 -275 -46 213 389 10 -141 -145 170 55 -100 70 -264 -118 -32 127 -255 -62 -225
2406 -225 -60 -194 146 102 -97 -104 178 78 1 159 -198 140 170 -225 -383 -54 125 -160 -1 -12 204 125
$$ packed form
2245a14o7j62M07J7j00J77k25J80j4Q6l83M52k26J4k51J03n5L45J73l19l8n1K90
2268B39j90j42j63N6J89L68l78J14p%j79J12L4k00k20N58j25k14J28L95l78N5
2290E2j53M9J96k75J9M5J89k88P2Q0K89k34J02m00L63p7j46M30l25k6M64j96m45
2313b15K33j14K48J0p2M8j2j42k65L59o5q7K17p7j34J43rJ7j69n9K42j91L30k00
2337C6l8N9QJ92k27r2n6K42q6j15N3J64l9j30j45j89N03nq3K96j53j71J45j03
2361F6K16k12j71J85p3p0qJ57J8j37j3J67j05k52J50J6J37j59Lr8J62J92j48J36
2385A59l64L64k35j99K29K59J76l79j51mL15j15j55J70l34J46Q6J59l82J93j63
2406b25J65j34L40m4j99pK82j00p7J58l57L38L0l95j58L29J79k85J59j1K16p9
$$ plain form
2428 125 -75 -73 440 124 150 -72 29 142 -134 157 -244 16 11 201 -300 -271 8 -109 -9 -31 -97 -40 61
2451 61 102 -146 -138 -113 -115 51 87 -56 -26 151 -75 103 -67 -21 -151 -177 -103 -98 -4 119 147 24 -10 -101 -296 26
2477 26 169 56 -109 340 -196 6 45 -134 33 -152 -5 135 -133 -157 306 112 42 -112 -136 76 82 62 209
2500 209 92 -80 6 -80 -212 87 220 5 78 -4 10 39 -76 -21 41 -91 -321 -135 -100 -194 52 154 190 20
2524 20 31 44 -105 -97 -111 -11 -244 58 -29 -190 -22 -11 232 -33 296 -10 241 -86 -20 202 -32 -160 23
2547 23 -6 -229 -54 -72 -54 -88 174 -91 -181 -41 328 0 -87 -30 276 -130 13 103 160 61 168 80 85 -20 -33
2572 -33 -105 51 -61 -19 194 204 -92 -19 -39 42 161 -106 42 -75 67 -73 -17 49 193 -153 -142 -157 -99 31
2596 31 -344 -97 5 -68 -137 -102 119 115 15 70 -214 105 -74 54 133 109 -19 -113 39 88 -82 108 -43 -92
$$ packed form
2428A25k00KN13l16K6k22J01J13k76K91m01K60nJ90n01K9K79j17J00k2o6N7J01
2451F1M1k48QK5kJ66L6j43L0J77k26J78j70M6j30k6P4NR4J23K8j23l4r1j95L22
2477B6J43j13j65M49n36K02L9j79J67j85J47J40k68k4M63j94p0j54k4K12Ok0J47
2500B09j17j72Q6q6j32K99J33k15P3q2J4K9j15N5O2j32k30J86L5r4K46J02L6j70
2524B0J1J3j49Qj4J00k33L02q7j61J68J1K43k65L29l06K51l27O6K22k34j28J83
2547B3k9k23J75j8J8l4K62k65r0J40L69l28q7N7L06m06J43R0N7r9J07q8Nj05j3
2572c3p2J56j12M2K13J0k96P3k0Q1J19k67J48j17J42j40N6O6J44l46J1j5N8J30
2596C1l75K47J02p3o9L5K21mj00N5k84L19j79J28P9k4j28r4J52M9j70J90j51m9
$$ plain form
2620 -92 9 -31 134 116 -27 -131 87 210 207 83 148 -294 51 -7 35 24 368 86 67 -113 -62 -180 89 -162
2644 -162 -183 -41 417 52 -49 42 -291 -79 -35 23 -122 -68 49 200 147 -38 -156 10 -131 -56 84 141 184
2667 184 194 41 270 5 -170 -118 15 -2 -113 -60 -143 -191 -132 -133 -39 -166 43 65 -136 -91 3 -40 24 -174 -288
2692 -288 -100 264 121 253 -6 -527 -49 264 -25 94 -246 83 -48 -168 69 -139 172 -4 -148 -243
2712 -243 157 -182 174 -14 -5 201 -14 112 52 114 -89 -14 -6 -176 168 40 -20 21 -119 -51 117 -27 19 113
2736 113 249 16 -37 -71 41 -16 216 76 2 103 60 -10 113 356 -284 320 -46 163 105 -69 90 -75
2758 -75 13 265 41 62 186 187 -147 198 124 54 176 -82 -64 16 -38 26 -28 130 -93 -142 269 28 158 -4
2782 -4 19 -36 -6 16 -75 -110 -8 179 195 -87 -185 4 -89 -40 -34 138 252 -61 -20 1 4 94 96 158 141 86 -64 -247
$$ packed form
2620i2J01m0J65j8j43j04K18J23lj24O5m42L45n8M2j1L44k82j9j80N1j18K69k51
2644a62k1J42M58l65j01R1l33K12M4N8j45N4J17J51n3j85j18J66j41P5J40N7M3
2667A84J0j53K29k65j75N2J33j7j11N3q3m8N9jR4j27K09K2k01M5R4m3O4j98j14
2692b88J88L64j43J32k59n21M78L13k89J19l40L29j31j20K37k08L11j76j44r5
2712b43M00l39L56j88RK06k15J26o0O2k03P5Qj70L44j28o0M1j40O8J68j44M6R4
2736A13J36k33n3l4J12n7K32j40p4J01m3p0J23K43o40O04l66K09n8j74J59j65
2758g5Q8K52k24K1J24Jl34L45p4p0J22k58J8Q0n4O4n4J58k23m9M11k41J30j62
2782dK3n5L0K2r1l5J02J87J6k82r8J89r3M9OJ72J14l13M1K1LR0KO2j7n5j50j83
$$ plain form
2810 -247 104 -296 -53 -108 -93 -71 -132 13 65 -141 -101 142 -178 25 86 24 37 136 -145 -63 -241 -86 32 33
2834 33 136 43 -113 139 204 55 -171 -119 -124 -118 75 133 72 -310 97 119 29 -26 -306 -6 -138 -61 28 28 -99 95
2860 95 -132 35 -252 -38 49 -51 -43 -58 88 -56 -97 44 -154 -292 -143 -125 183 120 -268 218 8 102 -139
2883 -139 -189 -91 120 -62 174 160 -370 -59 56 -10 -225 128 72 -64 -46 -242 98 -41 272 322 -143 -1
2905 -1 -1 175 -39 22 -283 -246 -117 -60 -95 262 6 152 322 -219 71 -13 59 -244 1 -167 111 -114 -163 220
2929 220 -111 107 80 388 -17 -160 -161 31 -239 -27 150 136 -128 129 12 12 124 -58 -185 159 -109 45
2951 45 83 59 56 -157 94 137 141 148 285 35 164 -64 -205 -130 -78 -226 -170 139 -137 109 59 52 -84 -74 -29 123
2977 123 -105 -194 77 107 -45 199 -91 -132 129 -215 -129 113 -124 182 -10 -14 -66 13 -19 -87 -149 28 229 -84
$$ packed form
2810b47L51m00K43n5J5K2o1J45N2k06M0K43l20K03O1o2J3R9k81Q2j78J55J18J
2834C3J03r3j56K52O5j49k26N2nOJ93N8o1l82M07K2r0n5k80L00j32P7Q9%j27J94
2860I5k27J67k87K14Q7j00Qj5J46j44m1J41j98j38J49J8L08o3l88M86k10R4k41
2883a39n0R8K11j82K36j4n30L11J15o6k15L53n6j36J8j96L40j39L13N0m65J42
2905a%J76k14O1l05L7J29N7l5L57k56J46J70n41K90q4P2l03K45j68K78k25m9L83
2929B20l31K18k7L08m05j43jJ92k70K12J77j4k64K57j17%J12j82j27L44k68J54
2951D5L8k4lk13K51M3MPJ37k50J29k28j41P5N2j48N6L09k76K46n0pj36J0M5J52
2977A23k28q9K71L0j52K44k90m1K61l44Q6K42k37L06j92mn2P9l2o8o2J77K01l13
$$ plain form
3001 -84 225 -119 7 46 -54 68 -4 -1 -62 74 -81 -11 65 115 142 5 117 3 -62 -74 60 189 25 -42
3025 -42 -7 58 187 27 185 -136 -4 208 156 -276 161 99 132 66 -123 -59 115 147 -239 -116 6 224 -105
3048 -105 -22 -227 104 57 -172 -10 5 -75 -180 -9 -136 -47 -233 39 -12 -154 -41 109 -337 59 -36 145
3070 145 284 -148 17 141 72 -49 -265 296 -169 76 27 -466 5 102 -107 -109 67 396 -53 -323 208 -13
3092 -13 183 88 -13 27 370 -109 327 -40 251 45 -2 264 247 279 -31 -89 -14 111 16 -155 -242 -21 -108 122
3116 122 -51 -245 162 -101 209 -10 -171 -74 -266 -20 99 -184 123 -16 118 145 -230 46 -126 40 114
3137 114 142 -143 -74 12 -303 -197 165 -2 -213 49 -12 28 94 -227 220 83 85 -235 13 -166 -444 97 -319
3160 -319 -208 287 251 -72 -55 -169 137 -206 158 92 111 4 -52 27 42 -13 -49 -407 -42 13 -212 -119 132 71
$$ packed form
3001h4L09l44J26L9j00J22p2Lo1J36j55P0P6N0K7j37J12j14o5j2J34J29j64o7
3025d2L5O5J29j60J58l21J32K12n2m32M37o2L3o6j89O4J74L2l86J23J22K18l29
3048a05Q3k05L31m7k29J62J5q0j05J71j27Q9j86K72n1j42J13J50m46L96r5J81
3070A45J39m32J65J24o9j21k16N61m65K45m9m93M71R7k09kJ76L29m49k70N31k21
3092a3J96r5j01M0L43m79M36l67K91k06m7K66j7L2l10n8P5J25r5j71q7K21q7K30
3116A22j73j94M07k63L10k19j61R7j92K46J19k83L07j39J34K7l75K76j72J66P4
3137A14K8k85O9Q6l15J06L62j67k11K62o1M0O6l21M47j37Kl20K48j79k78N41m16
3160c19J11M95l6l23J7j14L06l43L64o6J9j07n6P9J5n5l6l58L65N5k25R3K51o1
$$ plain form
3184 71 -18 -6 -3 -202 -89 217 -241 -58 -18 -281 -185 -139 -233 -16 -121 -232 11 83 19 183 -331 -262 82 100
3208 100 -189 27 -16 -44 12 203 0 208 87 148 -44 8 -28 131 -249 -149 61 -216 88 108 -168 -84 23
3231 23 -8 -141 136 119 56 -229 243 7 26 -174 79 24 -149 -100 0 -42 -214 85 97 -150 33 82 97 -168
3255 -168 -208 -303 89 -279 147 -69 221 -2 75 13 -19 -112 -38 42 -99 -76 -149 118 76 73 9 -88 78 136 -265
3280 -265 -51 -69 -174 -23 -217 -108 -133 54 164 -104 65 28 -127 -124 -167 -296 152 45 53 154 -102 -126 -60
3303 -60 279 -71 308 -64 161 22 -193 142 129 37 14 56 -222 26 -112 91 271 103 -101 -62 -45 -146
3325 -146 326 -2 106 -13 -160 145 58 -105 189 144 129 -92 -316 -183 -85 -43 -7 -76 83 51 -197 160 39
3348 39 184 -184 38 -91 53 -147 -8 38 -67 9 -136 -24 -145 -135 179 30 -91 -72 -58 37 -83 120
$$ packed form
3184G1q9J2Lj99J13L06m58J83M0k63R6M6r4K17j05j11K43P2o4J64n14O9L44J8
3208A00k89K16m3k8N6J91k03K08j21O1j92N2l6J59l80J00K10k77L04K0k76Q4J07
3231B3l1j33K77j7o3k85M72k36J9k00K53n5j73M9J00m2j72K99J2k47J83M9J5k65
3255a68m0r5L92l68M26k16K90k23P7o2l2r3P4Q0j41K3p3K67m2lo4r7J66N8m01
3280b65K14j8j05J51j94J09k5J87J10k68J69l7j55Lm3j29M48j07QJ01k56k4O6
3303f0L39l50L79l72K25j39k15L35j3r2k3M2k78K48j38K03J80j68k04L9J7j01
3325a46M72l28J08j19j47L05q7j63K94m5j5k21k24J33R8M2L6o9J59l2k48L57j21
3348C9J45l68K22j29J44k00J39M6j05P6j45J12j21J0L14j49j21J9J4R5j20K03
$$ plain form
3370 120 343 -187 270 -40 -46 133 137 249 -83 -11 75 -141 289 68 -84 -126 -166 -64 209 237 9 -224 -126
3393 -126 271 -78 79 -7 15 -39 -14 -193 203 -12 76 421 83 202 -129 -134 -136 -3 -103 -265 -69 -312 110
3416 110 53 33 304 56 25 46 196 106 -73 -15 -4 37 -101 72 -35 201 102 -54 -273 -132 -223 -217 85 148
3440 148 -82 -102 207 153 -114 -64 183 -75 -49 -5 -152 -302 -177 198 -136 -19 19 -181 119 109 -161 84
3462 84 -137 141 19 -252 -21 3 143 -111 -57 117 -286 133 402 41 -106 -76 -86 -89 7 -29 -131 82 339
3485 339 113 243 72 119 -102 -36 -11 -15 83 -364 -72 76 -209 -361 219 -287 -23 -158 249 11 -259 3
3507 3 -52 -235 -185 54 113 111 32 -109 -168 -176 62 -70 107 -5 23 -202 -89 184 -19 421 -259 66 -27 139
3531 139 -83 142 -13 -189 55 89 179 155 33 54 82 -42 18 -96 206 194 -142 -164 -200 -234 -60 -14 -82 60
$$ packed form
3370A20K23n30M57l10oJ79MJ12l32P2Q6k16M30k21j52m2m0J02K73K8k28k33R8
3393a26L97l49J57q6K2n4K5j79L96k15Q8L45l38J19l31nkJ33j00j62J96k43M22
3416A10n7k0K71k48l1K1J50r0j79N8J1M1j38J73j07K36r9j56k19J41r1OL02O3
3440A48k30k0L09n4k67N0K47k58K6M4j47j50J25L75l34J17L8k00L00j0k70K45
3462H4k21K78j22k71K31K4J40k54N4J74m03M19K69l61j47L0j0lR6l6j02K13K57
3485C39k26J30j71M7k21O6K5mR8m47K92J48k85j52N80n06K64j35M07k38k70K62
3507Cn5j83N0K39N9kp9j41n9qK38j32J77j12K8k25J13K73k03M40o80L25r3J66
3531A39k22K25j55j76K44L4R0k4j22K1K8j24O0j14L02j2l36k2l6l4J74M6o8J42
$$ plain form
3555 60 -1 197 -53 -98 -169 41 -50 73 -2 110 221 203 17 28 -8 224 71 4 422 -104 169 -124 -275
3578 -275 163 -75 91 -124 90 -147 -9 -256 13 -45 -20 50 52 65 -221 163 20 -191 40 42 76 28 63 41
3602 41 248 209 -16 37 28 134 -92 -331 38 31 130 162 -10 66 -141 229 305 43 -27 -4 69 -30 -4 159 112 -20
3628 -20 -11 -26 -156 33 -220 -74 256 95 310 -52 -53 141 131 112 -89 -77 174 -281 -8 -58 -207 128 -196
3651 -196 130 -190 -190 -203 75 160 -219 68 -79 143 -10 124 146 117 5 -121 -135 -149 -290 25 237 -65 -58
3674 -58 12 -18 17 40 111 60 -89 33 -126 114 91 8 -72 -170 18 -100 -97 -165 -51 -158 -205 -78 189 -16 -214
3699 -214 5 -198 -6 127 -31 -40 -200 -166 -252 19 109 -175 241 -128 -7 128 -99 12 -72 94 -10 76
3721 76 190 -115 37 -278 -111 31 -41 52 -118 -127 -226 39 38 23 70 39 -106 328 80 27 130 -49 -270 0
$$ packed form
3555F0o1J98k50m5p1K10r1J23p5J12J11j8j86J1l6K32j53o7M18n26K73k93j51
3578b75M38k38J66k15K14k37J38k47K69n8K5P0KJ3k86L84j43k11K31KL4m8L5k2
3602D1K07l9k25N3rJ06k26k39L69pR9L2j72P6k07L70P6k62p0K3P3r9K6J63m7j32
3628b0Rj5j30J89k53J46L30j61K15l62jJ94j0j9k01J2K51m55K73n0j49L35l24
3651a96L26l20%j3K78Q5l79K87j47K22j53J34K2k9j12j26j4j4j41L15K12l02P
3674e8P0l0L5K3P1n1j49J22j59K40k3q3q0r8J88j18Lo8J14j07m7J27K67k05j98
3699b14K19k03J92J33j58rj60L4q6K71R0k84M16l69J21J35k27J11q4J66j04Q6
3721G6J14l05J52l15J67J42p2R3j70rr9K65jj5M7l1j45M34k48n3J03j79k21K70
$$ plain form
3745 0 -26 272 -75 152 86 -93 -4 192 -5 45 -14 -38 157 -112 83 73 131 128 -28 237 35 91 118 134 -45
3770 -45 58 -275 -95 -113 165 53 2 276 -60 -219 354 108 74 -43 47 92 178 54 48 287 -25 -145 222
3793 222 140 101 -57 -56 -225 -104 309 -147 8 -313 -242 -1 34 111 -239 54 289 -77 145 -233 122 60 -72
3816 -72 36 -30 -3 86 250 -81 -76 -32 17 85 198 403 -3 29 -173 51 -72 30 -106 -64 -84 -11 -252 -264 -170
3841 -170 -252 149 -221 30 -199 -250 97 -3 240 -50 -21 -108 179 115 151 -196 106 169 -121 26 45 83 65
3864 65 -2 -11 -74 -92 81 103 371 10 18 -169 -300 108 -67 -139 -140 91 124 197 142 -138 -88 -39 -89 -41 78 257
3890 257 56 92 26 101 273 -222 355 194 -38 -134 -60 12 -38 -209 54 60 -9 -72 -106 68 53 -50 -148 3 -106
3915 -106 -17 -266 -172 130 29 -69 248 -370 81 173 -121 23 75 1 48 52 -28 -7 -124 -36 -76 141 -136 246
$$ packed form
3745@k6K98l47K27o6j79Q9J96j97N0n9k4J95k69J95j0N8lj56K65k02N6K7J6j79
3770d5J03l33J80j8K78j12n1K74l36j59N73k46l4j17R0M5Q6j24oK39l12j20L67
3793B22q2l9j58Jj69J21M13m56J55l21P1K41L5P7l50K93K35l66K22l78L55o2j32
3816g2J08o6K7Q9J64l31NM4M9O8J13K05m06L2k02K24j23J02j36M2k0P3k41j2R4
3841a70q2M01l70K51k29n1L47j00K43k90K9q7K87o4L6l47L02O3k90J47J9L8j8
3864F5o7ro3j8J73K2K68l61Qj87j31M08j75p2jK31L3P3n5k80N0M9n0M8J19J79
3890B57k01L6o6P5J72m95N77j61k32r6P4P2n0j71K63Oo9o3l4J74j5j03r8J51j09
3915a06Q9k49R4L02j01r8L17o18M51R2k94J44N2p4M7Mq0K1j17Q8m0K17k77L82
$$ plain form
3939 246 47 20 130 -76 -156 -135 69 -210 -125 -194 -131 102 -204 87 -66 17 -259 8 179 -102 -23 141 37
3962 37 196 -62 71 198 -87 121 36 -103 125 0 -15 -171 -183 124 -6 118 -84 24 -21 28 225 63
3984 63 -46 -169 82 -101 120 -274 335 -221 -155 -197 -3 -41 66 -71 -71 -100 208 182 57 -46 97 -60 58
4007 58 -195 54 -32 26 89 -60 -67 133 131 -276 -187 -85 92 110 -33 217 53 183 -14 -235 73 -79 -57 -128
4031 -128 -82 47 43 -129 -47 142 18 -44 91 159 153 82 84 165 -39 119 118 -4 -201 -55 96 130 -26 42 -167
4056 -167 55 -111 23 -86 152 -60 -216 -200 58 89 -77 -51 6 159 -40 -277 106 62 -68 94 107 143
4078 143 155 269 -41 -43 97 -26 306 162 -13 19 -107 93 63 153 -183 11 -6 -26 -96 70 299 -2 -3 277
4102 277 -103 165 -34 -47 -77 8 -219 213 -71 214 18 -37 218 86 23 -64 42 -96 -97 -44 107 -341 203
$$ packed form
3939B46j99k7J10k06q0K1K04k79Q5o9O3K33l06K91j53Q3k76K67J71k81P9J64j04
3962C7J59k58J33J27k85K08q5j39K28j25j5j56j2L07j30J24k02J08m5M9J97j62
3984F3j09j23K51j83K21l94O09n56O6m2J94l8J07j37%k9L08k6j25j03J43j57J18
4007E8k53K49q6N8O3j49pK00km07Q9J02J77J8j43K50j64J30j97k21L08j52K2p1
4031a28M6J29mj72Q2J89j24o2J35O8op1KQ1k04J58jj22j97J46J51L4j56O8k09
4056a67K22j66J34j09K38k12j56J6K58L1j66K6N7J53j99k37L83m4j30J62J3L6
4078A43J2J14l10kJ40j23L32j44j75L2j26K00l0R0l36J94j7k0p0J66K29l01jK80
4102B77l80K68j99j3l0Q5k27M32k84K85j96n5K55j32o3q7J06j38jN3J51m48N44
$$ plain form
4125 203 -150 -53 -51 46 -60 -224 21 80 -119 -155 43 0 20 -108 -152 -146 -8 -404 -174 -34 -116 198 24 0
4149 0 -81 64 -170 0 -154 116 163 47 -69 44 156 85 61 -214 50 63 -30 -124 84 24 -209 -28 -30 151
4173 151 30 -148 -112 27 49 -293 148 192 -189 -140 -103 167 144 -110 293 38 30 84 -142 -360 -19 -122 -167
4196 -167 -54 38 76 -136 93 224 -133 -72 31 -84 191 -63 -68 -28 -171 2 -253 141 -140 -129 -51 107 194
4219 194 -54 71 38 0 -109 66 16 -305 180 14 52 -200 -194 -204 -278 -149 -123 48 -50 65 49 -194 -6 273
4243 273 -201 -51 112 -125 166 208 159 -190 -114 84 5 -47 169 28 41 149 34 -107 -104 128 -267 85 146
4266 146 -9 76 -68 -246 -207 78 47 -158 11 -63 -61 181 -16 41 -65 200 62 -25 292 69 83 240 -174
4289 -174 7 109 108 32 -246 15 -38 -138 -88 -62 -22 134 -36 9 127 163 263 267 -32 169 -230 -70 -133 -175
$$ packed form
4125B03l53R7KR7j06j64K45N9j99l6J98m3K0j28m4OJ38l96K30J40q2L14j74k4
4149@q1J45k34J70j54K70M7j16j16J13J12p1k4k75K64J3r3r4K08o0k33J81kJ81
4173A51j21j78L6J39K2l42M41M4l81M9L7K70k3k54M03k55qN4k26k18L41j03m5
4196a67J13R2L8k12K29J31l57O1J03j15K75k54nM0j43J73k55L94k81J1P8J58Q7
4219A94k48J25l3l8j09J75n0l21M85j66L8k52Oj0p4J29K6J71r8J15j6k43J88K79
4243B73m74J50J63k37K91M2m9l49P6J98p9n2K16j41J3J08j15j41LK32l95L52O1
4266A46j55Q5j44j78L9K85l1k05J69p4KK42j97N7j06K65j38q7L17k23J4J57m14
4289a74J81J02jp6k78K61n3j00N0K6M0J56j70M5J18L6J00Mk99K01l99J60o3m2
$$ plain form
4313 -175 -73 115 20 104 -68 29 -458 -58 -128 22 335 28 -176 -167 -30 115 120 28 -370 207 201 134 -24 -113
4337 -113 -49 69 -65 15 -11 -339 177 11 -256 231 106 15 -204 44 105 -109 -154 219 -169 -123 -35 92 -346
4360 -346 192 87 159 108 -253 -94 -7 219 153 1 -34 161 164 172 250 -85 145 110 -187 -107 -60 -98 88 -90 105
4385 105 237 97 76 60 320 200 192 -63 -5 71 185 92 174 -197 50 105 -113 -311 -64 163 25 348 140
4408 140 537 193 48 45 -196 -166 -51 -9 -99 -80 263 -182 34 149 103 190 101 -329 36 173 110 -54 -14 96
4432 96 -125 -16 51 -25 -90 1 -162 -210 5 -266 -60 272 -149 141 -94 -40 -160 -76 11 -27 -155 -114 -172 -48
4456 -48 -64 -57 131 68 35 116 -33 14 -32 -56 2 -64 76 -228 128 174 -164 -74 282 3 -106 -104 47 38 -204 -60
4482 -60 -3 -8 66 -83 -242 48 154 103 34 -88 79 -67 129 -66 -13 -183 -155 -9 -64 -36 159 -218 -101 -79
$$ packed form
4313a75J02J88r5Q4j72R7m87M00p0J50L13l07k04RJ37J45Nr2l98N77oo7j58q9
4337a13O4J18j34Q0k6l28N16j66k67M87j25r1k19K48O1k14m5L73l88M6Q8J27m38
4360c46N38j05P2n1l61J59Q7K26o6j52l5J95LQP8l35K30l5k97Q0M7l8J86j78J95
4385A05J32j40k1j6K60j20qk55N8P6J14r3Q2l71K47N5k18j98K47K27j38L23k08
4408A40L97l44j45lk41L0J15M2r0J9L43m45K16J15m6Q7q9m30L65J37o3j64M0J10
4432I6k21J09O7p6o5R1j63m8K15k71K06L32m21K90k35N4j20Q4Q7l8j28M1n8J24
4456d8j6PJ88o3l3Q1j49M7m6k4N8o6J40l04L56M6l38R0L56k79j09KJ51rk42J44
4482f0N7nP4j49j59K90J06n1o9j22J67j46J96j95N3j70K8J46n5K8J95l77J17K2
$$ plain form
4506 -79 -84 -140 -280 103 7 155 1 187 -138 87 -37 29 -69 -28 171 142 -113 -117 -136 156 23 -116 -289 -26
4530 -26 -243 -70 83 52 44 -47 76 85 -267 176 -41 151 -290 -154 -55 -41 -44 -142 207 -38 -274 38 -94 67
4554 67 -78 85 -102 7 -183 2 150 125 -34 -241 49 108 93 89 174 248 -101 -59 -97 58 -104 -97 43 76
4578 76 157 -80 -115 223 -77 100 -44 -55 -88 186 -72 -123 188 -283 27 120 135 -12 -133 -71 106 -167 -308
4601 -308 -261 -80 5 -55 46 184 76 -191 91 54 -44 56 -188 125 -145 117 54 -138 148 -57 372 -119
4623 -119 -207 -106 -45 -23 -198 12 -9 -36 113 -148 -289 -26 110 -93 -131 -45 -188 207 -30 18 -16 -33 -20 10
4647 10 -109 -8 177 82 -71 136 -133 -59 -85 122 405 -303 81 53 133 -14 104 -52 1 -129 115 -17
4669 -17 134 -39 -128 -78 132 259 153 -65 89 -4 -68 -276 -87 -133 289 -72 310 232 -4 -1 -127 144 174
$$ packed form
4506g9nn6j40L83r6J48j54J86l25K25j24O6r8M1J99k9k55mj9K92j33j39j73K63
4530b6k17J73J53l1qr1J23Rl52M43k17J92m41J36R9J4lr8L49k45k36L12j32J61
4554F7j45J63j87J09j90J85J48k5j59k07K90N9j5mQ5P4l49M2l8J55j62PJ40L3
4578G6Q1k37l5L38l00J77j44j1l3K74k58n1L11m71L10R3J5j47j21O2J77k73j41
4601c08M7J81Q5o0J01J38j08k67K82l7r8J00k44L13k70K62o3j92K86k05M29m91
4623a19q8J01O1K2j75K10k1k7J49k61j41K63J36k03l8Q6j43L95k37M8l4j7J3L0
4647A0j19J01J85r5j53K07k69P4k6K07K83p08L84k8Q0j47J18j56N3j30K44j32
4669a7J51j73q9N0K10J27j06k18J54r3o4k08J89m6M22l61L82p8k36Lj26K71L0
$$ plain form
4692 174 -95 -107 46 365 72 71 52 22 110 -112 -135 108 -28 50 195 298 -216 84 -215 -103 -240 39 315
4715 315 104 192 -51 -73 -210 239 13 253 -63 47 -156 -227 5 64 -190 402 -148 -1 103 65 87 -28
4737 -28 -55 58 239 -241 61 72 176 48 48 -185 -40 77 123 -255 -45 -41 -75 104 43 -12 -144 -75 -59 -70 100
4762 100 130 187 49 21 41 -32 -149 -134 -208 52 82 -74 -156 -106 64 11 -137 -317 182 223 -54 -227 205 -28
4786 -28 -75 34 -30 117 151 52 -106 73 140 124 -129 -189 -160 150 15 309 172 -27 134 -187 175 -228 163
4809 163 -90 -92 -7 -86 23 53 -295 93 142 264 79 -112 188 -89 -248 -102 21 73 -226 200 -115 -136 241
4832 241 -166 -184 164 -40 -177 -125 -170 129 60 -77 193 -71 -1 -91 94 -61 -83 81 66 239 -61 66 180
4855 180 21 27 96 -117 -19 -62 159 98 -16 -128 -28 -20 22 235 68 278 54 143 64 119 73 -180 59 192
$$ packed form
4692A74k69j2J53L19k93jj9l0Q8k22k3K43j36P8J45J03n14L00k99J12j37K79K76
4715C15k11Q8k43k2j37M49k26K40l16J10k03p1K32N9k54N92n50J47J04l8K2j15
4737b8k7J13J81m80L02J1J04j28%k33J45J17M6l78K10Ml4J79o1n5j32O9J6j1J70
4762A00L0N7j38k8K0p3j17J5p4K60L0j56q2N0J70n3j48j80M99M1k77j73M32k33
4786b8m7J09o4J47L4r9j58J79O7j6k53o0K9L10j35K94j37j99J61l21L62m03L91
4809A63k53kQ5p9J09L0l48L88M9J22j85j91L00k77j59J46J23N2k99M26l15k1L77
4832B41m07j8L48k04j37N2m5K99o9j37K70k64P0r0J85j55k2J64j5J73l00J27J14
4855A80j59OO9k13R8m3K21o1j14j12J00QM2K13j67K10k24Q9p9N5m6k53K39J33
$$ plain form
4879 192 13 -191 86 87 -88 -209 122 75 4 -48 -30 165 46 -242 119 315 118 217 -242 166 -306 -138
4901 -138 207 115 76 -31 -179 32 -198 171 -200 36 154 79 -105 145 222 82 75 271 54 -7 34 228 -9
4924 -9 -117 -180 -171 94 -227 229 141 91 -39 -109 -249 226 -36 -177 17 64 -9 41 -42 -23 210 6 -306 202
4948 202 6 2 52 -42 -40 -195 -254 110 17 -170 50 -10 -63 -246 -335 -143 -46 -281 -215 207 -230 209 -44 5 19
4973 19 -52 -120 44 57 140 9 -188 -30 133 203 53 141 216 50 49 -77 -25 -179 302 27 -57 -18 144 110 6
4998 6 98 -26 179 -103 104 8 -61 12 72 -3 -29 -301 192 -202 38 102 -38 -105 67 10 143 10 -244 -28
5022 -28 -75 -39 -164 97 -55 122 9 10 -145 29 -7 84 -25 15 258 270 53 14 176 123 -12 -27 230 98
5046 98 -44 -218 -247 -116 -66 160 143 73 4 71 -147 112 82 68 -124 154 -304 47 122 -308 19 142 -69
$$ packed form
4879A92j79k04K77Jj75j21L31m7p1n2J8J95j19k88L61J96j97R9m59M08m72J68
4901a38L45r2l9j07j48K11k30L69l71K36J18p5j84K50P7j40pJ96k17o1M1J94k37
4924ij08o3RK65l21M56q8n0j30p0j40M75k62j41J94M7p3N0q3J9K33k04l12N08
4948B02j96mN0r4Kj55n9L64r3j87K20o0n3j83q9J92R7k35O6M22m37M39k53M9J4
4973A9p1o8J64J3Q3j31j97J58J63P0j50Q8P5j66jj26N2j54M81k75q4L9J62l4j04
4998FR2j24K05k82K07r6o9P3O0p5k6k72M93l94K40O4j40o7J72n7J33j33k54K16
5022b8m7L6j25K61j52J77j13Jj55J74l6R1j09M0K43J2k17l9J62n3j35j5K57j32
5046I8j42j74k9J31N0K26j7p0o9O7k18K59l0j4j92K78m58L51P5m30L27J23k11
$$ plain form
5069 -69 88 -11 -139 -271 15 174 -30 -4 -169 5 -240 145 333 -77 -151 -136 70 87 -164 -57 -192 -174
5091 -174 175 -88 -48 295 -198 107 -44 -69 104 1 -95 118 -38 -244 -25 50 -20 -38 -58 -36 144 -164 -93
5114 -93 -6 -27 94 57 35 106 -111 -24 139 -105 179 182 161 -68 -24 -115 10 -78 -32 223 -61 124 211 474 177
5139 177 119 119 -26 184 14 -63 183 22 -38 -134 -50 -31 134 224 -79 -28 -74 67 49 -81 -4 152 141 -72 -110
5164 -110 62 78 -98 -322 -27 -45 27 -106 270 89 215 365 148 -11 -138 -203 -127 -80 -15 24 -175 80 24
5187 24 162 219 351 -114 -372 105 71 -336 174 70 166 -57 -109 94 89 -121 -142 -212 -58 114 -15 44 164
5210 164 -169 -231 -142 -13 68 -32 44 -40 -38 329 -142 49 271 157 -124 271 -59 -42 49 -67 -104 -181 367 -77
5234 -77 -117 -81 0 51 83 65 19 168 -52 -124 -88 -7 -123 51 158 213 -2 -19 -116 19 16 -225 -174 -2 131 29
$$ packed form
5069f9J57r9j28j32K86J59k04K6j65J74k45L85J88m10p4J5K06J7k51J07j35J8
5091a74L49k63M0L43m93L05j51k5J73j03r6K13j56k06K19P5p0j8k0K2J80l08P1
5114i3Q7k1J21l7k2P1k17Q7J63k44K84Lk1k29M4r1J25q8M6K55k84J85Q7K63k97
5139A77n8%j45K10j70p7K46j61o0r6Q4J9J65R0l03N1m6J41j8j30P7J56j1k13l8
5164a10J72J6j76k24K95j8P2j33L76j81J26J50k17j59j27o5P6M7O5L9j99K55n6
5187B4J38N7J32m65k58M77l4m07N10j04R6k23n2K03nk10k1p0J54J72j29N9J20
5210A64l33o2Q9J29Q1j00P6q4KL67m71J91K22j14k81L95l30J7R1j16l7p7N48m44
5234g7m0L6Q1N1L2j8m6J49k20p2L6Q1j16J74J07N5k15j7r7J35lk41N1J72J33j02
$$ plain form
5260 29 73 50 -110 -183 -50 132 141 -104 196 -47 177 -70 47 -61 -90 277 -163 -156 -105 21 -154 -526 -104
5283 -104 127 334 -23 -188 72 -168 -47 -270 52 -5 -72 7 84 -169 -81 215 24 -75 -23 176 -9 304
5305 304 -53 157 3 280 16 -101 43 51 207 5 -97 6 78 -312 -237 -7 -236 170 -134 -28 -1 -89
5327 -89 -216 60 -190 -115 -120 56 140 -12 -78 -42 254 -68 93 -50 -68 -31 -302 -99 -46 175 -59 -15 -237 -170
5351 -170 38 -69 111 88 114 -121 -264 -162 36 -152 120 51 24 186 -87 -39 -126 -487 111 -235 91 17
5373 17 -69 38 100 244 -140 38 231 249 -18 -14 -132 175 -54 -135 -5 47 -19 133 83 225 76 12 13 2 -138
5398 -138 51 53 -84 -33 52 66 -138 -201 -2 -210 -249 235 -239 -116 -74 -134 105 35 -51 -82 -322 -51 144 88
5422 88 100 -298 85 152 -329 154 125 -290 80 160 -67 -27 127 -281 16 7 231 92 -17 -28 195 36 91
$$ packed form
5260B9M4k3j60p3J33J82Rk45L00k43K24k47J17j08k9L67m40PN1J26j75l72M22
5283a04K31K07l57j65K60k40J21k23L22n7o7P9P7k53Q8K96j91r9N2J99j85L13
5305C04l57K10j54K77k64j17J44QJ56k02j02J03P2l90P5K30k29M06l04J06K7q8
5327h9j27K76k50P5nJ76Q4j52o6L6K96l22J61j43j8L7k71K03N3K21k34M4k22O7
5351a70K08j07J80k3K6k35j43J02J98j88K72o9k7J62k73M8q7l61N98l46L26p4
5373A7q6J07O2J44l84J78J93J8k67Mj18L07k29q1J30N2o6J52n0J42j49o4Jj1j40
5398a38J89Kj37N1Q5J4k04o3J99k08l9M84m74J23M2o0K39p0q6l1k40K71J95n6
5422H8J2l98L83O7m81M83k9m15L70Q0k27M0J54m08K97rK24j39j09j1K23j59N5
$$ plain form
5445 91 18 54 86 129 -5 95 38 20 -32 101 78 -126 -157 -230 250 -253 71 -68 240 25 119 70 -3 -204 -309
5470 -309 19 109 64 -64 24 290 -147 488 133 266 169 -94 -34 -10 4 0 -121 -2 39 353 111 -2 -100 10
5494 10 -9 -11 187 228 201 71 -142 177 115 -66 21 6 -253 281 -4 182 213 -190 -3 -33 181 97 -7 92
5518 92 162 242 139 42 120 141 -205 -22 -187 -10 -174 -113 30 -22 -172 -263 -69 61 15 187 -64 -94 -196 -160
5542 -160 301 -337 69 127 150 57 4 -195 80 -58 187 168 -82 48 115 34 148 -98 164 -139 -43 -381 116
5565 116 171 -66 -37 -148 86 -539 -90 396 -41 -86 -224 -291 -96 14 12 -241 -169 -267 -135 143 17 -73 201
5588 201 -74 48 101 129 25 -26 187 193 52 10 136 146 -13 92 6 110 -175 400 1 -189 -33 109 16
5611 16 208 209 45 21 209 186 53 -145 21 140 -180 -108 20 -106 -94 5 -306 42 24 -125 -178 338 216
$$ packed form
5445I1p3L6L2M3j34J00n7j8n2J33k3k04l1p3M80n03L24j39L08k15R4m9p3k01j05
5470c09L28R0m5j28Q8K66m37O35l55J33r7k63O0K4J4mj21J19M1L14k42j13r8J10
5494A0j9kJ98M1k7j30k13L19o2j81Q7j5k59N34k85J86L1m03J87l0K14q4j04R9
5518I2P0Q0j03r7P8K1l46J83j65J77j64O1J43n2j50r1J94J30m6J72k51l0j02L6
5542a60M61o38M06N8K3r3n3j99K75j38K45j9k50J30O7q1J14k46K62l03R6l38M97
5565A16N5k37K9j11K34o25M49M86m37m5j38o7J95J10kk53P2r8J32K78j26r0K74
5588B01k75J22N3K8j04n1K13Oj41m2J26J0j59J05q6J04k85N75l99j90J56J42r3
5611A6J92Jj64k4J88k3j33j98J66J19l20P2J28j26J2R9l11L48j8j49n3N16j22
$$ plain form
5634 216 161 11 62 96 6 -103 79 -93 -72 -232 -203 -48 -124 113 126 -181 -257 -196 -63 179 147 75 -199 158
5658 158 -50 183 97 232 -60 -20 3 -61 -192 110 -36 -72 96 -74 15 -64 169 -226 -71 185 0 -73 51
5681 51 -106 78 175 -132 3 45 -82 374 31 -23 -95 261 94 -7 33 76 -37 -111 175 -36 3 -33 -43 14
5705 14 -11 78 -78 -11 82 -99 372 -114 -259 11 204 86 -271 58 -42 -173 -54 -60 18 142 157 197 86
5728 86 -222 38 -92 -193 233 62 -205 25 -62 -75 -17 -101 79 113 -212 -235 -154 25 14 -91 -123 193 -322
5751 -322 122 -102 16 -49 -57 416 -118 -68 80 -138 -141 68 139 144 122 109 26 63 148 161 257 141 93 -38 36 -137
5777 -137 149 147 -51 213 160 -199 47 5 -218 -16 115 -162 -67 57 54 -64 -7 -41 -131 59 190 -273 189
5800 189 178 63 -40 83 3 260 -29 134 -268 -50 -74 -230 31 106 -32 198 -94 -9 80 231 146 149 115
$$ packed form
5634B16n5j50N1L4r0j09J82j72K1j60K9J55p6K37J3l07p6O1J33K42l2p2k74L57
5658A58k08K33q6J35k92M0K3o4j31L02j46l6J68j70Q9p9K33l95J55K56j85p3J24
5681E1j57J84R7l07J35M2j27M56l43n4p2L56j67j01M0M3j13p4K86k11L9l6j0N7
5705A4k5Q9j56O7R3j81M71m86j45K70J93j18l57L29j00j31J19oP8J24J5M0j11
5728H6l08K60j30j01M26j71k67K30q7j3N8q4J80L4l25k3Q1J79j1j05l2L16n15
5751c22M44k24J18o5qM73n34N0J48k18lK09P1Nk2j3q3L7Q5J3R6j16m8j31P4j73
5777a37K86kj98K64n3l59K46m2k23K02J31k77R5J24lj18N7l4r0J90J31m63M62
5800A89j1j15j03J23q0K57k89J63m02K18k4j56K61P5j38K30k92Q5Q9J51q5Ll4
$$ plain form
5823 115 -110 251 -39 -102 111 24 247 -150 -146 147 210 -141 -268 185 -120 0 -48 83 60 -139 -344 -39
5845 -39 -149 -255 -10 -94 -197 81 54 85 -129 108 -38 -287 165 -37 216 -112 46 -52 -132 -62 201 158 193
5868 193 -186 -136 -163 -22 -99 -35 226 -172 183 5 30 -101 236 -163 59 199 199 46 -337 -207 70 134 -119
5891 -119 179 109 39 -9 99 -128 -124 183 -155 72 -13 117 -270 -7 75 -285 -63 -66 80 -10 259 -261 125
5914 125 -75 126 -200 175 -94 128 -14 111 104 9 -177 -10 76 28 -17 -196 55 -158 4 -49 -101 -180 -19
5937 -19 107 -161 9 58 -205 -56 88 -372 3 132 -48 -427 -202 -77 -90 38 -301 120 -42 -96 -2 145
5959 145 -117 251 -70 -259 268 -266 -22 144 -64 200 -66 -215 -67 6 -25 -35 -172 33 140 -162 236
5980 236 111 51 219 -167 45 -102 29 -407 183 -186 5 -95 -40 -106 104 217 -306 -277 54 94 -29 22
$$ packed form
5823A15k25L61k90o3K13q7K23l97MK93O3l51j27M53l05J20m8J31k3j99k05L05
5845c9j10j06K45q4j03K78k7L1k14K37j46k49M52k02K53l28J58r8q0P0K63m3L5
5868A93l79N0k7J41p7O4K61l98L55j78K5j31L37l99K22J40%j53l83J30K77O4k53
5891a19K98p0p0m8J08k27ML07l38K27q5J30l87K63Q2l60K22lJ46r0K69n20L86
5914A25k00K01l26L75k69K22j42J25pr5j86J67Q6m8m5j79K51k13J62n3n2p9J61
5937a9J26k68J70M9k63J49J44m60L75J29j80l79K25J25j3J28l39M21j62n4R4J47
5959A45k62L68l21j89N27n34K44J66k08K64k66j49J48P3l1j0j37K05J07l02L98
5980B36j25o0J68l86K12j47J31m36N90l69J91j00N5o6K10J13n23K9L31M0j23N1
$$ plain form
6002 22 -219 177 114 -82 -188 -58 -138 69 83 16 150 47 76 146 -163 77 -115 24 16 -83 101 22 19 304
6026 304 221 -20 -35 -296 -35 225 68 68 -126 -66 -176 61 -96 176 -52 12 -42 -22 -38 24 274 -84 -91 19
6050 19 30 174 -45 202 109 44 190 -18 -134 -160 49 -57 58 -97 84 -116 -18 175 74 -2 -261 10
6072 10 -239 -6 -73 105 241 142 143 43 -82 81 -6 -255 88 -2 89 -52 -308 69 152 117 243 -208 -293 -187
6096 -187 207 32 -24 199 -118 -184 8 -131 -72 218 -85 -99 83 -104 94 -59 -251 280 -43 68 48 275
6118 275 46 -90 -123 110 -66 141 55 154 -110 202 -113 -219 -94 40 -313 -134 -161 129 -105 -224 -126 83
6140 83 -155 -35 -15 -48 107 -219 -7 70 245 -175 245 208 85 53 389 -159 -19 174 -105 -313 -200 -9
6162 -9 231 195 -141 156 -67 -8 37 265 -193 -270 162 26 -2 301 134 -293 -10 -166 183 -143 162 229 -67
$$ packed form
6002B2k41L96o3j96j06J30q0K07J4o7J34j03K9P0l09K40j92J39qr9J84p9lK85
6026C04q3k41j5k61K61K60j57%j94O0j10K37j57K72k28O4n4K0j6O2K50l58pJ10
6050A9J1J44k19K47r3o5J46k08j16k6K09j06J15j55J81k00R8J93j01p6k59K71
6072A0k49K33o7J78J36r9Jj00j25J63q7k49L43r0R1j41k56L77Q3l5J26m51q5J06
6096a87L94j75n6K23l17o6J92j39N9K90l03j4J82j87J98j53j92N31l23J11k0K27
6118B75k29j36l3K33j76K07q6R9k64L12l15j06J25J34l53J79k7K90k34j19R8K09
6140H3k38J20K0l3J55l26K12P7J75m20M20l7j23l2L36n48J40J93k79k08J13J91
6162iK40l6l36K97k23N9M5K28m58p7M32j36k8L03j67m27K83j56L49l26L05O7k96
$$ plain form
6185 -67 151 -15 -71 159 205 -306 102 47 217 -121 37 -126 47 88 96 -132 -187 228 298 -235 0 170 -237
6208 -237 92 -341 36 135 45 -175 21 389 -53 66 176 35 -112 46 -238 -23 78 -221 12 26 43
6229 43 16 -154 156 -185 31 -222 97 -44 -105 101 41 -39 -165 -138 -201 76 -230 121 14 -272 -21 176
6251 176 -144 193 23 -195 15 -15 74 221 14 -74 -52 -257 -22 -217 103 175 -78 -18 40 20 -63 57 -152
6274 -152 -30 -206 -6 12 187 -6 -271 132 -79 221 64 309 234 112 40 -166 135 -22 275 94 -72
6295 -72 101 -77 -202 -107 -34 236 57 -361 57 207 -9 -219 191 404 -310 45 214 126 25 -10 28 130
6317 130 72 -166 130 -141 -103 -49 36 36 -29 105 27 -97 61 -55 220 -158 -19 -20 -95 -87 -159 -104 53 -1 6 147
6343 147 34 104 -45 -94 -1 159 33 -110 -209 -176 -139 78 -108 79 202 -68 330 179 -73 83 -9 104
$$ packed form
6185f7K18j66n6K30M6n11M08n5J70l38J58j63J73M1Qk28n5M15P0n33K35J70m07
6208b37L29m33L77R9r0k20J96L68m42J19J10j41j47J58k84K15J01k99K33J4J7
6229D3k7j70L10l41K16k53L19j41o1K06o0q0j26K7o3K77l06L51j07k86K51J97
6251A76l20L37j70k18K10l0Q9J47k07q8K2k05K35j95L20P2k53O0N8k0q3J20k09
6274a52J22j76K00J8J75j93k65M03k11L00j57K45p5j22p2k06L01j57K97j81j66
6295g2J73j78j25R5P3K70j79m18M18J50k16k10M10K13p14L55J69q8j01l5L8J02
6317A30n8k38K96k71L8N4Q5%o5J34p8j24J58j16K75l78J39jp5Qp2N5J57n4PJ41
6343A47j13P0j49m9R3J60j26j43r9L3L7K17j86J87J23k70L98j51k52J56r2J13
$$ plain form
6365 104 -60 219 245 92 32 -341 -106 78 -195 -8 13 157 -25 177 109 11 -218 63 104 41 -132 -287
6387 -287 120 20 125 193 21 -53 277 109 120 41 208 45 289 19 -29 152 209 -113 -296 51 -67 62
6409 62 79 -110 72 105 -162 -47 149 30 -95 -64 20 113 267 226 -197 -74 -60 -75 -23 60 -60 25 364 54
6433 54 57 19 -114 -1 227 141 231 -3 78 -162 41 198 -221 -213 248 -156 -164 -10 -45 -242 140 145 53 116 146 53
6459 53 93 137 -130 44 314 85 -99 -258 -146 134 -181 -183 97 -86 -95 -19 216 109 120 312 147 296 -147
6482 -147 179 -62 216 190 22 177 210 201 -50 108 -63 101 157 211 -141 8 26 72 218 -29 -115 -66 -159 156
$$ packed form
6365A04j64K79K6j53o0l73K35J84k73J87K1J44j82K02o8r8k29K81M1o3j73j55
6387b87M07j00J05O8j72p4L30j68J1p9J67j63K44k70m8J81N7l22j83L47j18J29
6409F2J7j89J82L3k67J15J96j19j25L1Q4R3J54m1m23J23J4j5N2Q3j20Q5L39l10
6433E4Ll8j33J13K28q6R0k34Q1k40K03J57m19QM61m04qJ54l5j97L82Nr2O3L0r3
6459E3M0M4k67J74K70k29j84j59J12K80l15kK80j83rP6K35j07J1J92j65J49m43
6482a47L26k41K78k6j68J55L3rk51J58j71J64N6N4l52J49J8M6J46k47q6M9r3L15
$$ [...]
8191B02
##END NTUPLES=NMR FID
##END=
