##TITLE=1H_DE-93m_d6
 200.13MHz, DMSO-d6,
 8 sc
 
 6.5.2025
##JCAMPDX= 6.0         $$ Bruker NMR JCAMP-DX V2.0
##DATA TYPE= NMR FID
##DATA CLASS= NTUPLES
##ORIGIN= UXNMR, Bruker Analytische Messtechnik GmbH
##OWNER= pz
$$ XWIN-NMR		Version 3.5
$$ Tue May  6 14:07:08 2025 Russian Standard Time (UT+4h)  she@DPX200
##.OBSERVE FREQUENCY= 200.1313
##.OBSERVE NUCLEUS= ^1H
##.DELAY= (6, 6)
##.ACQUISITION MODE= SIMULTANEOUS
##.ACQUISITION SCHEME= undefined
##.AVERAGES= 8
##.DIGITISER RES= 18
##SPECTROMETER/DATA SYSTEM= spect
##.PULSE SEQUENCE= zg30
##.SOLVENT NAME= DMSO
##.SHIFT REFERENCE= (INTERNAL, DMSO, 0, 14.3821)
##AUDIT TRAIL= $$ (NUMBER, WHEN, WHO, WHERE, WHAT)
$$ ##TITLE= Audit trail, XWIN-NMR		Version 3.5
$$ ##JCAMPDX= 5.01
$$ ##ORIGIN= Bruker BioSpin GmbH
$$ ##OWNER= she
$$ F:/spectra/data/she/nmr/H-C/1/audita.txt
$$ ##AUDIT TRAIL=  $$ (NUMBER, WHEN, WHO, WHERE, WHAT)
(   1,<2025-05-06 14:06:05.32 +0400>,<she>,<DPX200>,
      <created by zg, POWCHK disabled, PULCHK disabled
       configuration hash MD5:
       00 E9 B6 7A A2 85 ED C7 34 08 36 98 17 FE 4E 26
       data hash MD5: 16K
       A6 90 E0 31 D7 3A 0A 9F 39 6B EF A1 0C F0 8A 1F>)
$$ ##END=
$$ 
$$ hash MD5
$$ B1 4F 62 C6 0C C7 83 A9 6D 79 31 57 4F 92 AF 7E
##$RELAX= 
##$RELAX= 
##$RELAX= 
##$RELAX= 
##$RELAX= 
##$RELAX= 
$$ Bruker specific parameters
$$ --------------------------
##$DU= <F:/spectra>
##$EXPNO= 1
##$NAME= <H-C>
##$PROCNO= 1
##$TYPE= <nmr>
##$USER= <she>
##$AMP= (0..31)
100 100 100 100 100 100 100 100 100 100 100 100 100 100 100 100 100 100 
100 100 100 100 100 100 100 100 100 100 100 100 100 100 
##$AQSEQ= 0
##$AQ_mod= 1
##$AUNM= <au_zg>
##$AUTOPOS= <>
##$BF1= 200.13
##$BF2= 200.13
##$BF3= 200.13
##$BF4= 200.13
##$BF5= 200.13
##$BF6= 200.13
##$BF7= 200.13
##$BF8= 200.13
##$BYTORDA= 1
##$CFDGTYP= 0
##$CFRGTYP= 5
##$CHEMSTR= <none>
##$CNST= (0..31)
1 1 145 1 1 1 1 1 1 1 1 1 1 1 1 1 1 1 1 1 1 1 1 1 1 1 1 1 1 1 1 1 
##$CPDPRG= <>
##$CPDPRG1= <>
##$CPDPRG2= <>
##$CPDPRG3= <>
##$CPDPRG4= <mlev>
##$CPDPRG5= <mlev>
##$CPDPRG6= <mlev>
##$CPDPRG7= <mlev>
##$CPDPRG8= <mlev>
##$CPDPRGB= <>
##$CPDPRGT= <>
##$D= (0..31)
0 0.7 0 0 0 0 0 0 0 0 0 0.03 0 0 0 0 0 0 0 0 0 0 0 0 0 0 0 0 0 0 0 0 
##$DATE= 1746525964
##$DBL= (0..7)
120 120 120 120 120 120 120 120 
##$DBP= (0..7)
150 150 150 150 150 150 150 150 
##$DBP07= 0
##$DBPNAM0= <>
##$DBPNAM1= <>
##$DBPNAM2= <>
##$DBPNAM3= <>
##$DBPNAM4= <>
##$DBPNAM5= <>
##$DBPNAM6= <>
##$DBPNAM7= <>
##$DBPOAL= (0..7)
0.5 0.5 0.5 0.5 0.5 0.5 0.5 0.5 
##$DBPOFFS= (0..7)
0 0 0 0 0 0 0 0 
##$DE= 6
##$DECBNUC= <off>
##$DECIM= 32
##$DECNUC= <off>
##$DECSTAT= 4
##$DIGMOD= 1
##$DIGTYP= 9
##$DL= (0..7)
0 120 120 120 120 120 120 120 
##$DP= (0..7)
150 150 150 150 150 150 150 150 
##$DP07= 0
##$DPNAME0= <>
##$DPNAME1= <>
##$DPNAME2= <>
##$DPNAME3= <>
##$DPNAME4= <>
##$DPNAME5= <>
##$DPNAME6= <>
##$DPNAME7= <>
##$DPOAL= (0..7)
0.5 0.5 0.5 0.5 0.5 0.5 0.5 0.5 
##$DPOFFS= (0..7)
0 0 0 0 0 0 0 0 
##$DQDMODE= 0
##$DR= 18
##$DS= 0
##$DSLIST= <SSSSSSSSSSSSSSS>
$$ [...]
##$SUBNAM0= <"">
##$SUBNAM1= <"">
##$SUBNAM2= <"">
##$SUBNAM3= <"">
##$SUBNAM4= <"">
##$SUBNAM5= <"">
##$SUBNAM6= <"">
##$SUBNAM7= <"">
##$SUBNAM8= <"">
##$SUBNAM9= <"">
##$SW= 18.0517328524113
##$SWIBOX= (0..15)
0 0 2 0 0 0 0 0 0 0 0 0 0 0 0 0 
##$SW_h= 3612.71676300578
##$TD= 16384
##$TD0= 1
##$TE= 0
##$TE2= 300
##$TE3= 300
##$TEG= 300
##$TL= (0..7)
0 120 120 120 120 120 120 120 
##$TP= (0..7)
150 150 150 150 150 150 150 150 
##$TP07= 0
##$TPNAME0= <>
##$TPNAME1= <>
##$TPNAME2= <>
##$TPNAME3= <>
##$TPNAME4= <>
##$TPNAME5= <>
##$TPNAME6= <>
##$TPNAME7= <>
##$TPOAL= (0..7)
0.5 0.5 0.5 0.5 0.5 0.5 0.5 0.5 
##$TPOFFS= (0..7)
0 0 0 0 0 0 0 0 
##$TUNHIN= 0
##$TUNHOUT= 0
##$TUNXOUT= 0
##$USERA1= <user>
##$USERA2= <user>
##$USERA3= <user>
##$USERA4= <user>
##$USERA5= <user>
##$V9= 5
##$VALIST= <valist>
##$VCLIST= <CCCCCCCCCCCCCCC>
##$VD= 0
##$VDLIST= <DDDDDDDDDDDDDDD>
##$VPLIST= <PPPPPPPPPPPPPPP>
##$VTLIST= <TTTTTTTTTTTTTTT>
##$WBST= 1024
##$WBSW= 4
##$XGAIN= (0..3)
0 0 0 0 
##$XL= 0
##$YL= 0
##$YMAX_a= 12326
##$YMIN_a= -18067
##$ZGOPTNS= <>
##$ZL1= 120
##$ZL2= 120
##$ZL3= 120
##$ZL4= 120
##$ABSF1= 10
##$ABSF2= 0
##$ABSG= 5
##$ABSL= 3
##$ALPHA= 0
##$AQORDER= 0
##$ASSFAC= 0
##$ASSFACI= 0
##$ASSFACX= 0
##$ASSWID= 0
##$AUNMP= <proc_1d>
##$AZFE= 0.1
##$AZFW= 0.1
##$BCFW= 1
##$BC_mod= 2
##$BYTORDP= 1
##$COROFFS= 0
##$CY= -3
##$DATMOD= 1
##$DC= 2
##$DFILT= <>
##$DTYPP= 0
##$F1P= 0
##$F2P= 0
##$FCOR= 0.5
##$FTSIZE= 0
##$FT_mod= 4
##$GAMMA= 1
##$GB= 0.15
##$INTBC= 1
##$INTSCL= 1
##$ISEN= 128
##$LB= 0.25
##$LEV0= 0
##$LPBIN= 0
##$MAXI= 10000
##$MC2= 0
##$MEAN= 0
##$ME_mod= 0
##$MI= 1.114404
##$NCOEF= 0
##$NC_proc= 0
##$NLEV= 6
##$NOISF1= 3.799351
##$NOISF2= 2.8
##$NSP= 1
##$NTH_PI= 0
##$NZP= 0
##$OFFSET= 14.38212
##$PC= 1
##$PHC0= -1470.555
##$PHC1= 18.39221
##$PH_mod= 1
##$PKNL= yes
##$PPARMOD= 0
##$PSCAL= 0
##$PSIGN= 0
##$REVERSE= no
##$SF= 200.129724274929
##$SI= 16384
##$SIGF1= 3
##$SIGF2= 2
##$SINO= 400
##$SIOLD= 16384
##$SREGLST= <1H.CDCl3>
##$SSB= 0
##$STSI= 0
##$STSR= 0
##$SW_p= 3205.1282051282
##$SYMM= 0
##$S_DEV= 0
##$TDeff= 0
##$TDoff= 0
##$TI= <>
##$TILT= no
##$TM1= 0
##$TM2= 0
##$TOPLEV= 0
##$USERP1= <user>
##$USERP2= <user>
##$USERP3= <user>
##$USERP4= <user>
##$USERP5= <user>
##$WDW= 1
##$XDIM= 8192
##$YMAX_p= 0
##$YMIN_p= 0
$$ End of Bruker specific parameters
$$ ---------------------------------
##NTUPLES= NMR FID
##VAR_NAME=  TIME,          FID/REAL,        FID/IMAG
##SYMBOL=    X,             R,               I
##VAR_TYPE=  INDEPENDENT,   DEPENDENT,       DEPENDENT
##VAR_FORM=  AFFN,          ASDF,            ASDF
##VAR_DIM=   8192,          8192,            8192
##UNITS=     SECONDS,       ARBITRARY UNITS, ARBITRARY UNITS
##FACTOR=    0.0002768,     1,               1
##FIRST=     0,             0,               0
##LAST=      2.2672688,     0,               0
##MIN=       0,             -18067,          0
##MAX=       2.2672688,     12326,           0
$$ Real data points
##PAGE= N=1
##DATA TABLE= (X++(R..R)), XYDATA
0@%%%%%%%%%%%%%%%%%%%%%%qJ6j6J6j6J6j6K2l0L2l2L9m7M8n6O4p0P8q8R7j05
43e6J20j33J45j60J77j95K15k37K61k87L15l48L85m25M73n29N93o70P62q76J024
64E54j221J499j924K654m273J5037o362j6187J7481l961q522M260K915o050M654
79E54K11n888K411O124m694j396L384p24o68L341k542j531M846N68n108O88K408
96A984j551j311J83r58Q95R84j831o17K535L93j019O73L11l44P83m90j373R09
114A56J194j334o21Q95q4l90J93o10k95J013Kj001M18R35k63l38L49P8%J62k87
135A72l05L78L6m16j35J46O9j6j23j11J56K24q7j33R8K02K7j84l1J29J37j27j26
158b0J4K6pj06o5N5J27n0r1M4R6L9o5j1N5Q6mj06KM7nq8j4J0N3l4o1L8L9Nk7l7
$$ plain form
0 0 0 0 0 0 0 0 0 0 0 0 0 0 0 0 0 0 0 0 0 0 0 0 -8 8 -8 8 -8 8 -8 14 -16 16 -16 23 -24 24 -32 32 -38 40 -48 49 -56
43 -56 64 -69 76 -84 93 -102 113 -124 137 -150 165 -183 202 -223 250 -279 314 -356 406 -470 554
64 554 -667 832 -1092 1562 -2711 12326 5964 -10223 7258 3297 -5225 -965 1950 -4100 554
79 554 765 -5123 -2712 3412 -1282 -2678 706 -18 -686 2655 113 -1418 3428 3996 -1112 -424 1984
96 1984 433 -878 -695 -1653 -758 226 -1605 -2222 313 706 -313 360 671 327 1110 620 -753 156
114 156 1350 16 -605 290 206 -184 9 -601 -896 117 119 -882 -464 471 208 -130 219 297 297 459 172
135 172 -133 245 281 -135 -270 -124 -55 -71 -194 -305 -149 75 -12 -145 -47 155 182 -2 -33 96 233 106 -20
158 -20 -6 20 13 -93 -158 -103 24 -26 -117 -73 23 62 -3 -14 41 127 123 17 19 66 61 -27 -41 -31 22 -12 -73 -35 4 9 -18 -55
190e5N6K1j8pkK6L0k9l2JL2l4l0K2j9K8K3n3K4L3K1l4j0K7NnJ2mk4J8j3kj1K5
224B2k8rmJ6K0oqj0K5l7Nj7J8L8j1j4qj5J3rJ2Jj3L1j9J7j4J0l5M4j7K3J1j4J2
259C0j3J4qk4j3J5qLL3oj4j4kjQpj2J3mJ0krJj9M5n0J3L9j8KmOnK1rrMjl6L7j2
300f%k3N4k3%Mk5K9J4nrJ7j9Mm3M2Jk8L4l9L3k5jL2l0K5k3%J3j3K2llk1K7NpR
338A9k7Njl6L4J5KNK8k7j8J3j6QLKK9k1k5j5L2l6K9j3qOj3J7nQmK0j0QJ0j8pK3
376A6Oj4K2k9Mj1J9Jj3rnM2k8Lj0N0l6j0NKj0j4K9rjj1L1l8rJ4J7Oj2pK1j3j2
413a3J9j4pJ6Mk1MmL3l2K0J6j0J2m5N8oPj6jk7K2l0L0lL0n7K7j0pJ1k2J9j0Pm0
449d0M0qk5M7k8pJ5J1PJ1k0Rj3%J6kJ4j8K0nj2J3rj1J6k5K6j4nrRPm2M0j5PKj0
$$ plain form
190 -55 1 22 4 -3 -5 21 51 22 -10 -9 23 -11 -41 -19 -38 -10 13 -40 -16 17 38 4 -6 21 26 21 33 29 5 23 10 8 -3 22
224 22 -6 -15 -19 -3 17 11 3 -7 18 -19 -14 -31 -13 25 14 0 -8 -23 -10 -19 -7 -6 -19 12 -7 10 -4 6 -29 15 -2 21 32 18 30
259 30 17 31 23 -1 -14 1 -7 -4 29 23 9 -5 -7 -8 0 -7 -19 -6 -10 0 -2 -11 -10 -29 16 -34 -21 18 0 2 -2 4 -1 20 11 2 6 5 -31 6 -6
300 -6 -6 -29 25 2 2 6 -19 10 24 19 10 27 8 12 -31 11 12 -16 18 -21 12 -13 -14 18 -12 13 -10 -10 3 -10 12 9 6 -15 12 17 10 19
338 19 -8 -3 -4 -40 -6 9 11 16 44 17 -1 12 -4 4 7 9 38 17 -8 -23 9 -27 2 -11 -19 -13 -26 -9 -14 -6 -10 10 0 8 18 0 -7 16
376 16 22 8 30 1 5 -6 13 14 1 -8 -13 29 1 4 -6 44 8 -2 3 5 -5 -19 10 1 0 -11 20 -18 -27 -13 4 10 -2 -9 12 -1 -13
413 -13 6 -8 -15 1 5 -16 -12 -16 17 -15 5 21 11 23 -22 36 30 37 21 20 -7 15 -15 15 12 42 -15 12 2 -5 6 -16 3 -7 0 -40
449 -40 0 -8 -33 14 -14 -21 -6 5 12 23 3 12 -1 -1 15 13 27 9 29 24 12 25 16 5 21 -4 22 8 3 -6 3 10 -32 8 -7 0 2 -8
487hJ7rrQKj4k3J7L3Kl3J9KL2k6pJ5J5jj5j0J7k6K3lNkopmMK9ll4j3MPJ6J0k5
527aj7J4jl0K2Pkj2K9j7PNj1j2K4j4mK5k0L3pj2J7rqj9L7k6JJ4MK3n5J2J2j9j2
564b2M1l6L9k2J7k7J0k7K6j8J7J6l2RNK2j0Jj6n%j6J8J0J4J0qj1rK9j6JjOOJ5
600C6l5%%K0j7l4M8j1j6PJ0j4l3N7l6K4MNk8QMok4L2k7J9J5k3OJ8K4j9j1PJ5j2
636A3j4J8k0K6qJ1%knNmj4k9N5m0OQk3NmJ3m2P3j3j4k4OJ2J4J2j8RKj3K0k3j9
673b1N2j6pMPjj2kJ6KLRl8jK6l2qJM5l8Nk4L8k4J2LKj2rJ7nk2J0L6l2J1qJ7%k1
713a7K2K8k3Oj9mJ8Nj7M7m2J2Kj4j2LJ7Pj3j9L0k6J5l0lM0kl3L3kj7k9K6RNj3
749a0J4k5LL3j5MKK6pQOl9K1J6n5K7NJ2k2LJ7j7pL2j7l9L2K2l8jpK2l4OM2j8J0
$$ plain form
487 -8 9 0 -9 -1 1 -13 -36 -19 14 16 -17 2 4 36 10 3 18 33 32 17 7 24 -2 21 18 23 21 15 8 4 8 37 34 0 -13 -9 -2 14 24 -1
527 -1 -18 -4 -5 -35 -13 -6 -8 -20 9 -8 -1 4 -7 -19 5 -9 -13 12 -8 25 18 6 23 14 6 -13 24 -2 -1 13 17 40 -15 -3 9 -10 -22
564 -22 19 -17 22 0 17 -10 0 -27 -1 -19 -2 14 -18 -9 -4 18 8 9 -7 -12 -12 -28 -10 0 14 24 16 5 -4 25 9 10 9 15 21 36
600 36 1 1 1 21 4 -30 18 7 -9 -2 8 -6 -39 18 -18 6 10 15 -13 -5 -1 -7 -31 1 -26 -7 8 -15 -9 9 33 14 3 10 25 13
636 13 -1 17 -3 23 15 26 26 24 19 24 20 6 -23 32 -8 -2 6 -17 -12 -16 -3 -45 28 15 1 -23 -17 -5 9 21 3 12 14 1 21 -2 -21
673 -21 31 15 8 12 19 18 6 4 20 22 25 34 -4 -5 21 -11 -19 -18 27 -11 -6 -30 8 -16 -4 -1 1 -11 -20 -3 -8 -30 -20 16 -16 -5 -13 4 4 -17
713 -17 5 33 10 16 -3 -7 11 16 -1 46 4 16 18 4 -8 -5 12 19 6 -13 17 -9 6 -24 -27 13 11 -22 11 9 -8 -37 -11 -2 3 -10
749 -10 4 -21 -18 15 0 4 6 32 25 33 39 0 21 37 -18 9 14 26 4 7 24 7 0 32 15 -24 8 30 -8 -9 -16 6 -28 -22 20 2 12
786A2j2kJ4j7j2L4k4k4J1K6kOlk7QK5jqolML1j2%LK2l9J7j4L1l2j2Qk3J3k8QJ3
824a5oJ8oj2K5m1L8Mk0K7l4j0M5NMl4L5j4k2J4J8j2KK9ooj4mJ3j2NloK0k2j0M
861cM0m5j0K6l3M1k4j2Rj1lkN5m5K0l1J0QM6o2M0LpqK0m5L4kJ3k0K3j2j2J5J8
896C4l8%LkNJNj4K8j8pj6L6n0K2nL4j8l9M0J1j0j9j2N3l4K2j6%rJ2J4pMJ9j6k5
933a2L5k3J7nnnk5L9j2QM%On3J9J1k2K8Oj7l1K1J6j7J9r%rL0KJ6n1NKL9k0mOJ6
972B5k0k4L1j6KJ7k1M4l1j8J9j4K8l5L9%qk7oK6jl0K4j6LMJ1k5J2PJ4Qm3K3J7
1007A9l3J9j3K9j6J4J9j1j0j0K7k1j7K5Rk6K3j5jj3OJj1J4j2K0k2nJ2Rl0K3m0
1040c7J7J6j2PL2l1pK7k7J7J0k2MkL7jj1l5J5J2%L3l1oK4k4j9J9Lj4JoK0k1j6
$$ plain form
786 12 0 -2 12 -5 -17 17 -7 -31 -20 6 4 10 7 -20 -12 13 12 4 -2 -5 -1 30 18 18 21 43 4 21 7 38 6 -6 2 -21 -8 -36 -28 -15
824 -15 -21 -3 -9 -21 4 -37 1 5 -15 12 -22 -32 13 18 22 -12 23 9 -13 1 19 7 9 38 32 26 12 8 21 9 14 11 5 25 3 -7 -3
861 -3 37 -8 -18 8 -25 16 -8 -20 -11 -22 -25 -27 28 -17 3 -28 -18 -10 36 -26 14 17 10 2 22 -23 11 9 22 2 25 13 1 16 34
896 34 -4 -4 -1 -3 2 3 8 -6 22 4 -3 -19 17 -33 -11 -16 18 0 -39 1 12 2 -17 -29 24 -10 12 -4 -4 -13 -1 13 6 10 29 13 -12
933 -12 23 0 17 12 7 2 -23 16 4 12 16 16 22 -31 -12 -1 -23 5 11 -6 -37 -16 0 -17 2 -7 -7 -16 14 16 32 -19 -14 -12 27 7 3 9 25
972 25 5 -19 12 -4 -2 15 -6 38 7 -11 8 -6 22 -13 26 26 18 -9 -15 11 10 -20 4 -12 -9 -5 6 -19 -7 0 14 22 -21 2 19
1007 19 -14 5 -8 21 5 19 38 27 17 7 34 13 -4 21 30 4 27 12 11 -2 4 5 -6 8 -4 16 -6 -11 1 10 -20 3 -37
1040 -37 -20 -4 -16 -9 23 -8 -15 12 -15 2 12 -10 -6 -8 29 28 17 -18 -3 9 9 42 11 5 29 5 -14 5 8 -6 -5 -11 9 -12 -28
1075b8M6ok0j4L0n7M2oj3K5j6L4kk2qrK2J3Nk5J4M0k9j0J7Pl0J4J7k3k5KL8k9
1109fK6k9j1K3rKJ3k6J0pmK3kj3lJ3j7K1l9L6jrj0RJ7j3L0j3k3K3J1l8L1qK0n1
1145b4L4j2JM3m5J0j5J1K1k1rj0j7oN4m0K4K4n4J8j5K9Ok7OK7K2o3J8J4%k6K2
1178@K3Nm4K6j2rJ0L5l3J3j7J2j4RQj9J7J9m4J4lk4J5K5Lkk3k3M1nj6nJ6PJ6j8
1214CjJ0K9n6NoLL1j8OK8jj0l4kj7L1K0k3KnJ3J1J1j5nj9K0j4J1k4%Qm0N0k4m
1251b6K0J7n2N0j8mnK4J2lm8L9QJ7Mj7j6MRQK4m9j8J7K7k3J4l1K1nrpJ8k5J6O
1287aonMJ8J1l8LooJ0M7k3Ll6M3j6l4M1L6j4rj1J2l3J1JJ6lk1Jj2K6jqJ3Ml9L3
1325A1k6J8pk6J1mJ4Qok5K3j3K5KLk5pM5rj0Rk4J5J1j2L0k6j0J6lK7j6k5J0qL2
$$ plain form
1075 -28 18 12 -8 -22 8 -49 -7 -13 -26 -1 -17 17 15 -7 -15 -24 -2 11 16 -9 5 45 16 6 23 30 0 14 31 8 -17 -15 23 -6
1109 -6 20 -9 -20 3 -6 -4 9 -17 -7 -14 -18 5 3 -10 -13 0 -17 4 -35 1 0 -9 -19 -10 7 -6 24 11 -12 11 22 -16 15 7 27 -24
1145 -24 10 -2 -1 42 -3 7 -8 3 24 3 -6 -16 -33 -39 15 -25 -1 23 -31 -13 -28 1 7 -20 -14 13 35 -28 -10 4 4 -22 0
1178 0 23 28 -16 10 -2 -11 -1 34 1 14 -3 9 -5 4 12 -7 10 29 -15 -1 -4 -28 -13 12 15 13 -10 -33 8 3 -13 -18 -2 5 21 3
1214 3 2 12 41 -15 -10 -16 -13 18 0 6 34 33 23 -11 -13 -30 1 21 -2 0 -5 8 19 30 15 10 -9 11 -3 8 -16 -16 -8 -48 2 -22 -26
1251 -26 -6 11 -41 9 -9 -13 -18 6 18 15 -33 6 14 31 35 18 2 6 15 23 47 -2 -20 -3 24 1 15 -16 5 0 -9 -16 2 -23 -7 -1
1287 -1 -7 -12 -8 10 21 -17 -14 -20 -26 -16 31 8 11 -25 18 2 -32 9 45 31 22 11 23 -10 1 2 18 15 -6 -5 -17 9 8 0 13 17 -22 11
1325 11 -15 3 -4 -30 -19 -23 -9 -1 -7 -32 -9 -22 3 5 8 -17 -24 21 12 2 11 -13 2 13 1 31 5 -5 11 8 35 19 -6 4 -4 28
1361B8k9L2k4%J5l8JJ2j8J5LoQpK5J9m4K0j1K2l9Rk8M7qk7L6j3J2Jj1J7qQoM%
1398A7j3k1L4joJ1k7J1j2j0J9j2k3M2j5Qjj7J8k7NnJ4K6l4J8K0k0J6k2J2J0j8
1431cJ0j5K1qnK4K6k8qj9L0k6qJ5j6J8k0j0K3mKj9J8oj1L3Ro%l2mJ3K5n2L4%m
1468cM7l2rJ7k1K2k1JJ9j0P%k7L5LJ4l9Nl6J1J3J2Oj7K1Nk2j5Pk8K3J0Ool2N1
1504A7k6J8nl6L1K4pk6J1j5K2KKKk8oK2j5J8J8k0J3l6K6LomJ7rn%Mj0Lj3K1j2
1541ej7k2L5lPrj9K1K0j1j7K9j4jJJ7%K5m0J4l5M8l5L7j6J1j3mj0mK4L7k5l0m
1576hK1k8J6mOrj8J2oLj2J8L4l8k0L3qnK4Mj0j3nK2Kj1KK3k8K3J4j5rKKj0j7N
1614hK9k7J2K1j2prqj3K8Qj2j1k1L5j5qK0k2LJ3J6Mn7N1K3k4J6l0M2m6J5kK8p
$$ plain form
1361 28 -1 31 7 7 22 -16 -15 -3 -21 -6 -3 -9 -1 -8 17 36 -8 12 1 23 -16 -7 -35 12 4 -23 13 0 12 13 2 19 11 19 13 17 17
1398 17 4 -17 17 16 10 21 -6 5 -7 -17 2 -10 -33 9 -6 2 1 -16 2 -25 -20 -25 -11 15 -19 -1 19 -1 15 -7 5 15 -3
1431 -3 7 -8 13 5 0 24 50 22 14 -5 25 -1 -9 6 -10 8 -12 -22 1 -3 -1 -20 -2 -8 -19 14 23 17 17 -15 -19 -6 19 -33 1 1 -3
1468 -3 44 12 3 20 -1 21 0 1 20 10 17 17 -10 25 28 42 3 8 -28 -17 -4 8 14 -3 18 23 1 -14 -7 -35 -12 -2 4 -2 -34 17
1504 17 -9 9 4 -32 -1 23 16 -10 1 -14 8 10 12 14 -14 -20 2 -13 5 23 3 16 -20 6 9 3 -1 16 7 2 2 6 -4 -1 -14 7 -5
1541 -5 -22 -44 -9 -12 -5 -14 -33 -12 8 -3 -20 9 -5 -6 -5 12 12 37 -3 11 -24 24 -11 26 10 21 8 4 -6 -10 14 51 26 -4 -8
1576 -8 13 -15 1 -3 3 -6 -24 -12 -18 -15 -27 -9 25 -13 -33 0 -8 -13 11 15 5 -8 -13 9 11 0 2 25 -3 20 34 19 10 12 14 4 -13 -8
1614 -8 21 -6 6 27 15 8 -1 -9 -22 6 14 2 -9 -30 5 -10 -18 2 -20 -17 -4 12 16 -41 10 33 9 25 -5 37 -9 6 4 32 25
1649B5k8J9pOk9L0Ml3NL2m7L7k3Qnk4jJ8K2k1Kk0K0MPlj5J3LqL0j8j4J4KjjK9
1687C2k1K1k7K0oj3J6Ql2JQJ%JmoNj2Nj6K4k9j5J5J2NJ0qMj5jL4k1nk2K7j2qQ4
1726F0o1K2j5oJ8nj1J1nqQJ6j5Pl0JrnL6klK7j7j9rpJJOQj8L0pj8K5j3J8K0j6
1765A6k9L6J4l1Rjk1L2j5KK3K5n9J8k1M3k8k7J3J8j0j1rKK8m3M3k7OqL1j6j3L4
1799B4k5qj2oJ5oK3J3k6JK4Jk8K6KPlk5J6qJ6nJ9l2qK6pJ0l5%J5j2MJ6k1Qj4J
1837a4NQnMqj0QK3lj0rJ9QJ1jl8J0j5K0J3rJ1mPjj8J2j1J3j0L2l1j2j0J7J3k1
1874foK8l6j1M1n0M0k0L1k9j9L3J8k8J5J1k0MNrL3j9RPmj2J2lj1QJ2k6%mj2K2
1910Dj2KQlLj6j8L2Pj6J1j6pK7l1J5OpkK9k9J7QOj9kpPK4rM0j8%rj0J8k6J9k4
$$ plain form
1649 25 -3 16 9 15 -14 16 20 -13 -8 24 -23 14 -9 -1 -6 -30 -31 -13 9 -12 -10 -30 -10 -6 1 -2 -17 -4 -1 -9 21 3 -11 3 5 4 3 32
1687 32 11 32 5 25 19 6 22 30 -2 -1 7 8 8 9 5 -1 4 -8 -3 -19 5 -24 -39 -24 -12 -7 3 -5 -1 -16 -17 17 -4 -9 -31 -4 -16 -24 60
1726 60 -1 21 6 0 18 13 2 13 8 0 8 24 9 16 -14 -13 -22 -27 9 7 4 31 14 -5 -14 -21 -20 -19 -13 -5 -23 7 0 -18 7 -6 12 32 16
1765 16 -13 23 37 6 15 14 -7 25 10 12 35 60 1 19 -2 41 13 -14 -1 17 7 -4 -13 -11 17 -26 17 -10 -4 -12 19 3 -10 24
1799 24 -1 -9 -21 -27 -12 -18 5 18 -8 -7 17 18 -10 16 18 25 22 -3 13 5 21 16 35 3 -5 21 14 24 -11 -11 4 -8 -4 12 -9 -1 -15 -14
1837 -14 -9 -1 -6 -2 -10 -20 -12 11 8 -2 -11 8 16 27 26 -12 -2 -17 3 16 7 18 14 21 20 2 14 3 16 6 38 7 -5 -15 2 15 -6
1874 -6 -12 16 -20 -31 10 -40 0 -20 11 -18 -37 -4 14 -14 1 12 -8 -4 1 -8 25 6 15 22 18 6 18 15 4 12 24 -2 -2 -6 -18 4
1910 4 -8 -6 2 -1 2 -14 -32 0 7 -9 2 -14 -21 6 -25 -10 -4 -11 -13 16 -13 4 12 18 -1 -3 -10 -3 21 12 52 34 34 25 15 33 7 26 2
1949BJ7j0k0K0m9L7J2qj8O4l8l2J7m2M4Nj0j3L8pj2J5qrJ8jkJNj3K9j2nJ5JJ4
1985D5pj6Lk1J9J1l3J6J2m2K6Rj0j8j1K2lk8L5m0L3jPm8L0K4k2K7j4Qj6oJ5mJ2
2020A4J6j5m6Q1l6K5jj3Jjkj0MM0o2NJ7k7J7J2j7rK8qj8k4J9J0Nj9NONoQK0nq
2058A1j3RK5Nl0mPJl2N3k2J%j3M1l1J4m1%N7k5KMoj7J7j9Mjj0J4Lk4PJ3k4L0N
2096A1k8K9k2%JL8j5KL%lK2%k8QJ0k6J5k5J5nK4j6kQl8J7j1nJ4mJ6K0j3J0l8J3
2133cqJ5j4Rn2N5j6J5pRo%qK6k2J6K4m6L6j1Ok6LK7%k4M4k5j0J5Ok4qj4K1pJj3
2171a6MJ0j5L1Kk5PL8n2J0Qpj1J4L8j4Pj0k0JM0k2k1NJ3K0l1Qj2J8pk1K6K0k9
2206Gj7L6j0l1J0k3OK4nl2K6J9k7KjJ7j9K7Qj6qM3k5lQJ1Pk2n3Q1j0j1Pk4QJ6
$$ plain form
1949 2 19 9 -11 9 -40 -3 9 1 -17 47 9 -23 -6 -48 -4 1 -9 -22 16 9 -3 12 4 -5 13 12 10 11 16 3 32 20 15 30 31 45
1985 45 38 22 25 4 23 34 1 17 29 -13 13 22 12 -6 -17 5 2 -26 9 -31 2 1 8 -40 -10 14 -8 19 5 13 -3 -9 6 2 14
2020 14 30 15 -31 50 14 39 38 25 26 25 23 13 17 57 -5 0 17 -10 7 19 2 -7 21 13 -5 -29 -10 0 5 -14 -9 -3 2 -4 4 24 19 11
2058 11 -2 7 32 37 7 3 10 11 -21 32 10 11 11 -2 39 8 22 -19 -19 38 13 15 19 13 -4 13 -6 -2 -3 -13 1 4 -20 -13 0 -24 6 11
2096 11 -17 12 -10 -10 -9 29 14 16 19 19 16 38 38 10 18 28 2 17 -8 7 2 26 10 8 16 -22 -5 -16 -21 -7 -11 5 25 12 22 -16 -3
2133 -3 -11 4 -10 -1 -53 2 -14 1 -6 3 -3 -3 -11 15 -7 9 33 -13 23 12 18 -8 -5 22 22 -2 42 17 7 22 28 4 -4 -18 3 -4 -3 -16
2171 -16 -12 -2 -17 14 16 -9 -2 36 -16 -6 2 -5 -16 -2 36 22 29 19 -1 0 40 18 -3 2 15 35 4 12 0 18 11 -10 16 36 7
2206 7 -10 26 16 -15 -5 -28 -22 2 -3 -35 -9 10 -17 -15 -16 1 -18 9 17 1 -7 36 11 8 16 27 34 12 -41 40 30 19 26 2 10 26
2242B6j0jj7K4Kj0j8Oj0JpNj1mOJ6jJ2k3L1oj7j1K5%k1oKL0k3J5L9n8M4l5J6k
2279IJ5l6J6K1J3l2kQj2KJ7j8LJ5l2K5k3J3j2J1j5kJ6k3K8j3l2N5k0K0k2K5lJ
2313A6lJ0r%nk0L6j0%l1K5mrJ5mKj9RK8k2mqk1M0pJ2l0J4k2J7mjjj0K3k5L0Pk5
2352a0K6j5J6k0J2J3j5pL3j7Ojm5N8l7K1%%mNqJ3j3J2jk9K3l2K9j2j2J1j7KJ0
2387ej1K6j1plj0j8N0pRl3M0lnj5K4k5JJ0MJ6j2PQj8JOolk7N3k2Rk9L6k7NLJ1
2426B2k1RjJ8l2MJ6l2%J8MJ1j0j3J1J8J2lJj8J0j3J4J0j8j4K8pl2L8k2kj9K0l
2461DMk0J0lK2l6MRJ6qk8%K3kMpmK1j7J5mj6mJ4QK3ooj7K3j2LPk1oL1j3j8J8j7
2501fMj4L3k5jNk4lJ5KJ0mj1k2N8k4jMLoJ3N%k7OK3J2J9k4j5j2L7Rl3KKj1M3j9
$$ plain form
2242 26 16 15 -2 22 24 14 -4 2 -8 -7 -14 -9 -20 -24 -18 -2 -3 9 -14 17 11 -6 -17 8 8 -13 -19 -17 13 -10 5 44 -14 30 -5 11 9
2279 9 24 -12 4 25 38 6 4 12 0 2 19 1 4 19 -13 12 -11 2 -10 1 -14 -16 0 -23 5 -8 -40 15 -5 15 -7 18 15 16
2313 16 13 23 14 14 9 -11 25 15 15 -16 9 5 -4 11 7 9 -10 -1 27 5 1 -7 -28 12 5 17 -13 1 -21 -4 -8 -9 -10 -20 3 -22 8 15 -10
2352 -10 16 1 17 -3 9 22 7 0 33 16 22 21 -24 34 -3 18 18 18 14 19 11 24 11 23 22 -7 16 -16 13 1 -11 0 -17 -15 -5
2387 -5 -16 10 -1 -8 -11 -21 -39 11 4 13 -20 20 17 12 -3 21 -4 -3 7 11 27 15 22 30 12 13 19 13 10 -17 36 14 23 -6 30 3 8 11 22
2426 22 1 10 9 27 -5 -1 15 -17 -17 1 5 16 6 -7 4 22 34 31 32 14 24 11 25 35 17 3 31 24 -8 30 8 6 -13 7 4
2461 4 8 -12 -2 -5 17 -19 -15 -6 10 2 -26 -26 -3 -5 -1 -8 -12 9 -8 7 3 -13 -17 -3 5 28 22 16 -1 22 10 13 20 -1 -7 24 11 -7 11 -6
2501 -6 -2 -16 17 -8 -9 -4 -28 -31 -16 -14 -4 -8 -19 -41 17 -7 -8 -4 -1 -7 6 11 11 -16 -10 13 25 44 20 5 -7 30 39 6 8 10 -1 42 23
2540B3j0Nm0J6j2J7J4k0J4nmJ5k2MRj6RjMj4NK7j0LNj4J3QrMK5l1lJ2j4K8k3R
2578B1j4qQK5k6J0j6L2l0j4JK0k1L0k7%%k2PK8%nQKj1j2K8m7N4Nn0J7K6lk8J3
2614AlJ0Q%Jj6OnL9k7pJ5l1N4n0JK9k9j5K6pj0RK2k7k7L2L1n1K4KLpJ0OOl5K5
2652A3K8l0j5K2j9K2J0n0L5mJ0J2lPk7oj3oJ1J5J5m7J3rK2j7J3JqJ0k6K0J6k3
2686h%KJ2k1J4J2OKl3L0J9m6L5mpJ0ooj0PJ8k1okK0j5j2J8omk1K9k9nN1k4Kk5
2724b4J8nmRJ6nJ4k1L1o1M9rOj0L5l7J7J2k3L1k0mjk1JJ0J7j4J8l6MmJ8mj1Mj0
2761a4K9l2J9l8J8MJJ9J7k7k9M2K7nj7J5k3K8k4lJ5J6j7K1Lm5K7O%l8J3k7L2k6
2795a3J4jj1L6nmlk1J0Qj3J7k0j1J4NJ6kkj0J8J7j7lj5kk0j1N8l1nJ3J5J2k8J1
$$ plain form
2540 23 13 18 -22 -6 -18 -1 13 -7 7 2 -2 13 -9 -5 4 -12 -3 -4 0 -14 -9 18 8 11 16 2 15 23 14 18 43 12 9 21 7 35 12 21
2578 21 7 -1 7 32 6 16 0 32 2 -12 -11 9 -12 18 -9 -9 -9 -31 -24 4 4 -1 7 9 -2 -14 14 -33 21 26 -24 -7 19 16 -12 1
2614 1 -2 8 16 16 17 1 7 2 41 14 7 22 -9 45 -5 -4 25 -4 -19 7 0 -10 -1 21 -6 -33 -1 30 -21 3 5 8 1 11 17 23 -12 13
2652 13 41 11 -4 18 -1 21 31 -19 16 12 22 34 31 38 11 5 -8 -14 -3 12 27 -20 -7 -16 6 -11 2 3 -5 5 -21 -1 15 -8
2686 -8 -8 -6 6 -15 -1 11 17 19 -14 16 35 -11 24 20 13 23 17 11 1 8 26 5 -1 -3 17 2 -10 8 2 -2 -23 6 -23 -28 23 -1 1 -24
2724 -24 -6 -11 -15 -6 10 5 19 -2 29 -32 17 8 14 4 39 2 19 31 8 39 19 15 14 -7 -6 4 21 7 25 -11 -7 -11 7 3 -8 -4 -14
2761 -14 15 -17 2 -36 -18 -14 -13 6 23 -4 -33 9 36 31 14 29 6 34 10 7 22 38 21 42 45 0 27 33 33 -5 8 -19 13 -13
2795 -13 1 0 -11 25 20 16 13 -8 2 10 -3 14 -6 -17 -3 2 18 16 14 4 22 39 22 19 4 2 -18 -29 29 -2 -7 6 21 33 5 16
2831A6mj7J2%j5Mnk2QM1k4kK1k2J1mk7K0J8k9j1M0m4L4nOLqJ6j%J4k8J5LkoK0
2869B6j4j7RPmK2kl6L0%Mk6K6k5j1nK2J1j8qK2k1J1K2m0K9k8J4K3k7j7K9l2J6
2903hJ4kLOj4L6Mj7nkj0J1QlNk5K3j0J6mk9Rk1L4l9L4k5k2KK4kLj0K4lMl7L5l7
2942c0K5J5j3NK8m4M4k0J3nk0J9j9%kK5qj6J3J3qk5M1l9j5K9j8pJ6K5l4j3L0p
2976bqL2l5j0QOJ2j0PKJ1Jj6MJ0RnrRk0L1lj0nkj3L9k9l3M5oPj8rkPJ4j0k4J0
3016a5RoJ6j6Lj9O0Mj4l8J9rJ1J9k0K9m1L1m2M4qmLk4M6k3j7J6%Mk0J0%k1RJ1
3052GjJj3lnM6m2j6K3K3nj7j0Qk5P6m6k2L4J0pokK4j9PK3j8j0jL1k2J3l2PNj8
3089bLl2K1L3rj9K1j5J4j1plj1nqL9oJKMqk9O2J0n3K3%kL0l6NNj7N0m0l6K3J7
$$ plain form
2831 16 12 -5 7 7 -8 -4 -9 -31 -23 18 -6 -8 13 -9 2 -2 -29 -9 9 -20 -31 9 -35 -1 -6 0 3 -5 11 10 10 24 -4 11 14 12 6 26
2869 26 12 -5 4 11 7 29 27 -9 21 21 25 -1 25 0 -11 -16 6 17 -1 -9 13 -8 3 25 -15 14 -14 0 23 -4 -21 8 -24 -8
2903 -8 6 4 7 13 -1 35 39 22 17 15 5 16 24 21 26 1 24 14 30 26 -3 6 -15 19 -20 14 -11 -33 -31 -7 -9 -6 -16 8 5 9 -28 7 -30
2942 -30 -5 10 -3 2 30 -14 30 10 23 18 -2 17 -2 -2 -4 21 13 -3 10 23 15 -10 31 -8 -23 6 -12 -19 -3 22 -12 -25 5 -2
2976 -2 -10 22 -13 -23 -15 -9 3 -7 0 2 13 14 -2 2 12 21 16 7 16 -4 27 24 14 9 7 -6 33 4 -29 16 10 17 -1 -10 -12 -5 9 -1 -25 -15
3016 -15 -6 -12 4 -12 -9 -28 32 36 22 -16 3 -6 5 24 4 33 -8 23 -19 25 17 13 16 -8 38 15 -2 14 14 18 -2 8 8 -13 -4 7
3052 7 6 7 -6 -9 -14 32 -10 -26 -3 20 15 -2 -12 -4 -29 47 1 -21 13 23 16 10 8 32 13 20 43 25 15 14 45 23 36 4 11 16 -2
3089 -2 1 -31 -10 23 14 -5 16 1 15 4 -3 -6 -17 -22 -30 9 3 4 6 10 2 -27 35 45 -8 15 15 13 43 7 12 17 0 50 10 -26 -3 14
3127A4J0j5j4OlJqK9j5pKoJoMrOQKl4J2KQJ5L9k8jk5L4nPJ0qJJmj5j1L1J3l8M
3169HRJ1k1j0LK0l1K9j6qJ6j5j7J3KL6n2J4K3l8L8j6lK4l0J2JJ0J4j9J7Nrj2J5
3204B3k4K5k8K2onj9%L5l5J1M5l7j1J5j8J7j8j2K5mKqj3j0KO0k6k1j9K6J2j7K3
3238A2J1k3J7K5m4K2%rK2j2k5oL5rLjl9K9%%J5j2j0%j5K2k9J0j7N2k6k3K9nrj0
3274b0K4j6QqK1mj5K6%l3K0K7k0J6k9lK5Qk6L7k9LJ7m5PM3j8j5qK2l0LL0j2j8
3309a2Pk5K0K6j8k4K7k2K3J1l8N4ok3K0j9J0J0l0J1j4J8L5j7k3K5m0L4k2K5k4
3340aj6K5pLk1K2ok2J4mJ2j8K3k6LJ8j3J4j0K5kkJ6jk6K9k6k5N4l3L3k7MJpJ7
3376B0m7J5RnK9k5NnL2k2j4J3l9N0k3k3J2M7n4L6j5nJ5m0L5J3J9l8J9LllJ1Mj2
$$ plain form
3127 14 24 9 -5 1 -2 -1 -9 20 5 -2 0 -6 -5 -11 -7 -16 -10 -2 0 -34 -22 -20 -12 3 42 14 13 -12 22 17 24 34 26 27 28 24 9 -2 29 42 4 8
3169 8 17 28 7 -3 0 20 -11 18 2 -6 10 -5 -22 -9 -7 29 -23 -9 14 -24 14 -2 -5 19 -11 1 2 12 26 7 24 29 20 8 23
3204 23 -1 24 -4 18 12 7 -12 -12 23 -12 -1 44 7 -4 11 -7 10 -8 -20 5 1 3 -5 -18 -28 -26 34 8 -13 -32 -6 6 -11 12
3238 12 23 0 17 42 -2 20 20 11 33 21 -4 -10 25 16 19 18 -21 8 8 8 23 11 1 1 -14 8 -21 -11 -28 24 -2 -25 4 -1 -10 -20
3274 -20 4 -12 -4 -12 9 5 -10 16 16 -17 3 30 10 26 -3 -6 19 27 1 38 9 12 29 -16 -9 34 16 1 -7 15 -15 -12 18 6 -12
3309 -12 -5 -30 -10 16 -2 -26 1 -21 2 13 -25 29 23 0 20 1 11 21 -9 2 -12 6 41 24 1 26 -14 20 -2 23 -1
3340 -1 -17 8 1 4 -17 5 -1 -23 -9 -13 -1 -19 4 -22 -19 -1 -14 0 -10 15 13 11 27 26 0 29 3 -22 32 -1 32 5 9 10 3 20
3376 20 -27 -12 -3 -8 21 -4 1 -4 28 6 -8 5 -34 16 -7 -30 -18 29 -25 11 -4 -9 6 -34 1 14 33 -5 14 17 14 11 22 26 14
3411A4RjJ6n5L8m3L1k0L0j9PQkKplKk1Kj1N6l6j0KPK8l4J3k2k7J8K3K7qoKj8K6
3449A8Kk0k1L3J5j5J2j1k6M0Jj2nj4j0QPj7L0j6k5J3L0m2qL0j8J7J2lj0rRk8M7
3484A4k2K4Lj9Nr%J6jj0mJ5jlNJJ8k7K3m1K2j0J8k4Nj9K2J8k4Lj3K3k8J9jNk1
3521a8J1MpOK4l0L8l2PlJ9Nl6J8%Nj5J9Lj7K2k3J3k1L3j5j6J4j6K1l0M6m1J7n
3556@J3j1J7l5K4m2K9lnpPnJ1K8l0K0l5L0jj1JJ5JK0l4K8prK7j1l2J5Nrj1j0M4
3593B7j4j1k4M2k7j0qK1mK8j5J0l5J3J2J4l6qL4MOj1jk2qK4Oj6J5j1J5ppL5j8
3628A3J2Kk9J0%k7L7J5k7kl0K6k2JKJ1j2K3Mj4k7K2KjJ4NLk8J7oPpK0k2K8jj2
3665Gk2K4PK1k9l2M2J1lj9j4J2M3k6j2j1j1kJ7rlNok3J8jKJ7l6M5j9J7l5J4M4
$$ plain form
3411 14 23 22 38 -17 21 -22 9 -11 19 0 7 15 13 15 8 5 7 -14 -12 -23 33 -3 -13 -11 -4 24 -10 3 -19 -46 -28 -5 22 14 8 10 -8 18
3449 18 20 0 -21 12 27 12 24 13 -13 27 28 16 11 -3 -13 -5 2 -15 15 -1 -26 -13 17 -25 -33 -3 -21 -4 8 5 -5 -14 -5 -33 14
3484 14 -8 16 19 0 5 -4 -4 12 11 1 -3 12 11 8 13 14 32 5 28 -13 9 -1 17 -7 -2 -21 1 19 -5 -2 -15 8 -20 -1 -2 3 -18
3521 -18 -7 -3 -10 -4 20 -10 28 -4 3 0 19 24 -12 6 6 11 -4 15 18 1 23 0 13 -8 25 10 -6 8 -8 13 -17 29 -12 5 0
3556 0 13 2 19 -16 8 -34 -5 -8 -13 -20 -13 -18 -7 21 -9 11 -24 6 5 -6 -5 10 11 31 -3 25 18 9 36 25 -7 8 13 4 -7 -17 27
3593 27 13 2 -22 20 -7 -17 -25 -4 -8 20 5 15 -20 -7 5 19 -17 -25 9 13 19 8 7 -15 -23 1 7 -9 6 -5 10 3 -4 31 13
3628 13 25 27 -2 8 8 -19 18 33 6 4 -26 0 -22 -21 -19 -8 -20 3 7 -7 -34 -12 -10 -11 3 8 11 -17 0 -6 1 -6 14 -8 20 19 7
3665 7 -15 9 16 37 8 -24 18 29 26 7 -7 5 48 22 10 -1 -12 -14 3 -6 -9 -4 -10 -33 -15 -16 -14 3 -33 12 -7 10 -25 -11 33
3700C3l7L1j0j7J9OpJ7mj4K8l2rK8k9j0L7j7j2j7K5Nk8K6pk4J9j6J2PkJ1j7J2
3734Gl6OK3nJ9j2jQMLnLJJpj6L1J3qkl2lN0l6J6j0qj8RL1j9Mj9j3N2l0kl1L5k7
3774b4NJ2K0l6OK9l2J6rL1nJ8k5K2j9Pj0KPRpmj5L1m9L9k5L1ok8LJ0j9J1Jj1L7
3811B3l9QnK6k8J6LK1j8l1L7Mj0lkj0K3j0K4j2k2k2J9K1mJ1jOk1J3j2rKJ4k8J3
3847cL2j7k2j0RMk7N9n0K6Onk9L9k0J9OqNk7J4j3lL0J2k1J6Nj6Pj4K9jljj3m8
3884c3M5Pj4qMQj3Mj2J2MLl1L1jj0j4K3jk0MJ4jrK6k0K6l0K6J1k1K7m7O2l6k1
3920eL1j7J8k1K8qLk2%m9L8J6k6K2k1J3j2Kj0K9l8K7j9k4K0M9Nk1PoNLOl3L6q3
3956e7N2OnO3k2qqJ0m8L2J7%Rk9j0J8l5KJ9oRoj4j8J6L8Ml9QkqJ7Nl0K1J8j2L
$$ plain form
3700 33 -4 27 17 0 19 25 18 35 31 17 45 13 4 32 3 -7 30 13 1 -16 9 14 -14 12 5 -19 0 -16 -4 3 1 12 -5 7
3734 7 -29 -23 0 -5 14 2 1 9 13 16 11 14 15 16 9 -7 24 37 29 27 -5 -8 42 6 22 12 4 -14 -5 26 7 11 -8 -21 31 1 -1 -32 3 -24
3774 -24 -19 -7 13 -23 -17 12 -20 -4 -13 18 13 31 6 28 9 16 6 8 15 24 17 13 -2 29 -20 19 -6 25 19 -9 -6 4 -15 -4 -3 -14 23
3811 23 -16 -8 -13 13 -15 1 4 25 7 -24 13 17 7 4 2 -8 15 5 29 17 -5 -27 -8 13 9 20 19 25 4 17 5 -4 -2 12 -16 -3
3847 -3 29 12 -10 -20 -11 -7 -34 25 -25 1 7 2 -27 12 -8 11 17 9 14 -13 1 -12 -15 15 27 6 22 27 11 18 4 33 32 29 28 15 -33
3884 -33 12 19 5 -3 1 9 -4 0 -12 0 4 7 -24 7 6 -4 -18 5 4 -16 -12 2 1 -8 18 -2 24 -6 20 31 10 37 -10 52 16 -5
3920 -5 26 9 27 6 34 26 29 7 7 -42 -4 12 -14 8 -13 0 -12 -10 -20 9 -29 -2 -21 -45 -25 24 29 8 15 9 14 17 23 -10 26 -57
3956 -57 -5 1 -4 59 37 29 21 31 -17 15 32 32 41 12 2 20 -15 -13 6 0 9 3 -11 -29 -13 25 29 -10 -2 -4 -12 5 10 -20 1 19 7 10
3994A0J9j2j5L5l1J7pj7J5LQKj3K8l8J1l5M2j5PjnRj7K0j2rj6L3l4rK4J3l6J1
4029a5MJ1pMj0LJ8K3k9J3l%j5K8j9J1qrJ9j2j4L1Lqj3l3L8Okj4J5Jj5j8K4m3M8
4066A3k6NJ2j4N7l1lqrJK6l3N1o3K2K9k4K0j4KK0jj2k7K4j3J2Mk9K7%k2J5Kj2
4101Ak3L6lk5K1OpJ7J6m2mOrrL3j2j5PJ1J5l0K1oj6L0KNj6J7j5L2k8LNj2J4pj
4139A8Rj6k6K0rJ2j5J7j4K2m7J9J7j3J3j3K5j7J7k4K7NJ9o1K3mJ3J5j0mK0k2K4
4172D0k1k3O0n6J4qk1J4J0j1koJ2kRk5J3L6k9Rj4pM7mm4pJ6Ll4J8J6J8mJ7n5N3
4208C2oOk7LJ8j8K5j0pqJ3j5J7k1K5Jok1J8l8QKLj4PK0k7J4LJ2k0j4RJ7K1j2J0
4245B0qmJ6j1jjRk5J7Mj9M2j2K0m2j0J2j0Nk3OpJ6J0k9L3pK4m5J8k8K4mqJ0K9
$$ plain form
3994 10 29 17 2 37 6 23 16 -1 14 17 25 27 14 42 4 15 -20 22 7 14 13 8 17 0 20 8 -1 -17 16 -18 -27 -3 10 -26 -15
4029 -15 -11 0 -7 -3 -13 -10 8 31 2 15 12 12 -3 25 6 17 9 0 19 7 -7 24 27 19 6 -27 11 17 15 1 16 17 2 -16 8 -35 13
4066 13 -13 -8 4 -10 47 16 13 5 -4 -3 23 -10 41 -22 0 29 5 25 11 13 33 32 20 -7 17 4 16 20 -9 18 18 -4 11 13 1
4101 1 -22 14 11 -14 7 13 6 23 39 -3 -7 -1 -10 -19 14 2 -13 -6 5 20 -10 11 5 -11 19 21 26 10 27 12 44 16 19 24 12 26 19 18
4139 18 27 11 -15 5 -4 8 -7 10 -4 18 -29 -10 7 -6 7 -6 19 2 19 -5 22 27 46 -15 8 4 17 32 22 18 38 16 40
4172 40 19 -4 56 0 14 6 -15 -1 9 -2 -4 -10 2 0 9 -16 -3 33 4 13 -1 -8 39 35 -9 -16 0 3 -31 -13 3 21 17 34 -21 32
4208 32 26 32 5 8 26 8 33 23 16 8 21 6 23 2 27 28 22 1 19 -19 -11 -9 -6 -20 -13 7 -20 -6 -3 9 -11 -25 -16 1 22 10 20
4245 20 12 8 24 13 12 11 20 -5 12 16 -3 39 27 47 5 -5 7 -3 2 -21 -15 -22 -6 4 -25 8 1 25 -20 -2 -30 -6 -10 -18 -8 21
4281B1l1L8k1j3K7qj5J0j0mJ0rJ7j3K6j5mJ0OJ3j0j9NmMj3K7k3rJ0RJ1l3K4l2
4316a8j2J4J9Qj1J1l2MQ%lL0jk6MJ2L4l7J6j3Qj7K4Ok4RK2j6mJLKk2lLJ1loj2
4355a1L3l6RRj2J6k0QoJ3JJ1ll8M5k1K9k3%J7pK4k9k5L5Noj8LJ9k0mJ9J3K0n9
4391iPj7J0RjPj1QJ5ok7J0k4M1j4k0L8mmj8rMKM2k8NK3j5ppK4kJ4l8L0j5j3J8
4429A8j0M3k8kl5J3RNl9L4Lk5mK0nj4Qmk6L6J8l2L3j5j2mL1l8mJ8M3l8NJRkLK7
4467D0k7pJ0Ql5L9nKn9J4J5Om%lNrJ5nRj3Oj7J0j2j6L0kK4k0J2J8k8L9k5k2qm
4505a9L8J8nj3Lj8J6nqL4l8K5k1j3J4Mpk0J5j0K0k3mK2rj6L2k6NjlK3j8M1k0k0
4541gm%PL3rj3kM1l1J7m3L0%l0K1oOJ6k0RLj2k4N1l6Jk2Qk2K1J3J4l1J6KLRj9
$$ plain form
4281 21 -10 28 7 -6 21 13 -2 8 -2 -6 4 -5 12 -1 25 10 6 16 22 35 25 6 11 7 11 -2 25 2 -7 3 12 23 -10 14 -18
4316 -18 -30 -16 3 11 0 11 -21 -17 -9 -9 -12 18 17 -9 -5 7 41 4 20 7 15 -2 22 28 4 13 35 19 15 16 19 21 -1 -4 -1 10 7 1 -11
4355 -11 22 -14 -5 4 -8 8 -12 -4 -10 3 4 15 12 -26 19 -2 27 4 4 21 14 38 9 -16 19 24 18 0 3 22 2 -2 17 30 50 -9
4391 -9 -2 -19 -9 0 -1 6 -5 3 18 12 -15 -5 -29 12 -2 -22 16 12 8 -10 -19 -15 -13 29 1 6 29 14 7 0 24 22 36 -2 28 13 0 18
4429 18 8 51 23 21 -14 -1 8 13 -26 8 11 -14 -18 2 -3 -17 -9 -13 -39 -3 15 -17 16 1 -11 -15 16 -22 -26 -8 35 -3 2 3 12 10 13 40
4467 40 13 6 16 24 -11 28 23 25 -34 -20 -5 1 -3 -3 -6 -1 -10 5 0 9 -4 2 -15 -5 -17 -33 -3 -5 19 -1 11 29 1 40 15 -7 -15 -19
4505 -19 19 37 32 19 22 4 20 15 7 41 3 28 7 -6 8 12 5 -15 0 -10 10 -13 -17 5 -4 -20 12 -14 -9 -10 -13 10 -8 33 13 -7
4541 -7 -11 -11 -4 29 20 7 5 46 15 32 -11 19 19 -11 10 4 10 26 6 15 18 6 -18 33 -3 -2 -24 -16 -38 -17 -4 10 -21 -5 -3 0 9 -10
4579a0J8ojJ5k4K8l2L0j2RJ4j6nJ0JKLk6J6K3jj9j2l1K8l9N7l3K3m3K2M6l1l0
4613b6J3K1j9rK7j6jMK6j8k2J7J0lRK9m8K8k1K2J1j8k1K2Pk3K2k1K0j2K0l1rL2
4647B2l6K3k0K2qnj2j0jOJ7j0K3qk7J9j2J3J4nj8N5l3K2l5K3j0j5L9qoJ5l5J7
4681A6kqRLk2lL%Ok6Rj0L3j8nP%nLJ9j0j2mNJ5qMj8L9l8QK6l3J8J3j7MjK1ol0
4722a5L4m3K8K4k9rJ8k2J7KjJ7k1j0%j2J4j2j0N8j2l1M3m5J9j5MNJ8j5rK6Jj0
4756G%J8nj4j7L4J0qk3%nK2mmj5OqJ6k5M3k4J3k7K9l0LoL3k7l2L0L4j1m6L6%m
4793aJ7nkj0J6Mj9jK5%Kll3J5L7Ll2Ol4O3n2J5l0K8j5Mj5J1Ok4MK1j5QK6j8J2
4830A4l3J4K1qj1NjKK5j8J%L1l0k6N6k3lQjk5M2m2K0j4OMQm2L5m8M0l7M9k8%J
$$ plain form
4579 -10 8 2 1 16 -8 20 -12 18 6 15 29 13 8 18 19 21 24 -2 14 37 36 17 5 -26 2 -37 20 -13 10 -33 -11 35 4 -26
4613 -26 -13 8 -11 -20 7 -9 -10 -6 20 2 -20 -3 7 4 13 42 -6 22 1 23 34 16 -5 17 24 1 23 2 22 10 30 -1 -10 22
4647 22 -14 9 -11 11 3 -2 -14 -24 -25 -19 -2 -12 11 3 -24 -5 -17 -4 10 5 -13 42 9 31 -4 19 9 -6 33 25 19 34 -1 16
4681 16 14 6 15 18 -4 -7 -4 -4 2 -24 -15 -25 8 -10 -15 -8 -8 -13 -10 9 -1 -13 -17 -12 3 -5 -1 -19 20 -18 -10 16 -17 1 14 -3 1 0 21 15 -15
4722 -15 19 -24 4 28 -1 -10 8 -14 3 5 4 21 0 -10 -10 -22 -8 -20 -30 28 16 -15 28 -17 2 -13 -9 -4 14 -1 -10 16 17 7
4756 7 7 25 20 6 -11 23 33 25 2 2 -3 19 15 11 -4 2 -6 10 -15 28 4 17 -10 19 -11 -8 -14 19 -8 -40 -10 24 13 -33 3 3 -1
4793 -1 16 11 9 -1 15 19 0 -1 24 24 26 23 -10 5 42 45 13 19 -15 48 -4 11 -19 9 -6 -2 -17 -6 0 -24 -20 1 -14 -6 20 2 14
4830 14 -19 -5 16 8 -3 2 1 3 28 10 11 11 42 12 -14 42 19 16 24 23 -2 40 -2 18 4 10 14 22 -20 15 -33 7 -30 19 -9 -9 -8
4867hj5L4k4RjnJ7Jk1L4j9k1K3K4m4L3Qj5J6l1K4j%ml0%QK1k7K4Mj7Pj6K9mRk7
4905eOm1M1j5K1Pk6oK9rPl%j7J7J0qPj1j2L5k5J3%qOqJ4RqJ0jl7oJ3j9NROj0l
4946a3MkklNL2k4j1j1QQK9j6pOj2K9j0jJ1m7N9J2l8K1j2J0j1J3n1M7J6l6J3j4
4981BJ3j3Lm1J5J9j5K5j3Pl8M0l8L5MQjkk1K0k1NJ8k3L9m0K6l1M9l2PKqL1j6K8
5017D3k9K9l3%Lj5J4Oj5k5K2Ml5L1j6jnJ0JM3k6oJ0j4PrK7k0j3K6Pk7QMRoOj1
5055DJ2Jk0K6j9nk8PL6K1k4jj9K8j5j1jQk4Rk3pM0QrL7m5K3k3L5j2Pk8J6L8l2
5091A0nlJ9Loj4oL4l6JJ1Qj2m1M5K8j8Kk6llJ1J3l2J1K5l2L4J3l2MRk7J2pJ0j1
5128a1K0J2l0%J1J6k3qL8j1koORQj9nJ3mmkj6K3j4K2l6nJ3Kk7lN5j5j0k3M1l2
$$ plain form
4867 -8 -23 11 -13 -4 -5 -10 7 8 -13 21 2 -19 4 28 -16 17 25 10 26 -5 19 18 18 14 -16 -16 -8 13 -14 10 14 -3 4 -12 17 13 22 -5
4905 -5 1 -40 1 -14 7 14 -12 -18 11 2 9 6 6 -11 6 16 8 15 4 -8 27 2 15 15 7 13 5 19 28 20 30 29 -8 -14 -1 -20 -15 -6 0 -10 -13
4946 -13 -9 -11 -13 -16 -11 21 -3 -14 -25 -17 -9 20 4 -3 3 -9 20 10 9 20 -27 32 44 6 27 15 25 14 27 -24 23 39 3 16 2
4981 2 15 2 5 -36 -21 -2 -17 8 -5 2 -36 4 -34 1 5 13 12 10 -11 9 -12 -7 11 -12 27 -13 13 -18 31 -1 6 8 0 31 15 43
5017 43 14 43 10 10 13 -2 12 18 3 -22 0 4 -31 0 -16 -17 -22 -12 -11 32 6 0 10 -4 3 -6 21 1 -12 14 21 -6 2 6 15 9 15 4
5055 4 16 17 -3 23 4 -1 -29 -22 14 35 11 10 -9 19 4 -7 -8 0 -24 -15 -38 -45 -5 3 -6 31 -14 9 -14 21 9 16 -12 4 42 10
5091 10 5 2 21 24 18 4 -2 32 -4 -3 8 16 4 -37 8 36 18 20 -6 -9 -12 -1 12 -20 -9 16 -16 18 31 -1 3 12 -15 -3 -10 0 -11
5128 -11 9 21 -9 -9 2 18 -5 -13 25 14 12 6 12 21 29 10 5 18 14 10 8 -8 15 1 23 -13 -18 -5 -3 -30 -33 22 7 -3 -26 15 -17
5165a7L4j9J2l8K7K7j8j9PKJ4k9J0K3J4j6j3J9rqK0JLj0j3L2l2J8Lk7l7M5k7Q
5199a3pRj4nJ9Lj2j1K1J0K5k2j5JPRkj2M1lj1lK1l0j4K9Ljk7RK7l8J8j3%Qj0r
5237a2olOJ5j4jmKk0OM4j7Lk9L2j4j1J5M3j4j8K3Pk8rL2nrJJ2p%j6J8nm7K4j0
5275a6L6pk6J1KNJ2m5QM3k5Mj6Kj1J6Pj4NPL5l5mJ8j2OLKk0J0Oj3L3k3JJ5j1J4
5313B3j4nJ7Nj3j8J0K7k7j1oj8L3Mpj0J8l7pL2j9NN0k6%Rl4L1Ql1J0J6oK2Jk5
5349GK5k9mL7j6j7K9l7k1M1Kl1K3j8Qj2k1J0L1m2K1J8MQn6M2k1L8k5J1Mk0L5k2
5383BJ4L1l2K7l1mK5jk0mRJ8pm4M3m9N3j4j9l0K2OoK4oj9K3k4J5j8J4l9N4k4j2
5418b3K1K0j5j7M0j9LOjj0L1j5k0K0j0j1KOm1N4Opj8j8L5k2J0m5K0J0kMJk5K1
$$ plain form
5165 -17 17 -2 10 -28 -1 26 8 -11 -4 -2 12 -17 -7 16 30 14 1 20 11 3 23 24 27 17 4 36 4 22 25 -2 -39 6 -21 -13
5199 -13 -20 -11 -25 -30 -11 -8 -20 -31 -10 0 25 3 -12 -11 -4 5 3 -9 32 29 18 15 36 6 -8 21 24 23 -4 5 32 -6 12 -1 -1 7 -3 -12
5237 -12 -18 -21 -15 0 -14 -15 -19 -17 -37 -31 13 -4 -1 -30 2 -12 -23 -8 35 21 3 26 33 5 -4 28 23 14 15 27 20 20 4 22 17 -30 -6 -16
5275 -16 20 13 -13 -2 0 5 17 -28 -20 23 -2 2 -14 -12 -23 -7 0 -14 -9 -2 33 -2 -6 12 0 6 9 11 -9 1 7 -6 27 4 5 20 9 23
5313 23 9 4 21 26 13 -5 5 32 5 -6 -12 -30 3 7 0 -10 8 -29 -36 -4 -23 -18 32 6 6 15 -19 12 20 -11 -1 15 9 31 32 7
5349 7 32 3 -1 36 20 3 32 -5 -26 15 17 -14 9 -9 -1 -13 -34 -24 7 -35 -14 4 8 16 -40 2 -19 19 -6 5 9 -11 24 2
5383 2 16 47 15 42 11 7 32 31 11 7 16 34 27 -17 26 -23 30 16 -3 -33 -11 -5 -11 13 7 -12 11 -13 2 -16 -2 -41 13 -11 -23
5418 -23 -2 18 3 -14 26 7 10 16 15 5 36 21 1 21 11 0 2 8 -33 21 27 20 2 -16 19 -3 7 -38 -18 -8 -10 -6 -5 -30 -9
5453iOnJj2j8L7j0pL4j9lM0k2J6Kj7O%k4M3j1k7QK4l5jJ6OroRj5J6j3Jj6K5Pl9
5492b1nK1J9j1J2l3OLOPj1j1oL5MOk0j6J1L2m0M4l1J0J0j5NNj6RPNj7k0K0K0p
5529A7j5L0l3K4m4J2MJ7K1l7OJ7l4K2k7K7k2J3k9M2lj3j1K9J0k%l2K3j4K7j3K2
5562C4Nn1K1kKj4K9J3m0J7l2LNoM0m3lPJ2k2J9MJ2l0K1j5J2K1k2Jk0J1K2J0j3
5597HJ8j3j4K9%k6j0K7j2lpJ3rJ0m4M8k6J0lPk2OLnJ5l9L9lj5lj8J7J8k8K1qk3
5634d2M9l0K8Qj7J4J5k3J2k7j2J2L8k3J8JK2k4j5k4L0lj8K3k9K6j3nLk9K4K9j8
5667@m1L9j0K7Pl0oL5j7kmJ3lJ3Nk0lL5l8J1k4K9Jl4K5J0qjk4JL2j5j1L7m3j6
5703c0K3j8J6J8l2L1rj2j9L6j7J1J0k6L0rMPK6k5j9MPkJ5Lj6K5k4L%k6j3L8pj5
$$ plain form
5453 -9 -3 -8 -7 -19 -37 0 -10 -17 17 -2 -5 35 13 29 31 14 20 20 -4 39 28 1 9 33 -2 -3 13 19 10 4 13 -2 14 1 2 -14 11 18 -21
5492 -21 -26 -5 14 3 15 -18 -12 -9 -3 4 -7 -18 -24 11 15 21 1 -15 -4 28 -12 32 1 11 21 6 11 16 0 9 16 21 4 -16 4 24 17
5529 17 2 32 -1 23 -21 -9 -5 12 33 -4 2 19 -15 7 -20 7 -15 -2 -31 11 8 -5 -16 13 23 21 21 -11 12 -2 25 12 34
5562 34 39 -12 9 7 9 -5 24 37 -3 14 -18 -15 -10 -16 24 -19 -22 -15 -3 -25 -6 -2 10 -20 1 -14 -2 19 -3 -2 -22 -11 11 21 8
5597 8 26 13 -1 28 28 2 -8 19 7 4 -3 10 1 11 -33 15 -11 -1 -4 3 -19 -13 -10 -15 0 -39 0 -3 -18 -21 -39 -22 -4 -32 -11 -19 -42
5634 -42 7 -23 5 13 -4 10 25 2 14 -13 -25 -13 25 2 20 21 43 19 4 -20 10 7 -11 12 -17 9 -4 -9 -6 -35 -11 18 0
5667 0 -41 -2 -12 15 22 -8 -14 21 4 2 -2 11 8 21 26 6 3 38 0 11 -13 16 17 -17 8 18 10 9 -15 -14 18 3 -8 29 -14 -30
5703 -30 -7 -25 -9 9 -23 8 -1 -13 -32 4 -13 -2 8 -18 12 3 7 14 40 15 -4 0 7 5 20 23 7 32 8 11 11 -15 -28 10 3 -12
5739a2J8jl4M9j4j9J6l2RJ1j1J7JLkLpJRJ6j1k6N7om0j2J6J0MlL8n7K6Kmmj9K7
5777A9k6L2l6Qj2%J1jJl0J4Mj6L5qk0K1k7J7Lk1J0rJ4J7J2J6j9plJ4qK4l0K7j9
5813GJ3Rj1j4Oj2K4l6L3m7K9J5n5K2K1k7mJ0PJ7k1j1MQk1L9pJ6m4N1m1M2j5j0
5847cJ4j0RJ2j7J5j0Lj2mQK9j6pLJ9l4l1M1j5K7l5J9K4l1j5K1J0k6J6j1K1j4j4
5881a4kj0K2j%j3J7j8L9j2K1k3j1J8j0jJ5RJ1m7K5j2lMmMj2j1L1k9mj2L5j3PJ4
5917A0j8J2k4J9lj3K9J0m7qM1Mj2K5mqnK1r%pj8J8jK2j7j7M1k6j0j8qK5NqPl8
5954c0kL1PQJ9n4RMJ1J8j7k3J3rK0njpJ1J9k5OL5l0KnqL7o1K9J6J5nk5LnK6l5
5992hJ2l4NK4Qj3lj9K4J2J4l1j7ML3l9k5O2qqJ1PK0Jk2JK1k4KMl0K6%Qj2Mj7J1
$$ plain form
5739 -12 6 5 -29 20 6 -13 3 -29 -20 -9 -20 -3 -2 1 -1 2 -5 -4 5 21 10 -16 41 35 -5 -17 -1 9 13 10 48 -9 17 19 15 11 -8 19
5777 19 -7 25 -11 -3 -15 -15 -4 -5 -4 -34 -20 -16 -32 3 -5 -25 -4 -31 -14 -11 -32 -22 -31 -17 0 12 28 9 2 -1 13 5 29 -1 26 7
5813 7 20 29 18 4 10 -2 22 -14 19 -28 1 16 -39 -17 4 -23 -27 -17 -10 7 -14 -25 -21 -13 -34 5 -2 14 -30 21 -20 22 7 -3
5847 -3 11 1 10 22 5 20 10 13 1 -3 5 34 18 11 14 33 -1 -32 9 -6 21 -14 5 29 -2 -17 4 14 -12 4 -7 14 0 -14
5881 -14 -16 -26 -4 -5 -5 -18 -1 -19 20 8 29 6 -5 13 3 2 17 26 37 -10 15 3 0 4 0 4 -8 -19 12 -17 -21 -33 2 -11 -4 10
5917 10 -8 4 -20 -1 -4 -17 12 22 -25 -33 8 12 0 25 21 13 8 29 20 20 13 -5 13 12 34 17 0 41 15 5 -13 -21 4 9 1 8 -30
5954 -30 -32 -1 6 14 33 -21 -12 -8 3 21 4 -19 -6 -15 5 0 -1 -8 3 22 -3 3 38 8 10 5 -3 34 -27 2 18 33 28 3 6 1 27 -8
5992 -8 4 -30 -25 -1 7 -6 -9 -28 -4 8 22 -9 -26 -22 11 -28 -53 9 1 -7 4 11 31 32 10 11 32 8 10 14 -16 10 10 18 6 10 -7 4
6030DQk3J8pj7MJ7j2k4L0j8LQk6K3j5N1l4PmnONNrJ8k2N0l6K3j8j5J6Pk2K2mj7
6068cJ5jj1J3qj8QJ6qj5K5Lj6MplqNJ5J3n9N1nj8OK3k6PMLRj1K5KqMl3J4PlK8
6109C9j5k7oPJ2J0l8RK8m1K6K0j9j5k7K7j2oJ5J0KKROjl2PMJ5prmK0K0j2J3ml1
6147eK3j6j2OJ9J3k6LJ9j0Mjj8o%prrlK2j4K1Qm5K9J6k1j4J5J3JJ8J1l3MK2k2
6184dL7l9J6j2JK8%j1J1lnrK5m2j6L6j9K4k8J1%Jj0nQj7j5J1M5pk1J1l3M1kj0
6220bJ9k7%M3Oj0k7kj0K3qK8j5jk0J3PLj7J2J6m1J9j3k1M5l5JkL5k7mRqK2l2J7
6257dLnklPJ5j8N0k4j6JM1m1J2l6K9j4jK0kj3L3rj7rK5jopoJNJ4Ok3k0K0Nj5N
6297@%rJ3j5j3PK3oJ2k7LL6oj8L4l2OQk5NN4j7m3J3J3j2K0k1J7m4K2j3kJ0Ok7
$$ plain form
6030 4 12 -11 7 0 -17 -13 4 -8 -32 -2 -20 -17 -9 -35 -12 -27 24 -10 -3 -7 -12 -6 -1 4 -5 13 -9 41 5 28 10 -5 11 18 -4 18 14 -3
6068 -3 12 11 0 13 5 -13 -5 11 3 -12 13 16 0 4 -3 -6 -14 -9 6 19 -40 11 6 -12 -6 17 -9 -2 2 5 14 3 28 30 22 26 -7 7 14 11 39
6109 39 24 -3 -9 -2 10 20 -18 -9 19 -22 4 24 5 -10 -37 -10 -22 -28 -13 -3 -1 1 10 16 15 -17 -10 -6 9 2 -7 -11 9 29 17 30 26 -5
6147 -5 18 2 -10 -4 15 28 2 5 24 14 18 17 -1 -7 -7 -14 -23 -32 -35 -13 -27 -6 2 -43 -14 2 -19 -33 -18 -5 -4 14 25 -8 -4 18 -4
6184 -4 33 -6 10 -2 -1 27 27 16 27 24 19 10 35 -7 -23 13 -6 18 -10 1 1 2 -8 -13 -5 -22 -37 -26 19 12 -9 2 -31 10 8 -2
6220 -2 17 -10 -10 33 39 29 2 0 -10 13 5 33 18 17 -3 10 17 20 3 15 31 -10 9 -4 -25 20 -15 -14 -16 19 -8 -12 -3 -11 11 -21 -4
6257 -4 -1 -6 -8 -11 -4 11 -7 43 19 3 4 45 4 16 -20 9 -5 -6 14 12 -1 32 23 6 -3 22 21 15 8 2 3 8 22 28 5 -15 5 10 -5 0
6297 0 0 -9 4 -11 -24 -17 6 0 12 -15 -12 24 18 0 34 2 8 16 -9 -4 50 33 -10 3 16 4 24 3 20 -24 -2 -15 -17 -7 -1 -28
6333b8J1J5k1J5Kn%J2Rlrk9M7lk9J2K8j0k3JJ6jJ5Mk7K8rJ1rk1j0j0M9k0j6Pn
6370fK1Ok6Rj9k6M6l4K8Km1J3N0k6MnJ4l1MRK6rNj7J0NK5rk0K9l1Lj3pL8rJ0j1
6408A7%j2lrJ1J5Nk3j0l2L8Ql7J2J3kKj1KJ7l7L8J2j8k4J8J8LJ4j0pj%J9j8Mr
6445CnK8m5M1k0j3LJ9J9m3kOMJ6k1oK4l1MK3k7K4k1LK8j2LJ3n4K5J5Lj2J3pL2
6481C0j9j3L4l4L1k3pJnOjRKnOrj6K%J8j6J9k3J3Pj5K4k8J2k1K4j8J4lOj4M2n7
6519b7QJ0J4L5k6LpK6l9J5J4k5K5j6k0L5j3kj6k7K7Pj0J7jrk9J5K1k5K4j4rJ5
6553dqjmQK4J1j0opLRrJ2%k6rN8m8K4j1nL7m7K8jj3Kj8J5j8K1jj4j8J0mJ7kKK4
6593B1l8K8ll6M6j2j9L3j0n2M6RJ2Mj8L5l6Nj7LQj4K7m1J4oJ7J6k8K8olj8Pk3
$$ plain form
6333 -28 -17 -2 -23 -8 -6 -11 -11 1 10 7 -2 -31 16 13 -16 -4 24 14 -9 -8 8 7 22 26 -1 27 18 29 20 -1 -11 -21 28 8 -8 -1 -6
6370 -6 15 21 -5 4 -15 -41 5 -29 -1 1 -40 -27 23 -3 1 -4 10 -21 -17 -8 18 9 14 -3 7 12 37 28 8 37 6 9 -4 -11 27 18 28 17
6408 17 17 5 2 -7 4 19 24 1 -9 -41 -3 5 -32 -20 -7 -9 -7 -18 -16 1 -36 2 14 -4 -28 -10 8 11 25 15 8 7 7 26 8 12 3
6445 3 -2 26 -19 22 2 -11 -8 11 30 -13 -15 -9 -5 11 -10 -16 8 -23 -19 4 -23 1 -20 -17 11 -1 2 15 -39 -14 1 4 -8 5 -2 30
6481 30 11 -2 32 -2 29 6 -1 0 -5 1 0 9 11 6 12 3 -13 -11 -11 7 -9 10 -13 0 7 -8 16 -12 0 -21 3 -15 -1 -4 2 -12 30 -27
6519 -27 -19 -9 5 40 14 17 10 36 -3 12 26 1 26 10 -10 25 12 10 -6 -33 -6 1 -9 8 7 -2 -31 -16 5 -20 4 -10 -19 -4
6553 -4 -12 -13 -17 -9 15 26 16 10 3 6 15 6 18 18 -8 -17 41 -7 17 6 1 38 -9 19 18 5 7 -11 4 -14 7 6 -8 -26 -16 -20 -3 -5 -3 21
6593 21 -17 11 8 -28 18 6 -13 20 10 -42 4 13 25 29 11 46 10 15 -2 1 9 -5 22 -19 -5 -11 6 22 -6 22 16 13 -5 2 -21
6628b1J3k3N0k1k1j2M4k7L8j7JJj3L4k2ok7L1oK5km2L3PnK0Pl2KJ4okpJj5L1k9
6665dk1K3Lj7j5J6J1k0qj0N5k3k2PL4k8K7k4L3k9J1j8l0N7k2J1L1j7nK9l2K1p
6698A7m4M8j2k0K7k3J5qJ2k6j1L0J4rj0pJmK7k4j0OJ6k0kK4j7Lj9K4M5m6J7Lj9
6733bkK1pKj1j6J5K6j9J8j8L%j8Nj2QJ3Jk1qL4j0j9KJ9oj3J1Qk4K4j8RJ2mJKl4
6772b8J1J5K6Ml5jK6K2k8Jk0J3kJOK8l9pK2Kkk1Oj4j7K4KoJ3k7J1nK6ok3K1J5
6809A4L8o4LK4j5J3k5K3Nl9L7L4k5J1j3%%l8K0LPlj7J7k0k1K1jj7K7j3k8M3qp
6844a4j8M2l3RKKK5k5nL6j3L1jl9K1k0J0L3rk5pL5o5L2lNJ0nj4NlRJ0j8j6Rj1
6881a8K8kj2oL1m8K8Ok6Lj4K7J8pRj6J4pl3L3J9j0Rk7%J2kkK2l5L1ol3L1k3Nm
$$ plain form
6628 -21 -8 -31 19 -2 -23 -35 9 -18 20 3 4 5 -8 26 4 -2 -29 2 -4 21 19 -23 10 17 12 32 39 7 9 23 17 15 8 9 -6 25 -4
6665 -4 -25 -2 1 -16 -31 -15 -4 -24 -32 -42 13 -10 -32 -25 9 -19 8 -16 17 -12 -1 -19 -49 8 -14 -3 28 11 6 35 3 24 17
6698 17 -27 21 9 -11 16 -7 8 0 12 -14 -25 5 19 10 0 -7 -6 -10 17 -7 -17 -11 5 -15 -17 7 -10 -7 -26 -2 43 -3 14 17 -2
6733 -2 -4 17 10 12 1 -15 0 26 7 25 7 10 10 -8 -3 -15 -7 6 7 -14 -22 12 2 -17 -15 4 -2 -15 -4 4 -20 4 -14 -5 7 3 4 6 -28
6772 -28 -17 -2 24 28 -7 -8 18 40 12 13 -7 6 4 5 11 39 0 -7 15 17 15 -6 0 -14 -31 -7 -5 -11 2 -25 -14 -19 7 1 -22 -1 14
6809 14 52 -12 -9 15 0 13 -12 11 16 -23 14 48 23 34 21 21 21 -17 3 6 13 10 -7 10 -10 -31 -10 -11 -28 -1 -14 -42 1 -7 -14
6844 -14 -32 10 -23 -14 -12 -10 15 -10 -15 21 8 39 38 -1 20 0 10 43 34 9 2 37 -28 4 1 6 16 11 -3 2 -1 8 18 0 -16 -7 -18
6881 -18 10 8 -4 -10 21 -27 1 7 -19 -16 -30 -3 15 8 17 1 15 8 -25 8 27 17 26 -1 -1 11 9 7 29 -6 25 19 -14 17 -6 -1 -5
6918eK0j5Kqo%Qr%L5l1j8PJ2MNjlQj4j8K6L9k9lRok5K3%J4j1K0%j2mJ4l7QL1j3
6959A7l1J2j4JJ9jj2J5nLrlRnMJ8j6pPoK6Oo5M7j9K5nkkj7K2%Oj2Ok9KK0jRk0
7000gJ5Kj0j5RMj9J7Kj1kJ5j0k4K2J3pJ4k6qJ7J5M0o2L2k1pJ4k5L3l2L0k4O9n4
7035aK0mKj1Mj7%jJ4oj4%lJ3J9l0J1K0k6J4mj3oqPlK8KPQl9L4N%kk8oJ4J0Nj3
7076Brj4M5J0n8M7l8K0lqJ4Pk6Rj6J8K1l0jLj2L0j5Nj3JJJJM0j5Lk4K5qJ0rJR
7115B4l3JK3mj4L3l7lL6l4k3M5j0l0J3RPrk1L7k2QJ3l2K5k0J3pJ4PLJ2l9M4k2
7150GJ9j0koK2l4L2j0k8L5l0M0l1QKMk1LqJMJ5J2k2j7J0k5L6k5J9m0J0OL8nk8
7186a9K7j5L7J0o3K9Oj6NqlL6j1nJ9J1J7m2OJ9l1k9L2mj5j9K7K6k2j0j6K0oJm
$$ plain form
6918 -5 15 0 2 -6 -12 -12 -4 -13 -13 22 -9 -27 -20 -8 -4 1 0 -3 5 -9 -27 -1 38 9 6 15 9 -16 7 7 21 10 30 30 18 14 28 -9 -1 30 17
6959 17 -14 -2 -16 -15 4 3 -9 6 1 4 -5 -8 1 -4 0 18 2 -5 2 -4 22 28 -37 10 -9 16 11 9 7 -10 12 12 18 6 12 -17 -15 5 4 13 -7
7000 -7 8 10 0 -15 -6 -2 -21 -4 -2 -13 -15 0 -10 -34 -12 1 -6 8 -18 -26 -9 6 46 -16 16 -5 -12 2 -23 10 -22 8 -16 53 -1
7035 -1 19 15 17 6 10 -7 -7 -8 6 0 -14 -14 -17 -4 15 -15 -4 16 -10 4 0 -13 -19 -27 -20 -23 5 7 14 22 -17 17 22 22 20 -8 -14 0 10 15 2
7076 2 -7 -21 24 34 -24 23 -15 5 2 -6 8 15 -11 -2 -18 0 21 -9 -10 -7 -19 11 -4 1 -12 -11 -10 -9 -8 32 17 20 -4 21 13 23 14 15 24
7115 24 -9 -8 15 11 -3 30 -7 -10 26 -8 -31 14 4 -26 -13 -4 3 -6 -27 10 -12 -4 9 -23 2 -18 -5 -12 2 9 12 24 -15 29 7
7150 7 26 16 14 8 30 -4 28 18 -10 25 -5 35 4 12 14 18 -3 0 -8 -7 -3 12 24 2 -15 -5 -30 6 -19 0 -40 -30 -24 14 9 -19
7186 -19 8 -7 30 40 -23 6 12 -4 1 -7 -10 26 15 10 29 40 57 15 21 40 9 -20 12 8 -7 -26 1 27 5 -5 -21 -1 -7 -6 -10
7221a0j6K9Qk7OJj4K6Jpk9M1LJ2Kk8J2j9L2jj1j9J1j5L1j6Nmj7M8k6jj1MrOLn
7259dJ5K3k6k5K6Jj6J%j0J6NqPj6M1l2J6pRnKJK2k8k2M2l5L1j5Qk5K8l1mK9j3
7296AjK1mk4Ll0%M5Jj4mJKLpJMK8kJJ9n0J1J7j0k7K1LQJ2j5J7Jj2pk4lL2J2nl0
7337eOk3L2k0RkJ3kj1nj1K5j4%L1l6LJ8m2L1j1K2l%nmK6J1Oj4J1k2MLqNj3k2O
7376a1KK6Qk4J1Kj1k4K4kMJ0j9J0k3L5l3K2k0MJ4j1Rk8N1lj8L5o2M9NJ3k3j6J6
7411B2j1mpPL0l4k0M1%m3J0j9K4Mk9Rj2JK4J8k5L5k6j1K0mNJ2m1J7K3j7J5kjj2
7447aNK3k1jlL2Nn0L4qj5K0j9k9L8Mj5J7pRj7njJ8k2j2J0j8nK0J5j1K2l7K9J6
7483B0k3J8k7QK3J8k3kj7J7k5L5k6JK9m1J8QoK3l4MLpJ4qj7qL4kl4ML2k7Rj4r
$$ plain form
7221 -10 -26 3 11 -16 -10 -9 -23 3 4 -3 -32 9 12 24 26 -2 10 -9 23 22 11 -8 3 -12 19 3 8 4 -13 35 9 8 -3 1 -8 -2 1 -4
7259 -4 11 34 8 -17 9 10 -6 -5 -5 -15 1 6 -2 5 -11 30 -2 14 7 16 11 13 14 36 8 -14 28 -7 24 9 17 -8 20 -11 -15 14 1
7296 1 0 21 17 -7 -4 -34 -34 11 12 -2 -6 -5 -3 0 -7 -6 -2 26 24 25 44 -6 5 22 12 -15 6 9 17 29 14 31 32 20 13 -11 -14 18 30 25 -5
7337 -5 1 -22 10 -10 -1 -3 10 8 -3 -8 -19 6 -8 -8 23 -13 -10 8 -34 -3 -14 8 5 5 0 -4 22 33 39 25 36 14 18 21 13 18 5 -17 -11
7376 -11 -9 17 25 1 12 14 3 -21 3 1 5 15 -4 6 -17 18 -15 7 -13 -9 5 -6 3 -25 26 23 5 40 -22 27 32 45 22 6 22
7411 22 11 7 0 7 37 3 -17 24 24 -19 -9 -28 -4 0 -29 -20 -32 -31 -7 11 -14 21 -5 -16 4 0 5 17 -24 -7 16 -1 14 12 11 -1
7447 -1 4 27 6 5 2 34 39 -11 23 15 0 20 1 -28 10 14 -1 16 9 18 1 -4 -5 13 -9 -21 -11 -29 -34 -14 1 -10 12 -25 4 20
7483 20 -3 15 -12 -4 19 37 14 12 -5 12 -13 22 -4 -3 26 -15 3 11 5 28 -6 -2 1 -6 8 0 -17 -25 9 7 -27 -23 9 -18 -9 -23 -32
7520c2M0K6k0qk8qNL4Kj0K%K3k4NK5j2J8k0j1JJ6pKl5j9J3J6Rqjj1j2K1JL2m0
7557a5OK3Pkj0ok4K3Lj7RnJ0Jk2M6J3m3K6j7K7j3j8jj7J9%Qj7jj2M4j9j3kL4o2
7594c7P3m8NjJ3j4j8j1K4J3J0rJmL3l0K5jk4J8j0J2k3L6onj5oJ7LJk6RoMJ9l1
7631iJ3l7K2%J8k0pLL7k4Jj3J1Lk4J5K1ml1K0pL3l0L4k2J8rk2J1RPj8Q%j3L7j3
7668A8Nj5olmJ5k0j0J4JN%j3oKJ7k1J5mJ1J8j2qK1j2rK9j3J5jml1N1Pk0qqJ0j9
7707GKk4M5Ok7k6K9j4NQk7L8k2K4k7KJ2jj5j3L3j5j2K2J1k6J8l3K3K1%Pk8J1n
7742IMk3L2NKl5nJ3K0lj5NoK1l4J6%j7J6pMj4J8kK0Km2J7MK6k5kQkjj4J2oJ7o
7782A2JJ1k2ORqLK2Jl9J5J6j7kJ1Mm4J1Qj9K7k0Jj5N2l0MoK3l8J7MM%mNK8l1j1
$$ plain form
7520 -32 8 34 14 6 -22 -30 -25 9 11 1 3 3 26 2 7 32 20 38 18 7 8 24 17 19 -16 -35 -22 -6 3 -5 -6 -17 -29 -8 -7 25 -15
7557 -15 -9 14 21 19 9 3 -21 2 5 -12 -3 -8 2 3 -19 27 40 -3 23 6 33 20 2 1 -16 3 3 11 -6 -7 -19 25 6 -7 -9 25 -37
7594 -37 36 -12 -7 -8 5 -9 -27 -38 -14 -1 9 0 1 -3 30 0 25 24 0 18 8 20 -3 33 27 22 7 1 18 21 22 -4 5 -1 3 22 -9
7631 -9 4 -33 -11 -11 7 -13 -20 -17 20 -4 -3 -16 -5 -2 -26 -11 10 6 -25 -5 -12 21 -9 25 3 21 12 -10 1 10 17 -1 7 7 -6 31 18
7668 18 23 8 2 -1 -5 10 -10 -20 -6 -5 0 0 -13 -19 -17 0 -21 -6 -10 1 19 7 -1 20 8 -1 28 15 30 29 25 -6 45 52 32 24 16 26 7
7707 7 9 -15 30 36 9 -17 12 -2 3 11 -16 22 0 24 -3 -1 11 10 -5 -18 15 0 -12 10 21 -5 13 -20 3 24 24 31 3 14 9
7742 9 13 -10 22 27 29 -6 -11 2 22 19 4 9 3 24 -10 6 6 -11 5 -2 2 -12 6 4 24 26 -16 1 5 31 6 4 12 10 9 -5 7 1 18 12
7782 12 13 24 2 8 17 9 12 34 35 -4 11 27 10 8 19 23 -21 -10 -2 -21 6 -14 -13 -28 24 -6 -2 -8 15 -23 -6 -2 2 2 -2 3 31 0 -11
7821a1j0L6mJJ9j8qJ1rj3M2n0L7k7J0NmK5k2j1OlnNoJ2Nl6K5Rj0J4l1J7j1J9j
7858Hj0lj6K7mj7L8k5J9j9J7k2M1k1J7JRo1J2J2lL6l7%k1mL6Rj3mOl2L3j7mJ6
7894DPJPn0L5kJ2oj2j6K0qK6k5L0j8K1j5J2p%j9rkK2qOJ9j3j3Mq%j1K8j8K2l6
7932b0M3k8k4K2J9J0l7RJ0l4K1L2k3kJJ5jJ6l6J6jLK4k3RQpMk6j1JOJ1j9J1jQ
7969FPpl0J6mJ6nj4J8MJ9k9K4j8j3L0%l3QK1k0kJ4L1j3l5M2l1J4KJ0%j4J2qk3
8005eJ7j2K3k6j3L1j8j8QOJRj8JL2k7oNK7k1KJ3jm6N1lQk5L4pj8J2PJlrJ9k2K5
8044C4Jl6L8l2k2K1qoK0k1L0k2J6m2K3Nqj6K2OlpNj0J4pj3K3j9J1lKML2k0j8K6
8081B0mL0j4l2K6nkOpl7J6j9K5k0JJ8K0k1oL4m9JRJJ1J1j7j0J1Lj3rK1J7k3K9
$$ plain form
7821 -11 -21 15 11 12 31 13 5 16 7 -6 36 -14 23 -4 6 11 7 32 10 -1 5 2 -3 2 -4 8 13 -23 2 11 1 15 -16 1 -10 9 8
7858 8 -2 -5 -21 6 2 -15 23 -2 17 -2 15 -7 34 13 30 31 40 -21 -9 3 0 36 -1 -1 -22 -26 10 19 6 2 8 -24 9 -8 -12 4
7894 4 11 12 19 -31 4 2 14 8 -4 -20 0 -8 18 -7 23 5 26 11 23 16 16 -3 -12 -14 8 0 6 25 12 -1 3 -5 -5 -16 12 -6 16 -20
7932 -20 23 -5 -29 -7 12 22 -15 -6 4 -30 -9 23 0 -2 -1 14 13 29 -7 9 8 11 35 12 21 29 22 26 0 -11 -10 -4 7 -12 -1 -2 6
7969 6 13 6 -24 -8 -12 4 -1 -15 3 7 26 -3 21 3 -10 20 20 -13 -5 16 -4 -6 8 39 26 -9 33 2 16 18 28 28 14 26 18 -5
8005 -5 12 0 23 -3 -16 15 -3 -21 -13 -7 -6 3 -15 -14 18 -9 -15 -10 17 -4 -2 11 10 -36 15 12 20 -5 29 22 4 16 23 24 21 12 31 9 34
8044 34 35 -1 37 5 -17 4 -4 -10 10 -11 19 -3 13 -29 -6 -1 -9 -25 -3 3 0 -7 -2 -12 2 -5 -18 5 -14 -3 -6 -4 0 32 12 -6 20
8081 20 16 46 32 0 26 21 19 25 18 -19 -3 -22 3 -17 -16 2 22 1 -5 29 -20 -19 -10 -9 2 13 -4 -14 -3 0 -13 -22 -1 16 -7 22
8117B2l6K1jL0k2L4l0K1j9j4k0K2nNPk3PK2k1jJ3j3j6J3K0k9ML0Jm6LL1l2L0p
8152AlPJ4Lk8J8j1J5k1K1Rj0j0K7j8Oj3J1J5j0j2J1Qk6j2J0k3J2NJ6nkk9Nj8J3
8188b4K%L5
$$ plain form
8117 22 -14 7 6 36 14 48 18 39 20 6 -14 8 3 8 15 -8 -1 21 0 -1 12 -1 -17 -4 16 -13 -9 21 22 -24 -21 10 -22 8 1
8152 1 -2 5 19 22 -6 12 1 16 -5 16 25 15 5 32 14 20 7 18 33 23 11 22 30 4 -8 2 -21 -9 -4 12 7 5 -24 -19 -37 -24
8188 -24 -22 -22 13
8191A3
$$ Imaginary data points
##PAGE= N=2
##DATA TABLE= (X++(I..I)), XYDATA
0@%%%%%%%%%%%%%%%%%%%%%%%%%%%%%%%qJ6j6J6j6J6j6J6j6J9k7L2l2L2l4M2m8
48b4M8n3O1o5P3q1Q9r9J08j22J38j56J77k04K41k87L49m45O05r09J677o965j2223
71a8067K1106N121j1547M722O046o589R46K564o096M04N765m789m432L553r0k100
87c483K982l48j783M615J745m929K28L811j332j931Q89j32K51R69j782j234J985
104E21K48j997M2P59l90N44J98r20R08J541j051q55J192K98o89K7k57m29O23j
124C12j142J39J020m02n21L76K55j14J46j22j82M07K34l34q6K87O7j55j60j36
144a11L6J38j40k11Q9J99m3j17qJ90J24o3j01P3J02l5r2j9M6M9p8j27KJ18J4j09
170g4k9O6M3l0l8L0P6J5q3NO5J3Mo7j0K8J4o3k3%N9l2k7lO9jJ4m4M0L8l2j6j2
$$ plain form
0 0 0 0 0 0 0 0 0 0 0 0 0 0 0 0 0 0 0 0 0 0 0 0 0 0 0 0 0 0 0 0 0 -8 8 -8 8 -8 8 -8 8 -8 11 -16 16 -16 16 -18 24 -24
48 -24 24 -29 32 -33 40 -41 48 -51 57 -65 73 -83 94 -110 131 -156 193 -252 353 -556 1121 -5844 -18067
71 -18067 3039 8160 -3387 1335 7381 792 1738 4302 -1794 -1390 4375 -414 -4846 -1293 -1383 -3483
87 -3483 -501 -849 -2632 1983 3728 -1201 -973 2838 1506 -425 464 332 583 1552 -230 -1464 521
104 521 769 -1228 -1186 -427 -817 -273 -75 -995 -87 1454 403 -452 740 1038 349 376 119 -310 313 312
124 312 -830 -691 329 -73 -594 -218 37 -77 69 -53 -235 172 406 72 -14 273 340 185 25 -111
144 -111 -75 63 -77 -288 -199 0 -43 -160 -168 22 146 83 -18 55 157 122 30 11 57 106 28 -99 -97 21 35 -74
170 -74 -103 -37 6 -24 -62 -32 44 59 -24 -19 46 59 63 -4 -14 14 28 -35 -58 -58 1 -31 -58 -61 8 7 21 -23 17 55 23 7 -5
203eK5k6J1l5M1L7n7nj7O7k9l9K2J5L4k2j5k3L1J6l9Nl0K3J1oJ5Jj2ppLL4m3j5
238d1L6OJ8j8J1l0K1Nj1nj2kL0j7J0L9k7Pl1J4k7K8%oQj1PoK5n1L5K2k3K7l0k9
274b8N7l1J0lk1L0j6Qj2k3K1K2k7oL0oj8J9rpkK5l2mJ4L4j2k8KL8om4K1j8J5L
310dqPj4K3Qk0J5k2K2PKLl0J3Jj5J5jJ2k3Pl0M4Ok6j3L0%j9k2K4MK7nk6QJ8rJ6
349B5l0jNl3K1pJ2K0nJ6pj0kj2K3l7OlLK1K0l1lqK2km1N5k4J2pLJ1j0j7L5k5K3
387A8qqj3Mj1MPqK4polnlJ7j0Kk1M4Mqj5QnqK5j2J1j4Nqjj1Rj1J2J5k9POJ9j8
429bj8J7j2oK6LPk9mM3n2L7Qj3j9j8M1lj1Mj4NM7p5N7k8J2pJ3%j2jj3K9lLj1j4
467a3LK0%m2J8K5Lkj3Mj8J6K5m7j6L4j8L3J4l2Rj1kOjj0J5J5k2kjj3K5k0QjpK1
$$ plain form
203 -5 20 -6 5 -30 11 48 -9 -14 -31 36 7 -32 -10 5 39 17 2 -21 10 26 -13 -8 -38 -15 -4 -10 5 6 -6 -13 -20 -17 17 -26 -41
238 -41 -5 1 19 1 12 -18 3 8 -3 -8 -20 -22 8 -9 1 40 13 20 -11 3 -24 4 4 -2 6 -5 2 -4 21 -30 5 27 4 31 1 -28
274 -28 29 -2 8 5 -16 14 -2 6 -6 -29 -8 14 -13 -19 11 5 -13 6 -3 -10 -12 13 -19 -23 -9 25 13 -15 -13 25 19 -25 -4 -22 -7 -4
310 -4 -12 -5 -19 4 12 -8 7 -15 7 14 16 19 -11 2 3 -12 3 2 14 -9 -2 -32 12 18 -8 -21 9 9 -10 -32 -8 -4 23 18 -8 0 18 9 25
349 25 -5 -6 -1 -34 -13 -20 -8 12 7 23 16 6 4 -8 15 -22 -16 -19 -16 5 25 -6 -9 -17 5 3 -38 17 -7 5 -2 1 12 2 -15 20 -5 18
387 18 10 2 -11 -7 -18 -14 -7 -15 9 2 -4 -7 -12 -15 2 -8 -6 -27 17 21 13 -2 6 1 -7 18 6 17 3 8 0 -1 -12 -3 -14 -2 13 -16 -9 -3 16 -2
429 -2 -20 -3 -15 -21 5 8 15 -14 -18 25 -27 10 18 5 -14 -32 9 6 -5 -1 -15 -10 37 -38 19 -9 3 -4 9 9 -3 -4 -17 12 9 12 1 -13
467 -13 -10 10 10 -32 -14 11 14 12 -1 3 -15 1 26 -21 -37 -3 -21 12 26 -6 3 -8 -10 -4 -5 -15 0 15 -7 -9 -10 -23 2 -18 -10 -11 -18 3
505CJ5m2J5RJ9k1mJ3lRrk3L8kNj7j9K0k8Ql2M1J3j8K5qk2%K8k7J4K0ml6K5OJJ0
543B2Rjj1j8p%j5K0J6j8j0QQRj7J0j3L3j4ok6j1N0j1k9MJ2J4K1n1N0l2J0J2m5
578b7M5l4J7J0Pl0J0J1k5L0l8J2L7m0jK8k3PNpK0Ol5J5nK0j1J2kj3L3n8L0mj5
613a3RL5k1l4N0k8j1L1j7J7l1MKMLoL8m5j0K8jrNjmj7J6nqJ9j2k1M7%l4J2Mj1
651a5L1%k7JL0m5L1j0J6j4%ok6K6j7K7NK0l5J9J6j0J3j1Nk4j7J7j9jK1Kj9K7P
686A8jj3j1K2Krk8J0J6nJ2k6J9j5K0k9K8j5mmQnoK0J7k8mj0N0l1k5M4k0K0k1K3
722A9k4JJ4k4NK7l5K8jj8J4j4J4Nm2N5m4J0K7j4j2L4k8K4pl3M6j6j3Rk5J9jl1
756c1K5L6n4M6m0L4j3j3J9J1j3J6j6qj2j8L9J3kl4mK2j1kLrM5m7NOK2k6K5pj9
$$ plain form
505 3 18 -24 -9 0 19 -2 -6 7 4 13 4 -19 19 17 22 5 -14 6 -22 -14 -46 -5 8 -10 15 7 -15 -15 13 -14 0 20 16 -20 5 11 12 22
543 22 31 30 19 1 -6 -6 -21 -1 15 -3 -13 -5 3 12 -5 5 -8 25 11 5 -21 -32 18 7 -22 -18 -6 8 29 -22 28 -4 6 18 -27
578 -27 18 -16 1 11 18 -12 -2 9 -16 14 -24 -12 25 -15 -16 12 -11 -4 1 -6 14 20 -15 0 -5 15 4 16 14 1 34 -24 6 2 -13
613 -13 -4 31 10 -24 26 -2 -13 18 1 18 -13 -9 -7 -3 0 -6 32 -13 -23 5 4 -5 0 -1 -5 -22 -6 -11 -19 0 -12 -33 14 14 -20 -8 -4 -15
651 -15 16 16 -11 -10 20 -25 6 -4 12 -2 -2 -8 -34 -8 -25 2 7 27 -8 11 27 17 30 19 24 0 -17 0 -19 -20 1 3 -16 11 18
686 18 17 4 -7 15 17 8 -20 -10 6 1 13 -13 6 -9 11 -18 10 -5 -9 -13 -5 -10 -16 4 21 -7 -11 -21 29 -2 -27 17 -3 17 -4 19
722 19 -5 -4 10 -14 -9 18 -17 11 10 -8 6 -8 6 11 -31 24 -20 -10 17 3 -9 25 -3 21 14 -19 27 11 -2 7 -18 1 0 -31
756 -31 -6 30 -24 22 -18 16 3 -10 9 20 7 23 7 -1 -13 -31 8 21 19 -15 -19 3 -8 -10 -7 -16 29 -18 -13 -7 15 -11 14 7 -12
791a2kJ5j0pjK2nJKJ6k6K6pRlk3j2jK8pRk2J4Nkj3J4m8L3jO2p4J0%K5l3NrL8j9
831cmJ2KK3o2L1OQk1OpK3m5M6k6L4J4k5m1N3j1k4lK4KnNkk7j1PK4k4M3k3Lk4L7
869A5k8K2l7K5L2k8j3L3J3l0%qJ3k2K5j8J5j2j1K6n2K7M7l5L8Pm9JMj4OJ9qJ1
903A4k4pM5l8K6rl1L1J6j2lrJ1j8K2pMo%J5qMj2J5j8j8L5mlRk5J4j3Qk0J3Lk4
941b4pL0jJ7j8oRj4kJ4J1k2K7k7K9Rl1J7J4Nj0l3kpJ9jM0l2qJ2J9k9Qj4K6j4N
978Ij1k0J4J1l2QL8l9j6M2j0ooK7k3J0j3oK1K5jk7LjQk1K7nJok7L1k3L2l5L6j5
1015@loK5k0k0L2l4L7njLPl5J8m0L6lLJ8k4L8Kk5J0kJ9l4qmOK0LllQj4RJl5L1
1055Gkj%pK7k8mPj3nNjK4j0NJ2m2NL1j9K0k9K1Ok0K2Ln1K3J1j6J3J4j6K9j7JJ
$$ plain form
791 -12 -14 1 -9 -16 -17 5 0 1 3 19 -7 19 12 21 18 -5 -17 -18 10 3 12 -10 4 9 7 -6 8 -40 -7 -8 54 -20 -10 -10 15 -18 -13 -22 16 -3
831 -3 -7 5 7 30 -32 -1 5 13 -8 -2 -9 14 -31 15 -11 23 37 12 -29 24 13 -11 -14 10 12 7 12 10 -17 -28 -21 3 -21 22 -1 2 -22 15
869 15 -13 9 -28 -3 29 1 -12 21 34 4 4 -4 9 -13 12 -6 9 -3 -14 12 -40 -13 34 -1 37 44 -5 -4 0 -14 -8 11 3 14
903 14 -10 -17 28 -10 16 7 -24 7 23 11 8 -1 10 -8 14 7 11 5 5 20 12 16 4 19 1 -17 18 14 11 20 -5 9 -4 4 -16 -3 0 -24
941 -24 -31 -1 -2 15 -3 -9 0 -14 -16 -2 9 -13 14 -13 16 25 -6 11 25 30 20 -13 -15 -22 -3 -4 36 4 -4 8 27 -2 6 -8 18 4 9
978 9 -2 -22 -8 3 -29 -21 17 -22 -38 4 -6 -12 -18 9 -14 -4 -17 -23 -2 23 22 -5 -2 -3 5 -16 11 6 7 1 -26 5 -18 14 -21 15 0
1015 0 -3 -9 16 -4 -24 8 -26 11 6 5 8 15 -20 -2 -42 -6 -9 -6 12 -12 26 28 3 13 11 30 -4 -12 -16 -10 10 13 10 7 15 1 10 11 -24 7
1055 7 5 4 4 -3 24 -4 -8 -1 -14 -19 -14 -15 9 -1 4 16 -26 -21 10 -9 11 -18 3 9 -11 11 14 -37 -14 -3 -19 -6 8 -8 21 4 5 6
1093FJ3j2pj2L1l9oJ3J0Oj6M0j7j6K3j7j9MK2Pk4OL0l8J5j2QRPk2PQj5K2k7J6
1129Dj7L0K3m2J5njppM8n1J7RpKJ3k5j3K6j1j9K2J9k0NPm2N0mk2K2pj7l%J3Nq
1167B%K0k6N%k0pK5j9jK9pK1l1j0J9J9m0K8k4L1k8J8j2pNJ1J1j7J2k2J8k0L6m3
1202b4j8J6OL3k8J5JLnPl5N5rj5j6kK4j3mK0jk8L0J3k9LpJ8Rj6%k9J9J7j0qJ5
1239Gk1K2k8L4j0j9K1j6J1k8M7j5oQQOmJ2m4K9j6kKk5J4jL3m5J2K3l1pL8pj1J
1275hlJ1Nj7jK7Jl3MmRK0m5M8qlNqQoj5K6j7NJ5L3n7oL0m4J9PrJ5Ok1L2k5k5N1
1315B2j1j7M2n4K3j8K4k1lqJ1JL2k7M2m1k0K7J6rk9J6qK3jrk2K4JmJ9k3J0J0j9
1350apj8K5j6L2j7j2nK1K%K9k3j0k2J5K1m3L5k2J0L0k3mJj1K7l4L3k7L0k9J1K
$$ plain form
1093 6 19 7 0 -12 19 -20 -26 -13 -3 3 -13 27 10 -6 17 0 -19 -15 7 14 -10 -4 26 -12 3 -9 -1 8 15 -7 0 8 -7 15 -12 4
1129 4 -13 17 40 -2 13 8 7 0 -7 41 -10 7 16 9 11 24 -1 -14 12 1 -18 4 23 3 8 15 -27 23 19 -3 19 12 -5 -8 -8 5 10 2
1167 2 2 22 -4 1 1 -19 -26 -1 -20 -21 8 1 22 -9 -19 0 19 -21 7 -17 14 -14 4 -8 -15 -10 1 12 -5 7 -15 3 -17 19 -24
1202 -24 -42 -26 -20 13 -15 0 1 4 -1 6 -29 26 17 2 -14 -16 8 -5 -9 11 10 -18 12 25 -4 -1 -8 10 19 3 3 -26 -7 10 0 -8 7
1239 7 -14 8 -20 14 4 -15 6 -10 1 -27 20 5 -1 7 15 21 17 29 -15 14 -2 -4 -2 -27 -13 -14 19 -26 -14 9 -22 -29 9 2 -9 -8
1275 -8 -11 0 5 -12 -13 14 15 -18 -14 -18 -9 11 -34 14 6 3 8 0 8 2 -13 13 -4 1 16 49 -8 -14 16 -28 -9 -2 -11 4 10 -11 21 -4 -29 22
1315 22 11 -6 36 -18 5 -13 11 -10 -13 -21 -10 -9 23 -4 38 -3 -23 4 20 11 -18 -2 -10 13 12 3 -19 5 6 2 21 -2 8 18 -1
1350 -1 -8 -26 -1 -17 15 -2 -14 -19 2 4 4 33 10 0 -22 -7 14 -29 6 -16 -6 24 1 -3 -2 -13 14 -20 13 -14 16 -13 -2 0
1384@J1j5Jj1MK0k3K3Mrj5J1k0K1k5J3k3L3qJ4j2J6k3L2l0MrJ2PnjlNRqrL1m5
1422b3N0m2M0j4j4j3J3mK1jNl3nJ1L0n0K2J5j8nNK1l1QlJ5kl3K9K6j9k0LK9k2
1457ij2N4l4j4K1k4J8j3k4K4lK0jLQj7Ql1K8pKPMm4L4J3%k2J0j0J6l0K0J8l5K6
1493Dk3L0l2jM5k1j7K5l7J4J5JK3l4rK0j9M7k3jj0L3j9k3K8l2Mj6M7m2K6K7p8
1526d8P7m9L5qK2k9j5J2k7K4l3P1l2JOj2MJ7nj6%j3jK6l5J3J1J1k3K7j8L5m1K9
1560A6j9plLL1j4qk0L4k3PrlNj3nK0Ok1L8Oqjj7oN1n2NQK8n1K7k1mJ1j8K4pJ2
1599BKK4m6J4JjNpl0K4j3J1L2oLOm6qK9oj4OMk4M3LMk6L8kJ1n7L8NJrk1L4j9J6
1639B1j0j7PPOl9J3NK3m2NM9j9j4J3k7J2J0qj5J6k8L0J7J5k8J5n6O1lj2Lk1rK
$$ plain form
1384 0 11 -4 -3 -14 -10 10 -13 10 14 5 -10 1 -19 2 -23 -10 -33 0 -8 6 -6 10 -13 19 -11 -7 -16 -4 3 -2 -3 -6 -1 8 0 -9 22 -23
1422 -23 27 -15 25 11 -3 -16 -3 -7 14 13 18 -15 -20 -9 21 -29 -7 8 -10 -15 -10 11 -20 -12 -15 0 -2 -35 -6 20 1 -19 -16 13 -9
1457 -9 -21 33 -1 -15 6 -18 0 -13 -37 -13 -16 4 3 6 14 -3 5 -26 2 -5 -3 4 8 -36 -2 11 11 -11 -1 -11 5 -25 -5 13 -22 4
1493 4 -19 11 -21 -22 23 2 -15 10 -27 -13 2 3 26 -8 -17 3 -16 31 8 7 -3 30 11 -12 16 -16 -12 -28 19 -23 3 30 -48
1526 -48 29 -20 15 7 29 0 -15 -3 -30 -6 -39 32 0 1 7 -5 -1 16 11 -5 -5 -18 -19 7 -28 -15 -4 7 -16 11 -7 28 -13 16
1560 16 -3 -10 -13 -10 21 7 -1 -21 13 -10 -3 -12 -15 -10 -23 -28 -8 -2 -23 15 21 13 12 -5 -11 40 -12 -7 1 29 -22 5 -16 -20 -9 -27 -3 -10 2
1599 2 4 28 -18 -4 -3 -4 1 -6 -36 -12 -25 -14 18 12 15 21 -25 -33 -4 -10 -24 -18 -14 -38 5 8 12 -14 24 22 33 -24 14 19 20 11 -10 24 5 21
1639 21 11 -6 1 8 14 -25 -12 -7 16 -26 -21 28 9 -5 8 -19 -7 3 -5 -20 -4 -32 -2 15 30 2 17 -39 22 19 7 10 -11 -20 -18
1674a8K1l5M7Lj6kknJ4j9rK3j1j1K1Rm1M0kLpk6L8j2j0OmK1k5RQoj5M0k0pJ6j9
1712ck3K2kK4j8RrkK3jj1j6k5L4Pk1J2k0J1Oj5OJkQl0L7jkj9J0j8L1pOl0K0J9
1750A1j3J5pjnJ8l7K6jjj8lK1pk1LL4pJKrj5J6Qj8jnLLL2l4lj1MK2J4nk7L5kj4
1791Cj4J0Ol8M6%rJ0j9L5pk1j1Rj9K6l7KL7j2j7M1l7qL0k0J3j8J2oML2Ol2qrJ0
1828a0j0J4L0k4J5j5MKrjlj3K2nJ1j4J7k1J0J0K3m9J3%nJ7k6J6J6j4K4j5oj3J0
1863Aj7K8k2j5K3RrJ8k7kK2Lk2K9j6J0k6mL1j2jrmRj3NJ2j0K4KJ8l1M%kj9KPL1
1902B7j1qk4NK1Jl8K5mj8K1lKQJ2rNkll2N5m4L5k2J3j2%Oj6mL2nk6K1l2j4K7K6
1940A5l6L3l9K2j0jpnJ1J0%Nj1mK7J1j3k4MQM1o3N4k8nLK8k4j8J9KJ7llrj0J2
$$ plain form
1674 -18 3 -32 15 18 2 0 -2 -7 7 -12 -21 2 -9 -20 1 10 -31 9 7 10 3 -23 15 3 -7 -1 -5 16 -9 0 8 2 -13 27 7 0 16 -3
1712 -3 -26 -4 -6 18 0 9 0 -2 21 20 9 -7 -32 2 9 -12 0 -20 -9 -3 -18 -12 -11 -13 -5 -35 2 1 -1 -20 -10 -28 3 -4 2 -28 -8 11
1750 11 -2 13 6 5 0 18 -19 7 6 5 -13 -16 5 -2 -23 -20 14 7 8 10 1 -14 2 10 -8 -9 -14 -11 -8 24 -10 -13 -24 -20 2 16 11 -16 19 17 3
1791 3 -11 -1 5 -33 13 13 4 14 -5 30 23 2 -9 0 -19 7 -30 -28 9 -3 -20 21 -16 -24 6 -14 -1 -19 -7 -13 -9 23 29 -3 -11 -20 -10
1828 -10 -20 -6 24 0 15 0 4 6 -3 -4 -7 -20 2 -3 8 -6 11 -10 0 10 33 -16 -3 -3 -8 9 -17 -1 15 1 25 10 4 -9 1
1863 1 -16 12 -10 -25 -2 7 -2 16 -11 -13 9 12 -10 19 3 13 -13 -17 14 2 1 -8 -12 -3 -16 -11 1 -9 15 17 35 4 8 8 6 -13 -11 -4 27
1902 27 16 8 -16 -11 10 11 -27 -2 -6 -24 -3 -6 -4 4 16 7 12 10 7 -25 30 -14 21 -1 12 0 0 6 -10 -14 18 13 -13 8 -24 -38 -11 15
1940 15 -21 12 -27 -5 -15 -16 -23 -28 -17 -7 -7 -2 -13 -17 10 21 8 -16 -12 -4 37 -26 28 0 -5 -2 26 2 -16 3 5 22 19 16 7 -3 9
1977IOk0J1l0J8oL3l7L6l8KRJ8kk9QMpJ7k3L1n0L7N%kJ4l2oK0jJ0k2J0j8J8QJ9
2015B0l1k5M1J2j2j1j7L6m8N8o0N1Qn7M4m7L6J2J4k1j9J1J7k4MJ1m7K2%j1M1K2
2047C0j3pOk1PPj5K2j3L0l0J6l4J7j4M6l5oJ6JOl5L9j3Ql6K7k6K3pJ0k1J2NRL
2083A4j6J1o3M1mJ1Lj7L1jl5L8j4j4j8K0J7J7Qnk0J3pj6J2j3qK4pk8J4K0k7oL5
2118A0l4M1k0NlQj8J8oNj1%RRlNqk8L2k7K0J3m1J6J3k7K4Kj3NJj1M2j2l7K1pq
2156a5J%L0k1nJ1J4j9LJ1j0j1J9rL2l8j4N4n5K1jOj4L6j7Ok7J7jj7K9l7K8%j2
2191ej6QK0K0l4J4Nj4JqMK1rJ4%k0K9n7L7JJ2pj7Pk5qJ6L2j4j9OJ0k1K9l8J0J7
2228AJ2J9l2jj4k9O4k8pK2mJ2Ll1LMj7J9K2k5J3J3l6J1J2l3L0%JJKJm4M9j0nP
$$ plain form
1977 9 15 -5 6 -24 -6 -12 21 -16 20 -18 -16 -7 11 9 -20 -12 -8 -15 2 -21 10 -40 -3 2 2 0 14 -18 -24 -4 -5 5 -17 -7 -25 -7 1 20
2015 20 -11 -36 5 17 5 -6 -23 13 -35 23 -37 14 22 -35 9 -38 -2 10 24 3 -16 -5 12 -12 -8 3 -44 -22 -22 -33 8 30
2047 30 17 10 16 -5 2 9 -6 16 3 33 3 19 -15 2 -12 34 -1 -7 9 10 16 -19 20 7 15 -21 6 -20 3 -4 6 -15 -3 2 11 14
2083 14 -2 9 -54 -13 -17 -6 -3 -20 11 10 -25 13 -1 -15 -33 -13 4 21 29 24 4 17 10 -6 6 -7 -15 9 2 -26 -12 8 -19 -25 10
2118 10 -24 17 -3 2 -1 7 -11 7 1 6 -5 -5 4 13 10 15 7 -21 11 -16 4 17 -24 -8 5 -22 2 4 -9 -4 -3 -14 28 16 -21 0 -7 -15
2156 -15 -14 -14 16 -5 -10 1 15 -4 -1 10 0 -11 8 -1 31 -7 -21 33 -22 -1 -2 4 -10 26 9 15 -12 5 4 -13 16 -21 7 7 -5
2191 -5 -21 -13 7 27 -7 7 12 -2 -1 -9 -5 16 7 21 21 1 30 -27 10 11 23 16 -1 6 -19 -27 -11 21 7 -12 -6 4 -17 12 -26 -16 1
2228 1 13 32 0 -1 -15 -44 20 -8 -15 7 3 15 18 -13 -10 -6 -23 -4 18 -7 6 19 -17 -6 6 -27 3 3 4 5 7 8 -36 13 3 -2 5
2265EJrNMK3j9j9K4j4rL4k4j5PK8ok5K1k4K4m9K5oJ6QkJ4m4K8Pj2rK9j5K2n3M4
2302A5k1j9K6J4j4J6k1J6K1m0j0j7M4Pk5J3k9J7K6j4j4J9j1J4J%kl0pL1j0kJ3
2335Gj0opJ1L5kk8OJ3Jpj9J9jkPk0kJ4Ork6L4k0K8j6J0l6K7Kk2LJJ5Kqjk8nJ3
2375b1rM9k7nkj5L4Qk4Npj8J5qJ7J9j0KJ0j5J1K3m7L5rlJ0j0Qn4L5J6k2J6Lj8
2411hnJ7pk0J3mJ9k8L4j3k0L3k0J6pRK4k2nQK4n5%L4l7KK0ljj7ML3l8M0k8%J7
2448Ik2L0k0Pj3Pj3mJj1K8qJ9Qj2J7l4JK0J3mpj2j1jJ9j1nj3J5J6Nj4QKj2K6k0
2486DKj7J6L%j2J0j6L9n6KJ4nL5l9K2Mjj7pL2j7J0j6K3J8j1kKj9qJ5kj2RMJ1j6
2524BlJ5k8M1j8k2j7J8KJM0j6j2oJ4oj0KlmJ8l0L9k6J3j5K5Nm5QK1LQRn2J0K1
$$ plain form
2265 5 6 -3 2 6 29 10 -9 15 1 -8 26 2 -13 -6 22 16 -9 12 -12 12 -37 -12 -18 -2 6 4 18 -26 2 9 -3 -12 17 2 24 -29 15
2302 15 -6 -25 1 15 1 17 -4 12 33 -7 -17 -34 10 17 -8 5 -24 -7 19 5 -9 10 -1 13 14 14 12 -18 -25 6 -4 -6 7
2335 7 -3 -9 -16 -5 30 28 0 6 19 20 13 -6 13 12 10 17 -3 -5 9 15 6 -20 14 -6 22 6 16 -20 7 9 -13 -10 -9 6 8 0 -1 -29 -34 -21
2375 -21 -30 19 -8 -13 -15 -30 4 12 -12 -7 -14 -32 -17 -25 -8 11 1 3 13 -2 9 32 -15 20 11 8 18 8 16 -38 -3 13 -9 7 10 -8
2411 -8 -13 4 -3 -23 -10 -14 5 -23 11 -2 -22 11 -9 7 0 9 33 11 6 14 38 -17 -17 17 -20 -18 2 -1 -2 -19 -15 18 -20 20 -8 -8 9
2448 9 -13 17 -3 4 -9 -2 -15 -19 -18 -29 -1 -9 10 18 6 23 -11 -10 10 23 19 12 0 -11 -12 7 -4 -9 -22 -7 9 14 0 8 10 -2 24 4
2486 4 6 -11 5 8 8 -4 6 -10 29 -27 -25 -11 -16 19 -20 2 6 5 -12 -19 13 -4 6 -10 13 31 20 18 20 1 -7 8 6 -6 3 7 18 2
2524 2 -1 14 -14 27 9 -13 -30 -12 -10 -9 31 15 3 -3 11 5 -5 -3 -6 -10 8 -22 17 -9 4 -11 14 19 -26 -18 3 6 14 23 -29 -19 2
2561Bnj2nL2LpRj5j2PK5l4J4j2rpL1J2l0k4L3J3MOk5k1L1k3K5qJ0K2m3K6Qj6j2
2598gK4NoqJj1%J6qj6J1L2l6j0%M6k6J4k5j3L6k4krK0OoJ0Lj8k2J1qM4l9J9J4
2635A8qpk3J0lmJ5jmN%Rj6J9lk1K4K5k8j6M2l8OK3n3K5mJjLnK0qjK4k8J0rJ6j6
2675bK6j4pol4N1k5K3j8j5M8k8lJqJ1LJ0l9K2Oj1PQj9K0nj7J1l2L9Pj4Npl4L3
2712gMJ1Ljk0Mj4K9pj4K2rj0J4PQk8PLk6K7J5m3K9J1k3J6j3nK4l0J0LqK5j7qK1
2750A0m0L8lKOm6K0RKMk0Lk7K3L8k6K5l2lM4j5oJ8j0J1k7%k2MKOJ5NkQk9%j6M3
2789A2k4Nj7L3m0J5K5J1j3J2J4n5M7m6L1kj2J8j6K5k3j2lL3l5L1J1l9pL2k9Rj6
2822b5nJ2K0qK1kk6PpJ9j9nmpL2Oj1mJ2j0KJ6j1plkM6n4J8oOMj1K2qJ4k9lL5l1
$$ plain form
2561 2 -3 -15 -20 12 15 8 17 2 -10 -3 22 -12 2 -10 -19 -26 5 17 -13 -37 -4 9 13 19 -6 -27 4 -19 6 -2 8 30 -13 13 21 5 -7
2598 -7 17 22 16 8 9 -2 -2 14 6 -10 1 33 -3 -13 -13 33 7 21 -4 -17 19 -5 -7 -16 4 10 4 14 17 -1 -23 -12 -20 24 -15 4 18
2635 18 10 3 -20 -10 -13 -17 -2 -3 -7 -2 -2 7 -9 10 7 -14 10 35 7 -9 33 -5 1 24 -29 -4 -8 -7 -8 -5 -10 10 2 1 25 -3 7 -2 14 -2
2675 -2 24 10 3 -3 -37 14 -11 12 -6 -21 27 -1 -4 -3 -11 0 3 13 -26 -4 2 -9 -2 6 -13 7 2 -15 -4 -36 3 10 -4 1 -6 -40 -7
2712 -7 -3 8 11 10 -10 -6 -20 9 2 -12 10 1 -9 5 12 20 -8 -1 2 -24 3 18 -25 4 15 -8 8 -5 -10 14 -16 -6 -3 -11 14 -3 -11 10
2750 10 -30 8 5 7 13 -33 -13 -4 -2 2 -18 -15 -42 -19 19 -7 18 -14 -17 27 12 6 24 14 25 -2 -2 -24 -20 -18 -12 3 8 6 14 -15 -15 -31 12
2789 12 -12 -7 -24 9 -31 -16 9 20 7 19 33 -22 25 -21 10 8 -4 14 -2 23 0 -12 -15 18 -17 14 25 -14 -21 11 -18 -9 -25
2822 -25 -30 -18 2 -6 15 13 -13 -6 -13 6 -13 -18 -22 -29 3 9 -2 -6 6 -4 -2 14 3 -4 -7 -9 37 -17 1 -5 1 5 -6 16 8 22 -7 -10 25 -6
2862fj1%J0lJ3oJ3j7J4jj2kmK7l7RJ2Km1L9Ok8QlK3k9%KL3k1K7k5J5j7ORpmk9
2901c5L2L1Jl4nJ8j8Nk0K4L2l8J0j4j5K9j5nL7Pm3L6j9j1J2j5QOkK9l1J8pJrJ3
2937A3lOj3KJ8j3j3L7m5J5QLNnk0J2%roM0n7K6k7J5rKJ8lLjQj1Mjj3KmJ0KJ4K1
2978C1m7K3k2J8kj4J1J6l3j4L1lK5j1n2K5M1pMk1j1K9j6jJ4Kn3K3pK3JQk9J3p
3013a2J3L5l5rRj5PQnj3M1l2L7m1J4k1L7LrpnqnPL0o0M4l6L6J1m1J3n%jL3k7J7
3051HJ4m5K3MnjM2o0L2k6jL2j1Rmj1j6N3m0K3Ml0K9m1QrK3j5oNJ0KQjrj6L2nj0
3090aj0J0K1Pj7kqk7K6mJ4j5JPJ1oNm7K4qN6m0RJ6m0J9K0k0%jOJ0Lj0j4Jl0L7
3128CRl0MLJ4K3j1llmpJ5l8L1lLl1NJ7jkjL2j7j1QJ6k5j8J4j2J1OJ4Qk9j3L1q
$$ plain form
2862 -6 -17 -17 -7 -10 3 -3 10 -7 7 6 -6 -8 -12 15 -22 -13 -1 1 -40 -1 5 -23 -15 -18 5 -24 -24 -22 11 -10 17 -8 7 -10 -4 5 -2 -6 -35
2901 -35 -3 28 29 -5 -10 8 -10 -5 -25 -1 31 -7 3 -11 -26 3 -12 -17 20 27 -16 20 1 -10 2 -13 -5 1 -1 28 -3 15 8 9 0 13
2937 13 10 16 3 5 23 10 -3 34 -11 4 12 15 20 15 -5 7 7 -2 -8 32 -25 1 -26 -11 -20 -18 0 -3 0 -1 7 -4 0 -1 -14 -12 -16 -6 -4 10 31
2978 31 -16 7 -15 3 1 -13 -2 14 -19 -33 -2 -5 20 9 -43 -18 23 16 20 -1 -12 17 1 0 14 16 -37 -14 -21 2 3 11 -18 -5 -12
3013 -12 1 36 1 -8 1 -14 -7 1 -4 -17 24 -8 29 -12 2 -19 18 21 12 5 0 -8 -13 -6 24 -36 8 -28 8 19 -22 -9 -14 -14 -15 18 -9 8
3051 8 22 -23 0 4 -1 -2 40 -20 12 -14 -15 17 6 15 11 0 -16 37 -3 20 24 -6 23 -18 -10 -19 4 -11 -17 -12 -2 0 8 7 -2 -18 14 9 -1
3090 -1 -11 -1 20 27 10 8 0 -27 -1 -5 9 -6 -5 2 13 7 12 -35 -11 -19 37 -3 6 22 -18 1 21 1 1 0 6 16 19 9 -5 -4 -34 3
3128 3 12 -18 -14 -11 3 26 15 12 9 5 -2 13 -25 6 3 6 -25 -20 -3 -4 -6 -7 25 8 -3 5 21 -4 -22 -8 -20 -9 -3 11 19 -10 -23 8 0
3167@j9MOL4k3rJ3k8K8k5jL3ll8L7qj1L0j7knLLK4qj0nPn1L2j3K4mpQk8M3om1
3206c3%K8l0L6Rj9J3Pj1k7NJ4J0Lk1J0k0J3J7Qk3J5j1J6rJ4j9J5K4k7ojmQj6J7
3242EpRk1K4Nk4OJPm0K3K3m0K4qLJ9k7lM0ol4J7JMJ%pJ5k6J1QkmL9j6nj9j3K2
3282EPpMomRj5L0l2j8L8n1K9Rl1J4N1m5pL8k4Nj4N2k4j4%K0j7J1QqJk2pM4m1L3
3320B1Jk5RJ9l0K2k7RJ8k8K0j1k5L0j4N7k7j7JJj4j2J6nJ0K6l6K4l0QK1%j4k9
3354c1K5K6l6K5mOqj1L0j4K2ll6J8j4J7Mpk2L0j3k0rL8J1k7K4l3QK4l5J0J2l4
3388b7KK7kJ5j1OjJ8%qnj5j0J6J3l1L8k8J1J5k2Q%Plk2Pl7L9J7qj0J4l4J6Lj5
3425a7mNK4j7qK1mKj9K8j2K1k2j0nL5j6jJ5Lj8J5J9j8k0POJ0n%k8J3PPm6J8J4
$$ plain form
3167 0 -19 -15 -9 25 2 -7 6 -22 6 -19 -20 13 10 -28 9 1 -10 20 3 1 -4 -1 2 26 18 8 3 10 -41 -9 -22 2 -2 -9 -1 -29 14 8 -33
3206 -33 -33 -5 -35 1 10 -9 4 11 0 -27 -22 -8 2 5 -16 -6 -26 -13 4 12 -11 4 -7 9 0 14 -5 10 34 7 1 0 -4 4 -12 5
3242 5 -2 7 -14 10 15 -9 -3 -2 5 -35 -12 11 -29 -5 -13 -10 9 -18 -21 19 13 -21 -4 -3 1 2 2 -5 10 -16 -5 3 1 -3 36 20 15 -4 -17 5
3282 5 12 5 9 3 -1 8 -7 23 -9 -27 11 -40 -11 -2 -33 -19 32 -13 -20 18 -6 -1 -15 37 13 -1 -1 19 2 13 21 13 14 -8 -15 29 -12 21
3320 21 22 -3 6 25 -5 17 -10 -1 17 -11 9 -2 -27 3 -11 46 19 2 3 4 -10 -22 -6 -11 -1 25 -11 13 -17 -9 12 12 -2 -31
3354 -31 -6 20 -16 9 5 11 3 -8 22 8 30 27 -9 9 -5 12 16 9 -13 17 4 -16 -25 13 24 -3 21 -12 -4 20 -15 -5 7 -27
3388 -27 -25 2 0 15 4 10 9 27 27 19 14 -1 -11 5 18 -13 25 -3 8 23 1 9 9 16 13 -9 -2 -39 0 17 9 -1 13 -21 -5 -2 -17
3425 -17 -21 -16 8 -9 -17 4 0 2 -17 11 -1 20 -2 -12 -17 18 2 1 16 19 1 16 35 17 -3 4 10 20 15 15 -13 0 7 14 -32 -14 0
3462@jmJ1J1n0M5qk6K7oJpJ0j7K0K5m9J2J4j4kNjKj2RK5n1M3J4mPm6lML7rj0N
3501Gj1j7J5nK0j7j1J5j6K4k6K5J2j1LkqpoL5rMJ8m7K0mkJJ5lj5L5k6k6OLlJ2
3539bNmlJ4RJ4m8jKj9J1LK6J8pn8N0j8k3oM8l6J9mrOK6j1J2j1j1jj1K9MJnnj6
3578a2K4mMl2J1L1Mkk9j4K6k9J0mK7n1L7L7l7J6J5k0l2L4j0k2M6l5llJ5k4L9k4
3612a1J2NK7j4rNm3K4J2j8j9K0K3Kj9MPk2J1RJj3K5j8KnK0Jl7LOj0L0J5l5K4J7
3649C2j7J2rl0J1K1pj9J2QnmJ7k3j8L0NLPk1%Poqqk3K8m%j3J8PJ8j5j1%k7J5K1
3688DK3j6n%jj8N%J4LRJ4m2J8J9m9J2J4llmJ3j3jJ6k8K5oPl4M4mKk1pL7k7J0N
3727A2k9kj8N0pk8O5j4k9%l7K6J0oj8L0PNJ3l4MQpk0J8Proj6L5j3k1L9j6j9J1
$$ plain form
3462 0 -1 -5 6 17 -33 12 4 -22 5 -1 0 -7 3 -14 6 31 -18 -6 8 -6 -8 -3 -4 -2 -14 -5 20 -31 12 26 22 29 -17 -20 -16 21 12 2 7
3501 7 -4 -21 -6 -11 9 -8 -19 -4 -20 4 -22 3 15 4 7 5 -3 -10 -16 19 10 14 32 -15 5 1 -1 0 15 12 -3 32 6 -20 -14 -11 -14 -2
3539 -2 3 -1 -4 10 19 33 -15 -16 -14 -33 -22 -19 7 25 18 -40 10 -8 -31 -37 11 -25 -6 -10 -19 -13 13 2 14 3 -8 -9 -20 9 13 14 9 4 -12
3578 -12 12 8 12 -20 -9 22 26 24 -5 -19 7 -22 -12 -16 11 -40 -3 34 -3 13 28 8 -24 10 0 -22 24 -11 -14 -17 -2 -26 13 -11
3612 -11 1 6 33 19 10 15 -28 -4 8 -10 -29 -9 14 16 -3 1 8 -14 -3 6 7 -6 19 1 3 -2 18 19 -18 -15 -9 -19 11 26 -9 15 32
3649 32 15 27 18 -12 -1 20 13 -6 6 14 9 5 22 -1 -19 11 16 19 26 5 5 12 6 -2 -10 -33 -5 -9 -9 -22 -4 3 21 6 -5 -5 -32 -17 4
3688 4 27 11 6 6 5 -13 -8 -8 6 9 18 32 -10 8 27 -22 -10 4 1 -2 -6 7 -6 -7 9 -19 6 0 7 -27 17 13 15 -6 -13 24 -3 7 12
3727 12 -17 -19 -37 13 6 -22 43 29 0 0 -37 -11 -1 -7 -25 5 12 17 30 -4 0 8 1 -19 -1 6 -3 -9 -25 10 -3 -24 15 -1 -20 -9
3763iqK9j0rk4J7oQlK1j4j0K2Kj7J3j4J4J6k5OPRk6J1j0J6J1oKk9J3k0J3J7Kj5
3800fkK4k1rK8mj2J2lk0l5N0K%mm1N4k1K9m3jK2j6L4k5K2k8N1n9J7J4j0j4K0k
3835CJ4k8LNJ0%m0M0rJ2nj5J2Qrl0L8rnJ8pj2JK5k0jJ0jnnOJ1k3jmJ5J0k6M0l7
3875a1K9j6k3N1m1K4k2J4k6M0k2mj4K0j0J4l0L2%kj7L0j6kJ2Mj3oK0lj1J0j0J1
3909A2Lk2%J3MjjqK1kl6RJ9l3K7j2J1Jj6L0k7MmJ7k8J4Jj4L0j4J0jk1L2k1oMP
3947BOk3PLK4j6j3K5J0n0Pj9J7OO1o1NK2j2K0l3J6oNk1RK8k2KQq%LL1n4K7Pj0
3985COj5K1J7Pk3j8K8l5K3JqJ6j4j8k6N5n5pK8OOk4J2OqK7m8L3K8l8J4lK%Qj3
4022fklqLj3L6Mj2Jjj0K0jk1K3MMk4K3Mj7Pj9K1k3oM8m5qK1PJ1qj9J6pk0L4j5
$$ plain form
3763 -9 -17 12 2 -7 -31 -14 -20 -12 -15 6 -8 -18 4 6 -11 2 -12 2 18 -7 -1 6 15 -11 0 -10 6 17 11 13 -16 -3 -23 -10 7 9 -6
3800 -6 -8 16 -5 -14 14 10 -2 10 7 -13 -48 2 4 4 0 -41 13 -8 21 -22 -23 -1 -17 17 -8 14 -14 37 -22 -5 9 -1 -15 5 3
3835 3 17 -11 -8 -3 7 7 -33 7 -2 10 5 -10 2 10 1 -29 9 0 -5 13 6 -6 -5 20 0 -1 9 8 3 -2 4 15 -8 -9 -13 2 12 -14 26 -11
3875 -11 18 2 -21 30 -11 13 -9 5 -21 19 -3 -7 -21 -1 -11 3 -27 5 5 3 -14 16 0 -2 10 14 1 -5 15 12 1 11 1 12
3909 12 15 -7 -7 6 10 9 8 0 21 19 -17 -8 11 -22 5 -7 4 5 -11 19 -8 -4 -8 9 -19 -5 -4 -18 12 -2 8 7 -14 18 -3 -9 -5 2
3947 2 8 -15 -8 -5 19 3 -10 15 25 -25 -18 -37 -20 -14 47 -14 -9 13 1 21 -12 4 -2 3 -18 -9 19 -3 -1 7 -1 -1 2 33 -21 6 13 3
3985 3 9 -6 15 32 39 16 -2 26 -9 14 15 7 23 9 -9 -35 20 -35 -42 -14 -8 -2 -26 -14 -8 -16 11 -37 -4 24 -14 0 -3 -1 -1 7 -6
4022 -6 -8 -11 -19 -16 -29 7 11 -1 0 -1 -11 9 8 -13 10 14 18 -6 17 21 4 11 -8 13 -10 -16 32 -13 -21 0 7 18 10 -9 7 0 -20 14 -1
4061akK9k5J0mjk6L5l4J3L7l5KnK3j6j0K8qJ4j3J1l1K9j9J5m2M8npj7KL3j4l3
4096a9J9j0J0kk9J6J5K3n0L1j2J3Jj6L3j3pkK8l5N6p9N7j5k2OmJ9j7Qrj3K7j4
4130fL2k5j1jj0RjpJ2oLKnJ0KmMJ1k7nJ4oJ6MNJ1k8jJ1lK2k2QJk0j6jN2j6J0k7
4171iQPk2lL3n2K6Mk6L9K7l6j1PRK7k6j2pRj4J6K5k1K8l0K2k0J1%J2l5kK5KoK7
4208C2pj5j5NK2J1j8l3oJ4J0j9L4l2%J9k1QpK4j4J0LOk8J2k0M6jP%m7L1pkK3m
4245B1m7K9k1K3nJ4joK0m5K7rl2L0J8j8J0J3J1l8J9Mk2LkLk2MJ6%lJ4lJ3j3Nl2
4282b2J6j0RmJ5NJ6jm6PJ5J2k2j5MJ7PKn0L6nK0mk4K8Qj1J4j7lPPj9K2k9J7J6
4319A8J9m3%M3j6Mm1K8mnK5j2m2L2j2J8k0K4l9KPJ7lj3K1j3nMPL7m7k6K7MLJJ
$$ plain form
4061 -1 -3 26 1 11 7 6 -20 15 -19 -6 31 -4 -2 -7 16 0 -10 18 10 24 11 22 -9 20 1 16 -26 22 17 10 -7 -5 28 14 -19
4096 -19 0 -10 0 -2 -31 -15 0 23 -27 4 -8 5 6 -10 23 10 3 1 29 -6 50 -29 28 13 -9 -3 -7 12 -5 3 -6 -19 8 -6
4130 -6 26 1 -10 -11 -21 -12 -13 -20 -8 -14 -11 -9 -14 -4 -2 -6 -2 9 -18 -23 -9 -15 1 5 10 21 -7 -8 3 0 22 0 8 9 -11 -27 -28 24 8 18 -9
4171 -9 -1 6 -16 -19 14 -38 -12 -8 -34 5 32 -4 -15 -8 1 28 2 -10 -17 -8 -22 -6 19 -2 26 -4 18 -2 9 9 21 -14 -16 9 11 5 32
4208 32 25 10 -5 0 22 33 15 -18 -24 -10 0 -19 15 -17 -17 2 -19 -11 -18 6 -8 2 5 11 -17 -5 -25 21 20 27 27 -20 11 4 2 25 21
4245 21 -26 3 -18 5 0 14 13 7 27 -18 9 0 -32 -2 16 -2 8 21 32 -6 13 17 -5 -2 -4 -1 -23 -19 -3 -3 -6 8 5 18 5 10 -22
4282 -22 -6 -16 -7 -11 4 9 25 24 -22 -15 0 12 -10 -25 -21 -4 3 5 -45 -9 -14 6 2 -22 6 14 3 17 0 -3 4 11 -8 14 -15 2 18
4319 18 37 -6 -6 37 21 25 -16 12 8 3 28 16 -26 6 -6 12 -8 16 -23 -21 -14 3 0 -13 8 -5 -10 -6 1 38 -9 -35 -8 -4 -1 0 1
4356AJ7lk4L0k0qK8j0jjL%R%j0k3ON3l7k8J7j1oKL1om2K0RK4m6L3l3J9PJ3k2m
4394a3L1j7j8oK3j5K8J7k7j1J9Kl8K0J9J6l8K8j1j3J6k5QlK0rk2K1mjmJ5mmlk
4430eL1l4kL4j9Pl4L8k0K0j8%J9j5j2K4oJ8k3NmJ5J0j9k3MmPL8k5j5J5J3j7Mj3
4466fL4j5m6K8j8K4plJ7kJOl2L1Pl0L0j0j5%MPj3J2KnLKj3K9n4L1%K3l0J6k4j
4504a7J3j1K1j1MKk4M5l8J5Rj6L3l1J8k2nMk2L9J5k6%L2k5nQQrK4k8J7j9kK6j5
4540GojJ9l1K8m4L1NQJ2k9J1nj6qK2J3l7L1jlj0lK0j8J1j7lJ1l2K3nK8qQnJ0j4
4578BM7m7J0J0Mm4J3k1M8j4J1qRl2J1OMpOm7K9J4mj6J5J3k3NK0lj6llJ5jj3Nk
4616gJ9lL7j8J4j7j6J7l7K6k1L1l1kJ2k7K5mj1J0J3k4K4L2m3K6l1qJ4nj4L7J5
$$ plain form
4356 1 18 15 -9 21 1 -7 21 11 10 9 12 12 21 21 11 -12 -6 47 10 -18 -1 -12 -18 -16 15 9 -33 -13 -4 20 -26 7 -26 -7 0 13 -9 -13
4394 -13 18 1 -17 -23 0 -15 13 30 3 -8 11 13 -25 -5 14 30 -8 20 9 -4 12 -13 -5 -8 12 3 -19 2 -2 -3 -7 8 4 0 -3 -5
4430 -5 26 -8 -10 24 5 12 -22 16 -4 16 -2 -2 17 2 -10 14 8 26 3 8 4 19 29 10 -13 -9 -13 -6 32 7 -8 7 20 3 7 -6
4466 -6 28 13 -33 -5 -23 1 -6 -9 8 6 7 13 -19 12 19 -11 19 9 -6 -6 -2 5 -8 4 6 1 4 6 -7 22 -32 -1 -1 22 -8 8 -16 -17
4504 -17 -4 -15 6 -5 -1 1 -23 22 -16 -1 8 -8 25 -6 12 -10 -15 -11 -33 6 21 -5 -5 27 2 -3 5 13 4 28 0 17 -2 -4 22 7
4540 7 1 0 19 -12 16 -28 3 8 16 28 -1 10 5 -11 -19 3 16 -21 10 9 6 -4 -7 13 -5 6 -11 -14 -3 -35 -12 -17 11 3 11 6 16 2
4578 2 49 2 12 22 26 -18 -5 -26 22 8 19 11 20 -12 -1 5 9 2 8 -39 -10 4 0 -16 -1 12 -11 -6 14 11 -5 -8 -11 4 3 -10 -5 -7
4616 -7 12 9 46 28 42 25 9 26 -11 15 -6 25 -6 -8 4 -23 2 -2 -13 -3 10 -14 10 42 -1 25 -6 -14 0 -5 -19 18 33
4649C3l2j8K7kj6kqM8j5k4M6j2l3J8k9K1J3PLl8OK6m8L9%Nn1J8J3PJ6ok5j4J2
4684a5j3LJ8K8k5J1l1L4j8L4l5nk3L5OJ4Lj8j2NK3k6J5k8J9L4m2J7j2QnRJ1l9
4718b0J1pK0jk9M9l0KPmJ8l6K3lj1oL4k1kJ5J1l8L2l4K3%rnrJ8J7j1loJ7km2L
4756b9K0j1PL4j0k7%J7k2K6oj4J3j8J1k9O1l0K6qoj1J3jj0M3m9K9j9KrnLJ6j3
4791fj0J0mK4J2j7K8k3j3mK2Jk2K1Mk8OLj9PJ0j7K6j6NJ1Kl5N5k8jpK7k1lMPJ1
4829B2jl4kP0n0j1J1Kj0pJ9LKjoj6MK9k7k5L7Lk8K7J5k7j2K2nNKj3ORl9L7k8K0
4867CMpK6l3QJ2j3K1Jl9PRN1m6K5l1Kj8J0k1L1J0k7jJ9oQKkj0j7O1p4K8k3j2L6
4904frORJ3j4J1K3k9kkNK4j4j7Nk2K2Qj0KJ7l8K0J2Ml6jJ6k9J2J6M3n4MK0kmk6
$$ plain form
4649 33 1 -17 10 8 -8 -10 -18 30 15 -9 37 25 -8 10 -19 2 15 22 25 -13 -7 19 -29 10 10 15 -36 -18 -5 2 18 12 -13 -27 -15
4684 -15 -28 -25 -7 21 -4 7 -24 10 -8 26 -9 -14 -37 -2 4 18 21 3 -9 -4 19 -7 8 -20 -1 33 -9 8 -4 4 -1 8 19 -20
4718 -20 -9 -16 4 3 -26 23 -7 -5 2 -2 16 -20 3 0 -11 -17 17 -4 -6 9 20 -18 14 -20 3 3 -6 -11 -20 -2 15 4 1 -5 12 10 -32 -29
4756 -29 -9 -20 -13 21 11 -16 -16 1 -21 5 -1 -15 -2 -20 -9 -38 23 -7 19 11 5 -6 7 6 -4 39 -10 19 0 2 -7 -12 -9 7 -6
4791 -6 -16 -6 -10 14 26 9 37 14 1 -3 19 20 -2 19 23 -5 1 4 -15 -8 2 -15 11 -5 0 11 13 -22 33 5 4 -3 24 3 0 4 11 22
4829 22 21 -13 -15 55 5 -6 5 7 -3 -10 9 12 14 13 7 -9 -5 24 -3 -28 9 12 -16 11 26 -1 -13 9 4 9 11 -2 4 13 -26 11 -17 3
4867 3 7 0 26 -7 1 13 0 21 22 -17 -10 -1 50 4 29 -2 0 -18 -8 -29 2 12 -15 -16 3 -3 5 7 5 -5 -22 39 -35 -7 -30 -42 -6
4904 -6 -15 -9 0 13 -1 10 33 4 2 0 5 29 15 -2 3 -19 3 11 1 3 20 -18 2 14 18 -18 -19 -3 -32 -20 -4 39 -15 -11 9 7 3 -23
4942b3J6qK1j2J7j0K5k7JK1k4qL0Qk2l0L3J6j3k1J7j9J5Rkj8noK7j4%J6j3pjK0
4978Il9PK8j7LrL1oj5K7l3J7k5L3oL7k7Qk1mL3k7lMqRJ1jk6QPj4J9k8J9Pk5J8
5016Aknj8j4L9Mk5K3oRj1K5j8Kj0j6L9j9M4l4mpJ0K0l6lPJ0jJ3k3J1j1mpNJ7j3
5054hJ7k1K7j7QolqOJ0qLKkjj3J8k3L2qqkJ8k5J7PlL5j2m2J0J0K1k4l7K0J8k0
5092a2K8l9N2k7j5K1j5qj6RJ0j0K6Rk1nNjJ6LJj0lJ2k2PL9k9J0J2l0jk6O8m3K6
5128B1Qn3J8K5j6j7L4k6lJ5j1j3J6Qk0j6pL0L3k9J2j3j1mL0Knk0J0RlK3j1pk5
5163a6J9mJ4J9pm6K7j3L4k7kK0k5mqK1j5RPj3mM1j6nk6L8j7j0k4M0mMl0J7k7J7
5199a6N1n6J0oL7j8L6Ro0K8jJ4k6J1k0K1k0Qj6J4Rk7K0J4k0j0JK8k5ML6l1l4K2
$$ plain form
4942 -23 -7 -15 6 -6 11 1 26 -1 0 21 -3 -11 19 27 5 -25 8 24 11 -10 7 -12 3 12 10 -8 -13 -19 8 -6 -6 10 -3 -10 -11 9
4978 9 -30 -23 5 -12 -9 -18 13 7 -8 19 -14 3 -22 11 5 42 15 23 2 -2 31 4 1 5 -3 6 17 16 -10 -2 5 -9 10 -18 1 8 -17 1
5016 1 -1 -6 -24 -38 1 5 -20 3 -3 6 -5 20 2 4 -6 -22 17 -2 42 8 4 -3 7 27 -9 -12 -5 5 4 17 -6 5 -6 -10 -17 -12 5 -8
5054 -8 9 -12 15 -2 6 0 -3 -11 -5 5 -3 0 2 0 -1 -14 4 -19 13 5 -3 -5 13 -12 5 12 9 44 32 -10 0 10 31 7 -30 -10 8 -12
5092 -12 16 -23 29 2 -13 8 -7 -15 -31 -22 -12 -22 4 13 -8 -13 -8 -9 7 10 11 1 -2 10 -12 -5 34 5 15 27 -3 -4 -30 38 -5 21
5128 21 29 -24 -6 19 3 -14 20 -6 -9 6 -5 -18 -2 6 -14 -30 -37 -7 26 -3 9 -4 -15 -19 11 13 8 -12 -2 7 4 27 16 9 -16
5163 -16 3 -1 13 32 25 -21 6 -7 27 0 -2 18 -7 -11 -19 2 -13 -4 3 -10 -14 27 11 6 -20 18 1 -9 -33 7 3 7 -23 -6 -33 -16
5199 -16 35 -21 -11 -17 20 2 38 47 -13 15 14 28 2 13 -7 14 -6 2 -14 0 9 -18 2 16 -4 -14 -13 15 -10 -6 30 -1 -35 -13
5233a3j7NK2j1K5k2K1mk4J2K5l8oJ9J2j6j6L5J4l5L8J8l3l2K7nNk0L7k9j3J1n
5266a3JJ5Kj0j3K7pl9M4k5rL1Jj2k3N8k3Mll8J9L9l5J5j1J1J4nj2KJ5nk8J2Ql0
5302b3K0j5qJ5j1K4j1J4lj0j3%K3m2K2qL4l0K2J6J0j5k7oK3%J9Ll3J0j0j7M7K3
5336D3m6K6j3rj4N0m7j1J1Rj4kLKN3j6k3l5L6%m6L6J2m6M0J7kjl1J5J8k0k5K5
5370eJ7j2K5olk6K3j7ljRJ8rj5Rj7jK9rJ0k1QQl2nM9l2J3j0r%JRkj7K3l6N7m2
5409b2j3M8KJ0l9K1k2K7m1P3m3Lj6pM0j9K5l5OM2l6LNj4j4J7j0j4KkJ9l6K2k1
5443c9K8nj8L6j9L7j6J3j1k0K1lj5rJ3J8rJ0k1J8RqlrK6nj8LRrJ0jj0k1J8%kN
5481Ck0J1QoM1k5j7k9J3J0nj0J3NJ6kj9K7MNj1qk8M2J0k6oK1j2mOk1J1Oj3L1j3
$$ plain form
5233 -13 -30 -25 -3 -14 11 -11 10 6 -18 -6 19 -19 -25 -6 6 -10 -26 9 23 -12 26 44 11 -21 6 1 6 -14 23 -6 -19 -8 -13
5266 -13 -12 3 5 -5 -18 9 2 -37 7 -18 -27 4 5 -7 -30 28 5 9 6 -32 -13 26 -9 6 -5 6 20 15 3 5 20 15 -13 -1 7 -23
5302 -23 -3 -18 -26 -11 -22 2 -9 5 2 -8 -21 -21 2 -40 -18 -26 8 -22 0 16 26 11 -16 -22 1 1 20 23 -10 0 -10 -27 20 43
5336 43 -3 23 10 1 -13 37 -10 -21 -10 -1 -15 -17 -14 -12 41 25 2 -33 3 3 -43 -7 5 -41 -1 16 14 13 -18 -3 15 -5 -30 -5
5370 -5 12 0 25 19 16 -10 13 -4 -7 -8 1 19 10 -5 4 -13 -14 15 6 16 -5 3 11 -21 -26 23 -9 4 -6 -15 -15 -14 -5 -7 -24 -1 -37 20 -22
5409 -22 -35 13 15 25 -14 7 -15 12 -29 44 1 4 -12 -19 21 2 27 -8 -2 40 4 7 12 -2 -16 1 -9 -23 -21 -23 -4 -40 -18 -39
5443 -39 -11 -16 -34 2 -17 20 4 17 6 -14 7 4 -11 -20 -7 11 2 12 -9 9 18 10 7 -2 24 19 1 4 13 4 14 13 3 -18 0 0 -2 3
5481 3 -17 -6 2 -4 37 12 -5 -34 -21 -11 -16 -26 -13 -8 8 6 -13 14 18 23 12 4 -24 18 28 2 -4 17 5 1 7 -14 -3 3 -10 21 8
5518HK8k6j5j1MJ0%J8l3J6j7K7lk3RK6%k3PK9j6k6MRjqPLKqqJ8rM9m2J9l5Oql
5558a6kJ1K5J0l6j2mJ0k1L8oj6K0j3%NJK4nj0Pj7K4j0k5KJ9qOqK4k2K6k4J6k0
5594gK4k4PLmL8l8K2j9jk3J3K1l9L5mj9Kj9K5JJJ3j8PJ1Ll4K1LjqL6l3QQj0L5
5632C6k0mJj9%MjOm2J3O2k7oj6M5m2k0pL1K8n2J2J9mk2lL4j0lj6K1J6qjJ0k1m
5669a0L2l6Rk0L0K0oj5jk2L8j2nnJ1k0M1n1L3j7qJ3lJ1j2%M7o2j2L2k4K9pjJ6
5704A3kk3M6k4j4k%ORK0J2j0l1K3qPk1%J8k8JJ9j1%k3PJJ6K0k4J4j2j2K5j3J4
5740A3k2%J1J2Lj3J4j7Kj6KJ9j0rLQK3l9J3Nj5PK0j4J7m6K5Mj9J7nJJ6k5J3rJ1
5777@k6L9nm5L9j6J3j1RJ6k0J2J2Pk1j6L4pnOJ6l0pJ7qj4K2J0k3Rk1J4Oj8L2l0
$$ plain form
5518 8 36 10 -5 -16 -12 -2 -2 16 -17 -1 -18 9 6 -17 -8 18 18 -5 2 31 15 -11 -7 2 1 -7 0 3 5 -3 -11 7 -2 47 5 24 -11 -5 -13 -16
5558 -16 -18 -7 18 28 -8 -20 -24 -14 -35 3 -3 -19 1 -12 -12 -7 -6 18 13 3 10 -7 17 7 -18 -16 3 -5 1 -7 17 -5 21 -3 13 -7
5594 -7 17 -7 0 3 -1 37 -1 21 2 1 -22 -9 12 -27 8 4 -15 -13 -32 -7 -6 -5 8 -10 -3 8 11 -23 -2 1 0 -8 28 -5 3 11 1 36
5632 36 16 12 13 -6 -6 -2 -3 3 -39 -26 36 9 3 -13 32 -10 -30 -37 -6 22 -30 -18 1 -3 -25 -28 6 -4 -7 -23 -2 14 6 5 15 -6 -10
5669 -10 22 -14 -5 -25 5 25 19 4 3 -19 19 7 2 -3 8 -12 29 -22 11 -6 -14 -1 -4 7 -5 -5 42 -20 -32 0 -24 5 -2 -3 13
5704 13 11 -12 34 10 -4 -6 -6 0 9 29 41 31 0 23 15 22 1 1 19 -9 -8 11 0 0 -23 -16 -15 1 21 -3 11 -1 -13 12 -1 13
5740 13 -9 -9 2 14 17 4 18 1 3 -13 -11 8 -2 -11 -8 0 23 -16 -3 2 -13 -6 14 0 17 -29 -4 0 -19 -2 -7 -6 10 -15 -2 -11 0
5777 0 -26 13 8 -37 2 -14 -1 -12 -3 13 -7 5 17 24 3 -13 21 14 9 15 31 1 -6 11 3 -11 11 21 -2 7 -14 0 6 -12 20 -10
5813a0J9qPqNj5Qj9J7j9J0jL1J1m3jJ0kKj7J7OJ6j4OOj3J1Jj2KQJj0J%J8l0K6
5852A7%rj7K7m3M3j5k5J6Klj5J5k7L9k9RJ7K1m0j5N4k9J2Jj8J7PPl4mRJ1pJ6k0
5888a0JRk8J3L2l8RJ2j6%M0n8J5OJ0m9N1k1K6J1k4L0j9L6l6j5K0j8j0M9j2j3K
5921EqKJ4K2o2M2j0K2l4K5lpJ8l8J5j1J6k4J0Pk1jJ3RMk5JNK6lmJ8k2k3L4k0n
5958a3k3%L1MJ5k6L6l0LJ5k4K9mlj6K7m7K0jOKK0m0J4j3K3pKj0j9L2pN6o2MJ2
5994Fk9K4jJ1l1OK8mJ7J5k5j2j1K9k7QJ2nlj4K9l9L1j6K0k1m%Rj1j7J8J8j2j5
6029a6Kj7RK6oj5M6m5J6K8j9j5Nj4J2kpJ1mL1Mj9k6j1K9J0K8m6lJ1m5M1mL1k0
6064FrjJ5l3K8Kk0kL3j2k5L0J7p7L5j0L6joj6J8j4jkRlJ1lmJ8Jk5rJ1j0K6j4k6
$$ plain form
5813 -10 9 1 8 0 5 -10 -2 -21 -4 -23 -13 -14 17 28 -15 -16 -6 -8 -6 -23 -6 0 16 2 8 14 1 12 13 1 3 11 12 2 3 3 21 -9 17
5852 17 17 8 -9 18 -25 18 3 -22 -6 -4 -7 -22 -7 -34 5 -24 -15 2 23 -17 -32 22 -7 5 6 -12 5 12 19 -15 -19 -10 1 -6 10 -10
5888 -10 -9 0 -28 -15 17 -21 -12 0 -16 -16 24 -34 -19 -13 -3 -52 -1 -22 4 15 -9 21 2 38 2 -13 7 -11 -21 28 16 3 5
5921 5 -3 -1 13 35 -27 15 5 27 -7 18 15 8 26 -12 3 -8 8 -16 -6 1 -20 -21 -8 1 5 -20 -19 -14 12 9 5 23 1 -22 12 -8 -13
5958 -13 -36 -36 -5 -1 14 -12 24 -6 -3 12 -12 17 13 10 -6 21 -26 -6 -7 -1 1 21 -19 -5 -18 5 -2 0 -10 -29 3 -4 52 -10 -6 6
5994 6 -23 1 0 11 -20 -14 14 10 27 42 17 5 -6 23 -4 4 16 11 8 -6 23 -16 15 -1 19 -2 -6 -6 3 -8 -25 -7 11 -1 -16
6029 -16 -14 -31 -22 4 -2 -17 29 -16 0 28 9 -6 -1 -15 -3 -5 -12 -1 -5 26 30 11 -15 -26 3 13 41 -5 -8 3 -42 -1 -5 26 6
6064 6 -3 -4 11 -22 6 8 -12 -14 19 7 -18 12 29 -48 -13 -23 13 12 6 -10 8 -6 -7 -9 0 -3 8 5 1 19 20 -5 -14 -3 -13 13 -1 -27
6102b7M0k4J9j1RJ3ml7K2l1K8j0K8l9L6j4j3lJ8J5j9PJrK1j5J9Nk4Rjj7j7N8j1
6137B2oj6nJ9oPLKj9l0K9k3M4l2L8kl5j2M6l1j8J4qJ7K5j5j5MmRqL6l6K5l4J8
6173CpK1Jl0J5J2Ml7J7j0LL1k6K%lJ7j4lK1k4pNj8J3J9Kj5k2L0j0JJkNJ2PJqn
6213Bj3jK3J4k0pJ3J8n6L3l0MK6kj3KJ4j1m0M5J0Jk6J8Om2RK1k2K5j3JKpL5k2
6249cJ6l2J2Oj3OJ6k5J4J4OKj6Mj8%Rk5M0nl2K5RlnnJoM3m6lL1k3k4lK2J7j5l8
6288d7N6k%j3K4qrj7K1qlK1qq%oJ5k4J9j0jJ9j1l9M7j1j0K0J8j7k1K6k1L8k9k2
6324b1L0J3l9koNJ4Rlj3J5rJ8Kj8PkJ4kk3K0J3J0n3J8j7K4lqK3m2M3k6QooMJ1
6362Bl8N6k1j9N2q6M3j6K7l5K7KJ1Oj1J8l0nJ5Nj1L2Klk5K7m0LJ4mpnK2%J2l1
$$ plain form
6102 -27 13 -11 8 -3 6 19 15 -22 0 -31 -3 -13 15 -24 12 -2 -15 -18 0 15 -4 3 4 -5 16 1 20 25 1 10 9 -8 -25 33 22
6137 22 16 0 -5 14 8 15 18 20 1 -29 0 -23 21 -11 27 25 -10 -22 24 -7 -25 -11 -19 -2 23 8 -7 -3 -7 2 -6 30 -6 19 -15 3
6173 3 -4 17 18 -12 3 15 19 -18 -1 -11 -8 23 -3 -1 -1 -4 13 -1 -4 17 -7 -14 -9 -27 -14 5 7 -8 -30 0 -10 -9 -8 -10 -5 7 14 15 7 2
6213 2 -11 -12 11 25 5 -2 11 29 -27 6 -24 -20 6 4 -9 -7 7 -4 -44 1 11 12 -14 4 10 -32 -23 -2 -24 1 -12 -11 -9 -16 19 -3
6249 -3 13 -19 -7 -1 -14 -8 8 -17 -3 11 17 19 3 7 -11 -11 -2 -27 13 8 -24 1 10 7 2 -3 -2 -8 35 -11 -14 17 -6 -30 -33 -11 6 -9 -47
6288 -47 9 7 7 -6 18 10 1 -16 5 -3 -6 15 7 -1 -1 -7 8 -16 3 -7 -8 11 0 -39 8 -3 -13 7 25 8 -13 13 -8 30 1 -21
6324 -21 9 22 -17 -19 -25 -20 -6 3 0 -13 2 -7 11 13 -5 2 0 14 12 -11 9 22 32 -21 -3 -20 4 1 -7 16 -26 17 -9 -1 -7 -13 -9 2
6362 2 -36 20 -1 -20 32 -54 -11 -27 0 -35 -8 -6 5 11 0 18 -12 -17 -2 3 -8 24 26 23 -2 25 -15 -12 2 -2 -9 -14 8 8 20 -11
6398a1K6k6%J6k2J9L5l7k6K5lj5KL8m4K2j6J0mRK4J7m3L3j5Pl0K3j4lJ5kqnMj9
6434a8J1j5LK4J0j7OMljRk6J0kj8J4J2j9nj8LK4K9j7lNJ9n8M6j7J5J3k8j4LK3
6470Dk7N5n6L9j5J1j3j1K2qK2k3J3j5Oj5J1j4MK6j0LJ6k1kk4J5j4K7m5M6k4J5
6503bJ9k6j4M9ll2J2l4L9K0Jj5k0JJ4ok5J6KMJ0j3J5j6l3L2RqnlPK6Nl6j7lJ6
6540a4k3N4k2j7K0J8k2k1K5j1j0K0j0j3L9J4m0Mj0J4J9k3K1j0nj0K1k7K4Ok8M0
6572B3k6J9k7mRpk3K9j4J7Qj0rM0j3Lk2K4m6J9J8Lk3K8lqQPj0J5k9J8rK3l2j1
6608a5L6m0J1j7L6rN%j0Pkl1O2n1%J4NJ2J3J6l2j4kJ3j6J2Pj5J6j7rJJ5JROk7
6645a0J2J7l7K9Nj7j7K6Qj0jj5j1k1M6j2KJ5J3j9k8J8L3qk7J7J0j%j2oj2L3j5
$$ plain form
6398 -11 15 -11 -11 5 -17 2 37 0 -26 -1 -4 -19 -17 21 -23 -1 -17 -7 -11 -2 22 39 -4 29 14 21 -9 14 0 -3 12 10 2 -3 1 -18
6434 -18 -7 -22 -19 5 15 -2 4 8 5 4 13 -13 -3 -5 -23 -9 3 -16 -21 -39 -36 -12 17 0 -3 2 21 -37 9 -8 7 20 -8 -22 -19 4
6470 4 -23 32 -24 15 0 11 -2 -13 9 1 23 0 13 -2 4 -11 0 -14 -10 16 6 9 25 4 2 -22 -7 -21 6 -39 7 -17 -2
6503 -2 17 -9 -23 26 23 -9 3 -31 8 28 29 14 -6 -5 9 3 -22 -6 -4 0 10 -3 12 -4 -37 -5 4 -4 -9 -12 -5 21 26 -10 -27 -30 -14
6540 -14 -37 17 -5 -22 -2 16 -6 -27 -2 -13 -23 -3 -13 -26 13 27 -13 -9 -19 -5 14 -9 12 2 -3 -13 8 -19 5 11 -17 23
6572 23 -3 16 -11 -15 -6 -13 -36 -7 -21 -4 4 -6 -15 25 12 15 -7 17 -29 -10 8 11 -12 16 13 5 13 20 10 25 -4 14 5 28 -4 -15
6608 -15 21 -19 -8 -25 11 2 7 7 -3 4 2 -29 33 -18 -18 -4 1 13 26 42 10 -4 -6 7 -9 3 10 -5 11 -6 -15 -14 1 2 11 17 -10
6645 -10 2 19 -18 11 16 -1 -18 8 16 6 5 -10 -21 -42 4 -8 -6 9 22 3 -25 -7 26 18 -9 8 18 17 17 5 -1 -13 20 5
6679EJ3l2M8l0J1j2J7j8J9j0nmQk5j7L4Kmr%j1J6j0L2k9OJ8Qj3kj1OJ2Lk3jJ2
6716Drj8L5k4NJ7j3oJ2j5K1Nnj9QK5j2k1M6j7k1Rj5K9k0j2K6j0MjK5j7k3pj1L8
6752A3j4J2J1l6L7J1k3nj0l1M2Nm7L1J7qk7K0k0K1j5L7OqJ3k2mj3oPpJ9rj1RM
6788aMk3K3J3k5L3k6pj1RJ8j9J2J5k9K4jj9L3nMk2Pj9J3LKj1J5qRnRK2n1j7K3
6825hlPM3j5j9j3K2n3L0J9j0Lm4K0M4j6j1J0MjPj4M3j9l2J7j4j6K6j0nJ1kLk3
6860a9K8K3l3J6j8J0k1PRnQk1JMJ0JK0l6jLK1j5K6j5L1l4J0%lj8mK5j5K1k8L1
6896A9oj9K4Nm1J2J1K9m1JJ1Olm0LJ0J7K2lk4J4r%Nk3J8J2j9J2PRmkmK5l7J8k7
6934a2M7l2LllqjKJ2j3K2Moj0k5L8j0k6M1rj6rj5N1o2N2k0K6l9J0L7l8rL1kj4
$$ plain form
6679 5 18 -14 34 4 15 3 20 2 21 11 6 2 10 -15 -32 2 4 0 -9 -9 -20 -4 -14 18 -11 -5 13 21 8 6 -5 1 13 16 -7 -8 4
6716 4 -5 -23 12 -12 -7 10 -3 -9 3 -12 9 14 9 -10 -2 23 11 -10 36 19 -2 7 -8 21 1 -11 15 5 9 8 33 16 -7 -14 -25 13
6752 13 -1 11 22 -14 23 34 11 6 -4 -35 7 12 -35 -4 13 5 -22 -2 -22 -1 -16 21 27 19 32 10 6 -7 -13 -6 -13 6 -3 -14 -5 -1
6788 -1 3 -20 3 16 -9 24 -2 -9 -20 -11 7 -12 0 15 -14 10 9 -10 23 18 22 0 7 -12 1 4 6 -5 10 2 11 6 15 37 -14 -31 -8
6825 -8 -11 -4 39 24 5 -8 14 -39 -9 10 0 3 -41 -21 23 7 -4 6 10 9 16 2 45 26 -6 11 -3 -19 7 -3 -8 3 1 4 -19
6860 -19 9 32 -1 15 -3 7 -14 -7 2 -3 5 -16 -15 -11 -1 0 20 -16 -17 -14 7 -8 18 3 34 0 10 10 7 -11 -15 10 -5 16 -12 19
6896 19 13 -6 18 23 -18 -6 5 34 -7 -6 5 11 8 -32 -29 -19 -2 20 17 -7 7 -2 -2 3 -20 -2 10 -9 3 10 19 15 13 9 34 -3 15 -12
6934 -12 35 3 6 3 0 -8 -9 -7 5 -8 14 18 12 2 -23 15 5 -21 20 11 -5 -14 -29 22 -40 12 -8 18 -21 -11 26 -12 -21 10 8 -6
6970fkL2j9LMk1oJ7mMNMoj1QJ5j5NJ5l0L3l3Mmj2M6k0k2j3j8K3JL5k2J4oJ2kj7
7009iK9k5NLNmQj7%Mj3J8k9J5MLJ5Nj4kJ5l7K4Qk0K7k9L6k3j9MKLjnmL0qj8%J1
7050cLk4L3qK4m3J1OJ2jMpJ9l0ORl8L5rrj3K4j2j4N1k6NK8k3%Mj7qJ9%Nj1J0k4
7089a2pL4o0M2J7k4K6k1pk1L3JJJ4j5J3k2K6qm6K8k4K2J4j9j4L6k0K6K1l4k0J0
7122a0J4QkLl8KJ1j5K8m7K7M3l4Rj3K1Jk6j0L4K1j6k8K6K2l5rK6j1rJMqkPRj9
7159a5K5k1Lj9nL4Opl2K0MMJ8j0qQlk4K2K4l1K3qj1K6j3Nk7M2j9j8M9l7Kj8Rk5
7196b7K5J6l1nJ2KJ7K3p6L3J8j8K1j4J9k3mJ3lNJ0Om6M0l3OM9k1kj5J6lk1K1L
7231A3ol0K7k0MPJ0Qk1nJ4l0M4jJl4K9Lk4Mj5JJ6Oj9PLoRrnRJ8j4KJ3k3Nj3J8
$$ plain form
6970 -6 -8 24 5 8 12 -9 -15 2 -2 2 7 11 5 -6 2 17 2 7 22 -8 25 -8 -4 -8 -20 26 6 -16 -29 -47 -24 -23 12 -10 4 -2 10 8 -9
7009 -9 20 -5 0 3 8 4 12 -5 -5 -1 -14 4 -25 -10 -6 -3 12 17 3 1 16 -21 3 11 -9 18 -11 25 2 -17 -13 -11 -8 -9 -14 -18 12 4 -14 -14 -3
7050 -3 0 -24 9 1 25 -18 -7 -1 11 10 14 7 26 -4 2 11 -27 8 -1 -10 -23 1 -11 -25 26 0 5 33 10 10 14 -3 -11 8 8 13 2 12 -12
7089 -12 -19 15 -45 -3 14 -10 16 -5 -12 -33 0 1 2 16 1 14 -8 18 10 -36 -8 -32 -10 4 -15 -29 7 -13 13 34 0 -20 -10
7122 -10 4 12 10 13 -25 -23 -12 -27 1 -46 -19 24 -10 -1 -14 7 8 -18 -28 6 27 11 -17 9 31 -4 -13 13 2 -7 -6 -2 -10 -12 -5 4 -15
7159 -15 10 -11 -8 -27 -32 2 8 1 -31 -11 -7 -3 15 5 -3 5 2 -22 0 24 -7 16 8 -3 23 10 15 -12 30 11 -7 42 5 7 -11 -2 -27
7196 -27 -2 14 -17 -22 -10 -8 9 32 -44 -11 7 -11 10 -4 15 -8 -12 1 -2 3 13 19 -27 13 -20 -14 35 14 12 -3 13 10 -11 10 13
7231 13 7 -23 4 -16 -12 -5 5 13 -8 -13 1 -29 15 14 15 -19 10 13 -11 -7 -22 -21 -5 1 -18 -11 -8 -14 -5 -14 -19 -10 8 -6 -4 9 -14 -9 -22 -4
7271dLoJ8j7mOkN2k6%l2RmpM1k3J0j0rJ5j4lJKNk7J8J4j8L4j9J9l9K8l1M4k4L0
7309C0l3L5mm1J2J7l3K7Rk2K4l5J9KoJ1j1pj5JKL0j1mk6J9jlj1K5QrlPk4K3j2
7346a0j3K2l0L0J1oOoN%rj1J2qNJ1jOl2M4l0J6k5k6K6PRk1J3omPQJk8K8j5j9N
7385b8jM1l4K5Lmj0K2k2K1J7l1J9l3OM1n1lM5Kk1kLj1Rk0L2j4J4j4K7n6K6J1j3
7420dMJ8J4k7KkrRj0nQoK2NJJ5l2k5N5k3k0K4NKj6rj4Nnj1M9j8Jl2L5Ll2L4k2
7459a1J3k4OJ6m0L0J9oJ8j9j4J4Rm2N7k7J1plL3l4KjqrNL7m3J8%Mlj2j6K5K5k9
7496fL3j7l8K1J6%j4Olj0qjJ5kNj4Kj3OrN6m5QK2J1j7K5j3rK0m7K6J1J1k4kJ8
7533B0k2J2k4K4k0j4J5m4N2Jj6K2j9j5L5Kj9k3K9Rl4M6j5j3J2nKj6K6Kj8K1j3
$$ plain form
7271 -4 -1 -7 11 -6 -10 -4 -6 46 20 20 -12 -3 -7 -14 27 4 14 4 -5 10 -4 -7 -6 -4 1 -26 -8 6 -12 22 3 22 -17 11 -20 24 0 30
7309 30 -3 32 28 -13 -1 16 -17 10 19 -3 21 -14 5 7 1 12 1 -6 -21 -20 -18 12 1 -3 -29 -10 -11 -14 -25 0 8 -1 -4 3 -21 2 -10
7346 -10 -23 -1 -31 -1 10 4 10 4 9 9 0 -11 1 -7 -2 9 8 14 -18 26 -4 12 -13 -39 -13 -6 3 -18 -5 -11 -15 -8 0 1 -27 1 -14 -33 -28
7385 -28 -29 12 -22 3 6 2 -8 14 -8 13 30 -1 18 -15 -9 32 -19 -22 23 25 4 2 5 -6 3 -17 15 1 15 1 28 -28 -2 9 -4
7420 -4 0 18 32 5 7 5 -4 5 -5 -10 -2 -8 14 19 20 35 3 -22 33 10 -10 14 19 21 5 -4 -18 -13 -18 -29 20 2 3 -29 6 9 -23 11 -11
7459 -11 2 -22 -16 0 -40 -10 9 3 21 2 -12 2 11 -31 26 -1 10 3 0 33 -1 1 0 -8 -17 -12 25 -18 0 0 4 1 -11 -27 -2 23 -6
7496 -6 27 10 -28 -7 9 9 -5 1 -2 -12 -20 -21 -6 -8 -3 -17 -15 -28 -22 -31 25 -20 -12 10 21 4 29 16 7 27 -20 6 17 28 4 2 20
7533 20 -2 10 -14 10 -10 -24 -9 -53 -1 0 -16 6 -13 -28 7 9 -10 -33 -4 5 -29 17 2 -11 1 -4 -2 -18 8 10 -8 13 0
7566@K2k1RnMJpj2L4l8j4M4k3J1j4j2K0nK1k0k0nK3J4k6RK2Qj9J1Pj0j6J5J3J2
7602C3Rm5J4j0j5O6p1K8l1K5PqJ8k2J5k5KJ4J1l2J3Kj0J3mnJ7k4J3J9j5k1J4j3
7636a8J2J2Ok5j2J4L4j3k8L5k2Oj2J4J6k6j2L2k0K1J0j9j3L1k8J2qj9rK2K3ol9
7669b9K5Qk1L0k6j4K0j6RRMLPpK2k6pk1N2k5J9k6j8P6o7K5K5m4k0L8k6L1k0RO
7704Ek0Pj8PlK8Ok1J6l5%mK0L6j4j7j9J0nJ1lK0Oj7J5pk3qJ6NJ6j2Oj9K1Nmj1
7742dK0n2M7l5L1k6J9J2k7Qj0j0K2Jj6K9j5Rj2oL0j7J1k3J6oK9k6k%J3mj5L5k7
7777aJ8jnj5Ll%nJ3mj9N4l7m2K4K8j6lJ3oPj0J0rnk0L9mpoJ7Om0K9j3L1LKj2Q
7817B2Kl0J9m4K8J7k6K0Nk3NoRKNj1NlJ9j4lKK5k4qMJNjJ1nl3K7Kj1oJ7oORk5
$$ plain form
7566 0 22 1 10 5 9 10 3 -9 25 -13 -27 17 -6 5 -9 -21 -1 -6 15 -5 -25 -30 -7 7 -19 -10 12 20 1 12 19 9 -7 8 21 33
7602 33 42 -3 11 1 -14 52 -19 9 -22 3 10 2 20 -2 13 -12 -10 4 15 -17 -4 -2 -12 1 -3 -8 9 -15 -2 17 2 -19 -5 -18
7636 -18 -6 6 12 -13 -25 -11 23 10 -18 17 -5 1 -11 3 19 -7 -19 13 -7 14 24 5 -8 23 -5 7 -1 -20 -29 -7 16 10 -29
7669 -29 -4 4 -17 13 -13 -27 -7 -23 -14 -5 -1 2 9 2 24 -2 -9 -30 22 -3 16 -10 -28 48 -19 6 31 -13 -33 5 -21 10 -10 -1 5
7704 5 -15 -8 -26 -19 -22 6 12 -9 7 -28 -28 -32 -12 24 10 -7 -26 -16 -21 -10 -13 7 13 -4 11 4 -19 -27 -11 -6 10 -2 4 -15 6 11 7 -4
7742 -4 16 -36 11 -24 7 -19 0 12 -15 -7 -17 -27 -5 -4 -20 9 -6 3 -9 -15 15 -2 9 -14 2 -4 25 -1 -3 -3 10 6 -9 26 -1
7777 -1 17 16 11 -4 -1 -4 -4 -9 4 0 -19 35 -2 -44 -20 8 -8 -11 2 -4 3 -7 3 -6 -11 -31 8 4 -3 -9 8 14 -26 3 -10 21 24 26 14 22
7817 22 24 -6 13 -31 -3 14 -12 8 13 -10 -5 -11 -2 0 5 -6 -1 -4 15 1 -2 0 25 1 -7 -3 -2 3 2 13 8 -25 2 4 -7 -13 4 -2 4 13 -12
7858a2rN3%k1%l2K9j4L3m0K0kk3J9RNj7oolJ9j5K0j9qJ0Qj9J7L1m4LpL2l0L1j
7895A1l3K9J6j3L9n2J6J6Ll5k0jK9l4L7Lk9L8kk4J2J2k4K4j9k9J0K2prPK3m3K6
7929aKNj2J5nj9J6Lk6K8Kkj9j3M2k5J4mKjjJ6K2k1k6Rnk5K5JJ6l0J0j6L7m0K1
7966ej8J6J3j5J5lm0L0J4k2L8ml4LjK6Ok0J0k1J6NJ4n5N1m1K0kKn2K6LK0k6M4
8001A3k1j5J8jnPNj7j8K4Lj7J2LjlL2m5N5nk0K3Pl6RQj5QJ6l0lPqL8mk1J4m1L4
8040A0KKj3j3lM9n4J4j7L3rJ0Mj6nk5L9l5M2l0J1j3K4j0K4j9mJ6k3pK0j7M4j2
8074A9l8J2Qrj4L5pJ1m2oO3m1rK7l7L3k3J7oj5K0j7K1%k1qM2j1j1K7j9Kj3MOj2
8110a2QpJ0K4j0m%Kj0Nj4j6J7K0j2j9J9Nj4J2j0Qk6rL4oL1l0j4j9N6j2k4L1l0
$$ plain form
7858 -12 -21 32 32 11 11 -21 8 -6 27 -13 7 5 -18 1 10 15 -2 -8 -14 -17 2 -13 7 -12 -20 -10 -2 -21 -4 27 -17 -14 -21 11 -19 12 11
7895 11 -22 7 23 10 49 -3 13 29 32 -3 -23 -24 5 -29 8 11 -18 20 18 -6 6 18 -6 18 -1 -30 -20 2 -5 -14 -7 16 -27 -1
7929 -1 1 6 -6 9 4 -15 1 4 -22 6 8 6 -13 -26 16 -9 5 1 3 2 1 17 39 18 -8 1 -4 -29 -4 -3 13 -17 -7 -23 14 -26 -5
7966 -5 -23 -7 6 -9 6 3 -37 -7 7 -15 23 19 -15 -12 -13 13 19 -1 9 -12 4 9 23 -32 19 -22 -2 -4 -2 -54 -28 -25 -5 -31 13
8001 13 -8 -23 -5 -6 -11 -4 1 -16 -34 -10 -7 -24 -12 -9 -10 -13 19 -26 29 24 4 27 34 -2 7 15 0 8 24 -6 -9 -2 -10 28 24 3 17 -24 10
8040 10 12 14 1 -12 -15 34 -20 -6 -23 10 1 11 15 -1 -6 -31 8 -27 15 -15 -4 -17 7 -3 21 2 -2 14 -9 -16 4 -13 31 19
8074 19 -19 -7 1 -8 -22 13 6 17 -25 -31 32 -9 -18 9 -28 5 -18 -1 -7 -22 -2 -19 2 2 -19 -27 15 4 -7 20 1 3 -10 -6 0 -12
8110 -12 -4 -11 -1 23 13 9 9 11 1 6 -8 -24 -7 13 1 -18 1 6 -8 4 -6 2 -24 -33 1 -5 26 -4 -18 -37 19 7 -17 14 -16
8145a6L1j0l7K5QkqNPj0N4o3NJ0Lj3J4Ok0J6ok8PLJ2J1m4K6J4Nl8K1LjoJ4j4K8
8183A2j3ooQKj0K7l5
$$ plain form
8145 -16 15 5 -32 -7 1 -1 -9 -4 3 -7 47 -16 -11 -1 2 -11 3 9 -11 5 -1 -29 -22 -19 -7 4 -40 -14 0 5 -33 -12 -9 -10 -16 -2 -16 12
8183 12 -1 -7 -13 -5 -3 -13 14 -21
8191b1
##END NTUPLES=NMR FID
##END=
