##TITLE=1H_DE-93_oil
 200.13MHz, CDCl3,
 8 sc
 
 30.4.2025
##JCAMPDX= 6.0         $$ Bruker NMR JCAMP-DX V2.0
##DATA TYPE= NMR FID
##DATA CLASS= NTUPLES
##ORIGIN= UXNMR, Bruker Analytische Messtechnik GmbH
##OWNER= pz
$$ XWIN-NMR		Version 3.5
$$ Wed Apr 30 14:06:57 2025 Russian Standard Time (UT+4h)  she@DPX200
##.OBSERVE FREQUENCY= 200.1293
##.OBSERVE NUCLEUS= ^1H
##.DELAY= (6, 6)
##.ACQUISITION MODE= SIMULTANEOUS
##.ACQUISITION SCHEME= undefined
##.AVERAGES= 8
##.DIGITISER RES= 18
##SPECTROMETER/DATA SYSTEM= spect
##.PULSE SEQUENCE= zg30
##.SOLVENT NAME= CDCl3
##.SHIFT REFERENCE= (INTERNAL, CDCl3, 0, 14.3821)
##AUDIT TRAIL= $$ (NUMBER, WHEN, WHO, WHERE, WHAT)
$$ ##TITLE= Audit trail, XWIN-NMR		Version 3.5
$$ ##JCAMPDX= 5.01
$$ ##ORIGIN= Bruker BioSpin GmbH
$$ ##OWNER= she
$$ F:/spectra/data/she/nmr/H-C/1/audita.txt
$$ ##AUDIT TRAIL=  $$ (NUMBER, WHEN, WHO, WHERE, WHAT)
(   1,<2025-04-30 14:06:00.79 +0400>,<she>,<DPX200>,
      <created by zg, POWCHK disabled, PULCHK disabled
       configuration hash MD5:
       00 E9 B6 7A A2 85 ED C7 34 08 36 98 17 FE 4E 26
       data hash MD5: 16K
       42 B5 4A 24 21 AD B9 BF B6 B6 17 28 DF 65 3B 26>)
$$ ##END=
$$ 
$$ hash MD5
$$ 79 39 86 1B 9F 0D 3A 76 F6 4A D2 E1 9E A5 89 2C
##$RELAX= 
##$RELAX= 
##$RELAX= 
##$RELAX= 
##$RELAX= 
##$RELAX= 
$$ Bruker specific parameters
$$ --------------------------
##$DU= <F:/spectra>
##$EXPNO= 1
##$NAME= <H-C>
##$PROCNO= 1
##$TYPE= <nmr>
##$USER= <she>
##$AMP= (0..31)
100 100 100 100 100 100 100 100 100 100 100 100 100 100 100 100 100 100 
100 100 100 100 100 100 100 100 100 100 100 100 100 100 
##$AQSEQ= 0
##$AQ_mod= 1
##$AUNM= <au_zg>
##$AUTOPOS= <>
##$BF1= 200.13
##$BF2= 200.13
##$BF3= 200.13
##$BF4= 200.13
##$BF5= 200.13
##$BF6= 200.13
##$BF7= 200.13
##$BF8= 200.13
##$BYTORDA= 1
##$CFDGTYP= 0
##$CFRGTYP= 5
##$CHEMSTR= <none>
##$CNST= (0..31)
1 1 145 1 1 1 1 1 1 1 1 1 1 1 1 1 1 1 1 1 1 1 1 1 1 1 1 1 1 1 1 1 
##$CPDPRG= <>
##$CPDPRG1= <>
##$CPDPRG2= <>
##$CPDPRG3= <>
##$CPDPRG4= <mlev>
##$CPDPRG5= <mlev>
##$CPDPRG6= <mlev>
##$CPDPRG7= <mlev>
##$CPDPRG8= <mlev>
##$CPDPRGB= <>
##$CPDPRGT= <>
##$D= (0..31)
0 0.7 0 0 0 0 0 0 0 0 0 0.03 0 0 0 0 0 0 0 0 0 0 0 0 0 0 0 0 0 0 0 0 
##$DATE= 1746007560
##$DBL= (0..7)
120 120 120 120 120 120 120 120 
##$DBP= (0..7)
150 150 150 150 150 150 150 150 
##$DBP07= 0
##$DBPNAM0= <>
##$DBPNAM1= <>
##$DBPNAM2= <>
##$DBPNAM3= <>
##$DBPNAM4= <>
##$DBPNAM5= <>
##$DBPNAM6= <>
##$DBPNAM7= <>
##$DBPOAL= (0..7)
0.5 0.5 0.5 0.5 0.5 0.5 0.5 0.5 
##$DBPOFFS= (0..7)
0 0 0 0 0 0 0 0 
##$DE= 6
##$DECBNUC= <off>
##$DECIM= 32
##$DECNUC= <off>
##$DECSTAT= 4
##$DIGMOD= 1
##$DIGTYP= 9
##$DL= (0..7)
0 120 120 120 120 120 120 120 
##$DP= (0..7)
150 150 150 150 150 150 150 150 
##$DP07= 0
##$DPNAME0= <>
##$DPNAME1= <>
##$DPNAME2= <>
##$DPNAME3= <>
##$DPNAME4= <>
##$DPNAME5= <>
##$DPNAME6= <>
##$DPNAME7= <>
##$DPOAL= (0..7)
0.5 0.5 0.5 0.5 0.5 0.5 0.5 0.5 
##$DPOFFS= (0..7)
0 0 0 0 0 0 0 0 
##$DQDMODE= 0
##$DR= 18
##$DS= 0
##$DSLIST= <SSSSSSSSSSSSSSS>
$$ [...]
##$SUBNAM0= <"">
##$SUBNAM1= <"">
##$SUBNAM2= <"">
##$SUBNAM3= <"">
##$SUBNAM4= <"">
##$SUBNAM5= <"">
##$SUBNAM6= <"">
##$SUBNAM7= <"">
##$SUBNAM8= <"">
##$SUBNAM9= <"">
##$SW= 18.0519132531108
##$SWIBOX= (0..15)
0 0 2 0 0 0 0 0 0 0 0 0 0 0 0 0 
##$SW_h= 3612.71676300578
##$TD= 16384
##$TD0= 1
##$TE= 0
##$TE2= 300
##$TE3= 300
##$TEG= 300
##$TL= (0..7)
0 120 120 120 120 120 120 120 
##$TP= (0..7)
150 150 150 150 150 150 150 150 
##$TP07= 0
##$TPNAME0= <>
##$TPNAME1= <>
##$TPNAME2= <>
##$TPNAME3= <>
##$TPNAME4= <>
##$TPNAME5= <>
##$TPNAME6= <>
##$TPNAME7= <>
##$TPOAL= (0..7)
0.5 0.5 0.5 0.5 0.5 0.5 0.5 0.5 
##$TPOFFS= (0..7)
0 0 0 0 0 0 0 0 
##$TUNHIN= 0
##$TUNHOUT= 0
##$TUNXOUT= 0
##$USERA1= <user>
##$USERA2= <user>
##$USERA3= <user>
##$USERA4= <user>
##$USERA5= <user>
##$V9= 5
##$VALIST= <valist>
##$VCLIST= <CCCCCCCCCCCCCCC>
##$VD= 0
##$VDLIST= <DDDDDDDDDDDDDDD>
##$VPLIST= <PPPPPPPPPPPPPPP>
##$VTLIST= <TTTTTTTTTTTTTTT>
##$WBST= 1024
##$WBSW= 4
##$XGAIN= (0..3)
0 0 0 0 
##$XL= 0
##$YL= 0
##$YMAX_a= 47633
##$YMIN_a= -91799
##$ZGOPTNS= <>
##$ZL1= 120
##$ZL2= 120
##$ZL3= 120
##$ZL4= 120
##$ABSF1= 10
##$ABSF2= 0
##$ABSG= 5
##$ABSL= 3
##$ALPHA= 0
##$AQORDER= 0
##$ASSFAC= 0
##$ASSFACI= 0
##$ASSFACX= 0
##$ASSWID= 0
##$AUNMP= <proc_1d>
##$AZFE= 0.1
##$AZFW= 0.1
##$BCFW= 1
##$BC_mod= 2
##$BYTORDP= 1
##$COROFFS= 0
##$CY= -3
##$DATMOD= 1
##$DC= 2
##$DFILT= <>
##$DTYPP= 0
##$F1P= 0
##$F2P= 0
##$FCOR= 0.5
##$FTSIZE= 0
##$FT_mod= 4
##$GAMMA= 1
##$GB= 0.15
##$INTBC= 1
##$INTSCL= 1
##$ISEN= 128
##$LB= 0.25
##$LEV0= 0
##$LPBIN= 0
##$MAXI= 10000
##$MC2= 0
##$MEAN= 0
##$ME_mod= 0
##$MI= 1.114404
##$NCOEF= 0
##$NC_proc= 0
##$NLEV= 6
##$NOISF1= 3.799351
##$NOISF2= 2.8
##$NSP= 1
##$NTH_PI= 0
##$NZP= 0
##$OFFSET= 14.38212
##$PC= 1
##$PHC0= -1566.935
##$PHC1= 36.79221
##$PH_mod= 1
##$PKNL= yes
##$PPARMOD= 0
##$PSCAL= 0
##$PSIGN= 0
##$REVERSE= no
##$SF= 200.129724274929
##$SI= 16384
##$SIGF1= 3
##$SIGF2= 2
##$SINO= 400
##$SIOLD= 16384
##$SREGLST= <1H.CDCl3>
##$SSB= 0
##$STSI= 0
##$STSR= 0
##$SW_p= 3205.1282051282
##$SYMM= 0
##$S_DEV= 0
##$TDeff= 0
##$TDoff= 0
##$TI= <>
##$TILT= no
##$TM1= 0
##$TM2= 0
##$TOPLEV= 0
##$USERP1= <user>
##$USERP2= <user>
##$USERP3= <user>
##$USERP4= <user>
##$USERP5= <user>
##$WDW= 1
##$XDIM= 8192
##$YMAX_p= 0
##$YMIN_p= 0
$$ End of Bruker specific parameters
$$ ---------------------------------
##NTUPLES= NMR FID
##VAR_NAME=  TIME,          FID/REAL,        FID/IMAG
##SYMBOL=    X,             R,               I
##VAR_TYPE=  INDEPENDENT,   DEPENDENT,       DEPENDENT
##VAR_FORM=  AFFN,          ASDF,            ASDF
##VAR_DIM=   8192,          8192,            8192
##UNITS=     SECONDS,       ARBITRARY UNITS, ARBITRARY UNITS
##FACTOR=    0.0002768,     1,               1
##FIRST=     0,             0,               0
##LAST=      2.2672688,     0,               0
##MIN=       0,             -91799,          0
##MAX=       2.2672688,     47633,           0
$$ Real data points
##PAGE= N=1
##DATA TABLE= (X++(R..R)), XYDATA
0 0 0 0 0 0 0 0 0 0 0 0 0 0 0 0 0 0 0 0 0 0 4 -8 8 -8 8 -8 8 -11 16 -16 16 -20 24 -24 29 -32 35 -38 44 -47 54 -60
42 -60 64 -70 78 -86 96 -105 115 -129 140 -155 171 -191 211 -236 260 -293 333 -379 437 -509 609
63 609 -742 939 -1245 1777 -2887 6001 -32050 -91799 46443 35664 -38798 38699 47633 -8724
77 -8724 24854 26620 -10761 15062 20969 -14742 6325 21858 -6034 10280 24436 -7436 -2409
90 -2409 8022 -18273 -17044 -3776 -13639 -10819 -4973 -9741 -1550 4188 -8353 -6243 3969 -7335
104 -7335 -9600 2961 -1232 697 9366 1964 5676 12614 -520 2579 11861 481 558 10687 2439
119 2439 -2276 8110 3069 -5951 2542 1359 -8133 -1380 -557 -6812 512 41 -7205 -2743 -1567
134 -1567 -7976 -4688 226 -2562 -2411 2581 1718 613 3664 2001 447 2428 864 886 2730 2338
150 2338 4264 4022 2004 2163 1027 94 -264 -967 -1163 -917 -1289 -1425 -933 -620 -2228 -2430 -1294 -3108
168 -3108 -2819 -139 -1140 -628 1224 251 -184 1267 355 -334 650 1693 406 1297 2831 996 1389
185 1389 2288 -57 -144 379 -732 -793 23 -96 -877 -670 -442 -1297 -1698 -774 -1313 -1303 -451 -649 -341 96
205 96 677 359 202 671 331 -316 1050 909 402 1264 1058 426 562 608 95 -144 -187 -221 -571 -229 20
226 20 -611 -132 -516 -1089 -317 -392 -845 -443 236 -128 -155 134 273 -165 340 562 -370 298 363 351 786 557
248 557 549 268 419 161 57 -26 92 -298 -105 3 -25 231 -170 -586 -365 -417 -365 -328 -213 2 -300 -127 348
271 348 -254 65 130 97 366 259 265 357 495 635 419 187 258 52 -253 369 53 29 98 42 -109 -184 -410 -475
295 -475 -597 -379 -549 -558 143 -15 -214 141 -290 -244 -161 -244 -266 -164 325 371 319 726 206 356 373 202 -1
318 -1 -49 -99 99 84 157 206 -41 167 -173 -405 -221 -240 -316 71 -102 -56 -50 -349 -294 -13 -258 17 -163 -119 55
343 55 -220 -29 206 152 61 3 274 80 38 235 261 500 317 228 191 259 -253 97 186 -368 -376 -215 126 75 -122
368 -122 -70 -343 -146 -143 -362 291 -28 12 -77 -141 23 -10 -227 204 -66 -37 211 103 17 196 -92 130 285
391 285 185 93 47 283 144 55 134 153 -36 -15 -242 130 -140 9 -5 -120 -76 132 32 109 36 -147 -239 -117
415 -117 -8 -17 16 261 96 -171 -255 -64 -34 63 110 -70 -103 -71 71 -86 59 -149 123 -109 -73 -7 -103 167
439 167 68 119 -25 -230 -127 -31 -17 126 -91 213 -51 126 -123 39 41 -110 215 148 -45 143 -216 -242 173
462 173 52 -228 232 -113 77 322 -177 86 -130 118 -256 -21 -211 11 101 167 300 -204 60 26 -194
483 -194 -26 -247 -58 -113 -65 11 -253 7 -45 44 -84 -187 -92 39 -217 119 -93 -168 334 -5 -100 24 363
506 363 7 173 44 63 270 48 177 83 98 145 230 -96 23 -90 118 194 -191 118 -13 225 34 -148
528 -148 5 58 -45 320 -111 160 -324 -156 122 74 189 -8 -36 26 -14 -1 85 91 157 163 206 9 45 -6 -129
553 -129 -41 -25 104 187 -3 -87 -45 -297 -104 -140 -115 -16 384 -39 -151 64 -20 65 148 -84 -66 110 -94 64
577 64 153 102 -163 269 194 -19 127 137 47 61 -47 -141 16 -121 124 125 143 91 158 6 -37 -169 -76 -131 -44 -130
603 -130 -108 -25 -139 138 25 -193 84 -6 -56 -234 278 156 76 53 -275 -77 -219 176 288 226 -158 55 48
626 48 -80 -177 143 -145 57 -28 169 151 167 53 94 182 -77 -64 206 41 57 -159 108 -116 -160 3 170 38
650 38 5 266 -148 -189 40 270 -67 -97 -101 -133 15 158 -41 113 159 -34 18 108 92 269 -85 -158 -215 0 -107
675 -107 117 -13 175 62 25 94 -347 -159 11 -131 119 144 -157 6 -192 50 50 96 -134 -374 -16 -101 -148
698 -148 -76 -165 -67 -72 -80 124 -12 -70 -75 -103 -135 -78 210 -5 256 185 -223 161 146 -58 -37 83 -206 -8 135 98
724 98 -179 -146 -29 29 -192 -249 -43 -52 23 -116 104 -186 -181 -80 -143 157 -81 77 224 278 65 -186 -55 -248
748 -248 -120 70 94 -128 -5 216 -65 -6 -45 121 138 209 -20 -188 -117 113 131 -75 -22 47 60 4 90 -98
772 -98 -77 -292 -224 128 47 -141 131 -43 -78 234 -198 93 -161 -66 199 -187 -83 -227 303 -24 51 -21 194
795 194 114 -77 88 21 -35 -58 352 200 -252 -55 -206 -143 -30 205 -82 -274 -203 138 183 65 -8 49 69 120
819 120 -74 15 -244 49 17 267 15 -68 3 78 -3 45 232 -92 -175 125 -69 63 -141 139 25 323 59
842 59 104 -84 -205 -72 73 32 38 172 -109 195 251 -101 -387 -2 1 -11 110 95 -219 92 -174 25 81 -24
866 -24 -248 277 215 -37 42 -225 70 -73 57 -93 45 324 208 43 208 380 -82 -19 -162 -271 45 -305
888 -305 -243 108 -25 182 -61 -92 -136 151 23 -160 178 196 -115 64 -21 -68 -59 -182 80 324 -23 -9 -78 -228
912 -228 -234 89 167 165 -78 -134 -46 83 127 140 109 6 158 30 181 -30 280 -22 -64 126 15 150 -275 56
936 56 11 -59 306 -21 255 -105 29 112 182 -21 203 -127 -41 -64 -205 86 24 104 52 118 171 -22 269 353 57
961 57 47 43 54 -257 -31 310 107 -133 -159 -89 -101 -112 79 65 42 -323 -30 -432 0 135 -14 -192 -45 104
985 104 85 204 -179 36 119 272 -228 -60 73 93 1 -190 6 75 -131 -64 247 51 192 -130 309 77
1007 77 23 7 -42 -99 70 -61 56 2 211 8 -20 151 148 54 124 -161 -85 47 -202 78 -298 -154 259 38
1031 38 -299 107 -224 -129 -42 -188 -159 -144 -240 -38 -150 -251 159 -149 14 139 13 88 26 26 25 -208 81 154
1055 154 195 110 68 271 83 -170 170 236 -75 -327 -161 144 53 -153 -229 -81 -166 -202 65 -42 88 -2 121
1078 121 102 109 -140 -58 4 51 97 187 -126 57 45 -91 -98 -29 -48 -37 103 62 -10 35 62 208 -53 122 19 55
1104 55 150 -32 -358 51 144 59 223 -345 -116 62 -286 -177 -17 92 29 15 2 -73 -95 219 -29 -81 34
1127 34 -141 -93 -62 -74 -43 -127 -78 203 -66 177 57 86 186 38 19 -139 31 362 -33 39 -83 210 124 182
1151 182 69 328 86 -12 -223 -179 -64 -100 244 -158 132 -207 -172 132 215 -23 -77 -82 -62 -129 -50 19 134 140 -245
1176 -245 -226 -251 14 67 229 110 -120 -51 114 204 73 241 -9 31 178 112 55 119 -32 339 74 -149 69
1199 69 117 -61 -156 -139 -86 183 17 -251 -89 -61 -62 -254 -133 284 -128 -4 -17 -97 -42 60 15 -68 -195 139
1223 139 105 11 -216 -19 -23 -64 158 -94 -117 -401 -31 25 242 21 -1 155 126 125 -103 -156 -225 -297 108 265 -105
1248 -105 -9 73 -92 -9 -201 -59 101 100 -38 -56 -134 -55 82 -42 72 111 52 71 266 19 97 5 -174 -83 -154
1273 -154 -17 -140 36 -43 -155 87 73 -217 -99 29 -98 -106 1 130 -52 -43 -148 -74 -170 168 -1 296 83
1296 83 -218 -116 157 -7 136 -206 -223 230 -356 -48 241 137 -36 13 191 -55 133 -102 39 -16 95
1317 95 126 76 -39 -145 -165 -199 51 -113 -52 -252 296 25 57 -39 225 -129 -68 130 20 214 -67 -316 189
1340 189 157 -235 -12 15 147 45 -25 4 174 -194 -168 97 -46 21 -243 -37 -155 145 -94 -9 46 186 -130
1363 -130 131 -47 -17 71 -115 139 -231 -20 85 -97 70 76 -52 -94 57 -29 -51 269 162 -2 1 -164 -89
1386 -89 -144 -30 -12 -65 73 33 26 129 161 156 85 -121 -154 -178 -59 -165 77 -41 37 156 302 153 173 7 -176
1411 -176 -134 -66 63 -116 24 15 12 -196 10 -60 65 11 74 201 -311 117 -171 65 -73 -114 -138 172 -226 61
1435 61 -147 132 44 187 -93 -95 -219 21 48 -122 81 169 188 281 -323 -60 247 -14 -212 45 30 -284 -13
1458 -13 -91 61 132 -183 98 141 -156 -69 139 108 7 -255 -62 28 -109 54 178 -219 -64 136 302 169
1480 169 35 -62 -172 -257 193 -139 98 235 48 4 7 116 -3 -58 -165 47 -60 -153 9 20 50 38 144
1503 144 130 38 148 -144 -56 -186 203 -48 19 77 -93 -316 -60 173 -88 24 338 56 -8 -158 -117 134
1525 134 -186 -431 -85 -45 -121 144 -49 -18 60 236 9 -5 -23 12 119 151 103 -166 88 -55 1 -302 -33
1548 -33 -86 12 64 -61 121 -197 -280 -229 71 -195 226 -22 -238 -210 90 223 146 -212 58 193 7 301 66
1571 66 134 -236 145 -28 -197 -196 37 214 -135 -250 -223 -119 -151 -58 17 -26 113 -92 -170 -410 73 51 201 50
1595 50 230 20 31 -219 -280 208 50 40 -46 141 -65 -17 67 -174 -175 -211 109 271 -168 200 173 -113 123 43
1619 43 -168 -68 -260 -26 38 -36 -174 -131 -212 -321 153 86 -330 166 32 -298 -2 76 -281 18 -128 -300
1641 -300 90 186 202 -111 -77 -48 180 -29 26 21 247 -65 -121 216 -281 29 22 -1 -128 85 -182 -195 40 136
1665 136 -143 149 173 -233 -156 50 334 -67 -12 -160 -225 52 3 182 133 -64 -300 244 -111 333 320 162
1687 162 -41 39 156 -180 107 -191 30 13 -59 26 10 27 266 173 0 151 140 -37 38 -37 23 99 -134 -109
1711 -109 -178 -8 33 364 31 212 213 244 -29 -175 279 -140 -293 140 152 -112 219 -106 -126 273 -20 -293
1733 -293 -15 -163 354 60 -19 -67 -155 74 -16 207 112 -51 54 -423 115 -24 -93 -59 148 -80 -185 -222 -35
1756 -35 26 89 61 -40 175 -104 -212 -257 76 -97 37 -27 -4 -123 187 79 -66 148 -267 -217 -227 -70 -204
1779 -204 114 172 -50 -217 74 145 -60 97 -63 -115 102 -163 -138 -38 -9 -97 195 -129 -346 -129 137 -128
1801 -128 -104 156 -157 98 130 44 -119 -59 -159 -123 -33 271 333 -91 160 -148 134 167 53 154 174 -153 -64
1824 -64 3 16 -134 -112 -40 -147 -60 0 -14 35 -73 152 -4 13 57 18 135 72 -261 85 231 -76 184 21
1848 21 31 -6 2 351 315 14 -97 -340 169 -245 144 208 41 113 85 72 225 13 -269 316 -181 -62 82
1871 82 96 -200 3 -92 75 -133 178 237 -66 -75 -169 111 65 -59 6 64 10 25 71 119 115 157 111 131 24 84 4
1898 4 75 -140 -160 72 190 -192 -26 176 39 25 -120 -42 47 21 -152 -54 142 113 -181 77 109 -161 -94 -45
1922 -45 192 -8 -39 4 6 -153 -54 -87 -107 -248 -103 -59 92 66 -123 69 -104 125 176 203 -125 -33 -119 -302 -82
1947 -82 121 213 -197 -180 52 154 -114 -179 137 -180 -57 60 2 168 -111 33 -182 -128 145 -115 56 113
1969 113 -170 -183 -72 129 239 -115 201 -92 57 115 162 34 -64 -22 -122 -80 -142 26 -26 176 31 -52 19
1992 19 -162 -17 183 244 -391 44 33 -186 179 15 160 16 -227 146 222 -22 4 -115 -159 101 110 -109 -35
2015 -35 -16 -70 -133 7 128 151 240 -30 -191 356 -156 -260 -51 -175 -37 22 231 -79 127 -57 -10 94 67
2038 67 306 -29 -234 16 -105 -142 -244 151 -25 156 -37 51 46 -76 -106 11 -28 -143 233 79 85 -75 61
2061 61 300 -29 247 -53 -24 110 125 -5 252 51 -174 55 -103 -229 164 -184 -292 86 -26 -59 156
2082 156 -18 -146 85 -201 68 -33 252 125 2 -149 32 -274 77 23 -120 -89 -45 221 57 -2 -81 117
2104 117 -238 32 169 89 65 74 -7 99 -226 113 -87 198 -178 -68 -48 -111 -208 94 45 101 402 -69 139
2127 139 -1 -196 43 302 -59 9 339 -178 -70 -104 -87 26 -55 -125 -108 -258 246 28 -53 -185 94 -122
2149 -122 67 -63 68 15 1 -59 141 1 -69 -133 164 -32 138 80 19 194 -79 78 -50 -146 -43 -193 84
2172 84 58 -68 351 -259 -169 -33 -108 136 -88 -187 156 31 -124 99 -56 -56 -3 102 221 -86 -99 -55 68
2195 68 5 -286 -3 252 -214 -159 -55 -12 -278 55 -24 -20 -51 -182 34 -110 81 228 -401 -131 -62 -7 -293
2218 -293 62 -482 -41 183 -17 60 78 118 -23 -354 -127 15 -161 185 1 61 -3 102 82 113 159 43 53
2241 53 132 -15 49 101 -166 226 -135 -116 -415 -140 16 68 7 31 204 -344 27 110 -75 -19 147 -46 -128 53
2265 53 103 -188 -77 -29 47 -59 -130 -31 217 120 88 8 109 -119 1 -32 -116 -46 -42 -17 -154 -59 -103 -182 127 59
2291 59 -169 32 255 -167 -211 145 202 178 -161 -47 111 -199 -90 -140 -196 177 61 58 110 97 -163 249 39
2314 39 -1 13 230 -154 206 175 -27 108 -270 68 -342 8 -173 111 42 23 10 -37 -46 -112 233 40 209 -58
2338 -58 -237 -131 266 106 75 290 -112 -100 -160 -8 -4 -57 65 -128 -202 -316 12 39 172 -9 60 -171 147
2361 147 -149 -117 3 -115 -58 -155 -225 47 -2 -218 -110 98 148 -63 76 85 84 -368 -264 -69 146 122 -63 -14
2385 -14 109 62 184 -91 -92 -16 15 -157 76 -59 -20 68 118 -167 -163 55 -55 -6 -297 -109 119 -89 -82 111 207
2410 207 141 118 -84 85 -117 122 -38 85 -217 -54 -412 -191 -42 -126 -173 66 51 -181 -31 -156 62 41
2432 41 25 38 -122 -210 -240 68 60 123 -50 291 -198 -288 124 -173 -87 74 -141 42 30 -160 6 -9 -177 68
2456 68 -93 -295 28 -138 176 -141 -27 -94 -245 33 -84 -157 -71 44 -103 -53 -74 -130 -117 84 -42 407 127
2479 127 -34 152 -3 86 47 -208 32 -128 31 95 -14 214 26 61 -6 -76 108 79 248 -117 115 18 94
2502 94 -94 204 173 -221 121 42 4 7 -33 48 -2 108 157 119 65 21 99 8 18 -60 -116 20 -5 -31 148 248 19
2529 19 -53 -66 13 204 278 -330 -99 86 -320 58 -133 -11 -109 -169 14 38 457 90 14 144 127 170 -226 -85
2553 -85 -86 45 241 -216 108 276 -64 47 28 -139 181 -110 6 -242 -50 -157 -250 -32 -47 -71 -130 94 192
2576 192 120 160 -193 -231 178 -121 76 48 247 -37 -119 77 -210 -6 278 -49 -203 -15 225 -67 196 -102
2598 -102 16 26 -24 209 26 139 119 -208 -260 106 27 -109 -44 83 -26 -32 56 35 -11 7 -76 29 -155 296
2622 296 60 83 -213 142 -22 114 -91 42 248 -116 0 -283 175 74 -104 -83 288 136 -213 39 -29
2643 -29 -52 -188 -148 205 236 165 -138 -90 14 -122 -256 -76 -367 -20 154 -116 -34 121 222 -71 139 -53
2665 -53 -10 24 -90 -246 173 -156 -329 -151 -56 147 -271 -44 -165 -106 27 167 83 -93 -190 -3 143 414
2687 414 198 -58 206 -47 -224 177 -27 -22 78 -209 148 112 -39 32 -205 243 126 154 115 -189 102 180
2709 180 179 169 -216 216 -68 37 -41 -37 -100 58 12 31 164 -158 39 -267 -51 362 191 -25 83 -13 -110 116
2733 116 210 -97 15 -208 167 -119 -279 -36 -78 89 -81 176 -342 255 13 -113 41 -294 -7 178 221
2754 221 -95 -118 -93 163 77 11 -147 -129 -144 11 141 37 101 11 -353 192 108 27 109 -87 197 62 -159 -120
2778 -120 284 -76 33 119 -97 55 149 32 -389 43 -111 -488 172 -72 73 223 155 -9 20 95 -86 -117
2800 -117 17 -122 82 -35 165 36 -61 86 -230 23 -178 -83 1 160 4 -50 -198 206 -143 -191 2 -326
2822 -326 66 40 -36 224 -332 110 -129 115 134 46 13 -107 71 -162 89 164 -68 185 53 354 171 -6
2844 -6 135 316 -207 201 -9 190 21 120 175 -49 -94 149 30 -138 -449 -54 -45 -196 -124 -23 179 203 -309
2867 -309 259 -32 -102 -114 -100 -11 99 32 148 -15 -195 -318 -158 98 -62 11 50 2 126 51 110 -139 73
2890 73 89 -177 112 -136 -229 171 35 -17 154 -59 68 -44 72 -108 113 -61 16 -46 30 -186 52 -6 -49
2913 -49 -80 -88 -6 0 192 -148 -45 22 -199 69 12 -6 -32 -70 -250 138 -14 -165 -59 -23 -40 -88 18 35 -59 -66
2939 -66 160 -95 -36 -37 75 27 62 131 110 76 324 -221 235 -50 15 -112 26 18 63 17 -52 31 -7 282 -28 4
2965 4 -97 5 33 -12 -62 116 -114 143 -155 -10 -23 -109 60 -115 -11 -9 36 -292 -67 0 -31 -138 -53 61
2989 61 -65 -25 -132 -155 17 130 -32 76 156 -246 -240 -28 146 79 -367 -19 8 -113 83 263 -109 -269 188
3012 188 175 44 35 -91 -17 -149 25 286 15 42 299 192 -40 335 156 165 -3 -130 75 68 -95 128 -78
3035 -78 -36 -174 -44 245 114 9 -50 -92 42 13 -117 -196 11 -220 145 15 34 18 156 -36 -17 -139 104
3058 104 -199 48 -79 -26 225 -83 -216 0 282 -67 15 -107 72 -153 -42 38 125 -64 -210 -153 -120 84
3080 84 43 5 -71 -153 -69 -222 91 15 -204 -74 16 -163 218 -8 101 174 175 112 43 -25 130 -29 90 26 -53
3105 -53 108 80 85 142 259 -172 -77 123 184 246 31 -74 40 -90 112 101 38 -133 144 -178 64 77 -16 -66
3129 -66 -66 -35 -74 3 -178 -193 32 120 96 -28 188 -244 -140 180 76 -77 -38 16 41 -134 205 47 57 -38 -88
3154 -88 -15 -218 64 -93 64 33 135 135 255 141 -161 -65 -194 179 144 37 178 -66 96 -88 -126 -46 -137
3177 -137 185 -28 -303 -5 -13 -170 12 71 -216 -100 -133 138 90 -86 -99 -168 -94 70 -71 182 22 -56 -134
3200 -134 -249 -38 95 24 -82 7 54 81 -175 58 150 60 -49 93 78 -125 150 -172 -272 4 24 269 -118
3223 -118 3 -17 198 152 -76 18 163 -2 -178 -182 87 224 -230 -183 -50 -122 243 46 -98 29 -179 -50
3245 -50 -139 79 -87 -48 126 22 -78 52 -156 147 -272 -6 218 -492 70 34 -136 -62 -169 30 64 -69
3267 -69 -103 -323 91 195 -112 -94 1 113 173 -57 -150 8 143 -96 -10 -132 -213 -105 -34 168 -227 -92 216
3290 216 -145 172 79 91 40 -281 104 -157 178 -212 247 -75 133 -64 -163 -207 5 61 143 -294 150 264
3312 264 -135 -21 30 -25 191 -10 117 101 9 57 -41 22 67 151 -118 73 -46 8 -259 227 169 12 -150 -77
3336 -77 -6 88 21 -40 14 2 -369 -3 -18 59 94 -217 -59 227 -94 -159 139 95 65 28 -191 -89 -186 -59 59
3361 59 -15 151 -123 -42 223 -29 119 116 -159 -145 -8 -28 -251 -60 -4 108 17 65 -57 -17 38 -118 120 162
3385 162 -145 -65 -136 -63 -186 31 -18 47 67 43 77 75 9 28 -20 -80 45 214 136 193 204 -3 144 30 16 218
3411 218 -52 -191 82 17 -17 -187 -19 -81 -65 -131 -130 -60 -159 293 -172 6 -28 -232 70 -90 71 30 -85 -126
3435 -126 53 -162 -84 233 -20 259 334 218 120 -28 -12 12 -154 125 -36 -195 -88 -132 89 134 62 67 106 -147
3459 -147 -82 36 183 -213 -70 11 -77 56 50 104 269 -73 33 -120 71 299 -88 7 171 157 35 11 130
3482 130 -198 320 -253 -42 81 37 -75 85 140 -330 -44 20 -45 82 -62 -256 188 27 156 252 -47 23
3504 23 110 244 -80 174 150 -44 10 54 -76 -182 -123 -127 228 298 -82 -60 -48 11 -321 -116 -110 182 277 78 -46
3529 -46 44 8 -6 3 54 146 -229 125 -63 187 83 -31 -77 -223 -115 41 42 68 -13 -288 -4 -117 104 -186
3553 -186 -111 305 -36 -68 -238 -57 -40 -51 -13 282 -43 -19 87 121 -204 -74 123 177 57 -56 66 139 103
3576 103 -105 -116 38 30 89 120 22 -43 -58 -108 -250 37 83 177 115 -220 256 -360 -157 -6 79 157 250 -157 153
3601 153 98 -236 177 -116 223 -27 -76 -106 149 152 84 277 -83 107 111 -148 -44 100 -29 -163 100 -6 212
3624 212 -45 110 205 -45 -6 -14 189 -257 -173 116 -145 228 56 -170 -54 -86 -141 -172 -1 192 -59 -1 -12
3647 -12 -12 48 -31 -117 -61 -217 88 346 17 -122 -36 -287 120 -87 -61 369 278 -58 215 -16 -72 281 290 -58
3671 -58 21 -35 46 64 -92 -57 43 31 -21 98 2 89 192 17 -56 -78 -292 54 11 118 143 48 -12 158 196 92
3697 92 -164 121 50 4 18 143 131 -135 -69 67 194 -68 12 135 -64 77 -86 -59 -95 -109 -85 150 18 -46
3721 -46 -103 47 -56 -27 82 -102 -144 -69 75 43 16 -80 -137 -70 -329 81 -6 -65 -50 59 41 169 -341 -148 3
3746 3 -276 14 161 -286 268 149 164 -105 -208 -113 106 38 183 -136 -50 10 197 -8 -61 -190 107 -114 -1
3769 -1 160 9 116 81 199 51 33 -287 -50 83 80 -36 -60 7 -41 -102 144 78 -126 -17 -28 497 282 -166
3793 -166 63 -33 6 105 -302 104 185 -63 -89 74 -159 -59 114 -90 2 82 -64 151 -83 128 -93 -81 97
3816 97 58 6 268 18 -90 111 -59 6 -233 -6 115 14 -163 -134 -71 196 -144 42 88 151 95 58 144 -86
3840 -86 -31 -235 105 -101 283 108 24 -18 38 -68 -180 207 -132 235 -181 64 -48 -270 117 31 161 127
3862 127 -88 87 -143 78 52 166 -43 37 14 288 71 83 363 -245 -71 -217 -157 14 -157 118 -21 431
3884 431 260 -243 -188 -1 -82 110 -72 -106 -113 37 101 -67 -62 12 149 41 47 -130 55 -144 173 120 363 -76
3908 -76 -91 85 151 45 -22 -161 191 79 136 -136 181 6 406 143 147 42 -130 -64 85 51 134 116 328 -38
3932 -38 -195 45 -185 -209 174 -119 14 94 103 -4 73 -42 86 62 -3 92 -90 -124 -174 77 -171 134 -106 -110
3956 -110 9 -151 -51 90 294 174 -48 87 -130 146 49 -140 -140 -301 -34 -162 104 16 217 63 -36 -12
3978 -12 34 106 263 -75 -58 -43 171 412 -230 29 -164 75 -247 124 274 81 205 29 107 -177 -106 111
4000 111 -143 42 -2 72 152 -41 17 276 -45 -172 200 28 79 152 159 -6 -18 -61 -234 -310 87 -42 -113 -249
4024 -249 -173 43 -191 167 -180 -69 -77 169 139 117 -227 -50 16 -133 -66 42 64 -113 -34 7 -35 -191 -139 -110
4048 -110 133 -257 -42 -10 -69 111 -82 -15 182 152 17 -160 -49 143 -60 78 2 255 -95 -100 12 136
4070 136 47 -28 -290 25 -100 -75 -37 -366 -159 -120 304 50 244 92 136 268 -88 30 -213 139 -280 -3
4092 -3 135 67 98 27 -251 -100 -215 232 20 -113 69 329 -36 -135 198 -50 -293 -280 -84 60 84 -175 -177
4115 -177 -46 -55 -10 -52 -120 -53 177 -32 -9 178 119 89 469 -261 -36 -66 -150 25 -18 88 115 -27 34 70 -132
4140 -132 72 82 191 95 356 -34 -31 -100 -235 -142 -141 -202 51 -6 288 65 -149 -198 4 117 -204 207 -123 -72
4164 -72 33 36 146 102 -38 -14 187 -46 219 -55 -3 -310 -99 -23 43 83 132 -280 -155 -28 -78 98 -88 -42
4188 -42 67 103 176 193 152 325 -76 -337 8 247 -26 -16 188 81 -139 60 145 -217 150 -147 132 -174
4210 -174 76 -427 -233 93 -137 -124 -119 140 -24 -38 -235 -88 -24 148 7 -128 -154 8 -55 -105 -116 283 15
4233 15 -62 120 -76 95 230 -81 79 -18 -166 -83 206 70 126 -240 219 -3 -88 -285 -86 5 47 89 -323
4256 -323 -41 91 -120 -121 -230 -14 154 125 120 160 -66 12 50 -75 204 -95 -90 16 54 213 -186 140 -20 -150
4280 -150 -73 -140 250 245 -35 31 224 66 -148 -55 -127 -9 3 -21 93 18 -183 67 253 -260 126 113 -228 213
4304 213 -270 -167 48 -29 -145 177 171 -160 -144 18 -152 -72 -61 -27 27 -152 337 17 -158 -260 91 298 -4
4327 -4 93 148 -151 -161 54 55 264 136 45 169 19 1 -139 -69 195 -24 204 -212 -9 -242 197 161 -103 247
4351 247 -123 225 85 53 -199 297 -21 -130 130 -39 113 -236 66 -59 144 -72 -13 -23 1 90 126 -34
4373 -34 -40 165 99 -24 63 55 7 30 144 194 -61 81 -114 77 -114 -7 -91 123 -8 -349 15 19 -199 97
4397 97 -38 333 -151 -24 -150 -166 -135 -157 96 82 353 38 251 142 83 171 27 36 -55 -233 221 -120 -103 -182
4421 -182 89 32 163 52 -148 -29 -17 142 36 -8 -28 -36 134 279 30 -68 -154 41 69 135 -32 250 107
4444 107 -133 -173 -73 144 153 264 36 23 233 127 68 106 157 17 162 -238 -47 -104 -68 -26 -42 -188 -1 -69
4468 -69 157 176 214 -51 -42 529 -72 -121 101 -256 -252 15 52 40 5 -136 248 -157 173 -25 -99 -39 -148 -19
4492 -19 -123 -323 91 116 -31 -7 -319 171 -71 193 166 131 237 -10 -62 -52 -179 174 -225 -166 130 145 44
4515 44 -148 191 146 1 92 228 -22 69 83 150 -171 259 -259 77 -47 -17 83 -56 264 -119 71 -3 -28
4538 -28 -12 132 16 -48 -6 -110 -193 116 -74 155 221 84 8 -174 176 -24 72 255 -33 106 -71 -224 -158
4561 -158 -48 -43 167 28 184 232 72 -12 58 -275 63 184 72 69 188 182 117 -323 31 98 -82 -130 348 -8
4585 -8 188 -185 40 -16 101 171 63 22 -195 185 100 -126 79 -251 96 262 82 79 -33 73 164 212 -93
4608 -93 53 -154 170 -80 -118 209 74 -59 64 -66 -127 -59 -127 -174 -106 23 -278 -126 39 10 -28 -117 -130 259
4632 259 21 -81 -90 131 11 1 -52 80 68 -79 -238 -265 224 -141 -104 -76 239 96 -119 173 -104 -171 -186
4655 -186 63 -298 -210 15 227 -249 -44 148 90 79 -160 140 -4 7 51 -70 -33 154 -113 13 -139 -6
4677 -6 124 -174 -128 25 -41 -81 -258 337 58 -136 -270 113 -246 -59 35 128 81 -7 -186 477 -27 82 -24
4700 -24 -32 56 18 101 219 -144 -163 21 119 233 -27 3 -209 -41 72 -48 -179 -284 -208 43 144 83 12 224
4724 224 -58 -165 55 177 -54 -9 -251 -40 234 -189 104 -244 -236 -135 -96 169 36 104 -114 -83 12 41 -64
4747 -64 -107 306 -67 390 -168 80 155 157 -3 147 -115 -155 52 -295 -115 182 -157 223 -259 -118 52 128
4769 128 -52 254 142 26 -69 -176 64 -66 50 -3 114 -34 240 -14 126 -94 -228 22 -30 -215 109
4790 109 153 253 -101 11 -119 -116 -15 252 -3 117 -104 96 181 14 -126 -85 125 -367 25 -134 -14 0
4812 0 -251 69 99 -1 -15 162 -87 73 -23 83 -77 120 109 -154 -199 -84 -39 -174 46 -224 96 -177 48
4835 48 -1 3 -108 -196 -176 -6 -74 -108 108 33 1 67 109 -148 -17 75 -26 -85 5 -21 167 -136 6 -58 -62 -331
4861 -331 60 -184 -11 -142 -50 -121 -34 111 49 -33 -246 101 -21 401 -127 75 11 -234 74 100 311 36
4883 36 104 -144 50 91 46 -28 84 -90 -110 196 -12 82 285 225 60 -57 55 36 -95 148 -30 19 -177
4906 -177 -116 126 173 103 86 211 -162 -61 -213 -362 35 24 59 134 -138 14 77 352 128 12 193 164 -31
4929 -31 309 -149 -3 -36 174 -21 -101 69 -39 -13 58 349 120 -58 90 43 73 -149 -160 -125 -162 363 205
4952 205 38 156 89 1 108 29 121 -20 82 -121 -60 95 206 117 105 -247 -83 136 -127 65 181 -294
4974 -294 -65 25 -2 -168 -68 -281 -38 154 -181 22 139 -188 259 162 -272 37 -22 -265 12 38 -155 26
4996 26 -334 -274 84 163 22 -79 392 -95 30 66 -181 -97 -35 -70 -157 -237 -19 15 -109 -136 53 -79 78 144
5020 144 -59 -62 -122 142 173 30 144 -222 9 -46 -260 -67 -261 8 291 -181 -34 105 -89 -319 -183 75
5042 75 55 241 136 28 314 177 -88 -3 43 3 154 -7 80 -154 105 -102 -71 95 -23 -167 166 -52
5064 -52 -3 13 42 133 -8 -202 -86 -362 -241 160 19 308 -228 -77 -60 235 -10 -98 -27 149 1 142 347
5087 347 -47 -81 -49 -47 120 -115 -5 194 130 -96 93 348 -17 -199 68 -43 -29 66 -76 63 -179 -190 -82
5110 -82 -131 309 -111 -183 150 20 -57 40 -112 -125 -103 -213 144 37 -200 -46 137 224 157 26 162 -109 249
5133 249 16 -74 -95 -10 -107 26 -8 25 131 72 127 -204 27 -61 72 -49 -177 83 30 10 101 -27 -79 30
5157 30 11 -96 116 -41 -120 -215 311 -81 71 175 -58 149 41 135 -123 15 313 -92 -107 -7 -197 -282
5179 -282 125 268 -189 -39 126 42 11 45 -1 -169 -90 -40 9 -26 -74 193 70 93 -61 -262 -60 -126 -233 79
5203 79 -425 26 -9 122 -180 -287 -191 -37 -80 7 -103 -49 -45 23 249 -43 -77 119 -67 -92 32 -52 -94 -170 -28
5228 -28 128 152 -219 63 -1 246 49 -229 -27 -238 -91 59 40 -109 -15 -212 192 102 -58 -42 -186 26
5250 26 -72 144 -6 8 -70 120 -58 61 -114 -311 -155 10 120 -188 70 -30 -66 79 143 413 91 66
5272 66 -43 15 63 -171 -13 120 -131 126 114 48 -71 2 44 -170 35 -116 99 146 25 159 -69 -165 345
5295 345 169 122 60 289 -101 -66 159 -57 163 47 -7 -117 151 65 91 -191 12 -268 -293 134 -161 253
5317 253 -2 90 -2 -16 -34 -271 -289 -40 -38 -66 -21 -147 -106 -111 -175 50 -73 148 -146 -75 -121 29 170 -259 236
5342 236 -144 -132 57 139 -211 -211 -157 -128 26 -173 103 231 66 44 -252 74 253 -126 -38 67 -195 -68 0
5365 0 17 -184 -224 -74 -47 -90 25 117 280 191 -165 88 -36 -174 -115 21 -4 17 -115 -30 48 11 99 33 -375
5390 -375 13 181 66 218 -32 223 -148 327 78 185 -48 -2 -117 -23 -66 118 31 -64 107 -32 -71 117
5412 117 67 -12 49 -69 217 -82 -70 -238 150 126 14 -287 -209 -10 -12 254 88 -123 147 8 -50 -222 44
5435 44 88 -91 -121 182 90 65 -48 14 383 -12 -117 179 200 56 -29 121 -223 281 45 58 145 -241 146
5458 146 85 -126 339 -69 -203 42 8 -79 60 24 151 -67 -45 -62 -167 -151 -319 -106 140 91 86 1 -80 190
5482 190 43 73 -124 40 44 92 24 105 -143 69 -32 83 -138 38 123 -244 179 -45 192 274 149 -42 -465
5505 -465 186 331 247 0 -7 146 -48 220 -118 158 107 -108 -106 -19 57 93 164 129 142 5 54 -61 -43 243 286
5530 286 159 -143 14 33 250 156 95 180 85 188 -87 49 279 -128 160 -115 -357 258 37 247 154 43
5552 43 26 -201 127 259 -179 -79 65 138 67 2 -153 -193 -57 -108 -36 125 42 -115 182 -9 -27 77 156 -182
5576 -182 10 -74 -237 25 -18 -231 110 219 -60 66 89 24 104 21 -79 154 -131 -43 -273 -16 -44 45 -146
5599 -146 -21 11 -368 -98 -34 -20 -71 -84 -7 3 -17 -84 50 -143 170 -81 -202 109 -116 123 96 -270 199
5622 199 -249 -21 162 22 34 -49 69 65 195 49 95 37 45 84 203 64 -126 -192 150 -59 71 11 129 -117
5646 -117 -10 118 119 -151 179 7 -344 -5 144 38 -74 -113 -186 -275 27 86 270 7 -106 249 -103 -249
5668 -249 95 192 28 -48 53 -83 -148 133 -51 -112 -243 131 -108 -161 -53 35 -254 20 124 39 71 110 72
5691 72 -179 63 23 38 224 -70 -109 166 -28 81 15 -54 -116 -309 122 145 -203 -239 -233 -38 -142 67 -115 -71
5715 -71 147 -14 -161 68 -4 60 -383 -131 -9 78 -35 2 -4 161 266 -140 161 36 94 216 151 -293 -131
5738 -131 115 168 -120 -221 107 125 41 -65 128 -110 57 -265 108 75 -232 322 156 165 -10 -224 123 -28
5760 -28 10 236 245 159 85 -117 -22 -126 121 -105 -104 -33 -48 -49 22 -460 -15 110 -147 -127 -63 73 -9 159 -91 266
5786 266 -159 -9 -8 176 4 120 -33 -91 124 75 90 -104 114 -129 -142 -41 -61 58 -16 -170 -148 171 2
5809 2 73 122 -106 -98 59 -17 -281 27 57 269 219 -84 -159 -128 -174 209 200 0 62 74 -136 75 -41 -220 78
5834 78 -152 -162 -90 -115 -357 -34 -63 -99 110 -157 60 160 -166 -33 188 -53 166 -26 -100 -152 13 -107 67
5857 67 -39 211 221 105 -5 163 145 -111 84 -93 49 36 -206 -94 176 -71 -93 28 -21 -9 52 -41 -11
5880 -11 -100 -123 -121 -75 -154 -190 -26 -101 -130 162 -160 294 -248 89 105 -193 60 -44 15 -229 199 90 -111 -147
5904 -147 81 79 -68 215 254 42 113 185 -7 70 -135 265 82 -92 -227 -49 39 67 -24 -220 79 -158 13
5927 13 303 -177 -71 -224 -111 -32 64 100 -33 118 -105 -30 31 -66 146 98 167 -14 293 -177 144 -44 -52 -58
5951 -58 -40 -77 221 -124 193 -156 -141 182 41 191 -147 -136 -145 -45 -207 98 -98 89 80 7 -288 129 56 -6
5975 -6 -156 -42 -120 65 -117 219 7 -315 -146 -255 -45 27 65 -17 -119 -75 13 -9 -148 -49 112 123 159 -54
5999 -54 174 -259 -30 77 204 169 -128 -187 -93 179 -46 87 216 -30 -97 -18 -55 198 238 45 184 2 266
6022 266 19 149 218 14 -32 122 -97 -43 -110 -37 183 125 74 -40 -148 146 172 102 10 113 -420 -43 -128 80
6046 80 -64 31 91 -234 57 78 -320 -195 72 -103 294 129 100 313 259 -10 -154 203 -8 345 -83 -125
6068 -125 -92 -332 157 -122 -74 35 -127 93 -129 -58 124 154 -59 245 34 -19 -89 123 81 378 -304 24
6090 24 -256 -204 -44 -45 148 -229 -129 52 118 186 -4 -104 165 -61 -17 182 269 14 -159 -259 -62 -34 -159
6113 -159 -225 -6 176 -143 -258 63 68 -159 -239 83 11 16 371 -23 -162 66 -107 -120 286 45 105 76 154 -277
6137 -277 -191 354 -38 -98 -152 -79 -68 -339 -8 -156 -30 -89 72 -101 -50 -5 -321 -69 -11 3 243 27 -15 -133
6161 -133 34 147 -91 -153 -14 -78 -202 1 -52 264 70 -19 163 36 78 299 1 -18 97 271 97 -30
6183 -30 -63 66 -175 -272 71 206 0 220 -77 -37 175 -136 132 84 114 -128 73 -101 178 -195 -153 196
6205 196 -62 242 324 69 -31 -50 -8 -24 41 -223 -238 84 -53 -163 93 -54 217 -26 20 12 -46 -124 101 30
6229 30 -16 -161 52 -78 -105 -126 71 25 22 169 83 174 -167 113 142 351 65 -184 -16 -76 -17 -266 1 -93
6253 -93 132 199 -76 -28 -7 75 -99 -84 26 -34 -95 -354 -149 288 4 122 30 162 -37 -279 -359 -304 -64 -110
6277 -110 -54 -10 -24 -58 1 135 65 77 49 203 88 296 65 -200 -155 -319 30 61 142 -68 25 7 9 -56 6 80
6303 80 123 -44 50 31 355 -106 39 164 -12 172 -180 -90 122 -24 15 -382 -166 -155 322 78 2 163 -93
6326 -93 -175 -75 -250 90 100 -98 241 -69 41 123 175 77 -90 -101 -49 -24 127 180 -147 115 116 274 171 -134
6350 -134 -56 -59 -39 58 174 -307 -210 3 -172 13 -34 137 -109 74 95 -130 -17 82 63 65 -138 152 299 -250
6374 -250 157 198 12 55 37 188 81 -373 150 277 144 -164 339 165 68 111 -15 -77 16 98 137 -11 35
6397 35 -54 -115 -17 186 36 283 132 -141 -24 23 -81 31 17 143 -64 220 -434 23 144 -27 -167 -42
6419 -42 -149 -165 -125 151 -96 -32 185 -220 -187 -293 69 127 179 239 -37 325 187 -174 238 -295 131 -189 106
6442 106 46 164 -142 -259 -38 -191 3 -66 -120 97 235 -193 -17 309 63 -24 -70 74 -18 -178 223 -22
6464 -22 16 109 -65 -187 118 -10 -117 -104 389 207 -21 -11 -95 50 133 67 -107 -27 -48 -80 -77 2 58 237 26
6489 26 77 -124 -196 -118 -79 -107 15 -29 -182 -77 48 -126 -107 -69 38 -121 -130 -209 45 -51 -61 135 285 -143 201
6514 201 -142 -282 -7 -23 100 13 255 251 -120 -43 -32 -80 -44 142 95 -12 107 20 -211 80 -212 -191 -25 119
6538 119 -84 42 135 53 -43 222 11 98 286 58 240 167 -116 96 255 -96 -246 231 81 -298 -115 -314
6560 -314 262 -52 -109 102 -106 -72 7 -25 -335 283 35 57 218 -29 -249 46 43 -22 -37 -210 -30 -4 -313
6583 -313 -117 -4 -293 -24 -61 -2 225 316 -9 -7 -343 -23 -130 -20 -24 10 116 -69 210 -111 -131 3 96
6606 96 57 -169 63 238 -14 -84 -60 87 -288 65 -14 6 -87 -57 31 314 -4 8 -19 -146 -194 -57 -107 -116 -182
6631 -182 -128 17 52 -47 157 50 97 -192 180 -194 134 -35 76 52 -204 140 76 -55 -119 5 -104 56
6653 56 48 40 35 -346 37 87 -127 -31 -10 6 43 141 125 274 -217 6 73 -72 -59 -6 174 16 12 -133 135 -7
6679 -7 86 -306 -46 223 -131 121 64 83 -242 47 -10 -97 1 -84 11 129 -47 -83 165 -97 -134 49 256 94
6703 94 53 -296 3 -154 44 23 187 -2 -111 95 242 2 159 -114 130 16 76 185 46 98 142 109
6725 109 152 14 -32 -111 -141 10 -200 -144 -42 -51 -189 -65 -275 -90 176 203 -229 132 327 53 49 -120 -55 113
6749 113 261 -79 101 212 59 -26 -131 -85 179 -51 21 161 -37 103 -30 161 -123 -16 101 -151 174
6770 174 -139 -318 -126 96 8 159 20 -10 454 270 -53 41 -88 40 -188 -42 -221 79 80 150 187 -50
6792 -50 -2 237 -17 -28 202 56 -200 96 26 -242 85 -141 93 -171 -209 -10 177 72 67 -163 -93 -1 -84
6815 -84 63 -100 -244 117 -73 -94 38 45 -49 268 39 -177 -7 452 -108 -79 -177 16 -228 219 -109 60
6837 60 -18 72 -15 99 36 57 -110 -109 121 -59 133 -66 -77 3 91 -156 -180 40 -201 246 240 -98 178 -75 -24
6862 -24 49 115 171 -133 19 -75 -156 -7 -216 -114 84 -74 102 -49 17 -73 164 13 16 138 19 160 -155
6885 -155 127 -21 245 -164 89 283 59 121 133 -144 -242 -127 181 38 -236 172 -3 -119 -50 97 -17
6906 -17 101 34 -56 358 -251 -79 -137 101 -73 -74 -24 135 130 -80 -115 -224 40 -58 236 133 209 -170 161 -131
6930 -131 -336 -108 1 134 -24 -29 -139 341 73 -107 -188 123 35 96 369 -245 200 -65 184 62 120 -165
6952 -165 -88 179 -275 -34 258 6 -134 -56 -102 -119 -133 -13 -227 114 101 -95 145 33 -46 143 -137 190
6974 190 28 -80 -200 92 127 65 -219 174 89 -374 -114 -100 -60 -89 150 -296 78 267 -95 177 -16 284
6996 284 2 44 -139 -33 93 -20 -205 77 -80 -353 23 -75 -159 224 83 13 -45 185 -45 -1 -161 95
7018 95 16 -133 70 21 -232 -11 69 -273 81 -98 -93 -158 206 34 -95 -152 12 -24 -307 66 210 -60 168
7041 168 88 151 -59 97 92 299 324 -36 -57 206 100 -211 -246 54 -22 65 62 -17 -235 -139 122 -127 274 117
7065 117 245 46 -182 -111 -145 40 106 183 57 453 -43 -38 5 -17 -147 27 -68 -253 -101 16 178 265 -116
7088 -116 100 422 -124 -145 -192 -30 -147 76 26 30 -55 60 65 -156 39 -90 122 18 414 -77 -149 151 105
7111 105 105 50 184 -1 2 56 251 7 44 -213 -221 14 -57 217 311 -156 -238 230 -9 211 -85 -265 -144 -62
7135 -62 279 -106 -87 -79 20 136 82 211 -2 124 -85 158 73 5 130 119 47 -181 -190 -22 79 83 -149 -164 -37
7160 -37 11 48 -106 -229 155 41 3 -61 -55 -22 160 22 -148 -231 -104 -5 -74 19 -183 108 -42 74 41 320
7184 320 135 -49 62 -123 -19 -46 189 -41 234 -58 -66 -224 275 -305 -46 33 -139 -59 179 109 -110 72
7206 72 -240 29 146 -45 151 70 -77 117 126 -335 350 -38 -147 -196 28 -27 -143 85 -464 316 9 153
7228 153 -123 -70 71 96 -321 -130 -169 25 -66 -45 54 -61 -105 213 -35 -56 1 -17 -23 -164 -303 77 -86 172
7252 172 40 -54 -92 -209 -19 -271 152 96 6 -136 -27 -236 -7 167 -199 -246 108 -90 106 91 -40 153
7274 153 10 18 239 -59 -5 -112 40 -113 45 -36 -43 -302 -235 61 171 127 -136 -65 34 125 -110 -43 -100 -79 165
7299 165 82 77 50 86 -95 105 -370 117 322 -85 54 75 -187 -41 -34 167 16 -24 207 169 -4 -136 -308
7322 -308 125 148 32 242 -99 154 187 148 -78 86 -221 236 -141 19 -67 10 164 -72 186 242 37 136
7344 136 87 -8 -136 -98 14 93 -148 49 -126 105 -226 45 208 -90 4 235 -159 37 308 -170 -110 -322
7366 -322 16 -14 169 136 -37 -102 -38 -136 -37 120 93 104 15 272 -103 40 153 -4 151 171 -38 -300 235
7389 235 50 106 69 -161 -158 -59 -38 -312 -34 -78 346 176 -82 121 -121 -77 33 212 -232 -19 29 -100 228
7412 228 205 -212 229 3 -43 43 -292 -47 166 -3 -222 -224 -43 -130 167 -69 246 -28 -76 239 64 -105
7434 -105 15 -15 163 -61 38 -1 -255 118 220 -52 -200 24 86 126 167 -215 -149 34 60 110 214 -114 -38
7457 -38 112 -1 29 -130 -7 -227 113 -219 -85 76 102 -60 249 149 210 -1 47 -116 -132 63 -50 -79
7479 -79 -97 -190 -14 -132 -15 -225 283 29 -174 78 15 34 190 53 143 73 267 -129 115 68 -69 -68 200
7502 200 -15 54 191 -81 113 -235 -45 -50 75 -48 -113 -239 -224 -75 -53 -3 203 -49 -55 -183 65 -140 -146 29
7526 29 -45 120 -158 -306 86 129 48 -209 74 176 36 164 175 -40 -39 -43 -111 -86 160 126 29 -69 38 29 177
7551 177 62 -253 235 256 74 44 -74 11 -124 168 30 -84 133 -6 211 -147 -71 117 -45 37 138 -240
7573 -240 140 214 -141 20 -104 -109 -124 -68 139 -50 -19 21 -264 -107 104 -2 -60 27 -142 -155 95 55 224 -119
7597 -119 -89 -68 -48 31 -231 279 -270 -128 -67 61 -63 -75 -216 78 84 76 -265 5 244 -45 36 321 215 304
7621 304 -153 56 -9 172 125 24 -63 147 -124 111 -82 78 238 -58 -24 12 -197 -201 71 82 -2 -3 -190 -185
7645 -185 164 222 17 -44 140 -16 -77 -205 -237 35 -231 -87 -3 132 77 290 127 154 -68 97 -17 -32 164
7668 164 -19 -115 20 -39 -9 162 -122 -160 -153 -146 -83 -246 -139 -51 -21 234 -243 182 172 205 -129 292 161 100 -71
7693 -71 274 -87 -45 159 45 -137 -119 -41 -10 116 -185 -5 193 -138 -255 47 109 -31 164 50 317 34
7715 34 -364 38 8 -1 -84 -8 245 153 -166 259 11 2 196 -14 -14 -62 -2 -72 -64 -145 -6 78 -208 76 218 20
7741 20 -33 -85 110 15 -92 8 -38 219 17 130 127 222 51 -68 -186 -215 105 -4 240 -83 -113 -67 215 82
7765 82 358 -183 345 57 107 53 -276 39 -248 -179 -31 196 2 -55 363 262 69 -284 27 -242 119 -180
7787 -180 65 -147 -22 234 107 137 -86 -112 -127 -129 79 119 -56 -143 67 -12 51 -386 -84 54 -5 9 10 -243
7811 -243 75 76 149 -185 154 14 -113 -49 157 132 12 114 -6 286 -86 -2 213 20 -54 228 258 36 4
7834 4 -75 61 -61 54 -50 234 -9 151 -126 -154 -175 -6 123 -125 74 166 -133 18 -136 66 55 -123
7856 -123 84 123 4 -73 51 -34 25 77 261 -107 58 49 -35 247 70 -280 -122 234 -103 -254 155 -124 -71
7879 -71 202 -12 206 -83 452 46 -37 -106 -115 -173 -66 46 -249 -190 -44 -68 -165 5 -233 122 -33 73 166
7902 166 -205 -232 61 211 114 102 45 140 -184 -291 -180 8 114 -73 -49 184 149 4 121 88 281 -190 -100
7925 -100 -25 132 60 -61 -150 100 115 -24 208 211 -167 183 -1 44 262 -16 -72 -87 89 10 -232 -28 -13 97
7949 97 11 77 199 53 129 -48 -92 231 70 -174 -8 146 77 22 215 39 -2 106 -34 -3 -283 220 -330
7972 -330 -46 32 84 -110 -172 105 159 -45 -183 -68 211 118 83 212 -12 113 95 81 -166 434 115 279 -132
7995 -132 334 61 -51 -78 162 -3 46 -137 7 -24 -326 -86 2 20 -94 -119 -101 80 -27 93 11 13 -51 272
8019 272 161 -86 12 -159 73 66 170 38 27 -216 250 24 178 103 85 137 -348 67 95 -103 -73 13 29 49
8043 49 82 301 -199 -98 -195 -167 -3 -60 -60 -86 -159 75 -46 144 92 69 114 109 -62 -265 58 -62 150 107 176
8068 176 5 -68 -4 124 -181 153 -352 -125 151 234 118 -92 -55 -163 61 -192 171 -74 -250 131 -184
8089 -184 -110 -160 36 -103 -11 -50 -94 101 -179 -292 -64 -30 -66 0 -13 -53 -57 -84 54 -42 -95 -73 -243 123 -289
8114 -289 -156 -25 158 165 224 224 52 7 90 79 94 -14 5 165 14 -99 -146 199 -57 -39 -395 13 3 97 -104
8139 -104 86 7 -25 -27 -90 115 110 82 -123 67 261 0 6 47 193 -107 -40 19 94 221 -145 193 34 -109 -11
8164 -11 -180 -15 -101 -53 249 63 31 55 10 134 130 -45 -338 -15 117 -152 -127 -264 6 82 6 -247 -224 -165
8188 -165 92 -127 -73
8191g3
$$ Imaginary data points
##PAGE= N=2
##DATA TABLE= (X++(I..I)), XYDATA
0 0 0 0 0 0 0 0 0 0 0 0 0 0 0 -8 8 -8 8 -8 16 -16 16 -24 24 -32 34 -40 48 -56 64 -72 86 -96 110 -126 142
35 142 -158 178 -198 222 -248 278 -308 341 -378 418 -463 510 -563 620 -683 751 -828 913 -1007
54 -1007 1113 -1233 1367 -1523 1704 -1916 2170 -2480 2869 -3377 4067 -5059 6625 -9467 16325
69 16325 -73290 -31010 38165 -82089 -5356 35407 -24571 -9612 26267 -18880 -1652 16124
81 16124 -16053 -9317 24419 -2277 4404 29590 5838 654 25242 4221 -672 17056 6907
94 6907 -2248 4343 -4013 -3765 876 -10391 -12926 738 -6589 -12072 956 -338 -7606 417 -6513
109 -6513 -9742 -302 -8819 -9490 5588 -74 -3312 10196 6209 -1355 8621 7725 -3108 3281 7913
124 7913 -1938 2571 8308 882 3935 6035 -2935 -1149 2160 -5238 -4091 889 -2269 -4991 -804
139 -804 -1642 -4688 -2336 -2366 -4803 -2337 -1840 -1531 1018 1084 1193 1858 345 786 1202 1095 1732 1806 2513
158 2513 3252 2318 1896 1633 1487 -511 -1570 142 -938 -1781 436 -395 -1869 -105 -1494 -2741 -1266
175 -1266 -1579 -2357 -1345 35 -363 -409 1317 593 -97 1281 -118 -558 1400 878 876 1893 1728 1064 910
194 910 817 266 -798 216 -517 -940 52 -401 -933 -403 -661 -1180 -1414 -871 -615 -1137 -157 368 -246 253
214 253 569 14 341 347 253 300 272 1034 446 938 1116 256 403 496 -458 -80 76 -541 57 38 -70 -216 -216
237 -216 -348 -708 -576 -735 -295 -162 190 -90 -94 338 46 48 -57 312 112 384 707 76 190 709 159 239
259 239 219 -105 -30 18 -42 109 100 -317 -43 -424 -252 -368 -366 -431 -600 -304 145 -57 158 43 284 -11 -255
282 -255 -99 281 -42 432 720 295 278 457 352 294 -130 -38 68 74 13 -72 230 -167 -206 -441 -262 -579 -502
305 -502 -7 -248 -180 -124 -35 -162 42 -142 -44 217 -200 -337 396 392 325 420 410 377 371 277 519 295 26 371 49
330 49 458 218 299 -120 -312 131 -519 -80 -42 18 -290 -189 -447 88 -276 -278 -8 -212 -431 -124 -49 108 -126
353 -126 -147 222 -30 390 158 -55 232 450 38 137 341 72 282 -273 151 52 -89 -21 -191 14 65 -298
375 -298 -213 14 -219 -224 -7 -184 -77 44 124 102 -286 36 -45 -221 37 -298 42 -124 150 190 89 58 -270
398 -270 -43 7 130 -16 84 177 81 152 -92 390 -337 105 34 47 6 -253 -89 98 -24 -24 70 -61 -177 -102
422 -102 -72 155 -158 342 -70 16 -12 222 -222 -116 -5 226 127 58 147 25 145 96 -146 -208 -67 42 76
445 76 -185 303 2 383 -9 -373 -139 -29 -45 51 -42 -31 -11 -67 126 -102 -15 -159 -159 64 -114 -40 65 -30
469 -30 -83 -169 -35 71 -276 127 -79 120 124 -97 7 -155 223 21 126 250 27 -53 179 209 -92 -246 286
492 286 5 -31 -18 29 -98 -207 4 185 51 -49 -344 94 28 -175 50 -105 131 -47 -300 98 -117 -28
514 -28 178 -344 -9 -87 138 -46 191 271 30 293 262 4 61 -110 -312 -31 -131 188 109 182 -251 -31 32
537 32 10 389 24 -41 47 -60 -111 163 -220 38 -235 -24 -228 -100 222 369 10 112 207 -15 96 37 263
560 263 -40 -191 -79 -8 7 -32 -128 112 141 254 -211 -140 47 -116 43 -100 181 -47 293 67 173 -57
582 -57 -29 -75 -78 188 -150 -14 29 348 109 185 14 84 -31 -277 74 -316 78 71 108 -70 139 63 -207 -411
606 -411 7 -48 97 129 -298 217 -30 -161 123 -8 85 -312 74 89 181 -3 13 -102 16 -18 -105 85 -218
629 -218 145 384 -37 140 -77 -43 7 82 -25 -78 -317 70 66 155 -226 224 86 148 -167 16 148 -154 42
652 42 70 59 27 107 -292 -33 -52 340 62 -62 -319 -129 39 -132 -36 -45 35 72 15 19 263 -20 239 -49 137
677 137 9 -414 -47 217 -71 204 -40 -71 -297 132 302 -190 416 -3 -223 -7 -13 120 88 -245 -47 318
699 318 -243 -5 141 -272 168 -49 -11 212 -33 -131 -48 -57 -126 330 377 -14 157 17 -1 -71 207 17 7 -47
723 -47 28 158 -59 211 -123 258 177 -94 -1 -181 -171 -84 176 -29 228 7 -216 82 -3 129 -173 -83 374
746 374 -188 -20 243 13 -49 91 -129 14 -46 73 73 54 -155 -87 -15 -161 -179 -223 -126 -72 162 -152 -309 66
770 66 -55 -96 23 149 -137 36 -72 115 -69 -150 -152 148 -9 -12 63 195 -181 -21 192 -30 308 -34 269
793 269 28 0 -104 -28 26 324 101 -10 -30 15 213 -96 -386 -31 -328 78 54 -309 237 246 -7 90 -82
816 -82 -207 54 229 3 193 54 -156 301 181 -65 -8 -115 25 171 -198 -64 27 184 -65 175 -85
837 -85 -91 -88 -187 24 -149 -25 189 -27 70 43 188 59 -96 27 227 100 35 -150 93 -246 192 130 78 130
861 130 339 95 -24 132 -29 -140 156 217 -147 -42 -101 -188 -21 -104 -202 36 143 72 -268 -118 -50 47 -118
884 -118 -1 -258 58 -48 -132 -15 -84 64 133 -16 -52 -199 -36 -19 133 -186 91 217 -51 -115 -92 -162 -404
907 -404 -92 8 77 -8 -111 1 -44 69 -81 -72 6 6 -13 103 -325 -44 60 -167 -50 71 195 189 10 2 192
932 192 -33 171 50 180 104 146 -257 173 250 -74 77 46 -321 -112 -115 -225 -117 212 171 -133 164 92 -124
955 -124 -157 29 -101 -62 -39 -65 21 -209 -82 -302 25 -78 41 -7 274 168 2 -96 -187 -18 89 54 -186
978 -186 -50 -247 -179 -281 -102 97 -101 -3 -84 46 4 209 -245 -60 -89 -123 -17 -124 -39 -35 -44 26 -103 22
1002 22 341 138 66 143 65 -21 -198 -268 117 -45 -67 89 -3 -132 -81 197 -69 -198 -133 -43 45 -131 -122 95 53
1027 53 69 97 40 -148 -85 39 -4 39 114 41 50 -367 -50 -9 228 -31 -97 201 -140 -211 -57 1 115 83 -211
1052 -211 -164 -25 139 148 -137 215 116 -139 145 71 143 -163 -280 94 59 -108 103 -40 -239 40 43 215 -90
1075 -90 125 104 -34 78 -87 342 117 -14 -55 -15 -93 244 114 -127 -36 126 84 62 -12 -45 84 127 -122 -41
1099 -41 166 -215 82 134 92 186 8 -94 -22 2 -26 7 -38 -58 92 9 -145 187 9 112 24 77 -105 -180 97
1124 97 -78 383 -51 62 -14 -224 37 -116 -155 -239 118 -128 -181 -135 -175 277 -114 -82 -288 -33 1 -35 -17 -72
1148 -72 63 -100 -206 2 -57 253 -146 -113 -116 51 -170 -427 52 -151 63 21 -368 -325 -15 -37 -73 122 -235
1171 -235 -134 -198 39 69 78 -211 113 35 -55 16 -206 -205 -40 -63 -150 -180 -212 -126 -86 -32 -37 -73 -4 119 -104 58 243
1198 243 -39 -212 88 125 -148 62 100 -159 15 6 -1 170 62 -232 47 282 -61 80 -68 -234 -45 -152
1220 -152 342 139 154 21 -139 -6 -20 148 80 -51 369 -261 -43 215 -132 -178 1 -53 155 -200 -204 232
1242 232 -215 -78 194 132 -50 -103 -41 240 241 134 -66 185 -42 14 -12 -25 176 -88 22 -106 68 -68 -3
1265 -3 11 23 241 -80 -228 23 -9 303 -60 39 -125 115 62 145 20 302 -86 46 62 -58 446 140 -82
1288 -82 159 -47 -137 -120 110 42 34 104 -19 -16 -239 -110 -149 -136 -211 159 337 -112 -6 23 7 -72 -52 71 -189
1313 -189 -69 -68 -89 -85 67 -94 -76 -100 122 69 157 -88 -4 -1 -176 -19 131 -10 -21 71 31 188 24 -270 33
1338 33 35 290 -9 29 -90 -150 -230 -9 -4 153 48 115 -154 -100 137 185 -110 -93 -187 -39 -39 38 158 151 -78 337
1364 337 -127 45 19 -39 195 -214 -99 -113 -94 31 34 -37 -28 -185 157 -191 -141 271 -210 -112 -205 118 -85 -44
1388 -44 184 51 68 64 134 -170 -80 45 15 5 -148 -73 151 83 -266 48 174 -18 -117 -90 79 450 83 149
1412 149 -169 -79 161 -16 104 145 67 -122 2 235 -93 -339 55 123 167 237 -96 -10 -96 -52 12 -34 27 250
1436 250 161 61 179 -66 83 -59 166 -144 191 96 -93 -125 315 -135 57 8 93 -185 -37 253 10 -54
1458 -54 -118 -170 32 147 -168 -72 14 -29 -170 -36 -151 8 -53 -87 320 -60 -154 -269 113 59 -140 180 162 -235
1482 -235 -138 188 237 -73 214 289 -42 -21 204 -43 19 26 -21 140 18 36 -212 315 -7 -3 156 160 -56 -64 193
1507 193 65 -151 119 148 -128 48 169 -2 -149 102 -115 -256 -191 47 -206 -35 -143 -118 -18 -34 30 -119
1529 -119 91 147 -46 77 -186 -1 -114 -16 -71 158 -55 -173 328 -34 27 -36 -37 170 81 186 -284 -89 -101
1552 -101 88 -21 47 16 -79 -127 -104 208 8 -34 54 87 195 238 90 60 -189 -183 23 -64 -404 -1 -63 -83 190
1577 190 9 -158 196 -294 -46 206 -142 -83 -223 108 -11 66 -163 -71 96 13 98 191 -239 113 -26 -157
1599 -157 -11 -122 -135 66 -281 162 -31 76 -354 -50 -49 -158 -227 -46 -6 -114 75 -46 -182 6 -133 -244
1621 -244 17 -220 -5 -32 25 -206 99 20 -158 86 67 52 -205 -276 -73 -320 279 31 -101 -52 92 -22
1643 -22 -49 -87 -117 -237 46 161 -85 88 22 -176 17 207 71 -17 -24 114 118 -45 -48 -18 -23 25 -233 -201 25 147
1669 147 -162 -45 -181 -35 -58 -78 60 -114 54 137 223 -240 -174 -75 -141 -132 76 -103 -237 89 -194 59 280
1692 280 -133 92 -19 -61 -241 -342 182 84 32 27 122 276 -15 155 -204 -131 -68 -55 152 -49 -158 -172 -27
1715 -27 -145 -78 65 40 -242 -46 27 -69 74 -141 -277 161 -23 248 -210 -50 -89 -29 297 -41 -53 -265 -16
1738 -16 -171 104 -344 -117 111 56 52 -152 -50 72 -96 -66 106 51 84 28 9 -128 -333 95 13 -155 -99 69
1762 69 -1 -19 123 -239 -34 -22 62 -141 -30 143 -43 -94 -26 -35 66 341 -17 -54 -86 110 -251 -201 -183 -87 -164
1787 -164 30 108 -239 92 -26 -11 34 -172 -57 160 122 -161 -194 127 42 -42 119 -142 -27 -89 -95 119 144 -93
1811 -93 84 -232 -160 130 -39 -119 -147 -34 158 -109 -85 -29 -10 209 131 269 -201 231 -84 -25 -50 -35 -32 78
1835 78 -104 -102 383 -36 13 -99 214 -200 -75 -75 -91 222 261 -17 -139 -260 -251 -141 -33 -98 136 104 -88 -61
1859 -61 -63 -53 20 33 160 23 126 127 57 -78 -186 61 -43 76 -78 90 100 48 -145 -29 -151 62 180 314
1883 314 -13 7 -218 -54 -218 -194 8 -105 -110 14 -108 83 57 -96 -236 -53 -25 -99 -87 202 106 24 -70 47
1907 47 299 -151 27 133 -153 64 14 -65 147 148 89 -211 -90 97 61 -50 70 32 -8 -2 198 124 290 14
1931 14 197 -44 -131 -111 -280 44 -17 -67 -352 43 -33 -22 79 67 -141 131 37 146 159 219 113 79 -418 40
1955 40 -134 -238 310 38 -72 90 -110 -174 -193 206 -156 -44 269 -66 64 -141 -79 35 -168 -88 112 -15
1977 -15 26 66 -22 129 -190 247 10 -138 -6 136 193 -239 83 -194 86 -84 290 -113 -94 33 152 121
1999 121 -16 -158 130 -217 149 162 -57 -123 -34 169 44 -46 -121 -106 -197 -56 145 79 24 165 -110 -8 48
2022 48 -167 88 420 -63 300 -189 179 -17 -95 58 123 -82 20 104 -255 63 28 118 -70 -3 156 -7
2044 -7 -213 -219 124 -331 -50 -368 95 89 79 98 -140 219 -35 -273 -111 -255 -35 -20 -119 -106 -57 105 -187 35
2068 35 6 -300 -77 54 -90 164 -59 127 107 -40 47 7 -45 17 141 252 52 -24 90 -12 -194 148 -202
2091 -202 -150 -67 -44 -14 179 223 -83 362 -76 9 20 31 62 76 -13 -219 264 69 28 -2 -37 110 179 108 172 131
2117 131 113 -270 -240 -192 175 210 -195 -181 -84 314 45 -99 138 -17 43 378 -129 109 -120 -116 -373 116 -2
2140 -2 57 -256 210 230 319 245 -75 14 -175 -148 -139 -74 -88 141 -47 -159 174 -204 137 -318 3 114 -37 128
2164 128 198 381 -139 -46 -87 69 -124 19 32 -43 88 26 -27 31 127 -52 274 -37 -201 -3 -55 81 -212
2187 -212 156 164 -230 -110 34 -303 21 -77 6 -42 63 -83 -268 70 -208 44 45 11 72 -122 -64 222 -192
2210 -192 -107 -107 104 60 46 -283 -37 -124 -93 -5 -42 112 -102 -132 -19 -121 22 -158 36 -54 89 -39 -63 62
2234 62 -40 -21 -176 -117 233 107 57 -4 82 81 -3 -176 278 9 -17 189 99 -71 -113 14 -178 -135 -18 79 -75
2259 -75 181 -45 67 46 -184 63 68 303 -67 73 26 -132 -115 -10 -148 118 264 -139 0 96 -203 1
2281 1 110 114 28 -108 334 -25 230 202 -110 17 -41 53 -276 87 78 -211 -192 -213 82 129 65 261 119 -234 83
2306 83 -319 -218 62 -41 130 -21 -129 -14 -165 -131 125 14 -126 -1 63 116 8 209 10 40 41 86 -245
2329 -245 -74 -114 118 136 147 -51 -129 110 -77 9 -136 176 -180 -140 -105 -5 -43 -27 -230 208 100 -106 43
2352 43 194 -25 42 27 70 -138 -142 70 125 -162 -219 -136 201 -51 162 67 60 -93 -105 143 -73 69 -289 -15
2376 -15 -192 -26 -123 129 -12 -148 266 94 75 22 112 208 25 -43 50 100 171 299 28 49 123 -4 -98 229
2400 229 -174 -240 -123 142 131 -32 -168 101 144 -189 121 -112 -50 235 -231 -30 -13 -275 -29 -372 144 26
2422 26 -43 221 -215 -136 226 -125 37 -87 -12 -93 -131 -66 -159 277 108 -159 -180 57 121 150 42 -80 -44 17
2446 17 -80 94 -63 57 -298 -10 -222 4 241 -55 -5 149 44 25 -58 313 146 34 -146 -17 -118 -152
2468 -152 -167 -76 -84 -15 48 135 106 157 -195 66 -196 -131 129 -75 -127 301 163 -234 -47 157 -78 44 -230 -32
2492 -32 -53 -132 84 -26 -14 -40 -126 -102 25 -82 -94 -133 131 127 -230 93 -4 -92 -22 -86 -55 152 -34 42 61 117
2518 117 -84 243 119 145 -74 -149 63 -23 -91 -29 -242 75 29 176 -93 -263 74 29 -97 23 -109 71
2540 71 -74 -146 41 71 101 186 -36 378 2 64 328 -66 -218 -2 82 -48 22 177 76 32 19 -122 -93 6
2564 6 96 73 249 -127 32 63 -218 -172 -123 38 43 142 172 5 147 -52 -93 -47 81 130 -107 -8 -214 -77 -76 -122
2590 -122 -163 -176 -164 51 15 68 95 -243 -49 85 -119 51 -388 -262 -45 -147 104 -166 -180 154 126 262 159
2613 159 -98 -67 -35 107 29 175 -35 102 261 38 -30 -23 -94 -181 127 -132 287 35 -64 217 -7 36 135 224
2637 224 -123 -174 -66 -26 31 166 -101 -74 141 -182 -147 -103 -186 110 -184 157 -28 -81 44 13 -163 1 -158
2660 -158 28 -180 252 219 184 194 -183 -32 189 1 153 260 -59 187 -103 99 -342 42 93 19 -25 -154
2682 -154 252 325 -46 257 181 -204 -176 11 -156 -136 -134 205 -275 -73 -42 -32 74 -130 -73 -65 -228 -371 13 235
2706 235 -11 -169 -47 -224 -214 198 -51 -114 114 6 266 67 25 -119 102 245 -37 68 14 -90 -109 149
2728 149 52 56 39 17 -50 111 23 323 -92 -136 -126 -304 241 -115 130 -275 -111 -34 226 92 261 -193 -123 27
2752 27 -7 -65 -69 96 -31 8 -43 -31 11 58 -34 -124 122 208 403 35 244 138 194 -145 52 -170 72 -56 5
2777 5 152 94 286 106 -97 -124 33 92 88 -41 369 102 103 144 -118 129 95 165 -251 -62 -317 -113 -111 -165 7
2802 7 34 -36 9 -65 -229 46 24 -26 54 -75 -83 -71 -149 -158 -213 -241 171 22 225 127 59 -63 -286 -79 190 -195
2828 -195 115 -144 -12 -71 91 -94 133 38 -272 254 -123 -19 133 -2 -268 260 -170 -39 -108 39 -222
2849 -222 -135 56 170 -3 -238 -107 -166 -55 85 -78 -68 151 21 93 70 304 -32 14 159 -74 106 127
2871 127 -220 219 79 -312 3 -356 205 37 -108 -19 100 -168 146 -22 105 -145 77 -122 -90 -141 -184
2892 -184 36 -209 50 -6 257 139 -214 90 -126 -54 27 -73 -51 -176 -40 -42 -16 -130 -119 95 -93 60 20
2915 20 -43 10 -236 118 9 118 -254 171 -120 16 23 -31 -17 -4 -18 -33 -47 -146 -91 -245 64 -269 2 -67 67
2940 67 -214 241 -43 27 -6 239 -174 106 146 -15 -207 -283 10 121 -3 -260 44 -37 263 -59 156 91
2962 91 -20 78 104 -57 8 -138 41 -308 169 235 -69 -26 -40 6 -150 83 -40 297 115 120 -31 -13 184 196
2986 196 -102 -115 67 41 -7 -28 -98 -101 -3 195 -36 28 6 193 -89 16 144 139 228 24 -106 105 -98 58
3010 58 40 61 172 -112 118 330 32 -53 -81 160 170 122 -15 -114 80 -188 -87 84 -243 176 2 88 -97
3033 -97 130 106 -119 -63 150 -162 100 175 -212 -133 -59 -135 45 135 -119 12 -28 -99 83 -215 -87 -16 -49 -56 5
3058 5 174 -73 117 -106 94 203 573 -291 36 -89 -275 -63 -329 -40 -53 -46 241 -143 119 30 -40 139
3080 139 60 69 -90 -112 101 13 -150 -131 -297 -103 189 142 -36 -96 -9 -52 137 -29 -162 -47 164 -126 -95 30
3104 30 -119 100 89 -37 -9 206 -290 82 -6 71 -313 60 -238 -5 -116 -3 -55 -36 119 -78 21 21 -428
3127 -428 126 -118 -26 -140 97 -30 -25 176 -60 -166 -449 -162 -142 171 -73 99 163 73 88 -109 -153 121 -261
3150 -261 -65 -285 -197 -185 -115 -119 -175 311 -117 -116 278 32 -19 144 89 2 -340 -5 -180 287 77 108 -40 -120
3174 -120 337 -109 -47 -29 35 58 -98 27 -208 63 15 87 35 -30 -71 185 -169 -184 -173 -162 -181 -139 -155 -138 -43 -55
3200 -55 -11 -192 250 208 5 106 15 -294 -133 14 -64 68 43 139 176 103 326 -14 285 241 127 100 -77 -62
3224 -62 -189 -128 -70 -301 -94 -142 200 208 -17 -110 21 -1 -107 145 15 -130 -118 -131 46 -30 -93 54 -38 242
3248 242 111 196 69 62 129 15 173 -18 112 165 -37 -33 -163 33 -1 332 -8 -92 -47 -44 11 214 -374 -344 254
3273 254 31 -193 -151 -53 -183 19 -64 -44 -35 91 -245 -325 -172 -139 59 -313 -141 125 5 -12 215 -71 -292
3296 -292 105 -13 -56 -82 -79 -135 25 57 -188 -310 -17 86 10 108 38 302 -53 -26 48 -215 141 139 15 120
3320 120 -122 -224 -98 -222 175 1 154 79 -113 -156 100 275 13 -125 58 -168 -174 -33 118 -6 -172
3341 -172 89 -157 -166 54 263 -142 224 209 55 53 -196 10 -127 58 -25 -204 -346 -104 -85 -123 -108 187 -189
3364 -189 -14 -259 -109 -112 -21 -68 110 46 47 -130 -98 525 79 192 -194 -32 -252 75 102 -154 -131 149 142 122
3388 122 -152 46 -225 -71 46 -167 -84 -43 -164 -311 29 -371 263 -260 -291 24 15 -4 -8 81 112 -299 -186
3411 -186 58 158 13 -255 89 -39 -49 -34 -178 32 70 -42 -55 -72 82 -158 60 32 148 231 23 273
3433 273 -69 -29 52 44 -136 -112 232 112 -101 -69 180 -16 95 293 -26 4 16 -142 110 -184 -148 -106 66
3456 66 -43 186 -6 90 215 -8 8 -143 -210 -114 -33 -108 -12 238 113 8 239 220 -71 88 -151 73 -331
3479 -331 90 124 5 85 -115 -187 112 21 -61 117 -71 181 -194 350 49 -266 145 69 -162 300 113 -100
3501 -100 25 126 -140 -266 -98 -3 -27 -58 -216 41 93 -31 -128 241 33 3 -144 251 -134 100 -132 -61
3523 -61 125 100 60 -110 2 -75 -167 -15 273 135 111 11 -236 -331 -71 -227 48 29 -259 -152 203 114 58
3546 58 -68 -29 -352 -133 29 74 -119 -87 -126 -231 -178 60 99 -110 167 -147 -15 -146 -53 134 -35 139 123
3569 123 -103 -16 14 212 104 -61 -146 89 317 70 162 116 56 51 164 66 -180 185 279 70 -117 -273 156
3592 156 -42 -111 106 -172 27 80 61 25 75 -44 140 -65 -69 -19 -237 -195 91 148 -226 -246 115 -157 165 -316
3616 -316 -77 162 -2 -124 -18 106 89 117 -113 -11 223 -74 -32 -52 -146 -435 175 -105 -68 18 27 20 -164 230
3640 230 -3 293 -136 -56 -28 -208 188 -149 -119 -110 17 -325 49 -283 -237 -96 13 177 138 -168 57 58 -186
3663 -186 292 122 -171 3 -257 -302 206 -167 118 -140 113 -32 -49 -271 -113 285 168 -45 14 -130 -322
3684 -322 152 209 -173 -217 54 -206 97 60 182 15 241 -160 -211 -64 -134 -93 -86 222 99 -37 5 281 49
3707 49 89 -22 -3 205 -51 -19 144 -17 32 310 136 -90 -11 310 57 -20 95 -166 -12 23 -76 53 -108
3730 -108 -181 142 54 186 21 -81 -76 100 106 -26 -135 14 -83 4 12 -266 20 -7 126 -375 -27 14 104 129 224
3755 224 184 114 -113 28 88 -100 143 142 50 -255 -61 -94 -135 202 -168 -119 -9 131 -43 -242 -36 416 83
3778 83 59 55 -163 138 -5 27 2 192 145 -100 -35 86 34 -90 3 -151 -96 25 -63 181 197 60 -32 -73 31
3803 31 -39 -233 12 -63 148 35 -99 -87 140 -128 5 37 69 15 -78 101 45 141 -6 -110 -213 -4 10 36
3827 36 -157 511 -261 -133 -258 64 -53 -88 -165 -152 -93 -154 -154 -190 -88 -75 -67 -146 8 3 -41 -76 9 185 -209 -66
3853 -66 192 -32 40 50 122 -4 194 -152 -342 -139 45 -441 47 233 245 2 -248 -205 71 149 -67 17 74
3876 74 126 46 -119 14 125 100 158 -125 87 -86 -265 114 -349 47 -62 135 143 40 -200 22 -251 124
3898 124 92 -78 -32 -30 2 126 120 166 -60 1 120 -375 96 -100 -47 142 -15 -48 -291 38 -15 -25 -18 -42 -239
3923 -239 83 -125 -171 -173 -318 84 104 -345 127 -194 68 -11 -120 -78 -40 5 -131 -102 -31 -265 -122 -30 -34 35 -99
3948 -99 90 -224 -21 33 193 114 10 210 88 90 1 186 6 4 -44 -104 192 -291 256 38 -117 -37 218 -41
3972 -41 39 -2 -103 -121 -209 -50 -95 -182 139 68 -1 50 120 10 -111 -12 96 165 168 -154 -212 -13 164 33 127 -160
3998 -160 274 -72 80 -88 21 90 59 196 -212 -237 47 -294 -244 -308 -96 -100 -79 237 -136 -121 46 -57 -94
4021 -94 -166 52 107 -104 127 0 -110 172 174 11 -65 -118 -170 18 140 87 47 -46 -156 -46 135 37 -194 166
4045 166 115 242 -122 -114 57 -173 304 83 -95 108 -182 126 -180 -256 51 -151 -22 109 -20 4 -56 -214
4067 -214 -163 -489 -62 -52 -85 239 -195 286 -1 -181 -68 -221 244 -134 226 235 192 -100 -69 180 -11 -172
4089 -172 228 -56 -224 -77 114 210 -28 56 -99 4 -8 -35 -186 -243 55 -56 -184 33 325 -43 193 -131
4111 -131 -63 133 150 304 -215 -28 5 -151 52 -82 -146 25 -210 -124 2 -114 59 114 -169 29 206 54
4133 54 -95 255 -90 -26 104 116 -40 -62 -7 -125 60 150 57 128 70 140 -81 -22 -155 205 90 13 132 100
4157 100 -169 -138 58 26 -79 54 183 -20 -113 24 94 -80 -55 -1 -37 72 122 15 68 10 121 -58 -70 -54
4181 -54 -270 58 -109 106 -25 -269 -85 125 -129 12 -150 -164 145 -78 80 -9 29 296 -60 187 -81
4202 -81 109 29 12 -81 -203 253 18 61 167 -6 -50 -25 265 14 116 -4 -198 34 -89 165 147 33 111
4225 111 12 -19 36 136 109 -46 229 50 254 195 95 -81 145 206 287 -12 75 102 -446 158 260 -92 -9
4248 -9 -135 51 -69 -471 -2 106 53 168 -249 -45 -18 151 -287 54 -191 258 381 -124 94 202 153 -26
4270 -26 78 -14 -207 73 -199 103 98 -113 14 -168 97 28 -31 153 264 -127 -117 -216 -98 -1 46 -70 367
4293 367 204 -9 19 50 -151 -201 27 24 -152 110 99 -108 31 207 -154 -65 -89 79 5 -130 -111 23 -77
4316 -77 -118 -22 89 207 -107 219 22 -145 210 118 9 -128 -87 -34 228 160 -59 -210 -120 -22 16 20 25 -76 -153
4341 -153 206 2 -110 43 270 -84 -89 32 200 155 55 -51 -243 33 -193 17 -184 -64 65 78 116 216
4363 216 36 -91 133 71 -3 -97 -2 223 108 -199 -86 7 115 -14 79 -89 -150 -102 242 121 157 46 -6
4386 -6 167 51 -28 54 -259 388 46 -40 -99 207 30 0 -97 -53 28 -151 78 -37 78 82 -103 -148 68 -118
4410 -118 216 221 -21 -15 -138 81 -11 22 -50 -64 55 23 -11 -157 -156 9 -107 -74 54 15 -34 -38 350 -37 78 -179
4436 -179 104 104 91 88 126 -60 58 71 -160 57 -143 149 -55 143 -16 -86 30 -174 -106 53 94 -172 -307
4459 -307 127 177 -55 -56 232 60 -229 167 102 -168 -105 4 -1 -70 -75 4 141 85 108 -108 58 96 254 -195 -99
4484 -99 -32 24 251 -20 -146 257 168 72 263 -13 285 58 184 160 -159 157 -106 -28 65 -103 -18 66 15 -369
4508 -369 -128 169 19 63 -174 184 118 -49 95 -70 -60 -318 157 -66 185 -133 -194 254 139 25 104 -342
4530 -342 -147 209 339 -48 115 -234 -106 -71 39 226 -175 192 -62 21 111 -344 18 222 -233 21 111
4551 111 125 117 -6 -260 77 -4 -242 -68 -16 -85 -52 -113 107 259 -238 -48 124 -197 131 -113 226 21 -90
4574 -90 -87 82 115 159 125 169 254 -5 -119 200 -27 143 -82 -192 -129 -203 -139 121 -248 -200 -218 158 146 104 95 38
4600 38 274 139 -177 -36 -18 -103 -79 198 -36 29 210 -111 -62 -15 196 -40 -142 -43 246 -56 -192 -116 130
4623 130 58 180 44 172 -6 113 36 -25 166 191 -71 -145 371 -177 63 -18 -51 33 153 65 42 231 -81
4646 -81 -159 -179 27 32 30 216 122 -210 226 66 7 85 87 -78 150 -121 71 265 1 128 49 -185 14 109 329
4671 329 -43 -14 191 46 275 -36 172 -113 -264 161 95 2 -91 130 192 75 -5 -19 194 33 143 30
4693 30 45 -134 -91 20 73 161 16 -128 -173 273 -223 111 50 -71 -66 225 -112 -304 141 -118 -121 -51 20 -174
4717 -174 -215 -77 111 -299 53 172 -96 -318 -21 179 20 95 70 237 -93 -419 81 -248 -369 107 129
4738 129 -144 -26 -80 77 190 353 -11 72 177 325 -113 52 195 -11 1 -173 -183 353 109 18 23 -75 109
4761 109 144 135 76 -147 -34 208 218 31 -61 10 56 -78 -14 -413 211 -105 -23 96 19 159 34 -103 -260 305
4785 305 -120 2 80 179 -16 22 -171 -43 101 184 -80 31 -37 86 151 29 78 28 -33 -138 -210 -45 88
4808 88 66 -213 142 -198 35 138 -143 108 -91 -70 -232 30 -83 28 175 -68 -83 66 -281 -80 -91 -99
4830 -99 16 -283 -40 -127 -208 77 144 -52 -452 -56 -3 56 23 290 -73 118 -219 240 -302 56 -17 -34 63
4853 63 -52 -21 -253 -24 62 264 -142 95 -160 7 -150 60 258 -203 247 -257 -98 134 278 -53 -226
4874 -226 10 -9 68 -196 156 54 83 -39 -139 299 -178 -63 37 -191 16 -100 -288 -84 -81 24 21 116 -137
4897 -137 -27 275 -52 -22 -27 -151 32 -12 -90 -30 230 20 -65 -375 23 18 116 -143 -69 159 206 -86 345 -40
4921 -40 166 -23 -96 162 -65 176 -61 -41 -146 163 -179 222 90 -162 -127 7 -311 -121 6 -228 -89
4942 -89 -110 17 -86 125 22 52 82 65 -221 149 181 -20 -204 118 92 323 -80 -34 -19 223 55 18 -32 -260
4966 -260 121 -18 -62 81 20 44 112 230 115 -79 -134 -55 156 82 -51 -136 -59 -187 350 -30 -143 20 -329
4989 -329 4 214 7 502 49 -44 331 -157 180 -31 -259 64 -39 -109 -4 77 56 -25 -24 191 -25 -168
5011 -168 140 -53 -132 -454 99 178 183 -1 -34 5 -233 273 21 149 -117 0 70 176 162 -288 173 28 201
5034 201 -190 -65 -234 -114 -78 -40 -75 -57 102 -62 -284 -32 -198 20 283 -131 -93 21 390 -10 -23 -333
5056 -333 86 3 -77 155 -20 197 84 -220 210 -15 184 -124 96 -83 58 -275 110 -196 136 -11 -145
5077 -145 294 74 64 -12 71 -196 -182 -44 -124 -14 255 -159 -129 -159 110 -67 133 -7 85 -29 -18 -265 0
5100 0 167 -82 -38 -100 244 337 243 360 -45 -174 -162 -165 -49 -192 30 53 136 -40 -73 -89 -1 81 65 -76 -148 24
5126 24 -68 -24 -224 -185 -72 212 51 137 149 -62 -123 -81 -195 -168 329 -19 14 -158 7 143 73 25 -21 2 -242
5151 -242 -167 -35 -36 101 69 85 -334 -37 238 -147 -69 -63 91 141 38 -9 105 24 -62 -52 -119 -325 -18 65 -140
5176 -140 -228 -53 176 168 -42 -46 -208 308 -138 -38 -120 69 -281 -181 24 112 1 -144 -297 91 -95 109
5198 109 45 -37 124 -268 148 -241 37 138 100 -29 185 128 -313 53 -107 114 -163 -264 21 -123 -42 113
5220 113 -34 0 21 144 274 93 63 -234 -169 180 -242 49 -196 86 -9 -123 -40 49 -355 -146 39 -99
5242 -99 178 -154 -59 -5 69 199 55 -177 -29 122 -179 -55 -59 -151 -27 130 311 -290 82 -51 184 74
5264 74 20 97 17 -125 243 -161 -228 170 193 79 271 222 7 -11 -163 355 86 132 282 -32 74 -75 2
5287 2 140 -120 -170 53 48 -18 -108 124 57 -149 -161 -82 -103 -18 -176 -152 -139 65 15 211 331 12 71 124 61 -114
5313 -114 53 18 -15 162 231 186 17 302 7 143 -48 -110 54 -18 119 24 -88 -89 134 259 -66 -5 -221
5336 -221 -262 235 144 72 10 -48 -110 -32 -3 114 99 -90 208 6 146 229 -57 301 -111 2 146 148 71 80 11
5361 11 186 -141 108 342 56 118 157 140 16 102 94 82 140 315 100 -67 -92 -77 6 263 354 135 137 -1 -172
5386 -172 -225 40 -409 -84 127 -38 -135 -162 -29 297 -61 -260 -77 -16 34 -88 -224 -88 111 -101 64 -153
5408 -153 -116 34 -71 -49 -245 -81 104 -21 -101 -150 29 -151 66 -195 -252 -152 -50 155 93 -3 -128 12
5430 12 207 52 -80 82 141 -5 -127 281 -100 162 -131 159 -5 12 94 -4 321 -109 -117 63 24 -152 102
5453 102 -9 -231 30 121 -71 -160 201 222 -37 191 -175 -1 -38 85 23 294 303 -11 -96 -100 270 51 13 -133
5477 -133 -18 23 -106 -9 114 168 133 -35 -135 225 -199 119 138 175 -60 351 -8 -164 -76 -19 -192 -17 -295
5500 -295 85 7 76 31 -93 62 161 -237 96 182 57 102 -183 125 233 -64 -167 90 -89 -107 -375 -208
5522 -208 108 19 145 202 98 -66 -73 -49 259 -5 -63 277 129 21 57 81 66 -283 -31 -106 183 -112 19
5545 19 -193 -23 113 -75 102 -152 92 -60 -23 -35 -52 181 -263 131 33 62 -92 27 244 176 9 -119
5567 -119 -54 235 -169 -77 234 -94 -7 -241 -257 -17 137 167 -6 -226 -45 -106 -291 -26 378 163 223 -207
5589 -207 -54 106 221 -36 -302 -123 265 -18 5 78 152 119 -89 -6 -299 225 -134 65 -22 -204 -123 13
5611 13 54 178 45 11 -57 -85 -101 108 -161 136 106 27 -140 51 -162 -38 -53 -30 -10 -161 37 222 -16 365
5635 365 -76 205 99 -162 32 -93 73 57 -1 0 120 -10 -187 224 58 108 -103 161 -169 151 -148 -220
5657 -220 149 67 15 -60 -48 135 -174 -170 -72 -4 40 -81 213 -118 -142 -16 -32 -7 -110 54 -254 -104 73 63
5681 63 12 -117 41 204 -177 14 -14 119 215 -29 13 -33 208 99 -21 149 -8 11 186 -21 -26 -71 111
5704 111 13 159 -97 55 -74 74 68 79 -225 123 -199 13 -293 222 157 -52 289 -199 43 -257 -18 259
5726 259 130 149 -128 109 -57 165 -261 154 37 -174 202 43 -28 82 -292 55 53 -23 228 -193 -162 204
5748 204 83 153 -138 33 -129 89 7 132 -48 -51 89 -158 -154 -19 71 99 -137 -91 222 -51 -202 -86 125
5771 125 -249 -172 8 134 -73 215 385 22 24 -118 -10 -356 -47 89 -235 23 -10 -76 -89 -199 -90 226
5793 226 -94 16 -47 23 251 -310 -36 -5 208 225 15 295 64 89 -161 -11 245 -21 -97 0 -84 177 173
5816 173 -4 -326 -125 -150 170 -128 -88 -1 -98 -42 -424 -225 -111 2 -352 -186 -91 309 55 13 -98 235
5838 235 -28 321 -56 -14 151 -9 154 -77 83 94 59 58 -76 -71 -13 -32 24 -283 -74 52 -64 48 -61
5861 -61 298 100 -198 -360 -184 -42 32 58 29 -86 -179 25 -141 55 -134 217 -6 67 12 -143 -100 59 -53
5884 -53 -247 -219 257 29 0 -122 -162 65 34 26 14 -206 151 -9 -153 -93 -16 105 -300 162 -95 18 -79 -42
5908 -42 -17 105 229 187 203 301 183 -141 -151 63 7 71 145 -8 52 -340 12 38 -144 63 -64 -91 -13 -79 50
5933 50 -76 7 224 -175 166 -172 -159 -105 -98 2 40 123 -120 -153 -10 -8 -88 171 46 74 13 142 -121 -37 -290
5958 -290 -4 -44 -211 170 5 -235 -205 210 -83 -28 134 -88 -81 -34 -120 315 -169 -35 173 -156 -76 -14 -102
5981 -102 -139 16 -272 79 -238 -115 63 -65 -14 85 34 41 -122 10 -71 43 -60 -68 -27 139 14 -139 93
6004 93 -25 61 -114 64 232 153 -24 0 132 158 -48 -29 478 -40 -104 -10 213 108 -176 300 -270 220 -100
6027 -100 -13 -144 131 -219 30 215 338 -107 184 -67 119 -74 -94 39 -68 253 76 208 -65 222 122
6048 122 -106 84 10 -17 -38 -17 122 -76 -25 136 112 130 18 91 379 -183 -42 -230 253 343 285 275 193 -41
6072 -41 101 -303 60 81 -129 85 146 16 95 -135 -218 -65 -24 195 138 323 305 93 -195 10 -3 84 336
6095 336 15 -30 -56 53 -110 200 200 -297 -153 -77 -29 63 -40 184 118 -259 74 144 -66 -75 37 97 51 -92
6119 -92 -350 -118 38 196 40 -391 369 -33 -117 -101 -225 -128 -51 -140 -245 250 -116 76 9 -6 -298 7 -45
6142 -45 -167 69 -39 -70 141 -81 86 -128 38 -194 -33 -207 141 -23 -104 -343 -150 -64 -162 204 53 -44
6164 -44 123 9 -86 -59 -44 113 -181 -83 218 -56 -49 124 30 22 47 -8 34 412 -53 -48 21 180 -37 -135 -63 -82
6190 -82 423 83 93 -90 38 -261 -140 125 -48 24 -237 98 124 60 58 36 -190 -49 -64 -43 158 -289 13
6213 13 -320 -182 -153 85 121 -8 -68 110 -26 291 84 -50 37 -16 -209 205 47 138 85 70 275 -86 -29
6236 -29 -88 79 109 80 11 -67 -133 -116 -105 -279 161 154 10 224 -80 98 122 -48 -12 69 103 -186 -31 -186 -275
6261 -275 -371 176 -32 -229 -257 150 -197 -224 -177 -13 24 -412 -74 -188 -5 -204 -99 -133 -185 -122 221 96 48
6284 48 -142 301 -6 -270 58 -178 -245 -118 143 59 35 -189 198 269 -53 -221 74 -32 -82 -183 121 109
6306 109 197 -128 374 56 155 94 -281 154 119 -298 105 8 90 -111 -339 -129 -96 44 -85 10 80 39 -206
6329 -206 160 -63 82 -264 15 148 281 -147 -183 152 -63 -194 -90 -177 -120 295 148 -109 117 206 -85
6350 -85 68 -44 122 -123 -88 -87 -165 -245 21 218 -248 -20 104 108 -76 39 -14 -76 264 -43 -100 -14 -173 328
6374 328 41 -66 250 -13 26 -84 183 -79 27 156 -37 185 -337 -27 47 -45 131 -43 -202 -22 99
6395 99 -125 118 -146 73 88 182 26 106 33 63 -188 228 -22 -59 32 -25 290 -39 -53 225 -24 118 -241
6418 -241 -81 21 -75 174 -270 -2 83 75 32 -67 57 -74 -142 142 73 174 -102 242 -19 -43 47 -58 171
6441 171 -366 -192 126 -226 401 -17 -60 -177 -266 110 132 179 111 378 16 -102 -130 -317 -64 -160 54 119 -80
6464 -80 -339 -158 -222 4 20 65 179 94 -110 -74 -70 221 159 86 -113 59 182 17 92 170 -47 38 -125 -96 17
6489 17 2 114 21 -42 -256 -130 -30 207 38 109 -144 5 194 -117 -51 64 -36 -160 67 -52 145 -274
6511 -274 133 -187 -80 -206 24 -31 -110 45 -125 -268 69 63 237 80 -81 136 -76 75 -31 197 145 -51
6533 -51 -172 28 143 2 291 64 -70 51 25 275 -186 -155 154 234 -192 -49 183 113 -91 -450 -329 85
6555 85 -172 -152 -264 45 -64 223 272 92 91 191 39 66 49 -174 200 151 -42 -110 -266 -2 9 -345 349
6578 349 -66 334 -245 206 31 155 53 -58 21 -167 -160 32 174 -110 17 -184 94 43 91 164 -74 -9
6600 -9 -157 -122 -293 -7 128 -202 31 10 13 6 18 -90 259 287 -192 -63 92 -165 -22 -41 -4 -71 -97 -96 -128 -141
6626 -141 34 131 86 -29 465 99 -90 93 -174 135 141 124 190 248 -180 -29 340 -45 127 -74 -175 128
6648 128 209 230 88 -29 -243 59 217 159 -198 79 -128 150 229 248 -90 50 -209 12 -74 138 218 120 -7
6671 -7 20 27 65 -220 -35 -68 -8 -6 4 52 155 242 -160 153 -73 -31 -141 212 385 -93 17 -64 -89 33 -115
6696 -115 -123 226 -47 -36 131 153 -181 -26 85 154 -144 -156 141 136 -49 -57 -23 -23 217 311 93 131 -105 -44 11 -304
6722 -304 -107 -13 71 -167 201 -71 75 -7 -47 47 183 113 -55 -34 119 59 149 155 29 -199 -27 147 160 150
6746 150 -114 102 -127 78 -236 57 125 74 276 -130 -44 -118 -49 -13 -209 -248 92 -69 315 -249 85 -189
6768 -189 -9 -47 164 -186 -150 281 -219 -112 -167 81 42 103 22 -72 295 126 -202 -115 -173 -69 -93 -383 256
6791 256 382 -186 -167 111 124 157 13 -7 39 243 -16 208 12 -100 -115 -36 -49 174 -6 109 123 -30 98
6814 98 -161 3 -66 -82 -31 100 369 16 -317 -81 24 -46 -84 136 -2 -8 -73 69 95 267 -43 298 -28
6837 -28 12 303 65 4 -68 43 127 83 -7 -40 -89 181 135 -8 -227 -212 -209 -157 -148 107 31 100 -273 49 -39 169
6863 169 -222 104 149 9 -200 -121 -121 119 76 -25 -50 75 -28 -313 51 62 -206 102 182 315 -36 58 23
6886 23 38 311 -18 137 -200 202 143 -154 -287 -36 125 23 -43 142 -44 94 160 73 32 223 34 143
6908 143 -46 -48 40 -34 -96 128 -53 -233 196 -241 58 126 186 -32 -20 -114 -130 -19 -70 234 -134 27 -137 -131
6932 -131 211 -25 -193 -110 90 96 196 -56 -299 231 -45 -37 33 -184 -92 -35 -77 84 213 -77 108 82 143 83
6956 83 219 -163 323 39 12 15 193 -84 -19 181 86 82 -118 -41 -32 -144 204 -120 -229 -98 -50 -232 112 51
6980 51 -79 -204 -71 118 199 16 -51 -149 138 131 -178 87 -125 -116 -100 28 -56 -92 -102 -220 250 315 171 66
7004 66 -139 -44 207 -64 168 248 104 -52 -130 -164 -254 -61 -145 96 -96 -65 -124 156 -79 -42 12 -20 77 250
7028 250 183 -40 -82 -240 -51 -25 -1 213 -19 -21 158 160 -45 -175 -17 111 95 -192 -124 95 9 123 78 -214
7052 -214 -158 -128 -308 37 -217 180 240 115 -44 -108 95 -179 -126 34 106 -279 -136 -33 12 112 -46 133
7074 133 -100 39 150 169 74 148 16 44 115 80 226 -73 -135 6 316 -156 22 35 -407 134 -74 -121 134
7097 134 25 70 272 119 -18 42 -87 -133 72 -2 -34 -5 108 93 31 -169 -81 69 -28 -431 284 -31 89
7120 89 -2 -80 -88 -14 -60 -46 -135 -23 161 -194 -140 -76 234 -215 -207 269 71 -30 -106 -243 408 9 146 -136 -136
7145 -136 10 -132 -159 -44 83 125 47 128 -146 5 -117 -100 -45 132 77 -222 -62 -54 -84 64 -39 -34 292 -170
7169 -170 228 -311 312 -9 -15 -181 40 -75 -34 -32 -5 154 -261 -349 -182 -31 -345 -58 54 202 60 -59
7191 -59 -20 231 -5 -148 -63 218 103 -124 -51 -22 -47 -19 -5 -315 140 -34 44 -231 -180 57 81 174 63 216
7215 216 50 -7 114 124 -23 -322 -34 142 195 -48 219 45 -154 80 88 -112 75 194 397 47 25 -114
7237 -114 -209 140 -52 -207 23 46 172 105 88 112 83 -26 -95 122 234 291 -45 180 77 -46 129 -23 -117
7260 -117 -253 20 96 -174 -246 -203 19 77 -144 -3 243 -286 250 -128 -16 33 9 52 -65 -216 7 -44 -31
7283 -31 87 76 39 78 -136 103 25 88 87 96 73 -114 -51 -110 40 -385 -28 46 64 -201 -187 -93 59 128 -170 -136
7309 -136 63 229 -45 -151 213 86 42 -14 -37 84 55 68 -62 39 171 36 -62 -206 12 -196 -53 -140
7331 -140 85 -329 254 186 -54 96 27 -35 78 28 -31 59 138 120 -305 66 -139 -215 161 -109 -86 -180 2 224
7355 224 244 -133 -214 -58 161 97 -136 -213 258 8 60 16 -262 20 201 -174 131 -184 -60 -8 100 -115
7377 -115 -67 27 -14 -104 289 229 213 -133 53 -148 6 164 -15 242 -108 -10 -114 -49 7 -15 157 59 42 118
7401 118 -222 1 159 58 -22 80 245 12 88 68 187 -140 -168 143 -39 42 89 -87 -140 69 74 126 5
7424 5 -109 -83 -153 -17 153 107 -192 157 204 -275 196 86 -193 -489 115 84 146 95 39 -21 -27 -188 119 161 127
7449 127 242 204 182 168 -43 129 -21 167 164 -93 -60 -40 209 -89 -193 42 215 -25 -219 113 -132 214
7471 214 211 -173 9 -173 -84 -196 -62 -42 -18 147 -46 -11 135 -130 0 -62 300 158 151 138 197 130 58 -102
7495 -102 -93 61 67 -73 105 85 -63 171 -189 -221 -54 158 -133 197 112 -58 -2 -165 124 -29 136 70 -28
7518 -28 -123 -94 178 160 -127 -97 25 -279 38 -72 3 -95 -34 80 -51 175 148 -437 -301 -49 -21 10 -86 67
7542 67 51 -99 -201 -100 -10 109 21 -41 44 -27 -119 142 97 50 228 -69 -151 -111 186 -150 -261 189 -182 67
7566 67 95 340 71 -30 99 -181 237 45 -299 -53 -142 16 99 -100 7 452 -45 75 191 -91 147
7587 147 73 73 35 -91 -7 -81 43 -107 4 26 -180 127 -2 84 -240 91 -156 33 -96 182 37 27 106
7610 106 -65 -113 -18 87 -17 70 51 -55 -77 295 358 197 -105 -36 -14 88 -72 273 148 -188 -93 109 67
7633 67 257 -40 -50 -53 -276 -97 109 -204 -260 -42 175 42 -26 -203 121 -24 326 159 -60 102 -65 -2
7655 -2 -105 175 32 -73 -59 69 104 30 -166 -176 -51 78 38 166 -274 -2 -110 -8 61 119 197 83 -71
7678 -71 73 299 -5 122 5 51 -94 -221 127 -286 192 -290 46 86 117 -173 -75 -252 -139 -106 -8 -75 -43
7701 -43 323 44 64 77 -57 -10 -5 16 162 -155 -44 8 -14 -30 55 12 60 129 162 124 -24 -308 65 -186 -180 -181 -90
7728 -90 -14 176 76 -73 57 31 -92 25 130 23 -253 97 223 -88 126 -50 46 -51 -64 35 0 18 -17
7751 -17 47 -67 16 166 -74 8 -215 148 193 -214 135 55 133 -14 -229 -177 -51 -273 114 277 25 -184 -81
7774 -81 -14 -7 27 -41 179 -25 163 -63 79 95 82 82 -119 -57 182 11 75 -220 -137 -412 -177 97 -369 18
7798 18 84 197 -214 171 -61 188 -141 -145 120 -81 -212 -132 143 -114 -101 69 -396 146 65 -3 -74 -203 117
7821 117 250 -38 35 50 126 237 110 -227 68 68 268 -76 -70 147 -182 -139 -244 -22 134 88 -172 -112 -51 56
7845 56 47 -47 3 99 166 31 -103 -22 18 -151 -12 255 127 47 -144 -121 -25 97 111 -106 -292 -34 217 -211
7869 -211 9 19 -59 34 142 -141 148 320 -47 108 52 -45 28 -88 44 -231 -166 -51 -34 196 23 152 -64
7892 -64 5 11 -68 -26 67 -285 -194 92 -195 464 182 116 71 -249 -33 -75 -2 -3 -217 -126 -57 -157 -156 134 79 -181
7918 -181 43 48 153 -188 -26 -44 202 -22 332 142 -179 51 11 3 76 84 74 -154 28 22 15 -217 -95 -151 -120
7943 -120 106 -23 119 97 -103 154 -71 37 76 220 28 40 -62 -149 -196 -233 73 -39 176 8 52 -178
7965 -178 74 -123 20 111 8 134 -216 193 139 -213 -139 130 -108 -88 278 -172 -3 -211 382 -470 196
7986 196 -25 -152 142 218 187 47 -23 60 25 -162 152 151 319 49 -102 189 175 161 125 -165 45 -42 112 -217
8010 -217 200 118 -236 122 109 2 -58 -36 128 -287 28 242 -45 199 -62 -45 3 -143 -92 -195 193 31
8032 31 -119 -34 -152 58 125 -110 119 96 -49 166 66 137 196 -171 141 7 -191 -225 53 -132 256 165 -279
8055 -279 -37 261 -222 -103 123 -69 -12 -77 46 -7 100 -122 -193 49 150 160 175 31 23 145 -26 -285 57
8078 57 -225 174 -119 -45 -111 41 -43 -135 65 -53 -160 -75 -192 1 84 -86 -36 19 -161 -11 118 -93 111
8101 111 -132 -50 95 177 187 13 -92 -241 -87 -39 60 29 214 16 -257 294 -32 166 36 -16 -8 -132 95
8124 95 288 95 -241 421 11 333 52 146 -10 61 -211 292 -53 35 -133 181 116 54 -159 102 57 -95
8146 -95 -10 184 -56 -232 17 -107 69 -178 -126 22 117 -62 -136 -59 -41 79 69 -157 -62 105 94 -259 20
8169 20 146 -3 27 -3 80 229 -201 286 14 98 -97 -73 138 -111 25 240 204 -44 -201 -49 -75 323
8191C23
##END NTUPLES=NMR FID
##END=
