##TITLE=1H_DE--93K_TFA
 200.13MHz, CDCl3,
 8 sc
 
 5.5.2025
##JCAMPDX= 6.0         $$ Bruker NMR JCAMP-DX V2.0
##DATA TYPE= NMR FID
##DATA CLASS= NTUPLES
##ORIGIN= UXNMR, Bruker Analytische Messtechnik GmbH
##OWNER= pz
$$ XWIN-NMR		Version 3.5
$$ Mon May  5 14:38:34 2025 Russian Standard Time (UT+4h)  she@DPX200
##.OBSERVE FREQUENCY= 200.1313
##.OBSERVE NUCLEUS= ^1H
##.DELAY= (6, 6)
##.ACQUISITION MODE= SIMULTANEOUS
##.ACQUISITION SCHEME= undefined
##.AVERAGES= 8
##.DIGITISER RES= 18
##SPECTROMETER/DATA SYSTEM= spect
##.PULSE SEQUENCE= zg30
##.SOLVENT NAME= CDCl3
##.SHIFT REFERENCE= (INTERNAL, CDCl3, 0, 14.3821)
##AUDIT TRAIL= $$ (NUMBER, WHEN, WHO, WHERE, WHAT)
$$ ##TITLE= Audit trail, XWIN-NMR		Version 3.5
$$ ##JCAMPDX= 5.01
$$ ##ORIGIN= Bruker BioSpin GmbH
$$ ##OWNER= she
$$ F:/spectra/data/she/nmr/H-C/1/audita.txt
$$ ##AUDIT TRAIL=  $$ (NUMBER, WHEN, WHO, WHERE, WHAT)
(   1,<2025-05-05 14:37:36.07 +0400>,<she>,<DPX200>,
      <created by zg, POWCHK disabled, PULCHK disabled
       configuration hash MD5:
       00 E9 B6 7A A2 85 ED C7 34 08 36 98 17 FE 4E 26
       data hash MD5: 16K
       6A 8D 4A F1 CD 19 23 5D 69 24 A4 8A 28 24 F8 85>)
$$ ##END=
$$ 
$$ hash MD5
$$ 02 97 AF D6 38 D8 8F 58 59 90 67 5F FF 19 34 64
##$RELAX= 
##$RELAX= 
##$RELAX= 
##$RELAX= 
##$RELAX= 
##$RELAX= 
$$ Bruker specific parameters
$$ --------------------------
##$DU= <F:/spectra>
##$EXPNO= 1
##$NAME= <H-C>
##$PROCNO= 1
##$TYPE= <nmr>
##$USER= <she>
##$AMP= (0..31)
100 100 100 100 100 100 100 100 100 100 100 100 100 100 100 100 100 100 
100 100 100 100 100 100 100 100 100 100 100 100 100 100 
##$AQSEQ= 0
##$AQ_mod= 1
##$AUNM= <au_zg>
##$AUTOPOS= <>
##$BF1= 200.13
##$BF2= 200.13
##$BF3= 200.13
##$BF4= 200.13
##$BF5= 200.13
##$BF6= 200.13
##$BF7= 200.13
##$BF8= 200.13
##$BYTORDA= 1
##$CFDGTYP= 0
##$CFRGTYP= 5
##$CHEMSTR= <none>
##$CNST= (0..31)
1 1 145 1 1 1 1 1 1 1 1 1 1 1 1 1 1 1 1 1 1 1 1 1 1 1 1 1 1 1 1 1 
##$CPDPRG= <>
##$CPDPRG1= <>
##$CPDPRG2= <>
##$CPDPRG3= <>
##$CPDPRG4= <mlev>
##$CPDPRG5= <mlev>
##$CPDPRG6= <mlev>
##$CPDPRG7= <mlev>
##$CPDPRG8= <mlev>
##$CPDPRGB= <>
##$CPDPRGT= <>
##$D= (0..31)
0 0.7 0 0 0 0 0 0 0 0 0 0.03 0 0 0 0 0 0 0 0 0 0 0 0 0 0 0 0 0 0 0 0 
##$DATE= 1746441455
##$DBL= (0..7)
120 120 120 120 120 120 120 120 
##$DBP= (0..7)
150 150 150 150 150 150 150 150 
##$DBP07= 0
##$DBPNAM0= <>
##$DBPNAM1= <>
##$DBPNAM2= <>
##$DBPNAM3= <>
##$DBPNAM4= <>
##$DBPNAM5= <>
##$DBPNAM6= <>
##$DBPNAM7= <>
##$DBPOAL= (0..7)
0.5 0.5 0.5 0.5 0.5 0.5 0.5 0.5 
##$DBPOFFS= (0..7)
0 0 0 0 0 0 0 0 
##$DE= 6
##$DECBNUC= <off>
##$DECIM= 32
##$DECNUC= <off>
##$DECSTAT= 4
##$DIGMOD= 1
##$DIGTYP= 9
##$DL= (0..7)
0 120 120 120 120 120 120 120 
##$DP= (0..7)
150 150 150 150 150 150 150 150 
##$DP07= 0
##$DPNAME0= <>
##$DPNAME1= <>
##$DPNAME2= <>
##$DPNAME3= <>
##$DPNAME4= <>
##$DPNAME5= <>
##$DPNAME6= <>
##$DPNAME7= <>
##$DPOAL= (0..7)
0.5 0.5 0.5 0.5 0.5 0.5 0.5 0.5 
##$DPOFFS= (0..7)
0 0 0 0 0 0 0 0 
##$DQDMODE= 0
##$DR= 18
##$DS= 0
##$DSLIST= <SSSSSSSSSSSSSSS>
$$ [...]
##$SUBNAM0= <"">
##$SUBNAM1= <"">
##$SUBNAM2= <"">
##$SUBNAM3= <"">
##$SUBNAM4= <"">
##$SUBNAM5= <"">
##$SUBNAM6= <"">
##$SUBNAM7= <"">
##$SUBNAM8= <"">
##$SUBNAM9= <"">
##$SW= 18.0517328524113
##$SWIBOX= (0..15)
0 0 2 0 0 0 0 0 0 0 0 0 0 0 0 0 
##$SW_h= 3612.71676300578
##$TD= 16384
##$TD0= 1
##$TE= 0
##$TE2= 300
##$TE3= 300
##$TEG= 300
##$TL= (0..7)
0 120 120 120 120 120 120 120 
##$TP= (0..7)
150 150 150 150 150 150 150 150 
##$TP07= 0
##$TPNAME0= <>
##$TPNAME1= <>
##$TPNAME2= <>
##$TPNAME3= <>
##$TPNAME4= <>
##$TPNAME5= <>
##$TPNAME6= <>
##$TPNAME7= <>
##$TPOAL= (0..7)
0.5 0.5 0.5 0.5 0.5 0.5 0.5 0.5 
##$TPOFFS= (0..7)
0 0 0 0 0 0 0 0 
##$TUNHIN= 0
##$TUNHOUT= 0
##$TUNXOUT= 0
##$USERA1= <user>
##$USERA2= <user>
##$USERA3= <user>
##$USERA4= <user>
##$USERA5= <user>
##$V9= 5
##$VALIST= <valist>
##$VCLIST= <CCCCCCCCCCCCCCC>
##$VD= 0
##$VDLIST= <DDDDDDDDDDDDDDD>
##$VPLIST= <PPPPPPPPPPPPPPP>
##$VTLIST= <TTTTTTTTTTTTTTT>
##$WBST= 1024
##$WBSW= 4
##$XGAIN= (0..3)
0 0 0 0 
##$XL= 0
##$YL= 0
##$YMAX_a= 184854
##$YMIN_a= -192698
##$ZGOPTNS= <>
##$ZL1= 120
##$ZL2= 120
##$ZL3= 120
##$ZL4= 120
##$ABSF1= 10
##$ABSF2= 0
##$ABSG= 5
##$ABSL= 3
##$ALPHA= 0
##$AQORDER= 0
##$ASSFAC= 0
##$ASSFACI= 0
##$ASSFACX= 0
##$ASSWID= 0
##$AUNMP= <proc_1d>
##$AZFE= 0.1
##$AZFW= 0.1
##$BCFW= 1
##$BC_mod= 2
##$BYTORDP= 1
##$COROFFS= 0
##$CY= -3
##$DATMOD= 1
##$DC= 2
##$DFILT= <>
##$DTYPP= 0
##$F1P= 0
##$F2P= 0
##$FCOR= 0.5
##$FTSIZE= 0
##$FT_mod= 4
##$GAMMA= 1
##$GB= 0.15
##$INTBC= 1
##$INTSCL= 1
##$ISEN= 128
##$LB= 0.25
##$LEV0= 0
##$LPBIN= 0
##$MAXI= 10000
##$MC2= 0
##$MEAN= 0
##$ME_mod= 0
##$MI= 1.114404
##$NCOEF= 0
##$NC_proc= 0
##$NLEV= 6
##$NOISF1= 3.799351
##$NOISF2= 2.8
##$NSP= 1
##$NTH_PI= 0
##$NZP= 0
##$OFFSET= 14.38212
##$PC= 1
##$PHC0= -1587.737
##$PHC1= 26.19221
##$PH_mod= 1
##$PKNL= yes
##$PPARMOD= 0
##$PSCAL= 0
##$PSIGN= 0
##$REVERSE= no
##$SF= 200.129724274929
##$SI= 16384
##$SIGF1= 3
##$SIGF2= 2
##$SINO= 400
##$SIOLD= 16384
##$SREGLST= <1H.CDCl3>
##$SSB= 0
##$STSI= 0
##$STSR= 0
##$SW_p= 3205.1282051282
##$SYMM= 0
##$S_DEV= 0
##$TDeff= 0
##$TDoff= 0
##$TI= <>
##$TILT= no
##$TM1= 0
##$TM2= 0
##$TOPLEV= 0
##$USERP1= <user>
##$USERP2= <user>
##$USERP3= <user>
##$USERP4= <user>
##$USERP5= <user>
##$WDW= 1
##$XDIM= 8192
##$YMAX_p= 0
##$YMIN_p= 0
$$ End of Bruker specific parameters
$$ ---------------------------------
##NTUPLES= NMR FID
##VAR_NAME=  TIME,          FID/REAL,        FID/IMAG
##SYMBOL=    X,             R,               I
##VAR_TYPE=  INDEPENDENT,   DEPENDENT,       DEPENDENT
##VAR_FORM=  AFFN,          ASDF,            ASDF
##VAR_DIM=   8192,          8192,            8192
##UNITS=     SECONDS,       ARBITRARY UNITS, ARBITRARY UNITS
##FACTOR=    0.0002768,     1,               1
##FIRST=     0,             0,               0
##LAST=      2.2672688,     0,               0
##MIN=       0,             -192698,         0
##MAX=       2.2672688,     184854,          0
$$ Real data points
##PAGE= N=1
##DATA TABLE= (X++(R..R)), XYDATA
0 0 0 0 0 0 0 0 0 0 0 0 0 0 8 -8 8 -8 16 -16 16 -24 30 -32 40 -48 56 -64 74 -88 100 -114 131 -150 170 -191
34 -191 217 -244 275 -307 344 -385 427 -475 526 -582 645 -710 785 -866 954 -1049 1158 -1274
52 -1274 1404 -1550 1713 -1896 2104 -2343 2621 -2949 3340 -3821 4424 -5209 6275 -7811 10224
67 10224 -14568 24739 -89968 -37116 184854 -52950 -81613 -58019 -17404 61204 4590 -79820
79 -79820 -42898 -21702 40386 28264 -53879 -44762 -3241 14119 28299 -30329 -36993 6476 19623
92 19623 11582 -19290 -28885 8780 24140 20554 -5477 -28715 -393 30487 15384 -2411 -14661
105 -14661 3417 26873 12481 -1122 -11018 -1911 28879 18145 -4086 -9406 -5197 19007 22356
118 22356 -2929 -7992 496 8218 15739 -1847 -12671 1239 8647 12842 997 -16528 -7428
131 -7428 7470 8597 -327 -10211 -8480 2802 5999 -1822 -8922 -9070 1865 6383 -2701 -9687 -8499
146 -8499 220 4715 693 -7460 -8478 -807 2690 423 -5605 -5418 516 3219 1185 -4784 -5488 384
162 384 4635 2079 -2700 -3278 -711 4409 2987 -1284 -2106 238 4031 3084 -427 -1341 649 4306
178 4306 3346 441 -1882 -112 3206 3469 743 -1297 62 1801 2495 446 -1618 185 1522 1920
194 1920 295 -1643 -351 708 1657 -28 -1512 -1335 108 629 -118 -1038 -1520 -268 310 -621 -841
211 -841 -1383 -617 155 -270 -805 -935 -717 380 226 -680 -607 -486 90 595 -209 -121 -172 378 738 223 -143
232 -143 279 609 863 230 -313 18 196 553 682 97 45 355 178 333 52 -256 -75 305 -60 -266 -471
253 -471 -545 190 100 -425 -317 -561 -295 25 -94 -354 -368 -470 -167 -304 -314 -434 -165 57 -15 -327 -626 -172
275 -172 273 431 234 -547 -227 190 -52 206 -24 81 388 266 -142 166 -73 267 576 81 31 151 138
296 138 458 558 9 152 -72 205 -195 -60 -162 454 463 163 -53 -396 -424 313 250 13 -323 -327 -108 -175 33
319 33 -59 38 153 -86 -235 -280 -105 -29 365 -182 -221 -23 -190 -86 184 -90 -177 196 -194 -20 119 -410 184
342 184 456 26 -184 -224 207 1 173 61 2 -187 -283 -46 -63 142 265 350 228 -62 283 126 153 316
364 316 146 13 -121 190 183 72 -141 32 326 124 -146 -209 293 -120 -64 -89 -194 4 -228 -205 -176 -92 121
387 121 -133 -106 -326 -387 35 -117 78 -171 10 -47 -53 271 -5 107 -337 159 269 18 182 211 301 -126 101
410 101 119 -54 241 177 -50 32 -318 414 -47 14 203 181 42 19 69 21 271 -115 70 35 -278 52 -19 63
434 63 118 8 -2 47 187 -389 -103 -160 -163 172 -2 101 121 107 -77 5 -176 317 -111 -388 45 45 -131 16
458 16 42 -9 -157 -180 73 54 188 251 209 -24 -206 96 -89 40 -19 -156 -137 -76 109 139 160 -29 84 -73
482 -73 40 -113 -72 128 189 51 -48 139 74 109 72 -37 237 -19 41 277 -246 -104 143 -178 -37 130 -267
505 -267 -138 -98 192 -18 29 213 -8 -129 25 -200 -154 29 -230 -298 -96 -239 100 -111 244 103 78 19
527 19 -248 199 157 33 134 242 154 212 -14 122 412 -176 -72 162 -120 129 59 64 -30 11 -19 7 107 46
551 46 -107 169 -75 -229 30 -331 -250 105 20 -31 -137 -42 -206 -360 305 -245 -88 75 -43 -45 -79 120 -47
574 -47 95 -88 -167 -360 113 74 319 77 27 43 -8 -90 65 118 185 175 -147 -192 -182 -140 -156 -88 31 190 62
599 62 24 16 43 -237 -76 -37 -148 -149 -220 103 -93 -116 150 215 275 -179 -65 -53 -88 -165 -70 45 11 -90 7 305
625 305 177 99 168 241 41 -186 -182 -79 83 58 -84 264 -116 104 -100 -52 200 62 -46 -262 29 259 -92
648 -92 84 -40 -127 98 -111 -94 -122 -185 -75 297 81 204 -83 27 -67 -6 -122 84 -46 -212 12 -29 -149
671 -149 32 148 -166 -54 31 -153 -201 235 83 31 -56 -18 162 -162 58 67 -117 3 -39 -148 -54 -66 -20 -247
695 -247 -148 138 -66 -160 33 -115 93 233 181 -43 -104 -74 112 -134 -263 -71 -41 100 127 214 2 -30 -46 -43
719 -43 -226 36 100 -36 160 -12 18 -1 -218 -29 -69 67 48 -93 -28 236 57 209 -286 29 -113 -450 64
742 64 235 21 106 218 -263 -24 7 -37 -11 -135 250 -89 -115 76 115 274 -179 -256 34 124 305 -271 1
765 1 -93 -15 200 133 -14 -137 -230 -57 328 -14 180 6 -200 -158 -104 102 -57 -43 -4 -33 7 -242 -75 76
789 76 -182 -150 -41 122 -36 171 -122 228 14 97 161 225 -97 84 255 146 226 -20 -250 75 6 -141 -59
812 -59 -51 -335 15 31 293 -257 -227 91 106 -54 -25 -187 58 285 91 -120 163 -21 -113 -72 -228 -64 130
835 130 78 -63 -82 -67 214 -237 24 -163 137 88 95 43 61 114 70 68 -222 -193 -65 89 71 -183 67 -101 212
860 212 246 131 -104 142 147 -87 -229 148 17 16 -19 108 235 -90 166 -106 -163 -26 71 239 370 -63 -81
883 -81 -157 -37 356 -302 -67 -229 100 -78 -466 -100 34 -168 146 96 -117 0 21 -2 138 -173 -66 171
905 171 73 5 -246 -130 -76 77 -10 -164 -379 -43 -43 73 -37 11 242 336 -5 26 -161 1 -144 -238 22 -33
929 -33 -164 93 -66 124 117 -34 277 -186 -115 51 74 -13 -2 80 -41 212 192 -103 42 63 100 0 -86 -96 123
954 123 38 210 170 291 -36 -85 -121 -162 50 -57 -34 29 -12 265 -107 -200 -98 -108 66 105 113 218 150 -203 111
979 111 -85 18 256 143 -216 -137 437 -308 -120 179 122 -104 -141 -35 -56 198 27 -82 230 -258 -118 -20
1001 -20 86 197 -89 115 -183 83 -7 68 224 -85 36 150 48 -103 128 121 -55 57 -54 42 -77 164
1023 164 -118 147 48 -18 -214 25 -36 -158 22 -165 52 119 -166 -75 -88 -32 148 -51 -28 10 -33 41 -67 64
1047 64 29 -285 9 -189 -37 47 68 51 5 -51 170 -125 -76 25 220 114 82 -168 -200 24 -154 5 -12 0
1071 0 -28 168 136 -120 105 -7 145 -73 79 118 -36 -68 30 113 -82 24 23 -83 154 -320 85 -27 -62 -2
1095 -2 44 26 -92 183 376 -236 -64 -107 161 -22 156 -81 40 -18 -350 -324 -79 66 135 22 19 13 229 172
1119 172 -122 -263 -259 311 -286 207 0 -31 -228 -110 95 -129 151 72 110 107 -228 -60 181 206 18 103 -15
1142 -15 -21 291 -82 -17 72 381 -3 59 220 -263 59 -204 76 24 -47 74 124 291 201 23 113 -2 92 24
1166 24 -74 -37 26 -141 -22 -65 -27 251 -195 -176 -180 -11 33 -121 -63 -149 281 -138 90 30 -275 -53 -43 -90 -219
1191 -219 -268 16 276 42 -35 -4 68 459 78 174 -75 136 84 22 -98 -88 18 82 -128 -126 362 62 -255 68
1215 68 127 76 -254 -66 135 -192 58 -111 -26 -111 -228 61 82 34 -77 156 57 -198 -88 44 341 144 129
1238 129 -170 58 -226 199 -22 -49 -10 -88 -117 104 -18 83 25 18 -33 -167 -46 -67 245 -6 -147 142 -62
1261 -62 13 21 -108 -3 136 -186 74 88 103 87 21 77 -27 -27 -89 -78 67 9 199 266 -35 -10 -37 17 264 -42
1287 -42 -64 290 210 0 -8 358 148 -6 -120 142 -118 -11 -66 -232 47 -29 -259 -62 273 201 18 -95 -262
1310 -262 -536 249 -58 -331 129 -177 124 -9 -6 258 -135 158 -253 -3 -36 -39 -14 25 128 208 -204 42 124
1333 124 66 -147 -64 -98 47 261 -51 -274 76 231 -213 -134 7 -58 -187 -99 -247 176 84 247 160 119 176
1356 176 -124 18 44 154 -202 125 -36 -67 251 -80 -37 100 -33 141 -29 8 -1 1 107 -150 -223 468 79
1379 79 150 -13 -120 -33 80 4 -77 12 -107 -64 78 -47 189 -6 300 -194 -311 78 -273 18 26 -188 -109
1402 -109 -63 -54 -216 -78 87 -43 -232 58 -194 98 260 35 430 164 -95 102 -223 37 -90 -89 42 28
1424 28 -321 48 -88 -101 -191 -203 94 58 -35 153 -149 210 152 6 76 -124 103 209 83 -75 -228 185 257
1447 257 204 175 56 176 -337 36 -165 -148 113 -71 -149 119 -71 -92 -151 81 -48 -96 -119 -210 29 21 31 196
1471 196 68 -11 -33 103 -29 -73 -112 -83 210 -71 77 18 -98 82 69 8 159 71 -88 -73 -187 55 116 -185
1495 -185 56 -73 -145 125 85 -49 -55 -92 -6 -151 -8 161 -128 -97 60 -216 205 -110 -383 66 -154 125
1517 125 203 101 26 191 160 167 -157 -119 -72 52 228 -62 274 -35 -14 -80 267 32 560 -285 -187 87 55 62
1541 62 -28 -259 -52 -25 -197 -81 10 230 -4 169 -201 -172 163 176 100 202 3 77 7 0 66 0 80 83 41 -24
1567 -24 184 315 145 136 143 94 257 64 150 9 95 179 -349 -171 163 57 65 -166 102 99 -106 -144 88 163 -91
1592 -91 1 107 -65 -251 105 15 -4 -6 -161 -55 -3 -174 -57 72 46 108 59 -23 -272 55 116 -36 228 -79
1616 -79 -225 38 -3 -377 226 -222 85 136 1 94 147 175 -223 -31 -97 -19 177 -25 -292 -120 44 196 15
1639 15 201 -55 7 5 -188 -30 267 91 201 61 97 88 -91 -28 -58 215 -230 -56 -66 143 -76 51 -7 -256
1663 -256 209 -224 -62 -44 164 322 -73 -3 186 135 -82 -210 -18 135 238 -1 39 82 56 184 -260 139
1685 139 -95 -78 -49 -82 -176 -65 72 -18 218 -28 184 -110 -138 169 187 113 193 148 -219 -60 261 -238 -306 -51
1709 -51 319 -96 102 146 44 49 71 156 -13 159 -29 195 -23 48 -216 -97 1 -127 108 -135 -62 27 394
1732 394 11 -329 -46 -207 215 -87 63 -17 25 -222 -41 -91 188 -127 169 250 -43 -213 -458 -60 247
1753 247 20 32 71 25 -107 -101 273 -146 148 23 -12 -124 -66 -74 -78 18 130 -198 82 255 -180 147 15 12 113
1778 113 231 -197 210 232 127 -47 41 214 83 -250 -137 105 194 66 -104 13 82 -297 -85 40 53 -272
1800 -272 -200 169 -168 -66 43 103 259 -139 -145 177 -35 -215 -242 -51 -182 -60 -65 -152 89 97 -47 167 -66
1823 -66 -228 261 16 47 -137 175 150 12 55 -139 57 173 57 -178 -137 -30 -55 -15 97 19 320 103 33
1846 33 -295 34 56 203 209 -6 -42 46 64 2 -53 -52 -37 36 8 180 279 192 -7 -153 -270 136 -152 156 -106
1871 -106 23 -88 -474 137 191 249 -132 46 27 113 -156 63 -72 -36 -107 37 -137 67 31 -2 -77 39 -134
1894 -134 -66 15 201 142 -45 -173 -229 -6 -194 -340 -98 -188 -58 -140 378 -15 -390 43 340 79 4 247
1916 247 -136 32 -20 92 70 -62 -119 132 103 121 -99 88 123 -161 -173 102 130 99 32 -207 186 151 -40 -57
1940 -57 -72 -13 -151 142 11 -2 175 -50 -123 -118 95 125 -96 31 -97 41 -74 148 249 97 -45 -232 46
1963 46 100 -178 -29 -39 97 385 -214 24 -112 -169 -27 -127 -23 -213 172 -83 150 -58 49 -237 72
1984 72 -264 -105 -271 -101 -83 91 178 -294 -166 -139 272 -37 21 -198 137 24 -215 -93 11 -15 -79 -121 113
2007 113 135 -29 -36 117 -136 1 -104 -96 46 48 380 -306 166 -141 -226 -181 123 -219 -192 -206 95 225 -116 173
2031 173 -13 -65 186 -110 53 81 -209 317 -47 -84 -117 153 -155 -117 -16 -173 66 -100 8 -160 50 -109
2053 -109 22 -89 226 317 160 67 -252 -16 88 -85 -150 -12 43 127 -193 -208 203 91 -82 84 200 164
2075 164 201 11 150 -114 -27 -55 47 14 72 -90 -266 -56 28 168 19 60 -42 21 -231 182 -229 -397 51
2098 51 23 -148 -52 -30 -177 41 -185 16 -132 18 -228 -13 -194 -16 20 212 109 -79 108 225 84 75
2120 75 279 90 -175 -15 -45 -39 -120 -32 -109 136 -254 154 164 102 -9 -119 -144 39 192 -33 -183 -17 147
2143 147 -134 364 50 59 155 -61 -208 108 34 -48 -376 -2 -331 -189 -37 -101 -165 254 -226 -56 -50 212 -81
2166 -81 -130 170 -86 39 107 14 23 4 105 98 89 -225 40 7 128 -128 -169 -20 -212 99 -169 -164 -143 146 14
2191 14 -186 116 -165 42 -156 -15 -72 -269 89 113 -166 -122 -1 10 -27 206 75 -23 -96 217 232 47 -23
2214 -23 -71 -9 -66 204 56 -38 -71 121 205 -140 -193 163 -137 -31 116 -80 62 47 -149 115 -145 174 -68
2237 -68 83 120 160 65 -185 -134 -87 28 61 -136 12 -53 -146 -201 37 52 -74 15 64 -107 -4 157 -51 -30 -116
2262 -116 -102 23 253 -5 -166 -191 -314 -10 84 -108 -25 78 -34 -47 -165 -9 190 -36 -172 -80 -243 -124
2284 -124 -343 -33 -114 -176 106 142 238 22 119 -189 68 100 -148 110 -183 108 -129 -90 -139 70 70 254 -161
2307 -161 374 71 -257 172 109 17 74 -116 -32 -21 -139 121 -56 -42 99 4 12 40 112 -201 31 44 22 4 -182
2332 -182 29 -120 192 379 -119 -43 31 46 87 -60 12 233 -98 -12 76 -157 145 110 214 225 -52 71 -66
2355 -66 -40 187 45 -70 -200 260 177 78 -178 -154 205 160 -76 255 -70 -83 -290 119 171 -248 108 -48 68
2378 68 61 19 -38 57 206 8 2 277 152 176 -136 40 -155 2 291 -150 175 -74 -31 98 216 -73 11 1
2402 1 17 -32 -100 125 87 157 -212 -130 -102 48 94 174 -53 -133 163 -16 70 114 -172 140 110 118 -121 -183 -177 -58 -137
2429 -137 191 141 336 121 63 233 -37 -143 -231 143 119 281 -105 -299 -12 94 226 -8 138 -90 48
2450 48 49 -136 46 -66 428 -328 -283 -21 -3 -212 61 69 -36 -61 -133 36 98 181 202 243 -36 -237 4 178
2474 178 59 -484 -169 119 250 -142 14 79 117 72 311 148 337 24 -229 126 -66 190 146 -28 115
2495 115 48 13 -267 170 102 198 23 -171 -148 -65 123 214 -30 -184 162 17 213 -15 16 -96 -248 114 -71
2518 -71 33 -139 283 -304 14 94 -58 -74 -217 186 79 -258 155 307 -41 241 56 -192 -102 -431 -174
2539 -174 358 45 179 -1 176 -137 122 -91 65 -139 286 -197 53 119 224 -210 92 50 -118 67 -62
2560 -62 310 -306 110 -283 -36 -175 -54 -200 75 -148 -280 -194 -2 -39 123 -232 -24 -7 -164 -136 -253 42
2582 42 -107 109 -330 23 -264 -282 -29 63 106 -26 -304 -65 -44 59 -89 -54 8 -117 -256 -236 76 -142 83
2605 83 52 -32 120 57 -165 -185 89 -125 328 76 81 -134 -69 20 -20 -380 84 -89 -14 -81 259 168 -139 166
2629 166 122 111 -97 185 -229 -174 -66 279 -145 -151 -81 -97 -190 70 34 -19 -50 -27 298 -80 66 -167 -13 188
2653 188 -222 -36 -53 60 37 -8 -88 26 -74 68 -49 53 -102 -35 -34 305 -163 -414 187 398 -28 66 127
2676 127 66 218 146 81 -201 188 -71 -121 -224 -126 77 211 -142 -58 -162 -209 -157 -13 -16 -280 89 222 190 -10
2700 -10 -60 97 139 197 274 -41 81 -120 144 -233 -206 6 66 -63 55 154 -60 -218 -129 -215 134 26 -206
2723 -206 -123 -346 -292 -44 -263 -251 8 7 -135 -158 -68 -55 -39 -98 77 1 17 188 66 34 -142 54 242 -123
2747 -123 -90 -77 -136 219 12 -148 213 59 -141 176 -219 -36 -100 323 83 -165 -97 -89 59 -80 -396 -44
2769 -44 351 276 -318 119 -143 102 196 -125 -99 -92 148 -218 -111 216 127 155 -9 -91 229 32 159 182 -116
2792 -116 129 -68 68 3 139 6 151 -156 -110 -209 186 96 415 -38 -33 129 46 -54 127 59 -18 80 -65
2815 -65 82 -230 7 251 -233 6 20 -11 -50 32 76 -109 302 -168 41 -302 -222 -27 -112 -38 -149 -169 205
2838 205 172 140 -83 195 210 -102 -63 -117 195 -140 -17 16 126 -66 362 -187 103 -13 52 155 121 -62 6
2861 6 -32 93 -288 193 -154 -70 -17 116 26 205 -22 -65 48 -122 84 142 -206 -33 -89 -82 -126 -66 -189 -154 95
2886 95 -45 -318 19 -59 97 25 -67 -123 -21 -11 139 -5 187 131 -14 -24 -180 169 18 70 -191 18 -208
2909 -208 219 25 -16 -56 -101 26 283 -2 -370 -265 77 -161 96 -6 -54 22 -146 31 51 28 -18 36 -138
2932 -138 -264 -109 24 -141 35 47 81 -165 -214 137 -128 112 224 -221 -73 15 -218 -167 -345 25 49 226
2954 226 349 -45 -279 4 72 32 -188 -145 -40 222 -29 82 102 -48 132 -60 -127 -170 -163 -187 106 -65 -119
2977 -119 70 121 -94 96 -185 -238 82 42 60 -44 77 124 -77 2 -230 -103 75 36 67 164 343 87 -65
3000 -65 -14 39 127 121 345 211 183 -49 -181 73 -134 88 -65 -311 -318 -98 -188 -227 62 83 142 -146 -58 94 94
3025 94 -147 -209 -262 101 199 71 41 -403 82 24 -160 -73 -67 -130 -31 293 -89 54 -28 122 100 171 -231 -54 -92
3050 -92 -138 122 -206 291 -14 -164 -329 274 -126 -233 -116 195 -162 67 193 66 -74 -89 220 -73 -53
3071 -53 348 -57 -293 134 -26 -177 -63 -48 -34 -29 -62 -89 -256 -13 -78 65 42 35 200 -111 188 118 152 -143
3095 -143 77 -17 265 179 38 -38 -103 106 -75 161 30 75 -251 227 -116 -138 -296 -79 -133 -104 92 -124 -237
3118 -237 71 -43 -134 -91 247 -155 -189 151 -65 -152 -275 -96 -207 54 68 34 140 -133 -8 -12 7 113 162
3141 162 93 -174 -131 61 106 -13 -42 -32 237 -236 269 -112 48 67 239 117 75 -19 -83 -141 -95 297 -117 42
3165 42 22 98 -99 47 41 -43 21 -179 -84 -137 -30 73 20 -93 68 28 -186 -251 -65 -217 392 74 -42 134
3189 134 -117 -94 158 -2 -186 168 -37 -42 142 228 -129 -175 21 125 -212 100 -45 -122 -107 -123 102 187 65
3212 65 90 253 -24 -118 -9 61 -64 -128 -1 30 179 -141 122 92 30 -85 -187 -75 -66 -258 55 259 -126
3235 -126 -183 231 116 41 -123 518 -3 -26 79 35 -45 -102 -151 9 135 41 -2 -93 110 -39 77 -240 76
3258 76 169 -21 208 -66 -125 300 -117 75 109 131 -209 -118 -125 -55 -211 -65 117 -16 -111 -293 -387 -14 230 59
3282 59 29 166 -4 88 331 28 -110 -225 -173 61 -67 17 -49 382 5 -146 87 -22 -2 71 -307 -148 -48
3305 -48 165 -164 22 70 96 240 -102 -225 -88 -80 -356 -83 -92 -74 -155 33 10 186 199 142 -14 189 -121 108
3329 108 169 -22 -89 131 16 -129 -119 207 -118 -42 -38 -19 -123 68 -61 97 36 -19 -47 10 80 289 -244 -69
3353 -69 87 280 326 63 -108 -154 193 145 -102 -25 77 -183 -141 -212 -147 -1 -112 -252 258 -119 -243 138 123
3376 123 -135 122 142 99 156 202 -83 -305 293 -82 -165 178 -132 182 86 -95 41 -132 -73 78 345 121
3398 121 -192 -61 210 328 76 125 -183 -60 -108 9 137 -90 102 56 -180 51 -201 297 141 12 -62
3419 -62 7 -118 -6 99 -97 117 89 20 -184 -307 211 -7 72 34 5 -136 -213 30 -35 -93 63 -41 -137 49
3443 49 93 -35 132 196 120 189 239 148 5 -164 6 253 -44 39 333 -322 131 -165 -122 134 -34 325 20
3466 20 -178 -164 6 118 361 -369 -27 306 -1 -3 -384 -66 -14 118 5 62 -271 45 -256 352 191 -5
3488 -5 -215 -138 65 -56 -39 -26 -1 201 56 19 -110 -211 -47 172 199 204 -128 -154 22 -55 136 -110 144 347
3512 347 -8 170 -47 41 -175 107 -37 -44 -105 33 72 -19 4 242 282 -206 -32 -80 -16 189 -107 93 14 -163
3536 -163 248 -219 16 72 -42 131 202 -26 54 15 323 0 -140 -220 166 197 -102 262 -176 161 -65 206
3558 206 -111 -66 246 117 75 35 -120 97 95 -76 224 214 -74 214 623 -20 -1 20 -220 -47 154 -60 32
3581 32 56 37 -68 310 -29 -115 -96 -99 -93 43 117 11 -151 -126 -215 10 -78 -63 -220 -256 -104 -54 83 -353 -83
3606 -83 -62 -145 73 111 -145 224 -31 -123 283 82 -149 -133 -47 132 106 -107 76 -142 -113 -79 39 217 -18
3629 -18 -148 -62 -152 6 225 96 -220 116 -86 -191 -269 -95 -25 179 -106 -19 8 -150 -127 -54 -215 108 -358
3652 -358 156 -62 165 -16 127 79 -226 -3 326 -58 214 38 215 -49 -45 104 -150 -79 417 65 -28 109
3674 109 -136 -120 -11 -109 35 138 64 -145 -99 -311 -290 44 -35 214 -100 -122 8 27 -21 -113 -549 57 82 -61
3698 -61 -137 147 -52 -243 -31 42 206 395 170 206 -7 -189 220 -43 69 161 40 63 169 -165 -225 -211 -121
3721 -121 86 -49 42 -5 -53 -184 209 -19 235 -185 -40 -281 52 -141 230 52 203 40 -17 -386 -133
3742 -133 -75 16 16 -190 -147 76 -36 112 -34 -152 168 70 -258 64 -90 -21 -79 -33 -83 -9 -83 -44 -73 -242 -166
3767 -166 -35 185 -93 71 62 -24 74 -131 -133 249 -91 -203 87 -34 68 149 -108 -117 80 -91 89 65 -228
3790 -228 -72 75 -129 234 32 -164 89 -28 -171 -112 38 -56 -216 130 -137 -67 33 319 -15 -101 209
3811 209 -5 119 -73 -1 -89 84 90 177 -71 -14 143 22 -14 -161 -165 -146 -54 78 -4 294 320 6 85 135 -46
3836 -46 -63 53 -132 -10 -27 209 -13 64 379 97 117 7 171 -27 118 -130 -8 -208 79 -55 7 355
3858 355 -86 250 -210 -53 -142 -147 96 107 -32 98 -128 -209 -148 -7 -94 -64 247 141 46 71 -212 233 191 26
3882 26 -101 -16 70 0 -165 167 -27 53 -26 102 -40 40 281 -157 168 -323 -154 224 145 122 -119 -58 189
3905 189 12 158 50 212 11 104 148 63 -15 80 399 99 -342 119 -55 -101 -33 -151 -16 62 17 130 256
3928 256 122 202 -94 -132 -155 -8 -129 94 35 100 192 95 -81 -146 -71 264 77 -98 -65 -148 53 11 -51 -167
3952 -167 261 -48 297 -64 -81 94 141 -272 -80 -155 -83 115 2 65 -170 -148 -24 140 -44 -120 9 177
3974 177 -140 -137 45 71 -29 102 99 51 -326 215 -82 -192 54 -170 121 145 74 68 -35 -197 237 -151 -39
3997 -39 91 -124 145 -165 -392 -72 -10 47 -183 66 -40 -43 -142 10 -122 -124 16 -67 -147 110 405 -27 3 -98
4021 -98 19 41 14 148 152 -40 55 -31 147 -208 -158 -111 119 -54 -98 -214 -65 194 -77 197 14 -29 -82 65
4045 65 -117 70 132 181 69 -163 -156 -28 102 -150 -138 57 27 203 161 -16 -20 301 -143 27 291 -6 -239
4068 -239 82 67 -22 -105 -150 219 33 90 -52 -184 -121 -14 -98 135 -75 -80 59 -114 221 -164 -181 -205 -177 164
4092 164 294 -9 173 49 -71 10 31 -103 -143 30 39 -41 73 91 206 266 237 -54 -258 127 342 52 40
4115 40 -239 203 34 61 -20 -25 -33 126 -172 -16 126 -136 26 -88 -148 338 97 -92 119 -308 167 -225 84
4138 84 143 -459 -129 -150 48 -162 -169 -28 -235 -35 26 55 -47 114 -171 -51 255 156 -63 84 69 22 27 -39
4162 -39 -118 -238 166 79 -19 167 -82 -8 145 -131 36 75 -123 335 18 136 -97 -108 29 -103 11 -186
4184 -186 132 165 -87 126 -164 107 66 -129 153 200 -352 139 -61 73 75 27 -188 -87 -102 -124 -2 -86 148
4207 148 55 -20 88 -199 -98 334 255 95 144 -11 -138 -11 -53 46 75 36 124 46 -335 73 -90 53 -86
4230 -86 44 -80 -224 61 -180 138 236 3 -290 322 172 199 391 -38 -56 11 -174 34 -337 15 12 326
4252 326 -195 -131 443 -36 174 -41 -298 50 179 -186 19 -76 -115 62 164 231 9 106 -65 -178 22 -72
4274 -72 -11 -183 271 27 183 -172 212 -46 91 -124 -143 51 -67 17 100 172 124 -35 138 16 148 -134
4296 -134 49 172 20 166 -41 34 41 -36 -44 -108 -137 -279 -235 47 -228 -273 96 -51 -90 -58 -134 -115 -138 109 31
4321 31 -159 -68 -157 -144 -148 22 81 -221 -45 155 -28 -13 -92 60 -113 -76 -138 12 65 -8 -208 158 120 73 121
4346 121 82 -56 25 60 40 -147 -40 32 -189 -58 118 -48 -149 105 132 -147 -77 -164 175 94 -131 191 -8
4369 -8 -281 -237 224 153 22 129 173 206 108 84 -71 -17 81 168 152 -149 -115 25 -126 126 -54 -182 -69 159
4393 159 -59 -131 -68 -95 5 -259 56 159 47 21 23 -9 -246 -205 -132 -270 54 -50 246 6 87 -26 1 -174
4417 -174 -240 -52 -143 106 -47 -261 91 -17 -90 334 -225 -17 -295 -239 -107 -50 16 -107 -58 -108 -192 84 236
4440 236 -64 -35 -107 90 80 309 -126 -25 196 7 -162 94 -87 12 359 -220 26 -144 239 78 36 -26
4462 -26 24 -117 103 -79 -108 -15 26 34 35 52 -81 244 -143 -41 328 98 101 236 118 36 113 254 -195 -92 -175
4487 -175 -46 141 154 -94 -126 233 100 -51 -163 218 53 22 -102 159 -202 80 84 -51 -19 142 -124 86
4509 86 16 -60 181 -29 198 81 209 -197 -249 -154 -36 -72 -113 -8 -14 -258 -210 172 22 -133 64 -169 -52
4532 -52 150 -25 26 -121 137 47 17 -131 126 85 142 208 22 -190 -175 100 -22 32 -138 -112 -273 -77 102
4555 102 148 -23 211 30 -87 -149 107 -60 -285 63 141 22 62 76 -24 80 -6 -149 23 -35 241 -345
4577 -345 -72 88 -103 148 113 18 138 210 277 229 -199 -178 181 -101 51 48 -100 54 -233 -240 -6 11 -68 202
4601 202 -22 -4 -176 8 -236 -92 22 -60 -15 -78 -67 17 11 110 -107 303 157 -51 -130 17 -230 46 215
4624 215 -190 204 -178 25 131 -154 44 -160 -343 259 -97 148 2 -12 21 47 89 317 155 -13 74 195
4646 195 196 6 -95 73 368 -265 -48 -201 78 65 -24 156 117 13 -149 -14 74 96 156 -126 -86 -27 -34 105
4670 105 94 -88 9 -142 -264 -38 198 -110 -100 -67 120 198 82 -117 -94 -120 -48 241 77 -88 23 87 -80
4693 -80 76 -98 65 -13 -21 92 104 82 22 246 -9 -4 154 -75 78 43 -28 -11 129 -106 -122 -12 168 -2
4717 -2 91 76 -214 88 47 75 335 -87 16 -251 -19 71 -43 50 154 -49 -57 98 -95 166 72 -95 260 -4
4741 -4 -144 388 134 116 -38 -79 128 -121 74 132 -51 18 113 151 51 -29 -139 157 -359 -150 -51 -86 127 64
4765 64 31 -120 11 -256 -59 -180 -20 -104 -216 64 -205 -20 -8 13 -13 150 -225 79 -58 -68 -98 -69 -69 -58
4789 -58 -2 95 170 208 5 44 300 18 145 28 -82 183 89 81 -58 -68 -154 -32 112 -187 515 182 -187 -73
4813 -73 -24 -82 -74 -149 122 -143 -68 -49 153 105 59 -193 -45 58 38 -282 -220 -43 -99 -37 -230 87 34 -138 231
4838 231 193 86 -138 43 238 36 14 18 70 26 -28 136 4 155 -17 109 122 -158 216 -56 -77 46 -126
4861 -126 89 -16 -82 -80 -107 57 -61 257 -218 -182 -68 32 2 -52 119 -93 -6 51 -78 218 117 71 -4 184
4885 184 75 -81 149 -51 16 136 -289 95 -89 -209 105 121 7 -81 -23 92 217 -218 -224 -71 -122 -13
4907 -13 -44 4 8 129 60 -82 -269 105 -72 -179 -61 -80 119 35 236 389 93 123 -45 75 0 118 -58
4930 -58 142 11 -163 -1 57 94 93 114 -129 -40 130 -75 97 -278 152 -339 -13 254 44 -5 10 163 87
4953 87 -74 -255 -60 128 137 -381 -190 244 -102 115 -99 -303 164 190 -124 -42 249 76 -123 -135 6 166
4975 166 -69 -123 -66 353 225 -48 -206 208 256 31 173 -257 87 131 28 216 -19 -40 283 6 -86 36
4997 36 147 49 123 83 12 -5 -31 185 -289 -132 -101 114 -98 -206 184 -127 213 -108 240 -53 -64 57 134
5020 134 103 -88 -41 107 377 77 163 89 -29 -95 7 14 -52 -275 39 -263 37 149 -259 27 106 176 -179
5043 -179 290 52 -124 46 -146 -17 -162 48 110 354 -145 -167 61 -270 -76 -74 31 -3 -101 68 345 44
5065 44 -249 -226 -277 -161 -83 320 -241 170 306 -52 -116 138 62 131 -69 181 188 -33 79 77 216 -16 -38 194
5089 194 -271 -76 260 20 -226 222 363 17 66 -136 211 169 -211 15 -6 179 74 -121 -68 68 -27 -49
5111 -49 41 21 -102 -10 243 82 -46 -185 55 -224 104 -119 -36 124 -114 -12 13 128 -218 85 -216 -22
5133 -22 55 30 8 279 197 66 284 -74 -59 72 280 -213 -106 19 -177 14 76 35 68 -158 121 -189 96
5156 96 159 -157 261 -135 -35 -3 -109 -159 209 103 125 -79 -48 -23 111 313 -164 9 -43 124 -70 -176 -334
5179 -334 27 159 -112 -87 208 -150 35 249 138 90 206 33 -144 -201 -80 -13 86 -75 282 33 -264 -12
5201 -12 47 -160 -77 -239 -82 58 -134 108 -171 160 3 273 48 113 305 -94 3 -354 33 -77 154 216
5223 216 125 98 -4 -208 149 -159 -76 210 -295 -278 -268 78 253 -138 -2 84 -145 -9 16 93 40 -154 17
5246 17 -214 -18 -33 -72 -143 185 -51 -155 -23 195 -90 -72 -27 -411 -18 -66 126 84 2 -242 216 -56 -48 -12
5270 -12 -57 29 -50 116 20 -196 -232 -63 -91 -78 215 375 71 -66 -47 -181 -163 -13 -123 -78 -68 -31 69 43 -44
5295 -44 286 211 132 -112 -16 558 79 -284 -37 13 -24 -48 47 -24 -77 -88 -233 -66 -58 240 -1 61 -131 158 62
5320 62 -250 48 236 -145 -186 202 41 289 -49 -139 -22 261 94 -49 -275 -96 -93 187 86 -34 -35 26 -178
5343 -178 -185 -92 -89 -77 0 280 -163 -30 -99 -183 257 -35 -159 -181 -63 99 -125 34 -152 15 -133 -107 -58 22
5367 22 -32 69 209 294 -81 -111 -33 27 137 93 -109 -152 138 149 39 -8 -152 -113 305 -167 -114 120 58 45 119
5392 119 11 -18 111 -21 -48 -59 71 -164 -140 -179 -64 211 -14 119 249 60 136 -169 99 -26 -164 -33
5414 -33 98 -167 147 13 -174 -215 66 -214 0 -8 -48 -21 -67 50 5 -31 -12 -85 -132 38 77 149 -102 1 51
5439 51 125 -60 90 28 314 -144 37 -54 -86 122 -290 -76 298 6 -12 58 -167 -36 150 -21 -8 156 -35
5462 -35 158 162 9 -42 -215 296 -30 -50 -94 62 -151 -174 165 32 55 147 219 -141 -152 142 104 -134 -104 99
5486 99 -118 -74 -210 -60 166 -59 -231 8 -11 77 162 200 -33 106 34 -154 230 -157 17 -13 7 19 -264
5509 -264 -109 -175 149 -206 62 117 103 -44 -40 6 123 -39 -280 26 42 19 -129 157 79 -6 -55 253 -122 -29
5533 -29 -23 -98 190 -22 -120 172 -24 158 78 -75 222 -97 -78 -45 227 89 6 42 -101 -68 -24 -69 -55 -270 252
5558 252 -64 -127 -9 203 153 79 -27 146 192 -74 -150 -259 92 41 -17 147 -87 52 -331 -269 347 -75 250
5581 250 -120 311 -10 303 -139 169 -34 -38 7 241 108 278 182 89 -24 148 94 -233 148 226 110 318
5603 318 10 -24 38 39 -189 291 242 -20 -47 210 -30 105 202 39 243 60 -29 -89 14 36 230 -73 38
5626 38 229 24 -79 25 -26 -94 78 -83 91 -153 -41 -49 274 -7 -130 97 -98 -107 66 -22 175 280 42
5649 42 -6 304 225 56 1 -70 125 -208 70 68 48 24 324 260 -87 -28 219 154 -221 -84 8 226 -221 185
5673 185 229 -93 148 -336 -115 111 -25 63 107 -45 53 -155 159 -90 -30 54 -123 86 -104 62 -66 31
5695 31 51 16 -40 6 135 -34 68 -82 67 115 -7 180 115 -174 -17 -40 -48 207 87 -171 -25 -39 211 16
5719 16 72 320 47 119 -37 182 140 30 -43 -170 30 -67 -90 -121 109 -448 -1 180 -94 92 55 -100 -228
5742 -228 89 30 -151 -21 97 44 -1 -158 -114 66 -126 -87 275 -30 60 -139 -337 -311 -307 219 -218 -79 -3
5765 -3 40 243 -189 219 -252 -1 -13 -120 17 -61 162 86 117 49 -71 346 -207 99 22 139 -101 -157 22
5788 22 45 125 396 -106 32 -53 11 -72 148 -74 245 -176 126 181 -146 -27 80 -41 316 -26 43 -330 -157
5811 -157 98 27 14 -64 -221 133 21 -30 -237 11 67 328 138 32 -213 172 -43 154 -262 -76 -199 20
5833 20 90 -282 -20 -25 -44 -2 -192 -122 -162 -206 119 -47 -126 -169 152 -62 0 -100 -18 -44 187 19 69 -104 7
5858 7 166 220 9 38 185 -90 -342 177 6 -181 9 -268 -17 341 21 -92 -13 230 -59 -162 212 -121
5880 -121 -277 174 69 144 114 21 -65 -185 43 187 -32 -177 259 -126 14 170 61 -19 194 -5 -13 -225
5902 -225 -14 -268 -283 191 -105 172 -269 61 95 -65 -38 60 -15 48 -111 2 -54 -503 -151 30 87 -56 -188
5925 -188 140 31 228 -87 169 472 -83 68 49 55 -13 -51 -218 228 -105 140 362 -329 22 62 -346 -111
5947 -111 -12 -147 -7 39 -56 -125 12 58 -64 -127 22 104 -143 71 54 -62 228 -39 -38 -58 50 -28 53 -58
5971 -58 -89 -169 133 48 -172 240 -40 51 -235 196 -194 10 -84 -47 -15 135 -54 79 -217 -61 89 -237 -66
5994 -66 -42 -15 -113 8 -198 96 -112 -62 209 140 -28 136 -169 -209 -21 67 -7 -278 -102 -3 -202 -148 -193 -232
6018 -232 136 5 134 222 16 47 -103 -306 -350 100 118 163 147 196 228 -183 104 128 -144 13 227 20 137
6041 137 104 65 121 201 -36 -85 -124 91 -44 118 234 81 -45 96 -39 -188 27 142 296 -145 -24 132
6063 132 188 71 113 -27 179 51 -201 -13 -124 -17 171 138 -224 -378 -72 161 -144 86 104 219 -101
6084 -101 136 120 -124 115 -312 -138 -11 -107 61 -81 -156 -189 -67 83 15 -14 3 94 222 213 -41 64 186
6107 186 -75 176 320 182 105 -167 43 210 48 -80 77 -225 -27 -201 108 -184 -96 80 174 29 -94
6128 -94 -16 -165 357 257 -40 -39 -372 198 -47 35 5 -149 -62 -141 -4 123 -93 -253 -109 182 -49 182 11
6151 11 -240 46 -289 173 -120 91 153 42 -149 -163 -18 134 54 57 -157 418 -55 69 115 -43 -66 192 -70
6174 -70 132 -12 99 154 8 -111 -114 5 -219 132 27 26 12 34 -146 -58 -53 -368 -154 71 -47 -40 125 -153
6198 -153 47 83 158 -43 14 114 90 110 -68 232 -111 -13 21 -29 331 15 -44 -60 -18 50 -266 138 40 -75
6222 -75 -104 -9 57 -198 -191 221 -139 -33 -118 198 185 -8 -283 -11 173 44 -124 -23 56 -13 -95 -39 99 239
6246 239 -15 234 56 224 29 -492 -16 -180 177 -216 -47 136 61 -35 108 -289 72 -452 -8 133 84
6267 84 -156 -49 3 7 106 213 105 -182 -7 28 85 -258 -128 63 74 -36 -45 -294 -90 125 -95 -148 -100 33
6291 33 14 -212 223 -244 149 -113 100 -249 -33 83 -188 -115 -57 233 240 60 83 33 47 -191 -23 145 231
6314 231 146 -157 -9 105 -146 -53 176 -81 43 241 32 -175 27 -26 8 3 -82 209 36 148 38 13 57
6337 57 -26 -123 -161 -26 -87 -131 -6 22 -183 -58 -40 -119 258 -40 -7 -42 -250 -172 108 134 -53 -40 -126 170 4
6362 4 -49 -303 -137 72 256 224 187 -234 -64 7 30 -157 -43 47 -162 64 15 206 83 -270 -41 29 101 -5
6386 -5 207 29 24 167 -53 232 -155 180 90 3 109 106 -29 187 1 60 -226 -73 23 -20 112 -18 -215 4
6410 4 189 -218 -16 67 -76 117 -17 61 -1 338 -119 38 123 -20 -35 -65 80 -117 -57 118 29 -259 -148
6433 -148 -55 -94 377 -88 5 137 -36 -62 -392 94 -121 46 214 -100 141 -135 -27 -62 -242 -33 166 -21
6455 -21 131 -161 302 -153 73 -69 98 23 -125 289 -68 -145 13 10 285 -20 156 222 23 -245 96 77
6477 77 -2 -26 -181 -172 315 119 -198 236 139 86 234 13 -2 20 -266 238 -225 -159 -185 152 -240 205 -182 -251
6501 -251 -83 36 102 72 -31 -122 85 -35 82 117 -104 22 54 14 -221 -134 -121 125 280 50 -252 21 69
6524 69 -20 167 93 89 -80 -143 -140 0 -227 92 81 17 -225 89 59 71 143 198 -33 -69 187 -40 -60 -224 -12
6549 -12 -192 39 251 -154 18 343 -33 87 -125 -1 -113 -78 -55 -139 -95 306 -98 -147 115 43 -45 -89 55
6572 55 259 -196 -168 152 198 -22 -112 46 -182 -54 -93 -19 -196 108 -312 -54 144 -413 96 -201 -131 266
6594 266 -109 -60 -174 -80 107 -95 -105 5 -34 122 -97 55 -201 3 33 117 66 258 52 6 0 173 39
6617 39 -44 -63 -48 -218 -67 -219 57 101 -28 -123 202 -137 -125 65 82 -268 -405 -62 49 179 92 239 -46
6640 -46 -148 -16 128 -143 -261 63 15 98 -13 163 -11 131 -231 77 34 -161 -71 -183 -51 -196 -24 -118
6662 -118 -157 3 134 -76 350 -67 14 376 -78 -59 6 -75 23 -151 27 81 75 276 255 -112 79 293 61
6685 61 -59 96 -223 -127 -250 -138 54 -164 -135 245 195 123 23 -7 -128 241 -242 52 154 52 45 185 -1
6708 -1 -26 -156 -51 -1 -130 219 160 -30 110 -199 -191 75 -38 96 -185 -42 102 111 4 131 18 -52 -62 -260
6732 -260 9 258 -50 124 -147 -60 22 -56 -192 -97 31 280 166 90 31 24 223 25 -352 23 155 46 -208
6755 -208 103 -7 -73 -35 -47 -19 32 -20 98 -83 -359 196 22 -44 -6 41 86 -25 209 114 -72 149 14 63
6779 63 47 244 13 -45 -23 5 -90 36 -160 -182 -166 -172 211 125 -179 -128 -154 -123 18 -208 102 -176 80 -170 -71
6804 -71 324 -306 -81 36 144 86 168 92 -109 119 -40 -98 204 195 54 -96 10 -58 53 79 -11 -329 -259 -121
6828 -121 -93 148 -73 9 -84 2 -85 -304 16 40 15 160 -122 211 210 -135 -187 77 -375 -14 91 -30 -43 60
6852 60 31 33 145 182 -168 -223 153 51 341 -157 -113 168 -64 91 -123 39 -247 -52 290 98 -254 208
6874 208 -10 528 -173 -161 183 142 -8 84 -68 55 103 95 -113 -61 -163 76 224 -117 -315 -25 -1 9 -76
6897 -76 128 130 -262 236 -78 96 154 138 109 313 9 -182 127 271 -50 165 -184 -41 -111 -155 91 134 117
6920 117 -103 -278 -80 136 -291 -146 177 -9 -76 238 226 -104 -196 38 191 -15 51 53 108 -2 144 -150
6942 -150 -140 -49 -87 173 -105 112 7 -64 -11 -8 305 66 -145 -104 -60 -10 233 100 53 -9 -32 -236 301 -149
6966 -149 -229 -248 -218 -123 50 164 -37 63 3 39 -291 226 -98 52 67 5 77 194 -137 -117 -45 1 141 39
6990 39 132 150 -474 -141 -340 44 113 123 -222 50 -302 -218 -125 122 -34 -24 -180 75 -90 -130 508 49 -25
7013 -25 211 -4 150 76 -33 -115 266 100 82 68 -127 -165 -16 0 -197 -124 35 46 94 193 -82 69 -20 -309
7037 -309 -190 -79 -196 171 -45 -105 -137 96 -74 -8 60 25 -169 92 83 -144 22 130 -87 -38 168 -2 -41
7060 -41 -212 87 39 133 24 -98 137 -49 -38 -207 -20 -151 -43 4 91 -135 33 -124 -50 -133 -117 -46 -11 21
7084 21 43 9 -101 195 -43 46 -93 88 32 -33 293 105 -119 -138 0 23 -1 152 12 -80 34 169 -29
7107 -29 -158 24 17 109 -150 45 9 39 109 -84 -221 231 126 37 88 -35 203 91 108 -63 82 -138 -89 183
7131 183 214 -276 -382 -258 -44 138 353 25 208 100 68 -109 27 125 58 -240 127 112 41 -90 -40 219
7153 219 35 61 85 108 -148 230 174 48 15 -83 94 -175 52 42 -295 -177 -23 -10 -29 -168 169 -80 46
7176 46 54 197 69 -18 -182 65 378 -133 115 93 39 53 175 57 -154 40 92 -53 -110 25 74 -33 147
7199 147 -297 -63 248 36 -131 -45 -92 313 -89 -118 134 -88 -199 -67 -21 15 15 -230 -93 -172 218 81 142
7222 142 -58 224 219 -22 -45 -39 125 -195 21 12 81 43 -92 -116 -67 155 14 92 211 82 80 -88 -167 -180 -115 150
7248 150 -174 -159 236 -26 26 224 -149 -148 0 -169 50 -209 31 -138 90 50 136 25 7 31 242 -40 -229
7271 -229 -51 56 -71 -112 54 12 99 155 -38 96 160 81 -262 -49 -57 -34 0 -44 -241 70 23 -253 -251 -190 246
7296 246 196 257 -133 135 -108 122 -118 219 -238 -161 -1 -26 68 40 27 -14 2 14 1 -59 137 83 -240 -24
7320 -24 -16 38 -108 372 85 158 28 48 -538 -40 214 92 -58 -107 43 -113 -47 -168 153 80 103 3 156
7343 156 186 -9 -320 7 42 -235 89 -64 27 47 50 169 144 -83 -125 -81 538 95 128 -82 -209 -177 -43 -114
7367 -114 -80 5 -153 105 52 -121 66 -33 146 -49 7 188 -104 156 270 -24 162 128 120 -87 -183 -39 -126
7390 -126 81 332 12 191 168 -220 -25 44 50 20 14 -115 -82 77 -129 296 81 -252 -142 -112 2 -17 -43 -33
7414 -33 51 37 -10 387 17 273 15 118 -175 178 -32 -71 -31 -159 207 56 -3 -47 -165 -56 -127 -255 -228
7437 -228 142 -67 231 231 -13 220 -258 -3 28 202 11 63 49 -80 49 71 84 156 25 -94 -88 -25 42 35 186
7462 186 -90 -164 71 -315 -31 -98 -183 38 -9 46 17 253 142 -63 -70 -85 268 103 -80 13 -231 -306 187 -221
7486 -221 -225 172 168 -3 49 -121 -45 71 -58 167 21 24 91 -138 17 162 186 240 138 -61 -55 -22 205 84 -84
7511 -84 209 231 -53 -152 109 169 150 112 63 66 224 85 -150 10 -62 -348 -102 -273 -107 129 -269 203 -104
7534 -104 -25 28 190 -186 -169 25 -46 -164 -11 75 118 -67 -197 -122 311 72 -286 -114 -192 55 -370 183 -118
7557 -118 303 -113 -188 -37 -30 16 -28 45 -125 20 126 133 -92 157 -188 53 -244 148 -114 118 116 171 -13 57
7581 57 39 117 183 -111 -64 -110 99 204 28 -34 40 -58 213 -72 25 46 -50 -78 -49 167 -196 -120 -77 -6 -6 -46 327
7608 327 19 39 101 119 -100 271 -41 -127 -174 34 -231 -40 299 249 143 -101 -80 148 93 -183 -250 -120 47
7631 47 270 -26 55 -18 149 -70 -10 -38 -340 -14 82 -281 -112 9 -89 338 191 -19 -231 61 -35 -27 -58 -18
7655 -18 -65 57 96 -60 143 50 -187 -20 -63 62 -54 134 223 -36 54 -55 124 277 -72 81 -98 -170 -83
7678 -83 50 -135 107 -104 116 -34 -27 -159 26 -46 -15 29 80 415 -16 -103 89 20 43 -102 -135 242 33 185
7702 185 43 -127 -71 -322 125 -103 -91 -90 -91 95 -155 186 -137 55 47 -132 212 -20 79 62 7 130 13 235
7726 235 -212 317 117 -165 -76 71 -13 -79 -20 75 59 75 166 -338 131 122 179 2 -273 -438 -147 82 -138 170
7750 170 15 -75 -16 292 136 46 -35 44 294 -111 -6 -164 -108 -51 71 -51 71 39 -204 195 202 -56 -7 -66
7774 -66 -14 41 37 -218 40 62 70 -426 -163 77 17 319 -104 -227 60 -120 111 133 -142 -370 59 -88 -137 -363
7798 -363 -146 132 34 -167 119 -107 71 -119 153 -157 -242 280 -120 -45 -117 -100 -68 -326 -108 185 -41 168
7820 168 75 235 -141 122 73 53 -92 232 174 -63 -57 -22 34 -58 175 69 118 97 11 -50 23 -70 -15 -82 284 31
7846 31 1 220 16 12 -58 252 -22 19 -16 55 -190 -179 -253 -39 -50 178 -178 -42 40 198 197 -17 129 -153 129
7871 129 -277 142 -160 200 80 42 41 -616 12 238 -114 -20 152 80 147 -78 72 66 -246 -140 104 -121 -138
7894 -138 118 -334 55 179 -153 -97 9 72 166 -139 -209 284 -15 -319 -182 -153 -10 -76 91 173 224 156 -175
7917 -175 -81 160 67 37 76 -158 97 141 147 -196 -231 -83 283 8 -8 -28 168 6 36 259 -229 27 64 -3
7941 -3 152 27 41 68 -127 122 109 -40 -30 -137 143 201 148 -233 316 -36 -86 295 90 -127 40 200 45
7964 45 155 32 16 258 -119 -155 107 -281 69 79 235 283 -184 -18 -108 150 -118 88 -4 159 -223 -166 -107
7987 -107 146 11 -36 -19 -35 234 25 -78 -78 132 185 -4 93 -356 33 -5 13 97 221 24 -97 123 129 -280
8011 -280 119 42 55 -147 66 19 -323 87 57 74 380 5 61 -74 122 311 105 33 -152 -198 71 -166 89
8034 89 -12 82 163 -116 187 -93 -91 54 70 -8 1 139 -80 -187 22 260 -12 87 100 -99 -43 212 28 -184
8058 -184 44 186 -89 34 -83 -23 -114 38 62 112 367 -140 -301 -250 29 169 46 33 -56 -5 60 121 -112
8081 -112 84 33 -199 168 -237 -217 105 67 -174 91 192 -83 -302 170 226 247 18 -92 -302 -32 28 145
8103 145 432 108 36 83 295 -184 49 -305 172 -2 -238 35 -12 2 -99 -136 149 37 173 168 14 67 35
8126 35 67 -226 52 -49 123 40 -12 164 -92 -288 -16 -86 167 39 -105 -28 214 -50 57 -65 -4 -149
8148 -149 -46 -65 -25 -34 -32 20 19 -27 -124 -31 77 -122 44 -177 63 -278 39 -141 138 -79 96 -327 40 34 -369
8173 -369 -116 10 122 -61 -52 19 35 78 -156 -11 -29 -105 -235 62 -34 -31 192 -212
8191b12
$$ Imaginary data points
##PAGE= N=2
##DATA TABLE= (X++(I..I)), XYDATA
0 0 0 0 0 0 0 0 0 0 0 0 8 -8 8 -8 16 -16 24 -24 32 -40 48 -56 72 -80 96 -112 134 -152 176 -206 233 -266
32 -266 302 -342 390 -438 493 -551 617 -689 768 -853 947 -1048 1160 -1283 1414 -1563 1724
49 1724 -1898 2090 -2302 2537 -2799 3091 -3417 3791 -4218 4710 -5292 5984 -6825 7880
63 7880 -9241 11078 -13711 17836 -25297 43363 -192698 -132754 20537 32665 104596 -99665
75 -99665 -74115 -1395 49361 54867 -19342 -65729 23918 34263 36615 -3157 -44148 6585 51283
88 51283 23254 4408 -33313 -4835 39359 34325 3828 -19287 -5386 36169 22261 -5035
100 -5035 -11590 -3608 24022 30078 -4206 -17124 -12818 15207 26445 -4581 -14443 -7727 4717
113 4717 19090 -3467 -18659 -5724 3732 10612 1398 -21950 -13265 5545 6662 2200 -15464
126 -15464 -16255 3431 3578 -2419 -9935 -12146 1101 8459 -1015 -11977 -10648 -353 8921 1794
140 1794 -8691 -8264 -1673 6411 3852 -4479 -6431 1236 6986 3001 -2889 -5291 1157 7946 5278
155 5278 -1077 -4679 772 6369 4831 512 -2295 847 4982 5335 -329 -2677 1106 4495 5108 302
171 302 -2742 -685 3187 4470 489 -2271 -1172 1516 2810 -54 -2479 -1317 1375 1760 -163 -2670
187 -2670 -2211 466 911 229 -2185 -2440 -301 433 -93 -1806 -2079 -502 365 -251 -1463 -1629 -346 801
205 801 -160 -1050 -1194 -713 865 560 -406 -501 -381 679 836 -79 -92 262 600 1027 471 -21 106 778
225 778 738 264 -133 297 370 803 449 -265 -214 260 342 34 -42 -626 58 408 48 -235 -813 -549 77 261
247 261 -289 -659 -761 -426 201 -60 -260 -302 -204 51 -212 -43 92 -34 467 236 -302 -309 295 226 489 -106
269 -106 -306 -88 417 206 304 371 363 538 175 225 -22 539 264 487 155 -18 146 18 367 174 -106 -115 -20
292 -20 294 244 -232 -245 333 -17 -64 -208 -626 -262 -355 297 97 -357 -391 -144 -39 -526 -112 -108 -108 -48 -306 -453
316 -453 82 435 21 7 -230 -88 -84 2 192 60 -136 169 165 -88 -82 -20 -2 312 -38 -65 102 62 306 124
340 124 33 14 103 402 176 293 175 188 169 -5 287 -260 155 250 212 367 -191 1 -62 -146 215 -8 159
363 159 -121 -180 -314 -282 124 -2 38 -98 -235 -155 -268 -232 68 -117 -234 -108 -155 51 -168 -235 301 -257 63
386 63 -28 -143 136 -188 223 91 -112 -95 -135 -95 141 -76 291 239 247 62 106 -197 290 -29 210 277 250 -38
410 -38 49 90 135 -93 -22 -90 -280 154 -20 -60 -76 -103 103 -14 -231 -70 10 -132 159 -250 64 -77 -262 -223
434 -223 134 249 31 83 -112 27 109 15 -83 -247 221 200 -111 95 99 280 -10 -145 129 100 116 43 370 -26
458 -26 62 239 -164 -170 -55 163 -44 140 70 208 124 -29 252 30 -56 27 -14 -23 28 -5 79 -8 217 195 -154 209
484 209 -17 99 117 55 -30 -306 -170 145 -276 -283 183 4 102 -155 112 78 -336 -174 -117 -185 136 -292 50
507 50 176 101 -114 31 204 31 -122 -170 -13 -54 97 -203 58 137 8 58 90 187 -79 5 -360 33 85 -129
531 -129 -4 132 218 45 116 49 4 46 158 -69 -206 245 -56 10 -95 3 312 -33 66 95 -82 153 146 -19
555 -19 -41 -20 86 245 -16 -48 -153 -214 -75 63 159 -6 -149 -87 -225 85 -99 96 108 25 -82 45 -27 -84
579 -84 144 -4 -136 151 174 219 77 -189 63 223 -136 -99 118 -260 119 -85 119 -89 138 -140 205 -57
601 -57 -118 -35 -179 17 -75 -19 76 96 5 -90 -204 108 67 -221 -121 -310 -226 19 19 248 4 -41 37 2 384 272
627 272 21 159 -75 -321 114 -128 -32 -219 10 115 142 75 -150 198 -187 14 -130 -103 -182 -160 -22 28 -201
650 -201 -47 -134 176 110 2 185 151 -299 -31 186 162 146 151 120 -100 -40 263 -50 -145 -47 -416 -200 23 111
674 111 -21 4 -26 -8 -128 -79 127 -110 167 18 27 329 71 -35 -239 124 24 171 -66 -77 -83 -73 135 214
698 214 13 124 22 -89 112 187 48 50 101 328 -130 -43 78 -202 35 -31 107 -45 20 174 264 20 201
721 201 -10 -302 -175 -203 123 -278 15 -83 -50 -248 -54 -84 97 -87 92 25 32 -20 121 -421 9 -104 -24
744 -24 -94 -67 -222 230 104 50 83 -94 138 -272 65 238 -93 -90 227 46 163 -166 40 112 -31 81 57
767 57 -71 -62 204 -78 -82 132 -336 39 199 134 -16 -14 -51 38 93 299 91 -12 -101 23 166 -178 -54 -2 30
792 30 -226 99 -24 127 -28 -181 -134 -53 -458 -149 -46 -293 89 170 -227 256 -10 50 46 83 -68 -46 160
815 160 -210 -307 -300 -30 -33 84 148 19 -243 52 -140 -8 -110 74 -10 154 147 124 255 -160 -198 9 315 64
839 64 0 -25 -132 -71 175 377 -152 -66 -155 8 -9 141 141 -229 145 18 -59 -11 101 152 167 -172 -40 91 117
864 117 93 -177 86 -41 -85 -103 -159 -142 -196 104 126 64 151 116 -187 83 18 -108 21 171 48 -370 108 41
888 41 -32 307 -142 -162 77 76 -42 114 -119 -77 200 169 -76 206 -96 61 -39 5 90 -21 28 -171 123 -174
912 -174 135 80 131 118 -67 -170 -260 -74 16 123 255 -196 23 45 -361 -65 -80 -101 7 63 -235 -40 151
935 151 27 -3 55 -3 87 49 74 91 63 82 -4 14 -120 201 -178 -95 67 -149 120 -93 -103 12 28 -188 132
960 132 -168 193 -143 46 -101 96 34 -55 149 29 -205 -87 378 -179 21 83 -272 -161 140 24 -28 -122
982 -122 71 -34 357 -107 -15 -120 -92 122 -317 -67 -52 44 -191 -35 -244 -261 -119 -154 -154 -338 -95 -13 49 -120
1006 -120 -102 95 -81 15 62 104 19 18 -182 -67 215 -46 137 43 114 -219 37 330 -151 192 -259 84 -33
1029 -33 -37 8 -32 -132 43 -90 84 85 -208 64 3 -65 -194 -178 -44 -212 -143 191 123 79 -54 -73 0 -13 -108 -124
1055 -124 44 43 73 54 259 -32 -65 -66 -28 199 145 -504 158 64 48 29 -102 50 85 119 -114 -304 200 -68 -128
1080 -128 399 -51 361 -51 -175 -121 165 138 110 -91 -239 14 18 -57 206 48 50 -57 238 34 -84 74 -230
1103 -230 -51 -180 55 -185 144 -95 -110 52 78 -185 -48 80 88 -5 120 162 6 44 98 30 60 -162 -145 -277
1127 -277 177 233 184 34 -22 -114 -55 -74 41 221 209 132 -44 -299 19 -24 -8 -223 109 -169 219 46 -93
1150 -93 45 44 -38 85 -55 -130 26 -83 -67 -129 131 57 -126 166 0 -129 84 -215 -98 -55 141 -88 -49
1173 -49 46 -161 193 100 323 68 -170 23 -62 -22 88 161 333 -178 55 -123 -139 134 129 -24 -120 -37 -173 46
1197 46 -66 -141 136 -278 -199 -31 -40 133 -138 18 11 7 -144 -101 -40 -110 104 -108 -118 -66 -45 23 -141 185 220 -162
1223 -162 -27 80 -5 -78 -167 20 168 -34 -41 -286 106 -107 78 10 164 160 -366 58 -36 -200 -76 102 -12
1246 -12 -178 162 -152 -163 -26 -340 -169 203 -29 128 -156 -119 201 -26 90 237 250 4 -50 -120 -26 -33 -104
1269 -104 -142 -159 -489 65 111 -62 -166 -217 21 156 168 -7 -126 -8 63 -211 -18 -105 67 36 -53 3 178
1292 178 -73 -51 74 -78 -203 88 141 -36 84 185 -294 14 -60 94 -55 -109 -145 -57 36 -138 -101 134 7
1315 7 -151 -280 275 149 150 -101 17 283 -324 271 -46 87 -132 -34 -55 180 -179 -7 -5 152 209 -114 -114 -261
1339 -261 -76 123 11 40 273 -69 300 111 13 83 -77 140 46 201 10 -49 88 -104 100 74 -17 104
1361 104 -36 176 225 47 178 -15 130 -1 15 78 145 62 6 39 -59 -13 61 208 263 141 -36 -296 -26 204
1385 204 34 66 57 -83 59 -210 16 100 -117 -67 -135 -206 -37 35 -44 305 201 224 233 247 -313 -257 -156 -2 335
1410 335 -120 89 279 -65 -200 -176 178 35 6 35 -76 -70 -229 72 -250 78 234 -101 173 135 104 171 -97
1433 -97 80 92 167 -140 -5 -167 -230 -46 2 -271 -190 -88 162 -158 165 170 27 -84 -191 228 73 -10 -303
1456 -303 32 37 1 -37 80 -7 -100 79 38 -25 -8 170 -181 158 214 -85 122 -291 -316 -112 320 28 -195 52
1480 52 105 -157 31 118 100 222 -149 125 -172 132 90 -168 117 -157 109 -251 143 170 71 -11 -45 53 291
1503 291 116 77 219 -185 -282 -26 53 -208 21 54 100 -287 168 108 95 160 -35 -30 36 -68 -64 -106 176 -81 21
1528 21 124 151 -12 -81 298 52 109 -33 130 208 158 -165 -78 -157 22 115 164 112 41 -161 118 71 -390 -157
1552 -157 90 -96 -58 -25 -86 -94 -136 25 122 -35 6 28 340 -153 60 144 -296 -11 155 76 -111 -89 -21 -303
1576 -303 13 148 20 -135 -241 361 88 -37 95 65 -224 -263 194 194 174 -164 -7 -3 208 30 -142 -54 -14
1599 -14 -54 37 -79 -191 221 -51 184 70 -26 46 178 -209 -146 -9 -35 80 78 4 -187 94 -123 -99 84 -56
1623 -56 -157 183 141 -6 -87 62 144 13 140 155 -84 -83 -57 50 -88 13 136 187 -106 49 -156 -64 78
1646 78 93 -43 -15 197 -156 -146 17 9 144 200 -27 48 -16 30 -189 -104 235 144 -27 -44 -171 61 174 -169
1670 -169 1 -52 -175 -229 -162 275 -34 49 107 -133 -85 -90 -106 184 45 112 -87 41 139 39 68 -117 -127 177
1694 177 -169 -95 24 -40 -326 -63 -76 -57 189 -116 -69 -139 -204 66 -76 -146 -73 -20 -58 -165 82 5 -60 41
1718 41 -183 46 68 -30 267 -55 -279 0 78 86 -101 -217 310 -8 185 -96 -109 139 56 306 181 -75 -126
1741 -126 488 -121 194 -61 111 -213 123 -57 -143 -32 105 -55 -94 105 -153 -25 27 -78 -176 -83 26 -171
1763 -171 109 251 -162 -141 282 -130 -222 70 -226 155 82 171 192 167 -16 -6 40 -36 36 281 26 178 -58
1786 -58 234 -35 -33 -18 -62 -11 315 90 -77 28 -179 17 -77 -89 39 -77 13 -34 37 -258 -121 -195 244 256
1810 256 -337 -151 19 -33 -139 337 -26 -175 -24 71 168 70 71 139 45 131 187 253 59 154 -99 235 -183 68
1834 68 241 -220 -212 163 -7 -300 -54 151 -103 35 301 49 60 -26 233 42 -109 139 61 67 -109 0 344
1857 344 -19 -117 138 -24 6 39 16 88 195 207 -56 20 44 238 116 -30 135 -109 -128 203 -34 156 -118
1880 -118 -33 129 263 118 6 388 -171 -119 -160 -292 49 213 20 -387 -133 81 124 364 76 -159 37
1901 37 -327 34 -36 153 -263 104 -92 -71 5 -34 -2 157 -10 -13 191 182 -166 -32 9 50 341 188 112 -130
1925 -130 -120 -179 249 -138 127 -114 -19 -22 -331 96 16 -4 126 -28 184 60 116 -49 10 -58 -31 17 -221 29
1949 29 -84 81 65 -111 29 31 -41 -86 227 -109 48 43 301 55 -102 64 -16 72 -28 218 -194 -234 35 -136
1973 -136 325 182 -65 -153 52 93 -126 342 -68 60 -169 17 -3 13 183 -292 296 -104 -157 99 94 51 315
1996 315 128 38 -138 79 -55 -43 -109 54 41 151 184 -95 -7 58 -50 174 -68 -114 -172 62 130 125 -7 -137
2020 -137 -129 61 5 -62 27 -256 155 383 -85 127 -64 305 -144 2 -107 114 -29 -44 -52 72 110 -64 -161
2043 -161 13 86 99 -1 -241 -50 -166 48 61 74 0 167 11 133 -5 139 -46 -331 213 -107 146 -52
2065 -52 28 -167 -26 182 -27 -9 56 202 -76 46 156 -331 103 236 77 -58 -86 -211 140 27 -87 -56
2087 -56 72 -394 130 224 191 10 144 -75 -86 289 127 -128 315 141 22 345 71 -302 -62 -256 282
2108 282 -4 29 254 165 79 -206 -2 279 -185 -244 208 226 15 -66 -13 -3 70 -287 23 -168 53 -222 151
2131 151 118 18 -4 181 -152 297 14 -127 -131 139 -28 91 150 -51 195 246 -93 170 151 101 -45 -79 147
2154 147 113 -107 122 302 -115 3 -78 199 -106 20 -90 -116 -147 -34 -170 -53 -21 89 -126 -100 -263 -323
2176 -323 53 79 190 44 -236 11 -73 278 -48 114 -23 175 -317 -26 -103 1 -249 65 -130 38 200
2197 200 -246 -22 -141 84 99 123 -64 249 47 388 0 143 -138 39 -196 73 -301 -56 68 52 -46
2218 -46 -228 12 254 -55 223 137 -109 2 111 -143 -17 -59 -218 2 48 396 102 -308 261 47 38 -165
2240 -165 151 -44 -3 28 -76 21 207 295 -394 83 302 27 -18 173 -99 104 210 -73 -150 43 -307 163
2262 163 100 82 -112 -24 -189 148 -140 3 -103 87 -10 -34 -443 -233 -21 -74 -212 -60 -183 314 36 75
2284 75 67 73 -11 37 97 136 131 -41 -52 -384 220 -144 -132 203 -84 94 -172 -33 139 83 183 102 32 18 211 -26
2310 -26 146 140 214 81 6 -128 -98 -172 52 53 149 -309 -8 145 39 -87 -95 205 -24 -87 108 -253 -162 2 287
2335 287 68 -99 40 18 39 -200 92 -128 81 -113 93 103 80 262 -53 -56 28 5 37 123 -40 177 -105
2358 -105 29 132 -20 262 33 146 59 84 -33 -60 273 141 -114 20 -289 130 26 -173 -139 -82 328 35
2380 35 -4 -30 -38 -82 -26 -123 -160 118 -19 175 212 -344 202 46 -100 163 -49 -24 -5 159 -55 90 -150 -151 213
2405 213 90 -130 -38 0 -157 -114 71 -105 -112 -45 228 -21 158 -32 -397 183 -88 6 227 123 -55 79
2427 79 -73 249 -67 98 -313 -53 -178 108 43 -138 -147 -28 277 -62 -92 -171 -142 54 128 16 95 -28 86
2450 86 -122 -228 103 -136 120 293 117 138 125 -299 373 -159 -145 -10 -127 -155 -298 289 -246 88 133 23
2472 23 86 -410 -19 -146 184 231 -24 331 -5 111 37 133 7 81 -236 144 -275 76 0 -13 -45 78 -150
2495 -150 -39 173 2 -251 110 -226 372 39 -26 177 1 191 -210 -202 -209 159 53 -33 -21 -2 -232 14 -92
2518 -92 96 -55 -130 -34 145 -260 80 -260 327 111 313 -35 -241 -5 -171 -16 106 21 -65 -27 132 10
2540 10 173 173 -153 -11 -170 -42 272 -158 89 224 -132 331 22 -326 -328 93 3 1 -82 37 3 20 -194 -37
2564 -37 91 83 303 -106 -201 34 -36 -138 183 119 47 -280 -98 -142 -231 -35 206 193 -164 -12 83 12 85 -28
2588 -28 131 75 68 341 -77 313 14 -237 60 135 -228 -224 -148 53 -177 30 -84 -91 45 166 -25 -68 60 -36
2612 -36 -190 -81 -18 7 -107 -111 192 134 294 130 -258 54 -151 -39 -108 94 -69 105 246 -51 169 -198
2634 -198 -22 -110 191 186 211 80 -32 -88 215 75 -24 270 -129 154 -124 169 -33 -2 -43 178 8 -144 -56
2657 -56 -149 -379 118 -161 -72 -157 131 245 170 465 220 43 1 104 134 236 179 -85 -67 75 -171 269 -118
2680 -118 8 -113 18 170 -235 -54 158 -175 91 174 -176 135 92 -156 5 -79 342 16 -74 125 236
2701 236 -186 -251 -207 212 -143 127 115 -112 151 -72 269 -32 -51 -110 91 129 -46 -7 25 9 50 456 48
2724 48 -275 219 292 49 56 12 180 -56 294 -68 -284 37 -26 24 -92 83 -19 114 247 45 202 -358
2746 -358 90 47 -294 -12 58 -56 154 -25 83 -164 20 73 -122 -53 -29 -45 114 -108 -226 28 -333 52
2768 52 -97 200 119 -229 -193 5 -4 -7 295 -22 103 -149 -88 -133 -222 156 -35 83 203 247 -65 118 40 52
2792 52 372 233 172 -47 31 249 113 -224 -22 150 -46 77 102 -128 16 -185 -189 -152 94 54 172 53 -31
2815 -31 160 373 259 216 26 -182 -121 -57 -161 -49 93 -115 -120 -67 30 -10 310 -27 -105 -60 91 300 -44 80
2839 80 186 93 -80 -178 -224 -167 29 49 80 22 69 -56 67 80 -17 -19 -188 -231 -290 -136 56 49 159 33 -138 87
2865 87 -77 -58 66 99 -188 46 129 21 -194 107 15 120 -96 166 120 -48 195 162 -159 -242 162 -82 77
2888 77 -141 121 -130 -131 163 126 -112 -11 112 17 21 180 -337 -178 9 -71 -68 -125 3 177 183 19 -203 -105 -246
2913 -246 -35 -341 -120 145 122 -267 -149 24 -196 -95 -105 107 -147 -64 263 -24 -80 -76 -36 79 -98 44
2935 44 350 -169 -83 -131 -25 28 164 -65 94 -102 -261 -148 30 6 -43 -24 102 -124 186 -218 -223 176 -19
2958 -19 25 -403 173 -243 199 156 -106 -102 209 205 -28 76 -69 -390 -82 136 18 14 41 -195 -48 -145 53 63
2982 63 178 -1 -1 -5 98 197 88 -228 -184 -133 154 -202 -93 -44 -24 -257 -111 12 80 -36 168 -65 26 -178
3006 -178 234 43 197 37 113 104 83 -68 42 30 19 53 215 -31 -6 -113 -12 120 59 -129 -132 -87 -58 199
3030 199 -316 1 12 31 -132 -173 185 -72 43 -196 -73 244 -236 62 -245 9 -179 -39 6 246 114
3051 114 381 -9 339 -322 207 3 -203 13 -87 -39 -91 -4 -151 -94 26 -13 -138 93 57 28 -32 187 -228
3074 -228 -10 68 -181 195 -241 424 220 54 -220 -60 3 134 200 -187 24 -76 -158 -118 -56 74 -127 -203
3096 -203 246 -130 -111 47 31 -25 60 178 172 19 131 -84 41 -115 110 119 -29 170 -56 -80 -318 7 235
3119 235 -166 -114 284 153 -213 -268 -19 89 88 155 89 -131 8 183 20 137 194 -55 -155 273 -47 -189
3141 -189 67 345 -161 166 -70 235 108 162 6 -36 100 -27 -115 -27 170 -214 -23 114 -193 -254 -49 -115
3163 -115 -68 11 -242 -308 -81 -84 -172 78 -136 -280 -115 -23 181 -87 195 12 125 124 60 -256 -26 -119 155 96
3187 96 -241 -112 -62 38 -132 108 296 -156 -169 110 21 -43 -90 112 59 -191 -101 -35 100 -201 91 43 111 -25
3211 -25 39 46 130 70 -49 49 2 75 76 287 158 116 -62 131 136 25 111 -84 242 121 24 -15 -41 179 41 160
3237 160 169 -43 82 -266 8 146 -38 2 44 11 -130 54 -35 -168 -27 141 134 230 102 134 18 -137 -221 -37
3261 -37 73 7 56 -264 -131 -10 -54 -275 -33 466 -311 9 -18 -84 336 -240 -74 34 110 71 -25 -20 16 -301
3285 -301 63 134 99 -30 107 22 -56 256 -115 -263 9 34 243 197 -161 -139 -190 144 50 -141 -85 -54 -127 55
3309 55 -66 -46 -128 -237 69 -32 -12 38 71 -14 -121 -148 -180 -145 46 123 -69 -148 -46 -56 47 336 136 -72
3333 -72 -171 -387 -62 84 62 1 256 19 -297 -285 111 -124 -202 -83 -106 147 -221 106 -152 -123 147 -50 46
3356 46 37 -242 -131 -36 -261 -52 -25 -51 55 -8 53 36 -65 62 -298 -83 30 335 2 309 34 -4 -211
3379 -211 -8 -49 -117 89 61 78 -38 -177 -16 -60 -92 82 -176 -144 16 -31 -106 135 -125 -217 -62 -101 186 -56
3403 -56 68 -5 238 76 -117 -129 -175 -16 91 9 117 131 -48 -64 -364 -27 -148 -50 94 -40 -53 169 66
3426 66 110 -54 216 0 -25 37 56 89 138 10 -52 -210 -314 71 39 42 202 393 122 236 153 228 -19 141
3450 141 -278 -259 39 -54 196 20 4 135 -15 -18 124 347 130 40 -334 -64 53 -145 34 -189 -23 222
3472 222 -149 26 7 -100 -38 267 94 58 -40 59 0 -53 -200 89 156 140 294 154 -40 -76 176 60 -72
3495 -72 -234 42 -112 76 139 173 198 -76 94 -122 144 112 51 89 240 118 20 -24 -92 -235 107 154 -74 122
3519 122 -230 81 -142 -4 193 -173 -87 -144 117 113 -25 50 28 -71 -149 -84 87 14 -194 319 -89 -87 44 -4
3543 -4 108 -126 -157 -77 28 76 -148 42 -101 359 -133 21 83 51 117 -80 17 -58 -255 -237 110 21 134 -107
3567 -107 14 146 -213 141 62 -187 -11 105 34 100 41 -24 61 -39 101 -2 306 -38 132 -271 -225 -37
3589 -37 111 145 63 285 -137 -101 1 -91 153 -69 -294 -12 185 -24 28 4 -35 11 -53 11 216 20 11 53 85
3614 85 -282 12 1 59 293 216 169 -253 5 87 -388 -5 424 -21 44 122 -366 71 -8 -14 164 66 117 -181
3638 -181 -197 109 -47 68 -18 -313 0 66 20 -133 -39 -31 -418 -1 -137 -14 -132 82 -175 -192 131 108 72
3661 72 379 -222 -175 49 42 -54 41 -1 -109 -176 14 -44 -107 -99 132 -36 -213 -79 247 8 248 30 26 161 -68
3686 -68 143 -146 -176 29 -1 15 148 -37 79 -27 -43 -151 227 15 63 271 -28 -374 22 -106 212 -132
3708 -132 139 218 -34 128 -175 109 -77 30 83 190 -74 -144 147 53 -375 -41 -192 -23 120 156 45 265
3730 265 -264 -117 -231 -30 203 -139 136 -23 -15 69 -178 -195 165 268 -60 -174 8 -104 -17 -181 42 -55
3752 -55 -126 -198 -106 27 83 -110 -189 59 51 137 74 37 34 72 -249 51 89 -153 234 -102 92 83 13 -144 279 60
3778 60 106 17 -50 110 -155 32 -200 163 -211 -57 5 123 -309 117 278 -24 122 -14 -164 51 187 -13
3800 -13 66 -167 -34 210 -72 142 152 82 -56 34 -35 -119 -240 103 86 61 -111 -139 253 -212 -98 17 161
3823 161 -3 -116 -310 10 -51 -66 -74 51 163 -18 -116 74 200 -413 -233 -379 -22 -111 -7 7 241 76
3845 76 -201 -139 -57 94 253 211 -161 -31 294 62 -100 107 50 -245 55 194 89 183 -259 -11 126 267
3867 267 -133 -23 48 -260 -7 164 184 31 202 -65 183 124 391 81 166 -105 93 -17 -219 57 81 -414
3889 -414 124 -35 -176 35 211 -154 -78 134 173 36 -10 60 7 371 77 -9 -5 14 -40 -140 85 19 -195 -95
3913 -95 272 -57 58 -96 -185 -48 -48 -24 86 -56 -92 -28 -102 -63 -61 79 31 -30 -162 44 20 -218 -229 -49 96
3938 96 -24 88 59 81 96 -4 -6 13 -117 -46 -107 46 -100 -50 149 26 -139 246 -134 -6 -4 114 -22 -48
3962 -48 -81 143 -8 -178 -105 104 319 -123 153 -116 101 -96 -204 -139 -211 163 -135 -129 -100 -45 -110 -5 -114
3985 -114 6 225 -127 -79 96 178 -67 31 -19 -26 151 -151 -239 -103 -68 142 -144 35 196 -61 -14 74 151 -31
4009 -31 4 37 -265 -61 -101 -210 29 75 -9 -78 -15 60 63 185 -55 58 -94 -193 -78 -85 -269 138 149 157 -120 32
4035 32 204 -76 71 210 -65 59 -46 194 -120 15 34 4 -186 -130 -144 -174 -235 -150 211 -38 42 -5 -96 -142
4059 -142 291 -3 9 -4 -85 -207 63 150 119 146 15 298 47 -122 48 -171 -195 151 -192 154 184 132 262
4082 262 87 -163 -109 -124 95 0 -192 16 211 79 -58 54 7 -98 -187 -10 -63 -81 42 -145 157 -95
4104 -95 -137 13 82 137 119 -100 -80 22 -321 -36 -382 54 114 -55 27 357 228 117 -176 -45 -66 35 -132
4127 -132 236 303 -1 -130 -1 50 64 -20 126 63 -25 -91 -46 50 82 -26 -323 9 -1 92 150 -35 276 164
4151 164 -53 -46 -5 -26 156 -319 -91 99 -139 -260 42 -60 -140 8 236 102 39 -3 110 95 -169 -206 -14
4174 -14 208 -39 52 -120 5 -190 -174 -128 144 53 22 -13 -13 350 60 22 -167 166 -86 231 106 -113 -109 26
4198 26 228 5 136 114 132 105 11 -135 27 -219 169 178 -102 -88 165 18 11 259 -33 79 -90 44 12 -58
4222 -58 -291 129 29 5 25 -152 -117 -151 76 24 48 7 77 183 -205 -42 121 58 16 -143 381 59 55 -196
4246 -196 20 125 -234 211 315 123 44 126 8 132 132 -123 221 267 262 53 -32 -50 296 -67 -138 -57 -153 388
4270 388 -114 -103 178 39 -171 60 181 20 119 -109 119 52 66 -5 -85 -210 -46 -55 -48 129 13 -26 -87 -99
4294 -99 43 42 -79 -289 117 -273 -93 265 -298 38 -74 86 402 -147 37 83 -141 -95 -158 30 206 1
4316 1 149 -231 -156 95 -124 99 22 67 -194 -155 229 -159 -131 -61 -334 -65 2 -154 299 106 55 40 248 147
4340 147 -86 30 14 -121 -221 -26 -103 148 79 175 -155 131 -2 11 -36 120 -128 136 -253 175 -143 191
4362 191 -120 132 -309 -23 -193 26 31 16 -165 -97 -32 -18 -150 -166 -58 -101 -16 85 26 -70 -29 -194 291 -96
4386 -96 -20 28 -197 230 -154 -79 -70 -121 54 -152 18 12 -124 -93 -439 -191 42 -224 -167 138 170 -4 11 -264
4410 -264 146 204 201 112 268 109 -22 140 50 151 212 -113 195 -1 76 38 -33 196 422 -19 -67 -165 -216 -125
4434 -125 246 65 -111 -115 -50 400 -68 162 -109 183 -308 110 -76 -3 187 219 5 -185 -6 -190 -2 13
4456 13 -131 297 7 -33 65 -35 76 69 -200 58 79 -92 97 63 199 -32 -41 34 -296 212 208 -228 103 -15
4480 -15 71 -316 -193 -141 -97 -190 -169 -122 -46 25 -8 27 -32 126 63 -273 -34 -61 -209 37 44 -17 268 116 286 -196
4506 -196 66 29 -236 12 -36 -140 9 119 -49 -1 -61 28 -28 106 215 166 111 -96 -138 -176 269 110 340
4529 340 -62 11 -48 -183 15 190 -175 65 20 -297 384 -69 -278 -25 -196 -185 -326 91 -163 -24 41 -59
4551 -59 98 -34 -238 79 -114 -113 -64 -87 88 -161 74 263 -32 -29 -81 68 77 164 38 -1 -36 -117 -133 88 -13
4576 -13 539 13 -55 241 8 23 -216 -40 126 137 106 91 40 -184 170 -174 -157 41 42 292 -88 5 130 160
4600 160 -105 160 -48 313 -187 316 -48 -345 -321 -39 238 19 -153 218 -140 -180 -180 118 -264 -9 -236
4621 -236 98 -95 17 47 -47 89 57 94 117 -32 95 -143 117 -50 100 -2 -12 193 127 125 -52 -112 -53 8
4645 8 155 -6 48 -23 259 25 -308 -118 202 -90 -69 193 145 10 85 4 -170 -224 -6 -36 -11 248 -121 -46
4669 -46 -125 128 -184 -56 -50 -108 -90 -133 -8 -140 -150 207 97 -19 -229 -33 -86 0 18 -106 -54 177 161 -33
4693 -33 26 87 234 -170 -56 376 -16 -15 35 -8 -26 -25 -113 -350 -85 -87 66 -15 -184 169 -172 34 -74 -23 70
4718 70 86 92 -13 -107 -149 356 8 147 -141 146 -87 -403 37 -105 -36 279 -57 -247 -336 -48 -66 160 38
4741 38 33 -17 -246 2 54 -18 -66 -53 -24 171 -128 32 -117 -18 113 -161 -330 7 -113 -36 112 65 120 141 38
4766 38 -141 -147 -96 202 -37 -33 111 52 10 6 -195 -39 43 -117 -25 -8 -106 67 7 -115 -112 94 57 26 -164 198
4792 198 -230 112 -95 232 -218 50 76 62 -135 22 -88 340 -205 -190 85 49 73 226 -53 -29 32 170
4814 170 195 41 -63 -336 18 213 -318 43 135 112 -91 -103 111 -346 -101 -13 -165 -86 -37 167 -48 -84 -23
4837 -23 269 142 -294 35 212 287 117 25 -340 234 -102 -37 -2 -75 -126 -110 -49 -115 10 -97 -69 -11 42 -109
4861 -109 -13 -126 -355 -153 -86 33 199 -14 126 27 -44 -41 -75 -192 5 -143 -83 -200 162 -198 67 -110 111
4884 111 -49 -202 -188 46 294 112 -150 92 -7 64 31 164 -25 -73 -161 -150 165 133 -141 -29 -305 -40 -57
4907 -57 -95 -297 160 150 -101 252 -205 -94 -202 -92 -187 -253 110 -181 -19 182 -46 -112 81 -245 89 68
4929 68 -281 -48 -6 143 70 125 -106 -101 -338 -49 -117 -49 -237 -190 143 117 -51 -4 111 -159 32 -142 123 -138
4953 -138 20 98 135 -57 -148 -261 43 -104 94 205 2 179 -304 160 117 -46 196 -5 -274 79 117 80
4975 80 89 -52 -101 -194 93 -162 -70 -79 -149 -196 100 148 145 -114 -270 -113 -132 -116 -77 -33 210 -195 49 142 -294 -8
5001 -8 -47 -143 -49 -61 -143 -16 65 -96 -131 -83 -110 123 -190 -120 -231 154 115 208 229 265 -102 -18 -300 -59 126 -50
5027 -50 55 153 -254 -50 5 45 -162 -32 21 68 173 36 -185 -104 -146 -200 -24 -150 207 35 -61 210 41
5050 41 -290 -344 -133 186 -47 104 -45 202 97 219 -196 -118 -181 -23 220 157 -249 249 254 -74 -207 -179 -26
5073 -26 -34 -207 138 -15 -124 258 172 -117 91 -320 88 129 -75 -319 -27 153 335 -173 -96 -172 -183 99 200
5096 200 145 17 199 -54 139 151 -42 -137 207 67 109 110 -105 217 176 -3 10 27 34 16 44 -81 63 21 -100
5121 -100 -67 173 -85 -353 12 270 -219 -79 210 174 -63 -52 -29 -155 85 -20 118 -215 51 -349 -55
5142 -55 330 134 216 -213 -30 -26 -6 -212 74 -75 162 -322 10 -63 146 -17 51 195 -204 -27 30 -133 48
5165 48 -44 -128 -183 -110 79 50 -139 125 -6 -233 -76 -188 -135 128 35 172 241 6 105 -102 -150 154 -224 243
5189 243 68 45 -52 173 51 38 -234 245 35 -225 227 72 313 97 145 -54 56 186 58 166 88 -8
5211 -8 20 31 -115 -12 -49 14 44 -137 -161 78 -115 -358 -118 55 -122 -247 -10 -67 173 -128 -122 -275 94 -126
5235 -126 -117 -199 -101 58 -46 -122 247 -42 -22 185 111 -124 237 -150 -12 -12 -86 -2 84 -172 248 -28 122 -14
5259 -14 106 155 150 -13 53 -273 -146 -31 176 -67 107 -11 -4 96 37 -42 -150 46 235 50 164 107 225
5282 225 168 483 -30 -143 17 -34 -190 -81 -150 -6 -77 101 -4 54 24 72 45 -44 -19 90 -151 8 176
5305 176 99 -291 -102 -42 136 -73 26 -329 51 245 -62 -18 -97 52 55 72 -100 16 -130 -101 -48 61 122 64
5329 64 76 55 -179 -87 -167 38 99 -34 221 53 -223 -214 195 -136 165 -24 -180 -204 -12 2 -244 -39 -142
5352 -142 25 73 -23 102 13 59 24 -247 207 -5 205 232 19 125 -486 -177 -175 112 157 219 -201 -159 -144 13
5376 13 219 141 4 -44 -75 123 -127 25 -98 -25 247 -47 64 134 -361 -82 -239 22 -6 -137 147 38
5398 38 39 5 -9 -255 144 -61 43 6 -66 190 -168 166 164 -61 5 -13 -19 -26 19 -97 -21 -36 265 24 90 138 -113
5425 -113 249 -74 -230 -60 80 -22 -266 -155 -112 -145 148 -208 98 -4 170 -39 -294 271 245 171 -178
5446 -178 243 -69 142 122 54 30 -45 -90 204 -6 81 -96 36 89 50 294 255 6 -235 -44 -71 -238 -199 -53
5470 -53 -166 85 -126 118 13 -27 276 183 -31 -26 -49 109 -48 148 200 -8 -150 169 115 -127 255 -39 -1
5493 -1 -30 44 198 144 -63 -121 -159 -149 -387 0 -92 -46 -64 -165 13 20 305 1 228 221 115 6 178 -93 -3
5518 -3 29 3 -158 -66 32 81 -214 86 -190 14 31 30 29 -232 -129 60 -13 -133 100 29 34 -85 9 268 71 -5
5544 -5 -93 -36 -399 -97 -59 1 197 76 -71 -112 159 37 204 -47 86 196 185 -183 -135 -72 46 243 -106
5567 -106 50 144 -126 209 121 -83 4 221 -113 193 103 -154 66 -123 -311 235 9 -93 196 -18 192
5588 192 -48 -95 -137 -188 69 -120 169 -64 43 -127 -129 129 146 224 27 -131 93 32 -130 53 32 229 74
5611 74 170 2 -83 312 112 60 57 -245 -56 -98 -246 -139 146 -42 227 -144 80 -185 171 -297 -180 254
5633 254 -16 -208 -65 253 -124 -229 50 172 -251 10 -60 -79 54 53 99 -33 157 4 -52 8 196 79
5655 79 -136 108 -232 19 21 189 257 50 214 86 78 -89 -192 -205 -24 -115 203 310 -162 109 -23 -4 189
5678 189 -27 -71 -245 -64 -296 -132 -145 37 33 174 29 -1 95 -44 -67 70 -78 22 278 179 105 19 53 -188
5702 -188 -13 -72 -61 103 33 54 -27 204 109 -60 -206 16 7 82 -104 219 210 -52 152 -147 -85 -112 109 29 161
5727 161 422 169 193 -96 242 146 -328 -146 82 -6 38 -150 -169 269 177 -61 201 94 123 140 -18 131 121
5750 121 -57 68 -22 130 -116 -101 -99 248 206 -175 -30 206 214 -188 -130 -231 -124 16 -189 77 -37 162 41
5773 41 -187 -162 31 -152 -148 -40 54 -87 -208 -104 35 -50 197 -15 14 254 -2 -100 32 176 119 15 70
5796 70 126 -24 -165 73 210 -5 60 116 -91 103 -216 -22 -3 217 16 195 -40 27 -94 -300 -136 -1
5818 -1 -257 -29 259 -50 63 -23 12 -8 -29 65 60 -12 -39 131 -56 183 -147 446 141 66 68 106 -141 -276 -200
5843 -200 15 32 -6 -380 274 157 -72 206 119 79 133 -40 12 -173 -160 -120 56 -135 -83 -143 -18 -183 127
5866 127 -29 -133 113 -199 12 365 167 88 36 73 29 -65 186 -292 -43 -117 -193 11 -114 -164 70 110 -49
5889 -49 -279 -190 -250 -212 -192 -35 -65 -172 94 151 113 -71 -149 -276 120 -133 172 -23 -26 -5 -98 65 -208 -8
5913 -8 -99 -44 -99 0 -123 -11 60 189 -321 -196 -140 218 -90 26 185 -90 85 -27 316 120 46 -44 -57 -223
5937 -223 87 -44 72 -28 -56 -65 -30 -48 17 106 -70 154 88 48 -149 30 39 217 117 -293 -72 165 -50 211
5961 211 -49 -169 -120 166 -51 124 -70 -49 -67 218 -113 207 -82 247 -5 -34 252 -105 -150 -1 92 -61
5983 -61 -239 204 -64 65 45 53 -37 -19 68 -124 -39 15 -131 -234 -54 132 64 -138 175 164 -181 -98 160 -173
6007 -173 -89 218 -48 69 0 -8 -275 -293 176 188 -110 -190 73 -242 -92 -311 76 115 -38 -193 87 -29 -13
6030 -13 -389 -72 -52 -6 175 41 52 22 -86 -132 140 1 -137 39 154 85 -159 49 -54 26 225 -100 263
6053 263 27 -201 90 199 2 -30 14 150 -69 -149 -32 -46 230 86 300 -275 -18 68 41 -124 -75 184
6075 184 117 111 203 -49 -27 119 -52 27 122 -8 341 238 -84 -71 -227 164 42 -17 87 -44 -189 -104 133
6098 133 11 183 -322 -230 22 -93 -37 -232 -110 179 100 -63 -205 -95 244 -32 7 122 -79 135 98 252
6120 252 -59 145 269 -55 118 -124 83 68 -73 171 -336 325 185 160 -106 -105 52 318 293 133 183 180 460
6143 460 -149 63 -133 7 -346 247 -186 -21 -6 153 -61 -266 267 -95 331 133 -132 -23 -4 57 11
6164 11 248 185 -286 -52 276 84 615 62 -82 86 144 150 6 114 -403 -8 -159 217 -153 121 -261 132
6186 132 -57 58 263 -18 77 -34 -235 228 132 123 234 -127 -171 -43 22 147 -247 -138 251 48 62 -309
6208 -309 237 -17 269 -256 185 17 19 -101 -18 8 -54 -95 -48 -54 -60 -173 51 -98 -107 14 -56 -74 -186 -142 186
6233 186 -73 -250 69 29 119 -17 64 -246 69 54 -2 -169 108 208 -64 128 161 -73 55 203 311 397
6255 397 178 -290 83 191 5 -52 -126 150 39 -152 39 -331 13 -52 -96 54 -9 -73 123 66 57 -48 -180
6278 -180 174 -29 4 -321 63 241 -78 159 109 241 0 -48 24 -54 -175 180 -248 -221 -243 421 -142 -381
6300 -381 108 -209 -115 -31 144 -8 82 227 142 146 77 69 92 -129 129 -109 -377 84 -72 186 43 -86 -216
6323 -216 159 115 46 212 -136 170 240 -96 114 30 -5 -196 56 95 -176 -168 209 85 53 -174 -228 76 -52
6346 -52 -159 -20 75 -221 -7 -31 -339 -57 -43 -131 -140 164 106 352 -90 125 -242 -117 31 -37 252 66 -25
6369 -25 19 -101 -157 -148 60 72 -155 -43 137 -125 118 -192 -348 -93 162 122 51 -70 186 -37 -190 -55 -119
6392 -119 9 83 125 21 -176 85 -133 -129 56 270 79 -245 -7 -55 29 -170 -51 188 54 100 120 -338 -86
6415 -86 -77 249 -151 -65 366 38 -150 -97 223 -31 61 241 357 -165 -223 -210 166 -73 -76 -86 -100 -206 332 136
6439 136 13 319 95 -2 -4 45 15 -27 -127 157 -16 -97 -273 -144 -82 -20 93 103 37 -77 -191 67 -6 16
6463 16 -26 -8 6 55 -114 32 325 118 60 237 90 -155 -13 58 -96 172 327 -228 89 -139 238 160 -16
6486 -16 -167 154 -65 -73 -21 140 262 143 -67 76 -184 -21 65 14 65 78 -3 -220 94 -5 12 109 -353 30
6510 30 -86 4 38 -167 19 -56 -246 130 355 233 -34 21 -142 131 220 136 164 -271 -15 124 47 -4 100
6533 100 -15 86 -181 98 -66 -145 66 3 153 157 -202 -248 -87 143 95 147 57 -61 197 239 95 34 39 121
6557 121 -102 -83 310 187 -176 60 -283 155 -108 -39 78 150 62 121 215 -45 -88 -132 96 -131 30 253 155
6580 155 -251 -9 42 38 -60 -15 181 -3 -115 171 -65 112 -50 40 -41 8 7 282 -471 -66 -30 -124 -213 0
6604 0 -159 -8 -40 -93 -5 171 -118 -56 225 -45 -258 85 44 174 -102 209 -126 -88 161 -95 72 -80 27
6627 27 -133 -15 -3 131 -5 -66 -161 233 232 37 -19 -77 -10 -45 -114 -64 46 76 -181 218 -89 -129 -83 67 -133
6652 -133 39 78 22 -150 -24 107 141 -76 -255 -155 -193 -62 -230 -148 -98 -71 -10 -25 -43 131 325 -100 -97 -281
6676 -281 88 -122 -96 -48 -305 63 106 -6 -14 -78 -68 -263 65 -114 -176 52 -66 194 264 26 -175 124 -34
6699 -34 81 168 189 -150 -24 353 -89 31 -140 142 17 -108 -9 -326 -158 158 -139 131 8 91 -113 102
6721 102 -89 144 163 21 29 -141 113 74 359 -125 36 -116 -218 -390 -195 -58 -173 88 55 18 -76 -21 -160
6744 -160 -55 -145 -71 63 147 110 8 -48 16 -4 -27 99 11 51 -29 -71 23 -96 -103 70 19 -69 44 82 11 -166
6770 -166 -23 137 -19 -15 68 -48 -179 -11 -63 -134 275 -86 -41 43 30 108 -59 48 -109 -105 9 -1 135 97
6794 97 -62 187 -85 2 18 -77 53 -84 -253 168 -277 -77 -259 -89 -39 261 -38 -108 -49 52 -181 20
6816 20 -90 -55 -79 -111 -53 27 -17 -12 -148 -141 173 84 -48 -17 42 -231 217 -5 -99 127 10 56 145 171 210 31
6842 31 -183 40 45 170 27 -76 123 101 43 -169 107 93 -52 -80 -203 18 -120 -198 72 -180 -102 -40 -40 290
6866 290 -99 -164 225 175 91 -113 97 -82 -80 -105 88 -83 230 -72 233 125 187 -109 -210 -12 -7 174 67
6889 67 -77 -181 66 -15 42 -148 -120 26 113 88 34 -134 -126 -258 -50 -148 15 -168 207 160 201 -211 -77 278
6913 278 59 92 -56 -109 -27 -56 28 -226 -157 -190 -43 69 128 -43 145 -42 22 -110 102 85 284 -84 -33 -235
6937 -235 -56 174 -94 -126 -81 99 52 -3 10 61 11 -54 0 77 321 -133 65 118 -40 116 116 87 233 12 -139
6962 -139 -25 141 106 -58 -32 -170 -137 69 -192 91 229 -58 -30 -103 -143 159 -25 121 47 52 -9 -32 -55 179
6986 179 -11 -76 29 94 -312 283 283 -106 169 168 -29 -8 5 54 174 -30 -219 18 8 -111 -148 94 187 96
7010 96 317 -96 -168 -113 -79 104 -181 91 -15 1 167 -93 -158 -168 101 -62 85 71 -57 -43 -83 -9 -103 -108 -9
7035 -9 71 14 -9 119 -252 -177 -103 63 133 39 46 -91 137 158 -122 -173 4 -413 -334 -20 -53 72 9 232 -31
7060 -31 51 208 97 -15 -72 137 32 -97 166 -101 -112 46 23 -55 -111 -88 -13 21 -69 -223 65 -105 400 33
7084 33 -108 19 154 226 10 -65 -207 173 170 192 53 -105 -129 -230 -50 235 35 -76 20 -146 121 -126 -110
7107 -110 -76 181 -60 221 -297 160 200 173 30 84 -125 101 -56 -259 -292 38 -27 -68 55 -68 209 147 31
7130 31 -85 -38 -43 107 -7 7 -66 76 72 120 -241 32 -134 22 239 37 67 -185 -32 -30 50 -120 -144 203 48
7155 48 -20 -126 -180 -57 6 -176 9 -2 -233 -162 -284 -67 226 -36 293 279 10 -177 145 -14 -69 60 -6
7178 -6 257 -28 -173 190 23 102 186 197 142 -238 -223 237 103 45 30 150 340 -342 -53 -88 71 142 -63 -304
7202 -304 51 -312 223 194 1 -90 -26 80 -12 401 144 -108 -7 119 -34 118 69 -142 33 -39 36 -218
7224 -218 -135 -110 37 -32 -187 146 -66 -206 -29 -33 213 -204 308 159 211 81 63 -52 54 -29 105 82 -9
7247 -9 76 -75 -20 1 142 -121 203 -97 78 -203 -217 115 -235 249 256 374 4 116 -107 195 153 137 141 105
7271 105 95 -24 225 -116 249 -87 111 -48 -151 -28 -25 -144 -200 69 147 6 -167 32 14 8 178 -202 223
7294 223 -169 -149 -7 -177 -70 36 -44 -71 -62 35 -98 -29 167 -16 -317 -250 -39 167 123 -19 -210 -20 55
7317 55 -60 22 5 53 192 57 -82 49 -97 73 32 -176 264 -84 0 27 146 -5 -75 213 151 97 -10
7340 -10 -234 -198 -109 -111 47 -11 37 -7 18 174 81 -127 31 -151 -220 58 71 -41 58 143 -45 -3 89 184 75 4
7366 4 402 70 79 222 -18 87 -252 44 55 -117 -6 -44 21 -53 113 7 48 14 -516 292 71 -112 197
7389 197 -214 -277 -97 29 -8 24 -19 -172 -175 -258 31 71 81 75 26 246 292 -27 94 2 -74 229 -74 7 -27 157
7415 157 86 239 14 -119 -67 179 61 -43 -167 49 -77 -120 -60 72 -232 -93 365 38 136 -55 -115 322
7437 322 33 41 99 -12 -42 -145 14 -89 -17 -446 -107 -56 -312 84 -9 83 7 9 -99 -56 -126 289 -64 19 -96
7462 -96 -60 -9 -138 74 109 62 -255 -85 -170 18 42 179 249 -54 -31 38 -94 156 19 -180 46 -44 85 -215
7486 -215 51 19 33 -96 98 -426 -144 206 -110 -101 0 -144 235 61 -26 -5 315 -35 3 113 -4 -80 140
7509 140 255 -417 127 63 -30 96 -294 -144 134 244 -63 191 111 -99 340 176 291 237 46 -162 -24
7530 -24 46 -2 -102 85 -220 157 -24 16 20 -45 47 83 350 -173 -11 -204 -52 -158 -224 133 -113 -153 -12 -231
7554 -231 -181 109 59 126 -15 24 18 -181 -212 -32 208 -53 -193 -55 -121 344 -25 -259 -124 -114 -31 -8 -45 -84
7578 -84 -165 159 200 -193 -82 -18 60 185 8 -9 -21 214 109 -209 56 -58 -97 81 22 17 80 -144 58 128
7602 128 99 39 -293 -42 93 42 -33 292 59 82 37 138 119 -61 -126 -43 205 -189 107 257 -204 80 -205
7625 -205 -120 -182 222 -24 129 182 -52 203 -103 -48 -205 -151 112 282 67 -227 176 142 -51 -160 -329 -84
7647 -84 25 -13 -150 -42 -179 -42 -218 -158 121 260 -94 -239 314 -215 77 -95 180 321 113 -169 76
7668 76 -143 162 -48 -137 127 31 -47 115 208 127 113 157 -25 363 -275 -120 -135 59 -106 -65 140 -197 -298
7691 -298 141 182 -312 -129 2 -70 166 12 -80 142 219 74 39 202 -218 46 -31 36 -85 -49 61 281 -15
7714 -15 73 -130 -46 52 89 91 -282 97 -131 -372 6 137 206 4 91 -32 -134 -23 92 178 40 119 -15 -51
7738 -51 -112 -31 -5 -40 108 -35 -133 100 8 -116 -91 -263 -105 319 17 89 7 324 110 -199 -241 -50 -140 128
7762 128 61 46 180 -111 -229 169 139 61 122 -63 115 -105 120 18 -165 18 -73 -30 268 -47 -13 -52 -37
7785 -37 -128 -85 -85 48 21 251 80 -41 -16 -138 164 -130 151 -20 -212 -42 176 81 -293 211 356 106 90
7808 90 -171 -241 -284 8 76 192 70 104 112 -37 -85 224 -193 61 -50 273 96 93 266 98 -27 82 119 117
7832 117 -87 27 -48 40 -13 -17 106 18 70 271 -316 98 -214 -12 66 62 -68 41 272 14 169 26 -184
7855 -184 -197 -31 -24 232 -100 350 -62 -133 186 215 158 -279 274 4 10 122 -62 -211 -89 -128 -146 356 -80
7878 -80 -228 0 33 152 31 35 13 77 57 -71 235 96 -285 -13 -54 115 148 -118 -82 97 -93 -39 -97 160
7902 160 286 -74 169 -31 -302 38 27 -158 -8 -137 310 -40 -92 -101 -10 -93 -25 89 -4 85 17 305 -25
7925 -25 -195 -220 143 13 -75 59 55 -65 126 -170 -109 136 -74 70 48 -75 28 -30 -88 -97 95 63 -38 29
7949 29 177 104 -166 -8 116 -109 -130 -15 -48 55 104 137 7 -103 -30 24 149 64 86 175 232 121 -9 -272
7973 -272 -134 -109 -245 -28 -30 220 157 252 -14 -161 -20 -143 202 80 304 -262 -200 225 -314 3 101 44 -226
7996 -226 48 41 -18 33 17 -124 -257 -73 -41 -127 -253 47 445 -133 113 -40 190 -95 -58 -16 4 55 -143 -28
8020 -28 16 -43 223 -97 -150 -87 242 -55 40 -53 126 184 -84 -106 161 -47 -54 151 188 -88 -191 217 38 -145
8044 -145 154 -207 -145 -26 -21 -146 -146 11 -53 42 46 11 42 -19 -163 268 -142 -42 19 -276 -54 42 52 -122 31
8069 31 -21 60 -184 -52 218 -171 179 -29 -68 -2 5 102 57 -90 65 17 46 -19 272 19 -127 -12 -11 -18 44 -72
8095 -72 55 -124 -241 -70 32 89 -216 115 -142 -80 194 -199 2 -364 -134 61 22 78 136 38 208 26
8117 26 -8 -153 78 57 137 99 157 124 -71 216 -15 -27 256 -170 -79 -165 126 149 -29 168 -110 39 10 -193
8141 -193 -264 258 69 46 -346 138 3 240 110 -38 -130 40 137 281 75 236 19 -155 -131 173 62 -156
8163 -156 154 -129 123 80 333 85 -11 167 -12 -228 -48 -15 -42 26 158 -230 -35 13 60 14 -98 71 74
8186 74 -187 123 -9 -86 228
8191B28
##END NTUPLES=NMR FID
##END=
