##TITLE=1H_DE-93K2_TFA
 200.13MHz, CDCl3,
 8 sc
 
 9.6.2025
##JCAMPDX= 6.0         $$ Bruker NMR JCAMP-DX V2.0
##DATA TYPE= NMR FID
##DATA CLASS= NTUPLES
##ORIGIN= UXNMR, Bruker Analytische Messtechnik GmbH
##OWNER= pz
$$ XWIN-NMR		Version 3.5
$$ Mon Jun  9 14:17:11 2025 Russian Standard Time (UT+4h)  she@DPX200
##.OBSERVE FREQUENCY= 200.1313
##.OBSERVE NUCLEUS= ^1H
##.DELAY= (6, 6)
##.ACQUISITION MODE= SIMULTANEOUS
##.ACQUISITION SCHEME= undefined
##.AVERAGES= 8
##.DIGITISER RES= 18
##SPECTROMETER/DATA SYSTEM= spect
##.PULSE SEQUENCE= zg30
##.SOLVENT NAME= CDCl3
##.SHIFT REFERENCE= (INTERNAL, CDCl3, 0, 14.3821)
##AUDIT TRAIL= $$ (NUMBER, WHEN, WHO, WHERE, WHAT)
$$ ##TITLE= Audit trail, XWIN-NMR		Version 3.5
$$ ##JCAMPDX= 5.01
$$ ##ORIGIN= Bruker BioSpin GmbH
$$ ##OWNER= she
$$ F:/spectra/data/she/nmr/H-C/1/audita.txt
$$ ##AUDIT TRAIL=  $$ (NUMBER, WHEN, WHO, WHERE, WHAT)
(   1,<2025-06-09 14:15:56.59 +0400>,<she>,<DPX200>,
      <created by zg, POWCHK disabled, PULCHK disabled
       configuration hash MD5:
       00 E9 B6 7A A2 85 ED C7 34 08 36 98 17 FE 4E 26
       data hash MD5: 16K
       7A 78 88 6A DF EB 68 05 88 37 82 91 EE 38 81 61>)
$$ ##END=
$$ 
$$ hash MD5
$$ 4A 11 1E 52 2D C7 A2 3F 01 88 BC A7 89 9C 67 8A
##$RELAX= 
##$RELAX= 
##$RELAX= 
##$RELAX= 
##$RELAX= 
##$RELAX= 
$$ Bruker specific parameters
$$ --------------------------
##$DU= <F:/spectra>
##$EXPNO= 1
##$NAME= <H-C>
##$PROCNO= 1
##$TYPE= <nmr>
##$USER= <she>
##$AMP= (0..31)
100 100 100 100 100 100 100 100 100 100 100 100 100 100 100 100 100 100 
100 100 100 100 100 100 100 100 100 100 100 100 100 100 
##$AQSEQ= 0
##$AQ_mod= 1
##$AUNM= <au_zg>
##$AUTOPOS= <>
##$BF1= 200.13
##$BF2= 200.13
##$BF3= 200.13
##$BF4= 200.13
##$BF5= 200.13
##$BF6= 200.13
##$BF7= 200.13
##$BF8= 200.13
##$BYTORDA= 1
##$CFDGTYP= 0
##$CFRGTYP= 5
##$CHEMSTR= <none>
##$CNST= (0..31)
1 1 145 1 1 1 1 1 1 1 1 1 1 1 1 1 1 1 1 1 1 1 1 1 1 1 1 1 1 1 1 1 
##$CPDPRG= <>
##$CPDPRG1= <>
##$CPDPRG2= <>
##$CPDPRG3= <>
##$CPDPRG4= <mlev>
##$CPDPRG5= <mlev>
##$CPDPRG6= <mlev>
##$CPDPRG7= <mlev>
##$CPDPRG8= <mlev>
##$CPDPRGB= <>
##$CPDPRGT= <>
##$D= (0..31)
0 0.7 0 0 0 0 0 0 0 0 0 0.03 0 0 0 0 0 0 0 0 0 0 0 0 0 0 0 0 0 0 0 0 
##$DATE= 1749464156
##$DBL= (0..7)
120 120 120 120 120 120 120 120 
##$DBP= (0..7)
150 150 150 150 150 150 150 150 
##$DBP07= 0
##$DBPNAM0= <>
##$DBPNAM1= <>
##$DBPNAM2= <>
##$DBPNAM3= <>
##$DBPNAM4= <>
##$DBPNAM5= <>
##$DBPNAM6= <>
##$DBPNAM7= <>
##$DBPOAL= (0..7)
0.5 0.5 0.5 0.5 0.5 0.5 0.5 0.5 
##$DBPOFFS= (0..7)
0 0 0 0 0 0 0 0 
##$DE= 6
##$DECBNUC= <off>
##$DECIM= 32
##$DECNUC= <off>
##$DECSTAT= 4
##$DIGMOD= 1
##$DIGTYP= 9
##$DL= (0..7)
0 120 120 120 120 120 120 120 
##$DP= (0..7)
150 150 150 150 150 150 150 150 
##$DP07= 0
##$DPNAME0= <>
##$DPNAME1= <>
##$DPNAME2= <>
##$DPNAME3= <>
##$DPNAME4= <>
##$DPNAME5= <>
##$DPNAME6= <>
##$DPNAME7= <>
##$DPOAL= (0..7)
0.5 0.5 0.5 0.5 0.5 0.5 0.5 0.5 
##$DPOFFS= (0..7)
0 0 0 0 0 0 0 0 
##$DQDMODE= 0
##$DR= 18
##$DS= 0
##$DSLIST= <SSSSSSSSSSSSSSS>
$$ [...]
##$SUBNAM0= <"">
##$SUBNAM1= <"">
##$SUBNAM2= <"">
##$SUBNAM3= <"">
##$SUBNAM4= <"">
##$SUBNAM5= <"">
##$SUBNAM6= <"">
##$SUBNAM7= <"">
##$SUBNAM8= <"">
##$SUBNAM9= <"">
##$SW= 18.0517328524113
##$SWIBOX= (0..15)
0 0 2 0 0 0 0 0 0 0 0 0 0 0 0 0 
##$SW_h= 3612.71676300578
##$TD= 16384
##$TD0= 1
##$TE= 0
##$TE2= 300
##$TE3= 300
##$TEG= 300
##$TL= (0..7)
0 120 120 120 120 120 120 120 
##$TP= (0..7)
150 150 150 150 150 150 150 150 
##$TP07= 0
##$TPNAME0= <>
##$TPNAME1= <>
##$TPNAME2= <>
##$TPNAME3= <>
##$TPNAME4= <>
##$TPNAME5= <>
##$TPNAME6= <>
##$TPNAME7= <>
##$TPOAL= (0..7)
0.5 0.5 0.5 0.5 0.5 0.5 0.5 0.5 
##$TPOFFS= (0..7)
0 0 0 0 0 0 0 0 
##$TUNHIN= 0
##$TUNHOUT= 0
##$TUNXOUT= 0
##$USERA1= <user>
##$USERA2= <user>
##$USERA3= <user>
##$USERA4= <user>
##$USERA5= <user>
##$V9= 5
##$VALIST= <valist>
##$VCLIST= <CCCCCCCCCCCCCCC>
##$VD= 0
##$VDLIST= <DDDDDDDDDDDDDDD>
##$VPLIST= <PPPPPPPPPPPPPPP>
##$VTLIST= <TTTTTTTTTTTTTTT>
##$WBST= 1024
##$WBSW= 4
##$XGAIN= (0..3)
0 0 0 0 
##$XL= 0
##$YL= 0
##$YMAX_a= 116411
##$YMIN_a= -122591
##$ZGOPTNS= <>
##$ZL1= 120
##$ZL2= 120
##$ZL3= 120
##$ZL4= 120
##$ABSF1= 10
##$ABSF2= 0
##$ABSG= 5
##$ABSL= 3
##$ALPHA= 0
##$AQORDER= 0
##$ASSFAC= 0
##$ASSFACI= 0
##$ASSFACX= 0
##$ASSWID= 0
##$AUNMP= <proc_1d>
##$AZFE= 0.1
##$AZFW= 0.1
##$BCFW= 1
##$BC_mod= 2
##$BYTORDP= 1
##$COROFFS= 0
##$CY= -3
##$DATMOD= 1
##$DC= 2
##$DFILT= <>
##$DTYPP= 0
##$F1P= 0
##$F2P= 0
##$FCOR= 0.5
##$FTSIZE= 0
##$FT_mod= 4
##$GAMMA= 1
##$GB= 0.15
##$INTBC= 1
##$INTSCL= 1
##$ISEN= 128
##$LB= 0.25
##$LEV0= 0
##$LPBIN= 0
##$MAXI= 10000
##$MC2= 0
##$MEAN= 0
##$ME_mod= 0
##$MI= 1.114404
##$NCOEF= 0
##$NC_proc= 0
##$NLEV= 6
##$NOISF1= 3.799351
##$NOISF2= 2.8
##$NSP= 1
##$NTH_PI= 0
##$NZP= 0
##$OFFSET= 14.38212
##$PC= 1
##$PHC0= -1553.409
##$PHC1= 2.5922
##$PH_mod= 1
##$PKNL= yes
##$PPARMOD= 0
##$PSCAL= 0
##$PSIGN= 0
##$REVERSE= no
##$SF= 200.129724274929
##$SI= 16384
##$SIGF1= 3
##$SIGF2= 2
##$SINO= 400
##$SIOLD= 16384
##$SREGLST= <1H.CDCl3>
##$SSB= 0
##$STSI= 0
##$STSR= 0
##$SW_p= 3205.1282051282
##$SYMM= 0
##$S_DEV= 0
##$TDeff= 0
##$TDoff= 0
##$TI= <>
##$TILT= no
##$TM1= 0
##$TM2= 0
##$TOPLEV= 0
##$USERP1= <user>
##$USERP2= <user>
##$USERP3= <user>
##$USERP4= <user>
##$USERP5= <user>
##$WDW= 1
##$XDIM= 8192
##$YMAX_p= 0
##$YMIN_p= 0
$$ End of Bruker specific parameters
$$ ---------------------------------
##NTUPLES= NMR FID
##VAR_NAME=  TIME,          FID/REAL,        FID/IMAG
##SYMBOL=    X,             R,               I
##VAR_TYPE=  INDEPENDENT,   DEPENDENT,       DEPENDENT
##VAR_FORM=  AFFN,          ASDF,            ASDF
##VAR_DIM=   8192,          8192,            8192
##UNITS=     SECONDS,       ARBITRARY UNITS, ARBITRARY UNITS
##FACTOR=    0.0002768,     1,               1
##FIRST=     0,             0,               0
##LAST=      2.2672688,     0,               0
##MIN=       0,             -122591,         0
##MAX=       2.2672688,     116411,          0
$$ Real data points
##PAGE= N=1
##DATA TABLE= (X++(R..R)), XYDATA
$$ [...]
1864f7J30L2l28L49Lk76J05m1J54n10N35k6r7L92n33O6r8K15M4k5q1K92k77M0
1888bj00o4L91n0j70p2kK13j90L22l13J25M5m1j41k9J09Mj51K84q9k21q3J70J18
1913F3l48M36J30j79j5K4l22J08J39k85Q5J98J82l23o4j01N03l45np1N7J50p9
1936f2J6j63L9J84L5J63k17J59j46J38k94M6O5r5K33k25J76j72j45J96M3j15J8
1959a23m8L46J87q3k95m8J85m7q8m9j43J62l73M52r7K62k98j08N7J92O6k13L02
1982A98l12J85k19L6MJ15r6j18J9M62k33o9K57l88L68l99J59J54j79J04N3P1k55
2005h3o6N33l53p5n1L34n9r2o1j62J02j45J12R1j63J3M16k82R4k76J65k09J53
2028f4Q2M4j76R9K22l53J2K14n2n1J37pk12K02J46J3n05m1M90L6l15Q6n9R7j0
$$ plain form
1864 -67 63 95 -233 116 119 -157 -52 -93 61 -449 86 60 -37 355 -178 -112 -210 5 49 24 -57 235 -42 -2
1888 -2 -102 -166 225 175 5 -67 -69 144 -46 276 -37 88 133 92 -49 -78 31 35 -116 168 79 -142 -225 -55 63
1913 63 -285 151 281 102 87 111 -211 -103 36 -249 -164 34 216 -107 -171 -272 231 -114 -119 -190 -133 17 -62
1936 -62 -46 -209 -170 14 49 212 -5 154 8 146 -148 -102 -37 -132 101 -124 52 -120 -265 -69 -26 -141 -123
1959 -123 -171 175 362 279 -16 -64 121 74 -14 -63 -206 -44 -417 35 -62 200 -98 -206 -149 43 109 -104 198
1982 198 -114 71 -148 -112 -108 7 -89 -207 -188 274 41 -28 229 -159 209 -190 -31 123 -56 48 101 172 -83
2005 -83 -149 384 31 -44 -95 239 180 88 27 -135 -33 -178 -66 25 -138 -125 291 9 103 -173 -8 -217 -64
2028 -64 18 62 -114 -15 207 -146 -134 80 28 -23 114 107 -105 97 243 256 -249 -290 200 236 -79 7 -52 45 35
2053C5n7K10j7j54j5P2j07l19K45L84l62L85j74K3J8m3p3KK3k39L31l81M8J89
2077B4K95m07Q3n5l7L95l59L7k2JJ25p4l1O5l70K55P3Jj55J8J86J38kO2m36K58
2103F8k84L93o8l00J74L42l06J9Q5l04K02k4j24K37k22K32j57ML8j75K73J7k99
2126a79K13k04J40K9L1J39k86p9L72l79J72l0r2P6KL34k41o7j99J51P9k1k10M0
2150b09lQ7r7J97j80N8k02M12J28l71J53r0j00L5J71Q1k1m5K73l69J12n2m7R2
2174A3P5j72o7O4p2R9k9r2Q8Q2j37K15j57k02J60p6Q7K8J0L17k38j58J94m8J73
2199A57k59L3J26L5o3J23r9J91k99J45k5k53N4J03J29J12k42j09J44k20K90j63
2221i0J19O2N0j05j8o6J61j27q4L98m47K99%p8k74K47J26j79p4j10Q9J41J07k88
$$ plain form
2053 35 -22 188 171 17 2 74 -33 -352 -107 277 -85 300 126 149 167 124 51 53 76 -163 168 -213 -165 24
2077 24 319 -88 -5 -60 -97 298 -61 -24 -46 -45 80 6 -25 40 -330 -75 -2 -1 -156 -138 48 186 184 246 -190 68
2103 68 -216 177 109 -191 -17 325 19 38 123 -181 21 -3 -127 110 -112 120 -37 -33 5 -170 103 120 -179
2126 -179 34 -170 -30 -1 30 169 -117 -196 176 -203 -31 -61 -153 -77 -75 259 18 -49 -248 -97 -18 -39 -249 -209
2150 -209 -212 -125 -222 -25 -205 -147 -349 63 191 -180 -27 -117 -217 -182 -11 70 49 4 277 -92 20 -32 -79 13
2174 13 88 -84 -151 -87 -159 -60 -89 -181 -93 -11 -148 67 -90 -292 -132 -208 -121 -93 -83 234 -4 -162 32 -16 157
2199 157 -102 -69 57 92 29 152 53 244 -55 90 65 -188 -134 -31 98 210 -32 -141 3 -217 73 -90
2221 -90 29 91 141 36 18 -48 113 -14 -98 300 -147 152 152 74 -200 47 173 -6 -80 -190 -101 40 147 -141
2245a41J88j91N3K96l98mK01J0j34n3K25pp4j50M15m59j00L21j52L83j07j05O5
2268H2K11k03O4j77k31J48k7J77j20P0q4J27M5M7j29j03K37r7p2K42l23n2J01
2291f7J42l1j40L07k16M5kjj12L7j55L31j43l1K97m57K52Q7p9q5l25K13K09K3
2315I9m8k88J40J67j82J04l6K9M2K68m07K37j55o0R4K64k11j69P1PN9l7K45k18
2339A5L24j69M1M0k61k45L14J95l12k8L13j63j16N4l34P1N17l16L1R3q2m0j8j8
2363i4P5K7l04O65l21p1q9MR5Jk52L21J6j31j76K53o6R7m5k23J78q6R9j54J54
2388b7j58K37J24l68J28P4K44L1k07N4j72Rn9R7l2K95m80K75R6R9m71N9k8J61
2412a9Q7p3L38l06q0K08k68m0L8q2O3R0j08J38p3J64M5J84m83q8K44L03l94l5
$$ plain form
2245 -141 47 -144 -91 205 -193 -197 4 14 -120 -173 52 45 -29 -179 236 -223 -323 -2 -154 229 122 17 82
2268 82 293 90 154 -23 -254 -106 -133 44 -76 -6 -90 37 82 129 0 -103 134 37 -35 207 -116 -168 -67
2291 -67 75 44 -96 211 -5 40 38 37 -75 -38 -193 138 -5 -36 261 -196 56 143 64 -21 -346 -133 76 99
2315 99 51 -237 -97 70 -112 -8 -44 -15 27 295 -112 125 -30 -90 4 268 57 -112 -41 -34 25 -12 233 15
2339 15 339 170 211 251 -10 -255 59 254 -58 -86 227 64 -52 2 -332 -261 256 -60 -29 64 -18 -58 -76 -94
2363 -94 -19 8 -296 369 48 -23 -112 -108 -13 -12 -264 57 73 -58 -234 19 -47 50 5 -218 -40 -126 -27 -181 -27
2388 -27 -185 52 176 -192 -64 10 254 285 78 132 -40 -31 -90 7 -25 270 -210 65 161 260 -211 -152 -180 -19
2412 -19 68 -5 333 27 -53 155 -113 -153 -115 -197 -134 -44 -152 -14 -87 77 122 306 -177 -265 -21 282 -112 -147
2436a47k01K46J07O2r7K70R5l28K76l03MK1k51K92RK7j14q0J18K20j95j59K28
2459A00l04m4Q2J89J26Q8l58L4R2m6J22Pj56K50j85m9K20k0k61P7P0j63P9K2J03
2484G5k13J2J89j44L0L13m51J0P9r0%K21p5PK56j00J50l20J02p9k65M21m8j57
2508g7N3N4n3j0R7j25j19K55j34j03p0L21J02k27K2m8k15K13J35j62l2K39k45
2531a29K79k16k2J0QK5j02k3J37p3qL01j13l67K54j6J04N8q9K4K1j35J8j0K32
2556A68k52k3J9l6L84k19m2j61K69j53k30L13J96l51J76k02L05p4p6j63L33k30
2578d9J69k28K35q4J61p0J03j88j16J53L0j91k8L52k79L16k57Rj16J40J5j28J08
2601E7j31k25J69k9j3L24j12l7J13r5j2p6l4L19l60K18p4n6J2r9K5K74m19K31
$$ plain form
2436 -147 -348 -102 5 67 -30 240 335 7 283 -20 -16 5 -246 46 55 82 -32 -112 6 226 31 -128 100
2459 100 -204 -248 -166 23 149 237 -121 -87 5 -41 81 88 -68 182 -3 -52 168 148 -113 -36 34 -129 -50 -28 75
2484 75 -138 -126 63 -81 -51 262 -189 -179 -100 -190 -190 31 -44 -37 219 119 269 -51 51 -28 -293 128 80 -77
2508 -77 -24 30 -23 -33 64 -61 -180 75 -59 -162 -232 89 191 -36 -14 -62 -277 -64 71 -91 -123 116 -129
2531 -129 150 -66 -88 -78 -70 -45 -147 -170 -33 -106 -114 187 74 -293 -39 -55 49 107 18 42 63 -72 -54 -64 168
2556 168 -84 -107 -88 -124 260 41 -1 -162 107 -46 -276 37 233 -118 58 -144 161 87 11 -152 181 -49
2578 -49 120 -108 127 43 204 134 237 49 -67 86 116 -75 -103 249 -30 286 29 38 -78 62 77 -51 57
2601 57 -74 -299 -130 -159 -172 152 40 3 116 21 9 -67 -101 218 -142 76 2 -54 -42 -141 -116 158 -261 -30
2625c0J10L8q0J97k55L2j38Q0L23k36P5j73j35M4M7j3K54k14K1K58k27Ml9oJ18
2650E5q8J05j08qJ0J84l89J66J61j31l4K68k29K2j5K37j14j48J70l95L25k4J74
2673A94l02O0k19K41J51l8j46J12k1j28j20K34oJ00j92q2L34l46k12N13q0o8L1
2696A0l0j43O0K88l80K3J00K98l34K1M7j22J13m7k2K61k92J08J20j07J61J16j58
2719I1j87j66P1J49Q2j32J18R7r5j10j71K11J27k30Q4j4p8L02j58j75J54K02k08
2742c6L19j89j70LR2J56j57j35J7K75l38J82o7K31rn50K04L21n08M69k81L03J2
2765A44l14J72J40l74K49J09n6M09o37j23L90j11p5K60m11K48j8n9J97L1j71K3
2787B3p7K9j40J42J9j91M7K31k47K22k78L57l4p5P7k05oj22J68J02m2m5J31j5
$$ plain form
2625 -30 80 118 38 235 -20 12 -126 -46 277 41 116 -57 -192 -148 -101 -114 140 -74 -53 205 -22 -18 -57 -63 55
2650 55 -33 72 -36 -44 -34 150 -239 -73 88 -43 -77 191 -38 -16 -31 206 92 -56 114 -281 44 20 194
2673 194 -108 -48 -267 -26 125 87 -59 53 32 -96 -216 18 12 112 -80 -162 172 -174 -386 127 47 -21 10
2696 10 -20 -163 -103 185 -195 -172 -72 226 -108 -87 -40 -162 -49 -96 -118 143 -149 -41 79 -28 133 249 91
2719 91 -96 -262 -191 -42 40 -92 26 123 28 -82 -253 -42 85 -145 -61 -75 -153 149 -9 -184 -30 172 -36
2742 -36 283 94 -76 -73 19 175 18 -117 -100 175 -163 19 -48 183 174 -376 -172 149 -359 110 -171 132 144
2765 144 -170 2 142 -232 17 126 70 479 -158 -281 109 -2 -77 183 -228 20 2 -57 140 171 0 23
2787 23 -54 -25 -165 -23 -4 -195 -148 83 -164 58 -220 137 103 28 105 -100 -106 -228 -60 42 0 -45 86 71
2811G1j94J77m8p3K08k28M8K86k07j59K16J2m9k41J58l08K93P6n3J3o3N4j36k2
2835a69J74p4N5q3j72L93j84L6n2m8K20j27k34K24J00J4L4n3jj96J16L03l30J96
2859A42p4J1q4K89j62J31k44l2q7J57j93J97j04J89j06M7K46l90K39k30L8o3K28
2882A45o5j64J22J34J2j91j27J04J38J9k33n4J28J32j59K39n7j69K66l70K40J02
2904A92k84Q8m7J68k17L5M8l0N5j80J56J34k41n1L77k17J38k30K13m9p8J52k6
2927A06O5l88K99qP4J36l96K92j85R9k75J31L46l62nj34L76q3j28R2Q3n2j17J4
2951b0K50l49R7J71N7k41j6R3J0j30o1K92k9k04m7J98m9p8Q1R7q4l21M58l68K26
2976C3J06n06L79k35P6J09M9J08k52J84k02M64l81K6K31j70qk02K37L5P3k04L41
$$ plain form
2811 71 -123 54 6 -67 141 -87 -39 247 40 -119 97 109 60 -181 -23 -331 -38 38 -15 -2 -65 -11 -147 -169
2835 -169 5 -69 -14 -97 -269 124 -60 -24 -76 -124 96 -31 -265 -41 59 73 107 54 53 -143 -27 276 -54 142
2859 142 68 79 -5 284 122 253 9 -23 -110 47 -146 51 -53 136 30 77 323 -67 172 -58 -20 -83 145
2882 145 80 -84 38 172 184 -7 -134 -30 108 127 -106 -160 -32 100 -59 180 123 -46 220 -150 90 192
2904 192 -92 -4 -51 117 -100 -65 -17 -47 8 -172 -16 118 -123 -174 203 -14 124 -106 107 58 -20 132 106
2927 106 171 -217 82 74 148 284 -112 180 -5 94 -181 -50 296 -66 -71 -205 171 88 -40 52 135 83 -34 -20
2951 -20 230 -119 -22 149 206 -35 -51 42 52 -78 -139 153 124 -80 -127 71 22 -56 25 122 38 -283 175 -193 33
2976 33 139 -367 12 -223 -147 -38 11 119 -133 51 -151 313 -68 -42 189 19 11 -191 46 81 154 -50 291
2999B91j69R9k38J49p1j79N6r3J51Kr1K34l03J83k06M9Q0M6q6r3J43RP3r2L72
3024C16j98m1K39k97J07j76m3L12l22J63O9m40L49M6J25j70N5k71j62J39K93l0
3046F3k8qJ95m83J56M0J47j16K74m04L88K5l11J8j33j52J76J57L4l0j04Q7j58
3069a67J68l29K39j71M1L00J5j86r3J17J92k90M35k51m2M4j30j6j4J84N2j2r9
3092a3K9J75m7O0k04l11K30R9l10J77K03J03o9j47Qj7j7j91M09k13K81k32o6J82
3116A19J9j13n6k81L77P8k79l1K27o1J92l80J77j24N7K90j91l8lj68M84l14J32
3139A13k65R2L8K13l72K08j21J8J49k48K35J69k44J60k7k5p5j11J7j40L60m15
3161b71J64J78J83m38K52o3J9P1k6j93J16P1j44j13J64k0J24O0j48K16k25N6J24
$$ plain form
2999 291 122 221 -17 132 61 -118 -62 -155 -4 -2 -93 141 -162 21 -185 -136 -56 -10 -96 -189 -46 -37 36 -56 316
3024 316 118 77 316 19 126 -50 -93 219 -103 60 129 -311 38 84 209 39 94 -177 -339 -200 93 63
3046 63 35 27 222 -261 -105 -65 82 -34 240 -164 224 249 -62 -44 -177 -329 -153 4 38 8 -96 -9 -167
3069 -167 1 -328 -89 -260 -219 81 96 -90 -183 -66 126 -164 271 20 -22 22 -108 -124 -138 46 98 86 -13
3092 -13 16 191 144 204 0 -311 -81 18 -292 -115 88 191 122 -25 -17 -34 -51 -242 167 -46 235 3 -63 119
3116 119 138 25 -31 -312 65 143 -136 -167 60 -1 191 -189 -12 -136 -79 211 20 -18 -21 -189 295 -19 113
3139 113 -152 -60 -22 191 -181 27 -94 -76 73 -175 60 229 -15 145 118 93 18 -93 -76 -216 144 -271
3161 -271 -107 71 254 -184 68 5 24 95 69 -124 -8 63 -81 -194 -30 -50 74 134 -14 202 -23 33 157
3184A57k33J07l3N6j85J14L8n7O8j45K46n07L40p1N4R8j06K27j68M4K1Q4n8k42
3208a51m1N15j74l36K25N8NJ31j72J2jr0J7jJ30k95K36p4j30Q0k26l8K72m9j11
3233b08J94j15N6L3J63K6l80M33n26N14L6j24P6n11M01q7p4J70M4n0J66l43k6
3256a32J64k07J84j12J44mN3j18j76k9J3L2J0N6K53k04n4kJ13N8j13l2J74j85
3280a14L02k75J79M6k52j57L02j75J03kk7J58Q1j31J07j06K9q7Q2J11l34J94O3
3303I7J03j86J28k23J07K1P5J50j88l4j76K5m4L9J49J85j27j89K85n9k17J16k06
3326a69K99k6R9k30jJ18q2j82j20O12m50R1K50j65P9r5L1k02J28Q7j91J22j04
3349a01J30J47k65j58L89k70j5J72K16k89r7L4J55r3J5K00l03J24L6lq1m00O07
$$ plain form
3184 157 -76 31 -2 54 -131 -17 21 -36 32 -113 133 -374 -34 -105 -51 47 -59 168 0 44 65 149 91 -151
3208 -151 -192 323 149 -187 38 96 101 232 60 72 71 -19 -2 -3 127 -168 68 -6 -136 -56 -282 -320 -48 -97 -208
3233 -208 -14 -129 -73 -40 123 149 -231 202 -324 190 226 102 178 -333 68 -19 -93 77 121 71 237 -106 -132
3256 -132 32 -175 9 -103 41 37 90 -28 -204 -233 -220 -188 -178 -122 131 -73 -127 -129 -16 42 -71 -103 71 -114
3280 -114 188 -87 92 138 -114 -271 31 -144 -41 -43 -70 88 169 38 145 39 68 -19 63 174 -160 34 97
3303 97 200 14 142 -81 26 47 122 272 84 50 -126 -101 -145 -106 43 228 101 -88 197 138 -79 37 -169
3326 -169 130 104 203 -27 -28 90 8 -174 -294 318 -132 -41 209 44 123 28 59 -143 -15 72 -119 3 -101
3349 -101 29 176 -89 -247 142 -128 -143 29 245 -44 -141 -107 48 -45 -30 170 -133 -9 27 24 -57 -457 150
3372A50N5N3l45J43q3M4j66J26m22O50j70J41j94K21m19K49l35M85k89L13l98
3393a91K99ql71L74K0J67l35j57K17M3j07M5r8L05l22K72l57K62j29j71M41k67
3415f8J83j59J98k27K08p2k49J26l22M13M6k52K96J85n21N6J98k31m7J09M0N8
3437c2K44j77jl2J31m3K46l32p4J7J39J27j26j6j37m9L4K69r1J0k01K00m1j79
3461a14J37P0p6Q8n7P8k69K49l61L56j48P0p7K33j65r5L97k08j87J33k33J21n7
3484a15N8j16N2N4K58J05l43jN9j07K23j36j81N4L6O4J38J24j91J3n4n5oJ82o5
3509E0L57m18L8k12J17J57j88J03j03J65K31l97j5P8N2k78L08L03m14J80j26K0
3531HO1n9N0j58K07J05o11M15p3k44K03J71j47j20K75k95K8J64j48L48n38L74
$$ plain form
3372 150 205 258 -87 56 -27 17 -149 -23 -445 205 35 176 -18 203 -216 33 -302 183 -106 207 -191
3393 -191 108 100 -271 103 123 290 -45 -202 15 58 -49 -4 -102 203 -119 153 -204 58 -71 -242 199 -68
3415 -68 115 -44 154 -73 135 63 -186 -60 -382 31 77 -175 121 306 -215 -159 39 -192 -239 -130 -90 -32
3437 -32 212 35 34 2 133 90 336 4 -70 -53 86 213 87 71 -66 -115 -81 188 97 107 -94 106 65 -114
3461 -114 23 93 17 105 48 126 -143 106 -255 101 -47 23 -54 179 14 -81 316 108 -79 54 -179 -58 -115
3484 -115 -57 -173 -121 -67 191 296 -47 -48 11 -96 127 -9 -190 -136 -100 -36 102 226 35 48 -6 -61 -67 115 50
3509 50 407 -11 27 -185 -68 89 -99 4 -99 66 297 -100 -115 -37 15 -263 45 348 -66 114 -12 8
3531 8 69 10 60 -98 109 214 -397 18 -55 -299 -96 75 -72 -192 83 -212 -184 -20 -168 180 -358 16
3553A6l99L59j6J93k70J82k7r6K46l56O3O9N9J68l08K27k11L4j64K71l3N9r3m0
3577f7m4L38l88P9K64j46k96M54M3j15J01l01K40m94L47K1k2j76L35j62j5k40
3599b44K17l43L95k00M24r9l28J47M9K5j44J51j32o2k48M54k6j2j8R3N3k25q3
3622a56J14K49k10K07n4n5j24j23M52m56K40j50j91L21j49j99O1M19k66MO5J18
3644A17m54K54k9K01r9K13r8K0o3K3j48j44J45q4J75K09k37k47L05M7k97J01J84
3667I4K84m16K32j23R6j08K65l71j14J63o7K95j15j42J6j41N9j8K1L22l33j91
3689b92L60m0l8kk0k53K41J43l12M20l68J49M01l93j05Q7p8L56k64J34K0l10J22
3712d2Q3j09o2j07m3K98K44j84j31K99j58l0k18N35m90K49m84K48K03k84K28l17
$$ plain form
3553 16 -383 -24 -40 153 -117 65 38 -58 188 -168 -105 -36 23 191 -117 110 -101 -67 -231 40 7 66 -27 -67
3577 -67 -111 227 -161 -82 182 36 -260 194 237 122 223 -78 162 -332 15 36 14 -162 173 11 -4 -244
3599 -244 -27 -370 25 -175 249 150 -178 -31 18 43 -101 50 -82 -144 -392 62 36 24 6 99 152 -73 -156
3622 -156 -42 207 -3 204 150 95 -29 -152 300 -156 84 -66 -257 64 -85 -284 -223 196 -70 -66 -1 117
3644 117 -337 -83 -112 89 -10 203 105 125 62 85 -63 -207 -62 -146 29 238 1 -246 59 106 -191 -90 94
3667 94 378 -38 194 71 167 59 324 -47 -161 2 -65 230 115 -27 -11 -152 -93 -111 -90 232 -101 -292
3689 -292 68 28 -10 -12 -32 -285 -44 99 -213 207 -161 -12 389 -4 -109 -22 -100 256 -8 126 146 -164 -42
3712 -42 41 -68 -130 -237 -280 18 262 78 -53 246 88 58 -160 375 -115 134 -350 -102 101 -183 45 -272
3734b72K15J25k82L59j98o8J16k44M22l71L03l17K07j29L49j36J32k78M4J70j78
3755c1K5p9J55J89k07J42K8p9j00m71M98n4J17k46l0K27k65R8J07J44l20J87j06
3778g1mL33j24k40J93q3M0L0M0k66J43r7O7P9o2KK00l3J22k61j38o7p1M10l1p5
3804C6J4k27K79j45O9Mp5J02k14K78p2k15K22J20q5o3m31N60m51L56J31m61L61
3827I3K03k39k04K27l23L96l76l7M28j95k72J82j08M22j02j86J01J31j50m9L83
3848C25p6k19L4k92K60J60m06j0K93j11j3P2J3M4j82K40r5K32j85L8j71K49k19
3871a9J62j90L2J31j75K40l55K62k80P2L69k23j70M30k67O8J59l09R9K7k25k8
3893a90K31j77J79J59k17l3K8N1k29J68K14k99J20l8j34J95Jk06M8L05Q5k56M3
$$ plain form
3734 -272 -57 68 -214 145 -53 -121 -5 -249 173 -198 105 -212 -5 -134 215 79 211 -67 -23 147 -31
3755 -31 -6 -85 70 259 52 194 222 143 43 -428 70 16 133 -113 -143 84 -181 -83 24 168 -152 35 -71
3778 -71 -75 258 134 -106 87 4 44 74 114 -152 -9 -106 -39 40 -22 -20 180 147 269 8 -130 -197 -268 142 111 36
3804 36 50 -177 102 -43 26 30 -45 57 -157 121 49 -166 56 176 91 28 -403 157 -294 62 193 -268 93
3827 93 296 57 -147 80 -243 153 -223 -260 168 -27 -299 -117 -225 197 95 -91 10 141 -9 -58 325
3848 325 249 30 64 -228 32 192 -214 -224 69 -42 -55 17 30 74 -108 132 37 269 84 122 -49 200 -19
3871 -19 143 -47 -15 116 -59 181 -174 88 -192 -120 249 26 -144 286 19 87 246 -63 36 63 -162 -190
3893 -190 41 -136 43 202 -15 -48 -20 31 -198 -30 184 -115 5 -33 -167 28 29 -177 -129 176 261 5 48
3916D8Mm2j90J0K01L14j72l47K9J93N6l8N4k91L27k85J79O8k76R1N6j59o2K61
3940B9l81N66k54P5j58k22L01j00L11l8n57N82j40J00k35L4L90l96P6J59o5l31
3962b54N91m03o2J57l3q5L80l55P5Q7j79L2N9m7l01O22n61r3N64m4N2j07j47J83
3986A31J38k11R9N6j65n9J75m25J45K04j70O4R1N2l93J69M91l13k09K46j98K11
4008A29j53P2j38J30j24J80J81j72j42L1j04j76J41J47J65K7j15j61kL28j80K73
4030C37k2k29R4J00j97j37K84l90q3N54n5o71M88j18J13L00n21K04L0k25J78O7
4052A01j3j18kn4j36K52K04l3l21k9KL84k71J31K4j75J41KN8k10J80j93J28N8
4076A10j48K8mP8m8N0J34k02k3O4Q8k08N4r2J82l7k57R7J20k66L97K0j34J5MJ78
$$ plain form
3916 48 52 10 -180 -170 31 345 173 -174 -145 48 104 66 120 -171 156 -129 50 118 -158 -67 -11 -170 -232 29
3940 29 -352 214 -40 35 -123 -345 -44 -144 167 129 -428 154 14 114 -121 -87 303 -93 -17 142 77 -254
3962 -254 337 -66 -128 29 -4 -89 291 -64 11 98 -81 -49 10 -37 -338 284 -277 -370 194 150 202 95 -52 131
3986 131 269 58 157 213 48 -11 164 -261 -116 88 -82 -18 73 125 -268 -99 392 79 -130 116 -82 129
4008 129 -24 48 -90 40 -84 96 277 105 -37 -6 -110 -286 -145 2 167 194 79 -82 -84 244 64 337
4030 337 315 86 180 280 83 -54 230 -160 -243 311 256 -415 73 -45 68 368 -153 51 81 -144 34 101
4052 101 88 -30 -32 -86 -222 30 234 201 -120 -149 -147 237 -34 97 121 -54 87 89 147 -63 117 -76 52 110
4076 110 -38 -10 -14 64 16 66 200 -2 -25 39 127 -81 -27 -119 63 26 -231 -134 -14 -280 117 137 3 18 22 200
4102B00j98O5j97JR6j75J45n9P3pJ13l3k41M55j40j19R7p2L18k86k05mL56k04
4126b1j10J25r5L4L3L04m39K49k06L83M2l33K3k7K84j85k58N80j03l14J32O6j39
4149B5M2m2J59k19r5L69k81j27M7N46m18o0K26k44R7P0J54j42j60L13j43n10K94
4172i9L6j77N6k0j3P4K88p2O6j93J79rj03J74j26M4k62J4r7L1J80J66j72L33k20
4197G8J6j29m5r2K09j54M00j84l07L7K86j68J63J75l47q0L41j32l9J09j98p7j13
4220b51L00j83J12J87l82L69k18L0K8M4J39r7j1j11n0j35N05m44J88J15k15J91
4242A11j56k00K18Q6j5K6o8J34j71r2j7J88N8k73K54j33J26R9k43L19k33L1j56
4265a07j42J50l6o5L47n6r8J64l36J32k27J25J21o2L0j9Q7Rj6Q4k7P8j55M7j15
$$ plain form
4102 200 2 67 -130 -129 -33 -208 -63 -122 -49 -56 57 24 -217 238 98 -21 76 4 322 36 -169 -173 183 -21
4126 -21 -131 -6 -101 -67 -34 270 -169 80 -126 257 299 -34 -11 -38 246 61 -197 383 280 -34 98 164 25
4149 25 67 25 184 -35 -130 239 -42 -169 -122 424 6 -54 172 -72 25 95 249 107 -53 260 117 -393 -99
4172 -99 -63 -240 -184 -204 -217 -143 145 73 139 -54 125 116 13 187 61 105 -157 -143 -240 -209 -29 137 -35 298 78
4197 78 94 -35 -80 -172 37 -117 283 99 -208 -171 115 -53 110 285 -62 -142 199 67 28 137 -61 -138 -251
4220 -251 49 -134 -22 165 -217 152 -66 -36 -8 36 175 78 67 -44 -94 -229 276 -168 20 135 -80 111
4242 111 -45 -245 -27 59 44 70 2 136 -35 -127 -144 44 102 -171 83 -50 76 175 -68 251 18 49 -107
4265 -107 -249 -99 -135 -200 147 91 -7 157 -179 -47 -274 -149 -28 -90 -60 -79 8 17 1 85 58 136 -19 28 -87
4290h7L78k38q1p7K85k35R6J15m27L21K25p9j75JK1J8j34k5j42J2N42j3k40l34
4314b73K01p5J50J35k13K83q2j64j71j09L19J43o8M8j48L4k63L03k5j9J47l1p0
4337E2J30m19jL89k00M5j93L7m5K53m9j61J02O1J14l83J25l0L95m51M95n11P3
4360a72j0J53l4k95L72l3j34K12k07P2qK82r7l59K14o2J50j54L66k19j09L07j26
4383A09j76O3q2k1K03l09J37P7k0pJ26k8m3N9RN3k29q6K15Q2l51R8N68k13k19
4408A5J35l7k88J21K24N1L7m47L01K26j68l24K45j37J72%k35OM83p33L12ln4L9
4432e9J08N2J86k28r4j54J91Q9p9k20P6K97j36r7r2R4K04Kpj29j20P1J50j32M1
4457A4J3n7n2p8n9k5M52j08j13j86M46k81J4N1K0M7k54J19K13k58J16p3RJK31
$$ plain form
4290 -87 291 53 -28 -105 180 -55 41 156 -271 50 275 196 21 22 43 61 -73 -98 -240 -228 314 301 61 -273
4314 -273 -72 -147 3 138 -75 208 126 -38 -209 -318 1 144 76 124 -24 10 -253 50 25 6 153 122 52
4337 52 182 -237 -238 151 -49 -4 -197 -160 -205 48 -1 -162 -60 1 115 -268 -143 -173 222 -229 266 -245 -172
4360 -172 -182 -29 -63 -358 14 -19 -153 59 -148 -76 -84 198 101 -258 -44 -106 44 -110 256 37 -72 235 109
4383 109 -67 -4 -86 -107 96 -213 -76 1 -19 -26 100 72 29 88 97 150 -79 -165 50 132 -219 -121 447 234 15
4408 15 150 113 -175 -54 170 221 258 -189 112 338 170 -154 91 -46 126 126 -109 -103 380 -353 -41 -44 -98 -59
4432 -59 49 101 287 59 -35 -189 2 91 12 -208 -132 165 29 -68 -160 -66 138 140 133 4 -116 -45 105 -27 14
4457 14 27 -30 -82 -160 -219 -244 208 100 -13 -199 247 -34 -20 31 51 98 -156 -37 176 -82 34 -39 -30 -29 202
4482B02k07KKJ45j35p2J96j08k30O0M9j97K86o9j04K58j10pR8j02Lk29K03J81
4506A15RO2J08l64qL13m10R0M78l81O2q7K9jJ64j12l8o2O0K5n3k5r1L22l00k7
4532a22J52K09j15K6J9l66K69k14J05J36k04R2j00K4j21K35q1j20P5J55k3o7J27
4555I1p3j68R1N2j32O7M6j63J47p6K57k65j31K03l3J2P2J26r0k3K5j35K04k91
4579a87P3L06J56n20Q8L7R0k41K65k65K00q1J10L20k08R4k97p2k5K75N0l16P2
4602g6K92o5j40J89r4K3O4m28K41J37k1j11m2J17J25j39k27K46O3j51K97k26o4
4625A0K81n5k68O3o1J9j10K00O6om33L62k90J16O1j02K70j23j74J06K51k35j47
4648a99K44M2k54R2m9O9M40l27j28j96M49k63P5Q5rN0l3lM5M1k78r3M60K3o15
$$ plain form
4482 202 -5 -3 -1 144 9 -63 133 25 -205 -145 -96 -293 -7 -76 -180 78 -32 -39 59 -43 -40 -269 -66 115
4506 115 124 186 294 -70 -78 235 -175 -85 393 12 74 -13 16 15 179 67 29 -33 27 52 -1 -26 -117 205 -95 -122
4532 -122 30 239 124 150 169 -197 72 -142 -37 99 -105 -13 -113 -89 -210 25 -56 -176 -101 54 31 -36 91
4555 91 18 -150 -59 -7 -139 -72 -26 -189 -42 -118 139 -126 -257 -54 -87 -75 -3 123 33 10 35 -100 104 -187
4579 -187 -114 192 348 -172 -84 -47 43 -198 67 -198 2 -79 31 351 143 237 -60 -132 -157 118 168 -148 -76
4602 -76 216 151 11 200 106 129 193 -235 6 143 122 11 -31 86 211 72 -155 91 154 3 300 74 10
4625 10 291 236 -32 31 -30 -11 -121 79 145 139 -294 68 -222 -106 -45 -147 123 0 -174 -68 183 -52 -199
4648 -199 45 87 -167 -75 -124 -55 385 58 -70 -266 183 -80 -5 80 71 121 88 85 130 171 -107 -200 260 283 -332
4673c32K10P4K4J65j47n6J96N1l74L65P7k60j10J99m58M19k9K12k61K40l26L9
4695h2QQ1J16j60k00J50J15j61j89M35l69Q3J55Pj7n4J84r2m6o5Q8j32K58j05
4719HOJ79q6p6j5on6o8j63J27R0J8J4K58k11J8m71M77k54K95K26l13p5L2L57l64
4745e3J59J00k48K3J09j51O6J61j52j46N1J98l8l03O1K53k3l19J78q9K86J36m00
4768a41J62J3M9k79K43p5l50K90O8Lp3J43j65oj42O1K91L6k43K08j57o0R8l6k3
4793h5m0J93j10L0N6J13J5r9k73M35l72J45j2n0r2L09j79j5J2j9J28j56L0J32
4817I6N5k32J28j76j65M0J69J86l59L42nl31R0j57L06K30l59n9K82J17k84l81
4839d67R24n46K23l4p4M3M3q6L2O1k79K1M94o3k73j98J03q2P8M5J48j82r9L93
$$ plain form
4673 -332 -122 -48 -24 141 -6 -62 134 185 -189 176 253 -7 -117 82 -376 43 14 226 -35 205 -121 -82
4695 -82 -74 7 123 -37 -237 -87 28 -133 -322 113 -256 -173 -18 -11 -28 -82 102 10 -36 -101 -13 -145 113 8
4719 8 14 193 107 31 16 10 -46 -114 -277 -150 -60 -42 -28 230 19 37 -434 43 -211 84 310 -3 -78 -46 311 -53
4745 -53 106 206 -42 -19 90 -61 5 166 14 -132 -81 117 79 -224 -163 90 67 -252 -74 -163 123 259 -141
4768 -141 21 34 83 -196 47 -28 -378 -88 -20 -17 -90 53 -112 -118 -260 -199 92 128 -115 93 -64 -124 -26 -62 -85
4793 -85 -125 68 -42 -12 44 157 172 73 -200 235 -137 8 -4 -54 -146 163 -16 -31 -19 -38 90 -66 -36 96
4817 96 151 -81 47 -129 -294 -254 -85 101 -258 84 79 -252 -162 -319 -13 217 -142 -201 81 198 -86 -467
4839 -467 457 -89 134 100 26 69 112 26 58 119 -160 -139 355 292 19 -179 -76 -158 -80 -35 113 -69 -168 225
4863B25k17n7j80K66K23L0l40J63J9J1k81P4J25r1k17O7J44K31k77O4L4j48Q0
4886e2qJ62lQ0k44J0j62J15K56l65J77O1NJ52k88j25L08l0J54n5Q1l83K68j07
4910Gj05J87k35K55j42J3q1L81r9k34r9J13R2n6M3k76J61o2m6R9L10k10J62J91
4934C69k82O5j52p2Q8rp2k70M89n00K64L4J88k41p3N5m8K70l87M73j60m0r7j48
4958b56K54O1nj71K96m78P6L10j73L6Q4q0L0n4J07r6P2J3j29J88j27k2j90J88
4982f6R9j66O0M5K5j6n4k10J14K17k0m7j19K31k85M22l19P7n9Q7q6N1K43n22K73
5007b5J09rl02n3L66J28m75J65K80j19r7k67L46j83K84j98J37k4N4n0L2K0j8L12
5031D13n49J62o9J52r0J04N2l31J41J14K1M7j76K76n72K74%K59m67O56k94j42
$$ plain form
4863 225 8 -49 -229 37 260 290 -50 113 132 143 -138 -64 61 -30 -247 -180 -36 195 -82 -18 16 -132 -52
4886 -52 -60 102 99 179 -65 -55 -217 -102 154 -211 -34 27 32 184 -104 -229 79 49 203 148 229 -154 114 7
4910 7 -98 89 -146 109 -33 -20 -101 280 181 -53 -152 -39 53 -3 40 -236 -75 -137 -183 -84 226 16 178 369
4934 369 87 152 0 -72 16 7 -65 -335 154 -346 -82 -48 140 -101 -174 -119 -167 103 -284 189 29 -11 -108 -256
4958 -256 -2 59 54 -117 179 -299 -223 87 -86 -50 34 -46 -16 -70 37 -59 13 26 -103 85 -42 -64 -254 -66
4982 -66 33 -133 -73 -28 -3 -19 -73 -283 -169 48 28 -19 -138 93 -192 230 -89 -12 -71 16 -70 -19 224 -298 -25
5007 -25 84 75 -227 -280 86 214 -261 -96 184 65 -32 -299 47 -136 148 -50 87 63 117 67 99 119 101 413
5031 413 -136 26 -43 109 19 123 175 -156 -15 99 120 167 -9 267 -305 -31 -31 228 -239 417 123 -19
5053a9J02n1K5n6j7j40J87l1j15K08j78j2J49k25K11m8%N1J67j36k2K5r3q1N7
5078d2K88m05K59o3j45J07K57l03j13L32j32O0k75j96K63P0j01j24M50m58K40
5099c1J59l4K06l05k3k73K70O0J49k38k02L46k16j4L3J15J29l23k5O8K59n9j40
5122h9j65J99J53q5O5j71n5LP1O0j84L65j75R9p8J07j89K12J03m24L9J1j26K51
5146cJ28j84L44Nj01k93Q6j0M6J84j88j94K88j66J01O5k87J24q8L52j71l29K40
5169e1M7k7J26k15K48l25J57p4K0R9P2q2j76L20J35k41M5p7l1Om8J80l90K36J19
5194G3m4M8L0j20j39P4j1l4K47j78j70K07J19n3J03k52K15k55nJ90N7l24J56o4
5218a30K01l39J1K91l1J02Pl15O1K03l8J6j09J99j35J79k6j55J39o6j28L2J52
$$ plain form
5053 -19 83 32 57 1 -16 -156 31 0 -115 93 -85 -97 52 -173 38 -10 -10 41 208 72 50 75 -18 -99 -42
5078 -42 246 -159 100 37 -108 -1 256 -47 -160 172 40 100 -175 -371 -108 -38 -139 -263 187 -271 -31
5099 -31 128 94 300 -5 -28 -301 -31 29 178 -60 -262 84 -132 -146 -113 2 131 -192 -217 -149 110 51 -89
5122 -89 -254 -55 98 13 78 -93 -148 -145 -74 -14 -198 167 -8 91 13 120 -69 143 246 -178 -139 -128 -254 -3
5146 -3 125 -59 285 290 189 -104 -18 -28 18 202 14 -180 108 -58 43 108 -179 -55 -143 209 38 -291 -51
5169 -51 -4 -31 95 -120 128 -197 -40 -114 -94 5 77 -5 -181 139 274 33 78 1 -30 -24 -72 108 -282 -46 73
5194 73 29 77 107 -13 -152 -78 -89 -123 124 -54 -224 -17 102 49 152 -100 115 -140 -145 45 102 -222 -66 -130
5218 -130 71 -268 -257 34 3 105 112 -203 -142 61 23 39 -70 129 -6 173 147 -8 131 65 -63 -31 121
5241A21l08L53k87J98l3l94L29p5L00j39r7Np2N9J30k10Q6k18K33j0L06m18R8
5264d3K33k45J54k06J78l24K89L53k35l21J16O6l00M10j23l2J63o4K7l0j17j05
5286a56L7L09m23K27L7j90Q0K37k31N7k17J9K89P4q4J8j15L04n23j97N15l6k62
5309b31M45j32l33J63j21L55l72R1J73k36K99k11K14J2k7j41M2j63J83K63j82
5330I1O6l02J98j30M4q5J88j33o8J52J02j40J02o8k84J92R2O8j63J23p6p7L6J20
5354D8K10m02R8J94m62J54M8L12l4k67Q2j30J63k6K03j97R9K45l94L0m3j10K78
5377I9rk64J89J48l5m4j25j34J65r2L29k22J08k02Q0J02j57m5po0J54J40j99n8
5401a39R5Q9q0k74L64K31k92j25K08k49K03k45J54j54L13o9k10J72j41K22l38
$$ plain form
5241 121 -187 166 -121 77 44 -350 -21 -96 204 65 -32 -27 -99 -40 90 -120 -34 -252 -19 -29 277 -141 -43
5264 -43 190 -55 99 -107 71 -253 36 389 154 -167 -51 15 -285 125 2 -30 133 69 96 66 -51 -156
5286 -156 -119 190 -233 -6 31 -159 -79 158 -73 -16 -233 -214 75 149 65 83 -32 272 -251 -448 67 31 -231
5309 -231 214 82 -251 -88 -209 146 -226 -135 38 -198 101 -110 104 116 89 -52 -10 -173 10 273 91
5330 91 157 -145 53 -77 -33 -118 70 -63 -131 21 123 -17 85 17 -267 -75 17 85 -78 45 -31 -108 -72 48
5354 48 258 -144 -46 148 -314 -160 -112 200 166 -101 -19 -149 14 -12 191 -6 93 338 -56 -26 -69 -179 99
5377 99 90 -174 15 163 128 84 -41 -175 -10 -102 227 5 113 -89 -9 93 -64 -109 -116 -176 -22 118 -81 -139
5401 -139 -44 45 -35 -309 55 286 -6 -131 77 -172 31 -214 -60 -214 99 30 -180 -8 -149 73 -265
5422b65J63J5J57j53K9r9K90k49j35K04n0j33L10r5J57j13k41J73K15j40J8j17
5444e9j32K47r2M5K7m6K03l95J43%M6K7K59m03J16P3j56Q3J00j1j56J0K68J54
5468C51n11n4K32J44n3j69N6p3l9K30j26J27J25p4l4k7k37N99m35j53Q6J03j64
5491i6O4J02j31J06k8k07L95k20J25J23r7J34j18l3Q8k45k17J81N5j35J19m7%
5514h2j01L17J19k52k34K27p8K61k82k06K26R2p6m4J42Q9R9K5k29Jp4j27L33K4
5538A70l07MJ12R4J26k18J22l54K42l3J04j24j3J06j25L88l87K10J24j54m84N00
5560A03n6j32J52L04o71N36k81j10J78N2K9J94m25K71m4Nk4l7k41J13L22k63j80
5583b05L35l8J4k52q2K06q7O2o6K39l7L7J16p2k05m6J35ln68K88K89o3J29k41
$$ plain form
5422 -265 -102 -87 70 -83 -54 -153 137 -112 -247 -43 -93 -226 84 -11 146 33 -208 -35 180 40 58 -59
5444 -59 -191 56 -36 9 36 -10 193 -202 -59 -59 -13 14 273 -130 -14 59 -97 -14 86 75 -81 -71 197 351
5468 351 -160 -214 18 162 109 -60 -4 -77 -116 114 -12 115 240 166 132 105 -132 467 32 -121 -35 68 -96
5491 -96 -32 70 -61 45 17 -190 205 -15 110 233 136 270 152 119 207 -38 -255 -74 -19 -154 -35 -82 -82
5514 -82 -183 134 253 1 -233 -6 -84 177 -105 -311 -85 7 -69 -113 29 118 217 242 13 14 -60 -187 146 170
5538 170 -137 -133 -21 73 199 -19 103 -251 -9 -42 62 -62 -75 31 -94 294 -93 117 241 87 -397 103
5560 103 47 -85 67 371 -300 236 -45 -155 23 75 104 298 -127 144 100 105 81 44 -197 -84 238 -25 -205
5583 -205 130 92 106 -146 -228 -22 -109 -47 -113 126 89 126 242 170 -35 -81 54 51 -517 -229 60 -3 126 -115
5607a15L78m18Q6R4q5J9Q0r9j05J51J56P5m20L72q6k84J08K35K22m97J38R9M6
5630A50j07Q5K64l40J02l34K09n0J95j36M7J28k76QK62o28N05j06k03J41J45j15
5652e4OoJ08r3J34k09L87l59Q6J57j86J3R7k79K22J5J89m30J98r5J06r4n1L06
5676A68l16P0J94k96l4J99J26j32l67N14P3J28l14J29k27J32o5K9P1J5j32K40
5698B05j22o3L6M7l9q9o2J52q7n1J60j20J29k30k69L01L5P2J04k94L16j25Qj2
5722BJ20j00p5J61j79k5oo2L36N3k72P0K69m03J93j54L3P6m8j81L35o8J2j55o0
5747a28K75l2l19l4L73k17P1n8R9K7l3k49K59j37J32K59l43J11k18K22P6Q9J6
5770B41j44k96N18l20K3q4M08l62j5J2m4K6P8Q1j39K03m41L26Rq0j7O3k08K63
$$ plain form
5607 -115 263 -155 -69 25 -60 -41 39 -60 -165 -14 142 217 -203 169 83 -201 -93 142 364 -133 5 104 150
5630 150 43 128 392 52 154 -180 29 -21 174 38 85 213 -63 -55 207 -421 84 -22 -225 -84 61 -54
5652 -54 -48 -54 54 -39 95 -114 273 -86 0 157 -29 -16 81 -198 24 39 228 -202 -4 -99 7 -87 -138 168
5676 168 -148 -78 116 -180 -214 -15 111 -21 -388 126 199 327 13 142 -85 47 -18 11 82 97 -35 205
5698 205 83 20 56 103 64 -25 -87 65 -22 -73 87 -33 96 -134 -403 -102 -67 5 109 -185 131 6 14 2
5722 2 122 22 -53 108 -71 -96 -102 -164 172 225 -47 23 292 -111 82 -72 -39 37 -11 -192 143 75 87 -68 -128
5747 -128 147 115 -204 -238 135 -82 -11 -69 30 57 24 -225 34 -103 29 288 -55 56 -162 60 136 225 241
5770 241 97 -199 319 -1 22 -62 346 -16 -31 -19 -63 -37 41 122 -17 186 -255 71 80 0 -17 46 -162 101
5794A01j34J38j27k7R4j05j93M37j75k66L62J0Q0j62j1J47r1k86K28L6j97J56
5816A5j71L6j06O6k12L29L76k41O3n47M93R4l82L33q1o4j04J54j38l7l3J98m7
5839fn1l4J2K56m97M14P1k1j09j7K05l72J49j13J82Q1o9m2l3j38m0K01M34m46
5863A7j04J75N2j74l54N28k88J89j94m2K9j54L64m6K02j36m2J15n6K8m0j68J94
5886I5j91N9o8O9Q8j80J56N9k24J08J23k3j98N1PK05k1Q3j88j28J31k64K48Mo
5911eJ18Q9l12K32j35O6K52l82rj51J42L24j30j48J71j23R8j43M2K51n28L42j66
5934a05R6l2K28J36m16R9j35K84k65J48l2J44k20L37l99L00l03Q3o8MJ99j00N2
5957C5l11K14K35l58K8M28k97K46m35N6J28K22j05o6m7j33K60J16k99J20J95K9
$$ plain form
5794 101 -33 105 -22 -49 45 -60 -253 184 9 -257 105 115 195 33 22 169 78 -208 20 56 -141 15
5816 15 -156 -120 -226 -160 -372 -43 333 92 155 -392 101 195 -187 146 65 1 -103 51 -87 -124 -157 41 -6
5839 -6 -57 -91 -79 177 -320 94 165 144 35 18 223 -149 0 -113 69 150 81 39 6 -132 -172 29 463 17
5863 17 -87 88 140 -34 -388 140 -148 41 -153 -195 -166 -320 44 -2 200 64 22 137 81 109 69 -99 95
5886 95 -96 -37 -105 -36 52 -128 28 87 -137 -29 94 71 -127 -76 -69 136 115 198 10 -118 13 -251 -3 1 -5
5911 -5 113 202 -110 122 -13 53 305 -77 -86 -237 -95 229 99 -49 122 -1 97 -46 -4 247 -281 61 -105
5934 -105 -9 -41 187 323 -93 6 -129 155 -110 38 6 150 -70 267 -132 168 -135 -52 -120 -116 83 -17 35
5957 35 -276 -62 173 -185 -157 271 -26 220 -215 -159 -31 191 86 20 -27 -160 100 216 -83 37 232 261
5979B61m65L10j60n1j50K67j0K07j69K07m47P5K38j21N0k86L10K57o89M64m7J02
6001A53j85q2L7K7J05K4k59l2K35K2j84K60k66L27k20N0P3k3j68j44L73Lj40o
6025b0J42l8l0J64j43J75k99p0P2J97j24J36j09j28l6K70j93j16J9J85l5p2K09
6048A56l38M10M9k64R8j76L61q9j69N4J71l72K88k61O7j44L14k06j54K20j04K5
6070f4j96K81jM0k01K17j77rL50l17J20Nl40N65l01N0J20k56K21j61j67J76j44
6093a89L29m7q5k37L92m05K67J0j94K45k76J51K01R8m58L63Qk98K8k5N14l76k64
6116b48M17j22J31k35N0L27n49L11L1p8k26K68k55K87k06J93l5j85K03M5j53j11
6138a40L19k33Q8Rj43K01M6j03k7L0P2k62K0j94K9K91o0p4J90j11j24M33l23K43
$$ plain form
5979 261 -204 106 -54 -105 -255 12 2 209 40 247 -200 -125 113 -8 42 -244 66 323 -366 98 51 153
6001 153 -32 -114 -77 -50 55 79 -180 -212 23 45 -139 121 -145 182 -38 12 85 62 -106 -250 123 126 -14 -20
6025 -20 122 84 54 218 75 250 -49 -119 -47 150 26 162 53 -75 -111 159 -34 -150 -131 54 19 -53 156
6048 156 -182 228 277 13 111 -65 296 207 38 92 263 -109 179 -82 -15 -159 155 -51 -205 15 -89 -64
6070 -64 -260 21 20 60 -141 76 -101 -110 240 -77 43 48 -292 273 -28 22 142 -114 107 -54 -221 -45 -189
6093 -189 140 93 8 -229 163 -242 25 35 -159 86 -190 -39 162 260 -198 165 173 -125 -97 -122 392 16 -248
6116 -248 169 47 178 -57 -7 320 -229 82 113 35 -191 77 -178 109 -97 96 61 -124 79 124 -29 -140
6138 -140 179 -54 34 43 -100 101 147 44 17 47 119 -143 -123 -317 -288 3 -57 -131 59 -52 -176 257 -66 177
6162A77k34p9j1L51j14O2k77J05p4J02m6Q8k69L10o0p3J74m4o2k42M35j66j63
6185a10K32r0j89Q6p0Q3o1J76k30M51l36N4j72J63K0N8R7j53K5J39j03p7L8r5
6209f4M9q2OM83m30n5M9J46nj01j4J38k13J76k04R4J3O5j40J02k9J33j00r6J93
6234A14j7j28j85J01K04l4K5j08p4j63K52M4k98K81O4J73k42J71m46M50j2j87
6256a5L3J7R9r4R3l45J14J28l1o6J42P5Q1l33m0pR6q7J62j21N9l9J20m0j99J76
6282b2M3q4j54L04j30J45r2M1k08J68j80K33j33M7Q5l04L07r2N2O8j57L26q1j62
6306B0L7j56pJ80q8j37J80J97m49K49J30k03J26k12K29j04P8J38k23J06J11l16
6328a14KK13j31L16n59J99J70j43j55O5J61J84j27j81M9j0K9j40L72J1j64l4J61
$$ plain form
6162 177 -57 -136 -147 204 90 152 -125 -20 -94 8 -38 50 -219 91 31 -42 132 88 26 -216 219 53 -110
6185 -110 122 32 -157 -71 -141 -58 -119 57 -173 278 -58 -4 -176 -13 7 65 162 9 34 173 70 -7 31 -64
6209 -64 -15 -97 -91 392 -38 -93 -44 102 97 -4 -18 120 -93 83 -121 -27 -14 51 -89 13 -16 117 17 -79 114
6234 114 97 -31 -216 -115 89 55 80 -28 -102 -265 -13 31 -267 14 78 251 9 180 -266 184 172 -15
6256 -15 18 35 134 40 133 -212 -98 30 -1 -67 75 150 231 -102 -142 -149 -53 -140 22 -99 -40 -79 41 1 -198 -22
6282 -22 21 -63 -217 87 -43 102 10 51 -157 11 -169 64 -69 -22 63 -241 66 -26 26 94 -63 263 182 20
6306 20 57 -99 -106 74 -14 -151 29 226 -223 26 156 -47 79 -133 96 -8 70 208 -15 91 202 -114
6328 -114 -112 101 -30 286 -273 -74 96 -47 -202 -137 24 208 81 -100 -51 -61 -32 -172 200 211 47 13 174
6351A74m1Q5j59J00J6k81O3L14j99l00M33l55K4J12RK34k13K07j81J11k46j78
6373b71J26L29l82K27k19J83j6K3L7J30J90k79p8lL7J46k20j1L93k85j58N3j16
6396a64K28p3J4K17l5j18k07K27j48k70N29j13k73J96K0o3ML28j98l65J27j58
6418b95L13ml66K67K51l97M64j94l2j82J65K48n1k06K7O6m4k57J09L57l30j51
6440b42L17j91j4L12j95m0K51j95j28J36j4j04L35j63l30P4L39p1J1oj38q9o0
6463b05J25N0Q6nO0l54K53rJ46j43J46o2p9k0J64r5P9jj8p4r0Q4m33L50K20k3
6489A52m2k71K75j14J33k00J3J36j30L2J69j92J26j92L48n06N33k07K34j33j17
6510D7J24j93j9k53L60J71l55J36o7Q6k23J06J62j95K83k11K14j59K84k79K85
$$ plain form
6351 174 133 218 59 159 175 -106 -43 271 72 -228 205 -150 -126 -14 -5 229 16 223 42 153 -93 -271
6373 -271 -145 184 -198 29 -190 -7 -23 0 37 167 357 78 0 -3 34 180 -40 -51 342 57 -101 -48 -164
6396 -164 64 -9 5 222 187 69 -138 89 -59 -329 200 87 -186 10 30 -33 -29 299 101 -264 -137 -295
6418 -295 18 14 -352 -85 166 -231 233 39 7 -175 -10 238 187 -19 8 74 30 -227 -118 239 -91 -242
6440 -242 75 -116 -130 182 -13 -53 198 3 -125 11 -3 -107 228 65 -265 -191 148 77 88 82 -56 -145 -205
6463 -205 -80 -30 56 51 111 -243 10 1 147 4 150 88 9 -11 153 58 137 136 118 44 -46 38 -395 -45 175 152
6489 152 110 -161 114 0 133 -67 -54 82 -48 -16 153 -39 87 -105 243 -263 270 63 297 164 47
6510 47 171 -22 -41 -294 66 237 -118 18 -49 37 -186 -80 82 -113 170 -41 173 14 298 19 304
6531C04j90j93J15J21K4m55M1L41m12L75r9O1j39k6J17n2l9L3j92J39k8R2Q8j70
6555a44J33N9O0R1k58o5J98kJ5n9L0m1j04J23pm0J8Q9l3l27K49L3k60M30j86J07
6581A09n7J87k89J71k28J16J37j42j56L80k78j34M05j09j5j74M8r9K56n0p9qk4
6604c3Mj5L7K02j69N1j04M4J00k40j25L34j07Lk51K58J27r5%L7j51J97j63j12
6628a71L21l43J08K15K9l89K11kM4q6K9q6J44J39l93K60o3k51K33K4L8J2k07J20
6652f4j85K91k05R3j32Q8J32J73o3j53J69j71q5j54J56r3L94l96J17J24L82n71
6674a53J94j37K17j33K8K65j29M4j37p1l9Q6k1J22K8k02J16j70j85J69OJ87k1
6697F4N1o8K7R7m00K43q9M79j58j75j01k17J26J29K87l40J32j10Q3k22l5J67J13
$$ plain form
6531 304 114 -79 36 157 181 -274 -233 108 -304 71 -28 33 -106 -132 -15 -67 -106 -73 -265 -126 -154 -62 26 -144
6555 -144 -11 48 108 199 -59 -124 74 72 87 28 58 17 -87 36 29 -11 7 96 63 -264 -15 18 -242 188 2 109
6581 109 52 239 -50 121 -107 9 146 4 -152 228 -50 -184 221 112 97 -77 -29 -128 128 78 -1 -9 -33
6604 -33 -29 -44 -7 195 26 77 -27 17 117 -123 -248 86 -21 -18 -269 -11 116 21 21 58 -93 104 -59 -171
6628 -171 150 -193 -85 130 159 -230 -19 -21 23 -63 -34 -120 24 163 -230 30 -33 -284 -51 -27 11 23 -184 -64
6652 -64 -249 42 -163 -70 -202 -114 18 191 128 -25 144 -27 -112 -266 -110 -203 191 -205 -88 36 418 -153
6674 -153 41 -96 121 -12 16 281 152 196 59 -12 -51 35 14 136 164 -38 78 -92 -277 -108 -102 85 64
6697 64 115 47 74 171 -229 14 -75 404 246 71 -30 -247 -121 8 295 -45 87 -23 60 -162 -197 -30 83
6720H3m7J41k88J89q5N6k62L66k62L45l41L07j5q1p5O5k15L84l07p0K29n0k41
6743a74p5J31m3M0q0M47l36J70J3j77L8K3ml1J89m18L80j69Q3O3Q5J5k87K25j36
6768b8J71k39K33j89o4j11J97J4k8k03K84j30N4K16J6K4j36k11J12j77J5K77q3
6791A4J75l13J89p4L38k82J27o4J19k5k86rJ74J15m8r6J16J24n21J78J52k9j47
6814g3r5K50M6k11J41rr3P7o4J05q3lk3k3P9k15K23j58p4K40q8j49K01K39j24
6839A16j06m02L26J77K6J38m64L95k08r4J04K7o3j5K05j09R3l60K18o9J62k70
6861a73K92j53o0K86k65P0l2j30J61N4J10m13kK39J49Q5p0j40R1k36K81q7k27
6884a70J35K34j40k13J33K9k1K88l51J04K5j15q3L33k6o8R5n2j15J09j65J16q9
$$ plain form
6720 83 36 177 -111 78 -7 49 -213 153 -109 236 -105 202 187 106 31 96 -119 265 -42 -112 117 67 -174
6743 -174 -249 -118 -161 -121 -201 246 -90 80 93 -84 -46 -23 -27 -58 131 -287 93 -76 7 70 155 170 -117 108 -28
6768 -28 143 -96 137 -52 -116 -227 -30 -16 -44 -247 37 -93 -39 177 193 217 81 -130 -18 -195 -180 97 14
6791 14 189 -124 65 -9 329 47 174 110 229 204 -82 -91 83 198 150 54 170 294 -227 -49 103 74 -73
6814 -73 -168 82 128 -83 58 49 -44 33 -31 74 -9 -12 -35 -58 21 -194 29 -129 -203 37 -51 -200 1 240 116
6839 116 10 -392 -66 111 137 275 -189 206 -2 -96 8 35 -28 -43 162 53 146 -214 4 -65 97 -173
6861 -173 119 -34 -94 192 -73 -3 -35 -165 -4 50 160 -253 -255 -16 133 218 148 8 99 -137 144 57 -170
6884 -170 -35 199 59 -154 -21 8 -13 275 -76 28 53 -62 -145 188 162 94 189 137 22 131 -34 82 -7
6907gP8j5j00K16j21RK2r9Pm3L74m6l69J25M0j94L19p2k4q2k25J03J57k02K05
6932E6k65J82K75j96j46J58j22P6j24o6L51k54K18j06p8j07K32L0o4Q8r7k05K
6955a62L3n6p9M33k51J73Q3k22k33L88l21L89j31L8o5n4j87J10N2R4j0j42j9J82
6979D3m9J00k15J16J40k15J9k33K61p7mJ97l07L45l03Q6K37n32M23k02L31n32
7001c71M66k40J69j48K10j31L09q2K0Q1k90j1j81J60K4j60N7RJ95N9j31p9J45
7024H0j98k20K75K04k69K7J56k3q7K15j15k18Lj17L32j63K55p7k3PJ50j76j48
7047a30J07Nj01K28N1J7j39p8K01j54l28L11L3q0L17p6m8k16K71p9j15m1m2K85
7071A99k09K46k88Q1o5k1J16j13O0J8k40L19q8j13O3O1k3J10k43j9M0K59j74J41
$$ plain form
6907 -7 71 56 -44 172 51 60 82 -17 -10 -53 321 275 -94 31 71 -123 196 124 100 18 -207 -104 53 -149 56
6932 56 -209 -27 248 52 -94 64 -58 18 -106 -172 179 -75 143 37 -41 -148 84 114 50 138 41 -164 -162
6955 -162 -129 -185 -264 169 -82 91 174 -48 -281 107 -214 175 44 82 17 -37 -224 -114 -62 32 22 -120 -139 43
6979 43 -6 94 -121 -5 135 -80 -61 -294 -33 -110 -114 83 -224 121 -182 -96 141 -391 32 -170 161 -371
7001 -371 95 -145 24 -124 86 -45 264 182 202 283 -7 -18 -199 -39 -15 -175 -118 -109 86 145 14 -65 80
7024 80 -118 -338 -63 141 -128 -101 55 32 -55 160 45 -173 -170 -287 45 -118 137 60 37 44 194 18 -130
7047 -130 -23 -18 -119 109 160 177 38 -40 161 7 -321 -10 23 -57 260 184 136 -80 191 112 -3 -44 -86 199
7071 199 -10 236 -52 29 -36 -57 59 -54 6 24 -216 103 15 -98 -35 26 3 113 -130 -149 -109 150 -24 117
7095A17O7k10J37j8n7n0N4j12M5l34K37Q4N2k66L55R4r0k74m0L76k29L21m18k02
7119c61M9K05J67j67M6J18K47l85J61l21L69k01l5K77o8l4Q2j43j09K84k05j13
7141a37j11N90k85L8j85J33J54k56Qj42L26j60j31L99m97K46K1J7k0j03L40k86
7163d1K02j42o7NJ33j98M4K2J7r4J48J4k1l5j66K88L6J16m24L2K72j07M4N8l99
7188b63N18k99MJ11oJ1j31J46j3J05Jl60L8J5J90p4J00p2J07j33L7N5k54J48j2
7213c1K08k24K02k64Q1j78L49j04k03J29K01l07J41J88j56K83m25K94l45L7K02
7234G8m3n6J41p1J26j73k16L58l4l63K53k4J47j57K47j09l0k46K70n9k58J23J68
7257G2l9o8N3j57J92j71K56n2p1jL5j8p7J18N1k5k47J05K53p7r5k38M01j37n7
$$ plain form
7095 117 184 -26 111 93 36 -14 40 -72 -27 -361 -124 -40 12 -254 101 195 105 -169 -209 167 -62 259 -159 -361
7119 -361 -312 -107 60 -107 -61 57 304 -81 80 -241 128 -73 -108 169 101 67 149 6 -103 181 -24 -137
7141 -137 -248 342 57 95 -90 43 197 -59 -51 -193 133 -27 -158 241 -256 -10 11 28 8 -95 245 -41
7163 -41 161 19 -48 -43 90 -108 -64 -42 -25 -119 29 43 22 -13 -179 109 145 261 -163 -131 141 34 78 136 -263
7188 -263 255 -44 -40 71 65 76 -55 91 78 183 184 -176 -138 -123 67 -7 93 21 128 -5 32 87 -167 -19 -31
7213 -31 177 -47 155 -109 -28 -206 143 39 -164 -35 166 -141 0 188 32 315 -110 184 -161 -124 78
7234 78 35 -21 120 49 175 2 -214 144 110 -253 0 -24 123 -34 213 104 74 -172 98 39 -219 -96 72
7257 72 33 -35 18 -139 53 -118 138 86 15 14 49 31 -46 72 123 98 -149 -44 209 132 37 -201 200 63 6
7282FO9J51j55r2L6j4r1M75n90M58m15K95k73J6K20j96R0j2k52M06k61J70j15
7305g4l7l5L51j14l72J84J74m19J85L65j66Q7j35J2P2M4j25l0K49k47j34N7l6
7328a44q5N19m18J91l5m9m8k9K82k53K01J90k13k63K08o1K11k07O3mn6P6J74q3
7352A67j64K66j97p4k04K75J43j52L1j4R3j30J11l06J82J0j62J53j06K85j62J2
7374E7n58L75P3J21k26L22l10K28j52L46k00r8r4P2j41M54j90J64k25k25L62j78
7396b3O1KJ24j02r1Q3l3j83J20J31K9k39p1L94j71j26O2j98K08J36o33P07q3j42
7420c8P2k43J84J66p3l91K96Q6j84Q0j11M7K17j09q0N32k81l72N4J53j98K41J24
7443A72J1j34j53l7Q1k2J54j70j41K38q8K44k75J22p7J44L9q7K17j99K07l36L27
$$ plain form
7282 6 75 226 71 -21 15 1 -90 385 -205 253 -162 133 -140 -124 96 -100 -10 -22 -274 132 -129 41 -74
7305 -74 -111 -146 205 91 -281 -97 77 -342 -157 208 42 129 -6 6 78 122 -3 -33 216 -31 -165 -108 -144
7328 -144 -229 290 -128 63 28 -21 -69 -98 184 -69 132 322 109 -154 54 -7 204 -3 60 56 0 76 250 167
7352 167 3 269 72 -2 -206 69 212 60 91 77 170 40 151 -155 27 37 -125 28 -78 207 45 57
7374 57 -501 -126 -53 68 -158 164 -146 82 -70 276 76 -22 -116 -44 -185 269 79 243 18 -207 155 -23
7396 -23 38 40 164 62 -29 54 21 -162 -42 89 118 -121 -192 202 31 -95 -33 -231 -23 113 -520 187 104 -38
7420 -38 34 -209 -25 141 68 -323 -27 59 -125 -45 -156 -109 108 -1 -81 451 170 -202 -148 5 -193 48 172
7443 172 183 49 -104 -141 -60 -82 72 -98 -239 -1 -89 155 -120 2 -75 69 108 21 238 39 246 -90 237
7466B37m60m6K24j56K4J07NJ94j5j59K07l52K39m8j21J75K37k40q0j33K55q6K2
7489C0j19K05l74L01r9j7L03j88J4n3m2M9j31J77J24k42J43o3J87j48p1K1R0j99
7513a02j27K12J39j71J1K60j65N7j12j30p3K77l0k83J14K8J25o7k47K59j82K07
7535@j53J68Oo3L8J13j62P0K22m7l82J89mJ93l13K2J03j50j59M83j73l75K05j15
7559b84L81k48J11l7R6K42k80J31n5O7l67J56K93k54J29J55l74Q0N1j51L40j91
7581ij48K04j5%J6j44K4K00j33J41k18J45J51k98j4J41k3j38M2j23O0J24j61J12
7605f4N3J51J56n63K28j75M58j84r0L19n11K49M2q5oj89K68Nq5j18K28N1l6Q8
7629A90k94N7j06J90J1k0P2n8n6k90L37J72m76K09J98j61J8J19K5k81k1K12k22
$$ plain form
7466 237 -223 -269 -45 -201 -177 -70 -65 129 114 -45 162 -190 49 1 -120 55 292 52 -28 -161 94 8 30
7489 30 -89 116 -258 43 -56 -73 230 42 56 3 -39 10 -121 56 180 -62 81 18 205 57 -14 7 97 -102
7513 -102 -229 -17 122 -49 -38 222 57 114 2 -128 -201 76 46 -237 -123 -95 30 -37 -284 -25 -207 0
7535 0 -153 15 21 -42 -4 109 -53 17 239 192 -190 -1 -5 188 -125 -103 0 -150 -309 174 1 -374 -169 -284
7559 -284 97 -151 -40 -77 19 261 -19 112 57 124 -243 -87 206 -48 81 236 -138 -58 -7 -158 182 -9
7581 -9 -157 47 32 32 48 -96 -72 128 -5 136 -82 63 214 -84 -98 43 20 -118 -76 -199 -139 -15 -176 -64
7605 -64 -11 140 296 -267 -39 -214 244 60 -30 289 -222 27 69 -16 -22 -211 57 62 -23 -141 87 138 102 190
7629 190 -104 -47 -153 37 48 28 100 42 -14 -304 33 205 -271 -62 136 -25 -7 112 137 -144 -165 47 -175
7652a75n0K35Q3j11k33L84k60J40L0q4onK27m32K52r7J02q8NR9j5k9j10k5K34
7677G1j34LK07nj94J60r9%j8K26k79J03q0Jm9OJ49l72L88Km7j26J52J57m96N72
7703B98l65J78l51K30L67l44k22L29q7m0l5k1J01L6l3J05p8j67R8k08K72L7r6
7726Dj04r5K28Q3l09R6K05M4q2L1J18m58L87Pk19J78j53qpK18n0m15M84k00K52
7751B35m16J70J68k30P1k51M81j86P9q1l55N88k09J82j14j05K52k25p9J32k44
7772a37K5Q9o9l5L49l16j51M30j37J42j99m5J39o9P4n2p2o3L6K54j76k1K00N1
7796B47m99M00Q8k05p2j6N7J26j48Oo2L17m00J33j5J78k49mN3K42l9j60k01L7
7820a86K58R5m36L61K51k93J73j47J8j02K8k17L31J10k04j65J81o9Pp5J44k8j26
$$ plain form
7652 -175 -225 10 93 -18 -251 133 -127 13 43 -41 -47 -52 175 -257 -5 -102 0 -88 -83 16 1 -28 -138 -163 71
7677 71 -63 -60 147 142 -52 108 9 9 -9 217 -62 41 -39 -38 -87 -81 68 -304 84 86 39 -87 65 222 -274 298
7703 298 -67 111 -240 -10 357 13 -209 120 33 -7 -42 -63 38 74 41 146 68 -99 -1 -209 63 100 4
7726 4 -100 -195 33 116 -193 -97 108 152 70 101 219 -239 148 155 -64 114 -39 -47 -54 164 114 -301 183 -17 235
7751 235 -181 -11 157 -73 -2 -253 228 42 121 40 -315 273 64 246 132 27 279 54 -25 107 -137
7772 -137 -112 -23 -92 -127 222 -94 -245 185 48 190 -9 -54 85 16 90 38 -34 -97 -61 193 17 -4 196 247
7796 247 -252 148 236 31 -41 -57 0 126 -22 -16 -78 239 -161 -28 -43 135 -114 -118 -65 177 138 -22 -223 -186
7820 -186 72 167 -269 92 343 50 223 76 94 -8 20 -197 134 244 40 -125 56 -13 -6 -81 63 35 -91
7843i1j15j8J05k25L51k05J38P7J49n3p5P0j51K11k87m7K52l11J13J90k57J10
7865f9K39k25k2o9K11j82J16K6n7J14K07K2k88j11Q1j0P4j02Kj8j11K33M1L3k5
7890A10J2jm39M25k9o7q9J52k27K78j16J46r2o3N2k41J41l4L84k78p5j36L68o9
7914A12o1J10n5m4p8j18O1K28j58J84k2k14J81j96o3K75j8k51o7J23m5N51n50
7937a15R3j87K62K45k45J26k74J02M6j39J18k25K70l91L18J07j83%J49J43j88
7958C2p2J09j00J11j48M3L63k58R6J05k75J21K03n55K97l58K24L49k69o4m1J20
7980C3K00j50J44m62K53J92k54k05J09J83q1n2K05r3k4oJ20j06p0l6J58j98J20
8003b0P5Qn2k03K18K59l49n3L23k2j39J99k82J87r4j8j27J0l6J82Pk51k18M15
$$ plain form
7843 -91 -206 -224 -119 -344 7 -198 -60 17 166 113 38 108 -43 168 -119 -166 86 -225 -112 78 -179 -69
7865 -69 170 -55 -77 -146 65 -117 -1 25 -32 82 289 311 23 -88 -7 -17 57 -45 -43 -61 -172 61 102 135 110
7890 110 122 121 -318 107 78 11 -78 74 -153 125 9 155 63 0 52 -189 -48 -82 302 24 -51 -187 181 112
7914 112 51 161 106 62 -16 -134 -73 155 -3 181 159 -55 126 -70 -133 142 124 -127 -194 -71 -116 435 -115
7937 -115 -22 -209 53 298 53 179 -95 7 53 -86 32 -193 77 -314 4 111 -72 -72 77 220 32
7958 32 -40 69 -31 80 -68 -25 338 80 176 281 6 127 330 -225 72 -286 -62 287 18 -46 -87 33
7980 33 233 83 227 -235 18 210 -44 -249 -140 43 -38 -90 115 22 -2 -8 112 6 -64 -100 58 -140 -20
8003 -20 55 63 11 -192 26 285 -64 -117 206 184 45 244 -38 149 55 37 -90 -80 -116 66 73 -178 -396 19
8027A9j52J42K20m2k26J47k42J05j1k45K61qOj02M77m6k68OJ13N8Q3j99J94m87
8051a97L92j71Q7k04o0J7R6J39k87K83j1J12k07k1n5KJ97j15N6j80J6j89L62l9
8075B3k50L04j93K85q5K58l52M7j40J26k93L41L7l38J90K15K8l17M15k44o6J60
8097A51o8m10M03n3J06k5qJ5r0l6k37L03k48L38k42J16l6j26K35m6P4k27J68j37
8121h0N0r8R4K8L2o7J07r5J10k80L81k52m0J37j24J67r8K75j96m9j1J80n8o2J60
8146B11l47k52N87k74K7L8L7j78L0J50J1j9o8K19k66Q8K8Q7r8N2j78K3n1K14k78
8171b07k3J76J63K64k88qJ3K35m66K00k50J76r3%K19j29l7l4N0j34
$$ plain form
8027 19 -133 9 229 187 -39 108 -134 -29 -40 -285 -24 -32 -26 -128 349 303 35 41 154 212 295 96 290 -197
8051 -197 195 24 111 -93 -153 -136 -40 99 -188 95 84 196 -11 -32 -87 -85 112 -3 53 -127 -111 -300 62 23
8075 23 -227 77 -116 169 84 342 -10 37 -103 23 -270 71 108 -230 -40 175 203 -114 301 57 -9 151
8097 151 83 -327 76 23 129 104 96 111 21 -15 -252 51 -197 141 -101 15 -21 -147 88 42 116 -111 57 -80
8121 -80 -30 -128 -34 -6 26 -41 66 -29 81 -199 182 -70 -110 27 -97 70 -28 247 51 2 -9 171 113 51 211
8146 211 -136 -388 199 -75 -48 -10 27 -151 -121 29 40 21 -47 172 -94 -6 22 109 11 63 -115 -92 -143 71 -207
8171 -207 -230 -54 109 373 85 77 90 325 -141 59 -191 -15 -108 -108 111 -18 -55 -89 -39 -173
8191a73
$$ Imaginary data points
##PAGE= N=2
##DATA TABLE= (X++(I..I)), XYDATA
0@%%%%%%%%%%%qJ6j6J6j6K4l2L9m7N6o4P2q8J04j24J48j72J96k24K56k94L38l84
34b04M34m88N48o15O88p68Q54r50J055j170J296j431J581j745J921k115K333k570
52a346K831l124L449l812M225m700N248n887O649p574Q723j0197J2167j4952J9216
67A0916k6632M3188j50063M3714J88637j91103j5198J21361L1638m1188J8703
78C3973k9474L4222O4121o6458r5838R5017L2615j37511p902J30558m2103r5505
90h4285M3397N5005k8015k8114r455M4235O3491l4246p0575O5425Q3869o5317
102C5415o2385O8818K6901o7648k3417J0889j4542k965j4767j6587M4383K6297
114A0392m7625J2458Q0992q081o2234L6000N8716m6091n1541K5165J0224k8780
$$ plain form
0 0 0 0 0 0 0 0 0 0 0 0 0 -8 8 -8 8 -8 16 -16 23 -24 32 -32 40 -48 56 -68 80 -92 104 -120 136 -158 180 -204
34 -204 230 -258 290 -325 363 -405 449 -501 554 -616 680 -751 830 -915 1006 -1109 1224 -1346
52 -1346 1485 -1639 1810 -2002 2223 -2477 2771 -3116 3533 -4041 4682 -5515 6652 -8300 10916
67 10916 -15716 27472 -122591 -78877 109760 -81343 -96541 24820 56458 15270 33973
78 33973 4499 38721 102842 36384 -59454 35563 68178 -69333 -77235 53323 11220 -84285
90 -84285 -40888 14117 -13898 -42012 -51467 -7232 56259 22013 -48562 16863 100732 35415
102 35415 -26970 41848 68749 1101 -22316 -11427 -25969 -28934 -43701 -60288 -15905 10392
114 10392 -37233 -24775 56217 48136 -14098 21902 80618 34527 -17014 8151 18375 -10405
126a0405j2735o369M450K1886q387j9882K3012K5717j7382j1706K6766J4295k3886
139E374o667K4436Q83k3062m802J2584K663j6805j6456Q381Q762j3423j0761J0590
153a8303J6809K208q384J1959K2624m418j2589R657P665j3825j6585q60J855j2176
167a4363j2448L692Q188K683l215K672J8476Q398j1570M100J6370m122j1668P58
181G951L148m894r396m393K035N46m245p874L474J1296n781q607J4835J1128q285
196I38J370J1793K589m113k443M45l0n187q958o034K020m28j1826R07J4203j374
212f128n535J1611R694k473J358M024L52j863k596m742k957O75m342q298L995
227g225M874r013j605J0177M85m303M694N037J069J071J799J125P32J099l400
$$ plain form
126 -10405 -23140 -29509 -25059 -3173 -11560 -31442 -8430 17287 -95 -11801 14965 29260 5374
139 5374 -1293 23143 24026 964 -3838 8746 11409 -5396 -21852 -13471 -4709 -18132 -28893 -18303
153 -18303 -1494 714 -7670 4289 26913 22495 9906 19563 27228 13403 -3182 -4042 -2187 -14363
167 -14363 -26811 -23119 -14931 -12248 -15463 -12791 5685 14083 2513 6613 22983 18861 7193 7951
181 7951 11099 6205 -3191 -7584 -5549 -5003 -9248 -17122 -13648 -2352 -8133 -16740 -1905 9223 938
196 938 2308 14101 16690 12577 10134 10579 10549 5362 -3596 -9630 -7610 -8038 -19864 -18957 -4754 -6128
212 -6128 -11663 -52 9642 7169 8527 12551 12903 11040 8444 3702 745 1420 -2922 -11220 -7225
227 -7225 -2351 -11364 -12969 -2792 -2307 -6610 -1916 3121 4190 5261 7060 8185 8917 10016 6616
242F616m298K477l471r305P8K181n748j435M705K679J604K839M349M696J057l48
258H676kM24p25o089l346J315l062m957J201R81q15J619N74J204L176j31j94L029
276B878J954p71j526K768J754m280p27J963k947l069q28k642o95N54j817P82L705
293b944J897J067J823M063J699k176R98J005m215k794j161k345j628j097l2J171
309d669J070J016J553J702K177M03r10P73P11k379m69k8k98l43q84O2M64j359
327a408p71J206j095k70k44K71J271O94P65J902J213J020K3j029J84q08l713n70
345a359r05k151n42M60O35J283J117J807K255O82Q77M14j060k88j375j614r96
362g60q48m51m64k87P20Q26m73J108J194q50K60O24o9j59N03M05K16Q4O21k2j322
$$ plain form
242 6616 2318 4795 1324 -7981 -7903 -5722 -11470 -12905 -8200 -5521 -3917 -1078 3271 7967 9024 8676
258 8676 8674 9098 8373 2284 -1062 253 -2809 -7766 -6565 -5584 -6399 -4780 -4206 -3002 174 43 -151 2878
276 2878 4832 4061 2535 5303 7057 2777 2050 4013 1066 -2003 -2831 -5473 -6168 -5614 -7431 -6649 -2944
293 -2944 -1047 20 1843 5906 7605 5429 6427 7432 3217 423 -738 -3083 -4711 -5808 -5840 -4669
309 -4669 -3599 -2583 -1030 672 2849 3252 2342 3115 3826 1447 978 950 652 309 -575 -513 -49 -1408
327 -1408 -2179 -973 -2068 -2338 -2582 -2311 -1040 -346 419 2321 3534 4554 4577 3548 3732 2924 -789 -1359
345 -1359 -2264 -4415 -4957 -4497 -3862 -2579 -1462 345 2600 3282 4159 4573 3513 3225 1850 236 -760
362 -760 -1608 -2059 -2523 -2810 -2090 -1264 -1737 -629 565 -285 -25 599 530 371 874 1279 1495 1579 2200 2178 856
383H56j4q35k161K25K9k070L81J206N25O11J243K112J53N23J217m58j620J82j206
402H99j984n19n52q16K19P29N5P14P76J128K19k7R81l62n57L67k92m30K5j05n88
423a20K96m56n93J30k59l97p3J81M32J72K15R05L08J128N21p31N84J2j862m56
443f3J34j431q72M58j25l72R27N68O4Q34J297J84n15P47l02j236N29k25j408K30
463e77J63k04n85K32K05k05J87N82k26q0R80J06m09R02J64j52K12j76k38l04q60
484b83M7n07p80M71j92l69P57O29J22O01O43r8rK06q8r40J9J71p50l25N81k83
506c77l17N09k50n76R18R1m45O65j03N6p8R00q6o49M01P4r37L14N81j653L69N44
528d9r46n1J258l63n49J356J98p63P50O77j523j13J217j119j161J268Oj385J347
$$ plain form
383 856 842 7 -2154 -1929 -1900 -3970 -3589 -2383 -1858 -1247 -4 2108 2261 2784 4001 3543 1923 2105 899
402 899 -1085 -1604 -2156 -2972 -2753 -2024 -1969 -1255 -479 649 868 841 1822 1460 903 1270 978 548 573 468 -120
423 -120 176 -280 -873 -743 -1002 -1399 -1472 -1291 -859 -687 -472 433 741 1869 2390 1659 2243 2255 393 -63
443 -63 71 -1360 -2232 -1774 -1899 -2271 -1344 -776 -712 122 1419 1603 1088 1835 1533 297 826 601 -807 -577
463 -577 -414 -618 -1203 -971 -766 -971 -784 -202 -428 -508 472 578 169 1071 1235 1083 1295 1119 881 577 -283
484 -283 -236 -743 -1523 -1052 -1244 -1613 -856 -227 -105 496 1139 1041 1032 1238 1150 210 229 400 -350 -675 -94 -377
506 -377 -694 -185 -435 -1011 -93 -2 -447 218 115 171 93 993 907 258 659 733 -204 110 691 -962 -593 -49
528 -49 -995 -1046 212 -151 -700 656 854 91 841 1518 -5 -118 1099 -20 -1181 87 93 -1292 55
547E5J10q01O4J431p43o62R29O9p11O51j10p32P22N81j067J31O87p86l26N78k65
568a95q89P37L85n13J97O34k41j14J028k04p15M69J00j194k1K83n32J46J84j94
588f49k31J013J65o6K39K74l69r2L23m42p14N87N1m84N18k05j3L10j41k98J47
609g7K1j59q1K93q6J37mL71N8N7J67k97j48k45M6n66O1j10J8n0J86L23k01M47
633A61M18j76L76J30n90j95M1k85J79n18K80J83l82L55J30m36K70K03n91K20J95
654c2n9J50M6j33K35q9Q9j2J39j11l72j54N3n7k64L86J1j54K88K79j32K14N3j31
678B43J01l4j49j39m6k58O9j05L81l74O0K98J52j23p0K24k44k5J87j06l79O87
700C50j65l47L95J30l79R3Mk24L6r0l5J18j87n6M32j61J00K86j57J34K63l53p7
$$ plain form
547 55 165 -636 -572 859 116 -546 383 452 -259 392 282 -450 272 853 -214 -83 604 -182 -508 70 -195
568 -195 -1084 -347 38 -475 -278 356 115 1 1029 825 110 579 679 -515 -536 -253 -785 -639 -455 -649
588 -649 -880 133 298 232 471 745 376 284 607 165 -549 38 89 -395 123 -82 -95 215 74 -224 -77
609 -77 -56 -215 -296 -3 -89 48 44 415 473 530 697 400 252 7 53 -513 -452 -562 -544 -594 -408 -85 -286 161
633 161 579 403 779 909 319 124 165 -120 59 -459 -179 4 -378 -23 107 -329 -59 144 -447 -227 -32
654 -32 -91 59 105 -28 207 118 207 195 334 223 -149 -303 -250 -307 -571 -185 -174 -328 -40 239 107 321 374 243
678 243 344 310 161 22 -24 -282 -213 -318 63 -311 -251 47 199 76 6 230 -14 -39 148 42 -337 350
700 350 185 -162 233 363 -16 77 81 -143 -107 -197 -232 -114 -301 -357 75 -86 14 300 143 277 540 187 110
723A10j59j28p7k57K05M04k33R1L00j85M2J23L5n2J2j14q0j29l65R4J42K61O2
746A02k27K38o5j0j64j36K32J08p0p0K48k12P4L44m43L05r4m02J29R4j64k1m4
769b48M6%L30j35j52M25l31M19m05L7K47k46j87K36k63K22R9R9j51J9M69n82J60
792A08kk5j08J00o5LnJ61q3j73j55J06K56k80j39R2Q9j68K6O6j1L05R9J30j68
817A59j19J46p4L2k72j40J46M0k89L47j17J30L8l0L6J99l09l6K51j89%K00p1J
841G9K2l83L54k5j44j39M33k77k57rO37m56M62j01L7o2j79R9O7Kj87LJ73l28J01
866g8q5J2J70m2J68k73J20J5m2J19j35K90k19j53L71l35J91j05j56J26r2k56K41
889a48K17l00K89k42K61K0k39P8J31j55J22K17l76Q4N3j3k99M68k01%j79KK39
$$ plain form
723 110 -49 -177 -254 -511 -306 98 -135 -44 256 71 113 236 271 219 231 117 37 -92 -457 -363 -221 40 102
746 102 -125 113 48 38 -126 -262 -30 78 8 -62 186 -26 48 392 -51 254 160 -242 -113 -19 -183 -204 -248
769 -248 -202 -202 128 -7 -159 266 -65 354 -51 -14 233 -13 -200 36 -227 -5 94 193 42 61 530 -52 108
792 108 106 81 -27 73 8 11 6 167 84 -89 -244 -138 118 -162 -301 -209 -120 -288 -262 -196 -207 98 197 327 159
817 159 40 186 112 144 -128 -268 -122 -82 -371 -24 -141 -11 27 -3 33 232 -77 -113 138 -51 -51 149 78 79
841 79 101 -282 72 47 -97 -236 197 -80 -337 -346 291 -165 297 196 233 171 -8 91 158 160 -27 -24 149 -179 -78
866 -78 -163 -151 19 -23 145 -128 -8 7 -35 84 -51 239 20 -133 238 -97 94 -11 -167 -41 -133 -389 -148
889 -148 69 -231 58 -184 77 97 -142 -64 67 -88 34 251 -125 -41 12 -1 -300 168 -33 -33 -212 -210 29
912B9j01Q7P7r6o6K3O7J52m01K27j33K85j75K58k24Q6l7l17l6J69J28K5q1L14
936B60P5l88J42Q4l58j07N87k25j38J00L00j44l93M53l18rK34j01R6j46j67J10
958e3j44K85k95M28k04j02p9o1J99N2P8k43J33l4P9M3j09n5l56M35J2Q4j03j76
982a86J67o8J69j74K31k14r6M38l14J74O9l0q6j45K60k86J1J34o1Nl17K75P8O1
1006I5l71J55j5K31j72QJ32k03J01L0j81L75j67J03Q5k03j00P3QR2m4p9J7K97
1030B67j85k70J93J67j85kJ09j84Q4J80k55O8J10J12k32NJ19l64J99Q1Q6r6P3
1053H0J7l91K63NJ0k85M60j23j14K66k15M3n9O0J76m77L29K46l41M3N4j89J19
1076b3N5o2qJ31j62N0R8L4k38J57j3k56K58L8Q8m10M96l95K16L4k70J49oJ24K03
$$ plain form
912 29 -72 15 92 -4 -70 -47 20 172 -229 -2 -135 150 -25 233 9 95 58 -259 -295 -126 2 27 -54 260
936 260 335 -53 89 173 -185 -292 295 70 -68 32 332 188 -205 248 -70 -79 155 54 150 4 -163 -53
958 -53 -197 88 -207 221 17 -85 -164 -225 -26 26 104 -139 -6 -40 39 82 -27 -82 -438 -3 9 93 -10 -186
982 -186 -19 -87 82 -92 139 -75 -171 267 -47 127 196 166 80 -65 195 -91 -80 54 -7 -2 -319 -44 34 95
1006 95 -276 -121 -136 95 -77 -69 63 -140 -39 -9 -190 185 18 121 206 3 -97 -24 -16 76 32 -47 -30 267
1030 267 82 -188 5 172 -13 -15 94 -90 -6 174 -81 -13 97 209 -23 -18 101 -263 -64 17 103 7 80
1053 80 97 -294 -31 -26 -16 -301 159 36 -78 188 -27 16 -43 17 193 -284 45 291 -50 -7 47 -142 -23
1076 -23 32 -30 -38 93 -69 -19 79 113 -125 32 19 -237 21 59 147 -263 233 -162 54 88 -182 -33 -39 85 288
1101B88l08k78L54j21J69j39j99Q4J14Q8m2R2mp1j5j99K33k85P5j96L99k71M38
1124B06j68J13k38r4K26P6K98l94p5O2R7j43Q4l12M11l29J41q0%K28k05K2K96
1147B22k5k10R7j85K69j25l27O07m90J57k95M20N7l35M33l50R9j7k3O3K01j95
1169D8k9J16q1n1Lj97Q2J42Q7j7j40k66M62K84n35K19nj32j45M33k36K25m7n25
1193c05O59k06j38j36J70j4j02J49j65M0J25J42l98M6K21j18J6oK39j58M9j7j19
1216b6l5j47K85PJ20l07K66p6k61K56p2J1J43l26j4L42j05k31L49N7l03Q5R0m29
1240c21L18j43P7o4K46n5j96K85l06L11k54J98k66O3P8K87l42J48j18j73L67j61
1262b1r4K20j78Q3q9j8o0K15k29j29L95l5j38j0P0l71M69J25j96J23J11m65J52
$$ plain form
1101 288 -20 -298 56 -65 104 -35 -234 -150 -36 52 10 102 98 27 12 -187 46 -239 -164 -360 39 -232 206
1124 206 38 151 -87 -181 45 121 419 25 -50 12 109 -34 50 -262 149 -180 -39 -119 -119 109 -96 -74 222
1147 222 197 -13 84 -101 168 43 -284 323 -167 -10 -305 115 172 -163 270 -80 19 2 -21 42 243 48
1169 48 19 135 54 3 6 -191 -109 33 120 103 -37 -303 159 443 -92 127 122 -10 -155 278 42 267 220 -305
1193 -305 354 148 10 -126 44 30 -72 77 -88 -48 77 219 -179 -133 88 -30 -14 -20 219 61 110 93 -26
1216 -26 -61 -208 77 84 204 -103 163 87 -174 82 10 21 164 -162 -176 166 61 -170 179 236 -67 18 108 -321
1240 -321 -3 -146 -69 -133 113 58 -138 147 -159 152 -102 96 -170 -107 -29 258 -84 64 -54 -227 140 -21
1262 -21 -115 105 -73 10 -79 -97 -157 58 -171 -300 95 60 -78 -88 -18 -389 80 205 9 132 243 -222 -70
1285g0J20J17j58j90L16k15O7J9j6J75j01m1J76k2k13j66m7K51N5J67j20rk36
1308a41K5J29J47Kj42L3j5q2L4O9j15M9n3J44k28J14L7j57K35Mq9q0r1L51m43
1333b63L89k22J98L4k84R4J72r3p5J22j08j9j62K15J65m0j28K8K26k35k93M45
1355A66k25k4J7K6O9K42o1l54J80m5j14K57l1l6J9n3M9J45k15q1M7r1M03m52P8
1380h4J21J83l04L65o21K11J34l14J50m3J14J14j59J97J8q3L3q2R7j37J92k5R9
1403A76j30j06L5J95k2j17j98Q8J02J14q6J08K25k93k77K16N3p5q1n4P4J27j23
1426d9J74o1j66L13k01jj37j86L19j64K37j24K2k5K3K85n63P7N63l60K29O6k35
1449C6l05K50l8J75o7j62M9J24p8R6o4J19k8k68QJ41P5o4K10o6j79K77o5l34K60
$$ plain form
1285 -70 50 167 9 -181 135 -80 -13 6 -10 165 64 23 199 177 -36 -202 -249 2 57 224 104 95 -141
1308 -141 -116 13 160 162 20 53 38 -44 -10 59 -56 -7 -60 84 -144 -30 7 -150 85 89 0 -80 -171 180 -263
1333 -263 126 -96 102 136 -148 -54 118 25 -50 72 -36 -55 -217 -2 163 123 -5 23 249 14 -279 166
1355 166 -59 -83 -66 -40 29 271 210 -144 36 -9 -123 134 103 67 86 33 82 227 12 -69 -22 -113 290 -162 -84
1380 -84 37 220 -84 281 -340 -129 5 -309 -159 -202 -88 26 -133 64 82 -1 32 -50 47 -90 102 77 176
1403 176 46 -60 -25 170 148 31 -167 -79 23 137 51 159 384 91 -186 30 83 8 -73 -127 -53 74 -49
1426 -49 125 64 -102 211 10 9 -128 -314 5 -159 78 -46 -24 -49 -26 259 -304 -227 336 -24 205 271 36
1449 36 -269 -19 -57 118 51 -111 -62 62 -16 80 16 135 107 -161 -153 -12 63 -1 209 143 -36 241 176 -158 102
1474A02j22j9l34K26L12o6r5N7J68n61L08J37m2l1j84M0j32L25k55l9J46M4R0
1497G5j3j0J62O8l2j56j42R4k4m8J54l86J78q1o8L67j81K90n10J78J98j40O7k72
1521b32N6L33k13J72j19j06j22K33q3j58JL24J6r2M5j91p2J23K26r8k44P2P7J72
1545A20l9p1J39J13j39p5K0j78l7K59l00K97o1k19L16L6j44j73L95j98j62L0N6
1568a5J13m1k28K18j17J72k41m6J95K36k21j6l5P7o1j00J16L32l92M6k73J23K39
1591H1k84K68p3J15Q6k90J70nl8M3j0J62k37p9P2n0J30Rj75n2P7O1J0M5j59K68
1617A45J54k29j88L83k40J18m09L41n8o7j28M17l27J24R0k11K64k16J78l02L36
1638A75o1Pl88J88j96K55K8J07M3J3L0N8k30K45l29J32j44J3l5k90L69J14j92
$$ plain form
1474 102 -20 -39 -373 -147 165 99 4 61 229 -332 -24 113 71 40 -144 -104 -236 89 -166 -205 -59 -15 75
1497 75 62 52 214 282 250 94 -48 46 22 -26 128 -258 -80 -161 -229 138 -43 247 -263 -85 113 -27 40 -232
1521 -232 -176 157 -56 116 -3 -109 -231 2 -81 -239 -238 86 102 10 55 -136 -208 -85 141 43 -201 -129 -52 120
1545 120 81 10 149 262 123 48 68 -110 -147 112 -188 109 48 -171 145 181 37 -136 259 61 -101 -71 -15
1568 -15 98 57 -171 47 -70 102 -139 -185 10 246 25 9 -26 51 -10 -110 6 338 -54 -8 -281 -158 81
1591 81 -203 65 -8 107 193 -97 73 68 30 73 63 225 -12 -91 -19 -69 61 70 -105 -157 -80 -19 -9 36 -123 145
1617 145 299 70 -118 265 25 143 -266 75 17 -50 -178 239 -88 36 126 -85 179 -37 141 -161 175
1638 175 114 121 -267 -79 -275 -20 8 115 158 171 201 259 29 274 -55 77 -67 -54 -89 -379 -10 104 -88
1661h8Q6J76k63K56r6k56N73l66O1j5r9o6J95lL0J6J75l18j16J64j11q9mK31l54
1686b81K60l9J5M0j83J17R6j16q2K7K56j93J85L4j37j51M76j93j35l3J24k63J56
1709b0J53l15J99K15j84k07Q4j0Q0j6m4J92j5j37j5k82M99j10J68k6j55j81J92
1732F5q0K39j87Q9K38k33j45q6K06L6Nk13J69k83J94m9LJ94m38J48L4J89j45q7
1756a37J60J44J4j66l4M5J57j19%k0J75j96j38Q3K92j67l1k8j41R8K31l82J32
1779b8j00J02L4J33k70M7J45j31N6K11m52M26ql17K47l16K51j67m4M35l96oN4
1802i4P0J66m4o3J45j70l15M36j54L6K31k10k1p0O6K25j82j16J5j4j21K27l09
1825b66K42J17k5J74j11j47J19j11k16R7L29j24P0K9k46J72n1Qk10P2J22r6P5
$$ plain form
1661 -88 -2 174 -89 167 71 -185 388 22 83 68 -31 -97 98 95 125 141 316 -2 -118 46 -65 -154 -158 73 -281
1686 -281 -21 -60 -45 -5 -188 -71 25 -91 -173 -146 110 -83 102 136 -1 -152 324 131 -4 -37 87 -176 -20
1709 -20 133 -182 17 232 48 -159 -75 -85 -5 -21 -65 127 112 -25 -40 -322 177 67 235 209 54 -127 65
1732 65 -15 224 37 126 364 131 -14 -100 106 142 147 -66 103 -180 14 -35 -32 162 -276 -128 -94 95 -50 -137
1756 -137 23 167 181 15 -19 26 183 64 64 44 219 23 -115 -32 260 93 62 34 -107 -9 222 -160 -28
1779 -28 -128 -26 8 141 -129 -82 63 -68 -12 199 -253 173 165 -152 95 -221 30 -137 -181 254 -142 -148 -94
1802 -94 -24 142 98 35 180 10 -305 131 -23 13 244 34 13 -57 9 234 52 -64 -49 -63 -184 43 -266
1825 -266 -24 93 68 242 131 -16 103 -8 -224 -127 202 78 148 177 -69 103 52 60 -150 -78 44 -52 23
1848B3Ok07J59l9K3N9l3L43l33K05m43L20k0j11J73j88P6k0L66n40R6pk0K06m09
1873c15L52j9m9J33j03j18L9OO2J15l20J21K1N5m7O7l4j39M49m78Q4K06k21J37
1897Do7P1o6Q0l65K95M53k23l20P4k0J67k79J31R2k02K41j86N8L7J87k62N6j40
1921a84L26K41l15J3pj78R8q7Q4J3n8P1J42J54l62J02N4k77J34j55K6K63J28k50
1945b4l01L08j32L37j19j49K53j9j67np0J09P2j00j34J17j28K24r9j16j4OK60
1968A09J1p1qj93J31l8M10j99k21j67N18m32K4J98o7j02O8N5K69k46o4M7j02q3
1992a53J75J19l53K96o2j4l06K70j0J72q2m5K20M4m63J48P5m7K52l86K48k55K12
2015E5j79L90l22P9P7M7k29j24J17K1J48l6j76M9L3J47n2j03K41j99k6J45m0O2
$$ plain form
1848 23 29 -178 -19 -58 -35 24 -9 334 1 206 -237 83 63 -48 125 -63 13 -7 359 -181 -85 -92 -112 94 -315
1873 -315 37 18 -31 102 -1 -119 -80 -74 -12 103 -217 -96 -75 -20 -67 0 -34 -173 276 -202 -118 88 -133 4
1897 4 -63 8 -58 22 -343 -48 405 182 -138 -64 -84 83 -196 -65 27 -175 66 -120 -62 -25 162 -100 -44 -184
1921 -184 142 383 68 81 74 -104 -6 -93 -9 4 -54 17 159 313 -49 53 107 -170 -36 -191 -165 98 226 -24
1945 -24 -325 -17 -149 188 69 -80 173 154 -13 -18 -88 21 93 -7 -141 -24 -152 72 -27 -143 -157 -151 109
1968 109 120 49 41 -152 -21 -59 351 152 -69 -236 282 -150 -126 72 5 -97 -29 26 295 49 -15 32 -70 -153
1992 -153 22 141 -212 84 22 8 -298 -28 -38 134 52 7 227 271 -192 -44 31 -16 236 -150 98 -157 55
2015 55 -124 266 -56 23 100 147 -82 -206 -89 -68 80 44 -132 -83 -50 97 45 -58 183 -16 -42 103 63 125
2039A25l23L37J5k44O6j78K81j31J24k98J11J16m4j5M1K41l15k7PJ18J24j31J83
2062A83Mj21l4l13M86k25R6o4j16q5L70o4P2j91J25j56k27j57M34k3p7j36m6K70
2086El0K19k52O7N1l3o9k61K71K97k77j73j50L2K80Q1K7K01j70j67J87l6j83L82
2110B99j97m9j30L00k23j60l03L86L19n06J81K18k19j5O7R3O4j21k6o3pJ6K2K53
2134A99N7k58o5R8k52k1j4M06j42k26P0k5J01P9J88j03l12L32k13K21mq8o4n5
2158i1J02l53L47Jn7j36J31q7K41j12J13k07J34k81J22R9J58N7m5n4k25K40j73
2181g6L13k58j73K37m81O30k17L7Ql7oj65K20m6J62j69J34k9k3m12L25J76p9j15
2205d4k3L30j85k84J43K50q4l9j72J2K6k23K67j91J62qj78J37L90k69j27j04O6
$$ plain form
2039 125 -198 139 154 -90 -24 -202 79 -52 72 -226 -115 1 -43 -58 -17 224 -91 -118 -111 7 131 0 183
2062 183 187 66 32 -281 205 -20 76 12 -104 -189 181 117 189 -2 123 -33 -260 -417 17 -6 -83 -219 -265 5
2086 5 -25 194 -58 9 60 27 -42 -303 -32 265 -12 -185 -335 -303 -23 58 85 286 116 -51 136 100 -83 299
2110 299 102 53 -77 223 0 -160 -463 -77 242 -264 -83 135 -84 -99 -32 61 125 4 -22 -85 -92 -76 -54 199
2134 199 256 -2 -67 31 -221 -242 -256 150 8 -218 -148 -173 -72 7 195 92 -220 112 -101 120 116 28 -36 -91
2158 -91 11 -342 5 6 -51 -187 -56 -143 98 -14 99 -108 26 -255 -133 -34 124 181 136 82 -143 97 -76
2181 -76 237 -21 -194 43 -438 192 -25 12 20 -17 -23 -188 32 -14 148 -21 113 84 61 -351 -26 150 71 -44
2205 -44 -67 263 78 -206 -63 187 103 64 -108 -96 -70 -293 -26 -217 -55 -63 -241 -104 286 17 -110 -214 -148
2228a48R9j87K87P5K9k34J8k7J35j0M8j35nk0J34M3k9l41L66k9k67K56k43J3K69
2253I7O2j85j57J70r3o8J21J88l51L14N4m4l25m4K08n2J87k22J72n6OQ1Po3J10
2278A17j08j09K92k77P0Q1j32j01J93l6K67q3J01o2k34N5K09j30j51q3J13pK2
2301GK12p1k87Q2K3J02J07j14r0M9k43K63J61o32N28n5p0j3k9J35R4q0ol92K97
2326b2R8l7j03k15L04j16L1J57j89J94p2N7j62qm4K25N5m9J5J79j61j66L3J81
2350A85m33J3K74k30J63J3nJ10J01k73J33q2n0P3L03n38L95j7n1j67J28O0n1L
2374E7r1J55p0J20j92j93M15l19J19J6M3N4k69R8RP6j67J64J51m15N86l78j41
2397a72J81J16j29J55l79K52K5j6J05o3N9j93N6R2j86J40L3k47J79l1N9J91l6
$$ plain form
2228 -148 -49 -236 51 126 155 -79 -61 -88 47 37 85 -50 -55 -75 59 102 73 -268 98 69 -198 58 -185 -172 97
2253 97 159 -26 -183 -13 -106 -174 -53 135 -216 98 152 108 -217 -261 -53 -105 82 -140 32 -24 -18 63 70 7 117
2278 117 9 -100 192 -85 -15 66 -66 -167 26 -10 257 174 275 213 -21 34 243 113 -38 -121 -8 -15 7
2301 7 219 148 -139 -57 -34 68 175 61 -29 20 -223 40 201 -431 97 42 -28 -41 -70 65 159 79 73 -319 -22
2326 -22 76 39 -64 -279 25 -91 -60 97 -92 102 30 87 -75 -83 -127 98 153 104 119 298 137 -29 4 185
2350 185 -248 -235 39 -191 -28 -15 -20 90 191 -82 51 -31 -81 -8 295 -243 152 135 84 -83 45 105 54 57
2374 57 -34 121 51 171 -21 -214 201 -118 1 17 60 114 -155 -57 -48 28 -139 25 176 -239 347 -31 -172
2397 -172 9 125 -4 151 -228 24 49 33 138 75 134 -59 -3 89 -97 43 76 -171 8 -23 36 227 191
2420A91k33K34k75Q3q9N4j60K98K68n64K25j27O6j6k4J61r0P6q2j12J10K82m29
2443a53K65j36Lj3j08J38j03J00j97L07q1n2J07o9j08Q3K03k17P4k08J79R2j49
2466d3LQ9J5j26N0j14l9K38j66J41J21j36R2j00L7Jl0r7K42j00n1m7K1n0P7j09
2492h1p0J72j56J16j5M1L06k70O6p0R5j44k39K96O7j38L02n4r3m01J75M3l00L47
2516eq6p3l8j35J27M06j88m8K5k56L18l27K28J79k00r0L42m30R9R1n9R9k3lK11
2541A64k37k9K12j45J31o2l73M04M6k32n6J23K49k79J97l08K49P6l05L82o0r3
2563E4L0k47L87k76J44p8lj61J85r1L24n04J72L20k16j39K68mk02K0k36J25l5
2586a63L05m39L75j87J48J28J24l60j3K15M3k44L5k4K92j73R0j58p4L7Q8l3l4
$$ plain form
2420 191 -42 192 -83 0 -89 -35 -195 103 371 -193 32 -95 -29 -45 -69 92 2 78 -4 -116 -6 276 -153
2443 -153 112 -24 -21 -34 -142 -4 -107 -7 -204 103 22 -30 77 8 -100 -17 186 -31 43 -165 14 106 -43
2466 -43 -40 49 64 -62 -12 -126 -165 73 -93 48 169 33 125 25 62 63 33 -64 178 78 27 -20 1 -49 28 -81
2492 -81 -151 21 -135 -19 -34 7 313 43 109 39 134 -10 -249 47 114 -24 278 224 131 -270 -95 -52 -352 -5
2516 -5 -91 -164 -202 -337 -210 196 8 -40 -15 -271 47 -280 -52 127 -73 -163 179 -251 -152 -61 -120 -21 -44 -47 164
2541 164 -73 -102 110 -35 96 34 -339 65 111 -121 -177 -54 195 -84 113 -195 54 130 -175 207 147 54
2563 54 84 -163 224 -52 92 14 11 -150 35 -56 268 -236 -64 256 40 -99 169 165 -37 -17 -253 -128 -163
2586 -163 142 -297 78 -109 39 167 291 -69 -82 133 176 -68 -33 -57 235 62 152 -6 -80 -43 45 12 -22
2609b2l5j28K36J2r2k74L06j48K21r6k24L17J3j07N8j33K26l64J17J61k50K04
2631bj7J27l38L91k65J49L3k12P5k42L56M24m15J9k42J13R4L0j31o8Q7rJL06k21
2656D3l9j40O4J84j25O6Q8J6Pj51L0R7j58N7K02K2k29J93J5k55j43P1J08m0m0
2681e7J18k7L6K8k28q6Q3K80R1k71J04Mj24K86k25R6j54j47J76p7J50k2K21n8
2705A97l18J16R4j74L88k18m71L62r4K59k33m8J94l4j28q9L19k0j66n8K48l49
2727b23J19M0k03L47j51J43lj23P6k9mK9j46K43Q0q8P0k67N77m50K9m9M4k94P4
2752a59L18n0j66L19j27j59J06k09K61k91P7J76j43P5j52J68l28M00J7r4l0o5
2774e6nm6K09k77L16j18o4p9R0n5K25K9k75J28j4l4k85J60L6P4J92j99J19l04
$$ plain form
2609 -22 -57 -185 51 63 -29 -303 3 -145 76 -20 -244 73 86 -21 37 -96 130 -234 -117 44 -206 -2
2631 -2 -19 108 -230 161 -104 45 78 -134 -59 -301 55 479 64 83 -159 -46 48 78 -53 -121 -34 -43 -42 264 43
2656 43 4 -136 -72 112 -13 53 141 157 164 13 43 140 -18 39 241 263 34 227 242 -13 -156 -85 23 -17 -57
2681 -57 61 34 70 98 -130 -216 -133 147 238 -33 71 75 -49 237 12 108 -46 -193 -17 -94 56 34 255 197
2705 197 -121 -5 89 -85 303 85 -386 -24 -118 141 -92 -140 54 20 -108 -197 122 102 -64 -122 126 -223
2727 -223 -104 -64 -267 80 -71 72 69 -54 22 -7 -11 18 -128 115 195 107 177 -90 487 37 66 17 61 -233 -159
2752 -159 159 109 -57 262 135 -24 82 -127 134 -157 -80 96 -47 28 -124 44 -284 116 133 39 9 -56
2774 -56 -61 -107 102 -175 141 23 -41 -120 -30 -85 140 169 -106 22 8 -26 -311 -151 -115 -41 151 -48 71 -233
2798b33J46K00j61Q6p6k08J40O9K6r4l54N40M5j69K43m90J94%pJ13j06K84k86
2821i8p8J94R1j73l0J47q0K69l68K38j53K4j59K62p9r6M3k4r7J69j53K30k64K97
2845A12J41j63J18n6k72M36m07p7M17j27r5J4J24p4l2j84K97r9Pk07J77l5p5P9
2869A9J79m03J84q0J95J58k65J83k6l6k53J53k98L75j28M2j7K25J15m26K72m94
2891c26J72n8P6J37j78J12m25N41j3J59L6m50K66K1j02l9j1K7O3j44J0K21l8J6
2915G3j61L00K06m04R0j55J57N5p5K3r8R3l80K35ML9j04J1J19o4P2L8j57R1j1
2940cK5j32q8K72l52L27j63K45n98M47N7j89M2j33K09K29l52L42R0r6Kn3k25J81
2964H4m58N11l95M69k47j70J62J31n4j75J04K33k52J72j8j42N3j48K05l5j64K11
$$ plain form
2798 -233 -87 113 -48 38 -38 -246 -106 -37 -11 -105 -459 81 126 -43 200 -290 -96 -96 -103 10 -96 188 -98
2821 -98 -176 18 109 -64 -94 53 -27 242 -126 112 -41 -17 -176 86 7 -89 -46 -70 -167 2 -151 79 -185 112
2845 112 253 90 208 152 -120 316 -91 -168 249 122 27 41 165 91 59 -125 172 73 80 -127 50 15 -60 19
2869 19 198 -205 -21 -101 94 252 -13 170 144 108 -145 8 -290 85 -43 -1 -18 207 322 -104 168 -326
2891 -326 -154 -212 -136 1 -177 -65 -490 51 38 197 233 -217 49 70 -32 -71 -82 -55 8 -136 -126 95 57 73
2915 73 -88 212 418 14 104 -51 106 161 86 109 11 104 -276 -41 -37 2 -102 -91 28 -36 36 74 -83 8 -3
2940 -3 22 -110 -198 74 -278 49 -114 131 -467 -20 37 -152 -110 -243 -34 195 -157 185 275 179 181 128 -97 84
2964 84 -374 137 -258 211 -36 -206 -44 87 33 -142 -38 195 -57 115 97 -45 8 -140 65 30 -134 77
2986G7K6m4Q3R1n86N09l4k03M4L00j17p6Q3o9j52M9R3k92K75J86k64M2Nk93K82
3011A5p3N24n09j01J04j1L13k63J7O3P7j51j21K6j57N69l23O2j78J77l71L13K27
3034B29l00L03j19k4J19j97l5M8j58J20J42m0j63K78k5R1j97QJ3P5j46k54K96
3057F4j2P5k35J4K14k30J2J65l10J52l33M71n7n8j38J00O8R4k61K64J44l51J25
3080b3j34P6J46M6j17J59l24P7k21K49l8J85n6k35J78j05K19j18o3j07K34q7j14
3103a73J07J02j28K27o5j77J33M2k66J07K95k41J46l61J71O2j40M82j69k97J33
3124a0j65L8J54j70L52j08j26k17M11k49m1K44m2O8k2M2k77M0L22m62K7Q2o9L47
3148A69lk00N7k78L50L5l52N7J21J34r3J26j32K11l53J71p2j08J0J92l2J06j24
$$ plain form
2986 77 103 59 142 233 -353 156 122 -81 -37 263 146 70 153 84 -68 -19 74 -218 57 243 -21 21 26 -267 15
3011 15 -58 466 -43 -144 -40 -51 262 -1 16 79 156 5 -116 -90 -247 322 -1 61 -117 60 -311 2 229
3034 229 -71 232 113 89 208 11 -24 24 -134 -14 128 88 -75 203 178 269 72 80 93 168 22 -232 64
3057 64 52 127 -108 -94 120 -110 -98 67 -243 -91 -424 47 -10 -68 -206 -106 -38 56 -205 59 203 -148 -23
3080 -23 -157 -81 65 111 -6 153 -171 -94 -315 -66 -104 81 25 -210 -32 -137 82 -36 -99 -206 28 -59 -173
3103 -173 -66 36 -92 135 70 -107 26 68 -198 -91 204 -37 109 -252 -81 -19 -159 323 154 -143 -10
3124 -10 -175 -137 17 -153 199 91 -35 -252 159 -90 -131 113 71 139 117 159 -118 -78 244 -218 -191 -109 -178 169
3148 169 166 -34 23 -255 95 130 -222 -165 -44 90 -3 123 -9 202 -151 20 -52 -160 -150 42 10 116 -8
3171hJ3p8K01m23L76j6k40J4J17l7K65j87J73k60J94L63o34K01j13m7K88k22K25
3194A65m3j35K75m27L92l92J02K67l95J60m0J55j9J68k91k6K49l28J38R3j55m7
3216a34K04J68k07l3Q4k51L69k13q6J83l76J75Q8k48K72j31J57L61o85M33j06
3237B4L28k38m7n1j42K94l58n8M15j89K3O1j02r4m2K50P4p5m3o9j07L02k40J98
3261A14ok26N5p3J74j3J15j76%j76K57J48l03K6%k8K81j50Ol9j74J82KK09j24
3286H1n09M89j23P5K76k84Q9l04J67J52k52L41k15m2K70l80K8J49J83k48P3N1
3308F7r3l8J45l1p4J61j04J89jm94J9K83R9j06P4K8q6k07KM29k31J32l13Q6r5
3333a59J73l00L97J40j64q0N6M6j94o4O5P8J10p5q3J77k26J6j1j0OP2r3J40l6
$$ plain form
3171 -8 5 -73 128 -295 81 65 -175 -161 -44 -81 184 -3 170 -90 104 467 -167 34 -79 -126 162 -60 165
3194 165 122 -13 262 -165 227 -165 -63 204 -191 -31 -71 84 65 233 -58 -84 165 -163 -25 68 -87 -134
3216 -134 70 238 31 -2 82 -169 200 -13 -99 84 -292 -117 -29 -277 -5 -136 21 382 -303 130 24
3237 24 352 114 67 16 -126 168 -190 -248 167 -22 1 62 -40 -134 -176 74 148 73 30 -39 -146 156 -84 114
3261 114 108 -118 -63 -136 38 25 140 -36 -36 -212 45 193 -110 -84 -84 -112 169 19 25 -14 -188 -6 -4 205 81
3286 81 -428 61 -62 13 289 5 94 -210 -43 109 -143 198 -17 -59 211 -169 -141 8 191 -57 16 67
3308 67 -26 -64 81 50 -24 137 33 222 221 -273 -254 29 128 22 96 124 38 -169 -167 262 31 163 -150 -64 -159
3333 -159 14 -286 111 251 87 7 63 109 -85 -149 -84 -6 104 29 -54 123 -103 -87 -98 -108 -102 -30 -123 17 -19
3358a9J03m9P3o2j79J01J63l12R0M15j76j11j93L14j25p9k8K21j86J76l2k24J70
3381E1N7mk9r5j23P5K38j38K02j49L0K53m83K46k04j32J45L00r4k21K21p7J84
3404B53m19L9Q9n3K11P9j49j92j08L04q6L13k91Nm51N43P9q3Q6o9m06O60o01J78
3428f9j65RJ36Q3K44l59M01l10R2K0K1p8K92r1o11K28K33o5J16j09kJ22j31j9
3452a2J30k86o1Q8J43R8j43l6K56k65J4O1j34L01j25k39L20j14N5k65J83l7J05
3475C7J0r0N5n9J22kj61L15p2n7k4Jj87j19J84j51K12j81K52kl06J50r0m7J22
3500h8j36M18j22o8j04N8K19l79N9k3QK80j95J89J60k82j78K01n5J50lk5p6Mj3
3525ak9J77n4j18N5L04K32o38J59j80L81n14L29J31k80R4n2j1ROk4N8k19P5k0
$$ plain form
3358 -19 84 35 108 46 -133 -32 131 -181 -91 324 148 37 -156 158 33 -46 -74 147 -39 137 105 -119 51
3381 51 108 104 75 -20 -143 -68 170 32 234 85 115 368 -115 131 -73 -205 -60 240 146 -75 146 69 253
3404 253 -166 -127 -38 -91 120 199 50 -142 -250 54 -32 281 -10 -5 -456 87 166 83 169 100 -306 354 -247 -69
3428 -69 -234 -225 -89 -6 238 -121 280 -30 62 82 103 25 317 226 -385 -157 76 11 127 18 16 138 7 -12
3452 -12 118 -168 -229 -141 2 100 -43 -79 177 -88 -74 -13 -147 154 29 -210 110 -4 51 -214 -31 -68 37
3475 37 47 -43 12 -47 75 73 -88 227 155 98 74 75 -112 -231 -47 -198 14 -167 85 83 -223 -73 -163 -210 -88
3500 -88 -224 194 72 4 -100 -42 177 -202 -143 -166 -158 122 -73 116 276 -6 -184 17 -38 112 109 84 8 12 -1
3525 -1 -30 147 93 -25 30 334 566 -72 87 -93 288 -226 103 234 -46 48 -4 -15 -6 0 -24 34 -185 -110 -130
3550a30M1LJ2L7J47j17J30k26M9jJ62K2j61K9J59n8o1J07L4j75q9J91l49L93l6
3575A13J2k63J22J94k31j2j09K94k02O2J63l43J06k0LJ57l5K60l44l14K19j6J89
3598Ej58%Q3K70k55J44J24p9j23Q6N5r8J21j27p1j89J40O4r7K10q5j14J85k48
3622a57J61J5l10J99R8K01j51m5J07J89j26j25j87J18J55k78K68J02j33R1jp4
3644A17L6n43N00j27K59j29K8o5J35n9l60Q5J3j05K35J08j64K50j23Q6j47j1j83
3667a64L54l70L87k14k74K66n3OQ5K40n20L07j44N5J68k85K04m8J14j21K73l64
3689i8N6p2L8j07J84k55K5K73J14m50M42k24l2J27L2q0q7L63j29j26J5j07J87
3712H9r4L0p1L9k3J82k87o8L55k71O5%O4j14J09k07L84k53N5J02K3j19J39k27
$$ plain form
3550 -130 -89 -86 -74 -37 110 -7 123 -103 -54 -55 107 129 -32 -3 156 98 37 144 178 3 -86 105 -244 149 113
3575 113 125 -138 -16 178 -53 -65 -174 120 -82 -20 143 -200 -94 -114 -111 46 11 271 -73 -387 -168 -184 5
3598 5 -153 -153 -70 200 -55 89 213 134 11 97 152 54 175 48 -23 -212 -72 -8 -105 105 20 -94 91 -157
3622 -157 4 19 -291 -92 6 207 56 11 118 307 181 56 -131 -13 142 -136 132 234 101 192 191 117
3644 117 153 -390 110 -17 242 113 141 76 211 152 -208 -123 -110 -215 20 128 -36 214 91 177 30 19 -164
3667 -164 190 -180 207 -7 -281 -15 -68 -62 23 263 -257 50 -94 -39 129 -156 48 0 114 -7 266 -98
3689 -98 -42 -114 -76 -183 1 -254 -229 44 158 -292 150 -74 -106 21 53 -27 -114 249 120 -6 9 -98 89
3712 89 -5 25 -46 -7 -30 152 -135 -203 152 -119 -54 -54 10 -104 5 -202 182 -71 -16 86 109 -10 129 -98
3736i8Nj6J65j17K18N4l05J28l6P6l48K69J20j09n3J50pO2q1p5M6J7lM24p41J
3762b54L22q8J85k64Q5K72r0m05J94Rj97N9J00J7j86N40o05Q1K90k33L63l05K46
3785A36M77m53k60K25j58%O7J13k97M96n06K63k59R7K14j95k13M06n5j53J63l34
3807b26M6R0Q0j77J06j1m1J60m7K1M1P2l52N26k81K07m68J51L36l71K54K38l37
3830A7K39p1k18Q7P7k92J51l13M57J9k28J18k46K41j19j55J26J82P0j60Lk07K36
3853A4o1j27R0M07o53N41l18K00l2J36n05K52Q1j79K93r4j13J05k02M2J28J12
3875A17j71k75L18J17n9l1J48l46J04j08J13j04P0K70j91K7L78k40k42L2M1J43
3897A11q1L0K3j80L03m3J12k12QK4m24L66P2J7j75K99k02j69J21L6J50j00K47
$$ plain form
3736 -98 -93 -109 56 -61 157 211 -94 34 -2 74 -274 -5 115 6 -47 103 96 158 77 2 48 65 62 486 -255 -254
3762 -254 68 -20 165 -99 -14 258 168 -237 -43 -34 -231 -172 -72 -55 -241 299 -306 -225 65 -168 195 -110 136
3785 136 613 160 -100 125 -33 -33 34 147 -150 346 -160 103 -156 -59 155 -40 -253 153 98 -55 108 -226
3807 -226 -180 -90 -10 -187 -81 -92 -133 27 -20 1 42 114 -238 288 7 214 -254 -103 233 -138 116 354 17
3830 17 256 185 -33 54 131 -161 -10 -323 134 153 -75 43 -203 38 -81 -236 -110 72 142 -18 -15 -222 14
3853 14 -47 -174 -84 323 -330 211 -107 93 61 197 -308 -56 25 -154 139 45 -68 37 -165 -123 5 117
3875 117 -54 -329 -11 106 47 16 164 -182 -78 -186 -73 -177 -107 163 -28 -1 377 137 -105 -73 -32 111
3897 111 30 60 83 -97 206 163 275 63 71 95 -329 37 109 126 -49 250 48 -121 0 36 186 86 333
3920C33m64K6lj4L55m58J58L2J16N3j09P3m2J90k27J73l42K56J8j25k03K17j08
3943i5o4K08l6J8J27k54J82n9N9j64MN4j53O3M8j81K90J90k8n03N15j01j80J35
3967G5j34J44l51L73j23L6k15J67j9p8J25l15M58K3k84K90k06J71l63K98P3j65
3989b0m2J71j85K38l05N1j6P6J92l28K41K3J06j81r0pNL91m67J01m3J39K33n6
4013B27m0n76N85l70J90j02K20k27K32K3l28K40J08l91J74J9k16L00p8J29j1l24
4035b16K39J3R6J18J2j57p4k65J2K40OJ12j33r5j0j3J78n7o7o4J93l23M56j12
4059H9j57K28j85L06l01L6K05k02N7J33j45k5k70P7j18L13l19L17k27K07j10J10
4081A9j19J65N0l17J85q1k16M13j56p5J12m8Q5R9k91J52K50m78K77j7P4l11R9
$$ plain form
3920 333 -131 -105 -108 -122 233 -225 -67 -35 81 134 25 98 56 246 19 192 -150 106 124 -1 -204 13 -95
3943 -95 -159 49 13 31 158 -96 86 27 86 -78 -74 -20 -173 -110 -62 -243 47 237 209 -294 221 120 -60 75
3967 75 -59 85 -266 107 -16 20 -195 -28 -47 -125 0 -315 143 166 -118 172 -34 137 -226 72 145 -20
3989 -20 -62 109 -76 162 -143 -92 -108 -32 160 -168 73 96 202 21 -69 -76 -71 320 -147 -46 -89 50 283 227
4013 227 187 -389 196 -174 16 -86 134 -93 139 162 -166 74 182 -209 -35 -16 -232 68 -10 119 108 -216
4035 -216 23 36 132 250 262 105 31 -234 -222 18 24 136 3 -92 -102 -115 63 6 -61 -125 68 -255 201 89
4059 89 -68 160 -25 281 -20 16 221 19 76 209 64 39 -231 -154 -272 41 -278 39 -188 19 -91 19
4081 19 -100 65 115 -202 -17 -98 -314 99 -57 -132 -20 -68 17 116 -175 -23 227 -251 26 9 83 -228 -129
4104a29K91n20M28j58Q6J67r0j72Q4L7J67j75j61K77k07m6K7J3J05R0O8qk06j98
4128b30K53l1r1PN6L03k27j10m1l5J12n3K38p8J89k20j34L18n51J16K81j38J14
4151D8l2Q7j79L96m64J11K92l98Q3q2L45L3k32j3J54j71o5L08l69J35J38j54J27
4174I8N4k43K87lJ65n69Q7P1p7J15j00J14Kr6p7M38n34M77l69k2L77l49L70j76
4198D0j95J87R0r5j0k27K71j20p8L40k19l68L29J34j59l0J94k15J28l8k14L12
4220E7n9Kj30O1K05j93J31j06K38q8q8j75L54j85o7k3J03p0K77m13K82j72j23
4243a82R2K58k30j51P8%Q7J7rN2J87l64J08l4j8R8m9P2J94k02r1J90l58J87O2
4268fJ07k28K88O8J7j81J01Km8k7m7Mj02n6L26j19j0q0J8J47j51j67L54k05m4
$$ plain form
4104 -129 162 -358 70 -88 -2 165 75 -97 -13 24 191 16 -145 132 -75 -121 -94 -81 24 114 182 174 -32 -230
4128 -230 23 -8 -99 -92 -36 267 40 -70 -111 -146 -34 -87 151 73 262 42 -92 226 -325 -209 72 -66 48
4151 48 16 103 -76 320 -144 -33 259 -139 -56 -138 207 240 8 -5 149 -22 -87 221 -148 -13 125 -29 98
4174 98 152 -91 196 193 358 -211 -124 -53 -130 -15 -115 -1 1 -95 -172 266 -268 209 -160 -182 195 -154 216 40
4198 40 -155 32 122 27 17 -210 61 -59 -137 203 -16 -384 -55 79 -80 -110 84 -131 -3 -41 -255 57
4220 57 -2 0 -130 -69 136 -57 74 -32 206 118 30 -145 209 24 -43 -66 37 -33 244 -169 113 -59 -182
4243 -182 -90 168 -62 -213 -135 -135 -48 -31 -40 12 199 -165 -57 -91 -109 -11 -60 12 206 4 -87 103 -255 -68 -6
4268 -6 101 -127 161 229 246 65 166 168 120 93 46 50 -52 -108 218 99 89 9 27 174 23 -144 210 5 -39
4293c9J92J24j19j43m3q2J86k03L40l19m2p3j51N17k62L89j28k42L56k03J52j64
4315D3O6N9j82p3j5J17j08M5k58K79M7L8k83L27r8K96j2lq6P4R4l80PJ38j92l
4341f3K18l60K18j14K90j37K28k87J2n1Q3J2Q4j08J74J4o9M7k57q3L23m08K30
4364dJ32j45M0p5P2j82R7j24Q5m9NK90k30l8M24j98k8n4l9l8J06o2r3k8K64j68
4390d0J06q7P1l1j58J18J37K39k24j26q4j50K5RJ48J49k59J81L7J01j24J22j33
4413B7n5K60l05K89k34J12j1j87J00k78J15K87j07J32k2k6N9k63l8K32k63L91
4435B15j62l7l26N15l62L11j23k89N25k14k10K26M9l39K86Lj93KJ8K05m7R6Qm29
4459b72p1K59j14L81l70m9K56j01RJ07j52j27K86j73K36l62K09P2J78q6j63M3
$$ plain form
4293 -39 153 277 158 15 -28 -110 76 -127 213 -106 -148 -221 -372 145 -117 272 144 -98 258 55 207 43
4315 43 109 168 -14 -87 -102 15 -93 -48 -306 -27 20 58 -225 102 4 300 288 285 199 273 367 -13 -6 132 -60 -63
4341 -63 155 -205 13 -101 189 52 280 -7 5 -46 37 49 133 25 199 213 144 191 -66 -149 174 -234 -4
4364 -4 128 -17 23 -52 20 -162 -65 -189 -104 -153 -148 142 -88 -126 298 100 72 18 -21 -59 47 -15 -108 -136 128 -40
4390 -40 66 -21 50 19 -139 -21 116 355 131 5 -79 -229 -204 -195 -47 102 -157 24 61 162 38 160 27
4413 27 -28 232 -73 216 -18 94 83 -104 -4 -282 -167 120 13 145 123 97 156 -107 -145 87 -176 215
4435 215 53 16 -310 205 -157 154 31 -258 267 53 -157 69 118 -221 65 68 -125 -123 -105 100 53 149 157 -272
4459 -272 -343 -84 -198 183 -187 -236 20 -81 -72 35 -117 -244 42 -131 105 -257 -48 24 202 116 -47 -4
4481dJ69M8j3k8j1p1k4j64L28L3k44o2J57o3k1r9p1nL41l93PK96L7k93K32j00
4507a8p0r1J74L0n4J9J30J1k50J50r7m9O6k2O4j0J05l3N0k16K40k72rK50j50J72
4533A20l38K30J81m3j4J67k69j55r7J96K01k30j87K83m9n1qL71o1j79M5N0l48
4556a85RJ22j1k5K32p5K2p3N8k83J53J14K6j13k05%J62n0R5N5J2K49k71K69k75
4581A2j9Q7n3j14J39J73n15K95r6K03j20J10J42j74j40j06M7Q3N0q3j12K05J39
4604A53P1Q0k91L6N3j71R3k76J64J39r4J23j6j28l6N7K76n09K04J84p8j46J46
4627C4K8j20J37j59J92o2Kk63K49J31j44Q4m75L80pK91l10J27j64K34q3m29L58
4650C1Q6l03J59J52j13O7k19K78J40j47k28J10RJ5p5M4j43K10L0l11K23m6O3J93
$$ plain form
4481 -4 165 213 200 172 161 90 66 -98 230 263 19 -43 114 51 30 -69 -140 -145 196 -197 -190 106 143 -150 82 -18
4507 -18 -88 -179 -5 25 -29 -10 120 131 -119 31 -66 -115 -49 -71 -7 -17 88 55 105 -111 129 -143 -152 98 -52 120
4533 120 -218 12 193 150 136 303 34 -121 -218 -22 179 -51 -238 45 -4 -55 -63 308 247 68 113 163 -185
4556 -185 -176 -54 -65 -90 142 67 89 16 74 -209 -56 58 84 -29 -234 -234 -72 -122 -27 28 40 289 18 287 12
4581 12 -7 80 27 -87 52 225 -290 5 -91 112 -8 102 244 70 -70 -176 -129 -46 4 -79 -191 14 153
4604 153 224 304 13 49 102 -69 24 -252 -88 51 -43 80 64 -64 -100 -43 233 -276 -72 112 34 -112 34
4627 34 62 -58 79 -80 112 50 52 -211 38 169 25 109 -366 14 7 298 -12 115 -49 185 102 -327 31
4650 31 117 -186 -27 125 12 79 -140 138 278 131 -97 13 22 37 -38 6 -137 73 103 -208 15 -31 32 225
4674B25j45m2J15j86l6J15l10j7L52M3l46J40O6k40K08Q7J55r0J27l16N2l4Q1
4697DJ69j47j5l49L39J07o9j4l1qO2P4m07K50j16K67k07J81K9k04J4K31l67J87
4721b0K1P0K80l37n8J23J57l09mL6k10K90K09l74P1j14L1J97l02K19m4q4K05q
4745D5m8oJ8N2Q8j49j27J35J76l21j63K41L08j09j77J08J24n5jj70q4L15n55L84
4769B9J75j78j9Jl0j81M59r5l9J91m65J17K8p1J58j21j43N9K7J14j13J37J38J7
4793A95n5N5j88R5k39q7K28J6j17j8L1J44J86m02K23j59K01j80p1K16J30l15J63
4816E2j1L4n5j05K8L8K68l59J08K17j36j31j89Q7L37j10j59n8J74j58j97L01J53
4839A29j47q0pj71L20j13O6J9o4J52J7K70m45K8K25j71Q8p8J95j12J17k80J5J75
$$ plain form
4674 225 80 38 153 -33 -69 46 -264 -281 71 114 -232 -92 -26 -266 -58 29 184 94 221 -95 -43 -77 4
4697 4 173 26 11 -338 1 108 39 25 -6 -14 48 122 -285 -35 -151 116 -91 90 119 -85 -71 160 -207 -20
4721 -20 1 71 351 14 -44 79 236 -73 -77 -41 -251 39 248 -126 -55 -169 -138 59 -243 -24 -68 -152 53 45
4745 45 -3 -9 9 61 149 0 -127 8 184 -137 -300 -59 249 140 -37 71 195 140 139 -31 -115 200 -355 29
4769 29 204 26 7 8 -22 -203 256 161 122 313 -152 -35 -7 -78 80 -41 -184 -125 -98 16 -97 40 178 195
4793 195 140 195 7 102 -137 -224 4 20 -97 -115 -84 60 246 -156 67 -92 109 -71 -142 74 204 -111 52
4816 52 41 75 20 -85 -57 -19 249 -110 -2 215 79 -52 -241 -154 183 73 -86 -144 30 -128 -325 -24 129
4839 129 -18 -98 -105 -276 44 -69 -3 16 -48 104 121 391 -54 -26 199 28 116 38 233 121 238 -42 -27 148
4863A48k65P6K12j47R1Q2j78mk68K39J71j87l2P7K4j32R8k10J47J89k0j31J44
4886A24n4r8N2p7oJ32j09J89m05N02m0j38p6J05j75P3k2j78j0j0L74k43p7K86
4910A19n1k33J32K0J36j13R7k73K99k58K02k12J64J74Q5l98K61k09q4n4K12j06
4932i0K32k2j41n2O9J01j7j78k1K17j33k6J40J1j28K07j9r9J14K4j64j51L7K91
4956B02k86J63mj82Q3RJ07k6k55J29r7J63J01r9J53j0k35J62j09J73k8k08J30
4979C6P3o6q5n0N3R1J54l32l6J82l06K15O0N4l0K1j58J89J81l47kO1P3j51K55
5004A35j88K2K48k22J86j22n2K16k96%K5L2k39J63l6M22k86N3J19k09j04qJ51
5027A0k52J08K62R6n68L32J41l35P3n7L16k16J07j57J60J3j13K71j01J06j96J43
$$ plain form
4863 148 -117 -41 171 24 115 197 19 15 -253 -14 157 -30 -62 15 39 -93 5 -205 -58 131 111 -20 124
4886 124 70 -28 24 -53 -59 73 -36 153 -252 250 210 72 -4 101 -74 -1 -23 -201 -211 -221 153 -90 -167 119
4910 119 68 -165 -33 -13 123 10 107 -166 133 -125 77 -135 29 203 288 -110 151 -58 -142 -196 16 -90
4932 -90 142 120 -21 -73 -4 97 80 -98 -119 98 -35 -61 79 90 -38 169 150 51 165 189 25 -126 -89 202
4956 202 -84 79 75 -107 -24 -15 92 66 -189 -60 -157 6 107 8 161 151 -84 78 -31 142 114 -94 36
4979 36 109 43 -42 -92 -39 52 206 -126 -162 20 -286 -71 -11 43 13 34 -124 65 246 -101 -103 -42 31 -120 135
5004 135 -53 -31 217 -5 181 59 7 223 -73 -73 -48 -16 -255 -92 -128 294 8 61 180 -29 -133 -141 10
5027 10 -242 -134 128 224 -344 -12 129 -206 -133 -190 126 -90 17 -140 20 33 -80 191 90 196 0 143
5049A43k77Km7K27j07k1j14K63J8j32j54K25l5j06J1L9L36l41K34k67j66M69l08
5072a08K26j22L37o71N00l15J79N9J90j69j51K06j57j0K03l3k13J58r7j35J38
5093A5k40K17J14k53K50N5Rj96m2P6q6K25k36L34N2m40J92j10K4k10L18Nl25K15
5117c7J70j65J81k30j79J94k9M5m2K23o4K0j50K01j34K82j65j40k57K52p1J16
5139B1j93J41J05K19j96k99%L03k68K1j0J50J16k02J68k54M1J42p8J20K38m05
5161a20J0q0p9L62Rj62J14n8m1J76j97LQ1J33j94J1Q0o0L9K0j18J62j74j09Q4
5186a08q0L84j36k30L64j91Q3m6J36m55K73k41N4K23j93J19k70N55j88n7K15k70
5208e9J27j74L39Q0j89R0l07Mj1K34j59j24J69J01k49L65r3o7j91K17N6l42M59
$$ plain form
5049 143 -134 -132 -179 48 -59 -80 -194 69 87 -45 -199 26 -9 -115 -104 -65 271 -70 164 -103 -269 200 -108
5072 -108 118 -4 333 -338 162 -153 26 85 275 106 -45 161 4 -6 197 164 -49 109 12 -123 15
5093 15 -225 -8 106 -147 103 158 167 -29 -71 5 -81 144 -92 242 294 -146 46 -64 -40 -250 68 73 -252 -37
5117 -37 133 -32 149 -81 -260 -66 -95 -50 -92 131 67 87 -63 138 4 286 121 -19 -276 -24 -95 21
5139 21 -172 -31 74 293 97 -202 -202 101 -167 -146 -156 -6 110 -92 76 -178 -137 5 -73 47 285 -120
5161 -120 -110 -190 -269 93 102 -60 54 -4 -45 131 -66 -63 18 151 -43 -32 48 -12 27 47 -71 91 -83 -192 -108
5186 -108 -188 196 60 -170 194 3 86 40 176 -279 -6 -247 -193 30 -163 -44 -314 241 53 -4 211 -59
5208 -59 68 -106 233 313 124 214 -93 -89 -100 134 -25 -149 20 121 -128 237 144 77 -114 103 159 -183 276
5231B76l31rJ67j51l6J84k03n4J04jJ87l91K29Q9k38K39q2J26p9n7K2p2MJ60n9
5256B4L9j15J09j09J36J47K8n22L50j33j84K95m3k09K10k7j44j07J15M13k39r6
5278f2J29k01J16l3J31J02j12p7K64j26q1p4j33n2K54J2r7O0J02j0j7j62l4K8
5302g3J22L5%O9j06p4K57m05K3J25M9J11q3j31K48j14m7j35J71j04L8j3J41j16
5326a2L0L1k61N83m59M36m18J57j43L15n71L30l3K9qM7n0Mj97M1O1N4K06l51J50
5351b9K21k63K65k27m7P8K69l59O1M7J73j17j35q5J82J01l8k14L6k06M04O8q2
5374A03K18m15K46l44J24j3J29j34R9P6ok46J0k39M84j46K6K6j23K61J7m8P4k75
5398i6N2K55k15j47j49K80J71p9Kk70K54j99o3J19J31j09L8l0P0n4K31j67j57
$$ plain form
5231 276 -55 -64 103 -48 -84 100 -103 -157 -53 -54 133 -258 -29 60 -178 61 -21 105 26 -31 -9 -81 -77 83 24
5256 24 63 -52 57 -52 84 231 259 -263 87 -46 -230 65 22 -187 23 -4 -148 -255 -140 273 34 -62
5278 -62 67 -134 -18 -51 80 182 70 -7 257 131 50 -24 -157 -209 45 57 -40 20 122 112 95 -67 -101 -73
5302 -73 49 84 84 153 47 -27 230 -175 -152 -27 22 133 50 -81 167 53 6 -129 42 -62 -24 -37 104 -12
5326 -12 18 49 -212 371 -88 348 -70 87 -56 259 -312 18 -15 14 6 53 3 7 -190 -149 -88 -34 172 -179 -29
5351 -29 192 -71 194 -33 -80 -2 267 -92 -31 16 189 72 -63 -148 34 135 97 -117 -81 -287 117 185 103
5374 103 321 -94 152 -192 -68 -81 48 -86 13 89 83 -163 -153 -392 92 -54 -28 -2 -125 136 153 105 179 -96
5398 -96 -44 211 -4 -151 -300 -20 151 72 74 -196 58 -141 -204 -85 46 -63 -25 -55 15 -39 192 25 -132
5421a32J81J65j35k08K20k12K19Q1l41M27k59J28j12O5j3k11n1J98P1j83K36k98
5443a64K33m52L98l2j68l3M41j02r8m6j86K31m0j52K79l61K11j83J99j16k3p4
5465b38K25j47J81J88P2l20J47m00K92j04o8J15K49k09J71j82o0K50m08L51o0
5486D5l8q4L0o2j37K71j16J24k40J95k10K05o4J88k00R6K73Jj53m22Q5J82nL58
5510C22k57O2k54l9M04p49N99p5J20J71l36M6J37j33l8nK29qN6k5q3j70J10j3
5534G1j52J56j13m2O9K3j1P1j01Q7K87l12M2l2k2K32j86R4l10K58j54Rk25L59
5558I8P2l80N2N4K64k04J53r4J76j14k95Q9k29M48j78n8M5l4J11j15k29K45n8
5581a81K22L0j66R9n7j20K27o9j0K03j21q5M5L3k1l22L84R1j13k00Q2J33q5L5
$$ plain form
5421 -132 49 214 79 -129 91 -121 98 179 -162 265 6 134 22 87 74 -137 -188 10 81 -102 134 -164
5443 -164 69 -383 15 -17 -185 -218 223 121 23 -23 -209 22 -18 -170 109 -252 -41 -224 -25 -141 -164 -238
5465 -238 -13 -160 21 209 281 -39 108 -292 0 -104 -172 -57 192 -17 154 -28 -88 162 -246 105 45
5486 45 7 -77 -47 -109 -246 25 -91 33 -207 -12 -222 -17 -81 107 -93 3 276 277 124 -298 -213 -31 -36 322
5510 322 65 127 -127 -166 238 -511 88 13 133 304 -32 14 151 18 -20 -25 204 196 252 227 144 -26 84 71
5534 71 -81 75 -38 -80 -11 12 1 72 -29 58 345 33 75 43 21 253 67 161 -149 109 -45 -36 -261 98
5558 98 170 -210 -158 -104 160 -44 109 15 191 77 -218 -129 -358 90 -88 -146 -101 -135 -24 -139 -368 -123 -181
5581 -181 41 71 -95 4 -53 -173 54 -15 -25 178 57 -28 17 50 29 -293 91 182 69 -131 -49 84 -1 34
5605C4J47l23J0K35k34L31j69J86j60l30O7K11k03J49K20r9j55o1J90k05K2L4
5627a03l6j03L53j16L7Q8l49K37K02k50J40O2j32J95k58M09n11L11k40p4J29j79
5649a88K12o4J11J4L49l71j27o8J21o3n3L74j51J00j92m08L86k04L60k41L47j49
5671I5K23l53n4rj40K53J8K20p0k05l33L25K3l06J64O8p3j05K56p6L3J33j91p7
5695a81M9J07m8J87j01l51J93J73j8j30m6L91j66j68L8J39k26J93j0p8J75k63
5717a41L46j99j48oJ00rj99r0M70K8k1l02K3j22L59m7j30m3j08K42K11j41N7k68
5741a38Q4J03j31K03m13M20l44M50k04j80J08J13j4J62l8o2k92K10J22j65M5j43
5763a04R1q7J35J04n6j35R9l09N65j20n15M38m44M01k3J26k5k76J01r3L81k95
$$ plain form
5605 34 181 -142 -132 103 -131 200 31 217 57 -273 -206 5 -198 -49 171 72 -83 -144 46 -159 -137 -103
5627 -103 -139 -242 111 -5 32 120 -229 8 210 -40 100 162 30 225 -33 376 -135 176 -64 -138 -9 -188
5649 -188 24 -40 71 85 434 63 -64 -132 -11 -74 -127 247 96 196 4 -404 -18 -222 138 -103 244 95
5671 95 318 -35 -89 -98 -238 15 33 253 183 -22 -355 -30 -7 -313 -149 -81 -154 -259 -3 -79 -46 87 -104 -181
5695 -181 -132 -25 -73 114 13 -338 -145 28 10 -120 -166 225 59 -109 -71 68 -158 35 25 -53 122 -141
5717 -141 205 6 -142 -148 -48 -57 -256 -346 124 152 131 -171 -148 -270 89 42 -88 -131 -239 3 214 73 130 -138
5741 -138 -54 49 -82 121 -292 128 -216 234 30 -150 -42 71 57 219 181 119 -173 37 159 -6 39 -104
5763 -104 -13 -100 35 139 83 -52 47 -262 303 183 -332 106 -338 63 40 166 141 -135 -34 -127 254 -41
5785d1J15k8p1kJ2l8K49q2K91k76lj68q1K06p5k2l7L08n07N4M06k49J29nj89M14
5811C10l81k3J64OK0j07k73K15Pl2Q0Q8L8l1r8k37J94N8J25j04P4k5r6J51j00
5836B3nn9Pj50j00M06J38k52JJ68R8p07M54K62k19j60J62j8J01m5P3k44K72m10
5860b04K81j78o2J04K08k00r6j53L98k90K16J35k81L00l70J72j09J98L3k7l0m6
5882ak14M29m6k65K89k35J03K74k62J29k05j7k91L36K7O0m0L6pl2j91K78k61J44
5906C8J8j44m0K05j03K2j71K95l09L77j17L1j46k3L1N5L3o8k56J75mn5KM2J76
5931F4l43L82k14KM1J35j59K67o8m47J55K09R8Jqo0j1n6K89k58k96K84k96L40
5955E1n4r8j47J88j24O6Q2J9R1k43J51L8Q0K36l65P0P1m3p6o3R5k79N02k71O0
$$ plain form
5785 -41 74 46 -25 -27 -15 -53 196 114 405 129 126 -42 -123 83 8 -14 -51 257 -250 -196 210 -39 90 85 -104 310
5811 310 -71 -94 70 76 96 -11 -284 -69 -62 -94 -14 74 112 81 -17 -254 -60 -2 123 19 93 68 -28 123 23
5836 23 18 -41 -34 -184 -284 122 260 8 9 177 275 -432 22 284 65 -95 67 49 150 105 178 -66 206 -204
5860 -204 77 -101 -163 -59 149 -51 -147 -300 98 -192 24 159 -122 178 -192 -20 -129 69 102 75 45 -1
5882 -1 -215 214 168 -97 192 -43 60 334 72 201 -4 -21 -312 24 51 111 71 107 100 68 -123 155 -106 38
5906 38 56 -88 -128 77 -26 -4 -175 120 -189 188 71 102 -44 -67 -36 19 52 -16 -272 -97 -101 -156 -154 -112 64
5931 64 -279 103 -111 -109 -68 67 -92 175 107 -340 -185 24 122 123 115 55 44 -12 277 19 -277 7 -289 51
5955 51 -3 -101 -248 -60 -184 -118 -36 -17 74 -169 -18 20 100 336 -29 41 112 69 -7 -70 25 -254 248 -23 37
5980C7J94k64K36k60K4J61k43J39j26n1L00m03K47J29l38J39j1R0N4O6j18R2l3
6003F1j33qJ51k78K78qo9J3J09k71K63P4l39pL84k66J46q0k72J81Q5k72M54l85
6027a89J27Q7l16J94J77k21K61k35K37r2M8q2kM8k35P0J50J55m03L52p9J22j95
6050b1J15ol31K59N7j92M8J60M2K7j38Q9j41N2o1Mr6J35l8K68R6m35kr7K12j49
6076a43L93l71L1k1J43J93kk82k42N05k76L64l12m4K05j68K3M5L0j94L04k07M2
6099A6j74J95k49L78k8q4j2j21J91k68m1K0J17j97K72n0o6k69K10P0k5L64k07
6122D2j44j0M11l41J71n8j53K89j06r7J39j03l7P0M4n9m92L11J79p8J4k38K86
6145D0r6J76k03K1K51l03K55p9N1l33K38K7k13K3K13j08r0R7l36O29k93R1q6L0
$$ plain form
5980 37 231 -33 203 -57 -33 128 -115 24 -102 -153 147 -256 -9 120 -218 -79 -90 0 54 120 2 94 61
6003 61 -72 -80 71 -207 71 63 -6 7 116 -155 108 182 -157 -164 220 -46 100 20 -252 -71 14 -258 196 -189
6027 -189 -62 25 -291 -97 80 -141 120 -115 122 30 78 -4 -6 42 -193 -123 27 182 -221 131 52 174 -21
6050 -21 94 88 -243 16 73 -119 -71 89 131 158 20 109 -32 20 -41 -37 -133 2 -36 232 328 -107 -109 -206 6 -143
6076 -143 250 -121 -90 -111 32 225 223 -59 -301 204 -72 292 -20 -64 141 -27 -4 41 71 -123 181 -26 16
6099 16 -158 37 -212 166 138 54 42 -79 112 -156 -197 -177 -60 -257 15 -35 -101 -370 -160 -90 -115 249 42
6122 42 -102 -112 299 -42 129 71 -82 207 101 4 143 40 3 73 117 58 -434 -123 56 -22 -8 -246 40
6145 40 -56 120 -83 -62 189 -114 141 62 113 -220 18 45 -168 -145 68 -40 -130 -33 -369 260 -33 58 -28 2
6169BM36o83N4K06o8K80m21K30O5q7J71L0k82j98K08k3m6K10j40l3K0l9M16m11
6193a03jo1K21k00J18l0OJ19m2q8p5L16r9m20K65K74l17q3p9K66J22j47J60j85
6217f3j06J00J27q2O1N7j28M6k9j24L13l51K32k99O48n45J5L09l53J55J40k18
6239i5N7k02J03K43l94O34l33nJ01q6j48J27K02K6m04j11K28lO6j42j82K54nK14
6263A45j70K36k1l00P3L05p1k05J05j33J63N4l3k75J72r8j43J84J23l6J38m61
6285b48K74N4k13M8O1k49L11l20M84k52m1K12j31J09k55k1K35J25k30k39M86k67
6307f7M7k17L16n4r2J38p3K2k27J41K24R6j46k54K94j09k50J57o5m9L69k79r1
6330a69R6J47j2m1J99j81lm5l13K91j45L8N8J67Qj56J34j84M4k66L63j44j3j69
$$ plain form
6169 2 438 -245 -191 15 -53 227 -194 36 101 14 185 215 -67 -265 -57 -80 -126 84 -56 -89 -69 -108 308 -103
6193 -103 -104 -165 56 -144 -26 -56 -50 69 27 -61 -136 180 81 -339 -74 200 -117 -200 -279 -13 109 -38 122 -63
6217 -63 -169 -69 58 -24 37 94 -34 12 -17 -141 172 -179 53 -246 402 -143 -128 181 -172 -17 123 -95
6239 -95 -38 -240 -137 106 -288 346 13 8 109 23 -125 2 204 230 -174 -285 -57 -60 6 -136 -318 -64 -69 145
6263 145 -25 211 190 -110 -37 268 197 -8 97 -36 127 181 148 -127 45 -53 -196 -12 111 75 213 -248
6285 -248 26 80 -133 -85 -24 -273 38 -282 202 -50 -91 121 -10 99 -156 -177 58 183 -47 -286 200 -67
6307 -67 -20 -237 79 25 -67 71 -2 20 -207 -66 158 254 108 -146 148 39 -211 -54 -119 -168 201 -78 -169
6330 -169 -73 74 62 21 220 39 36 -9 -322 -31 -176 -138 -80 87 95 -61 73 -111 -67 -333 30 -114 -127 -296
6354b96L43l8j62K76j03J01j18r7J7k9l9j1R9K43l21L66l67J0M1N2P2o6Q1j44
6378i0j48K94j79Q9J18r8J27j51oj21K50j62J71j57K23k52J10J78j66P7m7PKj71
6402a02q6O6R0J06J48j49m3J81k25p8j5R3k1j24J77k26O5n5M42j14j22j25K31
6425A14K0j41j57L12j22K6j80Q9J77k22J24Q2l17J48k1j65J79l37P99m48L66m73
6447a47L8L05r3j43L28j00j01R4k39M9k8l1k6J55r6J0MK34l81J72R3J0k54N3o0
6472a54L14j46k8J38k06J53k58l3lK41j6q8j9K87p3k50J98k01N1k2m1R9J27r2
6496b2R1k9O4j00J11k33K45j53j41K81J15j59l21J46j33R4m9j64M01j54J83Nr2
$$ plain form
6354 -296 47 9 -153 123 20 121 3 -94 -77 -106 -145 -156 -57 186 -135 231 -136 -126 -85 -33 39 -27 54 -90
6378 -90 -238 56 -123 -34 84 -14 113 -38 -44 -165 85 -77 94 -63 160 -92 18 196 30 107 60 67 69 -102
6402 -102 -188 -122 -32 74 222 73 30 211 -14 -92 -107 -14 -35 -159 18 -208 -143 -198 244 130 8 -117 114
6425 114 134 -7 -164 148 26 52 -128 -39 138 -84 40 122 -195 -47 -68 -233 -54 -391 408 -40 326 -147
6447 -147 -109 196 103 -40 288 188 87 181 -58 -9 -37 -68 -94 61 -35 -25 -21 213 -168 4 97 107 -147 -94 -154
6472 -154 160 14 -14 124 -82 71 -187 -220 -223 18 2 -86 -105 182 109 -141 57 -144 -93 -115 -156 -57 70 -22
6496 -22 69 40 104 4 115 -118 127 -26 -167 114 229 70 -251 -105 -238 -144 -193 -357 44 -110 73 78 -14
$$ [...]
8191D53
##END NTUPLES=NMR FID
##END=
