##TITLE=1H_DE-93K-d6
 200.13MHz, DMSO-d6,
 8 sc
 
 6.5.2025
##JCAMPDX= 6.0         $$ Bruker NMR JCAMP-DX V2.0
##DATA TYPE= NMR FID
##DATA CLASS= NTUPLES
##ORIGIN= UXNMR, Bruker Analytische Messtechnik GmbH
##OWNER= pz
$$ XWIN-NMR		Version 3.5
$$ Tue May  6 15:40:52 2025 Russian Standard Time (UT+4h)  she@DPX200
##.OBSERVE FREQUENCY= 200.1313
##.OBSERVE NUCLEUS= ^1H
##.DELAY= (6, 6)
##.ACQUISITION MODE= SIMULTANEOUS
##.ACQUISITION SCHEME= undefined
##.AVERAGES= 8
##.DIGITISER RES= 18
##SPECTROMETER/DATA SYSTEM= spect
##.PULSE SEQUENCE= zg30
##.SOLVENT NAME= DMSO
##.SHIFT REFERENCE= (INTERNAL, DMSO, 0, 14.3821)
##AUDIT TRAIL= $$ (NUMBER, WHEN, WHO, WHERE, WHAT)
$$ ##TITLE= Audit trail, XWIN-NMR		Version 3.5
$$ ##JCAMPDX= 5.01
$$ ##ORIGIN= Bruker BioSpin GmbH
$$ ##OWNER= she
$$ F:/spectra/data/she/nmr/H-C/1/audita.txt
$$ ##AUDIT TRAIL=  $$ (NUMBER, WHEN, WHO, WHERE, WHAT)
(   1,<2025-05-06 15:39:39.29 +0400>,<she>,<DPX200>,
      <created by zg, POWCHK disabled, PULCHK disabled
       configuration hash MD5:
       00 E9 B6 7A A2 85 ED C7 34 08 36 98 17 FE 4E 26
       data hash MD5: 16K
       F3 07 61 2A 8A 7F FE 4D C3 E9 E9 D2 CB F0 DF F3>)
$$ ##END=
$$ 
$$ hash MD5
$$ 1D F5 BC 83 27 A3 27 76 22 1F 7A 8B 41 DE 00 CD
##$RELAX= 
##$RELAX= 
##$RELAX= 
##$RELAX= 
##$RELAX= 
##$RELAX= 
$$ Bruker specific parameters
$$ --------------------------
##$DU= <F:/spectra>
##$EXPNO= 1
##$NAME= <H-C>
##$PROCNO= 1
##$TYPE= <nmr>
##$USER= <she>
##$AMP= (0..31)
100 100 100 100 100 100 100 100 100 100 100 100 100 100 100 100 100 100 
100 100 100 100 100 100 100 100 100 100 100 100 100 100 
##$AQSEQ= 0
##$AQ_mod= 1
##$AUNM= <au_zg>
##$AUTOPOS= <>
##$BF1= 200.13
##$BF2= 200.13
##$BF3= 200.13
##$BF4= 200.13
##$BF5= 200.13
##$BF6= 200.13
##$BF7= 200.13
##$BF8= 200.13
##$BYTORDA= 1
##$CFDGTYP= 0
##$CFRGTYP= 5
##$CHEMSTR= <none>
##$CNST= (0..31)
1 1 145 1 1 1 1 1 1 1 1 1 1 1 1 1 1 1 1 1 1 1 1 1 1 1 1 1 1 1 1 1 
##$CPDPRG= <>
##$CPDPRG1= <>
##$CPDPRG2= <>
##$CPDPRG3= <>
##$CPDPRG4= <mlev>
##$CPDPRG5= <mlev>
##$CPDPRG6= <mlev>
##$CPDPRG7= <mlev>
##$CPDPRG8= <mlev>
##$CPDPRGB= <>
##$CPDPRGT= <>
##$D= (0..31)
0 0.7 0 0 0 0 0 0 0 0 0 0.03 0 0 0 0 0 0 0 0 0 0 0 0 0 0 0 0 0 0 0 0 
##$DATE= 1746531578
##$DBL= (0..7)
120 120 120 120 120 120 120 120 
##$DBP= (0..7)
150 150 150 150 150 150 150 150 
##$DBP07= 0
##$DBPNAM0= <>
##$DBPNAM1= <>
##$DBPNAM2= <>
##$DBPNAM3= <>
##$DBPNAM4= <>
##$DBPNAM5= <>
##$DBPNAM6= <>
##$DBPNAM7= <>
##$DBPOAL= (0..7)
0.5 0.5 0.5 0.5 0.5 0.5 0.5 0.5 
##$DBPOFFS= (0..7)
0 0 0 0 0 0 0 0 
##$DE= 6
##$DECBNUC= <off>
##$DECIM= 32
##$DECNUC= <off>
##$DECSTAT= 4
##$DIGMOD= 1
##$DIGTYP= 9
##$DL= (0..7)
0 120 120 120 120 120 120 120 
##$DP= (0..7)
150 150 150 150 150 150 150 150 
##$DP07= 0
##$DPNAME0= <>
##$DPNAME1= <>
##$DPNAME2= <>
##$DPNAME3= <>
##$DPNAME4= <>
##$DPNAME5= <>
##$DPNAME6= <>
##$DPNAME7= <>
##$DPOAL= (0..7)
0.5 0.5 0.5 0.5 0.5 0.5 0.5 0.5 
##$DPOFFS= (0..7)
0 0 0 0 0 0 0 0 
##$DQDMODE= 0
##$DR= 18
##$DS= 0
##$DSLIST= <SSSSSSSSSSSSSSS>
$$ [...]
##$SUBNAM0= <"">
##$SUBNAM1= <"">
##$SUBNAM2= <"">
##$SUBNAM3= <"">
##$SUBNAM4= <"">
##$SUBNAM5= <"">
##$SUBNAM6= <"">
##$SUBNAM7= <"">
##$SUBNAM8= <"">
##$SUBNAM9= <"">
##$SW= 18.0517328524113
##$SWIBOX= (0..15)
0 0 2 0 0 0 0 0 0 0 0 0 0 0 0 0 
##$SW_h= 3612.71676300578
##$TD= 16384
##$TD0= 1
##$TE= 0
##$TE2= 300
##$TE3= 300
##$TEG= 300
##$TL= (0..7)
0 120 120 120 120 120 120 120 
##$TP= (0..7)
150 150 150 150 150 150 150 150 
##$TP07= 0
##$TPNAME0= <>
##$TPNAME1= <>
##$TPNAME2= <>
##$TPNAME3= <>
##$TPNAME4= <>
##$TPNAME5= <>
##$TPNAME6= <>
##$TPNAME7= <>
##$TPOAL= (0..7)
0.5 0.5 0.5 0.5 0.5 0.5 0.5 0.5 
##$TPOFFS= (0..7)
0 0 0 0 0 0 0 0 
##$TUNHIN= 0
##$TUNHOUT= 0
##$TUNXOUT= 0
##$USERA1= <user>
##$USERA2= <user>
##$USERA3= <user>
##$USERA4= <user>
##$USERA5= <user>
##$V9= 5
##$VALIST= <valist>
##$VCLIST= <CCCCCCCCCCCCCCC>
##$VD= 0
##$VDLIST= <DDDDDDDDDDDDDDD>
##$VPLIST= <PPPPPPPPPPPPPPP>
##$VTLIST= <TTTTTTTTTTTTTTT>
##$WBST= 1024
##$WBSW= 4
##$XGAIN= (0..3)
0 0 0 0 
##$XL= 0
##$YL= 0
##$YMAX_a= 124294
##$YMIN_a= -202277
##$ZGOPTNS= <>
##$ZL1= 120
##$ZL2= 120
##$ZL3= 120
##$ZL4= 120
##$ABSF1= 10
##$ABSF2= 0
##$ABSG= 5
##$ABSL= 3
##$ALPHA= 0
##$AQORDER= 0
##$ASSFAC= 0
##$ASSFACI= 0
##$ASSFACX= 0
##$ASSWID= 0
##$AUNMP= <proc_1d>
##$AZFE= 0.1
##$AZFW= 0.1
##$BCFW= 1
##$BC_mod= 2
##$BYTORDP= 1
##$COROFFS= 0
##$CY= -3
##$DATMOD= 1
##$DC= 2
##$DFILT= <>
##$DTYPP= 0
##$F1P= 0
##$F2P= 0
##$FCOR= 0.5
##$FTSIZE= 0
##$FT_mod= 4
##$GAMMA= 1
##$GB= 0.15
##$INTBC= 1
##$INTSCL= 1
##$ISEN= 128
##$LB= 0.25
##$LEV0= 0
##$LPBIN= 0
##$MAXI= 10000
##$MC2= 0
##$MEAN= 0
##$ME_mod= 0
##$MI= 1.114404
##$NCOEF= 0
##$NC_proc= 0
##$NLEV= 6
##$NOISF1= 3.799351
##$NOISF2= 2.8
##$NSP= 1
##$NTH_PI= 0
##$NZP= 0
##$OFFSET= 14.38212
##$PC= 1
##$PHC0= -1549.376
##$PHC1= 10.59221
##$PH_mod= 1
##$PKNL= yes
##$PPARMOD= 0
##$PSCAL= 0
##$PSIGN= 0
##$REVERSE= no
##$SF= 200.129724274929
##$SI= 16384
##$SIGF1= 3
##$SIGF2= 2
##$SINO= 400
##$SIOLD= 16384
##$SREGLST= <1H.CDCl3>
##$SSB= 0
##$STSI= 0
##$STSR= 0
##$SW_p= 3205.1282051282
##$SYMM= 0
##$S_DEV= 0
##$TDeff= 0
##$TDoff= 0
##$TI= <>
##$TILT= no
##$TM1= 0
##$TM2= 0
##$TOPLEV= 0
##$USERP1= <user>
##$USERP2= <user>
##$USERP3= <user>
##$USERP4= <user>
##$USERP5= <user>
##$WDW= 1
##$XDIM= 8192
##$YMAX_p= 0
##$YMIN_p= 0
$$ End of Bruker specific parameters
$$ ---------------------------------
##NTUPLES= NMR FID
##VAR_NAME=  TIME,          FID/REAL,        FID/IMAG
##SYMBOL=    X,             R,               I
##VAR_TYPE=  INDEPENDENT,   DEPENDENT,       DEPENDENT
##VAR_FORM=  AFFN,          ASDF,            ASDF
##VAR_DIM=   8192,          8192,            8192
##UNITS=     SECONDS,       ARBITRARY UNITS, ARBITRARY UNITS
##FACTOR=    0.0002768,     1,               1
##FIRST=     0,             0,               0
##LAST=      2.2672688,     0,               0
##MIN=       0,             -202277,         0
##MAX=       2.2672688,     124294,          0
$$ Real data points
##PAGE= N=1
##DATA TABLE= (X++(R..R)), XYDATA
0@%%%%%%%%%%%%%%%%Qj6J6j6J6j6K2l0L2l5M3m8N4o2P0q3R4j04J16j30J46j63
$$ 0 0 0 0 0 0 0 0 0 0 0 0 0 0 0 0 0 8 -8 8 -8 8 -8 14 -16 16 -19 24 -24 30 -32 38 -45 49 -55 61 -69 77 -86
38h6J84k07K30k54K81l11L44l80M20m63N10n61O15o77P48q29R18j017J131j265
$$ -86 98 -109 121 -133 148 -163 181 -199 221 -242 268 -293 322 -355 393 -436 482 -535 596 -669
58f69J422j607J833k118K483k971L657m689O400r695J8152p8536j35939K60629
$$ -669 753 -854 979 -1139 1344 -1627 2030 -2659 3741 -5954 12198 -66338 -202277 58352
72E8352O5942j68166O2210R9074q6681J5503M1817j06732m33R1284r9177q9734
$$ 58352 124294 -43872 18338 117412 30731 46234 88051 -18681 -19114 72170 -27007 -116741
84a16741P2801l620m0909P4711m252n2052J11743O1346j17968J786J08459l4926
$$ -116741 -43940 -47560 -88469 -13758 -18010 -70062 41681 103027 -14941 -13155 95304 60378
96F0378o9156J8553J320O890K5203n9249l8125P2931j041q2271J7478L8920l5219
$$ 60378 -8778 9775 11095 17985 43188 -16061 -54186 18745 17704 -64567 -47089 -8169 -43388
109d3388J0090L1176l4008K2946P7838k5243m3465N0324K0416l9690n639j1038
$$ -43388 -33298 -2122 -36130 -13184 64654 39411 -4054 46270 66686 26996 21357 10319
121A0319k7178K2200j910o1927N924N7410j5154l2157K7863J6692r178J0781J13
$$ 10319 -16859 5341 3431 -58496 -52572 4838 -10316 -42473 -14610 2082 -7096 3685 3798
134C798j2073K3568K0601k0654r420K0199R079q525j6524k0029k532O765j3654
$$ 3798 -8275 15293 35894 15240 5820 26019 35098 26573 10049 -9980 -12512 -5747 -19401
147a9401k0871L808J9169N576j2110O81K8592K1604o732o393O025M807L740o781
$$ -19401 -40272 -36464 -17295 -11719 -23829 -23148 5444 27048 20316 13923 19948 24755 28495 21714
161B1714k3083j044K2648j2941l6707N416K2319p767j3776k435J222J8402J2179
$$ 21714 -1369 -2413 20235 7294 -29413 -23997 -1678 -9445 -23221 -25656 -24434 -6032 6147
174F147j9834j36L6784Q670j8879L500Q646l879Q50j3991k6335R113J9147k5041
$$ 6147 -13687 -13823 22961 31631 12752 16252 24898 21019 21869 7878 -18457 -9344 9803 -15238
188a5238k3068J8436J2875o370j74K22P482K5044m28k5387J0728K7873j1020j7523
$$ -15238 -38306 -19870 -6995 -13365 -13539 -13317 -5835 19209 18781 -6606 4122 31995 20975 3452
202C452L962K012K36O29k0355j3079K1317M070k8636m252K2511M615n258K882
$$ 3452 7414 9426 9662 10291 -10064 -23143 -1826 2244 -26392 -30644 -8133 -3518 -8776 -5894
216e894K443J3452J7363j1656j6022J5389J1653j7951j2887K400O20R22n234j5676
$$ -5894 -3451 10001 27364 15708 -314 15075 26728 8777 -4110 -1710 -1090 -168 -5402 -21078
230b1078K767J9191m119j6905P117J6328J244l357p01K133J2229O181j3962o640
$$ -21078 -18311 880 -3239 -20144 -13027 3301 4545 1188 487 2620 14849 21030 7068 428
244D28J3164L407j5440r718R33K151r90q461p524R650J4312m030q474R343J3823
$$ 428 13592 16999 1559 -8159 -7226 -5075 -6065 -14526 -22050 -12400 1912 -2118 -10592 -1249 12574
259A2574M2o904k649N083O655m592j2346r04J0061q00j2725o124N449M401m133
$$ 12574 12616 5712 3063 8146 14801 10209 -2137 -3041 7020 6220 -6505 -12629 -7180 -2779 -6912
274f912o964L05J0192O752m389l377Q771J0885j572p955r40N914R20q932r670
$$ -6912 -13876 -13571 -3379 3373 -1016 -4393 4378 15263 13691 5736 4796 10710 11630 2698 -6972
289f972P68N661k920r163j658Q986N276m155l784M765Q322J632m782j094P068
$$ -6972 -6204 -543 -3463 -12626 -14284 -5298 -22 -4177 -7961 -3196 5126 6758 1976 882 7950
304G950N518n166p411J674M662k377q967n957K864M539l756o512L171R072K066
$$ 7950 13468 8302 891 2565 7227 4850 -4117 -10074 -7210 -2671 -6427 -12939 -9768 -696 1370
319A370l908N36O855N687q79n325r80M355P04p244n465K294K535l214n191j026
$$ 1370 -2538 -2002 4853 10540 9661 4336 3356 7711 8415 1171 -4294 -2000 535 -2679 -7870 -8896
335h896M943L661l405m590M248Q305N3m311J127O077J921l598m646O87L923j360
$$ -8896 -3953 -292 -3697 -8287 -4039 4266 4319 8 1135 7212 9133 5535 889 1576 5499 4139
351D139p663l728M785K187m475l180K241M173J205k141o00M824N308k068m095
$$ 4139 -3524 -7252 -2467 -280 -4755 -7935 -5694 -1521 -316 -2457 -3057 1767 7075 5007 912
366I12R17M745l43m674k849J654K208l202n211L70M154R9m549j503M335L925k94
$$ 912 1829 6574 6231 1557 -1292 362 2570 -632 -5843 -5473 -1319 -1220 -5769 -7272 -2937 988 694
383F94j314J030M087J720k872j499J527J547j318m235k425J853J498l219l695
$$ 694 -620 410 4497 6217 3345 1846 3373 4920 3602 -633 -3058 -1205 293 -2926 -6621
398f621J083L614J5j842R06M262K242j566j425K351K950o96k748j495O87L85k099
$$ -6621 -5538 -1924 -1909 -3751 -2845 1417 3659 2093 668 3019 5969 5273 2525 1030 1717 2102 3
415Cl471n96J470j02j809p96K548L472J82k592P95M565N02k326K71J694M29j076
$$ 3 -3468 -4064 -2594 -2696 -4505 -5301 -2753 719 901 -1691 -896 3669 4171 1845 2116 3810 4239 3163
433C163k265k102J353J92l646k085J738J206o70O11l11J983L672J31l483K283
$$ 3163 898 -1204 149 341 -3305 -5390 -3652 -2446 -3116 -2505 -2816 -833 2839 2970 -513 1770
449A770L723j974k393M15M52L70j445l431m64K940p88m100J155K346r55O46M25
$$ 1770 5493 3519 1126 1541 1993 2363 918 -2513 -2977 -37 -825 -4925 -3770 -1424 -2379 -1733 -1308
466a308l46L014L181k301j052L667J71l781n37k00j383L21j255l225K334K783
$$ -1308 -1654 1360 4541 2240 1188 4855 5026 1245 708 508 -875 -554 -1809 -5034 -2700 83
482H3k773o27K998N05q30J733m47k95L175m8l447J272K784k632j124K99k497K58
$$ 83 -2690 -3317 -319 186 -644 1089 642 347 3522 3474 27 1299 4083 1451 327 626 -1871 -1613
500a613J167l436j007M073k32k576K884K269j019J900J040l401J824K335m446
$$ -1613 -446 -3882 -4889 -816 -1048 -3624 -740 1529 510 2410 3450 49 1873 4208 -238
515b38j705M059j165k981K446J21k936J267J248l422N14L354j497j059K977l7
$$ -238 -1943 2116 951 -2030 416 537 -2399 -1132 116 -3306 -2792 562 -935 -1994 983 946
531I46k97K460j44j914J744J41l387r83J043n78q91P8m52Q47P61p31N21J300J15
$$ 946 649 3109 2965 1051 2795 2936 -451 -1434 -391 -969 -1860 -1782 -2234 -1387 -626 -1357 -836 464 579
550E79j00P28j003m27K471j04k276J912J303k220j791J450j570j486P66k10j045
$$ 579 479 1207 204 -223 2248 2144 -132 1780 3083 863 -928 522 -1048 -2534 -1768 -1978 -3023
567c023J931R69j732J828K907j402k70J420o95j606N43L09j925j14J222n10j603
$$ -3023 -1092 -123 -1855 -27 2880 1478 1208 2628 1933 327 870 1179 -746 -860 362 -148 -1751
584a751N07Q46m53q39O02K42K86L95O4K93R83J246m60n06P84p50j166k30r04r79
$$ -1751 -1244 -398 -851 -1690 -1088 -846 -560 -165 -101 192 1175 2421 1961 1455 2239 1489 323 93 -811 -1790
604a790k9M14p07N84J433J74r65J238Q70o68j95R63o61k63N08n9l97J90k13p33
$$ -1790 -1819 -1405 -2112 -1528 -95 79 -886 352 1222 554 359 1322 661 398 906 847 450 640 427 -306
624c06j9m12r99K04J09m2j01J290K22k5Q71R40R7j64n1k79l01m68j248k33K86
$$ -306 -325 -737 -1736 -1532 -1423 -1465 -1566 -276 -54 -79 792 1732 1829 1665 1614 1335 1034 566 -682 -915 -629
645f29n73K80L08m56J1O96k18m53J103L66n78Q26P71m37j2N60n63o91L96o94j520
$$ -629 -1202 -922 -614 -1070 -1059 -363 -581 -1034 69 435 -143 683 1454 1017 1005 1565 1002 311 707 13 -1507
666a507N31J60r40K35J118n49p5J454K28k53O64O13q30K9K24r46K39O56r43n76
$$ -1507 -976 -816 -1756 -1521 -403 -952 -1027 427 655 402 1066 1679 849 878 1102 156 395 1051 108 -468
686d68O89q59p05O93j52o77J54J182n27Q47Q09k72L33M28j3r53N19l82j309K31
$$ -468 221 -638 -1343 -650 -802 -1479 -1325 -143 -670 177 986 714 1047 1475 1462 509 1028 646 -663 -432
706d32K62j069K09P46q60j0N05J15k04J083%m67P13L89m44L05M72m47o16M79p56
$$ -432 -170 -1239 -1030 -284 -1144 -1154 -649 -534 -738 345 345 -122 591 980 536 841 1313 866 250 729 -27
727b7n74j9k84o19L30O22k97L57O89j19J79N53l20J46M61p1p73M31no73pl3j39
$$ -27 -601 -620 -904 -1523 -1193 -571 -868 -511 178 59 238 791 471 617 1078 1007 234 665 660 -13 -20 -53 -192
750a92p54K97l2l78O90K32j80L73K11J79J25J49k58K66Q2k51p16J76J6o69M1K51
$$ -192 -946 -649 -681 -1059 -369 -137 -317 56 267 446 571 720 462 728 810 559 -157 19 35 -634 -593 -342
772c42k27nQ6K00K24j33p2r2P34M75k53J40k6Q5l56o6j33k69p7m24l11J96N4J1
$$ -342 -569 -574 -488 -288 -64 -197 -269 -361 373 848 595 735 709 794 438 372 239 -30 -107 -531 -842 -646 -592 -581
796e81j68L10L18M4M8N19K37J14j53k37L9J5k10p22J04L30n08k05J64j77K68K22
$$ -581 -749 -439 -121 -77 -29 490 727 841 688 451 490 505 295 -427 -323 7 -501 -706 -542 -719 -451 -229
818b29M2J89K20K01P2K20K3j66J75n1o44o1O0m60n7m1q7j86M30l9R0K74L49j07
$$ -229 -187 2 222 423 495 715 738 572 747 696 52 -9 51 -409 -466 -507 -594 -780 -350 -389 -299 -25 324 217
842B17J28L72J35o18L66l02j94J81k41k65L35k36n29K97J41j1n7J24K14M8M3N38
$$ 217 345 717 852 234 600 298 104 285 44 -221 114 -122 -651 -354 -213 -224 -281 -157 57 105 148 686
864F86k09J00K22m6j82m58J1k45K9j74j6k82k71N37J24j13L3M10k32K91J45j52
$$ 686 477 577 799 753 571 113 124 -121 -92 -266 -282 -564 -835 -298 -174 -287 -254 156 -76 215 360 208
886B08O2Jj70k5K55O3m06j64k91j32J26J45k21P4M85j24J85K71K05j43j15j25
$$ 208 270 271 101 76 331 394 -12 -176 -467 -599 -473 -328 -549 -475 10 -114 71 342 547 404 289 164
908A64j94L24p2k36r4L85k86n36J94J80k64p8K67j84L69k35K74L26Q4N1k73K60
$$ 164 -30 294 222 -14 -108 277 -9 -545 -351 -171 -435 -513 -246 -430 -61 -296 -22 304 388 439 166 426
930D26k98J1K09m90m71L54K27m07J13k6L2p5P5M43j62O7M38m12K53L49n22PK76
$$ 426 128 139 348 -142 -613 -259 -32 -439 -326 -352 -320 -395 -320 123 -39 28 466 54 307 656 134 141 417
953D17n65P3N2j88l67L32j2j16L04k31M66j30K7J85j8J73L1k79J15o3k37j60K46
$$ 417 -148 -75 -23 -211 -578 -246 -258 -374 -70 -301 165 35 62 247 229 402 433 154 269 206 -31 -191 55
976E5k95J73n5l17N00k96l8J02r2L61N1P0J86O4k40j56K72m57m8Q6K16l64J18
$$ 55 -240 -67 -122 -439 61 -235 -273 -171 -263 98 149 219 405 469 229 73 345 -112 -160 -74 142 -222 -104
999a04Q2j73M2j45L34k25O3K3j9j7L35j77J08p9J8k75L55r6K7Pj70k48M1L3q1
$$ -104 -22 -195 -153 -298 36 -189 -126 -103 -122 -139 196 19 127 48 66 -209 146 50 77 84 -86 -334 -293 -260 -341
1024c41J37L71m52N17j45r6M37rj19j1k53J1P3j32k32P2L03k95J34k11Oj42K64
$$ -341 -204 167 -285 232 87 -9 428 419 300 289 36 47 120 -12 -244 -172 131 -164 -30 -241 -235 -377 -113
1047a13J96q3mJ47J63m70M89j3k0j35J27m24o6Q8j22k55R27n58l09J72L63j60
$$ -113 83 0 -4 143 306 -164 325 312 292 157 284 -140 -206 -118 -240 -495 432 -126 -435 -263 100 -60
1069f0L4J09R5J28l14L73j96j9j80k47L88p7k62J65K5M4k97J98r2J12R4r2J79
$$ -60 -26 83 178 306 -8 365 169 150 -30 -277 111 34 -228 -63 -38 6 -291 -93 -185 -73 21 -71 108
1092A08L1J39k99N1K13m31K68m09L93l83L44Ok20K84j24k00J80L24m00J68l1J8
$$ 108 139 278 -21 30 243 -188 80 -329 64 -319 25 31 -189 95 -29 -229 -49 275 -125 43 12 30
1114C0P0J58r2l57L10L1j99J60j02N7r0k3n9k8L16j2k98L33j55j06J20L37l65
$$ 30 100 258 166 -191 119 150 -49 111 9 66 -24 -47 -106 -134 182 170 -128 205 50 -56 64 401 36
1137C6J01j49j47M25n24K03J54j38k10M17j93k32K94N8o0l7J91K2j11K4j00K20
$$ 36 137 -12 -159 266 -258 -55 99 -39 -249 168 -25 -257 37 95 35 -2 189 211 100 124 24 244
1159B44J57k27j68J64r9J02k09M02k44k01mL08l6j79k22M92k10J96k49K61k82
$$ 244 401 174 6 170 71 173 -36 366 122 -79 -83 225 189 10 -212 280 70 266 17 278 -4
1180dj67J62K40l11l1J77j72K69l46J78l3O0j83J88L3Q8k17J05K70r7J6l13j2
$$ -4 -171 -9 231 -80 -111 66 -106 163 -183 -5 -38 22 -161 27 60 148 -69 36 306 209 225 -88 -100
1203a00o7QP9j68OMK65N6k63J34Ro8J61j98R6K7j1L46l61J76k64K67k32M9L28
$$ -100 -167 -159 -80 -248 -242 -238 27 83 -180 -46 -37 -105 56 -142 -46 -19 -30 316 -45 131 -133 134 -98 -49 279
1228B79n03J30M8j81M05k55K7k83M04j42L41l26K1J00R7O7k18j63L49j61O5j56
$$ 279 -224 -94 -46 -227 178 -77 -50 -333 71 -71 270 -56 -35 65 162 229 11 -152 197 36 101 -55
1250e5M7o0k28L72j45N3n0j66K37k19M91O7j07k97N5oP7j85K32m53L40Lj94N12
$$ -55 -8 -68 -296 76 -69 -16 -66 -232 5 -214 277 344 237 -60 -5 -11 66 -119 113 -340 0 3 -191 321
1274C21l08LM8Mk06P6K98j17k94J93j25o7K03J96n1k75OJ8N7L7N8j25J94j78J6
$$ 321 13 16 64 68 -138 -62 236 119 -175 18 -107 -174 29 225 174 -101 -95 -77 -20 17 75 -50 144 -34 -18
1299a8r2m8Q7J82k67L01j26qR5j70j7o9J30p2L01k34L62n61L37r8j72O0Q2j25
$$ -18 -110 -158 -71 111 -156 145 19 11 106 -64 -81 -150 -20 -92 209 -25 337 -224 113 15 -157 -97 -15 -140
1323a40J94K31l33O1kl36N05n4m60L09j5p7K6J78j08j57l2K24R5P3j94p7Q4L76
$$ -140 54 285 -48 13 11 -325 180 126 -334 -25 -40 -117 -91 87 -21 -178 -210 14 109 182 -12 -89 -5 371
1347C71k73p1O7p5m1LJ5k2o8j31K16K22j67j69Q7j19K42o7j86K12pj39j14J70
$$ 371 98 27 94 19 -22 -19 -4 -26 -94 -225 -9 213 46 -123 -36 -155 87 20 -166 46 39 -100 -214 -44
1371d4p8K11k29K10k79L08k72K24j8k15K22Rp2M2p2K27N6l01r2Q1j0J33m6L15
$$ -44 -122 89 -140 70 -209 99 -173 51 33 -182 40 49 -23 19 -53 174 230 -71 -163 -82 -92 41 -5 310
1395C10m20J47J14n8k24qJ33K7J4j6K6q0j25J92n5q3k11L23L4l41O26l29J72j17
$$ 310 -110 37 151 93 -131 -139 -6 21 35 19 45 -35 -160 32 -23 -106 -317 6 40 -301 325 -4 168 51
1419E1Q9q5J79l81J68j02K12j89M7q2K57l5j66K32j45lN4j99rj8L46j05n5jk32
$$ 51 140 55 234 -147 21 -81 131 -58 -11 -93 164 129 -37 195 50 47 101 -98 -107 -125 221 116 61 60 -172
1444a72J60J07j59K4q1M8J31J87k82l2R5p9k9L9o0J11j48j20M07j72L21n37N9
$$ -172 -12 95 -64 -40 -121 -73 58 245 -37 -69 26 -53 -82 -43 -103 8 -140 -260 147 -25 296 -241 -182
1467a82K19r1J61m5J06J98l00j34L9K07j27nLj47K62k43j80K4K80j35jK58n2r9
$$ -182 37 -54 107 62 168 366 66 -68 -29 178 51 46 49 -98 164 -79 -259 -235 45 -90 -91 167 115 16
1491A6K4k42Q1J20K39j67k51K30r1j23J8J34r9J67J09K8j68k28L88J2l71K35K1
$$ 16 40 -202 -121 -1 238 71 -180 50 -41 -164 -146 -12 -111 56 165 193 25 -203 185 197 -174 61 82
1514H2j59J49j6j38M78k53m09L35j38J28j8j69Kr8l2M82m06J29m0mL20l67L53
$$ 82 -77 72 56 -82 396 143 -266 69 -69 59 41 -128 -126 -224 -256 226 -180 -51 -91 -95 225 -142 211
1537B11m32J90L6J29k37K05n6o3m8j19K63k3K38l07Q9j13m4j48M21j31r2J89p4
$$ 211 -221 -31 5 134 -103 102 46 -17 -65 -184 79 56 294 -13 76 -37 -81 -229 192 61 -31 158 84
1560H4qj76J63JL09j76k79K8K92p2j88L81k65j76P8L4j56k39N03r3j33m1K37J37
$$ 84 76 -100 63 64 373 197 -82 -54 238 166 -22 359 94 -82 -4 30 -126 -365 138 45 -88 -129 108 245
1584B45j84K87l77rj2O6Nmj32n1K19k32R2P7N0J57j78j45L33j48O0J00j71k85
$$ 245 61 348 -29 -38 -50 16 21 17 -115 -166 53 -179 -87 -10 40 197 19 -126 207 59 119 219 48 -237
1608b37R9J06J42j59O7K1j79P6K4o5k05K14J94l95L83N4k15n1q2M78j23j18m7
$$ -237 -138 -32 110 -49 18 39 -140 -64 -40 -105 -310 -96 98 -297 86 140 -75 -126 -208 270 147 29 -18
1631a8K22k02r3j30K07p4j59K22j5K97m7k53L77l92J74j15K33l31l5K60L4M9o7
$$ -18 204 2 -91 -221 -14 -88 -247 -25 -40 257 210 -43 334 -58 116 1 234 -97 -132 128 162 211 144
1654A44k36K01l09M19k82Q5m45L52J40l69K72K16l33K05j50J98j53K25m34N41
$$ 144 -92 109 -200 219 -63 22 -423 -71 69 -300 -28 188 -145 60 -90 108 -45 180 -254 287
1674B87l25J23j21k6J99n00Q5L05O1k44l04M40J65k68L11k03k02M3J39q1J99j65
$$ 287 -38 85 -36 -62 137 -363 -278 27 88 -156 -460 -20 145 -123 188 -15 -217 -174 -35 -116 83 -82
1696h2J36mJ41l09L8j02K27j74K72o5jk12J78N7j42k08Q4J44K49m23k9L97k98
$$ -82 54 50 191 -118 -80 -182 45 -129 143 78 77 -135 43 100 -42 -250 -166 -22 227 -196 -225 172 -126
1719a26k2J40j69O8J62J85J22m75L94n15J75j41M10j93M0j9k58R2K93j13m95M47
$$ -126 -148 -8 -177 -109 53 238 360 -115 279 -236 -61 -202 208 15 55 36 -222 -130 163 50 -445 2
1741Bk2P2j37j58K85N5j07m5N1L7J44m12L57j01J3j68k0N8L8K8L01l56Q7j04J34
$$ 2 -20 52 -85 -243 42 97 -10 -55 -4 33 177 -235 122 21 34 -134 -154 -96 -58 -30 271 -85 2 -102 32
1766C2l5M01j89j14N3R4k50R8K43j39O5j24k25J47j13J91Q4j22k81R4L3N7l8j35
$$ 32 -3 398 209 95 148 242 -8 90 333 194 259 135 -90 57 -56 135 219 97 -184 -90 -57 0 -38 -173
1790a73M82j72l57J81k16K90o6P5K68m69K72k85j30K58K70j12r5l17L09K15j52
$$ -173 309 137 -220 -39 -255 35 -31 44 312 -157 115 -170 -300 -42 228 116 21 -296 13 228 76
1811G6k91K38J59j19J81j88K87l71Q8M7K1k01J99L3k44J89j88K29p6j03R0K12
$$ 76 -215 23 182 63 244 56 343 -28 60 107 128 -73 126 159 -85 104 -84 145 69 -34 56 268
1833B68j03K2r4j02k82K70J22j15r2Q5j05j94N4K34K5m3J91l1j72R6J9j81j15
$$ 268 165 187 93 -9 -291 -21 101 -14 -106 -21 -126 -320 -266 -32 -7 -50 141 110 -62 34 53 -128 -243
1856b43K69j3LJ25mL0k22R3O5j35r0J23J7K07l62J03J49j41J4Q7n4P4J88k96j82
$$ -243 26 13 16 141 137 167 -55 38 103 -32 -122 1 18 225 -137 -34 115 -26 -12 75 21 95 283 -13 -195
1881a95k8L04j9m9j36P4R1l0l30K87O7P3J8j09o4Q6N9k25J78R8k46O1j03J94L57
$$ -195 -223 81 62 13 -123 -49 42 12 -318 -31 36 109 127 18 -46 40 99 -126 52 150 -96 -35 -138 56 413
1906D13p42L54J45j04k02lKJ78K22k78J28l79L21j04j87J56K6L17k63r9R2j9K18
$$ 413 -329 25 170 66 -136 -139 -137 41 263 -15 113 -266 55 -49 -236 -80 -54 263 0 -99 -7 -26 192
1929A92k31Q7N9k83J32K05k42K49P3k70m9J5l3J22j53J89R3j37J98j76k9J15j72
$$ 192 -39 48 107 -176 -44 161 -81 168 241 -29 -78 -63 -96 26 -127 62 155 18 216 40 11 126 -46
1952d6p9j21P4K47Q1p2j5j70lK02j71J97j16J14j07j11J19j94j34N23k74L6J20
$$ -46 -125 -246 -172 75 156 84 69 -101 -104 98 -73 124 8 122 15 -96 23 -171 -305 218 -56 -20 100
1975A00r4oJ56k12l2K89L3j75K58l35J16L3o9j83L40k20mJ21o5m4Q1k13M4K2J57
$$ 100 6 0 156 -56 -88 201 234 59 317 -18 98 131 62 -121 219 -1 -5 116 51 7 88 -125 -81 -59 98
2000I8Q0N2k07j0R6k12n6J22J00o8J2L2J59j33k43l1J97L31l62N0L1m4J97j01
$$ 98 178 230 23 13 109 -103 -159 -37 63 -5 7 39 198 65 -178 -209 -12 319 -43 7 38 -6 191 90
2024I0N6l06L6J79O0k15j00J68j49J9J54j05K93k49K03l2l4j47j1M9j56R8M49
$$ 90 146 -160 -124 55 115 -100 -200 -32 -181 -162 -8 -113 180 -69 134 102 68 -79 -90 -41 -197 -99 350
2047C50m09N0R1K7j3j01J39k18O9K9O7Q6J06m73L47j84P2k09J85n1K7m6j52K35
$$ 350 -59 -9 82 109 96 -5 134 -84 -15 14 81 167 273 -200 147 -37 35 -174 11 -40 -13 -59 -211 24
2071B4K5j1K06r3k00J25j1J2j27J97k17m6Q1R1J4j62R5J05Q1l21L4K16q8j77J20
$$ 24 49 38 244 151 -49 76 65 77 -50 147 -70 -116 -35 56 70 -92 3 108 189 -132 -98 118 30 -147 -27
2096b7j78L43m09K83j11J72J46j03j32J89l7p5K7k90J32J91k20K18j61J07J11
$$ -27 -205 138 -271 12 -99 73 219 116 -16 173 136 61 88 -202 -70 121 -99 119 -42 65 176
2117A76q7o0k05R6l1J23ROo2J95l9l3NJ25l92M9K14k21L9J59R4j78k48K26j61
$$ 176 89 29 -176 -80 -111 12 21 27 -35 160 121 88 93 218 -174 -125 89 -132 -93 66 160 -18 -266 -40 -201
2142b01K30o4Q8j50L19j94q5O4J91r1j2j52O8l32M89k40P7J36L7j67r3O9J07j17
$$ -201 29 -35 53 -97 222 28 -57 7 198 107 95 -57 11 -321 168 -72 5 141 178 11 -82 -13 94 -23
2166b3L4k1j92J32J43k35K30k51J23J44l41J91J48j48N7j36L07j78j97J98J26
$$ -23 11 -10 -202 -70 73 -162 68 -183 -60 84 -257 -66 82 -66 -9 -145 162 -16 -213 -15 111
2187A11j90J89k01N47k90r8l14J07J7L6M3R2r6kP4j33K35j0m3k52J3J69l35M21
$$ 111 -79 110 -91 456 166 68 -246 -139 -122 -86 -43 49 -47 -49 25 -108 127 117 74 -178 -165 4 -331 90
2211I0j21p8K6N9J53k20n5K22Mj83J34j79J06M8J47P9k30q4K76j61k61L78l4j45
$$ 90 -31 -109 -83 -24 129 -91 -146 76 80 -103 31 -148 -42 6 153 232 2 -82 194 33 -228 150 116 -29
2235b9J98R0k35l63K96R8j31k12N2J28N1L44n91M45k62J31Mq2J40J0j72J80j43
$$ -29 169 259 24 -339 -43 55 -76 -288 -236 -108 -57 287 -304 141 -121 10 14 -68 72 82 -90 90 -53
2258e3J41k77Q6O2r1K11Q4m20K21J14J65j13l15J08O8Q6l6p2M9k4N6p2k77N33
$$ -53 88 -189 -103 -41 -132 79 163 -257 -36 78 243 130 -185 -77 -9 77 41 -31 18 -6 50 -22 -299 234
2282B34j68q3O2O1l5J95k47J71p4L0j44J59J19p7k69J64j41k2J68J23j2k01o6
$$ 234 66 -17 45 106 71 266 19 190 116 146 2 161 280 203 -66 98 -43 -65 103 226 214 13 -53
2305e3K51n89R3M65p7n00J69L19K41k03n7n0j09L09j64K0j04l3J67OJ94k98j69
$$ -53 198 -391 -298 167 90 -410 -241 78 319 116 59 9 -100 209 45 65 -39 -72 95 101 295 -3 -172
2328a72J25J54j99J57J33k76J23m01J93ql7j47N77k84o9L50r4o3j44j66J51K35
$$ -172 -47 107 -92 65 198 -78 45 -356 -163 -171 -208 -355 222 -62 -131 219 125 62 -82 -248 -97 138
2350A38j08Q4j21J7j75j80M46j86l7J63O4l35J79J13M2o8j82J90rP8p6j31K26
$$ 138 30 114 -7 10 -165 -345 101 -85 -122 41 105 -230 -51 62 104 36 -146 44 35 113 37 -94 132
2373A32q2K8J9j14l89L78J09p7J07N2k18J13K1j62n8k6L8J56N3j23K78j24k25
$$ 132 50 78 97 -17 -406 -28 81 4 111 163 -55 58 79 -83 -141 -167 -129 27 80 -43 235 111 -114
2396a14k6J30O2J5j08n9j37L91j74k7j00K86k4p2m4o5J62J01k90L10j72m0k6j30
$$ -114 -140 -10 52 67 -41 -100 -237 154 -20 -47 -147 139 115 43 -1 -66 96 197 -93 217 45 5 -21 -151
2420a51J57J1r1j56M63j88J14q4r7J56q2j90O0J3J14q8Q0n4J08j61J87j37n6N45
$$ -151 6 17 -74 -230 233 45 159 75 -22 134 52 -138 -78 -65 49 -39 41 -13 95 -66 121 -16 -72 473
2444D73p52M16p3j06n9R0j29L67J43k95j45j37p1L32j75N8%J86P9Pk16j30R1K24
$$ 473 -279 137 64 -42 -101 -11 -140 227 370 75 -70 -207 -278 54 -121 -63 -63 123 202 209 -7 -137 -46 178
2468A78r6N8J24k12l06K80P1m5K7l3O8j53O6j26J6m5K33k06L13k09q9J38n9P7
$$ 178 82 140 264 52 -254 26 97 52 79 46 114 -39 27 -99 -83 -128 105 -101 212 3 -86 52 -7 70
2492G0N1j33j20J58l47K07J86j19po2lK84j13k36Q3M17l72Q3r1K39o2l5j75P9
$$ 70 121 -12 -132 26 -321 -114 72 -47 -54 -116 -119 165 52 -184 -101 316 -56 27 -64 175 113 78 -97 -18
2516a8K14q1r1j91K61R8m99M22l7k12n6P7K28j66K66j00Q1j48p5K4J05l08K64
$$ -18 196 115 24 -167 94 192 -307 115 78 -134 -190 -113 115 -51 215 115 196 48 -27 -3 102 -206 58
2539E8J17l07K08r1l23N23k25q8K52K9j42O4k65J74J00J46k43J47J26m3L4j43
$$ 58 175 -132 76 -15 -338 185 -40 -128 124 153 11 75 -190 -16 84 230 -13 134 260 217 251 108
2561A08k33Q8o4j44J80M1L0k1N6j43K79m17J33k06j51N59L3k42K12j14j47K20
$$ 108 -125 -37 -101 -245 -65 -24 6 -15 41 -102 177 -240 -107 -313 -464 95 128 -114 98 -16 -163 57
2583E7j05J84j87M9P5O0k40N3J38l45L43j45o2K59l04J47l0k41M76ll03J55K05
$$ 57 -48 136 -51 -2 73 133 -107 -54 84 -261 82 -63 -125 134 -170 -23 -53 -294 182 179 -124 31 236
2606B36J04l60K2o2K37m00RJ17K04K08m74k2l6K74q5N2J56k60j52L10k65M29j15
$$ 236 340 -20 2 -60 177 -223 -214 -97 107 315 -159 -181 -217 57 -28 24 180 -80 -232 78 -187 242 127
2629A27MK9k43J68r0J13l19J15N22n03K57l77K90k16N4n7J91k74J89m5p3K36k19
$$ 127 131 160 -83 85 -5 108 -211 -96 426 -77 180 -197 93 -123 -69 -126 65 -209 -20 -65 -138 98 -121
2652a21J95Mj41J32l12J18m6K12P8j22pk55N49k62k01K97p9k8k16J64m1j0K89
$$ -121 74 78 -63 69 -243 -125 -171 41 119 -3 -10 -265 284 22 -179 118 39 11 -205 -41 -82 -92 197
2675A97k36j18N07k95OQ4l37J88j66J18M8l23M52j76R0L8l03K81k42L6L37j58
$$ 197 -39 -157 350 55 61 145 -192 -4 -170 -52 -4 -327 125 -51 39 77 -226 55 -187 -151 186 28
2697B8Mk9q8N6J79l15L67l67L80o3j71Q4j09K39K9j28j98J12k05J35q8J40K7J43
$$ 28 32 3 -85 -29 150 -165 202 -165 215 152 -19 65 -44 195 224 96 -102 10 -195 -60 -148 -8 19 162
2721A62k04k1r2N1o1J40NK47r9l4j00l07O75k94n5K1mj38J40J07Pj28j95%K43
$$ 162 -42 -63 -155 -104 -165 -25 -20 227 128 94 -6 -313 362 68 13 34 30 -108 32 139 146 18 -177 -177 66
2746F6j03Q4j37K49k05K76l05q8M11l43K3k7J40k18J84M1J30l42L15o7p7J05j63
$$ 66 -37 47 -90 159 -46 230 -75 -163 248 -95 -72 -99 41 -177 7 48 178 -164 151 84 7 112 -51
2769e1J32k82K49j4J85j35k47K07L3j52J15J34j92L51m54K4m0L6K42j95J43j23
$$ -51 81 -201 48 34 219 84 -163 44 77 -75 40 174 -18 333 -121 -97 -137 -101 141 -54 89 -34
2791c4l7J96p1l0K8K12n73K91lJ14j8j64J52p6J32m12L34lL7R8r9j06q2J41K2
$$ -34 -71 125 54 24 52 264 -309 -18 -21 93 75 -89 63 -13 119 -293 41 38 75 173 74 -32 -114 27 49
2816D9j8l7k07K01kJ91l14J11K16k44j28L51M5J2l22K61J17j51j18J36k25j80
$$ 49 31 -6 -213 -12 -14 177 -137 -26 190 -54 -182 169 214 226 -96 165 282 131 13 149 -76 -256
2838b56L28j02R9R7j71J28jl13K82JJ16N3l07rK06l11R3R3r6J23j55k0LL14l13
$$ -256 72 -30 69 166 -5 123 122 -191 91 92 208 261 -46 -55 151 -160 -67 26 -70 53 -102 -122 -119 195 -118
2863a18o0J39o2lK2L79k92k3k58L47J90k90n7NN5J38j21K10j60j68k2o2J35J13
$$ -118 -178 -39 -101 -104 -82 297 5 -18 -276 71 261 -29 -86 -81 -26 112 -9 201 41 -127 -149 -211 -76 37
2887C7R1M9L1k57J11j05n9j20J53N7j92K84l23J24k73O27k02r7J78K75k96j72
$$ 37 128 177 208 -49 62 -43 -102 -222 -69 -12 -204 80 -243 -119 -392 235 33 -64 114 389 93 -79
2909g9J63Mk19K4M29k70M5j62J85k65J83J98j05k64R2R9j26R6J12nr7L7r9R4K9
$$ -79 84 88 -131 -107 322 52 97 -65 120 -145 38 236 131 -133 -41 58 -68 28 140 135 38 75 -24 70 99
2934I9j80K61q1j75p0K57k13j16J95N3M44j47l64kj62J35K85j07k50J1J61n3M06
$$ 99 -81 180 99 -76 -146 111 -102 -218 -23 30 474 327 -37 -39 -201 -66 219 112 -138 -127 34 -19 387
2957C87l98J96k69j15L33J68l74K51l17J39K76j55J83k40l76K06K16l45K18K76
$$ 387 -11 185 -84 -199 134 302 -72 179 -138 1 277 122 305 65 -311 -105 111 -234 -16 260
2977B60k29j6j39J78kQ9n8l0J89m20o2J34j24K24K84m66L24l25N10o09J62Q6j96
$$ 260 31 15 -124 54 52 141 83 53 242 -178 -240 -106 -230 -6 278 -188 136 -189 321 -288 -126 -40 -236
3000b36K27q1J31l7j06M2K52j42J09j8K2l7J31j79L6k44p2L34L13m49N0m5k8K44
$$ -236 -9 -90 41 4 -102 -60 192 50 159 141 163 126 257 78 114 -130 -202 132 445 -4 46 1 -27 217
3024B17l61K47l45K05j58J50K13l61J63Q2j08m6K71m9o1k94L72m5j79J60P7k4
$$ 217 -144 103 -242 -37 -195 -45 168 -193 -30 52 -56 -102 169 120 59 -235 137 92 -87 73 150 126
3046A26M1j29j87K12k02K40r0R3k62M38n06kL31M9l97M23j28q9k80L37l2l7l4
$$ 126 167 38 -149 63 -139 101 11 104 -158 280 -226 -228 103 152 -245 178 50 -39 -319 18 -14 -51 -85
3069h5J05J17k09J98l07o6L13Q6k57J50K6k17KL97p2l18J61R6k05L70k77m6j4
$$ -85 20 137 -72 126 -181 -247 66 152 -105 45 71 -146 -144 253 181 -137 24 120 -85 285 8 -38 -52
3092e2K68l10k07J77j71K57r0k84P96l08m5K93k96J67j19o0M1k56M80l30k89K04
$$ -52 216 -94 -301 -124 -295 -38 -128 -412 384 76 31 324 28 195 76 16 57 -199 281 -49 -338 -134
3114a34Q2K58l01J8K03m17J11J07J71jJ33k64J8K39o43M73q4K40j45Q6j66J2K02
$$ -134 -52 206 -95 -77 126 -291 -180 -73 98 97 230 -34 -16 223 -420 53 -31 209 64 150 -16 -4 198
3137A98j3l05j14K01p5l6L09l39KJ21P6k10L54r8k67L05J24m5l52K8j7j17L36
$$ 198 185 -120 -234 -33 -108 -144 165 -174 -172 -51 25 -185 169 71 -196 109 233 188 -164 -136 -153 -270 66
3160F6j12k61K96J30J66k33q3J07l12K82J82m76R2K00L0k01J26QJ08k27Q9k7K12
$$ 66 -46 -307 -11 119 285 52 -31 76 -236 46 228 -248 -156 44 74 -127 -1 7 115 -112 -23 -50 162
3183A62n28M88k16L85k84J95j64L8N9j93J50k86K69j75Q1LQ4k34K42k13J40j26
$$ 162 -366 122 -94 291 7 202 38 76 135 -58 92 -194 75 -100 -19 -16 68 -166 76 -137 3 -123
3205a23J86n6j89M96j53j04n9j49K78l05L37j72J24k61K16J17j68k9J23j43j71
$$ -123 63 7 -182 314 161 57 -2 -151 127 -178 159 -13 111 -150 66 183 15 -14 109 -34 -205
3226b05L57j18J00J38l51K7J28J62k07J59m00M21k04j96J19j0J38r2J1Jk4K05
$$ -205 152 34 134 272 -79 -52 76 238 31 190 -210 211 7 -189 -70 -80 58 -34 -23 -22 -46 159
3248A59p2J07m3j89J50o2j79j03L31j59K28m38K33k6J55j11j16K59n3k54Q7J71
$$ 159 87 194 151 -38 112 50 -129 -232 99 -60 168 -270 -37 -63 92 -19 -135 124 71 -183 -96 75
3270G5n8O4k37K27m6P2j0j34J31l0m3l40L29L0j83n5O8M3K0K5K07k29J42L0j50
$$ 75 17 81 -156 71 25 97 87 -47 84 54 11 -329 0 30 -153 -208 -140 -97 -77 -52 155 -74 68 98 -52
3295e2M0J34m9j36j4J27r1o5K58Nk79N0k01J69QK04k52j09L73m3j78J28PJ16l04
$$ -52 -12 122 73 -63 -77 50 -41 -106 152 157 -122 -72 -273 -104 -96 108 -144 -253 120 77 -101 27 34 150 -154
3320a54K63J89m55N3J03m9l7J65p6J81j04l61L93k33J63P2j22k4p4L21k68j18
$$ -154 109 298 -157 -104 -1 -50 -87 78 2 183 79 -282 111 -122 41 113 -9 -33 -107 214 -54 -172
3342a72L58l17J11R6ql9L3Q4m41L54M8j20J00j81M19l74K82j2m86N80k83o2j44
$$ -172 186 -131 -20 76 68 29 62 146 -295 59 107 -13 87 -94 325 -49 233 221 -265 315 32 -30 -174
3365a74L83j0k16O9R0j96N7J77n67K68K46nj40M0l46K25J0j3J38O5k63J18k3n2
$$ -174 209 199 -17 52 142 -54 3 180 -387 -119 127 122 -18 22 -324 -99 -89 -102 36 101 -162 -44 -67 -119
3389a19o8L17k78J03K69j58j96L50N6m93N9K9N7J54m80L26J43j16R3J23j91L96
$$ -119 -187 130 -148 -45 224 66 -130 220 276 -217 -158 -129 -72 82 -398 -72 71 -45 48 171 -20 376
3411C76k97m6J9r8J57o5p7j21J45J11j72qM9m7K72j34k47K45P2pj29n6K15k88
$$ 376 79 33 52 -46 111 46 -31 -152 -7 104 -68 -76 -27 -74 198 64 -183 62 134 127 -2 -58 157 -131
3435a31Q4j65j01Q2K03J7j08k13N73j68l7j52N7j8K69k06m49M49k38K01q7L04
$$ -131 -47 -212 -313 -231 -28 -11 -119 -332 241 73 36 -116 -59 -77 192 -14 -463 -14 -252 -51 -138 166
3457A66p4K22m38O6k6L04k28J59l1j46J25j04j60P7j29L54k42K30P8j85Pm27L21
$$ 166 92 314 -124 -58 -84 220 -8 151 120 -26 99 -5 -165 -88 -217 137 -105 125 203 18 25 -402 -81
3480h1l47M74J72j48J36PM3l56j53K17L27k85j36k22P20m42j71M27j71j38l2J58
$$ -81 -428 46 218 70 206 213 256 -100 -253 -36 291 6 -130 -352 368 -74 -245 182 11 -127 -159 -1
3502ao6qK6m5q3L86j57k95K92n7L11n40K73j21j21K10k32K24q4K67k22m2J55k01
$$ -1 -67 -75 -49 -94 -177 209 52 -243 49 -8 303 -237 36 -85 -206 4 -228 -4 -88 179 -43 -85 70 -131
3526a31o4O9L34j43K5J21k77K15j59l9j18j7P8L9J65k38J7K41l13J78j1O7J79
$$ -131 -195 -126 208 65 90 211 -66 149 -10 -49 -167 -184 -106 -67 98 -140 -123 118 -195 -17 -28 39 218
3549B18k8k66J23j06M7J50j60m6J8J39l11J93O1j62j26J90J53Q2k21J79q8J78
$$ 218 190 -76 47 -59 -12 138 -22 -68 -50 89 -222 -29 32 -130 -256 -66 87 169 -52 127 39 217
3571B17m81K50j00J04J26j65q7J49o8n4L38l38o2j42J86o3L14j70l2K58l08K08
$$ 217 -264 -14 -114 -10 116 -49 -136 13 -55 -109 229 -109 -171 -313 -127 -190 124 -46 -78 180 -128 80
3593H0l3k74j50L36R2q8Pp7l8L43j37Q9l08Q5j38K25N8J39j50k03M1m7j33N06
$$ 80 47 -227 -377 -41 51 -37 -30 -107 -145 198 61 150 -158 -73 -211 14 72 211 61 -142 -101 -148 -281 225
3617B25n04K23J89j24j01j21K12oJ74m14N84n36J31N4P4L0M3n0J23k8n9J30k18
$$ 225 -279 -56 133 9 -92 -213 -1 -7 167 -247 337 -199 -68 -14 60 90 133 83 206 178 119 249 31
3640C1MM3K09j81j89J56j69K10k77J92j33K8k5P4o6j5QK03l66M0K59J33p6l57
$$ 31 35 78 287 106 -83 73 -96 114 -163 29 -104 -76 -101 -27 -93 -108 -100 103 -263 -223 36 169 93 -264
3664b64J88Lj9N5J18%j29ll7J60j61M03j97k32K31j82mK10l44J09J80k0J22Q4
$$ -264 -76 -73 -92 -37 81 81 -48 -51 -88 72 -89 314 117 -115 116 -66 -70 140 -204 -95 85 65 187 271
3688B71k31M4j18K11k53L2O9o2L7J70k86L22k91J91j0l24M22k92J79m3NN9l1k8
$$ 271 40 84 -34 177 -76 -44 25 -37 0 170 -116 206 -85 106 96 -228 194 -98 81 38 43 102 71 43
3712D3j49J3J77J66n38N07N4j77j04N0P5q7j67J14J44Q7k29O1O2j48n2j1K31j26
$$ 43 -106 -93 84 250 -288 219 273 96 -8 42 117 30 -137 -23 121 208 -21 40 102 -46 -98 -109 122 -4
3736dR6k85Q9Q9J60k51J90r1j28K43r8N1j56K26r0q2L16n37L72P2j93n9j56L8
$$ -4 92 -193 -104 -15 145 -106 84 -7 -135 108 10 61 -95 131 41 -41 275 -262 110 182 -11 -70 -226 -188
3760a88M36m29L73j59J2j86k0K37k78K21J57l71PJ40l8K38l50K02k15L97k21J35
$$ -188 248 -181 192 33 45 -141 -161 76 -202 19 176 -195 -188 -48 -86 152 -198 4 -211 186 -35 100
3782A00k57J82j42p8K23j52J99k68K77j36P4J20m22O60n12L29j52M0l01L47O4
$$ 100 -157 25 -117 -195 28 -124 75 -193 84 -52 22 142 -280 380 -132 197 45 85 -216 131 195
3803A95k2k31J23O7j98l7K17l47K34J6n7J10j75J33j77J17J83k64J40j18q4J45
$$ 195 173 -58 65 132 -66 -103 114 -233 1 17 -40 70 -105 28 -149 -32 151 -113 27 -91 -175 -30
3825c0l5K55l02J9J55R7j64l21L95k83L50p0O4j47J09j03k49J3R3n7M01k7j59
$$ -30 -65 190 -112 -93 62 159 -5 -326 69 -214 136 66 130 -17 92 -11 -260 -247 -154 -211 190 163 4
3848DJ01j36J56P1O4l75K51k03J11Q2N9k38K18k86M7K28j56JLk71J93N8N6q9M6
$$ 4 105 -31 125 196 260 -115 136 -67 44 126 185 -53 165 -121 -74 154 -2 -1 2 -269 -76 -18 38 -51 -5
3873eJ09k25K61l23Q1L41m12q8J81L50l00K17k18P2j7Nj49M07r1l5l88K55J89
$$ -5 104 -121 140 -183 -102 239 -173 -261 -80 270 -30 187 -31 41 24 29 -120 287 196 161 -227 28 217
3896B17j34o9R4k93M68l30K20j12l73L51K63k54p6L49k05j50O8k92N36k84j87
$$ 217 83 14 108 -185 283 -47 173 61 -312 39 302 48 -28 321 116 -34 34 -258 278 -6 -193
3917a93L40l26L30k15K01l90q4K60m7J65J50l45K14K43j56l44L58k54K4K48k8
$$ -193 147 -179 151 -64 137 -253 -337 -77 -124 41 191 -154 60 303 147 -197 161 -93 -69 179 151
3938A51o0r3j8J39l5j76J3K30j37r2j72j05J97J42j07L7K36n4k34J78j94j19J18
$$ 151 91 -2 -20 119 84 -92 -79 151 14 -78 -250 -355 -158 -16 -123 -86 150 96 -138 40 -154 -273 -155
3961a55J59K75l22p5J93p6R0j25j98k8N19n1q0k29K95l89Q0J10j14K86j95j40
$$ -155 4 279 -43 -118 75 -1 89 -36 -234 -262 257 206 126 -103 192 -197 -117 -7 -121 165 -30 -170
3983a70J53O1J13l33M06l13P7nl13K64J25j82J25N7M2K3j97J79q9J7K59j59k86
$$ -170 -17 44 157 -176 230 -83 -6 -11 -324 -60 65 -117 8 65 107 130 -67 112 23 40 299 140 -146
4006a46J27J12k15M16k72l31L87j94K1K9J41k26K66k63K58k15Np3L24N2m95N60
$$ -146 -19 93 -122 294 22 -309 78 -116 -95 -66 75 -151 115 -148 110 -105 -100 -173 151 203 -292 268
4028B68j95k9j1j13J81j31k34N7o3L78j36P3J1J48q1k14J05K72j95l43L58j0J88
$$ 268 73 44 33 -80 101 -30 -264 -207 -270 108 -28 45 56 204 123 -91 14 286 91 -252 106 96 284
4051B84k87l0L5L13q8l32J51o4J31M5l22K40j51L29l61o9J37K35j64j28J97j45
$$ 284 -3 -33 2 315 227 -105 46 -18 113 158 -164 76 -75 254 -107 -176 -39 196 32 -96 101 -44
4073d4K21J33j18j77Oj92K68J14j34l37K10K23l22O4J01n3J74k02N8j17K8L17
$$ -44 177 310 192 15 21 -171 97 211 77 -260 -50 173 -149 -85 16 -37 137 -65 -7 -124 -96 221
4095B21l54K13j26j05Q1L56j95k6p9J03rj72P6O3q2L6j20J48p5J10J52j33L9j11
$$ 221 -133 80 -46 -151 -70 286 91 65 -14 89 80 -92 -16 47 -35 1 -119 29 -46 64 216 83 122 11
4119A1R5l84K55p8J33k4N5J05k18J66J6r5L82l76J54m71J56L74j15m5J91n9k26
$$ 11 106 -278 -23 -101 32 8 63 168 -50 116 132 37 419 43 197 -274 -118 256 141 96 287 228 2
4142BJ38j97k40K6N0J61K18j76nJ67o5L03n71K93j00P8J53k34J47j96J38O6k19
$$ 2 140 -57 -297 -271 -221 -60 158 -18 -23 144 79 382 -189 104 4 82 235 1 148 -48 90 156 -63
4165f3m3Op4O5K36l21J60j06J04O1J04n1j65J6Q9q3Qk7J42N4k88J46J31m38M9
$$ -63 -106 -100 -174 -109 127 -194 -34 -140 -36 25 129 78 -87 -71 18 -65 -57 -84 58 112 -176 -30 101 -337 -288
4190b88L19L1L1n5l34L04j44L11q9k43J21j04J78JQ4o1J48l07K05j8l8J23j81
$$ -288 31 62 93 38 -296 8 -136 175 86 -157 -36 -140 38 39 123 62 210 -97 108 90 52 175 -6
4213fj73K60%L06m16M18n79L89j36o3n3K94k25K48l6k15J65m59J12L90m04j46
$$ -6 -179 81 81 387 -29 389 -190 199 63 0 -53 241 16 264 228 13 178 -281 -169 221 -183 -329
4235c29N13k11K62k79L55k57j29l5P9p2k4R3J77k91J36ro7J11oP7m4L0j19l62
$$ -329 184 -27 235 -44 311 54 -75 -110 -31 -103 -127 -34 143 -148 -12 -21 -88 23 17 94 50 80 -39 -401
4259d01J69r6J71Q2J68pl05K13J59m7p6q8K60l39j9k72L49o7N8K85J14j01m78
$$ -401 -232 -328 -157 -75 93 86 -219 -6 153 106 30 -58 202 -137 -156 -428 -79 -146 -88 197 311 210 -268
4282b68K56J42Kk93N9kL26j77K04j57j02j87K99Q9O9l67J15R2k21j60L03j48j85
$$ -268 -12 130 132 -161 -102 -104 222 45 249 92 -10 -197 102 191 260 -107 8 100 -121 -281 22 -126 -311
4305c11M37P7k05N8L2J7KQ7K0k78J0K03k7j96JP5l04L71J08j27M8p6m3j73L59
$$ -311 126 203 -2 56 88 105 107 194 214 -64 -54 149 122 -74 -73 2 -302 69 177 50 98 22 -21 -194 165
4330A65l27M9K4J06J1j6q2L69k15J71n5l80J76L25l86J66j97J26l6Q0k7J09k22
$$ 165 -162 -113 -89 17 28 12 -70 299 84 255 200 -180 -4 321 -65 101 -96 30 -6 74 47 156 -66
4353f6K6R6j66K45n8J70j46J13k10J70k27n1L89k86M3J19j80n1J93j07k74M86
$$ -66 -40 56 -110 135 77 247 101 214 4 174 -53 -104 285 -1 42 161 -19 -70 123 16 -258 228
4375B28j24l64J41n7J62J9P6J39J7n85K54L25l89J81rN1j43m8p8K42Q1r3r2L22
$$ 228 104 -260 -119 -176 -14 5 81 220 237 -348 -94 231 -158 23 14 65 -78 -126 -204 38 119 26 -66 256
4399B56k98J28k4jj5k87J30J26p1J4P2n5J68j57l5l07M02J69l39J78N6P3k72L04
$$ 256 -42 86 62 61 46 -241 -111 15 -56 -42 30 -25 143 -14 -49 -356 46 215 -124 54 110 183 -89 215
4423B15j20j55K46j33j5N7l02O7R3J04p3K06M1o2k19k6J5J4K12J4o7j21LR2r5
$$ 215 95 -60 186 53 38 95 -207 -140 -47 57 -16 190 231 169 -50 -76 -61 -47 165 179 112 -9 -6 86 -9
4448iJ55k75q5K24K0j50L08k08j26L77k71n1K6R8k49K63k67L91l48J46J34p9j19
$$ -9 146 -129 -214 10 30 -120 188 -20 -146 231 -40 -91 -65 33 -216 47 -220 171 -177 -31 103 24 -95
4471i5L43r8n1l21L88o5j5J55q8N5k65q6K76L1j53J04k6n5k27J87qm5nO2l28M00
$$ -95 248 150 99 -222 166 101 86 241 153 208 -57 -143 133 164 11 115 89 34 -193 -6 -14 -59 -64 -2 -330 70
4497G0k83K16k95M31k71P9O2J89J43l24L9k90N7Q7J95k87q6K15J74k26L03m08
$$ 70 -213 3 -292 139 -132 -53 9 198 341 17 56 -234 -177 -90 105 -182 -268 -53 121 -105 198 -210
4519b10L91m9k04k93M80j3p2j45J41J80k85j22L98j16k1J04k39p4J29P2m5n3J04
$$ -210 181 132 -72 -365 115 102 30 -115 26 206 -79 -201 197 81 60 164 -75 -149 -20 52 7 -46 58
4542E8M0j64J11k5K13n25L62M0r4j72L9J95n1j30O8K8M40k32j07J50j00k52m8
$$ 58 98 -66 45 20 233 -292 70 110 16 -156 -117 78 27 -103 -35 -7 433 201 94 244 144 -108 -156
4565a56J94L0l08K69q5nj27J58N3o9o2k4K92j87K42k79J12M7j25N8N17k78k52
$$ -156 38 68 -240 29 -56 -61 -188 -30 23 -46 -108 -132 160 -27 215 -64 48 95 -30 28 545 267 15
4588A5Nr9l0O8J32j18K2j17J43J92j35j75L9K5j50J21J40k25R6m9J28Q4j79l9
$$ 15 20 -79 -109 -41 91 -27 -5 -122 21 213 78 -97 -58 -33 -183 -62 78 -147 -51 -100 28 112 -67 -106
4612a06J81J3J4P1k36Q2J02k00K3R0L45k79Q3k60P0q0J06K64k46j0J03j9m4p6
$$ -106 75 88 102 173 -63 19 121 -79 -56 34 379 100 183 -77 -7 -87 19 283 37 27 130 111 67 -9
4636ij31K92k21o4N5J20n6P4jk25M26k63R6k76L2J87q8j16J81J38l41N27l39K1
$$ -9 -140 152 -69 -133 -78 42 -14 60 59 -166 260 -3 93 -183 -151 36 -52 -168 13 151 -190 337 -2 19
4660A9j12J67l4k66K53k33J58K12k09k3qJ86N3o2p4l94M93L9l84M42n30L23k70
$$ 19 -93 74 40 -226 27 -206 -48 164 -45 -68 -76 110 163 101 27 -367 126 165 -219 223 -307 16 -254
4683b54O3J41J07R3l83L58j32L02m38L32j29n3J22K2l31L36N2j92j02J44k87Q5
$$ -254 -191 -50 57 150 -233 125 -7 295 -143 189 60 7 129 151 -180 156 208 16 -86 58 -229 -144
4705a44O0J27J30l39K87k97J92J68k14j68K14j59j76K32o0K01k2J9n7J1j18L81
$$ -144 -84 43 173 -166 121 -176 16 184 -30 -198 16 -143 -319 -87 -147 54 32 51 -6 5 -113 268
4727B68r0k95J64j77M5l4o0M53k74O0O3l38K82J38k06k18L43j52R2j76Q1j65J50
$$ 268 178 -117 47 -130 -85 -119 -179 274 0 60 123 -215 67 205 -1 -219 124 -28 64 -112 -31 -196 -46
4750d6J0J65J72k01o9l10L82k55J79j0r2J36k43K29j65o7K96k36J92o5r9L2K20
$$ -46 -36 129 301 100 31 -279 103 -152 27 17 -75 61 -182 47 -118 -185 111 -125 67 2 -97 -65 155
4773A55j46j90K20m38N91j23j4K50n15M2K0L2P5K10j55J43l46K86k79p7L73k11
$$ 155 9 -181 39 -399 192 69 55 305 -210 -168 -148 -116 -41 169 14 157 -189 97 -182 -259 114 -97
4795i7O3N5j92R5j4L57p4j50m4j1j24J74l0q7K25n4l42K37M9o0o9j77k9K15R4
$$ -97 -34 21 -171 -76 -90 267 193 43 -1 -12 -136 38 8 -79 146 92 -250 -13 36 -24 -93 -270 -299 -84 10
4820A0J39o14N42j60r7L58n26M12mO2j49j50O9L13j86p5K30L4j47Q0k60K04p1
$$ 10 149 -465 77 -83 -180 178 -348 64 60 122 -27 -177 -108 205 19 -56 174 208 61 141 -119 85 14
4843A4l83M89j59k6j1j4L35k59O4P2nl65K17q0n6J42n5J69r5R6k13Q6j93J82r7
$$ 14 -369 120 -39 -65 -76 -90 245 -14 50 122 117 -248 -31 -111 -167 -25 -80 89 -6 90 -123 -37 -230 -48 -145
4868a45J49l04L04k6K5j10P6M5k14P0N8R2l24M18l56N99l43j31q0J14j47k0M32
$$ -145 4 -300 4 -22 3 -107 -31 14 -200 -130 -72 20 -304 114 -242 357 14 -117 -197 -83 -230 -250 182
4891A82l56K61j04J84k26J97l1k68L8K85k12N8K36j37j54K16K0j32K21o02K75
$$ 182 -174 87 -17 167 -59 138 107 -161 -123 162 -50 8 244 107 -47 169 189 57 278 -324 -49
4912d9J06K12m92K12L1o3j54J56J77k28R0j42M75m53n7J63P9j71j3J82J59k22
$$ -49 57 269 -223 -11 20 -43 -197 -41 136 -92 -2 -144 331 -122 -179 -16 63 -108 -121 61 220 -2
4934bq6K00L6k82J12J32R9p4l15J54J98j33KM3%m3J98j35j07l52K72O4k36M99
$$ -2 -88 112 148 -134 -22 110 209 135 -180 -26 172 39 41 84 84 41 239 104 -3 -355 -83 -19 -255 244
4958B44k37k13L07j37K1J92n7k3k39J20O8j27J0r3K12l72K72J58K1Rj72L48l49
$$ 244 7 -206 101 -36 -15 177 120 97 -142 -22 46 -81 -71 -164 48 -324 -52 106 127 136 -36 312 -37
4981c7K28j41lj61K04k6j51l8K04m0p9J5L8J12l33K18j14J69P9j30n7K94n13J61
$$ -37 191 50 47 -114 90 64 -87 -125 79 39 -40 -25 13 125 -208 10 -104 65 144 14 -43 251 -262 -101
5005a01j37K15M9K72j54m21L82n8q8o6q7J97J58j04k12J62J9m8L19k34q4J39J68
$$ -101 -238 -23 26 298 144 -277 105 47 -41 -107 -194 3 161 57 -155 7 26 -22 297 63 -21 118 286
5028B86k70p1Q7l27L80J1j33q1K70j89K25l76J85k60J73j25r3L70o7p3J53o8q
$$ 286 16 -55 32 -295 85 96 -37 -118 152 -37 188 -188 -3 -263 -90 -215 -308 62 -5 -78 75 7 -1
5051aJ63m8qmk18LJ55j0j01P5k6Q1k31K58j34L8k18Q7k41L75n5k57Q5m0M75j68
$$ -1 162 114 106 102 -116 -113 42 32 -69 6 -20 61 -170 88 -46 -8 -226 -139 -380 -5 -60 -317 -232 -272 203 35
5077C5j68K27k41k70K18n3L05j12j46N70n57K47j73J68O4k96L73l87J40M4J13
$$ 35 -133 94 -147 -417 -199 -252 53 -59 -205 365 -192 55 -118 50 114 -182 191 -196 -56 -12 101
5098A01k41J61R3J91k52M8j18O7j32l7K95k21J01k19J32Q8K49k48j55K68nj94
$$ 101 -140 21 114 305 53 101 -17 50 -82 -119 176 -45 56 -163 -31 57 306 58 -97 171 166 -28
5120b8J6J54j94%M6n3K05k37J32L24q7p40L84l1K76j21j98K9J56k5k2N0p4O8J57
$$ -28 -12 142 -52 -52 -6 -59 146 -91 41 365 278 -462 -78 -109 167 46 -152 -123 33 8 -14 36 -38 30 187
5145A87m10L64l6m36L96k12K30j16J49k40J13K4j31M0Q8R5j61J93J4k04k2n4L07
$$ 187 -223 141 105 -331 65 -147 83 -33 116 -124 -11 13 -118 -78 10 105 -56 137 151 -53 -75 -129 178
5168A78q1k82J43Q5n7j64R7R5j04r8K58M5j8j52j19M30k03k47O0J05p8J11k4J26
$$ 178 97 -185 -42 43 -14 -178 -81 14 -90 -188 70 115 97 -55 -174 256 53 -194 -134 -29 -107 4 -20 106
5192A06q2K8M0J2q3k16M89j59j74l23K40J48j93R0J18k1J3O4l74L42J85l77K84
$$ 106 24 52 92 104 21 -195 294 135 -39 -362 -122 26 -167 -77 41 20 33 97 -277 65 250 -127 157
5215A57j5k52J36J4m7M5r2j02N1J12j09j3j04J92j74J91j03K9L86m00J08j39R3
$$ 157 142 -110 26 40 -7 38 -54 -156 -105 7 -102 -115 -219 -27 -201 -10 -113 -84 302 -98 10 -129 -36
5238c6L3j1P3J8o5q4Q9k84K66J22k32K92r4r1N7j08M3J49m85O20l50j2j49J91
$$ -36 -3 -14 59 77 12 -72 17 -267 -1 121 -111 181 87 -4 53 -55 -12 137 -348 272 -78 -90 -239 -48
5262d8l1L0l66L51K38k21j01m5L20j95k4K34l80K88J15k41N8m5qLK47J90k51k68
$$ -48 -79 -49 -415 -64 174 -47 -148 -193 127 -68 -92 142 -238 50 165 -76 -18 -63 -71 -68 179 369 118 -150
5286a50K54n1j4p1M9j53l1K43L79o19L26j06p2J09k90K08J6j28L23l44J67j05
$$ -150 104 53 39 -32 17 -136 -167 76 455 -164 162 56 -16 93 -197 11 27 -101 222 -122 45 -60
5308f0J45O3N0j3n29L67j38Q6J5p4j3L3Pk1Qk7R7k35K65K31k34j06l8J55k47J32
$$ -60 85 148 198 185 -344 23 -115 -29 -14 -88 -101 -68 -61 -82 -74 -101 -4 -239 26 257 23 -83 -121 34 -213 -81
5334h1j80K17R2j17l2lJ14J49j62j37J48j33r5P4K01nq2%j72J73O9j32J62M9l9
$$ -81 -261 -44 48 -69 -101 -104 10 159 -3 -140 8 -125 -220 -146 55 50 -32 -32 -204 -31 38 -94 68 117 78
5359G8j69J4J9k5R1J53M3j56j84K49j91p3J68N9j49o2K78k02J89k46O9l7K78j67
$$ 78 -91 -77 -58 -83 8 161 204 48 -136 113 -78 -151 17 76 -73 -135 143 -59 130 -116 -47 -84 194 27
5383B7Q1nl29K45M4k75J07%M8N0jj19K97j70L0N5l96J65K93l08R0m2J48q0J79
$$ 27 108 103 -226 19 63 -212 -105 -105 -57 -7 -8 -127 170 0 30 85 -311 -146 147 -161 -71 -113 35 -45 134
5408A34j30l9J36j81qQ0K87k91j2K97l35J15m5K7L71o87N34j47J5j83J88j99K09
$$ 134 4 -35 101 -80 -88 -8 279 -12 -24 273 -62 53 8 35 406 -281 253 106 121 -62 126 -73 136
5431A36o8j92j52K45M7k14K45k66q0K05K42P8n86M19k22QJ03J2nJ99j57j7R6j07
$$ 136 68 -124 -276 -31 16 -198 47 -219 -299 -94 148 226 -360 59 -163 -155 -52 -40 -45 154 -3 -20 76 -31
5455c1K21k75l6J8N1K78k56J96l36J73J10j45J54N7k97K4m6L96l97k7J65N8J09
$$ -31 190 -85 -121 -103 -52 226 -30 166 -170 3 113 -32 122 179 -118 -94 -140 256 -141 -168 -3 55 164
5478A64k90J70J62k57j39k4L08L3k99O18l64J7r5j17O3m1k57K24k9L36k28j16
$$ 164 -126 44 206 -51 -190 -214 94 127 -172 446 82 99 4 -113 -50 -91 -348 -124 -153 183 -45 -161
5500a61K87k46M05k44j90M8K21j92J13j05k7J60J7k29K3L54l20N6J23j43J7j52
$$ -161 126 -120 285 41 -149 -101 120 -72 41 -64 -91 69 86 -143 -120 234 -86 -30 93 -50 -33 -185
5522a85K33o9K22k03Q2K4J87j22J15m08J35K28j64P7M7j79J25j40J4k09j44L90
$$ -185 48 -21 201 -2 80 104 291 169 284 -124 11 239 75 152 199 20 145 5 19 -190 -334 56
5544E6j72r4L62J7k14J94r0L8j51o7j41J93K43k18j30L15r2j19P6j14K65Mo1M7
$$ 56 -116 -210 152 169 -45 149 59 97 -54 -121 -262 -69 174 -44 -174 141 49 -70 6 -108 157 161 100 147
5568A47j47j74M1J24J74k49K26j55k04L75Qk6o3k27J35l0J42J05k02Q0o5J46L6
$$ 147 0 -174 -133 -9 165 -84 142 -13 -217 158 166 140 77 -150 -15 -45 97 202 0 80 15 161 197
5591A97j25j06J17M8j96M3J12l09J35K83l15k1Q5r0k12L97N6r1r6K90m4l19Q3
$$ 197 72 -34 83 131 -65 -22 90 -219 -84 199 -116 -137 -52 -142 -354 43 99 8 -88 202 158 -161 -78
5614g8K52k14NN9p9j18J06J54P7J47k82O8J27J0l35j46K13n7M24j83J3m4j57P7
$$ -78 174 -40 -35 24 -55 -173 -67 87 164 311 29 97 224 234 -101 -247 -34 -91 333 150 163 119 -38 39
5638C9Nj98L90m37J81M5J62k35k39L34j28J12l7n5K69k14l04L18k8P2k9J05k80
$$ 39 44 -154 236 -201 -20 25 187 -48 -287 47 -81 31 -6 -61 208 -6 -310 8 -20 52 23 128 -152
5661a52J10P0K6j34j56K24M4k87L37o7J76m1N7k43J90j77Q0j52q4J33L75l77R5
$$ -152 -42 28 54 -80 -236 -12 32 -255 82 15 191 150 207 -36 154 -23 57 -95 -179 -46 329 -48 47
5684D7j42J0L7K07k77K10J8J61l49K66l13K41L0j15j42P2j54q6M63p4Kp7J7l5
$$ 47 -95 -85 -48 159 -118 92 110 271 -78 188 -125 116 146 31 -111 -39 -193 -279 184 110 112 35 52 17
5708A7P6m15N23k70k21M22j04Nm15L44J05k77J65k2K49k62J01k53K59J33j76k9
$$ 17 93 -322 201 -69 -290 132 28 33 -382 -38 67 -210 -45 -67 182 -80 21 -232 27 160 -16 -45
5730d5K4J36j39Q1K8k89Q9J71k84J45J17M3j62l5J89j79P6M9P3K39l74L08k05
$$ -45 -21 115 -24 57 85 -204 -115 56 -228 -83 34 77 -85 -120 69 -110 -34 15 88 327 -47 261 56
5753E6L2q1J9L01l63j91J82P2K2K00m34J99l5K37n0l26L07j22j33J75k25J42J
$$ 56 88 7 26 327 -36 -227 -45 27 49 249 -185 14 -21 216 166 -160 147 25 -108 67 -158 -16 -15
5776a5J14Q1n3j30J85n1k54R5k47jN12j64r0Q1j32O1N6K64k23j42j69J74R6r3
$$ -15 99 180 127 -3 182 131 -123 -28 -275 -276 236 72 -18 63 -69 -8 48 312 89 -53 -222 -48 48 -45
5800d5j28J22q1J2K27j52O5j31J07J43k47J95O5l30j35M00J80l18N1K60j59r4
$$ -45 -173 -51 -132 -120 107 -45 20 -111 -4 139 -108 87 152 -178 -313 87 267 -51 0 260 101 7
5822GM6m2k98O72l84J66l67J84k25L92k69K79k49K46l7l61K66k78J6P5J86j0K84
$$ 7 53 11 -287 385 1 167 -200 -16 -241 151 -118 161 -88 158 121 -240 26 -252 -236 -161 25 15 299
5845B99k97k15K74j59L58l5j03l56J57K23j94K76l72J71M9J5m27L98Kj44O0J18
$$ 299 2 -213 61 -98 260 225 122 -234 -77 146 -48 228 -144 27 76 91 -336 62 64 -80 -20 98
5867I8k05J48K5m03O66m7m96Q0J85n4j99K91R9k27n0L47k01L17j95k96J72k1r8
$$ 98 -107 41 66 -337 329 282 -214 -134 51 -3 -202 89 188 -39 -89 258 57 374 179 -117 55 34 -64
5890f4m1K26q4J19j34on9J83k10K68j91j37J62j90K64l3J36j87k34K93j94K87
$$ -64 -105 121 37 156 22 16 -43 140 -70 198 7 -130 32 -158 106 73 209 22 -212 81 -113 174
5912A74k6l36J14J34j55M8o0K00k18J07j40O9K33j23P0Q4k91K85k12K24l14J54
$$ 174 148 -188 -74 60 -95 -47 -107 93 -125 -18 -158 -89 144 21 91 175 -116 169 -43 181 -133 21
5934B1R5N7L0k77N2j35L41j53O0k06J17Nk5Q9j23L18k75l4J05l09K45K66m04J90
$$ 21 116 173 203 -74 -22 -157 184 31 91 -115 2 7 -18 71 -52 266 -9 -43 62 -247 -2 264 -140 50
5958E0l49L69J9j06J10k53J32J5J20K5L9m17R5K70k72J55j4J90l42k7K79k01q3
$$ 50 -299 70 89 -17 93 -160 -28 -13 107 132 171 -246 -151 119 -153 2 -12 178 -164 -191 88 -113 -196
5981a96o0L39n6Q5j49k32K57N4l35J2P4L12m3R0k26L41j91K28l95l1K49l43jK05
$$ -196 -256 83 27 112 -37 -269 -12 42 -293 -281 -207 105 62 152 -74 267 76 304 -91 -122 127 -216 -217 -12
6005a2J39Q1j79k29K57j94K94k74J8K24l6j06K22J68p46L57O5r6J20k87M03j79
$$ -12 127 208 29 -200 57 -137 157 -117 -99 125 89 -17 205 373 -373 -16 49 -47 73 -214 189 10
6027A0K8j98K81j41j49K06k54K08n4j14P0M7M69l69j76K06j63P0l5K84j85k90
$$ 10 38 -160 121 -20 -169 37 -217 -9 -63 -177 -107 -60 409 40 -136 70 -93 -23 -58 226 41 -249
6049b49L68j79L31J37k49j63Q8J09l92J07J39M40l34j14j24n1J29j08n5L44j99
$$ -249 119 -60 271 408 159 -4 84 193 -199 -92 47 487 153 39 -85 -136 -7 -115 -170 174 -25
6070b5j75K61j04O3k19J79j94J05Lj64L17k85K56J4j89Q1J74l23K00K11r9k4J62
$$ -25 -200 61 -43 20 -199 -20 -214 -109 -106 -270 47 -238 18 32 -157 -76 98 -225 -25 186 87 63 225
6093B25l61qO3L7o9J65J41Q2l42L00k00j57J46r9kL04k98l0K48k03J28k35K2k31
$$ 225 -136 -144 -81 -44 -113 52 193 275 -67 233 33 -124 22 -77 -79 225 -73 -103 145 -58 70 -165 -143 -374
6117c74M28j09M9j90J62Q6j67M2L11k12rJ91j71k15r4L26n03J71L74j1k78k1J29
$$ -374 54 -55 -6 -196 -34 52 -115 -73 238 26 17 208 37 -178 -272 54 -449 -278 96 85 -193 -214 -85
6140h5L75p5p9j32rmM2k1J72k81Q3r0qJ3j94K32m0M4o7J51%l20J66j28M76l65
$$ -85 290 215 136 4 -5 -9 33 12 184 -97 -14 -104 -112 -99 -293 -61 -101 -57 -124 27 27 -293 -127 -255 221 -144
6166a44P5L28k51O2j51J35j01k70O22j74l3M0k02n9k6L17j43K49j17m7n6L2j87
$$ -144 -69 259 8 70 -81 54 -47 -317 305 131 98 138 -64 -123 -149 168 25 274 157 110 54 86 -101
6189a01k7K32L7qQj5n0l94K69J96j33l25M89n0m12K48m6J17j9l0J53k76q6N8J52
$$ -101 -128 104 141 133 141 126 76 -318 -49 147 14 -311 178 128 -284 -36 -82 35 16 -14 139 -137 -223 -165 -13
6214a3J59l96K68j10PM77l71J10k18K52m80M57k03L7J09j53K90k46J22O7k63K48
$$ -13 146 -250 18 -92 -85 392 21 131 -87 165 -315 142 -61 -24 85 -68 222 -24 98 165 -98 150
6236A50J2m6k02N4j46K48m17M61K4m09L48j9l04L25j78P1L9j41J41q3J98m01M14
$$ 150 162 116 -86 -32 -178 70 -347 114 138 -271 77 58 -246 79 -99 -28 11 -130 11 -72 126 -275 139
6259A39l9k96N19k55N4Pj99J96J8k28j13J5L43k13r0K8j64K76m5N1L2l84M08m5
$$ 139 100 -196 323 68 122 129 -70 126 144 -84 -197 -182 161 -52 -142 -114 -278 -2 -47 4 36 -348 60 15
6283A5O3o7N3L7Mj06j4k62J36j33J89J36nq9K74j70Pk25K05N1O9j24J07j09J85
$$ 15 78 11 64 101 105 -1 -15 -277 -141 -274 -85 51 46 -43 231 61 68 -157 48 99 168 44 151 42 227
6308B27m8j18l08J95J17r4L63l80O0Q0l7p4R5nk70N5K41P8r1k3Q5k87K06m3l9
$$ 227 179 61 -247 -52 65 -29 334 -46 14 94 57 -17 78 73 -197 -142 99 177 86 63 148 -139 67 24 -15
6333a5J48j45P2r6J94k19J80r9m59M97J43l68J90M4Mj25L36j53p0k6m4O4J5m9
$$ -15 133 -12 60 -36 158 -61 119 20 -439 58 201 -167 23 67 71 -54 282 129 59 33 -11 53 68 19
6357A9k53K47j03M7J09j47l9J42l51p7L36K35j26j19J20r7k0k3o0L30k81K28j79
$$ 19 -234 13 -90 -43 66 -81 -120 22 -329 -406 -70 165 39 -80 40 -57 -77 -100 -160 170 -111 117 -62
6380f2k43L78J65m95N99l57K2p1m5K4M7R7n1O2n3J47m43N7J25N9p9J63P3j04n9
$$ -62 -305 73 238 -257 342 -15 7 -64 -109 -85 -38 59 8 70 17 164 -279 -222 -97 -38 -117 46 119 15 -44
6405d4K1p5L1J2JJ14p1k21L98o4k98M38k12j02K59j05J3l8j10j19J75k54K14M2
$$ -44 -23 -98 -67 -55 -54 60 -11 -232 166 102 -196 242 30 -72 187 82 95 57 -53 -172 3 -251 -37 5
6429EL86j85k15N8j6p5J9R4Lk38J34JK0m4j4L4l3K55p8MR1l46L45j32r0j14J81
$$ 5 391 206 -9 49 33 -42 -23 71 74 -164 -30 -29 -9 -53 -67 -33 -66 189 111 115 206 -140 205 73 -17 -131 50
6456E0r3j58J14K81l92J68J04N1l15P0j8m4K14J44j39Q8N5j78R0l50L50l96L24
$$ 50 -43 -201 -87 194 -198 -30 74 125 -190 -120 -138 -182 32 176 37 125 180 2 92 -258 92 -304 20
6479B0N8j92K69l7j41oo6j16J77j66L47j54jK29j21l0R0j58q4Q6n2J55p5M8K1
$$ 20 78 -114 155 118 -23 -29 -95 -211 -34 -200 147 -7 -8 221 100 70 160 2 -82 4 -48 107 32 80 101
6504A01J30j19m5O5p7p4K23k37J25j98K95k80OM0M3K39m19J09J10l8K97l53j12
$$ 101 231 112 67 132 55 -19 204 -33 92 -106 189 -91 -85 -45 -2 237 -182 -73 37 -1 296 -57 -169
6527a69J72m08N45p6mr2J69M7k01J90o2p6l0j60k7K29L9j42m1K02j26l15M87j20
$$ -169 3 -405 140 64 60 -32 137 184 -17 173 111 35 5 -155 -182 47 86 -56 -97 105 -21 -336 151 31
6551C1j72J50j74K54K54k92o9k7k3j28L92j48j61R7R0p4j24L19k85M1M7J61k01
$$ 31 -141 9 -165 89 343 51 -18 -45 -68 -196 196 48 -113 -16 74 0 -124 195 -90 -49 -2 159 -42
6574d2J31k04K75j38Oq1J39k23J26l7%O5k51L85j19j67M02n6k66J16J41Pj04N1
$$ -42 89 -115 160 22 28 -53 86 -137 -11 -48 -48 17 -234 151 32 -135 267 211 -55 61 202 209 105 156
6598A56o7r8J39r8j12L27o2j75o7N4j63L17m07L86k88K95j88l02N68m12L94k57
$$ 156 89 -9 130 32 -80 247 185 10 -57 -3 -166 151 -256 130 -158 137 -51 -353 215 -197 197 -60
6620f0%LlJ08P4o7j0j03l8J40j92J20J88j7j42j18P4K41j81O1j46L57k50%j60
$$ -60 -60 -57 -60 48 122 55 45 -58 -96 44 -148 -28 160 143 1 -117 -43 198 17 78 -68 289 39 39 -121
6645a21M3J8J78j02Q0k77j4L63j73J93j51o4L21k81M4q8M9n0J77j87J43r8q7J76
$$ -121 -78 -60 118 16 96 -181 -195 168 -5 188 37 -27 294 13 57 -31 18 -32 145 -42 101 3 -84 92
6669I2j46p9N7K63L5l38J9R5pL54k22o7j41J42q7J25J85j69J14j60j22n4J92p
$$ 92 -54 -133 -76 187 222 -116 -97 -2 -9 345 123 56 -85 57 -30 95 280 111 225 65 -57 -111 81 74
6693G4m0j78L97m56J78j88K15N8k5K81l60Q1p6p7J25K54m79L43k5k03L11j78Q5
$$ 74 34 -144 253 -203 -25 -213 2 60 35 316 -44 37 -39 -116 9 263 -216 127 102 -101 210 32 117
6716A17k12J29K32l12m4K81k04k17L11J01j53p2J18j00k05K74k71M2k9L94R5j93
$$ 117 -95 34 266 -46 -90 191 -13 -230 81 182 29 -43 75 -25 -230 44 -227 -185 -214 180 275 82
6738H2m1K98j6k89j03o3J20mk37J98k13L64O0m64m3O2N74l84k9R7j2N3j03RJ43
$$ 82 41 339 323 34 -69 -132 -12 -16 -253 -55 -268 96 156 -308 -351 -289 285 -99 -128 -31 -43 10 -93 -84 59
6763E9n8j33L30j34j82J51J06O6k10K16j25j53MM8K19l02O3L7L5n6K81kk17j61
$$ 59 1 -132 198 64 -118 33 139 205 -5 211 86 -67 -63 -15 204 -98 -35 2 37 -19 262 260 43 -118
6787a18K72Pj26l89K72J7J30j41L9l22L61L7p5j5L1p6J22K0J4mj9p8K50j80J8
$$ -118 154 161 35 -354 -82 -65 65 -76 -37 -359 2 39 -36 -51 -20 -96 26 46 60 56 37 -41 209 29 47
6812D7k01R5J45q2j7j1q4j00K74l05J90J13Q6k49k05J90J53j53J40j70J4L20k31
$$ 47 -154 -59 86 4 -13 -24 -108 -208 66 -239 -49 64 150 -99 -304 -114 39 -114 26 -144 -130 190 -41
6835d1Rj00J75J3J7Q7Lj96p2M3q3J75J52l52p9L45j21k37M43j06m5p9j83K62j54
$$ -41 -32 -132 43 56 73 160 163 -33 -105 -62 -145 30 182 -170 -249 96 -25 -262 181 75 30 -49 -232 30 -124
6860a24J50L3K09j69K7J20k08qK56l33n2J78lJ02m1k09po1J50J7n8O6k4Q1j35
$$ -124 26 59 268 99 126 246 38 30 286 -47 -99 79 76 178 137 -72 -79 -140 10 27 -31 35 11 92 -43
6885d3K4K2k01Q6K19L5n4n6l5j58J56J6Ooj28N7J63j9k68O8M8j00L03Mk71K10
$$ -43 -19 3 -198 -112 107 142 88 32 -3 -161 -5 11 17 11 -117 -60 103 84 -184 -116 -68 -168 135 139 -132 78
6911G8j54Q2L54l60j36K87j02L1j98k34J95K79o1KK4k62L71l15M9J47l49L06j36
$$ 78 -76 6 360 0 -136 151 49 80 -118 -352 -157 122 61 63 87 -175 196 -119 -70 77 -272 34 -102
6934a02J82r2L1J29Q8m10J55r8J35k59J92J62j84L49k86O2l1K5M8n3k59L84j48
$$ -102 80 -12 19 148 236 -174 -19 -117 18 -241 -49 113 -71 278 -8 54 23 48 96 43 -216 168 20
6957B0Q6l17N33m22K62j80K24j37o1j8L22k37K64m57K52k01j03K11Mk16J13J76
$$ 20 106 -211 322 -100 162 -18 206 69 8 -10 312 75 339 -118 134 -67 -170 41 45 -171 -58 118
6979A18R0qk91J04k11J58J43r4l12K73K80k1k90J86L9k85L71k00k3Q0j81P8j1
$$ 118 208 200 -91 13 -198 -40 103 9 -303 -30 250 229 -61 125 164 -121 250 50 27 107 -74 4 -7
7002gq9J39n1r0j26M6N2mk0p0J50n1K76q1l58L55j41J55k08j1n7J55r6j4J06K81
$$ -7 -96 43 -8 -98 -224 -178 -126 -130 -150 -220 -70 -121 155 74 -284 71 -70 85 -123 -134 -191 -36 -132 -146 -40 241
7028B41m79K52J46m59K60K14j13L5j25m0j52K97j24K18j70K54k47j6l1L7q8J90
$$ 241 -238 14 160 -299 -39 175 62 97 -28 -68 -220 77 -47 171 1 255 8 -8 -39 -2 -90 100
7050A00m10K50k0M3J89k57J28k08J70r9O2m9K99j28r5J46qr5Q8oK47k48k39P3
$$ 100 -310 -60 -80 -37 152 -105 23 -185 -15 -114 -52 -101 198 70 -25 121 113 18 106 100 347 99 -140 -67
7074f7J26k85M42l31j30P0K97k16J87j45j02N5J92k86L12J16l34K25Nj55m07L17
$$ -67 59 -226 216 -115 -245 -175 122 -94 93 -52 -154 -99 93 -193 119 235 -99 126 131 -24 -431 -114
7096a14r2K60pj71L58k64J66k39L82k63k7j1p2J56M1J52m06J44k28N15k43o7J86
$$ -114 -206 54 47 -124 234 -30 136 -103 279 16 -11 -22 -94 62 103 255 -151 -7 -235 280 37 -30 156
7119A56P5l24k90M75j82L02m26J54O3q9J66l08K67j4j3m5N7jq4J60ON9m6q6L6
$$ 156 231 -93 -383 92 -90 212 -214 -60 3 -86 80 -228 39 25 12 -33 24 23 -61 99 105 164 118 32 68
7144F8l12K57J10j7j19N4j54J25j49O5J14N7P1l50J19L4K84k29p8q8J10J20k34
$$ 68 -244 13 123 106 -13 41 -113 12 -137 -72 42 99 170 -180 -61 -27 257 28 -50 -138 -28 92 -142
7167a42L36k86P9n1K50J28l79Q9j09J86L0k71K09O1l42p9K89j64K67q7q5K2j15
$$ -142 194 -92 -13 -64 186 314 -65 24 -85 101 131 -140 69 130 -212 -291 -2 -166 101 14 -71 -49 -164
7190a64N5J86k1N9j89Q7P2k07Q3P1j24NK25j65K07k44o1J00J65k31O2j91K78P3
$$ -164 -109 77 56 115 -74 13 85 -122 -39 32 -92 -87 138 -27 180 -64 -125 -25 140 -91 -29 -220 58 131
7214A31m95M64j73J20L8j12L4%l8K98j27l2K55j61j98J32l1k97N4L87o3j36KJ12
$$ 131 -364 100 -73 47 85 -27 7 7 -31 267 140 108 363 202 4 136 105 -192 -138 249 186 50 52 164
7238A64k49J62n4j27J00Q9l23L19j04Q8j46j45J74L08L4n52J38O57o04l9J09j3
$$ 164 -85 77 23 -104 -4 85 -238 81 -23 65 -81 -226 -52 256 290 -262 -124 533 -71 -110 -1 -14
7260a4j80M12j08k28J23m3M3k8R2k42RK12J44j85o5J85q6K9l19Q2K53j75K40k
$$ -14 -194 218 110 -118 5 -38 5 -23 69 -173 -164 48 192 7 -58 127 41 70 -249 -167 86 -89 151 149
7284A49j74J73l77J17R0L18m32q7O0J35Mo4M1l97M37P0Q9j7m01K91N4m7J52k18
$$ 149 -25 148 -229 -112 -22 296 -136 -223 -163 -28 -24 -88 -47 -444 -7 63 152 135 -266 25 79 32 184 -34
7308c4jJ27l07J02L5L3P8j41J93l2J20m41M54l18K07J75j67j10J21K1J53j32l34
$$ -34 -35 92 -215 -113 -78 -45 33 -108 85 53 173 -268 186 -132 75 250 83 -27 94 115 268 136 -198
7331a98J13J51Q3j26R4j75j19J11J21j20L17m98K01l5J41P1J42l24p2J97O6Q2
$$ -198 -85 66 149 23 117 -58 -177 -66 55 -65 252 -246 -45 -80 61 132 274 -50 -122 75 141 223
7353B23k20LJ24j88j07J61j01J14j08J00N3l2j88K41J16j03l07L04q4N96n54j21
$$ 223 3 6 130 -58 -165 -4 -105 9 -99 1 54 22 -166 75 191 88 -219 85 1 597 43 -78
7375g8J49Q7o7o2J32j61k19P9L4QM6o4K09l25J90J96m38K17J50m0Q4n1k23K3J93
$$ -78 71 158 91 29 161 0 -219 -140 -106 -98 -52 -116 93 -232 -42 154 -284 -67 83 43 127 76 -147 -124 69
7400F9J76l73M7J95j1k04R0k11M3k6J86k13L41l45K03k9k6J64k6o2q6K69l4j57
$$ 69 245 -128 -81 114 103 -101 -11 -222 -179 -205 -19 -232 109 -236 -33 -62 -88 76 50 -12 -98 171 137 -20
7424b0J17k41n0J59O1j31L61k37j26K23j95J19k13J52L5K35k66j24j52N84o67
$$ -20 97 -144 -194 -35 26 -105 256 19 -107 116 -79 40 -173 -21 14 249 -17 -141 -293 291 -376
7445c76M92m8J50r5R0k93J70m08L30N4k96L20k01j37M6L47l78J28N9J81k00N8
$$ -376 116 68 218 123 213 -80 90 -318 12 66 -230 90 -111 -248 -202 145 -233 -105 -46 135 -65 -7
7467gj05J64j81J25n4J84N9P0m66K42N6k79J14k7K69k64O7Q9p4J62l1j6o1k30
$$ -7 -112 52 -129 -4 -58 126 185 255 -211 31 87 -192 -78 -105 164 -100 -33 56 -18 144 113 97 36 -194
7491a94j30M42Rl5J18K24l78r7j82L61p9J9k57K13j20K09k41p1l0K32l4Q5j01
$$ -194 -324 118 127 92 210 434 56 -41 -223 138 59 78 -179 34 -86 123 -118 -189 -219 13 -21 64 -37
7514c7L1L21m97J61M6m05R5J17J06J12j72J56k12K46k50J83j19K08Qj98j32l1
$$ -37 -6 315 -182 -21 25 -380 -285 -168 -62 50 -122 34 -178 68 -182 1 -118 90 98 -100 -232 -263
7536b63K39MJ81k03rQ1j57J15K01k15J1k2K0J07k61L52j49j19K82k19J30l1j87
$$ -263 -24 -20 161 -42 -51 30 -127 -12 189 -26 -15 -37 -17 90 -171 181 32 -87 195 -24 106 75 -112
7559a12Q2rM9J22k12m4M0n5J6K84p5o5m4j58K40J78j88j77L56k30QQ0j04k65M16
$$ -112 -30 -39 10 132 -80 -124 -84 -139 -123 161 86 21 -23 -181 59 237 49 -128 228 -2 6 86 -18 -283 133
7584A33j12l0N3r5m0J70j25k54K36J04j10J88r7M8k88K54J73r3j53j1J01k2m0
$$ 133 21 -9 44 -51 -91 79 -46 -300 -64 40 -70 118 21 69 -219 35 208 115 -38 -49 52 30 -10
7607a0j42P2q5r3K61J80k44n0J88o7j06K38J15k66p6m3j1K48j9j16J5J1K50j13
$$ -10 -152 -80 -165 -258 3 183 -61 -111 77 10 -96 142 257 -9 -85 -128 -139 109 90 -26 -11 0 250 137
7631A37j38M5J15l0m67J77K13L66n05J59K00k86m32N98k98kJ41J09k14K40r7p3
$$ 137 -1 44 159 129 -338 -161 52 418 -87 72 272 -14 -446 152 -146 -148 -7 102 -112 128 31 -42
7653d2m5NR2L14k77j1K14k68L6jL7oJ79k65j76K79J65m63J67j50K14k82N49m73
$$ -42 -87 -82 10 324 47 36 250 -18 18 17 54 48 227 -38 -214 65 230 -233 -66 -216 -2 -284 265 -208
7677b08K15J18J5R1l7j04Q8l69L62k16Q4j36L9K8K7K96p6k18R9J07l19J80j65
$$ -208 7 125 140 231 194 90 178 -191 171 -45 39 -97 -58 -30 -3 293 217 -1 98 205 -114 66 -99
7700i9Q1J48r1j16J36l9K19m51K42K1J62k01J68j19j42J86m6Q8k79j4K05k81J36
$$ -99 -18 130 39 -77 59 20 239 -212 30 51 213 12 180 61 -81 105 59 147 -132 -146 59 -222 -86
7723h6l02M45R2j24j92J80%o1J08n7j37K93j60j8R6R7k87o5J04r1R7n0J16q7L2
$$ -86 -388 57 149 25 -167 13 13 -48 60 3 -134 159 -1 -19 77 174 -113 -178 -74 -165 -68 -118 -2 -89 -57
7748e7k3N0p0J92k50K74q4O1K7k11J61j65J84J16j30q0L2O2r3J1n3K06l05J65
$$ -57 -80 -30 -100 92 -158 116 32 93 120 -91 70 -95 89 205 75 -5 27 89 -4 7 -46 160 -145 20
7772B0k5R1M1rK55k45r9q9P8o4O5j23M10l35J54J26l97L9Q5k00K73o6j60K49r8
$$ 20 -5 86 127 118 373 128 29 -60 18 -46 19 -104 306 -29 125 251 -146 -107 -22 -222 51 -15 -175 74 -24
7797b4K00k05q9j38K55J77R7m2j16J17l15MJ56k86O9J95k07J03J53k52J76N1k68
$$ -24 176 -29 -118 -256 -1 176 273 231 115 232 -83 -79 77 -209 -140 55 -152 -49 104 -148 28 79 -189
7820a89J25P7Q3j08q0L30j89k18J97j05p1J34j68K11lj11R7j29M05l43J70k51
$$ -189 -64 13 96 -12 -92 238 49 -169 28 -77 -148 -14 -182 29 26 -85 12 -117 288 -55 115 -136
7842a36k70O27j60j10J27n0J34j64lmj56j22K92j98K21K88k54j35L03m68L02K5
$$ -136 -406 221 61 -49 78 28 162 -2 -5 -9 -165 -287 5 -193 28 316 62 -73 230 -238 64 89
7864H9k3j33J29j22K29o5p9nK46l65M30j18j67K44k76J86l08K28L2k81L83M7n69
$$ 89 66 -67 62 -60 169 104 25 20 266 -99 331 213 46 290 14 200 -108 120 152 -129 254 301 -268
7887b68K23K83n2j44K9k37J77K07k92rK9K47k24o3J9j33J19P8k01L82l3Ok83J93
$$ -268 -45 238 186 42 71 -166 11 218 -74 -83 -54 193 -31 -94 -75 -208 -89 -11 -212 170 137 143 -140 53
7911E3k22K07J3j07kJ64J23j47J8P2l40M98l65N8J40n94M07K21o9j21j90Q6K46
$$ 53 -169 38 51 -56 -58 106 229 82 100 172 -168 330 -35 23 163 -431 -24 197 128 7 -183 -97 149
7934A49l00k44K86K20J88j70j10j55O2N6K1j92K69k5K6lk77K13N5k16K70L8k41
$$ 149 -151 -395 -109 111 299 129 19 -136 -74 -18 3 -189 80 55 81 78 -199 14 69 -147 123 161 -80
7957h0K6o0K90k27K25J1j78K9q3P3j30J95j32J10l36L20q6M1j61K21k09L59k01
$$ -80 -54 -114 176 -51 174 185 7 36 -47 26 -104 91 -41 69 -267 53 -33 8 -153 68 -141 218 17
7980A7j03L71k81mL3j61l9J36o0K73k44o0K40Q5k89K09l73L30j9k8l09J31m2r
$$ 17 -86 285 4 0 33 -128 -167 -31 -91 182 -62 -122 118 203 -86 123 -250 80 61 33 -276 -145 -187 -196
8004a96M42k00J58j87q8k13K83O6k39J11l7J29N6l48M57l85Q3J87O3k98k0J41
$$ -196 246 46 204 17 -71 -284 -1 65 -174 -63 -100 29 85 -263 194 -191 -108 79 142 -156 -176 -35
8026c5j62J94k5o2N0J48M7k59j4K51m0k67K53k48J79j31N0J31k11j4j5K8J37P9
$$ -35 -197 -3 -28 -90 -40 108 155 -104 -118 133 93 -174 79 -169 10 -121 -71 60 -151 -165 -180 -152 -15 64
8050F4Q6j60N5q5K09k52j28L93j30j76J08J57K8k38J69l72L17p2K06j37n2K39
$$ 64 150 -10 45 -40 169 -83 -211 182 52 -124 -16 141 169 -69 100 -272 45 -27 179 42 -10 229
8072B29j72j44N5K18K3k13j50q0L27j83n2o7K78p3r4j82J22L33J0m21M00o7K25
$$ 229 57 -87 -32 186 209 -4 -154 -234 93 -90 -142 -209 69 -4 -98 -280 -158 175 185 -236 164 97 322
8095C22j26k48R2r3Q0l7j8M4K47q4j60j81j30M10k81K04k83K18K27n0j70k04J50
$$ 322 196 -52 40 -53 27 -10 -28 16 263 179 19 -162 -292 118 -163 41 -242 -24 203 153 -17 -221 -71
8118g1K49l58J2r9K25j26L09j4j25M5N2o5k01J25R3j43K32J42l02N9k38L41j51
$$ -71 178 -180 -168 -267 -42 -168 141 127 2 47 99 34 -167 -42 51 -92 140 282 -20 39 -199 142 -9
8141il05N60j12l05K43Mk03J48j48L0R9P8k39L11j79j49Q5p7J30Pn1J01OJ89k97
$$ -9 -314 246 134 -171 72 76 -127 21 -127 -97 2 80 -159 152 -27 -176 -91 -168 -38 -31 -82 19 25 214 -83
8166h3k26L75R4r1K81n38N08l09M3J81k39o5l0J68J11J92k47J35o6j3k13J95J3
$$ -83 -309 66 160 69 350 -188 320 11 54 235 -4 -69 -99 69 180 372 125 260 194 181 -32 163 176
8189A76o9J32
$$ 176 107 239
8191B39
$$ Imaginary data points
##PAGE= N=2
##DATA TABLE= (X++(I..I)), XYDATA
0@%%%%%%%%%%%qJ6j6J6k4L2m0M8n6O8p7R0j11J34j53J77k08K40k76L17l62M10
$$ 0 0 0 0 0 0 0 0 0 0 0 0 -8 8 -8 8 -16 16 -24 24 -32 36 -41 49 -62 72 -81 96 -112 128 -148 169 -193 217
33B17m66N30n97O69p51Q43r40J045j163J292j430J582j748J931k132K351k592
$$ 217 -249 281 -316 353 -398 445 -495 550 -613 679 -751 831 -917 1014 -1118 1233 -1359
50a359K857l148L467l821M220m668N173n751O419p202Q131r257J0660j2460J4862
$$ -1359 1498 -1650 1817 -2004 2216 -2452 2721 -3030 3389 -3813 4318 -4939 5721 -6739 8123
65H123j8249K3425l2408N2382j80650N6645J98237k31022N2964J43806m6361l5763
$$ 8123 -10126 13299 -19109 33273 -147377 -90732 107505 -123517 -70553 73253 26892 -8871
77h871R2953o9676j0877R9656n2104j10668Q7985K7119p3677K2141P985q6143
$$ -8871 84082 14406 3529 103185 51081 -59587 28398 55517 -18160 3981 11966 -74177
89g4177N2975N2523j18271k5835J31659r424p4453M7245N3113N099K7681k8517
$$ -74177 -21202 31321 -86950 -112785 18874 9450 -65003 -17758 35355 40454 68135 39618
101C9618l3655O3231R948r8203p314M5511m5102k6413L1514k4676j025O5152j8360
$$ 39618 5963 69194 79142 -19061 -26375 19136 -25966 -52379 -20865 -45541 -46566 18586 226
114B26n5895M8677M0063l9233j987K4608o404K2911J7409m5197j130N3249k2415
$$ 226 -55669 -6992 33071 -6162 -8149 16459 10055 32966 50375 5178 4048 57297 34882
127C4882n8675J0909J2889k8169o663L164j1307J7277K5147j3434m509L2936J9103
$$ 34882 -23793 -12884 5 -28164 -34827 -31663 -42970 -25693 -546 -13980 -18489 14447 33550
140C3550o282p281n465N257J0390j1691k1975L29J2394o570k2830q206J6828Q204
$$ 33550 27268 19987 14522 19779 30169 18478 -3497 -3168 9226 2656 -20174 -28380 -11552 -3348
154c348j8970j3117J1726J3370Q740M925l064J1211K9739l446l1794N623K4942
$$ -3348 -22318 -35435 -23709 -10339 -1599 3326 262 11473 41212 37766 5972 11595 36537
167C6537j5584k7269n499j263L242N53k2580o841L1895R176k2313N896K2617K666
$$ 36537 20953 -6316 -11815 -13078 -9836 -9283 -31863 -38704 -6809 2367 -19946 -14050 8567 11233
181A1233J937N14j1384J2300K2884k0571k5877J7507J1690k0721j2560k904k127
$$ 11233 13170 13684 2300 14600 37484 16913 -8964 8543 20233 -488 -13048 -15952 -18079
194a8079J0282m008k4186J0400L3826m006j5768J5473J5051P84K168j0239r467
$$ -18079 -7797 -11805 -35991 -25591 8235 4229 -11539 3934 18985 19769 21937 11698 2231
207B231J7874M604l1494j0299K0539j484j7874k866K201O009J0563q441j3719
$$ 2231 20105 24709 -6785 -17084 3455 1971 -15903 -18769 -16568 -10559 4 -8437 -22156
220b2156J9267J9751j3026p935J3570R106k19l426j0861o77J3373q860k5029O10
$$ -22156 -2889 16862 3836 -4099 9471 18577 18358 14932 4071 3394 16767 7907 -17122 -16512
234a6512J3098n332j0228P51N577J0979P273q995k458J8024P957j3275n787Q423
$$ -16512 -3414 -8746 -18974 -18223 -12646 -1667 5606 -3389 -5847 12177 20134 6859 1072 9495
248I495M870m086q285p761N337P731j1059j4662N880J0911m541q864J689R589
$$ 9495 14365 10279 1994 -5767 -430 7301 -3758 -18420 -12540 -1629 -6170 -15034 -13345 -3756
262c756Q537m05o096N431J3798J154j2120l600N972J027q755r855j315N647J662
$$ -3756 4781 4376 -1720 3711 17509 18663 6543 2943 8915 9942 1187 -8668 -9983 -4336 -2674
277b674p712m861P882R092k921o544K959J0215L577m613l183N805P846k873r949
$$ -2674 -10386 -15247 -7365 1727 -1194 -7738 -4779 5436 9013 4400 1217 7022 14868 11995 2046
292B046k441N824k59r947p493K294N298j281n790J88Q791P283k758l083O188P886
$$ 2046 -395 5429 5170 -4777 -12270 -9976 -4678 -5959 -11749 -11561 -2770 4513 1755 -1328 4860 12746
308A2746q41p149k639L730K490n512q494M48N653j830p845j390N461L854k745
$$ 12746 11905 4756 2117 5847 8337 2825 -5669 -5221 432 -1398 -9243 -10633 -5172 -1318 -4063
323d063l493L298P853L894l761j703N503L564m021n349j315K723P1o210o171K279
$$ -4063 -7556 -4258 3595 7489 3728 2025 7528 11092 7071 1722 407 3130 3201 -3009 -9180 -6901
339f901N660k098n753J562O840K673k793q26M125N128l51n556j306N354J452n622
$$ -6901 -1241 -3339 -9092 -7530 -690 1983 -810 -1636 2489 7617 7266 1710 404 5758 7210 1588
355A588l986J509J806k032m346j832L603K906k843l210L074O323J179k865k83
$$ 1588 -2398 -889 917 -1115 -5461 -7293 -3690 -784 -3627 -6837 -3763 2560 3739 874 591
370E91L658L047k121m072O91L630j743n905k355K377J379k729k901P13L400J605
$$ 591 4249 7296 5175 1103 1794 5424 3681 -2224 -4579 -2202 -823 -3552 -6453 -5740 -2340 -735
386g35j525rL684K610o23j778k7L438K077l523l950N09J997k511m340p41K643
$$ -735 -2260 -2269 1415 4025 3402 1624 1597 5035 7112 3589 -361 148 2145 -366 -4706 -5447 -2804
403b804Q33k421j314L201L627p7k261J449L004J936r47j531O3J260j036l227j740
$$ -2804 -1971 -4392 -5706 -2505 1122 1045 -1216 233 3237 5173 4226 2695 2758 4018 2982 -245 -1985
420a985O79J124k037l455Q0M115O12k318Q23L529J321m06k41L99J851R96k904
$$ -1985 -1306 -182 -2219 -5674 -5594 -1479 -867 -3185 -2362 1167 2488 2082 1841 2240 4091 5087 2183
437B183k423J438N80k525j446m94nJ656q76l517J422M340n56k282K592L120P37
$$ 2183 -240 1198 1778 -747 -2193 -2687 -2692 -1036 -1912 -5429 -4007 333 -223 -2505 87 3207 3944
454C944j48j352m1K254j087m670l63J800j893j628J20q52J451K544k059j761M590
$$ 3944 3796 2444 2403 4657 3570 -1100 -1463 337 -1556 -3184 -3064 -3916 -2465 79 -1980 -3741 849
471H49J572k739O05K770j74J52l2k628J194K212l398l353K093kk985P27k51o42
$$ 849 2421 -318 287 3057 2883 3035 3003 375 1569 3781 383 -2970 -877 -879 -3864 -3137 -3388 -4030
489d030L288J348k473J920M125j177j436J257j101o91J732k751j545K899k78m164
$$ -4030 -742 606 -1867 53 4178 3001 1565 2822 1721 1030 2762 11 -1534 1365 1087 -3077
505c077R87J970k340K31J318k028J020L750k131j594N023J045l437J929J218l557
$$ -3077 -2090 -120 -2460 -2229 -911 -2939 -1919 1831 -300 -1894 3129 4174 737 2666 3884 327
521C27K46J057l584p08K740j513k374K094R79j318K286P31j668Q84J743j993o73
$$ 327 573 1630 -1954 -2662 78 -1435 -3809 -1715 -736 -2054 232 963 -705 179 1922 -71 -744
538g44K772J48r71N48j23o85K82j850j133P67p43j281P84J40J50K362Q44j633
$$ -744 2028 2176 1205 1753 1630 945 1227 -623 -1756 -989 -1732 -3013 -2229 -2089 -1939 423 1267 -366
556c66J492K535j785k064K259k10j975M83J55j767R08N43j971Q0J891j112j611
$$ -366 1126 3661 1876 -188 2071 1861 -114 369 524 -1243 -335 208 -1763 -1683 208 -904 -2515
573b515J522O00j198J444J671m28J9K115l49j717k0N14j242j533j72m27p7q8K73
$$ -2515 -993 -393 -1591 -147 1524 1096 1115 3230 2881 1164 1144 1658 416 -1117 -1289 -1716 -1793 -1881 -1608
592a608K27Q90O00q2k01R69J85n99L93M10n28K52M15j041m03J058o78j914N39
$$ -1608 -1381 -491 109 27 -174 795 980 381 774 1184 656 908 1323 282 -121 937 259 -1655 -1116
611a116L14j144l92J038K73J27J201N99L67M95K95n48l57k21p52n90M14r41k36
$$ -1116 -802 -1946 -2338 -1300 -1027 -900 301 900 1267 1762 2057 1509 1152 931 179 -411 3 -938 -1174
630a174P08q7p29J39Q83m46J54J48J81Q15J91J7L82P55n79j82O2o33q48l97l31
$$ -1174 -466 -553 -1282 -1143 -260 -706 -552 -404 -223 592 783 800 1182 1937 1358 1176 1238 605 -243 -640 -971
651i71o56M55l3m76K86J369j95M71Q60J56o31O84k62q47L90O42r59l65O72p65
$$ -971 -1627 -1172 -1205 -1681 -1395 -26 -221 250 1110 1266 635 1319 1057 210 600 1242 283 -82 590 -175
671a75q56N22l36n71J89L95m36N20J065l07M64O73K53n88N74k38j179K99K64j220
$$ -175 -1031 -509 -845 -1416 -1227 -832 -1268 -748 317 10 474 1147 1400 812 1386 1148 -31 268 532 -688
691f88m15O24l82n69P46k05m0P91M9k44Q81K91o59O79P24m95o31O45p77q05K32
$$ -688 -1103 -479 -861 -1430 -684 -889 -929 -138 -89 -333 548 839 180 859 1583 1088 457 1102 325 -480 -248
712b48m06n68J47Ko82P46Q83k71L35R57n50OM97M04p06N98k05j179L08K98q34
$$ -248 -654 -1222 -1075 -1073 -1755 -1009 -126 -397 -62 895 345 351 848 1252 546 1144 939 -240 68 366 -468
733d68j65K62l44m38M13R5l17N90M62j98O99O67n07P2M45n62m94L32m76o10R3
$$ -468 -633 -371 -715 -1153 -740 -645 -962 -372 90 -108 591 1258 751 823 1268 706 212 544 68 -542 -449
754d49J26l92n2L51l43o4M04L18r6N59q3q9L86J80P3m72K12k86m74J42j97m90
$$ -449 -323 -715 -767 -416 -759 -823 -419 -101 -197 362 279 190 576 756 829 357 569 283 -191 -49 -246 -736
776g36J43q5k57K42J63J90l1N50K15k9J03L64j18Q4l22o1k85J53j99m58J28m76
$$ -736 -593 -678 -935 -693 -530 -340 -371 179 394 365 468 832 714 798 476 415 130 283 84 -374 -246 -722
798g22N1RP9l07L38K93qM72J49J70j20L06J66k60l56J18m6o96j92K40n66M04j31
$$ -722 -671 -662 -583 -890 -552 -259 -267 205 354 524 404 710 876 616 260 378 332 -364 -556 -316 -882 -478 -609
821f09j7L24K85P0J06K14K09j35L60j13k64n9r5j73j75j77j35j69M5J9l07P06
$$ -609 -626 -302 -17 53 159 373 582 447 807 694 430 371 276 103 -72 -249 -384 -553 -508 -489 -796 -90
843i0o8k40M92L60l07K13K09J59J10l80l05J55l19l37j32J06J11k92K6K70J77
$$ -90 -158 -398 94 454 147 360 569 728 838 458 153 308 -11 -348 -480 -374 -263 -555 -529 -259 -82
864h2Q2J3K02l05p0K62M19j19k54K26J31k98Rk30m58J7q7J39l13J86K67J80J99
$$ -82 0 13 215 -90 -160 102 521 402 148 374 505 207 216 -14 -472 -455 -542 -403 -716 -530 -263 -83 116
887A16m0K07j84M45k38J97j35j20m14K04k5k87p1j2L3k55L10l40J06Q1J37n8N86
$$ 116 76 283 99 544 306 503 368 248 -166 38 13 -274 -345 -357 -324 -579 -269 -609 -503 -422 -285 -343 243
910B43n3R3M31j03m54L8L2l42k54j79K65N7j33k14N74R9j40n2K11n7K18j91K59
$$ 243 190 283 714 611 157 195 227 -115 -369 -548 -283 -226 -359 -573 1 100 -40 -92 119 62 280 89 348
933C48j82M75l2m28k84K86n14pn3O5J10P7k4p07P68L54l81L27L35k44j07M3k03
$$ 348 166 641 609 181 -103 183 -331 -338 -391 -326 -216 -139 -163 -870 -102 252 -129 198 533 289 182 225 22
956B2J07O4j54j01j86p0J82J06m06j20L60p3j22J67L19M51l46L33l8l16J82l05
$$ 22 129 193 39 -62 -248 -318 -136 -30 -436 -556 -196 -269 -391 -224 95 546 200 533 495 179 361 56
978E6p0j42Q0j67N4k74N63j79j48K79o6O4K83m6m35J40R6j58K00j64L08j94k82
$$ 56 -14 -156 -76 -243 -189 -463 100 -79 -227 52 -14 50 333 287 -148 -8 88 -70 130 -34 274 80 -202
1001b02K85m40p6J39P9j92J66L04l16K21K67j55M9K61l39k55L53j25n7J61J08
$$ -202 83 -357 -433 -294 -215 -407 -241 63 -253 -32 235 80 129 390 51 -204 149 24 -33 128 236
1022B36l70r2J49m9k37J22P6R4J14K10m93K57K00j57L43Q5j89K8j20j97n3J96
$$ 236 -134 -226 -77 -126 -363 -241 -165 -71 43 253 -240 17 217 60 403 488 299 327 207 10 -43 153
1044A53n13J54M2n8M3o0J44k32K50O26n37K03K15k87l74L28P3r2L9m5l69J68J07
$$ 153 -360 -206 -164 -222 -179 -239 -95 -327 -77 549 12 215 430 143 -231 97 170 78 117 72 -297 -129 -22
1067b2J7k22J73k12r9J53J2J03L06j7J6j23J61J65k97p7K30m64K21j70l8K16r9
$$ -22 -5 -227 -54 -266 -365 -212 -200 -97 209 192 208 85 246 411 114 37 267 -197 24 -146 -184 32 -67
1090f7Nm5o1K94J0j82J93o2P0j73J59NK62n28M65l00j51j01K21p4k36L86J6k60
$$ -67 -62 -107 -168 126 136 -46 147 85 155 -18 141 146 408 -120 345 45 -106 -207 14 -60 -296 90 106 -154
1114a54j9M35j02jK54l59K60j17k07k36J51J61j56Q3k50j39M32k29m5K13J79j8
$$ -154 -173 262 160 159 413 54 314 197 -10 -246 -95 66 -90 -7 -257 -396 36 -193 -238 -25 154 136
1136A36r5R6K86l97k5J93k17J76j56J77q9k31M9R7l41M76o0r9j56J69J03kj45
$$ 136 41 137 423 26 1 194 -23 153 -3 174 85 -146 -97 0 -341 135 75 -24 -180 -11 92 90 -55
1159e5R0j18j4K77j0j76L04o5j70q0k01lo0K02R4l2J05k48J55j42L56R2j71j47
$$ -55 35 -83 -97 180 170 -6 298 233 63 -17 -218 -221 -281 -79 15 -17 88 -160 -5 -147 209 301 130 -17
1183a7r1J92J18k34K9j4j33jK83k80l2K09k84J7k1M39k06q2J52m1K06k75m6K54
$$ -17 -108 84 202 -32 -3 -17 -150 -151 132 -148 -180 29 -255 -238 -259 180 -26 -108 44 3 209 -66 -112 142
1207A42l51J28lK4K9P7Or2j0J28j84n3J88R4k07J65j44l9J42n3l3J01L3J6j15
$$ 142 -209 -81 -84 -60 -31 46 52 -40 -50 78 -106 -159 29 123 -84 81 -63 -102 40 -13 -46 55 88 104 -11
1232a1l73M26K3m7J60m14j01L92Q7m77L40l4J09r0P2n4M37k92m4J58j16kk24Q1
$$ -11 -384 42 65 18 178 -236 -337 55 142 -335 5 -29 80 -10 62 8 445 153 109 267 151 149 -75 6
1256FJ25k20L38l36P5J21j3J04j88p6J40p9j31l2O9J65j33k4J76j57QJ7j34J64
$$ 6 131 -89 249 -87 -12 109 96 200 12 -64 76 -3 -134 -166 -97 68 -65 -89 87 -70 -62 -45 -179 -15
1280a5J60O7k62k10K17k2n2Q7J51l0Nj98N0J63o3k46j73K55pK08m6kK9m0q1K78
$$ -15 145 212 -50 -260 -43 -65 -117 -30 121 91 96 -102 -52 111 48 -198 -371 -116 -123 85 39 37 66 26 -55 223
1306B23k84J09j6M3O4j73l2J9k32m7M51k31QK60k4l53K87k2m1k3J73k65K71Nk03
$$ 223 -61 48 32 75 139 -34 -66 -47 -279 -326 125 -106 -98 162 138 -215 72 50 9 -14 159 -106 165 170 -33
1331c3J80j51J60j73K29j16j9l1k16J29L1R2L3o1k28J90J75m3j85l69L17K20l89
$$ -33 147 -4 156 -17 212 96 77 46 -170 -41 -10 82 115 54 -174 16 191 148 -37 -406 -89 131 -258
1354b58K01j44M45k86P8m2L8J37l49L82k41J23J55L0m3k31M2J22K4q4p3o0J33
$$ -258 -57 -201 244 -42 36 -6 32 169 -180 202 -39 84 239 269 226 -5 37 159 183 99 26 -34 99
1377I9j57l3J40J4k84K84j53K31P1m73L51nJ4j25j93K37K01k43l8N4J08p4k0L27
$$ 99 -58 -91 49 63 -221 63 -90 141 212 -261 90 85 99 -26 -219 18 219 -24 -62 -8 100 26 6 333
1401C33l95p9l8K25p2K53j07l26K83l29L47j19K98j26j57J67J4n62N30l59K56
$$ 333 -62 -141 -179 46 -26 227 120 -206 77 -252 95 -24 274 148 -9 158 172 -390 140 -219 37
1422C7R2m58M13j37m8J29M2L8k83%K44L8k12O9RQ0k16J88p0J23j31L19p4m12K0
$$ 37 129 -329 84 -53 -101 28 70 108 -175 -175 69 107 -105 -36 -27 53 -163 25 -45 78 -53 266 192 -220 -200
1447b00K56K09m35m6N75l18j30L1j07J28p9J34k6j44J81R1J2k2k16J07K72j71
$$ -200 56 265 -170 -216 359 41 -89 -58 -165 -37 -116 18 -8 -152 29 120 132 110 -106 1 273 102
1469A02J30j58l85N82j33j68O5L9M4O9k02l70L03K45j74r1j72L72N4j66j14M1
$$ 102 232 74 -311 271 138 -30 35 74 118 187 -15 -385 -82 163 -11 -102 -274 98 152 -14 -128 -87
1491h7j9l2L17j71m3p7K4o4J27k85K25J37L6l8lp9P9j25P0J34K51m11r8J53J96
$$ -87 -106 -138 179 8 -35 -112 -88 -152 -25 -310 -85 52 88 50 47 -32 47 -78 -8 126 377 -34 -132 21 217
1516B17k04J14j18n0R8P2j57LL38k92J91M3m72J75n8J59p9l5R9j41L74k28j88
$$ 217 13 127 9 -41 57 129 -28 -25 313 21 212 255 -217 -42 -100 59 -20 -55 44 -97 277 49 -139
1539a39k4J96j55K74o6n8N8m50L76J15k28L06r3k82J37J20k06K99m80L4K62J39
$$ -139 -163 33 -122 152 86 28 86 -364 12 127 -101 205 112 -170 -33 87 -119 180 -300 -266 -4 135
1561A35j22l3J3P4J95k81k91L49j24K53j35J47j91J91j73N2J0j64K32k65K42O2
$$ 135 13 -20 -7 67 262 -19 -310 39 -85 168 33 180 -11 180 7 59 69 -95 137 -128 114 176
1583A76m0j51j46K18Lr7J91J06k91J14kk9L09m82l5j46J91K70n1j96K22j32P4
$$ 176 136 -15 -161 57 60 -37 154 260 -31 83 81 52 361 -121 -156 -302 -111 159 108 -88 134 2 76
1606G6l05K51o3R0P7j17l22L53pj87o6J03j56j68L08r0L79j68R6j98m1J28J19
$$ 76 -229 22 -41 49 126 9 -313 40 33 -154 -220 -117 -273 -441 -133 -223 156 -12 84 -114 -155 -27 92
1629I2K1J29J13m29J2O0o7K3OJ63J4q1k15J28p0J49J01k50m4q8N9L25J4j50k14
$$ 92 113 242 355 -74 -62 -2 -69 -46 -40 123 137 56 -159 -31 -101 48 149 -101 -145 -233 -174 151 165 15 -199
1654a99J16n1K85j88n1J36j97M7L0J03J63k29m4J59O3j09j00J1K35j04l1M01l35
$$ -199 -83 -134 151 -37 -88 48 -149 -102 -72 31 194 -35 -79 80 143 34 -66 -55 180 76 45 446 111
1677A11k48M26l65K47J36m81Oj2P8J63o9L58l54j32J41N7k06P2K99M3k45J6j91
$$ 111 -137 289 -76 171 307 -174 -168 -180 -102 61 -8 350 -4 -136 5 62 -144 -72 227 270 25 41 -150
1700a50L80l55J77k65Q8M06m66K75j04J75j99K24n4n0k50J4L8J92m0J07j34J22
$$ -150 230 -125 52 -213 -125 281 -185 90 -14 161 -38 186 132 82 -168 -154 -116 76 36 143 9 131
1722A31k35J29K39l2k23n8J31n7n9J17%j11R3J49j82P7k28L8K73k18q7J98j78
$$ 131 -104 25 264 232 9 -49 82 25 -34 83 83 -28 65 214 32 109 -119 -81 192 -26 -113 85 -93
1745i3o0K23M2l05L37q7J3K55l66L80l69J85j11q8k05RJ71m8M1J09J10l00L7K92
$$ -93 -153 70 112 -193 144 57 70 325 -41 339 -30 155 44 -44 -249 -240 -69 -117 -76 33 143 -157 -120 172
1769A72j37p6R0P4k57J34j52K23L53n47j46M02m14M84k70j28J77m7oj65J38J65
$$ 172 35 -41 49 123 -134 0 -152 71 424 -123 -269 133 -281 203 -67 -195 -18 -65 -71 -236 -98 67
1791F7N2k4j28l6LJ99j12k43K66l60J08J24K40j01J2j27N5j90J98m64M62j09R8
$$ 67 119 95 -33 -69 -66 133 21 -222 44 -316 -208 -84 156 55 67 -60 -5 -195 3 -461 1 -108 -10
1814a0J10k1m5J74k63pK5p9k4k5N2j35K24k3j43j34L22R7k35q7J52j93N05j62
$$ -10 100 79 34 208 -55 -62 -37 -116 -140 -165 -113 -248 -24 -47 -190 -324 -2 95 -140 -227 -75 -268 237 75
1838G5j53L35k01j37J30P1k09K20J41k27L9R9j0j99O6N7J30l5k83K35L3l86O0
$$ 75 -78 257 56 -81 49 120 -89 131 272 45 84 183 173 -26 40 97 227 192 -91 144 177 -209 -149
1861a49OM03k00q4P0j8K95k62l46K97J27j81q5j0KN2K15k18R4J09K27l34J00Q9
$$ -149 -143 260 60 -24 46 28 323 61 -285 12 139 -42 -127 -137 -135 -83 132 -86 8 117 344 10 110 199
1885A99p6K64o24L49J04j32L7l93L22j68K9K32j34K3k6R9j27J56r9P9k29K57k28
$$ 199 123 387 -237 112 216 84 121 -272 50 -118 -89 143 9 32 6 105 -22 134 35 114 -115 142 -86
1908h6j47M20m08j78M02q0O0J84k35rL1J42K03k49j16J34k55p8L08P3j39P9K91
$$ -86 -233 187 -221 -399 3 -77 -17 167 -68 -77 -46 96 299 50 -66 68 -187 -265 43 116 -23 56 347
1931C47l11k08K13k8J31k05J64J64j22j47j00J02j6K4O5J8Pj12J09K46k09l34
$$ 347 36 -172 41 13 144 -61 103 267 145 -2 -102 0 -16 8 73 91 98 -14 95 341 132 -202
1953b02K53O7n6j7L10p8k46j37K15J8k55p%J06m5l4J31N3O8k50K61j45J40n3M1
$$ -202 51 118 62 45 355 277 31 -106 109 127 -128 -135 -135 -29 -74 -108 23 76 144 -106 155 10 150 97 138
1978A38j29j25j10L12L1l04K2M30l22K7m2j4J62L2j5k11K50l99L52r2l9L38l36
$$ 138 9 -116 -226 86 117 -187 -165 265 -57 -30 -72 -86 76 108 93 -118 132 -267 85 -7 -46 292 -44
2001d4K0p8K94j16m01L05j30K22J5L4l0j67K94k13k49J94J30o8M3k12n7J96R9
$$ -44 -24 -102 192 76 -325 -20 -150 72 87 121 91 -76 218 5 -244 -50 80 12 55 -157 -214 -18 81
2024H1J2l53K77r1K27j84k74K93o7K35l49K09m0j72K14n7Q3M0j2R5p4q9P5m80
$$ 81 93 -260 17 -74 153 -31 -305 -12 -79 156 -193 16 -24 -196 18 -39 44 84 72 167 93 4 79 -401
2048d01L24J51k87K68J12k32k8L0N6J16j8j41q1nK35l1n7K1J09l71K13o6L96l32
$$ -401 -77 74 -213 55 167 -65 -93 -63 -7 109 91 -50 -131 -136 99 68 11 32 141 -230 -17 -83 313 -19
2072a9n4L31m58pJ39J1j14m5K62j59J53J79o7L4q7J5k03J11l0k9J74j26J58j50
$$ -19 -73 258 -200 -207 -68 -57 -171 -216 46 -113 40 219 152 186 99 114 -89 22 -8 -37 137 11 169 19
2096A9j66K38J52j41j11L0k10M98l32p2L99k95k6K7p2K14k53J22J67k11J41j40
$$ 19 -147 91 243 102 -9 21 -189 309 -23 -95 304 9 -17 10 -62 152 -101 21 188 -23 118 -22
2118b2O1j88N3J96k87O2J09L2J42k63J44j35J84k1K8o7j20O3M7j72o6K10k4JJ44
$$ -22 39 -149 -96 100 -187 -125 -16 16 158 -105 39 -96 88 67 95 28 -92 -29 18 -154 -220 -10 -34 -33 111
2143A11j49L28l87P4J86q6K68l68ORlj71N07l15j74j39J70J40n7J44j80j09M43
$$ 111 -38 290 -97 -23 163 77 345 -23 -17 -8 -11 -182 325 10 -164 -303 -133 7 -50 94 -86 -195 248
2166B48l16J3m0J08j87J04j10J90m02O03k05m3J6OJ71j00J4k05J71J1J02j66r6
$$ 248 -68 -55 -95 13 -174 -70 -180 10 -392 211 6 -37 -21 -15 156 56 70 -135 36 47 149 -17 -113
2189a13J12M57m56J35l64p2L09j9p2P9J39j73n2K88j27J7l7p8j22M07k9k27qq5
$$ -113 -1 456 0 135 -229 -301 8 -11 -83 -4 135 -38 -90 198 71 88 51 -27 -149 258 229 2 -6 -91
2213i1Q7l5j71M58j80j3l3k9j02K34j75L0J02pk09M3J94O6j79K02j79L6j69J70
$$ -91 -4 -39 -210 248 68 55 22 -7 -109 125 -50 -20 82 75 -134 -91 103 169 -10 192 13 49 -120 50
2237E0q2p5J00P3j70J77j46K00J60m01m5Q6K40k28K59j73J1N0p3J5k14L80j18
$$ 50 -32 -107 -7 66 -104 73 -73 127 287 -114 -159 -73 167 -61 198 25 36 86 13 28 -186 194 76
2260G6j53J29j50m0K42Q8k91M2J25k43Q6R1J32j43r1j14L01j47J84k92J55k00
$$ 76 -77 52 -98 -138 104 192 -99 -57 68 -175 -89 2 134 -9 -100 -214 87 -60 124 -168 -13 -213
2282b13L28j34l05L40l70J68J14O2l17L36K41m21K17l0j89M48m05J1K7n0L15k67
$$ -213 115 -19 -324 16 -354 -186 -72 -10 -327 9 250 -171 46 16 -173 275 -130 -119 -92 -142 173 -94
2304i4P1P5j32j62K53j59J81J35m17J46J41n1P0J2k05R0l73M93k10J67j21J99
$$ -94 -23 52 -80 -242 11 -148 33 168 -249 -103 38 -13 57 69 -136 -46 -419 74 -136 31 -90 109
2326A09j94k96L40j45K17k93K26J90j09P9M3l05J49r0O8O7j28J03j48J53O5o5
$$ 109 -85 -381 -41 -186 31 -262 -36 154 45 124 167 -138 11 -79 -11 56 -72 31 -117 36 101 36
2348C6J33k04J69q0p6P1J12l39K74p5k97L65j12J37j76O4l1r5K30k63L38k36O0
$$ 36 169 -35 134 54 -22 49 161 -178 96 21 -276 89 -23 114 -62 2 -29 -124 106 -157 181 -55 5
2371Ej19J76J01k20J61Q5j37r9q7l5K59j98K09j2j98J16o2M20k39K8k16L28k46
$$ 5 -114 62 163 -57 104 189 52 -47 -134 -169 90 -108 101 89 -109 7 -55 365 126 154 -62 266 20
2394B0L8J61j94l6K10k09m4Q1l7q1m6K51j86J55m2L4n5K12r4oM8k6l23n1L07j93
$$ 20 58 219 25 -11 199 -10 -54 27 -10 -91 -137 114 -72 83 41 75 20 232 138 132 180 154 -169 -220 87 -106
2420a06j21J97nJ87j87K3K9J07J18m00J96J20r8O3n26L37k5R4j2L8M39m10j33
$$ -106 -227 -30 -35 152 -35 -12 17 124 242 -158 38 158 60 123 -403 -66 -91 3 -9 29 468 58 -75
2443g5R4J93m12J25K4j08J38J93j13j80j41R8P9K48m09J98J99p1rk22L01r9j63
$$ -75 19 212 -200 -75 -51 -159 -21 172 59 -121 -262 -164 -85 163 -246 -48 151 80 71 -151 150 51 -112
2466a12L61q5n6k2J2o2j43M6J00k51L11j19K0r1J7J90j14K53j14Lk12L23m2l09
$$ -112 249 164 108 86 98 36 -107 -61 39 -212 99 -20 0 -91 -74 116 2 255 141 144 -68 255 213 -96
2490i6J77nj67N8j1R3j42J29K3J05k66K53p5n9k07n5K19L47k47k9k8j63L88J1
$$ -96 81 76 -91 -33 -44 49 -93 36 59 164 -102 151 76 17 -190 -245 -26 321 74 45 17 -146 242 253
2514B53l55K1J58j14j67J07J55J63Rk54J80j60j56J87K6K9r7n6K02l32J40J11
$$ 253 -102 -81 77 -37 -204 -97 58 221 230 -24 156 -4 -160 27 53 82 -15 -71 131 -201 -61 50
2536E0R6j53K69k48k41N7J17J97p7Q1k31j42O7L0J14L35k80J12m32J82j63M33
$$ 50 146 -7 262 14 -227 -170 -53 144 67 148 -83 -225 -158 -128 -14 321 41 153 -279 -97 -260 173
2558A73l7p5l9J64k61j22K15j39K06n5k16L18k0k02J06K1r3K1j51J9K0J97K05
$$ 173 136 61 22 186 -75 -197 18 -121 85 30 -186 132 112 -90 16 37 -56 -35 -186 -167 -147 50 255
2581B55k46Q5k91L66K5p4j09J75l39MJ79j65J35J6M7k6p3MK52l15n5J53q9K80
$$ 255 9 94 -197 169 194 120 11 186 -153 -149 30 -135 0 16 63 37 -36 -32 220 -95 -150 3 -86 194
2605A94k72K97m51m6L42j58K21j02J31j58k37K89m3O8R6N9l9j91J12k47K23m5
$$ 194 -78 219 -232 -278 64 -94 127 25 156 -2 -239 50 7 75 171 230 191 0 112 -135 88 43
2627D3J09q2p4PL7M9l55O09j23k37j86K42J41M3k68n7j46M87j7j44L7J0O7k43
$$ 43 152 70 -4 3 40 89 -266 343 220 -17 -203 39 180 223 -45 -102 -248 239 222 78 115 125 192 -51
2651e1j18L29J6o4j13J69l50J79j51k28M73K3rj47j0q8K13j81J17J15jj65m2J86
$$ -51 -169 160 176 112 -1 168 -182 -3 -154 -382 91 114 105 -42 -52 -140 73 -108 9 124 123 -42 -84 102
2675A02j02m2J38j51P0n1L2j89J14K4j03L19j70O7m4n3j8L20k41l1J9j5j03J67
$$ 102 0 -42 96 -55 15 -36 -4 -193 -79 -55 -158 161 -9 58 14 -39 -57 263 22 -9 10 -5 -108 59
2699E9J48m03O2L74o9r2J5o5k44MJ35J30R2K3m9k69L6K01J19l71M58k79J82l7
$$ 59 207 -196 -134 240 171 79 94 29 -215 -211 -76 54 146 169 120 -149 -113 88 207 -164 294 15 197 160
2723A60k66Q9k5J38k74K47j33%K15l40o8K21N5P4l4j25j70K13k35J98M2l58K48
$$ 160 -106 -17 -42 96 -178 69 -64 -64 151 -189 -257 -36 19 93 59 -66 -236 -23 -258 -60 -18 -376 -128
2746a28J24M8O1k67K54j30j42L59k51n8J71K67k14j36J15L00m24j61J49m6J52
$$ -128 -4 44 105 -162 92 -38 -180 179 -72 -130 41 308 94 -42 73 373 -51 -212 -63 -109 43
2767D3j64K73p2k70K22j46J06n1pJ10J5K57n23O3J17k04L66k87K43q4k9k7Q7l42
$$ 43 -121 152 80 -190 32 -114 -8 -59 -66 44 59 316 -207 -144 -27 -231 135 -152 91 7 -22 -49 38 -304
2791c04K85K82m63L45m1j23j0j51M9M2L6J24R7k85J28l6k68L05l2M2r3k58L29
$$ -304 -19 263 -200 145 104 -19 -29 -180 -131 -89 -53 71 168 -117 11 -25 -293 12 -20 22 -71 -329 0
2814@j37J83j56K15l02J39Q2N9k80P3J19k94M50l06L63j51k27j47L94l4r6M5j03
$$ 0 -137 46 -110 105 -197 -58 24 83 -197 -124 -5 -299 151 -155 208 57 -170 -317 77 43 -53 -8 -111
2837a11J30M5r6K33j53J53l34K73m03L06k52J33R7J24k63J07L4J31k99M0J17J9
$$ -111 19 64 -32 201 48 201 -133 140 -263 43 -209 -76 21 145 -118 -11 23 154 -145 -105 12 31
2859C1J5l00J13k6J82l8O0k86M90n3J82p03K01k72L43L91n10J53K67r0k00O3Q7
$$ 31 46 -254 -141 -167 15 -23 37 -249 241 188 370 -333 -132 -404 -61 330 -180 -27 240 150 -50 13 100
2882A00J45k47m8j59J26J49j47K16k56p0L00J74n94K80Q2N5k36O1j26k5n8K08
$$ 100 245 -2 -50 -209 -83 66 -81 135 -121 -191 109 283 -311 -31 51 106 -130 -69 -195 -220 -278 -70
2904g0M4o1K20j9k48Q7K04k57J26k98Q9J70J77k58q3J60k66J89L8k35K76qJ23
$$ -70 -26 -87 133 114 -134 -47 157 -100 26 -272 -183 -13 164 -94 -177 -17 -283 -94 -56 -291 -15 -23 100
2927A00j16J00J07k82J32P3Q5q6rk06m7K46q9m78L36K21M7N6j29k13K12P2q3j33
$$ 100 -16 84 191 -91 41 114 199 113 104 -102 -149 97 8 -470 -134 87 134 190 61 -152 60 132 49 -84
2951h4P9K87o8k39k29L92j81K22N8l57J94M6k21M24l06J76k38mJ10k61J66m6L60
$$ -84 -5 282 214 -25 -254 138 -43 179 237 -120 74 120 -101 323 17 193 -45 -49 61 -200 -34 -80 280
2974B80m18K04L35n45p4K24J2j11K65l33K77j47O9M00k25k88j20J13M2k11L85
$$ 280 -138 66 401 -144 -218 6 18 -93 172 -161 116 -31 38 438 213 -75 -195 -82 -40 -251 134
2995A34j6r2j01KJ15m1L3l16M02Jj62K5J85l92K37j15q7J53mJ52l49L83Lj01j45
$$ 134 118 26 -75 -73 42 1 34 -282 120 121 -41 -16 169 -223 14 -101 -188 -35 -39 113 -236 147 150 49 -96
3020i6J91k24k9J16K6M4L5j05j23J13M9P6j18J19K9j37RQ6p4j35j0k38L11R1n6
$$ -96 95 -129 -158 -42 -16 28 63 -42 -165 -52 -3 73 -45 74 103 -34 -25 61 -13 -148 -158 -396 -85 6 -50
3045e0kK8j9KJ68j5p5m98O04p9j25k2K3j2L0m0K20k78k6oJ44J87k38n1L73l03
$$ -50 -52 -24 -43 -41 127 112 37 -461 143 64 -61 -83 -60 -72 -42 -82 138 -140 -166 -172 -28 159 -79 -130 243 -60
3071f0J05k3J30l39O1K65k29j94j67K80L05r8K8M7j59lM9q6R0j11J80JrP5j30
$$ -60 45 22 152 -187 -126 139 -90 -284 -451 -171 134 36 64 111 -48 -51 -2 -88 2 -109 71 72 63 138 8
3096HJ3J08j6k75J41L13k50k0K25Q9l18qN2O0l07K25o3n6R5j18J28n9K2M9j1k52
$$ 8 21 129 113 -162 -21 292 42 22 247 336 18 10 62 122 -185 40 -23 -79 16 -102 26 -33 -11 38 27 -225
3122b25J08K56j84J30k35K04J42q6j08j18k27M69j88n8L35k28J98k45L39j50p2
$$ -225 -117 139 -45 85 -150 54 196 110 2 -116 -343 126 -62 -120 215 -13 185 -60 279 129 57
3143E7k9r9P5N7J02j07q9J53k38n0K26M54m03j82L51j96P5k12N7J69Lj73j36J78
$$ 57 28 -71 4 61 163 56 -33 120 -118 -168 58 512 109 -73 278 82 157 -55 2 171 174 1 -135 43
3167D3n7k46K16l6J75j03j44K08K4j34j11J98k49q0N87l09j09K03l9n6J56j09
$$ 43 -14 -260 -44 -80 95 -8 -152 56 80 -54 -165 33 -216 -296 291 -18 -127 76 37 -19 137 28
3189B8K14l04L3L2j52K44J05j74J17k06M5J4J43q2j52o7J13o3Q8K35q5nj02J32
$$ 28 242 -62 -29 3 -149 95 200 26 143 -63 -18 -4 139 57 -95 -162 -49 -112 -24 211 126 121 19 151
3213A51j19K96m41Q5o8J32qn5j0J60j9K0l27o8J34N0J75J65P8m74O2J94n7J40
$$ 151 32 328 -113 -28 -96 36 28 -27 -37 123 104 124 -203 -271 -137 -87 88 253 331 -143 -81 113 56 196
3237A96j6l39J44J43K6l11K81o4J34jk7l76L24m4q3j79R2J40r3J66k5K03j93J4
$$ 196 180 -159 -15 128 154 -157 124 60 194 193 166 -210 114 70 -13 -192 -100 40 -53 113 88 291 98 112
3261A12j51J05l8j1P7n6j03l6L48j68p6k16L12J02k77J66N6n10M47k3r3J24l24
$$ 112 -39 66 28 17 94 38 -65 -101 247 79 3 -213 99 201 -76 90 146 -364 83 60 -33 91 -233
3284b33j8J07J05n8k86M65j34J48p9O2m8PK0j43N1K45m07L08l9Q6J22k68M4k58
$$ -233 -251 -144 -39 -97 -383 82 -52 96 17 79 31 38 58 -85 -34 211 -196 112 73 159 281 13 57 -201
3308b01L05j78R6L1j49L40k9n46L30o7J51J73m98M28k99K15k98P7P7oK28j13n9
$$ -201 104 -74 22 53 -96 244 215 -331 -1 -68 83 256 -242 186 -113 102 -196 -119 -42 -48 180 67 8
3331Hj54K49O9k47K06k5m4j59Q0L4n5oP3j49J65r8L04k10k45M09Q2m01J9J4n6
$$ 8 -146 103 172 -75 131 106 62 -97 -17 17 -38 -44 29 -120 45 -53 251 41 -204 205 287 -114 -95 -81 -137
3356a37KK68j62P7k20lL37k11N8rJ99k36k5K61k51K05l91Q1J79k99L51l1j35k6
$$ -137 -135 133 -29 48 -172 -175 162 -49 9 0 199 -37 -62 199 -52 153 -238 -157 22 -277 74 43 -92 -118
3380a18K17J35q4m91L15p2Q3J97k63L24k62jJ09n5j73M02k56j77K64r4O6J4j42
$$ -118 99 234 150 -341 -26 -98 -15 182 -81 243 -19 -20 89 34 -139 263 7 -170 94 0 66 80 -62
3403f2J2Nj42J37L7L2N4k91K75l7l9rn04O20j11L7j23J14R4J2l02Q2J39k02L33
$$ -62 -50 -45 -187 -50 -13 19 73 -218 57 20 -19 -28 -532 88 -23 14 -109 5 99 111 -191 -109 30 -172 161
3428A61j07r3N9n7n2n9k8L27k52N1m0J41J23k35J82N1M4r8J33l24M42k76j02j41
$$ 161 54 -39 20 -37 -89 -148 -176 151 -101 -50 -90 51 174 -61 121 172 216 118 251 -73 369 93 -9 -150
3452a50J11l32K93K55k44J18RLj13p2K76k82N9P1l4K58k80R1k29J76K17j47j72
$$ -150 -39 -371 -78 177 -67 51 60 63 -50 -122 154 -128 -69 2 -32 226 -54 37 -192 -16 201 54 -118
3475a18R8j75K69l39K46K47l37K30q1J33k65l7OK39k95L65k16l05L46l43M35j42
$$ -118 -20 -195 74 -265 -19 228 -109 121 40 173 -92 -129 -123 116 -179 186 -30 -335 11 -332 103 -39
3497c9n6J61R0j26l57J69K76j82k16M42k0k2l06K50j3n4k57Q0N7K94j67O5K43
$$ -39 -95 66 156 30 -327 -158 118 -64 -280 162 142 120 -186 64 51 -3 -260 -180 -123 171 4 69 312
3520C12l50J33j59j17N2J44m0j72J96lN7k2j56M10l17j38k6J60J84K2j74J79k57
$$ 312 -38 95 -64 -181 -129 15 -25 -197 -1 -4 53 31 -125 285 -32 -170 -196 -36 148 170 -4 175 -82
3543h2R4J61L5j07m06M20r7j78R6j69J66J91J7j15J03o9j11p8m7k11M02k4k5J17
$$ -82 12 173 208 101 -305 115 18 -160 -64 -233 -67 124 141 26 129 60 -51 -129 -176 -387 15 -9 -34 83
3567H3J24N2k65J54j78M9K62k17j68J8j12l5J33n7K03j57OJ06J4m9K68k10k55
$$ 83 207 259 -6 148 -30 19 281 64 -104 -86 -198 -233 -100 -157 46 -111 -105 1 15 -34 234 24 -231
3590b31K54j36J58M0r6l3l3N1l8l05L44m9J40j3J87o0m5k62J61O2j80K22K7k93
$$ -231 23 -113 45 85 -11 -44 -77 -26 -64 -369 -25 -74 66 53 240 180 135 -127 34 96 -84 138 165 -128
3614a28J52J33l76K26l49J09L04j78n3J31L2j32P0J40p8J27J44j7l42O7M3p0P8
$$ -128 24 157 -219 7 -342 -233 71 -107 -160 -29 3 -129 -59 81 3 130 274 257 -85 -18 25 -45 33
3637C3J07M2k24k63L46J03L91p55L55l06J60j95J71r8J08r0m15P90m55n2q4L30
$$ 33 140 182 -42 -305 41 144 535 -220 135 -171 -11 -206 -35 -133 -25 -115 -530 260 -195 -247 -331 -1
3659aJ61k31M1K40m49J07J58M6jj2l50L42j10P2l08L33n6k24J95R9j16k5K16K6
$$ -1 160 -71 -30 210 -239 -132 26 72 71 59 -291 51 -59 13 -295 38 -18 -242 -47 52 -64 -89 127 153
3683A53L6J36n02K51l5K4J48l70L05k69J10J07n6K3K4k32k0J36K48j82l04K70
$$ 153 189 325 -177 74 39 63 211 -159 146 -123 -13 94 38 61 85 -147 -167 -31 217 35 -269 1
3705Ar8K7J98j1p6o8l2K61j53l22K19n2L2p7J13K9K20l20kj2L11m47M66j22k32
$$ 1 -97 -70 128 117 41 -27 -59 202 49 -273 -54 -106 -74 -151 -38 -9 211 -109 -111 -123 188 -259 207 85 -147
3730a47L75Qo4j11q8K22l65K40n1K16j10l0m36M40j8k36R4J79N4j50J53j96q4
$$ -147 228 236 172 61 -27 195 -170 70 19 235 125 95 -341 99 81 -155 -61 118 172 22 175 -21 -105
3753a05J41q9J83r6J57k34P2j35j1L41j80k78J69J45n0J5l5O8R0k60J77o6Nm7
$$ -105 36 -53 130 34 191 -43 29 -106 -117 224 44 -234 -65 80 30 45 10 78 168 -92 85 19 24 -23
3777b3Q2j00P8l6k53K30K89j46k28q8J77m3J51j35J56k32L13j84j78J92l36K97
$$ -23 59 -41 37 1 -252 -22 267 121 -107 -195 -18 -61 90 -45 111 -121 192 8 -170 22 -314 -17
3799a7K40j9p2l41R2J06K83k54J53j51j63L1Q5n7J33l17K64j52r0L91l00J81q
$$ -17 223 204 132 -209 -117 -11 272 18 171 20 -143 -112 -27 -84 49 -268 -4 -156 -246 145 -155 26 18
3822A8l27K67m0J16N0j45J7qj26J02n2K00q8r1J16K4J12j37LM0j55L03l83L65
$$ 18 -309 -42 -82 34 84 -61 -44 -52 -178 -76 -128 72 -16 -107 9 33 145 8 11 51 -104 199 -184 181
3846A81l54N98n66j6J73J28j01j99k0L19l06J57J4N7n2l58L32J02j18N0k25M62
$$ 181 -173 425 -141 -157 16 144 43 -156 -176 143 -163 -6 8 65 13 -345 -13 89 -29 21 -204 258
3868B58l82O9J22l34M33k69R9k20K26MM2m4k45L97l85L45l22N34p08L07J53l25
$$ 258 -124 -55 67 -267 166 -103 -4 -224 2 6 48 4 -241 156 -229 116 -206 328 -380 -73 80 -245
3890b45J92O5O0Q8j32K7K99l45K74ll01J61o4k9J70j20J7j46Q8l19K72j08L91
$$ -245 -53 12 72 160 28 55 354 9 283 280 -21 140 76 47 217 97 114 -32 56 -263 9 -99 292
3913B92j49j71J82p3k90K92l10K83q1J0p6K61m03K22J25k2%j15l8k08J81q6o5
$$ 292 143 -28 154 81 -209 83 -227 56 -25 -15 -91 170 -233 -11 114 92 92 -23 -61 -269 -88 -174 -239
3936b39P5K51J49O7l10k9J12l0l22L90k01R9k3K4k15K11K7m7O4k49J29J09L1n1
$$ -239 -164 87 236 303 -7 -36 76 46 -276 114 -87 12 -11 13 -202 9 36 -11 53 -196 -67 42 73 22
3960B2J68k89j19J12p2k4L9K41J68m26J23J16k16J21M0O8l09K69LJ65k18J22q0
$$ 22 190 -99 -218 -106 -178 -202 -163 78 246 -180 -57 59 -157 -36 4 72 -237 32 35 200 -18 104 24
3983B4P1m9j7o5r2K96j40k98K37M9j44K19m1q9J14j67O1J56m06L68K33m39P2P6
$$ 24 95 46 29 -36 -128 168 28 -270 -33 16 -128 91 50 -39 75 -92 -31 125 -281 87 320 -119 -47 29
4007B9J26k88L67j19j19L6k43J30LR9n9o7J14lO4K7L99l49k21J29O0J49j99j57
$$ 29 155 -133 234 115 -4 32 -211 -81 -78 21 -38 -105 9 6 70 97 496 147 -74 55 115 264 65 -92
4031i2K02l42K30K9q0k27M15r3R4L7k15j63R4j57L15J83j45j70Q3k93K08J03k85
$$ -92 110 -232 -2 27 -53 -280 135 42 136 173 -42 -205 -111 -268 47 230 85 -85 -2 -295 -87 16 -269
4054b69L61k63J04K44k31k92M22j59L13q0J40m04j90M20J66o15N37k49K36k2k07
$$ -269 92 -171 -67 177 -54 -346 76 -83 230 150 290 -114 -304 116 282 -333 204 -45 191 169 -38
4075c8n7lK26l14O1l2J40K04l05J56j86K16q5J65j15j53K91M2m9J23o51K85J03
$$ -38 -95 -98 128 -186 -125 -157 -17 187 -118 38 -148 68 -17 148 33 -120 171 213 164 287 -364 -79 24
4098B4j49J0O2L7J7j21l1M3q6N70m70K93J1k43J88j30P5J9j04rj0J62j92N2k82
$$ 24 -125 -115 -53 -16 1 -120 -151 -108 -194 376 -94 199 210 -33 155 25 100 119 15 6 -4 158 -34 18 -264
4123b64J86K63l1j62o8M4K9Qj71K59j20Q6m8J6R4k92J74J12j53j22L23p3k20R
$$ -264 -78 185 154 -8 -76 -32 -3 5 -166 93 -27 59 11 27 121 -171 3 115 -38 -160 163 90 -130 -121
4147a21J05K05k22M28l31j92M22k08o8J23m5rm6O5k88L30j25q0n6J86M8r0J14
$$ -121 -16 189 -33 395 64 -128 294 86 18 141 96 87 41 106 -182 148 23 -57 -113 73 121 31 145
4170A45r0K45l69n1p7J99r9l2KK89j67K06Rk22Q8l87L50Op5k98M59j91m6M33k55
$$ 145 55 300 -69 -120 -197 2 -97 -129 -127 162 -5 201 210 -12 76 -311 39 45 -30 -328 131 -60 -106 327 72
4195G2k19p3J85n3Q7r1k77M02m09N24j27n2KJ49j83PJ75k83K74p8J5l4Q5j50r3
$$ 72 -147 -220 -35 -88 -1 -92 -369 33 -376 148 21 -31 -29 120 -63 -56 119 -164 110 32 47 13 98 -52 -145
$$ [...]
8191A
##END NTUPLES=NMR FID
##END=
