##TITLE=1H_DE-92m_TFA
 200.13MHz, CDCl3,
 8 sc
 
 14.8.2025
##JCAMPDX= 6.0         $$ Bruker NMR JCAMP-DX V2.0
##DATA TYPE= NMR FID
##DATA CLASS= NTUPLES
##ORIGIN= UXNMR, Bruker Analytische Messtechnik GmbH
##OWNER= pz
$$ XWIN-NMR		Version 3.5
$$ Thu Aug 14 14:24:08 2025 Russian Standard Time (UT+4h)  she@DPX200
##.OBSERVE FREQUENCY= 200.1313
##.OBSERVE NUCLEUS= ^1H
##.DELAY= (6, 6)
##.ACQUISITION MODE= SIMULTANEOUS
##.ACQUISITION SCHEME= undefined
##.AVERAGES= 8
##.DIGITISER RES= 18
##SPECTROMETER/DATA SYSTEM= spect
##.PULSE SEQUENCE= zg30
##.SOLVENT NAME= CDCl3
##.SHIFT REFERENCE= (INTERNAL, CDCl3, 0, 14.3821)
##AUDIT TRAIL= $$ (NUMBER, WHEN, WHO, WHERE, WHAT)
$$ ##TITLE= Audit trail, XWIN-NMR		Version 3.5
$$ ##JCAMPDX= 5.01
$$ ##ORIGIN= Bruker BioSpin GmbH
$$ ##OWNER= she
$$ F:/spectra/data/she/nmr/H-C/1/audita.txt
$$ ##AUDIT TRAIL=  $$ (NUMBER, WHEN, WHO, WHERE, WHAT)
(   1,<2025-08-14 14:23:01.56 +0400>,<she>,<DPX200>,
      <created by zg, POWCHK disabled, PULCHK disabled
       configuration hash MD5:
       00 E9 B6 7A A2 85 ED C7 34 08 36 98 17 FE 4E 26
       data hash MD5: 16K
       2D 35 E0 48 39 CA 11 75 DD BE 84 16 4C CF EF 4C>)
$$ ##END=
$$ 
$$ hash MD5
$$ 21 4A 98 96 EE 0B 1A 49 AB FB 9E 45 FA FB F0 2A
##$RELAX= 
##$RELAX= 
##$RELAX= 
##$RELAX= 
##$RELAX= 
##$RELAX= 
$$ Bruker specific parameters
$$ --------------------------
##$DU= <F:/spectra>
##$EXPNO= 1
##$NAME= <H-C>
##$PROCNO= 1
##$TYPE= <nmr>
##$USER= <she>
##$AMP= (0..31)
100 100 100 100 100 100 100 100 100 100 100 100 100 100 100 100 100 100 
100 100 100 100 100 100 100 100 100 100 100 100 100 100 
##$AQSEQ= 0
##$AQ_mod= 1
##$AUNM= <au_zg>
##$AUTOPOS= <>
##$BF1= 200.13
##$BF2= 200.13
##$BF3= 200.13
##$BF4= 200.13
##$BF5= 200.13
##$BF6= 200.13
##$BF7= 200.13
##$BF8= 200.13
##$BYTORDA= 1
##$CFDGTYP= 0
##$CFRGTYP= 5
##$CHEMSTR= <none>
##$CNST= (0..31)
1 1 145 1 1 1 1 1 1 1 1 1 1 1 1 1 1 1 1 1 1 1 1 1 1 1 1 1 1 1 1 1 
##$CPDPRG= <>
##$CPDPRG1= <>
##$CPDPRG2= <>
##$CPDPRG3= <>
##$CPDPRG4= <mlev>
##$CPDPRG5= <mlev>
##$CPDPRG6= <mlev>
##$CPDPRG7= <mlev>
##$CPDPRG8= <mlev>
##$CPDPRGB= <>
##$CPDPRGT= <>
##$D= (0..31)
0 0.7 0 0 0 0 0 0 0 0 0 0.03 0 0 0 0 0 0 0 0 0 0 0 0 0 0 0 0 0 0 0 0 
##$DATE= 1755166980
##$DBL= (0..7)
120 120 120 120 120 120 120 120 
##$DBP= (0..7)
150 150 150 150 150 150 150 150 
##$DBP07= 0
##$DBPNAM0= <>
##$DBPNAM1= <>
##$DBPNAM2= <>
##$DBPNAM3= <>
##$DBPNAM4= <>
##$DBPNAM5= <>
##$DBPNAM6= <>
##$DBPNAM7= <>
##$DBPOAL= (0..7)
0.5 0.5 0.5 0.5 0.5 0.5 0.5 0.5 
##$DBPOFFS= (0..7)
0 0 0 0 0 0 0 0 
##$DE= 6
##$DECBNUC= <off>
##$DECIM= 32
##$DECNUC= <off>
##$DECSTAT= 4
##$DIGMOD= 1
##$DIGTYP= 9
##$DL= (0..7)
0 120 120 120 120 120 120 120 
##$DP= (0..7)
150 150 150 150 150 150 150 150 
##$DP07= 0
##$DPNAME0= <>
##$DPNAME1= <>
##$DPNAME2= <>
##$DPNAME3= <>
##$DPNAME4= <>
##$DPNAME5= <>
##$DPNAME6= <>
##$DPNAME7= <>
##$DPOAL= (0..7)
0.5 0.5 0.5 0.5 0.5 0.5 0.5 0.5 
##$DPOFFS= (0..7)
0 0 0 0 0 0 0 0 
##$DQDMODE= 0
##$DR= 18
##$DS= 0
##$DSLIST= <SSSSSSSSSSSSSSS>
$$ [...]
##$SUBNAM0= <"">
##$SUBNAM1= <"">
##$SUBNAM2= <"">
##$SUBNAM3= <"">
##$SUBNAM4= <"">
##$SUBNAM5= <"">
##$SUBNAM6= <"">
##$SUBNAM7= <"">
##$SUBNAM8= <"">
##$SUBNAM9= <"">
##$SW= 18.0517328524113
##$SWIBOX= (0..15)
0 0 2 0 0 0 0 0 0 0 0 0 0 0 0 0 
##$SW_h= 3612.71676300578
##$TD= 16384
##$TD0= 1
##$TE= 0
##$TE2= 300
##$TE3= 300
##$TEG= 300
##$TL= (0..7)
0 120 120 120 120 120 120 120 
##$TP= (0..7)
150 150 150 150 150 150 150 150 
##$TP07= 0
##$TPNAME0= <>
##$TPNAME1= <>
##$TPNAME2= <>
##$TPNAME3= <>
##$TPNAME4= <>
##$TPNAME5= <>
##$TPNAME6= <>
##$TPNAME7= <>
##$TPOAL= (0..7)
0.5 0.5 0.5 0.5 0.5 0.5 0.5 0.5 
##$TPOFFS= (0..7)
0 0 0 0 0 0 0 0 
##$TUNHIN= 0
##$TUNHOUT= 0
##$TUNXOUT= 0
##$USERA1= <user>
##$USERA2= <user>
##$USERA3= <user>
##$USERA4= <user>
##$USERA5= <user>
##$V9= 5
##$VALIST= <valist>
##$VCLIST= <CCCCCCCCCCCCCCC>
##$VD= 0
##$VDLIST= <DDDDDDDDDDDDDDD>
##$VPLIST= <PPPPPPPPPPPPPPP>
##$VTLIST= <TTTTTTTTTTTTTTT>
##$WBST= 1024
##$WBSW= 4
##$XGAIN= (0..3)
0 0 0 0 
##$XL= 0
##$YL= 0
##$YMAX_a= 205889
##$YMIN_a= -177968
##$ZGOPTNS= <>
##$ZL1= 120
##$ZL2= 120
##$ZL3= 120
##$ZL4= 120
##$ABSF1= 10
##$ABSF2= 0
##$ABSG= 5
##$ABSL= 3
##$ALPHA= 0
##$AQORDER= 0
##$ASSFAC= 0
##$ASSFACI= 0
##$ASSFACX= 0
##$ASSWID= 0
##$AUNMP= <proc_1d>
##$AZFE= 0.1
##$AZFW= 0.1
##$BCFW= 1
##$BC_mod= 2
##$BYTORDP= 1
##$COROFFS= 0
##$CY= -3
##$DATMOD= 1
##$DC= 2
##$DFILT= <>
##$DTYPP= 0
##$F1P= 0
##$F2P= 0
##$FCOR= 0.5
##$FTSIZE= 0
##$FT_mod= 4
##$GAMMA= 1
##$GB= 0.15
##$INTBC= 1
##$INTSCL= 1
##$ISEN= 128
##$LB= 0.25
##$LEV0= 0
##$LPBIN= 0
##$MAXI= 10000
##$MC2= 0
##$MEAN= 0
##$ME_mod= 0
##$MI= 1.114404
##$NCOEF= 0
##$NC_proc= 0
##$NLEV= 6
##$NOISF1= 3.799351
##$NOISF2= 2.8
##$NSP= 1
##$NTH_PI= 0
##$NZP= 0
##$OFFSET= 14.38212
##$PC= 1
##$PHC0= -1564.515
##$PHC1= 16.39228
##$PH_mod= 1
##$PKNL= yes
##$PPARMOD= 0
##$PSCAL= 0
##$PSIGN= 0
##$REVERSE= no
##$SF= 200.129724274929
##$SI= 16384
##$SIGF1= 3
##$SIGF2= 2
##$SINO= 400
##$SIOLD= 16384
##$SREGLST= <1H.CDCl3>
##$SSB= 0
##$STSI= 0
##$STSR= 0
##$SW_p= 3205.1282051282
##$SYMM= 0
##$S_DEV= 0
##$TDeff= 0
##$TDoff= 0
##$TI= <>
##$TILT= no
##$TM1= 0
##$TM2= 0
##$TOPLEV= 0
##$USERP1= <user>
##$USERP2= <user>
##$USERP3= <user>
##$USERP4= <user>
##$USERP5= <user>
##$WDW= 1
##$XDIM= 8192
##$YMAX_p= 0
##$YMIN_p= 0
$$ End of Bruker specific parameters
$$ ---------------------------------
##NTUPLES= NMR FID
##VAR_NAME=  TIME,          FID/REAL,        FID/IMAG
##SYMBOL=    X,             R,               I
##VAR_TYPE=  INDEPENDENT,   DEPENDENT,       DEPENDENT
##VAR_FORM=  AFFN,          ASDF,            ASDF
##VAR_DIM=   8192,          8192,            8192
##UNITS=     SECONDS,       ARBITRARY UNITS, ARBITRARY UNITS
##FACTOR=    0.0002768,     1,               1
##FIRST=     0,             0,               0
##LAST=      2.2672688,     0,               0
##MIN=       0,             -177968,         0
##MAX=       2.2672688,     205889,          0
$$ Real data points
##PAGE= N=1
##DATA TABLE= (X++(R..R)), XYDATA
$$ [...]
1867H3n1L26l10L4j59k30J96N0K39j27l1P5ll47K95J23o20M91Q1k08j25K37pj75
$$ 83 32 358 48 82 -77 -307 -111 -61 178 51 20 95 92 -255 40 163 -457 34 115 -93 -218 19 12 -163
1891a63K04%O5m0j12j44J12l9J74k00K42m9l86J64L47l03Q4J38L4k80p6K81j26
$$ -163 41 41 106 66 -46 -190 -78 -117 57 -143 99 50 -336 -172 175 -128 -44 94 128 -152 -228 53 -73
1914g3p%K52k13J5J62l05K03N5k02nj61J31J76J77l00R4o8O5J33J68r5k89Q1N6
$$ -73 -80 -80 172 -41 -26 136 -169 34 89 -113 -118 -279 -148 28 205 -95 -1 -69 -4 129 297 202 -87 -6 50
1939E0j29J71j90K08J37k08j4l31M02j10J76m70J98R7k5j4R4k05K18J55n9Ln00
$$ 50 -79 92 -98 110 247 39 25 -306 96 -14 162 -308 -110 -13 -38 -52 42 -163 55 210 151 154 -346
1962c46K93K8j50K85k14J57J67k56J90l49JL14j25l79M46j65J70Kl9m2j61K54
$$ -346 -53 -25 -175 110 -104 53 220 -36 154 -195 -194 120 -5 -384 62 -103 67 69 30 -12 -173 81
1984H1r8NP9qK5k40J49O2l65J9K60J83n0l2j32J67l46J93J02J09m18K99K68k64
$$ 81 -17 -12 67 59 84 -156 -7 55 -310 -291 -31 152 102 70 -62 105 -241 -48 54 163 -255 44 312 48
2008D8J2m29L20j30L23j15P9J80n66L42j03j04M74k81j54L6N7j3O1k00K55r6J19
$$ 48 60 -369 -49 -179 144 29 108 288 -278 64 -39 -143 331 50 -104 -68 -11 -24 37 -163 92 -4 115
2031A15j99L2L38k28P2k82K00k25N8K6O0J6nn8M1R0k63J83l9K1N1j97M38l85M16
$$ 115 -84 -52 286 58 130 -152 48 -177 -119 -93 -33 -17 -22 -80 -39 51 -212 -29 -68 -47 4 -193 245 -140 276
2056B76k04k86L84J03m11K55q4Np3M2O4j35K43k64K28j26j44N3K90Mj50J52l64
$$ 276 72 -214 170 273 -138 117 33 38 -35 7 71 -64 179 -85 143 17 -127 -74 216 220 70 222 -142
2079a42L17o0k69K47k04K52j12k00K8J76k70K04jK8J41k84L95k09o6J25j05L85
$$ -142 175 115 -154 93 -111 141 29 -171 -143 33 -237 -33 -34 -6 135 -149 246 37 -29 96 -9 376
2101C76m07J76j39N1k41J11M02m80J33j03Q7L5o5Q5L84m83J81m1J48o0j37PJ03
$$ 376 -31 145 6 57 -184 -73 329 -151 -18 -121 -34 1 -64 21 405 -78 103 62 210 150 13 20 123
2124A23j48J05k30n0J6J71K61n06M77r6K37j68l2k30K6J6j07j9J16N6j57o2L15
$$ 123 -25 80 -150 -200 -184 -13 248 -258 219 123 360 192 160 -70 -44 -28 -135 -154 -38 18 -139 -201 114
2147A14j61J56j13Q1l28M5j2K80j02r4J99j02R2K14r1m25L00r3P8j57k34L08j02
$$ 114 -47 109 -4 77 -251 -206 -218 62 -40 -134 65 -37 55 269 178 -247 53 -40 38 -119 -353 -45 -147
2170a47K84r0j67j6J57o3pK29k23qJ02M7j8o2n9N8M8k31K71N5Kj68k73J39O1m1
$$ -147 137 47 -120 -136 21 -42 -49 180 -43 -51 51 98 80 18 -41 17 65 -166 105 160 162 -6 -279 -140 -79 -120
2196a20J5J38j34j95M34k87K28J75k03jJ13k43K24j85J38J93m52N0K50l39J76
$$ -120 -105 33 -101 -296 138 -149 79 254 51 50 163 -80 144 -41 97 290 -162 -112 138 -201 -25
2217b5Q4nk07K4N1j58P7L71j78J13j56p4K52k54j40L10M4k12K25j0j01j5k39p5
$$ -25 59 54 -153 -129 -78 -236 -159 212 34 147 -9 -83 169 -85 -225 85 129 -83 142 132 31 16 -223 -298
2241b98J94l5Q5j40J52j34J32J28Q6k20R0j02J51j03j05J85j8j1j89J71N9L1k50
$$ -298 -104 -139 -54 -194 -42 -176 -44 84 170 -50 40 -62 89 -14 -119 66 48 37 -152 19 78 109 -141
2264a41p0J82N1M4k23J45q9O2J10q3K5K5K23q9L9k39L55k73L6j3K52l72K15j72
$$ -141 -211 -29 22 66 -157 -12 -101 -39 71 -12 13 38 261 172 211 -28 327 54 90 77 329 -43 172 0
2288@k6pJ78j69k3o7j50K56L1J00j09j7k21K19J67l02Q5J57J16l01K46k32J97
$$ 0 -26 -33 145 -24 -47 -114 -264 -8 23 123 14 -3 -224 -5 162 -140 -55 102 218 -83 163 -69 128
2311A28n78N24j20j59J35r2K86j07%K67j65j74Q5k06J21j45M23k28j21N4M8k3
$$ 128 -450 74 -46 -205 -70 -162 124 17 17 284 119 -55 30 -176 -55 -200 223 -5 -126 -72 -24 -47
2333d7M1J54r2j97QL2K48k2k31J54k18J73j6j29K02N6k15J9M0k41O71j86j89k04
$$ -47 -6 148 56 -141 -133 -101 147 125 -106 48 -170 3 -13 -142 60 116 -99 -80 -40 -281 390 204 15 -189
2357a89K59l2k71J55K50j0J7o5o3P8j13J87k41J21m6J54K6m09J27M07k50j51O4
$$ -189 70 38 -233 -78 172 162 179 114 51 129 16 203 -38 83 37 191 217 -192 -65 342 92 -59 5
2380Ej65j6L01n1oQn54N78k82QK41N3o1p8J18J77k04k00K35j71L57j28j91j0R8
$$ 5 -160 -176 125 74 68 76 -478 100 -182 -174 67 120 59 -19 99 276 72 -128 107 -64 293 165 -26 -36 62
2405F2o6j35M78l63nK04k08J94k31p9K0K09j21q3L03j29J31j75J78k75K81k8m14
$$ 62 -4 -139 339 -24 -29 175 -33 161 -70 -149 -129 80 -41 -124 179 50 181 6 184 -91 190 162 -252
2428b52K57J36k05K42k78m1J18K3m9J81l4l51L68q5N7j30J3N5P7k86q8J95J77
$$ -252 5 141 -64 178 -100 -141 -23 0 -49 132 98 -253 115 30 87 -43 -30 25 102 -184 -272 -77 100
2451A00p0J2O1k94K10j34Q3o8j6J59k54PJ47N0j2l1K3J3k41p2L17q2M40n57K58
$$ 100 30 42 103 -191 19 -115 -32 -100 -116 43 -211 -204 -57 -7 -19 -50 -27 -14 -255 -327 -10 -92 348 -209 49
2476D9P9L7k62J02J85m34K97L03l25j68J08J1K05j51r5R6L8k17K69j35k10L11
$$ 49 128 165 -97 5 190 -244 53 356 31 -137 -29 -18 187 36 -59 37 75 -142 127 -8 -218 93
2498I3j52J18L8n2k2m0o5J56o8q6m1K98k26J5j46m7J37N3rJ10j28O2J04l18J26
$$ 93 -59 59 97 45 23 -17 -82 74 6 -80 -121 177 -49 -34 -180 -227 -90 -37 -46 64 -64 -2 102 -216 -90
2523i0J62M5J26m06K74j22J43l48K32j5q5NJ24m9j1j75J30J96m3j56q6K67p0k4
$$ -90 72 117 243 -163 111 -11 132 -216 16 1 -84 -79 45 -4 -15 -190 -60 136 93 -63 -149 118 48 24
2547B4j25r9L12k53J77k63L89j08m2K90k13J02j20J9j8j36r4K26mk12Q3rJ07J8
$$ 24 -101 -200 112 -141 36 -227 162 54 12 302 89 191 71 90 72 -64 -158 68 64 -148 -65 -74 33 51
2571E1r4o7K38j65J64m9l40Q8J56r9k50L63k11K26LN0l47N17k20K85m73LJ31l3
$$ 51 -43 -110 128 -37 127 78 -262 -174 -18 -117 -367 -4 -215 11 14 64 -283 234 14 299 -174 -171 -40 -73
2595g3n7J71r5j65M79k60p8j04J89j07K70o0N2j13R5j34r2K88j72j1j24k7J38
$$ -73 -130 41 -54 -219 260 0 -78 -182 7 -100 170 110 162 49 144 10 -82 206 34 23 -101 -128 10
2618A0k19L51j08l9k7j3L5N8j41K40j75pK11k69K13N8k91Q8L9l2R7K4q6P8J20
$$ 10 -209 142 34 -5 -32 -45 -10 48 -93 147 -28 -35 176 -93 120 178 -113 -25 14 -18 79 103 17 95 215
2643B15j47k6j67J21l6j3r3K99m7j86K80k1q0j80K3m7j1k47L16j80Q2K18m17L56
$$ 215 68 42 -125 -4 -40 -53 -146 153 106 -80 200 179 99 -81 -58 -105 -116 -363 -47 -227 -145 73 -344 12
2667A2r2N0J27N2n1m48N05j39K92m33Q0r7J89N7j18L7R9p9m6J29P4k30J70L6l87
$$ 12 -80 -30 97 149 98 -350 155 16 308 -125 -45 -142 47 104 -14 23 122 43 -3 126 200 -30 140 176 -211
2692b11L48rn2l8l00M95k06P7L2j50K48k21K13l22L7k6k13J01M24l87J54K37m22
$$ -211 137 128 76 38 -262 233 27 104 136 -14 234 13 226 -96 -59 -85 -298 -197 227 -160 -6 231 -191
2715a91L96j93l1K97k33j38j77M43L3l68K64k46J80J46k06K60j69j09K5kn8J74
$$ -191 205 12 -19 278 45 -93 -270 173 206 -162 102 -144 36 182 -24 236 67 -42 -17 -19 -77 97
2737I7k23M8Q2K14R2j72j48n6RK16k24N8J30k29J20j46K9J99n43L08K25m1L3k0
$$ 97 -126 -78 4 218 310 138 -10 -66 -57 159 -65 -7 123 -106 14 -132 -103 96 -447 -139 86 45 78 58
2761E8k32P9l5m1N2L1J76k03K08LM4j40J77k58N3N01m57K55l69J09J49j32J00
$$ 58 -174 -95 -130 -171 -119 -88 88 -115 93 96 140 0 177 -81 -28 473 16 271 -98 11 160 28 128
2784A28k5j31P1j51k4j48J63L25l87J76m8R6j15K27n3Oj27j53K58m7p8M0J38o2
$$ 128 103 -28 43 -108 -132 -280 -117 208 -179 -3 -51 45 -70 157 104 110 -17 -170 88 41 -37 3 141 79
2808G9q0M1k01L82l27J70m6K07o3r0j23K77j84P6o5LL3J42n81N00j18j88K35J95
$$ 79 -1 40 -161 221 -106 64 18 225 162 72 -51 226 42 118 53 56 89 231 -350 150 32 -156 79 274
2832B74q0j73pK16o1l53M44j71J34m93N49m30L00P3k42K41k82J5j02J61J5m9l04
$$ 274 194 21 14 230 169 -184 260 89 223 -270 279 -151 149 222 -20 221 -61 -46 -148 13 28 -21 -325
2855c25L55j5Lj12J86lr3o6J0J56Q9n9j48J98k49L52r8l10J99k76L83n2j94k20
$$ -325 30 15 18 -94 92 89 -4 -70 -60 96 185 126 -22 176 -73 279 181 -129 70 -206 177 125 -69 -289
2879b89M05k13n7j92M46j94m2J08j00J51Pp6K54O9n38L18j4K6L6q7l9j3j41J38
$$ -289 116 -97 -154 -346 100 -94 -136 -28 -128 23 30 -46 208 277 -261 57 43 69 105 18 -21 -34 -175 -37
2903c7L61m06L12j49mM1j84J5j10Q2K45k06O0O0j53j6KJ42j70K04k22J10P6nM0
$$ -37 324 -82 230 81 77 118 -66 -51 -161 -79 166 -40 20 80 -73 -89 -87 55 -115 89 -133 -23 53 48 88
2928H8j04J24j62p7m3J48JK1p4L7K6k95K99kJ8Lk80K32Lj59J47j41K5K61j37J12
$$ 88 -16 108 -54 -131 -174 -26 -25 -4 -78 -41 -15 -310 -11 -13 5 8 -272 -40 -37 -196 -49 -190 -165 96 -41 71
2954G1j02J02j72k14L85m4r2P8K0R2P3j01J20J9m47K05k2P6k06L06j12LJ10j88
$$ 71 -31 71 -101 -315 70 26 -66 12 32 124 197 96 216 235 -212 -7 -29 47 -159 147 35 38 148 -40
2978d0K23j73M06m06k0J6l65M00J06M5l05k02L91j36K45k41Q3J44m46K10K31j67
$$ -40 183 10 416 10 -10 6 -359 41 147 192 -113 -315 76 -60 185 -56 27 171 -275 -65 166 -1
3000aP3J98j78J25O8m80K01J70j54J16l34J24K23K06k15j37k27K36j34Q3k5j11
$$ -1 72 270 92 217 285 -195 6 176 22 138 -196 -72 151 357 142 5 -222 14 -120 -37 -62 -173
3022a73J88K6n7K26j43k31K87l17K04p0j1J57j74Q8j20J14m5p9K80P3j69j87K64
$$ -173 15 41 -16 210 67 -164 123 -194 10 -60 -71 86 -88 0 -120 -6 -51 -130 150 223 54 -133 131
3045A31k24K26j43N8j03K66k91L02k58Ro8J05O1J3j24pK66j42r7O4l44pM84j55
$$ 131 -93 133 -10 48 -55 211 -80 222 -36 -27 -95 10 71 84 -40 -47 219 77 -20 44 -300 -307 177 22
3069B2K1o2N1rj70J3M52k86N5j58j9q9J35p1R3J21j25n1q4n2M36k61P9J71l02
$$ 22 43 -19 32 23 -147 -134 318 32 87 -71 -90 -179 -44 -115 -22 99 -26 -77 -161 -213 223 -38 41 212 -90
3094i0J33p0L5m68N89k24J64P4l32J04J00l1j96K89M8n8P0J37k45JJ4K70q1k86
$$ -90 43 -27 8 -460 129 -95 69 143 -189 -85 15 -16 -212 77 125 67 137 274 29 30 44 314 233 -53
3118e3K7j58Q5L21m44M25J6k66l7l0J41k05J13J28j13J26O5l60K33rl84N71r1
$$ -53 -26 -184 -99 222 -222 203 219 -47 -84 -114 27 -178 -65 63 -50 76 141 -219 14 5 -379 192 101
3141A01j20nm7n2L54k18J2p4j06Q3j54K16J74m7j55k06J70K49k54j27O6K66p6
$$ 101 -19 -24 -71 -123 231 13 25 -49 -155 -72 -226 -10 164 117 -38 -244 -74 175 -79 -206 -140 126 50
3164E0k48J90K4j53p3L33j62q5J15O9q1N6Q3m9J11j32K8k7J70j34j1J7j82J14
$$ 50 -198 -8 16 -137 -210 123 -39 -124 -9 60 -21 35 118 69 180 48 76 49 219 85 74 91 -91 23
3188B3k80L65N0n6j67L5Rj91L36k97J61L0K15l18K65Lm14L09k50K45k5j06L9K2
$$ 23 -257 108 158 102 -65 -30 -21 -212 124 -173 -12 18 233 -85 180 183 -231 78 -172 73 48 -58 -19 3
3212Cp6OJ29k9RK97k78j28J83N6j98J43L3k54k1K26k26J84q5M2j17o0J60J50j17
$$ 3 -73 -67 62 33 42 339 61 -67 116 172 -26 117 150 -104 -125 101 -125 59 -26 16 -101 -161 -1 149 32
3237C2j48o7M06j60P6pn0j07L4k67NM20j96K30p1m4J62m92L36j36K12k3l8j79
$$ 32 -116 -183 223 63 139 132 82 -25 9 -258 -253 167 -29 201 130 86 248 -244 92 -44 168 145 107 -72
3261g2p6K35P9r4k15L19k67K3R9j78J2L48P0l85K17O3k60Q2Qk12K48P7J19j80
$$ -72 -148 87 166 72 -143 176 -91 -68 31 -147 -135 213 283 -102 115 178 -82 0 8 -204 44 121 240 60
3285F0o8M6j37j50K95j18q5O8j18L51o8j32j8Q2mN1m9k39J46p9L65k96J02k43
$$ 60 -8 38 -99 -249 46 -72 -157 -89 -207 144 76 -56 -74 8 4 55 6 -233 -87 -166 199 -97 5 -238
3309b38M08j10j93N2K44j83Qk50K34j34K25m0J1j46j8J98l5k43M31k60m5R4J27
$$ -238 170 60 -133 -81 163 -20 -12 -262 -28 -162 63 23 34 -112 -130 68 33 -210 221 -39 -84 10 137
3332A37k65k1M3L91l45J15J37k80K32l05L02l07K46l04J76J18Rl60K79k62M42
$$ 137 -128 -149 -106 285 -60 55 192 -88 144 -161 141 -166 80 -224 -48 70 79 -281 -2 -264 178
3353A78qj21M3j97K3M17l47k34L20o1rKq3O7K33j83Kj55J66O2j68M05j72k83l
$$ 178 170 49 92 -105 -82 335 -12 -246 74 13 4 6 -77 -10 223 40 42 -113 53 115 -53 352 180 -103 -106
3378a06O5P6j30R1j60N6J30j32k0J53j19M7l6K71j32J1k85l6J90P9R0k90K20k
$$ -106 -41 35 -95 -4 -164 -108 22 -110 -130 23 -96 -49 -85 186 54 65 -220 -256 -66 13 103 -187 33 31
3402C1j96L27j75L8m9k94L27O3J9P2l30pJ96R0k86PlK11K14J04l05l86Q40n52
$$ 31 -165 162 -13 25 -24 -318 9 72 91 163 -167 -174 22 112 -174 -167 -170 41 255 359 54 -332 508 -44
3426d4J7J01l6q6K18M2P1k9k27mo4R8n59M71K26j56Mp9N2N1j03L64j71J51m45
$$ -44 -27 74 38 -48 170 212 283 254 27 23 -41 57 -502 -31 195 39 43 -36 16 67 -36 328 157 308 -137
3451a37JK38j36j10N9K26J12m65L03j2j02qo8l40L06M51l05o5p8k35L11J96L07
$$ -137 -136 102 -34 -144 -85 141 253 -212 91 79 -23 -31 -99 -439 -133 318 13 -52 -130 -365 -54 142 449
3474D49m64k96K68j64K01J98j36j97J17l1K02p1j13J74j74k8L9M3J48j24j54K22
$$ 449 -15 -311 -43 -207 -6 192 56 -141 -24 -55 147 76 -37 137 -37 -65 -26 17 165 41 -113 109
3496A09m4j37k6O1K92n34L30R0l86J18J01J65k15O1m4LJ66k7q0m0J33p5P4P5k90
$$ 109 65 -72 -98 -37 255 -279 51 141 -245 -127 -26 139 -76 -15 -59 -56 110 83 3 -37 96 21 95 170 -120
3521a20Q2QJ73J9m61K40j41M61k73n0J87o0J05o6j19K46k45P1K6k09J58p6J04
$$ -120 -38 -30 143 162 -299 -59 -200 261 -12 -62 125 65 170 104 -15 231 -14 57 83 -126 32 -44 60
3544F0p0l7j36J80J29j51m3j40K44k38r4K22J69j60R5K71l95L13k87R4j41L84
$$ 60 -10 -47 -183 -3 126 -25 -68 -208 36 -202 -296 -74 95 -65 30 301 -94 219 -68 26 -115 269
3566B69k03l29K17kQ9j53J4K8L19n4k48J22J85m14K19N3L3k37O3p7R9j89N2L04
$$ 269 66 -263 -46 -48 41 -112 -98 -70 249 195 -53 69 254 -160 59 112 145 -92 -29 -106 -7 -196 -144 160
3590A60k58K58q7j37J15j7O3j26j72N62l22L8k17J28J58l54M43j3l91J58o3N0
$$ 160 -98 160 73 -64 51 34 97 -29 -201 361 39 77 -140 -12 146 -208 235 222 -169 -11 -74 -24
3612b4J61K16k12k26k17J65J39J20q1j97K33L3O9J74o94L25k01J93o8j56K10R2
$$ -24 137 353 141 -85 -302 -137 2 122 41 -156 77 110 179 353 -341 -16 -217 -24 -92 -248 -38 54
3634E4J9j14J27l44J66o2J58k32J44L61l56p2M69l20O2m0l13J88L28k58j57K88
$$ 54 73 -41 86 -258 -92 -154 4 -228 -84 277 -79 -151 318 -2 60 20 -293 -105 223 -35 -192 96
3656I6k53J55p3P7k11R2J59J92j61k31P4J95q8P5p2J38l3k91K11O8Kr0L7Q0p4
$$ 96 -157 -2 -75 2 -209 -117 42 234 73 -158 -84 111 23 98 26 164 131 -160 51 119 121 31 68 148 74
3681G4J79k23P2k89M2n1O9LK78j51J33j32J32r8oJ5J27k71M29j66j63P5j79J00
$$ 74 253 30 102 -187 -145 -196 -127 -124 154 3 136 4 136 38 32 47 174 -97 332 166 3 78 -101 -1
3705aJ01j60m9m8J88j10Q3j9j62N3J2j06K11J76l81L27m65K20o9J22m8K76j35
$$ -1 100 -60 -109 -157 31 -79 4 -15 -177 -124 -112 -218 -7 169 -212 115 -350 -130 -199 -77 -125 151 16
3728A6K3l0K80j33k03J55k10j27J17M7L3R1m4k7j90K24n0K83j31j41M23k68k68
$$ 16 39 9 289 156 -47 108 -102 -229 -112 -65 -32 59 15 -12 -202 22 -28 255 124 -17 406 138 -130
3751a30O9Q6p0o4L80k01k05K65j28r5N5J99j13l2J39l27J4J39o7J4K15l82L93
$$ -130 -61 25 -45 -109 271 70 -135 130 2 -93 -38 161 48 16 155 -172 -158 -19 -86 -72 143 -239 154
3774A54j98K04k16rL3k51L10M7k04L86j18j89r2R3J90k75L55l41J33K62m45N3
$$ 154 -44 160 -56 -65 -32 -283 27 74 -130 256 138 -51 -143 -50 140 -135 220 -121 12 274 -171 -118
3796a18K62j7L2k65K08l18J62J30m8k12L72j35r7j49Q2J60k86K27m5K61k80K1
$$ -118 144 127 159 -106 102 -216 -54 76 28 -184 188 53 -44 -193 -111 49 -237 -10 -55 206 -74 -53
3818e3L13k25j37k33O84l82K46j49j87J28j33k05O9L39j45L90l70J30J45k5k15
$$ -53 260 35 -102 -335 349 -33 213 64 -123 5 -128 -333 -264 75 -70 320 -50 80 225 200 -15
3839a5P7l68K37K46l33J51RQk90L17q8p1K25k76M3R0k81K47J21J16m12K14r6P
$$ -15 62 -306 -69 177 -156 -5 4 12 -278 39 -49 -120 105 -171 -128 -38 -319 -72 49 165 -247 -33 -129 -122
3863a22J54J71k23K04j35K1p0K32m43N8K03l1k28K80Q8j23k08R5L3M1l2p7k0K10
$$ -122 32 203 -20 184 49 70 0 232 -211 -153 50 19 -209 71 159 36 -172 -77 -44 -3 -35 -112 -132 78
3887G8m80J72J27J53M5j79L5j19j09J98M32o28L15k06P8K03r3m7Q5J4j20RQ1L17
$$ 78 -402 -230 -103 50 95 -84 -49 -168 -277 -79 353 -275 40 -166 -88 115 22 -25 60 74 -46 -37 44 361
3911C61n25K29j59Nl73N84k94R2K58l78K39kj31O2q4j21L19K5m8j12L6q3J99n0
$$ 361 -164 65 -94 -89 -462 122 -172 -80 178 -200 39 37 -94 -32 -116 -237 82 107 59 -53 -17 -100 99 49
3935D9M2n3j3L1j74q0J97r0K63k94K30jj71K25j64j82J72K8j6J43l9k41J39J66
$$ 49 91 38 25 56 -118 -198 -1 -91 172 -122 108 107 -64 161 -3 -185 -13 15 -1 142 103 -138 1 167
3959A67m31J77PK07qM2j65n0p3K00r0P3p2j36J50N7k84K55J49k20L04k90O4j18
$$ 167 -264 -87 -80 127 119 161 -4 -54 -127 73 -17 56 -16 -152 -2 55 -229 26 175 -45 259 -31 33 -85
3983h5K47j02j99K97j89K5j3j00J81oj80j23J72p2L16m37L05o9N5j85J37K22k72
$$ -85 162 60 -139 158 -31 -6 -19 -119 62 56 -124 -247 -75 -147 169 -268 37 -32 23 -162 -25 197 -75
4006g5n8oJ37l16L45n9nj23M23l78J18o0j21k6J38M6j41K61k50J01K98l48J28
$$ -75 -133 -139 -2 -318 27 -32 -37 -160 263 -115 3 -57 -178 -204 -66 -20 -161 100 -150 -49 249 -99 29
4029B9L4m9J27k35K53l8k69K22l24L25j21K62l43J65N7K9q0j40K4J21R0k27J90
$$ 29 63 14 141 -94 159 121 -148 74 -250 75 -46 216 -127 38 95 124 44 -96 -72 49 139 -88 102
4052A02K53n37k3J99k1J3J67k19j88L03NJ5k44J58J01Nk04O2M5L9J5j37O4O6j59
$$ 102 355 -182 -205 -6 -27 -14 153 -66 -254 49 54 69 -175 -17 84 89 -115 -53 -8 31 46 -91 -27 39 -120
4077a20O4J31j84p3P9R0j29J43r3K44j82J14k5J16j77q3K21M3o1j50K24n10K78
$$ -120 -56 75 -109 -182 -103 -13 -142 1 -92 152 -30 84 59 175 -2 -85 136 179 118 -32 192 -318 -40
4100d0k78K84K01j77J15n5p3k69k5K62J65j60J99k65K0J23P8k69N9r9L81j53j40
$$ -40 -318 -34 167 -10 105 50 -23 -292 -317 -55 110 -50 149 -116 -96 27 105 -164 -105 -204 177 24 -116
4123a16K5k15L27J10L6J81q5j66O0l50L57o0J5l10J79K01j67P5j99L09n18L78
$$ -116 -91 -306 21 131 167 348 263 97 157 -193 164 104 119 -191 -12 189 22 97 -102 207 -311 67
4145F7p3P6j27K70k49j0Q3J69k30M2L4k08N3K5M6J04j54J50l0j19o8K80j86J64
$$ 67 -6 70 -57 213 -36 -46 37 206 -24 18 52 -156 -103 -78 -32 72 -82 68 38 -81 -149 131 -55 109
4169A09j71K7K73k44J55j67m3j71K28J53j65k34K31P4m2J25M3k46K41j70J0L0
$$ 109 -62 -35 238 -6 149 -18 -61 -232 -4 149 -16 -250 -19 55 13 138 181 -65 176 6 16 46
4191D6j36O7q0j3R1J33q2P6k97K99j72J46k14O2J04k6J72j17l2Q6Ln7K19l79L13
$$ 46 -90 -23 -103 -116 -25 108 26 102 -195 104 -68 78 -136 -74 30 4 176 59 27 113 116 59 278 -101 212
4216B12l5j95M1l7j1K12o4R7k34K3J8P0p7J13j99k8n1J8K12L0k22J45r4J4K49
$$ 212 177 -18 23 -14 -25 187 123 220 -14 9 27 97 20 133 -66 -94 -145 -127 85 115 -107 38 -56 -42 207
4241B07O1l26K44k17J28p0O9k13POO8K13k89Q9k89N67k23j30J55j72J31K8p2M6
$$ 207 268 -58 186 -31 97 27 96 -117 -110 -104 -36 177 -112 -23 -312 255 32 -98 57 -115 16 44 -28 18
4265A8k92L37o3j93K00o2K92l40J10M5j98p5K23OJ84k00O7k18J30J22j11J49j71
$$ 18 -274 63 0 -193 7 -55 237 -103 7 52 -146 -221 2 8 192 -8 59 -159 -29 93 -18 131 -40
4288d0K5j2j52K68o9j46O5J11k20L06j59Nj58K12j00JO4k05M3L39n2k55l0J81
$$ -40 -15 -27 -179 89 20 -126 -61 50 -170 136 -23 -18 -176 36 -64 -63 1 -204 -161 178 126 -129 -159 22
4312B2K3j58O3J00r8L3j29J26L0ko4j4R1%P2l26M97l49k71N65k20k25j0J81m0
$$ 22 45 -113 -50 50 -48 -15 -144 -18 12 10 -54 -68 23 23 95 -231 266 -83 -354 211 -9 -234 -244 -63 -103
4337a03p5J03O2Q1R8j21Q2k64j49Q7K82J03M5m11M14M4k95l1j75J83NK03l00J28
$$ -103 -178 -75 -13 68 166 45 127 -137 -286 -199 83 186 231 -180 234 278 -17 -48 -223 -40 -35 168 -132 -4
4361dK06q3k14L28k37J18j06j73J38j06K47kj02Q1j12J13k6r6q6J13n1j85M40
$$ -4 202 119 -95 233 -4 114 8 -165 -27 -133 114 112 10 91 -21 92 66 -30 -116 -3 -54 -239 201
4384B01j98J27k58K70k50J7J49m7l75K42k35L55J45j76K7k5k7l08J35L66J5K3
$$ 201 3 130 -128 142 -108 -91 58 11 -364 -122 -357 -2 143 -33 -6 -31 -58 -366 -231 135 150 173
4406A73j64r7M4J23j78J54J88k11j49J53K37l18K84k53m6M3k33K47J80k05J63
$$ 173 9 -88 -44 79 -99 55 243 32 -117 36 273 -45 239 -14 -60 -17 -250 -3 177 -28 135
4427A35j53o7N2K64k53J93o7J23j3j74q9K26p3J69j77k62L1J50Oj41J21j35L40
$$ 135 -18 -85 -33 231 -22 171 104 227 214 40 -49 177 104 273 96 -166 -135 15 21 -120 1 -134 206
4450B06k24J34j52k67L26J33J31O7m04O2J00j64O5K10k5ol04L3J28lK8n1j51N14
$$ 206 -18 116 -36 -303 23 156 287 354 -50 12 112 -52 13 223 198 192 -112 -79 49 46 74 23 -128 386
4474C86k26l20K89l47L42O0k73P3rK36k38P4j05J56j63P3M5n7k14p4R7P9L19P8
$$ 386 160 -160 129 -218 124 184 -89 -16 -25 211 -27 47 -58 98 -65 8 53 -4 -218 -292 -195 -116 203 281
4498B81j95P4K30n05J39p1K41l59J80k55J92j66K02j02K49m14N6K22P0k68L69
$$ 281 86 160 390 -115 24 -47 194 -165 15 -240 -48 -214 -12 -114 135 -279 -223 -1 69 -199 170
4519A70j99Pk1k59O67l69p2k86N95k40p9M9Q8j67j94K08m1K94k08K65l79K75k21
$$ 170 -29 -22 -43 -302 365 -4 -76 -362 233 -7 -86 -37 51 -116 -310 -102 -143 151 -57 208 -171 104 -117
4542a17K1M7p6kJ89l62K90j20M8J62P9O4l07J8n6m3J29l9mM9k4J43J30k20RJ44
$$ -117 -96 -49 -125 -127 62 -300 -10 -130 -82 80 159 223 -84 -66 -122 -165 -36 -75 -79 -30 -54 89 219 -1 8 152
4568A52j86nJ51j27J11R8r1j08L00o2r0k91R3O9m8M35l63j91J62k4j30O4J59k
$$ 152 -34 -39 112 -15 96 194 103 -5 295 233 143 -148 -55 14 -34 401 38 -153 9 -15 -145 -81 78 76
4592G6j39O3k1K16k97P5J95j84k04N85l93r3J84j51J37o5j42K12p6L11l92K87
$$ 76 -63 0 -21 195 -102 -27 168 -16 -220 365 -28 -121 63 -88 49 -16 -158 54 -22 289 -103 184
4614A84j45M5j84j72J96R4J47l25J10J71k34r5L27j55k50K47J61J76j77j67P7
$$ 184 39 84 -100 -272 -76 18 165 -160 -50 121 -113 -208 119 -36 -286 -39 122 298 121 -46 31
4635C1N2l3m6J33j63J67k73K70j21ol01L59k76n5J27q9L74l31LJ74l2k2j44L48
$$ 31 83 50 4 137 -26 141 -132 138 17 11 -290 69 -207 -262 -135 -224 150 -181 -178 -4 -36 -58 -202 146
4659A46m43K24n9K39m76M93j09j5l6J10O0k70J51O1k55M11k81k0k6P7R9Kj83J72
$$ 146 -297 -73 -132 107 -369 124 15 0 -36 74 134 -136 15 76 -179 232 -49 -69 -95 -18 81 83 -100 72
4683G2j51J56O2j52J92j53M4P8j99J6o9R4r5p2J94pN1L0j73O0O3j17J33O8Ol03
$$ 72 -79 77 139 -13 179 26 70 148 -51 -35 -104 -10 -105 -177 17 10 61 91 -82 -22 41 -76 57 125 131 -172
4709a72J64j09J57j52L8K03q2j0q2m2nP0O6R1l25J47R8k8J4q2j92J59K07l12K15
$$ -172 -8 -117 40 -112 -74 129 47 37 -45 -87 -92 -22 44 135 -190 -43 55 27 41 -41 -233 -74 133 -179 36
4734C6Q5n9N5k73l5K02j51R4J97nl67m2K34j52K93j70J41M4q8K2j0k23MJ80p2
$$ 36 121 62 117 -156 -191 11 -140 -46 151 146 -221 -263 -29 -181 112 -58 83 127 39 61 51 -172 -168 12 -60
4759f0J78m02L80Lqn7j63J72k29J75o8k5K13k74J12j97K44K42o3k23J21j1j7l8
$$ -60 118 -284 96 99 91 34 -129 43 -186 -11 -79 -104 109 -165 -53 -250 -6 236 173 -50 71 60 43 5
4783EJ0j80N6L3J72j76k31M66m13J23k7K00Q3m7j0o0P3l28K41K43l86K15j03j00
$$ 5 15 -165 -109 -76 96 -80 -311 155 -258 -135 -162 38 121 74 64 4 77 -251 -10 233 -153 62 -41 -141
4807a41K46k56L15k06K29J26l13K90K3l64K67n53K77J95j40K24k02J19q8m1K8
$$ -141 105 -151 164 -42 187 313 0 290 313 -51 216 -337 -60 135 -5 219 17 136 48 7 35
4828C5R7l2k04o0R0L08j23J19N3k88J55k18K42j61q3m4k7K64l41K11r6P0k9J84
$$ 35 132 100 -104 -164 -74 234 111 230 283 -5 150 -68 174 13 -70 -114 -141 123 -218 -7 -103 -33 -62 122
4852A22l19nm7M14j85O2l24M17l34J81k45N48m67J74n4o9o4J67J80n51L71j28
$$ 122 -197 -202 -249 165 -20 42 -282 135 -199 -18 -263 285 -182 -8 -62 -131 -195 -28 152 -399 -28 -156
4874a56j47K16K76J5j65rk12K18J5N1Q7Njk32j45J82O0p7n6J64n0K18m81K95j50
$$ -156 -303 -87 189 204 39 30 -182 36 51 102 189 194 193 -39 -184 -2 58 -19 -75 89 39 257 -224 71 -79
4899g9J52p9J19J21r4P0l44J77Ol53L35j51QK32r1j18K2ro6L06r7K6l7q9M05l52
$$ -79 73 -6 113 234 140 210 -134 43 49 -304 31 -120 -112 120 29 -89 -67 -76 -142 164 67 93 56 -33 372 20
4925B0m8M6j72L39j0j46m0k07j6R2L12l8l55J32l3J61o0%q5J49k31J85j61o5M9
$$ 20 -28 18 -154 185 175 29 -11 -218 -234 -142 170 132 -223 -91 -124 37 -23 -23 -108 41 -190 -5 -166 -231 -182
4950a82KJ48N7n2k8J16L7K57n40M8K18O5p5l55K15p1J25Q9%Q2l44J29K80j08l57
$$ -182 -180 -32 25 -27 -55 61 98 355 -185 -137 81 146 71 -284 -69 -140 -15 74 74 156 -188 -59 221 113 -244
4975b44L87k80L02r2o1l3k48J28L05l27K41r1P3k24L87k79r3L19p0L6J45l15o8
$$ -244 143 -137 165 73 12 -21 -269 -141 164 -163 78 -13 60 -164 223 -56 -149 170 100 136 281 -34 -102
4998a02K53J57l05j61J28K30l09Q6N8Pm39L02Nj10K74j7J48n77L41j24M7J55r
$$ -102 151 308 3 -158 -30 200 -109 -23 35 42 -397 -95 -90 -200 74 57 205 -372 -31 -155 -108 47 38
5021C8mj37J81K2j36K27j69j13J67q1m5j21K32k29R2J26l2j62K74k39j08J57j0
$$ 38 34 -103 78 100 -36 191 22 -91 76 -5 -50 -171 61 -168 -76 50 18 -144 130 -109 -217 -60 -70
5044g0L5K4j35J07j39J47M8l0kK09l30K6K42l29K1j0J89o3K38l54K88k26J37j33
$$ -70 -35 -11 -146 -39 -178 -31 17 -13 -15 194 -136 -110 132 -197 -176 -186 3 -60 178 -176 112 -114 23 -110
5068a10R5K26l42K64j46P7k06j16K90J34j68O6l2J42j60J50k17J26k19m6O13l49
$$ -110 -15 211 -131 133 -13 64 -142 -258 32 166 -2 64 32 174 14 164 -53 73 -146 -192 421 72
5090G2l08M69l83J46J10M2j8J2j1o3j51Q9p2R7M6J69k01m7O4j28J91k53J26j3
$$ 72 -236 233 -150 -4 106 148 130 142 131 68 -83 6 -66 31 77 246 45 -2 62 -66 125 -128 -2 -15
5114a5j28J69k13J30K51k83J27P1j29M9J20k03M08m83Q7J39j03J8J16l91K38j20
$$ -15 -143 26 -187 -57 194 -89 38 109 -20 29 149 -54 354 -129 -42 97 -6 12 128 -263 -25 -145
5136a45P4L97l54j43K5K12J04l31K50j70q1J25n8L10j97K9P2m0j88K58ljm97N4
$$ -145 -71 326 -28 -171 -146 66 170 -161 89 -81 -162 -37 -95 215 18 47 119 79 -109 149 146 145 -352 -298
5160b98K68K86n09L51P7k6l89J1M83j72j10j34K84k9l3J4j59J23K28k68j33r1
$$ -298 -30 256 -253 98 175 149 -240 -229 254 82 -28 -162 122 93 60 74 -85 38 266 -2 -135 -226
5182b26L97J4j46j49J71l17K01N1k26K04q8J27m1r0J9P4J28j5j25j83J56R1k4
$$ -226 171 185 39 -110 61 -256 -55 -4 -230 -26 -114 13 -28 -118 -99 -25 103 88 -37 -220 -64 27 3
5205Cj41k42L97p1L92l90O4J51o8j35o2J36P3o6J57j40j77r4K70j98j5K55k92
$$ 3 -138 -380 17 -54 338 -52 12 163 95 -40 -102 34 107 41 198 58 -119 -213 57 -141 -156 99 -193
5228a93K30r7L03l96K37j84P8j08k05L35k1O0j79P6j3j28m6K21k68K44l2J58M9
$$ -193 37 -60 243 -153 84 -100 -22 -130 -335 0 -21 39 -140 -64 -77 -205 -251 -30 -298 -54 -86 72 121
5251A21N1j37j9J8p4J86k45J44j58j1L34j93Q0J0l2j10J73p4l25J68L02l77%N32
$$ 121 172 35 16 34 -40 146 -99 45 -113 -124 210 17 97 107 75 -35 138 64 -261 -93 209 -168 -168 364
5275C64k15m0q9r5J11j47M1j36O44m59jJ82l34J88K7p0J25o8j19K12j02q1m3L2
$$ 364 149 109 20 -75 36 -111 -70 -206 438 -21 -22 160 -174 14 41 -29 96 28 -91 121 19 -62 -105 -73
5299g3L69m18O03p34J88M1Qj64j8l6L75j92N4K2j72K30o4P5l67L09j3j6Nl28L00
$$ -73 296 -122 481 -253 -65 -24 -16 -180 -198 -234 141 -51 3 25 -147 83 19 94 -273 36 23 7 12 -316 -16
5324a6Q4l42M23L8j08j9j23J52j08j90L01j37r9Q5J46j69k3J96k44J8N7J5K56
$$ -16 68 -274 149 187 79 60 -63 89 -19 -209 92 -45 -144 -59 87 -82 -105 91 -153 -135 -78 -63 193
5347A93k50L03mk62n9P1M9k96K62M0k20J50j7k02K33j33M32j73p6j67M15o6l38
$$ 193 -57 246 242 -20 -79 -8 41 -255 7 47 -173 -23 -40 -242 -9 -142 290 117 41 -126 289 223 -115
5370a15k7M68j79J42l61n2K95j87J31k05K04k61p2L54j81M9K90k17j28J26k00
$$ -115 -142 326 147 289 -72 -124 171 -16 115 -90 114 -147 -219 135 -46 3 293 76 -52 74 -126
5391a26K64l01mJ75j43K05O2P5k94L07j75q3K36q9k24K69l69J89K46q1k28j24
$$ -126 138 -163 -167 8 -135 70 132 207 -87 220 45 -38 198 109 -115 154 -215 -26 220 139 -89 -213
5413b13M12j82J74k14j17L55m36M15k63mq3k3L41J9k99O3K81k38k2p5Q4M0k43
$$ -213 199 17 191 -23 -140 215 -221 194 -69 -73 -156 -179 162 181 -118 -55 226 -12 -34 -109 -25 15 -228
5436b28L8K19k13N02l67L5n3K74k97N3J74ll99Q2L14k48J08J01j72J36p1L25j8
$$ -228 -190 29 -184 318 -49 -14 -67 207 -90 -37 137 134 -265 -183 131 -117 -9 92 -80 56 -15 310 292
5459B92k95j38K23j21lJ04J19j63k12K34j39J34k2J62l44L70l06M1O7OP0k31K85
$$ 292 -3 -141 82 -39 -42 62 181 18 -194 40 -99 35 13 175 -169 201 -105 -64 3 9 79 -152 133
5482A33q8j32J55J25p5j28P0M13m02K4o3n1J75j82M9rJ5j80P6p9J14N2q0J9L31
$$ 133 45 -87 68 193 118 -10 60 473 71 95 32 -19 156 -26 23 14 29 -151 -75 -154 -40 12 -68 -49 282
5507B82j30J59j34k20K11l28N4K00m55M19j54K01J25n56N02r8r5J19K2m81M28
$$ 282 152 311 177 -43 168 -160 -106 94 -361 58 -96 105 230 -326 176 78 -17 102 124 -357 71
5528G1j67N6n9J74r2J1O4j08J50k17K65j4k66K56j18j68J53Q3m3k31mM10l38L51
$$ 71 -96 -40 -99 75 -17 -6 58 -50 100 -117 148 134 -132 124 6 -162 -9 74 31 -200 -204 206 -132 219
5552B19j17o8J19j92l42K83L0Q6k50P9K57j04J03l98L74j33j5J50j70J19N2p3
$$ 219 102 34 153 -39 -381 -98 -68 18 -232 -153 104 0 103 -295 79 -54 -69 81 -89 30 82 9
5574Ik7N1P6l8l2Q4l41J58J04r0K38k22R7l8J50k75J57j47p5K56J5k76K36J5N0
$$ 9 -18 33 109 71 39 123 -218 -60 44 -46 192 -30 67 29 179 -96 61 -86 -161 95 110 -166 70 85 135
5599A35j5l07K93P6k35OK8k94L70Q9l01P3r2J80j82r7M27k31O3l4K63l30K10k1
$$ 135 120 -187 106 182 -53 -47 -19 -313 57 146 -155 -82 -174 6 -176 -273 154 -77 -14 -48 215 -115 95 74
5623G4K3j24K8j70J99J46l27L47K2j85L3j9Rl6J81l59K24o3j1j02k4L85l20k5
$$ 74 97 -27 1 -169 30 176 -151 196 218 33 66 47 56 20 201 -158 66 3 -8 -110 -134 251 -69 -94
5647i4J32J08l45L89l45P8k6K73k31m4J46rj67J48n3k24J51L95l86m16N42Rr9
$$ -94 38 146 -199 190 -155 -77 -103 170 -61 -105 41 32 -135 13 -40 -264 -113 282 -104 -520 22 31 -68
5670f8K58p5J16j74o7j6J98k25J13J78p3m95K73j91J83K31r1j87j47P0L21j09
$$ -68 190 115 231 57 -10 -26 172 -53 60 238 165 -330 -57 -248 -65 166 75 -112 -259 -189 132 23
5692B3J13J0p7P4j68J92o1j74n3J76n5K73k24J42m71L83j52j6l8N9j9o1K9J32
$$ 23 136 146 69 143 -25 167 106 -68 -121 55 0 273 49 191 -280 103 -49 -65 -103 -44 -63 -124 -95 37
5716C7J59q8j90R9j10L37l71j6N66l96j40K67j94J94J5l42M0R7l11M58J67l17
$$ 37 196 108 -82 17 -93 244 -127 -143 423 27 -113 154 -40 154 169 -173 -133 -36 -347 111 278 -39
5738c9o8K86j59k70K71L05m42k9O4N9j52K34mj49OJ9K88k0m06lL82p3j13j33j
$$ -39 -107 179 20 -250 21 326 -116 -145 -81 -22 -174 60 56 -93 -87 -68 220 200 -206 -209 173 100 -13 -146 -147
5763a47J6J90j05L3j85L38N9j60j02J15k40J34m2r2K72k80K40j33K07j24l0J10
$$ -147 -131 59 -46 -13 -198 140 199 39 -63 52 -188 -54 -96 -188 84 -196 44 -89 118 -6 -36 74
5785G4K7J4N9q0k49R2N5j09M4L21l18J53n2%p5QJ0k6R0N7j28p9J93k20L45l20
$$ 74 101 115 174 94 -155 -63 -8 -117 -73 248 -70 83 31 31 -44 -36 -26 -52 38 95 -33 -112 81 -139 206 -114
5811a14L29j00l03m0K30J11l25J00L27m39O3J65J9j9k33r4N11j06J1j03R4k10
$$ -114 215 115 -188 -228 2 113 -212 -112 215 -224 -161 4 23 4 -229 -323 188 82 93 -10 84 -126
5833a26K37Jn5K76n64L98n19K35R8J21l74K74J14Q6j71PJm0rm6l4J98k58K06J5
$$ -126 111 112 57 333 -231 167 -352 -117 -19 102 -272 2 116 202 31 38 39 -1 -10 -56 -90 108 -150 56 71
5858G1J61k04K9M8o1n8J4l7k4P7j28n5K19n6K33k04L38j77kk26J09j04N6j02j40
$$ 71 232 28 57 105 44 -14 0 -37 -61 16 -112 -167 52 -4 229 25 363 186 184 -42 67 -37 19 -83 -223
5883b23M62p9m8k27K54j6l84Q1k3K29qK8k83K22JJ91Ok13n5J27j08J61qpr2ol0
$$ -223 239 160 112 -115 139 123 -261 -180 -203 26 18 46 -237 -15 -14 177 183 -30 -85 42 -66 95 87 80 -12 -18 -48
5910d8O8j94K06J03R7l96L0J95Pj80J99l0j74J11N1j42m2K29m9r6N0J6m0qN6j14
$$ -48 20 -174 32 135 232 -164 -134 61 68 -112 87 57 -117 -6 45 -97 -139 90 41 -55 -5 11 -29 -37 19 -95
5936i5J26O1J2o8j77L97l67L8M4J31k69K01q6K1J99j86j6N5L12k37l99P7K82k44
$$ -95 31 92 104 36 -141 256 -111 -73 -29 102 -167 34 -52 -31 168 -18 -34 21 333 96 -303 -226 56 -188
5960a88K85q0m69N13j28o8L5J54j03M50k36l68J40J50k74K97J8n8j69K7L4N1o4
$$ -188 97 17 -452 61 -67 -135 -100 54 -49 401 165 -203 -63 87 -187 110 128 70 -99 -72 -38 13 -51
5983e1m7J58j14k44L73J00j26m1k6J52k17j50J61R3J92m95M27k65j18M08m92M53
$$ -51 -98 60 -54 -298 75 175 49 8 -18 134 -83 -233 -72 21 213 -282 145 -120 -238 170 -322 131
6005A31n3L0j77k94J31K15M5n9j98K29j10K86j95J9K09k15r4R1J89p4n4M0j18
$$ 131 78 108 -69 -363 -232 -17 28 -31 -229 0 -110 176 -19 0 209 -6 -100 -9 180 106 52 92 -26
6028b6j16J08J16j70r1K1K23k85L73j92o3j21K51n0j01K22J75m80N48l81J44j65
$$ -26 -142 -34 82 -88 -179 -158 65 -220 153 -39 -102 -223 28 -22 -123 99 274 -206 342 -39 105 -60
6050f0L6N4rK52l54J36j13J39K5q9k6j4j00K56l30K76J69l69K55j13o1J53j68
$$ -60 -24 30 21 273 -81 55 -58 81 106 17 -9 -23 -123 133 -197 79 248 -121 134 21 -40 113 -55
6073e5p9J19J53l7l68L18J41j72k7k41K27j79J96j04L16j75j30K09k62Q2J4j13
$$ -55 -134 -15 138 101 -267 51 192 20 -7 -248 -21 -200 -4 -108 208 33 -97 112 -150 -68 -54 -167
6095a67n0L19j25m3K11j53L6j66K2K14J0j08O3p3R0m0J9j55K33J73m44J41q9J07
$$ -167 -217 102 -23 -66 145 -8 28 -138 -116 98 108 0 63 -10 80 40 59 -96 137 310 -134 7 -82 25
6119B5l07O44k57k4j04l6K66j17k54O0K29R6m79J74K24J1j87R9Q4q8j8j25K48
$$ 25 -282 362 105 81 -23 -59 207 90 -164 -104 125 221 -258 -84 140 151 -36 63 147 59 41 -84 164
6142A64k52j19J79J91k74J72J26k35J48Qr4J95J40l89M5J18j92P7J03k13K23j58
$$ 164 -88 -207 -28 163 -111 61 187 -48 100 108 14 209 349 -40 5 123 -69 8 111 -102 121 -37
6164c7N8j09J59j18j72L61l21L35j30m1M0k54K01N9P3j62K2K8L0m9M4j19o5L78
$$ -37 21 -88 71 -47 -219 142 -179 156 26 -15 25 -229 -28 31 104 -58 -36 -8 22 -27 17 -102 -167 211
6188B11k86R2j04K43j2k51J51M0J61l09J37j67P6l6K75j44J07l40J61O0J07j83
$$ 211 -75 17 -87 156 144 -107 44 84 245 -64 73 -94 -18 -54 221 77 184 -156 5 65 172 -11
6210a1j23NJ09k11K57j48J08R5k55P5m1K37k09J07K8l18NJ99k9k3K29j7n5j10
$$ -11 -134 -129 -20 -231 26 -122 -14 81 -174 -99 -140 97 -112 -5 23 -295 -290 -91 -120 -143 86 69 14 -96
6234i6j12J97j52K57j18j21M39k64k08K90r9J60N7L2m16J8J8%J53j35K07j17j52
$$ -96 -208 -11 -163 94 -24 -145 294 30 -178 112 13 173 230 262 -154 -136 -118 -118 35 -100 107 -10 -162
6257a62K0l7J81OPj60L25k16jJ26j35J08J77o9k10o1j39nK78j05M69m38n2R5j23
$$ -162 -142 -179 2 8 15 -145 180 -36 -37 89 -46 62 239 170 -40 -101 -240 -245 33 -72 397 -41 -93 2 -121
6282a21L6o1J81K04l83J40kK24l50N6P0L9pj22J59j49q7J47J1J22o9J52J19m95
$$ -121 -85 -146 35 239 -144 -4 -6 218 -132 -76 -6 33 26 -96 63 -86 -173 -26 -15 107 38 190 309 -186
6306a86J31L8m2L62k44J08p8l22L28k1O1m77K73Q2k32M19j74J01k02J89k70K70
$$ -186 -55 -17 -59 303 59 167 89 -233 95 74 135 -342 -69 13 -219 200 26 127 -75 114 -156 114
6328A14k3j23NJ26j78J64j03R9k03J95k44K65j94O9L94m04n2MN2L6j15P2k14K27
$$ 114 91 -32 -27 99 -79 85 -18 81 -122 73 -171 94 -100 -31 363 -41 -93 -89 -37 -1 -116 -44 -258 -31
6352c1J09j7K13k70P1P0r9j61L33l55J08rm2L60k99K93k51j00O4Q5K0j41k02K79
$$ -31 78 61 274 4 75 145 46 -115 218 -137 -29 -38 -80 280 -19 274 23 -77 -13 72 92 -49 -251 28
6376B8j48J92j19J47k06L26j39j86L44k69k1J54j2k26O9M5P4p2J65m4l68L08r0
$$ 28 -120 72 -47 100 -106 220 81 -105 239 -30 -51 103 91 -135 -66 -21 53 -19 146 102 -266 42 -48
6399d8j82pJ26K32j59J99l08M6N62k28k65J09R1r2j14k41M62j06j21M3Rr6J65
$$ -48 -230 -237 -111 121 -38 161 -147 -101 461 233 -32 77 168 76 -38 -279 183 77 -44 -1 8 -88 77
6422G7J3m4q7mL8q8J18L6o9K3L19l44K83j15j78O2R7k17K34l1j62K0%J79k10J13
$$ 77 90 46 -41 -45 -7 -95 23 59 -10 13 332 -12 271 156 -22 40 137 -80 154 123 -39 -19 -19 160 -50 63
6448F3j91j71K21j29K12k33M55n01J40P2J95j36K7J40J6k27N4J2O3J54k89J34
$$ 63 -128 -299 -78 -207 5 -228 227 -274 -134 -62 133 -3 24 164 180 -47 7 19 82 236 -53 81
6470H1k19K77q7j80K15J22M8j11k79J62J98k14k37K25q2J7M5M8L5n9L7K0j03k7
$$ 81 -138 139 52 -128 87 209 257 146 -133 29 227 13 -224 1 -81 -64 -19 29 64 5 42 62 -41 -68
6494f8KJK18j74j8o7K44l39M04l9m8J17j38j74j29L54Q1n66J37K85Rk54K19l78
$$ -68 -66 -65 153 -21 -39 -106 138 -201 203 164 116 233 95 -79 -208 146 227 -339 -202 83 92 -162 57 -321
6518c21L40L7l5P1j77l9J38o4L8j2JN3J38l39jJ12K9K63j44J12m25M13k57K57
$$ -321 19 56 21 92 -85 -124 14 -50 -12 -24 -23 30 168 -171 -172 -60 -31 232 88 200 -225 188 -69 188
6542A88l07N0L0J0j29l0J64k19K60L70l07n2j11k5L3J33l3R1l28K14L7m6K30l24
$$ 188 -119 -69 -39 -29 -158 -188 -24 -243 17 387 80 28 -83 -108 -75 58 25 116 -212 2 39 -7 223 -101
6566a01J00jN6K78m14J80K1j32K37k93k0j03J72J24n9j20L21j98K03l22K19j52
$$ -101 -1 -2 54 332 -82 98 119 -13 224 -69 -89 -192 -20 104 45 -75 246 48 251 -71 148 -4
6588dK07J5j98n0K04j87O9O6lk63K9K22k22L7J52p9j17J44j76K32k84J55l55M74
$$ -4 203 218 20 -30 174 -13 56 122 119 -144 -115 107 -115 -78 74 -5 -122 22 -154 78 -206 -51 -406 68
6612F8Q4k42NN5m9K79q0P3r2k69L48k41K44m94K44J48j23O8j36L06k7Q9k83L1
$$ 68 152 -90 -85 -30 -79 200 120 193 101 -168 180 -61 183 -311 -67 81 -42 26 -110 196 169 258 -25 6
6636Fj97L93N6l83J20k15K73j49O9J30k7j84J05J17j06J40k72R5J12m6K3p7K05
$$ 6 -191 202 258 -125 -5 -220 53 -96 -27 103 76 -108 -3 114 8 148 -124 -29 83 37 60 -17 188
6659A88l40q6J70Q3k22L25j06p8k07M48j35K40l28r9K20j26L3n8ln9K67j49Q7
$$ 188 -152 -238 -68 15 -207 118 12 -66 -273 175 40 280 -48 -147 73 -53 -20 -78 -81 -140 127 -22 65
6682F5j42K56pm07K81J22r5p0o8o6J4J70j13L4K54k89N4J8j30J69q5J71r1K99
$$ 65 -77 179 172 -235 46 168 73 3 -65 -131 -117 53 -60 -26 228 -61 -7 11 -119 50 -35 136 45 344
6706C44m81K14n5rN2j83r6K88L3Q4j28j71J69j60K57j67R5j28Pr9L3N05l70O6
$$ 344 -137 77 22 13 65 -118 -214 74 107 191 63 -108 61 -99 158 -9 86 -42 -35 -134 -101 404 34 100
6730A00L9k05j86K53l60K42j06K2J54K1J66J8J34l32K18j02n0K57l16J28J1j85
$$ 100 139 -66 -252 1 -359 -117 -223 -201 -47 -26 140 158 292 -40 178 76 26 283 -33 95 106 -79
6752g9J61o6j4R4j98L0J18J9j15J44j83J49q0k4l3o6O8K68p5J9P6o3J2l79R7J16
$$ -79 82 16 2 96 -102 -72 46 65 -50 94 -89 60 -20 -44 -77 -143 -75 193 118 137 213 150 162 -217 -120 -4
6778dK23j34J58l25N1J20k42L29l01K0K01j77n8J89l6K08m51K59P1mK9J6l11K82
$$ -4 219 85 243 -82 -31 89 -153 176 -125 -105 96 -81 -139 50 14 222 -229 30 101 97 126 142 -169 113
6802A13J11k81J08J95l82L5K43j82M7J7j74J93l49K02K35j03r5J1l4k1o7L40k92
$$ 113 224 -57 51 246 -136 -101 142 -40 7 24 -150 43 -306 -104 131 28 -67 -56 -90 -111 -178 162 -130
6825a30K64l5j26k7o4J27j23q9k2M5K22j33Q5J12j90K21l63K66J39k03j4J7j35
$$ -130 134 99 -27 -54 -118 9 -114 -203 -225 -180 42 -91 -6 106 -84 137 -226 40 179 -24 -38 -21 -156
6848a56K63J26j22k35J25l35M37K40l91K27J12j94R7R2m08O1J0O7J05j11PQ3m05
$$ -156 107 233 111 -124 1 -334 103 343 -48 179 291 97 194 286 -122 -61 -51 16 121 10 17 100 -305
6871c05M37m30K49K37l33M1j21K91k71M0J86k21L27j2j80l6K06k35l3J53K7j16
$$ -305 132 -298 -49 188 -145 -104 -225 66 -205 -165 21 -200 127 115 -65 -101 105 -130 -163 -10 17 -99
6893i9R6m8J16k1l5m8k0N3r7j31N22m53M69k17j69Qj3j11l1L19L5j02Q9l47L21
$$ -99 -3 -51 65 44 9 -39 -59 -6 -103 -234 288 -165 304 87 -82 -74 -87 -198 -229 90 125 23 112 -235 86
6918H6j63Q3j55L86n3q9J9r0M5j65P2Pjm0J48o2j19K00Q1k50m7J74k28K43j67
$$ 86 -77 6 -149 237 184 95 114 24 69 -96 -24 -17 -18 -58 90 28 -91 109 190 -60 -107 67 -161 82 -85
6943h5J40Q2rq5om1J11k14J48j23J04k40J75M9p1j31O0L38m23K82k41L07l13K11
$$ -85 55 137 128 43 37 -4 107 -107 41 -82 22 -218 -43 6 -65 -196 -136 202 -221 61 -180 127 -186 25
6967B5l8J2k40J55K17j73j04L21l94L36L3%k38J92j96K9k23K10K07q8j32j23K91
$$ 25 -13 -1 -241 -86 131 -42 -146 175 -219 117 150 150 -88 104 -92 -63 -286 -76 131 43 -89 -212 79
6990G9M1j31O9O4O7k5j45J0k20K27p7K74j70J96j05p2k54J95K37l45R8n0M9L64
$$ 79 120 -11 58 122 189 164 19 29 -191 36 -41 233 63 259 154 82 -172 23 260 -85 13 -37 12 376
7014C76k24j74L57k69p6r2K56j5l72K23Q6j6j83J54J3K20k46q8k13J18J99P8J6
$$ 376 152 -22 335 66 -10 -102 154 139 -233 -10 76 60 -123 31 44 264 18 -70 -283 -165 34 112 128
7037A28k08K00l7k14K10j78J71k23K66L3o4M4n7k35L8o6p9m0J65K53r0j79J4K7
$$ 128 -80 120 83 -131 79 -99 72 -151 115 148 84 128 71 -164 -126 -192 -271 -311 -146 107 17 -162 -148 -121
7061a21r0L03q4k02J44j55j6L53q2J1k3j38J57K62n78K69k1mR6l4m24O45l43P9
$$ -121 -211 92 8 -194 -50 -205 -221 132 50 61 38 -100 57 319 -259 10 -11 -15 81 47 -377 268 -75 4
7085DJ20k75J41l2l2L06l11M9j28O2K66M3p4m2k70J38K3l8N5m26M10L8J20k24
$$ 4 124 -151 -10 -42 -74 232 -79 -30 -158 -96 170 213 139 97 -173 -35 -12 -50 5 -421 -11 27 147 -77
7109g7m2J19J33r5k95K06J93k73K96J1k17o6Jj69L30m1MN2R7k71M83l79j3J19
$$ -77 -119 0 133 38 -257 -51 142 -131 165 176 -41 -107 -106 -275 55 14 18 70 167 -104 379 0 -13 106
7133A06l01Q4K61j40j63pK92l07J14m7J15p7l1J47k54J10J10M3j30Q9k15M4Q8
$$ 106 -195 -111 150 10 -153 -160 132 -175 -61 -108 7 -70 -101 46 -208 -98 12 55 -75 14 -201 -157 -69
7156f9K96m25Q7K43M6j97L10r1k59K72j52N6j67J22k1k55K56p4O3P5q1K9O3K4
$$ -69 227 -198 -111 132 178 -19 291 200 -59 213 61 117 -50 72 51 -204 52 -22 41 116 35 64 127 151
7180A51J91m81K69Mm29K27O2j18J2J00J82k56J5R7J74l01M5n2J94j32l2j16L85
$$ 151 342 -139 130 134 -295 -68 -6 -124 -112 -12 170 -86 -71 26 200 -101 -56 -108 86 -46 -78 -194 191
7203A91J23j73j86J78m62K39K78p7k85J70p5J22j54n5M07r8j42M9J60l17k67L28
$$ 191 314 141 -45 133 -329 -90 188 111 -174 -4 -79 43 -111 -166 241 143 1 50 210 -107 -374 -46
7225d6K63j94k21K11k3K9R0j52l1J92j60k36J45L27m32J80k00L93j09J20k03O1
$$ -46 217 23 -198 13 -10 19 109 -43 -74 118 -42 -278 -133 194 -238 -58 -258 135 26 146 -57 4
7247DQ2j79M01l75R0L8q1q3k55J83n2J40J3J34n2q1j54K79J46o7n1J07j91N9j18
$$ 4 86 -93 308 -67 23 61 -20 -103 -358 -175 -227 -87 -74 60 8 -73 -227 52 198 131 80 187 -4 55 -63
7272f3J36j28J46l22j7L98k18J02j55L21k12J34J3n0R4j43P6J70j61l09K06k2
$$ -63 73 -55 91 -231 -248 150 -68 34 -121 200 -12 122 135 85 179 36 112 282 121 -188 18 -4
7294dj3Q7j03J61j58O3l09K94j8K2m3l09M60j89M8o0pK3j5L28j91J94j3o4o5l5
$$ -4 -17 70 -33 128 -30 33 -276 18 0 22 -21 -330 130 -59 -11 -71 -78 -55 -70 258 67 261 248 184 119 84
7320H4O6l20K20l06M11k13j99J61J5p3J79j87J70o2P3J35k19j35K32K62Jl41q2
$$ 84 150 -170 50 -256 155 -58 -257 -96 -81 -154 25 -162 8 -54 19 154 -65 -200 32 294 295 -46 -128
7343a28R8J04%l45J16J76M6j23j38J85p1K09k12J92j91k17N27n5j51j34r6J43
$$ -128 -30 74 74 -271 -155 21 67 -56 -194 -9 -80 129 -83 109 -82 -299 228 173 22 -112 -208 -65
7365f5pL8j8j21L14j59j97Q2nJ07K94l00J85Pj75KO7kJ37j74J20j49m9oL47k83
$$ -65 -72 -34 -52 -173 141 -18 -215 -133 -138 -31 263 -37 148 155 -20 -18 49 47 184 10 130 -19 -68 -74 273 -10
7391a0J1KJ4r7L2N7j74j1N0N7n8O3L9J83r2n4q8K74k41J23j45M18k28k36M07k67
$$ -10 1 3 17 -80 -48 9 -165 -176 -126 -69 -127 -64 -25 158 66 12 -76 198 -43 80 -65 353 125 -111 296 29
7417B9p0J15M9j10j38K78l8l09j31K13j22p6M97N8j02k09J33J06k78K21j54O0
$$ 29 -41 74 123 13 -125 153 115 -194 -325 -112 -234 -310 187 245 143 -66 67 173 -105 116 -38 22
7439B2Q2l19M70n2k81j80K77q2mK14j85J76j16N4j69J63j55J87j56N0K24j45Q7
$$ 22 104 -215 255 203 -78 -258 19 -63 -67 147 -38 138 22 76 -93 70 -85 102 -54 -4 220 75 162
7462A62k13J07J01k61J19n4OJ43Q1m14K14O7j18qQ8m9J48J9j49J18k78K46n5J12
$$ 162 -51 56 157 -104 15 -39 -33 110 191 -223 -9 58 -60 -68 20 -29 119 138 -11 107 -171 75 20 132
7486A32k50N5K48k2j91J0p0m3J21K73k73K28k60R4J16j85j2J84R2m83L31k78L37
$$ 132 -118 -63 185 163 -28 -18 -88 -131 -10 263 -10 218 -42 52 168 -17 -29 155 247 -236 95 -183 154
7509A54j28O0j19M09l84k02J95J59k28J90j14j58M0o3K43r8N6J16j47k27K86n2
$$ 154 26 86 -33 376 -8 -210 -15 144 -84 106 -8 -166 -126 -189 54 -44 12 128 -19 -246 40 -12
7531a2J77r6L2o8q3N4j05r9R1K95j17j93j26p4K89J50k5kk5l29L48q4J12p6O1
$$ -12 165 69 101 33 -50 4 -101 -200 -109 186 69 -124 -250 -324 -35 115 90 88 63 -266 82 -2 110 34 95
7556I5k57J36j41M2R0N0p8P5r8J58J97k21qj9j24P3L3j2j22K73j75J23k44M01
$$ 95 -162 -26 -167 -125 -35 15 -63 12 -86 72 269 48 40 21 -103 -30 3 -9 -131 142 -33 90 -154 247
7580B47l59J6J68k72K32n8p0O4m3J30k05j87M16k0rk50K70J34j59k43J49OJ72
$$ 247 -112 -96 72 -200 32 -26 -96 -32 -75 55 -150 -337 79 59 50 -200 70 204 45 -198 -49 -43 129
7603A29k23J32k4J76k85k9J91j02n0J79k36L06M9l34j1J31j54J60r3J67j53K9
$$ 129 -94 38 14 190 -95 -124 67 -35 -85 94 -142 164 213 -121 -132 -1 -155 5 -88 79 -74 -45
7625d5p1R0j30P0Q4k14K84j46O3j2m0j60L48q5k96L75k10J71j38j98J98L27J19
$$ -45 -116 -26 -156 -86 -2 -216 68 -78 -15 -27 -67 -227 121 36 -260 115 -95 76 -62 -260 -62 265 384
7648C84nl69l2K45j78j58R1M08l59M8j0KJ2M7k47J39K10l37L62k08o5j07L81l11
$$ 384 379 10 -22 223 45 -113 -22 386 27 75 65 67 79 126 -121 18 228 -109 253 45 -20 -127 254 -57
7672e7J76j12K21j30j96j31N09j66j03j7J69l25K25J4j13J77J9k05k31L79j29
$$ -57 119 7 228 98 -98 -229 280 114 11 -6 163 -162 63 77 -36 141 160 -45 -276 103 -26
7693b6K8k7J82j52J75l14O1R8j35J4J43J00k89L31m17L66P9l68N1J62O1r5j7k58
$$ -26 2 -25 157 5 180 -134 -73 25 -110 -96 47 147 -142 189 -228 138 217 -151 -100 62 123 28 11 -247
7717b47M29j40j49rJ79J12k09j31N04k29J39l68O2J17J33k07j01N7J22p6O5j92
$$ -247 182 42 -107 -116 63 175 -34 -165 339 110 249 -119 -57 60 193 -14 -115 -58 64 -12 53 -139
7739a39K51j86p0M8n2L85P7l09m4N0n5J55N9j19j64J54o3k3J09N4j6k00K92j66
$$ -139 112 -74 -144 -96 -148 237 314 5 -39 11 -44 111 170 51 -113 41 -22 -45 64 118 102 -98 194 28
7763B8P7k63J00kP7oj21N6O0P4k67N0K1l5l0J87o1J00J04j51j94nOK27k32K06
$$ 28 105 -158 -58 -60 17 11 -110 -54 6 80 -187 -137 -116 -151 -181 6 -55 45 149 -2 -196 -201 -195 32 -200 6
7789Fj25k7N4J38k11J75j32J5j1M11j21j57nj70J14M0k3j19J18o5J57j15Q5P4
$$ 6 -119 -146 -92 46 -165 10 -122 -107 -118 293 172 15 10 -160 -46 -6 -29 -148 -30 -95 62 -53 32 106
7813A06k43J31P4J0Q3j25q3J29Q4j66J41q0l35J57p7l4K42j55L17j47j32J15K64
$$ 106 -137 -6 68 78 161 36 -47 82 166 0 141 61 -274 -117 -194 -228 14 -141 176 29 -103 12 276
7836B76l20m9J09K5pm1K82j20j55q7j32J75o0Ql3J47J24Qj27K6r9R6L7L7l28K12
$$ 276 -44 -93 16 41 34 -7 275 155 0 -87 -219 -44 -104 -96 -129 18 142 150 23 49 -50 46 83 120 -208 4
7862Dj13K29Njk80J18p8j85N58m44J28l8L26N0m25j20J70j96J85n2J16P4j72K50
$$ 4 -109 120 125 124 -156 -38 -116 -301 257 -187 -59 -97 229 279 -146 -266 -96 -292 -107 -159 -43 31 -141 109
7886A09J3n3p1j61J79M6j49K27l74J01K42k17K83j13L8j8j20N4N8J2l82L09K66
$$ 109 122 69 -2 -163 16 62 -87 140 -234 -133 109 -108 175 62 100 82 -38 16 74 86 -296 13 279
7909B79k25R7k43K52l30J67j52K88j23n7OJ66j18K18m38J39m2J05J07n11L73j80
$$ 279 54 151 -92 160 -170 -3 -155 133 10 -47 -41 125 7 225 -213 -74 -116 -11 96 -415 -42 -222
7931b22L74j72M1l6r8l77M33LJ25K14j45k97O2J70k9NN9k05J44k70L35k04J72
$$ -222 152 -20 21 -15 -113 -490 -57 -54 71 285 140 -157 -95 75 46 51 110 -95 49 -221 114 -90 82
7954H2m4Q5k09n1m4J09J92k27J57k20L51k70L51j84k90K32k1K47j35j96J5jJ04
$$ 82 38 123 -86 -137 -181 -72 120 -107 50 -170 181 -89 262 78 -212 20 -1 246 111 -85 -70 -71 33
7977C3O8l21K58M5j17L7K25j59j56N4J33M2m06L89K4p0k08K72L6j50Kk06K73m9
$$ 33 101 -220 38 83 -34 3 228 69 -87 -33 100 142 -264 125 149 79 -129 143 179 29 31 -175 98 49
8001D9nJ48l44j45K68K79k76K39l05k46L92o5P8P8l46K47j97J32j01k2R5Q6k80
$$ 49 44 192 -152 -297 -29 250 -26 213 -92 -338 54 -11 67 145 -201 46 -151 -19 -120 -142 -47 39 -241
8024b41L26k13L0k2K54p6J74k91J69m50N79j56J16l73N11m25M4J82P9L6p5j57
$$ -241 85 -128 -98 -120 134 58 232 -59 110 -340 239 83 199 -174 337 -88 -44 138 217 253 178 21
8046B1J68j34j41K16l58K16j54J40j7lR2o1m1R1J69k85L31R8m75L80k57j08J8
$$ 21 189 55 -86 130 -228 -12 -166 -26 -43 -46 46 -15 -56 35 204 -81 250 348 -127 253 -4 -112 -94
8069i4j4J60M0j51L4N1l5j56m7J62J90L9k88K53J54l88K41O2m1Lk73N0P9o9l5
$$ -94 -108 52 92 -59 -25 26 -9 -165 -212 -50 140 179 -109 144 298 -90 151 213 172 175 -98 -48 31 -38 -73
8094g3J06J33l47P2M43m00j1M0K81j90n49N51K66k84k32L44k1j22L2j5q8J32l20
$$ -73 33 166 -181 -109 334 -66 -77 -37 244 54 -495 56 322 38 -194 150 129 7 39 24 -64 68 -252
8117b52M54kq1K6l68L73O4k30r1Q7J45j93J24k4q4N7K71K5n50j71M84o2j92K50
$$ -252 202 200 119 145 -223 150 214 -16 -107 -20 125 -68 56 32 -52 5 276 301 -249 -420 64 2 -190 60
8141F0j5j68J01K94l48L69n53K38n7K47K74m26O1J11k38j10K67j22J02k51K18
$$ 60 45 -123 -22 272 -76 293 -260 -22 -79 168 442 16 77 188 -50 -160 107 -15 87 -164 54
8162E4J1j19k8R1j73K20O0j78K90l1l13K56n6j65j47O8K29M6j4l7L4J98k13q2
$$ 54 65 -54 -82 9 -164 56 116 -62 228 197 -116 140 84 -81 -228 -160 69 115 101 64 98 296 83 1
8186AM6O2l17M19M9
$$ 1 47 109 -208 211 260
8191B60
$$ Imaginary data points
##PAGE= N=2
##DATA TABLE= (X++(I..I)), XYDATA
0@%%%%%%%%%%Qj6J6j6K4l2L2m0N6o4P2q8J10j34J56j80K08k44K84l26L74m28M87
$$ 0 0 0 0 0 0 0 0 0 0 0 8 -8 8 -8 16 -16 16 -24 32 -32 40 -48 62 -72 84 -96 112 -132 152 -174 200 -228 259
33B59n52O24p03P89q86R91j107J235j372J523j687J868k066K279k513K772l055
$$ 259 -293 331 -372 417 -469 522 -585 650 -722 801 -886 982 -1084 1195 -1318 1454 -1601
50a601L364l706M086m506M975n503O099o782P574q499R598j0932J2593j4725J7577
$$ -1601 1763 -1943 2143 -2363 2612 -2891 3208 -3574 4000 -4499 5099 -5833 6760 -7965 9612
65I612k1612K7798l8593O2828k18001L2936L10568j75764n5917j104J0885J10833
$$ 9612 -12000 15798 -22795 40033 -177968 -145032 165536 -10228 -66145 -67249 -56364 54469
77E4469J19357j71117r3902J55051P8972j27453l4346O593j8319N7896L6215j33067
$$ 54469 173826 2709 -91193 63858 142830 15377 -18969 -12376 -30695 27201 63416 -69651
89f9651l3818J21924K6780q8536l4386J4983O5048O3949m9419q4649N9688R4176
$$ -69651 -103469 18455 45235 -43301 -77687 -62704 2344 66293 16874 -67775 -8087 86089
101H6089k7519n5793J0068P235O702P142n7013m4056N3685J9603n1663m13L1095
$$ 86089 58570 2777 12845 20080 26782 33924 -23089 -67145 -13460 6143 -45520 -45933 -14838
114a4838L81K2459K4472l1425j2750N2901J8826m5848j8353J6282o308o283J958
$$ -14838 -14457 8002 32474 1049 -11701 41200 60026 14178 -4175 12107 5799 -484 1474
127A474k1247r126K4230M938j9799l577J6599J2641o224r958J0253J4365J923
$$ 1474 -19773 -28899 -4669 269 -19530 -23107 -6508 6133 -91 -10049 204 14569 16492
140A6492k447o133l640R982Q732j4038j7182L450L920j3340k992P202q722L25
$$ 16492 14045 7912 4272 14254 22986 8948 -8234 -4784 -864 -14204 -17196 -9994 -18716 -18391
154a8391J8024j681m424J7624N739r610N125N922r360j407L318j4409j2579J0826
$$ -18391 -367 -2048 -6472 11152 16891 7281 12406 18328 8968 7561 10879 -3530 -16109 -5283
168e283K620j3065L391O940n641O135Q804n558L677J0549n055m511P827m8p587
$$ -5283 -2663 -15728 -12337 -5397 -11038 -4903 3901 -1657 2020 12569 7514 3003 10830 10782 3195
183C195P63K0p917o16N056q600n454P703j969l558J0401K014n410Q168O817m665
$$ 3195 3958 3978 -3939 -4555 501 -8099 -13553 -5850 -7819 -11377 -976 1038 -4372 3796 10613 5948
199E948J742M870m304n119J819k436q281J287J172q492Q71P706l348o79P486O2
$$ 5948 7690 12560 8256 3137 4956 2520 -5761 -4474 -3302 -11794 -10923 -3217 -6565 -7244 242 304
215C04p57O375K049l363M61L229k589l930K417j340o610R09O33n900P44L367l209
$$ 304 -453 5922 7971 4608 5069 8298 5709 1779 4196 2856 -3754 -2845 -2212 -8112 -7368 -4001 -7210
232g210m9M709J704P33K874L014N20j52K577p78l868m22k171m368r32p42l163
$$ -7210 -7259 -2550 -846 -113 2761 5775 6295 6143 8720 7942 4074 3652 1481 -2887 -3819 -4561 -7724
249g724L20R04Q23J966J743K535J904L74J679P12o17J58j246j328Oj758j144N6
$$ -7724 -7404 -6500 -5677 -3711 -1968 567 2471 2845 4524 5236 4619 4777 3531 2203 2209 451 -693 -637
267f37j751j189N71j190J60J160l24N08J380J891Q62M20K135J583j933P23N37
$$ -637 -2388 -3577 -3006 -4196 -4036 -2876 -3200 -2692 -1312 579 1441 1861 3996 5579 3646 4369 4906
284D906l023j290n32k870j520O22p08q54J031K486P25L44K866J450j360J280Q07
$$ 4906 1883 593 61 -2809 -4329 -3707 -4415 -5269 -4238 -1752 -1027 -683 2183 3633 2273 3553 4360
301D360k440j91m04j672o56L1o54m42K75R27J02n01P53L35m48O81N00l67P28p8
$$ 4360 1920 1729 1325 -347 -1003 -972 -1626 -2068 -1793 -866 -764 -1265 -512 -177 -625 56 556 189 917 839
321H39L11O15m46J28M2j178l23k8j618l27N24m17K18L27J103M94n3J297M51q13
$$ 839 1150 1765 1319 1447 1489 311 -12 -40 -1658 -1985 -1461 -1878 -1660 -1333 -230 264 211 1508 1959 1146
341A146P47k74j685O7j21j536M2O82k25j43M63J176m2J94J084r6n56j43J95j246
$$ 1146 1893 1619 -66 1 -120 -1656 -1614 -932 -1157 -1300 -837 339 297 491 1575 1479 923 780 975 -271
361b71M86p49j51L16m84M31j73l1M13J67p24O60M55l21J07K45L64j03k21P63m88
$$ -271 215 -534 -685 -369 -853 -422 -595 -626 -213 -46 -770 -110 345 24 131 376 740 637 416 1179 691
382F91p79N13l97q14J81l49p19N07M80Q7P8M90Q67k11M51N18j77n27L25p02n52
$$ 691 -88 425 28 -786 -605 -954 -1673 -1166 -686 -599 -521 -31 836 625 1076 1594 1417 890 1215 513 -39
403c9mn42o51N7j49M12k09L60Q41J52k37Q39j3rK87o08Q0O7m28k7l48M7l13k79
$$ -39 -43 -585 -1236 -1179 -1328 -916 -1125 -765 76 228 -9 830 817 808 1095 487 567 634 206 179 -169 -122 -435 -714
427g14l97M04J25n00N81K31p8M71O1L91j39K24Q22n52o5K8q00j41j13m15k18P1
$$ -714 -1111 -707 -582 -1082 -501 -270 -348 123 184 575 436 660 1482 930 865 893 93 -48 -161 -576 -794 -723
449g23L5j47K05R0M57j02J52P81j63O0L61m87K01l76J2P9o52j04J20k39l83J078
$$ -723 -688 -835 -630 -540 -83 -185 -33 748 585 645 1006 519 720 344 356 435 -217 -321 -201 -440 -823 255
471B55o12k86N66K82m49J15L95m1Q5J38k6k90j9N07o88J05L15k62n50M12o3o8
$$ 255 -357 -643 -77 205 -244 -129 266 225 310 448 422 132 113 620 -68 37 352 90 -460 -48 -111 -179
493a79q1L07j15p2M09j42n3j36L88m30J29K45l75K35K2l14K98k25l76N66j76m62
$$ -179 -260 47 -68 -140 269 127 74 -62 326 -104 25 270 -105 130 152 -162 136 -89 -465 101 -75 -537
515e37N59r7L8r1J79m9j91L39ok68o2O29j96m65M68J3k41m5L6j10J66L3o3l90
$$ -537 22 -75 -37 -128 51 2 -189 150 144 -124 -186 443 247 -218 250 263 22 -23 13 -97 69 102 39 -351
539c51Q0J52J02l96N06l38N1K98J6j32J4M25l71O8k84K37o4j39K15k72rK6K04
$$ -351 -271 -119 -17 -413 93 -245 -194 104 120 -12 2 427 56 124 -160 77 13 -126 89 -183 -192 -166 38
562C8k78O0j58Q3j27M98n8k69M98j33k97K02K34o6k3J9j41J34k87p1k47rK84k95
$$ 38 -240 -180 -338 -255 -382 116 58 -211 287 154 -143 59 293 227 204 223 82 216 -71 -142 -389 -398 -114 -409
586d09L08kN5p6J92J43K53k07M4l07J11j00r0J93L8r1j33p0K7O9r2%k3J49J32
$$ -409 -101 -103 -48 -124 68 211 464 257 301 -6 105 5 -85 108 146 55 -78 -148 -121 -52 -144 -144 -167 -18 114
611A14k23J70l6n3K92j76K1L0j0k7Q4N0j32k43J7J28n0l97L35J11j12q6J4J96
$$ 114 -109 61 25 -28 264 88 109 139 129 102 186 236 104 -139 -122 6 -44 -441 -106 5 -107 -193 -179 17
635A7J5K9J51L4m2O0m12J31J51j36NJ37k29R7j52J3l3M0Q6J40j79O3J41k65J52
$$ 17 32 61 212 246 204 264 -148 -17 134 -2 3 140 -89 8 -144 -131 -164 -124 -38 102 -77 -14 127 -138 14
660A4r9L33l98K69lpQj16j62K72j24J07j8l55M01j16k61K71J57k68L3J22m3j05
$$ 14 -85 248 -150 119 116 109 117 1 -161 111 -13 94 76 -279 122 6 -255 16 173 -95 -62 60 17 -88
684h8J80K7j8k47o9K11j09n7O2L19l72l38N05j42j10n7J74J07j93L09j56K79M0
$$ -88 92 119 101 -146 -215 -4 -113 -170 -108 211 -161 -499 6 -136 -246 -303 -129 -22 -215 94 -62 217 257
707B57m9j56n0K03j88K25k81R0j63N8O3q9J10P5j57J28k76L7L69k91J14k02M68
$$ 257 208 52 2 205 17 242 -39 51 -112 -54 9 -80 30 105 -52 76 -200 -163 206 -85 29 -173 295
730B95j06k00m9K79k41J4q7p7J04l1N7Q8p1M7r3K02k7n5L9r9K71o6r1j25O0Q9
$$ 295 189 -11 -60 219 -22 -8 -95 -172 -68 -99 -42 46 -25 22 -71 131 104 49 88 -11 260 194 103 -22 38 127
756A27j40O1L3k06k3J74j99J04n8J47M8N4l5k50J06N7O0L3M9Q9k36L2J34j89R1
$$ 127 -13 48 81 -125 -148 26 -173 -69 -127 20 68 122 87 -163 -57 0 60 93 142 231 -5 27 161 -28 63
781F3m8k09L10k93L0K8P6n3K30J17m24R6L31j5q0J17p8k22J12n3m8M7J7p7n2o
$$ 63 15 -194 116 -177 -147 -119 -43 -96 134 251 -173 -77 254 239 159 276 198 -24 88 35 -13 34 51 -26 -78 -84
807h4K20l04j71K58J46p9o0l8J69m1l65M20j24J55k05J80J71n03L43m19M92J5
$$ -84 136 -168 -339 -81 65 -14 -74 -112 57 16 -349 71 -53 102 -103 77 248 -255 88 -331 161 176
829A76l45K74r7J22k36L3Kk9K49J09q1p9k98L41l38J91L3K75l33m6K86O8m48K1
$$ 176 -169 105 8 130 -106 -73 -71 -100 149 258 177 98 -200 141 -197 -6 27 302 -31 -77 209 277 -171 -150
853a50J51N5P4k06n5M16q8J44n39K74nJ98o4Q8k95R5q2K5j17M0K9k89K97j84K82
$$ -150 1 56 130 -76 -131 285 197 341 -198 76 71 269 205 293 -2 93 11 36 -81 -41 -12 -301 -4 -188 94
878I4j78N2j87L67k33j48J67J53j88L19l28r5K94j01j55J63n2K38m00K27J13l54
$$ 94 -84 -32 -219 148 -85 -233 -66 87 -101 218 -110 -205 89 -12 -167 -4 -56 182 -218 9 122 -232
900b32J88l6J41on7P2l8k24K53J7K93k97J41j88j42J54j21p5K06p2j62k5J62J05
$$ -232 -44 -80 61 55 -2 70 32 -192 61 78 371 74 215 27 -115 39 -82 -157 49 -23 -185 -210 -48 57
924E7k89L32l13K69m9J11K16l86J31j49P1M6j13K5j98Q3K2J07N8Rj67RK13kj52
$$ 57 -232 100 -213 56 7 118 334 -52 79 -70 1 47 -66 -41 -239 -156 -134 -27 31 40 -127 -118 95 93 -59
949e9J75K9J31l10P6PJ5K89l31o4j07J00J56J2r9j06N8K83k00j53J37J96j3k45
$$ -59 116 145 276 -34 42 49 64 353 22 -42 -149 -49 107 119 20 -86 -28 255 55 -98 39 235 222 -23
973b3k7R5p8J60J48r8j71O5m6j41K22n44O92k88K36j50L0J03k88J18J7M3m7l0
$$ -23 -50 45 -33 127 275 177 6 71 25 -116 106 -438 254 -34 202 52 82 185 -103 15 32 75 28 -2
997bJ26j56j0j32K97J31m27J04K08m1qj77k09M75q8j3l52J99p3K69k10L18k71
$$ -2 124 -32 -42 -174 123 254 -173 -69 139 98 90 -87 -296 179 91 78 -274 -75 -148 121 -89 229 -42
1020d2O7O8j1q8rm28L17N76l38L4k11Qj2J73k43J13J69k36M26n18K29K47k27N8
$$ -42 25 93 82 -6 -15 -443 -126 450 112 146 -65 -57 -69 104 -139 -26 143 -93 333 -185 44 291 64 122
1044A22j53K53N5k72n8m5L6K08Mj53k3j66Q2J3O2j00J85p3N34n87J59j14l2m0
$$ 122 -31 222 277 5 -53 -98 -62 146 150 -3 -26 -192 -110 -97 -35 -135 50 -23 511 -76 83 -31 -63 -103
1068a03j60L87j08p9R3J64m4m6O4m62O25j47j13j13k4R2m9R0l48L51o2R7l5j40
$$ -103 -263 124 16 -63 30 194 150 104 168 -294 331 184 71 -42 -66 26 -23 67 -281 70 8 105 70 -70
1092g0lm5L7k6K01n5j20L0R0K9n9P7l71K52p9L14j85l29N52l12RJ0J84j69J5j8
$$ -70 -73 -118 -81 -107 94 39 -81 -51 39 68 9 86 -285 -33 -112 202 17 -312 240 -72 -63 -53 131 -38 -23 -41
1118d1K06l02J99j17j03J21j41K97Mr0Pj41K36j90j6L0p6R8J22j88k1K2J44J18
$$ -41 165 -137 62 -55 -158 -37 -178 119 123 33 40 -101 135 -55 -71 -41 -117 -19 103 -85 -106 -84 60 178
1142A78q2J44k06K91l74Q0j04j99R5J43Lk22K94r2j57J83K24l49J99k78K56K16
$$ 178 96 240 34 325 -49 31 -73 -272 -177 -34 -31 -253 41 -51 -208 -25 199 -150 49 -229 27 243
1164B43n42K73q5K90l26q2K63p8J74k89j9J67J50k81K13j20q2K84l8m43K52J34
$$ 243 -299 -26 -111 179 -147 -229 34 -44 130 -159 -178 -11 139 -142 71 -49 -131 153 115 -328 -76 58
1186E8k15O8N6l35K08J88l24Q0K90k77M3n8K10J5J82j34K34l41K46k29k26K82
$$ 58 -157 -89 -33 -368 -160 28 -296 -216 74 -203 -160 -218 -8 7 189 55 289 -52 194 -35 -261 21
1208B1q6j42R5j34K22J8j74K32r4M04k83l3k55K69l56K43L09j75O3k35L70k91
$$ 21 -65 -207 -112 -246 -24 -6 -180 52 -42 362 79 46 -209 60 -296 -53 256 81 144 -91 279 -12
1230a2k54L03K5j89K42q1Oj09K03j87L9M3q3K97l01J12l1k16K65j05j75L69K60
$$ -12 -266 37 62 -127 115 34 40 -69 134 -53 -14 29 -54 243 -58 54 23 -193 72 -33 -208 161 421
1253D21n07K25l30J70M2J2o9Q8n6j6r2K62r8j52K30j49J42k47N1J27P9J51k2j88
$$ 421 -86 139 -191 -21 21 33 -36 52 -4 -20 -112 150 52 -100 130 -19 123 -124 -73 54 133 284 262 74
1277G4J95k98J10j42J09pk19K32J23j99J74n7m6n4k20K13J04K05k13j39K19l9
$$ 74 269 -29 81 -61 48 41 -178 54 177 -22 152 95 49 -5 -225 -12 92 297 84 -55 164 125
1299A25j48j53L95j23n33O12j62L06j16J0j06l05L41p9j87j27J78J76j98r5J19
$$ 125 -23 -176 219 96 -437 175 13 319 203 213 107 -198 143 64 -123 -250 -72 104 -94 -189 -70
1320g0L0K3m3K87p9o4l66L80k24J47k31J79Q9j17r6l5L59m35L38n39Q39o2l32
$$ -70 -40 -17 -60 227 148 84 -282 98 -126 21 -210 -31 58 -59 -155 -190 169 -266 72 -467 372 310 -22
1343b2J96l41L29m13L28j71k9J22o2o0K00O6j17Q3k79J18J25j45J13K5Mj15J15
$$ -22 174 -167 162 -251 77 -94 -123 -1 -63 -123 77 143 26 109 -170 -52 73 -72 41 66 70 -45 70
1366G0m4N6k59L6K99k27N1j3m7r8K17J22mj22J1Q8R4k13L3O8j27R6k8m9J86J49
$$ 70 26 82 -177 -141 158 -69 -18 -31 -78 -176 41 163 159 37 48 136 230 17 50 118 -9 87 59 10 196 345
1392C45m47K53N7j48k5k2R7m25J77M06m08J35r5K4o3O6K87m6l29J57J25k05j1
$$ 345 -102 151 208 60 35 13 110 -315 -138 268 -140 -5 -100 -76 -139 -73 214 168 -161 -4 121 -84 -95
1415i5o6L5J50j47P8nm1J03j46M81m05J2J40q9L2Jn0K16l2j75J26k49J21K9M7
$$ -95 -161 -126 24 -123 -45 -50 -91 12 -134 347 -58 -46 94 5 37 38 -12 204 172 -3 123 -126 -5 24 71
1440G1l28L07k5Q9j72J73J54m83L46j12K10n4r5m1j92J41l7L9j6j41J96M0Q4k31
$$ 71 -257 50 25 114 -58 115 269 -214 132 20 230 176 81 40 -152 -11 -48 -9 -25 -166 30 70 154 -77
1464g7J60m05K30L64l81L50L6j28n9l02K76j92k4L6J62J23n0j28K06k91lJ52Q1
$$ -77 83 -322 -92 272 -109 241 277 149 90 -212 64 -128 -152 -116 46 169 119 -9 197 -94 -97 55 136
1487A36J21k82K00j47j34P5K0o8J49N9k44J75L3k63K47K29l99Q1O4j55K21k33
$$ 136 257 -25 175 28 -106 -31 -11 -79 70 129 -115 60 93 -170 77 306 -93 -12 52 -103 118 -115
1509a15J03k49K16Orp7k44K34K90j37Qj09K18J38n1j02K2n4j59o3q0N10k5k61
$$ -115 -12 -261 -45 -39 -48 -125 -369 -135 155 18 26 -83 135 273 222 120 142 88 -71 -134 -214 296 271 10
1533A0q3K26k18K71j40R9q6p0q4K08k92O5O1K54o2o5m5j61L06j42j91J33JJ34
$$ 10 -73 153 -65 206 66 165 79 9 -75 133 -159 -94 -33 221 159 94 49 -112 194 52 -139 -6 -5 129
1557A29k20q6J47k8M4k6q5J84j73J55k4n1k03K23K29k12L5m4k77J72J72n3j11
$$ 129 -91 -177 -30 -58 -14 -40 -125 59 -114 41 17 -34 -237 -14 215 3 38 -6 -283 -111 61 8 -103
1580a03J04k63k12N80k74o1k4J52L62l72J21MJ34l53L50k4n0n4j78K99k05Q4j24
$$ -103 1 -262 -474 106 -168 -229 -253 -101 261 -111 10 14 148 -205 145 121 71 17 -161 138 -67 17 -107
1603a07j3p5K02n2J03Q1j44R2J17l67J40%J7j71J52J66J22n30L80p5k0o3K4K4
$$ -107 -120 -195 7 -45 58 139 -5 87 204 -163 -23 -23 -6 -177 -25 141 263 -267 113 38 18 -45 -21 3
1627CL0j48K14q9j70O8j05K83j87J8K3r2N9K01K2N8k68K67k10QL8L6k55J5J33
$$ 3 33 -115 99 10 -160 -92 -197 86 -101 -83 -60 -152 -93 108 130 188 -80 187 -23 -15 23 59 -196 -181 -48
1652d8RK83l55j65J87J18o8j58o5K72j02PK45j94J12j98J86j17J71j92m8M8R5
$$ -48 -39 244 -111 -276 -89 29 -39 -197 -262 10 -92 -85 160 -34 78 -120 66 -51 120 -72 -120 -72 23
1675B3P7j31j6K54m39K08n3P1j60J32rj45J79j35l3K18m07M57J10P1k12j21J6
$$ 23 100 -31 -47 207 -232 -24 -77 -6 -166 -34 -43 -188 -9 -144 -177 41 -366 91 201 272 60 -61 -45
1698d5M5J05J43o23M23K36k76j66M4P3j3q9J93j95j7L55p0j04K9K3j53J45j12
$$ -45 0 105 248 -375 48 284 8 -158 -114 -41 -54 -143 50 -145 -162 193 123 19 48 71 -82 63 -49
1721d9J30n8J51k82jRL4J03MJ64n45N67l79K95O2m55L08n3m6J51j02R3k19J08
$$ -49 81 23 174 -108 -109 -100 -66 37 41 205 -340 227 -152 143 205 -250 58 5 -41 110 8 101 -118 -10
1745a0J80k43n5R8N2j25K77l1j89J34k41J35k61K95n8j91K65OO7j72J63j30J35
$$ -10 170 -73 -128 -30 22 -103 174 143 -46 88 -153 -18 -279 16 -42 -233 32 38 105 -67 96 -34 101
1768A01j14k83L63j73K28ml08J39L06l85J51j25K67M3j55O0k15L58l12J63r3p
$$ 101 -13 -296 67 -106 122 118 -190 -51 255 -130 21 -104 163 206 51 111 -104 254 -58 105 12 5
1790Ep7J16K0k42J67j5j05O46m97j19J84k35N7J60R4j35L36n39J72r1l46L84R8
$$ 5 -72 44 64 -178 -11 -26 -131 515 18 -101 83 -152 -95 65 159 24 360 -179 -7 -98 -444 -60 38
1813C8K7J08j9l35K72k28K81q9J10j11k11J33j27J08j5q0N9K25k60j18M70n27
$$ 38 65 173 154 -181 91 -137 144 55 165 54 -157 -24 -151 -43 -58 -138 -79 146 -114 -232 238 -289
1835b89L30j97K14R3m2k78M45j98j47J66r6k34J58R3j52K08k01L0J15K32k33O0
$$ -289 41 -156 58 151 109 -169 276 78 -69 97 1 -233 -75 18 -134 74 -127 -97 18 250 17 77
1857G7P6J0l91L10j62j17K04J45j59n8L87j32j92j3P7Q4l04J05j10J16J87j1R7
$$ 77 153 163 -228 82 -80 -197 7 152 -7 -65 322 190 -2 -15 62 146 -158 -53 -163 -47 140 129 226
1880B26j40j13r9J11k0K80Q1o25L14p0J93j53j18K74m4o1l4J01J99j36k90n8k43
$$ 226 86 -27 -126 -15 -35 245 326 -299 15 -55 138 -15 -133 141 97 36 2 103 302 166 -124 -182 -425
1903d25L34O3J90l53L17r3j86K87j13j09N8k4J42l0j54J8K40j16k20K84n4j31
$$ -425 -91 -28 162 -191 126 33 -153 134 21 -88 -30 -54 88 58 -96 -78 162 46 -174 110 56 -75
1925g5R0p4q0kK84m3j16J41P5r7k36j2M17k24m9k25J22o8J17J05j93J04O1k30
$$ -75 15 -59 -139 -141 143 100 -16 125 200 103 -133 -145 272 48 -1 -226 -104 -172 -55 50 -143 -39 22 -208
1949b08M58j57P1m8K6j11j99K93k68q5K29J0j08L60l19J18k04L2JK54P3l71L18
$$ -208 250 93 164 116 142 31 -168 125 -143 -228 1 11 -97 263 -56 62 -142 -110 -109 145 218 -153 165
1972A65k04K4k47L87q0j40Q2K72l12p8J24l2J25mr2L9MJ75p6k72L64M5l24l4J44
$$ 165 -39 -15 -262 125 45 -95 -13 259 -53 -131 -7 -39 86 82 -10 29 33 208 132 -140 224 269 -55 -89 55
1997E5k18n9K23m5L81j72l07R4N3j12O2O9M27n34J16q9J22m4r0nJ49k5j15J8q4
$$ 55 -163 -222 1 -44 337 165 -142 -48 5 -107 -45 24 451 -83 33 -56 66 22 -68 -73 76 51 -64 -46 -130
2022a30N49k66k18J89j59L3J38j11k84L91j83jk4J67j12j0K09k23J2J59J52k72
$$ -130 419 153 -65 124 -35 -2 136 25 -259 132 -51 -52 -76 91 -21 -31 178 -45 -33 126 278 6
2044FK7k0j2j1n4pL4O9k9j16j01J40J2J20KO0m19K67Nj59K11k77K74j54K82l94
$$ 6 33 13 1 -10 -64 -71 -37 32 3 -113 -214 -74 -62 58 60 120 -299 -32 -27 -186 25 -252 22 -132 150 -244
2070b44K38m9J91q9j01J25k08J50j39M12l96J61J61l73J22O1J21jj79K9K0j29
$$ -244 -6 -55 136 47 -54 71 -137 13 -126 286 -110 51 212 -161 -39 22 143 142 -37 -8 12 -117
2092a17n0J65jl4J4l1J51j44j35K0J31n6L04j95n1n0M6l4J64o1p7O5k12L65j74
$$ -117 -167 -2 -3 -37 -23 -54 97 -47 -182 -162 -31 -87 217 22 -29 -79 -33 -67 97 36 -41 24 -188 177 3
2117CJ77J22k41j89J54J17j99J69p6j9M8j5N5nj00K52k74J48k13j26M58k18R3
$$ 3 180 302 61 -128 26 143 -56 113 37 18 66 51 106 101 1 253 -21 127 -86 -212 246 28 121
2140A21k71K63j14R4k56L70L8j92j5k44m9J17K76j98M0on9K5p7J06Q5l27K24o4
$$ 121 -150 113 -1 93 -163 207 245 53 38 -206 -255 -138 138 -60 -20 -26 -85 -60 -137 -31 54 -273 -49 -113
2164a13J86k02R7n1j11K02n0J9j2kJ57K10j72O1j31k12L72p1r5Pj67J46j5l4j90
$$ -113 73 -129 -32 -83 -194 8 -42 -23 -35 -37 120 330 158 219 88 -124 248 177 82 89 -78 68 53 19 -171
2189a71L64p8l47L82k64K6P1j42L72j28K0l85J36L21kr2j78K70q7q6K71l70J83
$$ -171 193 115 -232 150 -114 -88 -17 -159 213 85 105 -280 -144 177 175 83 -95 175 88 2 273 -97 86
2212H6J28l43K9L36l05K46n5k24m1J51K65m30J41k1J3k9L0j74mO9J86J07j2J6
$$ 86 214 -129 -100 236 -69 177 122 -102 -143 8 273 -157 -16 -37 -24 -53 -23 -197 -201 -132 54 161 149 165
2236A65j11j47L08k22L00k09j40J98k74M66m61J58p7k48M05r4J5l6L3j19K58j67
$$ 165 54 -93 215 -7 293 84 -56 142 -132 334 -127 31 -46 -294 111 17 32 -4 29 -90 168 1
2258Aj82r9L47j34k49K82k64L43l38J25L09l50p1J31K71j51J38p6J62n05L26P0
$$ 1 -181 -280 67 -67 -316 -34 -298 45 -293 -168 141 -209 -280 -149 122 -29 109 33 195 -310 16 86
2280H6Q2m11K11j4j32K16P6j19m8j54J71J09Kr2j28L1K58K74l07j00k19L95k40
$$ 86 168 -243 -32 -46 -178 38 114 -5 -53 -207 -36 73 75 -17 -145 -114 144 418 111 11 -208 187 -53
2303e3J25j62j13K87m8r0J65j5j85j70L86p2k52R5J39l9qj52J54o0L8O8j89K39
$$ -53 72 -90 -203 84 36 -54 111 96 -89 -259 127 55 -197 -102 37 -2 -10 -162 -8 -68 -30 38 -151 88
2327H8m30L79K5k6r7K81Qj04M1j24K0k5k62K43k7J57j68N6n2q6K9J19nj15J74
$$ 88 -342 37 62 36 -61 220 228 124 165 41 61 36 -226 17 -10 147 -21 35 -17 -103 -74 45 40 -75 99
2352I9J68l16L5L24k48qp4p0n9K85J0j99l8J01M6J21k86K41k94J66J41Q0l59J30
$$ 99 267 -49 -14 310 62 54 -20 -90 -149 136 146 -53 -91 10 56 177 -109 132 -162 4 145 225 -134 -4
2376dJ91j02K1J52k98j41Q4r3M36m76K06r7M8J33o3Qq7J47j41J34j21J2K4J30
$$ -4 187 85 106 258 -40 -181 -97 -190 246 -230 -24 -121 -73 60 -3 5 -82 65 -76 58 -63 -51 -27 103
2400A03k32P0%j65J07R3j59J89N1M8p9k2j10K92l86K05n0M7K9L8j92K2J09k45
$$ 103 -129 -59 -59 -224 -117 -24 -183 6 57 105 26 4 -106 186 -200 5 -45 2 31 69 -123 -101 8 -237
2424b37J47K01L1j96j49M40m05J25k62K97N2j15K9J96k30j62O6P2m5J10J9k3j51
$$ -237 -90 111 142 -54 -203 237 -168 -43 -305 -8 44 -71 -42 154 -76 -238 -172 -100 -145 -35 -16 -39 -190
2447a90L36l31J93K53l20K10j05j46P0q2M71k67q6j53K70k33k34L98j96K91l16
$$ -190 146 -185 8 261 -59 151 46 -100 -30 -112 359 92 6 -147 123 -110 -344 54 -142 149 -167
2468a67M10k23r2K09N4j37l9K4J45L3k28N5M8P7j74QO9j43K23J44m38N7J2J43
$$ -167 243 20 -72 137 191 54 15 39 184 217 -11 44 92 169 -5 3 72 -71 152 296 -142 -85 -73 70
2492G0l64L87K4rr5J41r6k3j1j76M55l46L1k1k91O5N6L40J8k75L97j46j23J98
$$ 70 -294 93 117 108 13 154 58 35 24 -152 303 -43 -12 -33 -324 -259 -203 137 155 -120 277 131 8 206
2516B06p7J24q5k79k2R0K06Rj15m8k15J55l8P5M1L5Pk39M7M14k17j27j47P8K92
$$ 206 129 253 168 -111 -133 -43 163 172 57 9 -206 -51 -89 -14 27 62 69 -170 -123 291 74 -53 -200 -122 170
2541A70q5j29K52j92K05j74O1M5j52K66m25R6L9J60l24J83J86j74lk06M08k62
$$ 170 85 -44 208 16 221 47 108 153 1 267 -158 -62 -23 137 -187 -4 182 8 5 -201 207 -55
2563e5N1j52Q8R7q3J00j89J6J72rj79P1K32l2k9r5j0J6k01l0J92O0J71k84J2P4
$$ -55 -4 -156 -68 29 -54 46 -143 -127 45 36 -143 -72 160 128 99 4 -6 10 -191 -221 -29 31 202 -82 -70 4
2589Dmo8j31R9j37K06L9j5j92K66J54m60K75j59J33j78L98q1k21J84j11L6l8o9
$$ 4 0 -68 -199 -100 -237 -31 8 -7 -199 67 221 -239 36 -123 10 -168 230 149 -72 112 1 37 -1 -70
2613g0K23l78K0J12K79k47R0J75k83l6L05j62l95O87k65m3j89L00j33k30M15j04
$$ -70 153 -225 -205 -93 186 -61 29 204 -79 -115 190 28 -367 320 55 12 -177 123 -10 -240 175 71
2635G1J00j27K32l7k97L64j99j58j98L0L87l34J08j45K95l97K9m1K30J9j02K06
$$ 71 171 44 276 239 -58 306 107 -51 -249 -219 168 -166 -58 -203 92 -305 -276 -317 -87 -68 -170 36
2657C6J90m57J53MJ30L5j91J80J3k00k5K68j23k41L00l4o8J03m7O1j07k23L74
$$ 36 226 -231 -78 -74 56 91 -100 80 93 -107 -132 136 13 -228 72 38 -30 73 26 87 -20 -243 131
2680A31O7k25P7k19L36k15N5KJ76k44j01K11j78K15J07k75o1M35l88q4J57M0j7
$$ 131 198 -27 50 -169 167 -48 7 9 185 -59 -160 51 -127 88 195 -80 -141 294 -94 -178 -21 19 2
2703Bm4K6QPj95MK98j20j04J62Q2j84J97j49k3J85p2j41m2J19mj30p2L78M2l06
$$ 2 -42 -16 -8 -1 -196 -192 106 -14 -118 44 126 -58 139 -10 -33 152 80 -61 -103 16 12 -118 -190 188 230 -76
2729g6k2J15j97J44q0j51L22k31K50k07L33j38k32O8J39K40k40J38l61j5N23l09
$$ -76 -98 17 -180 -36 -116 -267 55 -176 74 -133 200 62 -170 -102 37 277 37 175 -186 -201 322 13
2751A3R1k52J12J70L4l16K17R9k06oJ60m9j35k2L1J08J74k21Q8J52m07L04k92
$$ 13 104 -148 -36 134 168 -148 69 168 -38 -44 116 67 -68 -90 -59 49 223 2 90 242 -165 139 -153
2774a53Q3L89l90q8N4J13m7J61q4J03O8l23j6J70N1m10L82O3j47P2K72j90R4j37
$$ -153 -70 319 -71 -159 -105 8 -39 122 38 141 209 -114 -130 40 91 -319 63 126 -21 51 323 133 227 90
2798I0Kq8k3j62P5o3K33j82J66k3R2j71K5J47K1j93k6J25k56J23l0P9j8K2pL0
$$ 90 92 4 -19 -181 -106 -169 64 -118 48 25 117 -54 -29 118 139 -54 -80 45 -211 -88 -118 -39 -57 -35 -42 -12
2824a2J91J18m82K98j57l7J49k16L54m28K64m2l14Q5J26J61k9P4m1R8J4k89N7
$$ -12 179 297 -185 113 -44 -81 68 -148 206 -222 42 0 -314 -229 -103 58 29 103 62 160 174 -115 -58
2847e8O3l12L41j07o2k2L34q8j63K47m9j01M5r9O6l1J65j92J07J60k71p8M4J55
$$ -58 5 -307 34 -73 -135 -157 177 89 -74 173 124 23 68 -31 35 4 169 -23 84 244 -27 -105 -61 94
2871I4j45L38k46j67N9J57l06L56j18l3K9j51L34o5Q2l40m9L1K69k8n2j13J58
$$ 94 -51 287 41 -126 -67 90 -216 140 22 -11 18 -133 201 136 218 -122 -171 -140 129 101 49 -64 94
2894I4l13l8L12J55j52L4j5j69kJ66R2j91j30K99m8j86qN5K77l96P1J52p2rm0
$$ 94 -219 -257 55 210 58 92 77 -92 -94 72 164 -27 -157 142 94 -92 -100 -45 232 -164 -93 59 -13 -22 -62
2919f2J6K93l44%mO9K75k63j49l9L15p2O0k72K34k64J61N4J85j81Nn1J64n4j51
$$ -62 -46 247 -97 -97 -101 -32 243 -20 -169 -208 107 35 95 -177 57 -207 -46 8 193 12 17 -34 130 76 -75
2944g5j32J83O0r4k03K34j56L37J3j80J93m08M12j90J93k15K17j89J98o4j16l0
$$ -75 -207 -24 36 -58 -261 -27 -183 154 167 -13 180 -228 184 -6 187 -28 189 0 198 134 18 -12
2966a2J04n7L6k80M60l3j80KL8P9p4l38K54j9k8k7J11k17K36J76l63K30l8j04
$$ -12 92 35 71 -209 251 218 38 40 78 157 83 -255 -1 -20 -48 -75 36 -181 55 231 -132 98 60 -44
2990d4O7O8m60M08j72j52R0j91K29J81J97L7k75J72j33O7j52j02K72Pj04k86K60
$$ -44 23 91 -369 39 -133 -285 -195 -386 -157 24 221 258 -17 155 22 89 -63 -165 107 114 10 -276 -16
3013a6K59m0o4o5m4k26K50j6j74K34j47J15k00p7K82j28j9J05J18j12k6Jr2r5
$$ -16 243 203 139 74 30 -196 54 38 -136 98 -49 66 -134 -211 71 -57 -76 29 147 35 9 10 -82 -177
3037a77L14r5J02l16J66n2l7K63j45R6k41j68J84J83j42J17k29J8L65q8o6M4r0
$$ -177 137 42 144 -172 -6 -58 -95 168 23 119 -122 -290 -106 77 -65 52 -177 -159 206 118 52 96 6
3060Fj57R2J32Kj18j03L76L0l94J23O4j27j40L4L56K6j84k99L94j98j17L05k43
$$ 6 -151 -59 73 75 -43 -146 230 260 -134 -11 53 -74 -214 -180 176 202 18 -281 113 -85 -202 103 -140
3083a40K19J20j55k96K38Ok05J12q6L54l84L22l8J0j62K85k80k0K75m5k64l5M19
$$ -140 79 199 44 -252 -14 -8 -213 -101 -187 167 -217 105 67 77 -85 200 -80 -100 175 130 -134 -169 250
3106B50k06J31l07J55L6j75m3L88k8j67j14q1N25k68l13m3J33K29K4J29k86o0
$$ 250 44 175 -132 23 59 -116 -159 229 201 34 -80 -161 364 96 -217 -260 -127 102 126 255 -31 -91
3128i1J36M4J29m0l28L81m07J94J00m1l00K6L15o0J47J2k46J2R9n8J85o8J70n34
$$ -91 45 89 218 178 -150 231 -176 18 118 77 -223 -197 118 58 205 217 -29 -17 82 24 209 141 311 -223
3152b23L21k36J29K8j5j03N3J09j08K38j25j22J45O7k79K23k79RK33l19L05p4
$$ -223 98 -138 -9 19 4 -99 -46 63 -45 193 68 -54 91 158 -121 102 -177 -168 65 -254 51 -23
3174b3Pj36R3p4j07K69L2J18k05k37K65P5QL3J7p7l7M1O6k59K91j37j3m9R9mj59
$$ -23 -16 -152 -59 -133 -240 29 61 179 -26 -263 2 77 85 118 135 58 21 62 128 -131 160 23 10 -39 60 56 -103
3201a03K05j15O2m4j28K05n6R8J68j13l79L6M20k28j93K04L09j65j91Q0j99J25
$$ -103 102 -13 49 5 -123 82 26 124 292 179 -200 -164 256 28 -165 39 348 183 -8 72 -127 -2
3223bK9k1N8J78l27J13k54L5m8J95N3o5L8j25O6Q4O7M8o6J40l00M31l2m31j88
$$ -2 27 6 64 242 -85 28 -226 -191 -239 -44 9 -56 -18 -143 -77 7 74 122 56 196 -104 327 295 -136 -324
3248c24M36k84L44l80J76k5J70r5j69k1P3K4N7j73L4K33Q1j72L5K39j75j69O8
$$ -324 112 -172 172 -208 -32 -57 113 18 -151 -172 -99 -75 -18 -191 -157 76 157 -15 20 259 84 -85 -17
3271a7M8qR2j0k71L87k94L12l04K7N9j74M11k97J33j7j62p6P0k21M65j96j36J85
$$ -17 31 23 115 105 -166 221 -73 239 -65 -38 21 -153 258 -39 94 77 -85 -161 -91 -312 153 -43 -179 6
3295FL33n12J98j71K11j27LK34o1j09K59k26p9k5K05k31K63j69J41p6j01o8%J10
$$ 6 339 -173 25 -146 65 -62 -59 175 114 5 264 38 -41 -66 139 -92 171 2 143 67 -34 -102 -102 8
3319Hj77K19L7L0O1j35j04j05J25J55k90k03K21J61J88j84K7k0Ll61M67k95J27
$$ 8 -169 50 87 117 178 43 -61 -166 -41 114 -176 -379 -158 3 191 7 34 14 17 -344 123 -172 -45
3342d5m7j38L40j94K17j8Ql50M12k09L4k06N3n8m4L19J79m56P4L49k05k19J72
$$ -45 -92 -230 110 -84 133 115 123 -227 185 -24 10 -196 -143 -201 -245 74 253 -203 -129 220 15 -204 -32
3365c2J9j20L73p0m20J43K26l16J72N5k25L76j84K50n41K08k30L97n0k7j70R9
$$ -32 -13 -133 240 170 -250 -107 119 -197 -25 30 -195 181 -3 247 -294 -86 -316 81 31 4 -166 -67
3387f7K68j14RN7p5k94J93j37L62k87K71k18P7q0M0J4k56L20l95L93k95R4K69
$$ -67 201 87 96 153 78 -216 -23 -160 202 -85 186 -32 45 -35 5 19 -237 83 -312 81 -214 -120 149
3410A49k34J40k84P1n4J91K54j83n8K4j27Q1o9J30j08J7m1P6l1m5j62L65l9k50
$$ 149 -85 55 -229 -158 -212 -21 233 50 -8 16 -111 -30 -99 31 -77 -60 -101 -25 -56 -101 -263 102 63 -187
3434a87J96q9J48K0m0j24L37n50L83j93j15K54r3J94j12K04p0J40j53l66K87q
$$ -187 9 -80 68 88 48 -76 261 -289 94 -99 -214 40 -53 141 29 233 163 303 150 -216 71 63
3456F3OJ69M8j57k47L45j31j08NM7R1k14L69j14p5j62J33j59p4J42k31L29j36
$$ 63 69 238 286 129 -118 227 96 -12 -7 40 131 -83 286 172 97 -65 68 -91 -165 -23 -254 75 -61
3479f1pJ14k59J83o7L6J92k58K66k26L15l99P2r7nJ06K86j33J16k20J34K18l72
$$ -61 -68 46 -213 -30 -97 -61 131 -127 139 -87 228 -171 -99 -196 -201 -95 191 58 174 -46 88 306 -66
3502f6j08o3K29J19m62M34k05L17k92K57O1l1j77J8N1l19L07p9K8J29j83q7Q5
$$ -66 -174 -237 -8 111 -351 83 -122 195 -97 160 221 190 13 31 82 -237 70 -9 19 148 -35 -122 -37
3525c7JK26j32k28J58n0J78o9L0j08O4m11N45q2j65O7J29K6l55J83l03L21rR0
$$ -37 -36 190 58 -170 -12 -62 116 47 77 -31 33 -378 167 85 -80 -13 116 142 -213 -30 -333 -12 -21 69
3549F9k4q9K19l25J62J25j44J53p3j34J05m6l78M35L5q0L5k46n8K75k3q4J59J42
$$ 69 45 -44 175 -150 12 137 -7 146 73 -61 44 -2 -380 55 90 10 45 -201 -259 16 -7 -91 68 210
3573B10m00L26j32Kr6p7Q6j60M17j97J05J79k31K63l28K23j67N7k90K46J4K7o1
$$ 210 -190 136 4 6 -90 -167 -81 -241 176 -21 84 263 32 295 -33 190 23 80 -210 36 50 77 16
3596A6L7j88K10r5m5r2j40L84k29L56l47K42j8j81J20j92J17J08m1O1k42J44M7
$$ 16 53 -135 75 -20 -65 -157 -297 87 -142 214 -133 109 91 -90 30 -162 -45 63 22 83 -159 -15 32
3619C2k6K87l64j99K73K47j63o3k9J51j88J92j6l04L04j00J96k67j31J05JJ05
$$ 32 6 293 -71 -270 3 250 87 24 -5 146 -42 150 134 -170 134 34 230 -37 -168 -63 -62 43
3641D3mJQ9j33J53m7P0Mq4L7j41J30j41J9R3j3k09J0m6K47k20K27j82k14L34L
$$ 43 39 40 129 -4 149 102 172 176 92 129 -12 118 -23 -4 89 76 -133 -123 -169 78 -142 85 -97 -311 23 26
3667B6J19r3Rp5K01l25J73N4N6J56q5l26J93k44M00j11j63L26n09L34k6K4k01
$$ 26 145 52 61 -14 187 -138 35 89 145 301 216 -110 83 -161 239 128 -35 291 -218 116 90 114 -87
3690h7J21K5j52L23j04J24j43k06K35Kl98M14j78K33j08q2L5j8n8J89j27k25K62
$$ -87 34 59 -93 230 126 250 107 -99 136 138 -260 154 -24 209 101 19 54 36 -22 167 40 -185 77
3713G7k99J56L1n6J96K00l59r7p6J16m7L00j3p3o7L2j97L59o7r0J19l39J47r1
$$ 77 -222 -66 -35 -91 105 305 -54 -151 -227 -111 -158 142 129 56 -11 21 -176 183 116 26 145 -194 -47 -138
3737a38J51K00l84J30k30L05n5p6m0J26L0O8j92K8J98P2k57j63K06j11K52L8j70
$$ -138 13 213 -171 -41 -271 34 -21 -97 -137 -11 19 87 -105 -77 121 193 -64 -227 -21 -132 120 158 -12
3760a2N3k53K27J11q5k16J19p5K87j06j55J68j48l8q3M56k52l2l06K03j8K25k6
$$ -12 41 -212 15 126 41 -175 -56 -131 156 50 -105 63 -85 -123 -206 250 -2 -34 -340 -137 -155 70 44
3783D4m2oK00l12k45M61j06p9j14M23k92Qj8j61J50M1M3J15j04j81oJ96J3o2j29
$$ 44 2 -4 196 -116 -361 100 -6 -85 -199 224 -68 -60 -78 -239 -89 -48 -5 110 6 -175 -181 15 28 -34 -163
3808a63J54j18M0K76k50N6m6J05j06n3J06j73PJ76nNL1m0p7K38j57K3k66K86j6
$$ -163 -9 -127 -87 189 -61 -5 -51 54 -52 -105 1 -172 -165 11 6 11 42 2 -75 163 6 29 -237 49 33
3833C3M0k81J92r6J87o2k71J95Kn5N6J16M2k24K61l15J85j68M45k88m8J71l41
$$ 33 73 -208 -16 -112 75 13 -258 -63 -61 -116 -60 56 98 -126 135 -180 5 -163 282 -6 -54 117 -224
3856b24p2R7J38K22j92O9n6L1m5J80L2k21qR9j81POJ87j02l6k63M24q7J00p9j03
$$ -224 -296 -199 -61 161 -31 38 -18 13 -32 148 180 -41 -49 50 -131 -124 -118 69 -33 -69 -332 92 5 105 26 -77
3882g7n6J76J96l40J98P4R6j72l31K50J10R5l21K41l34J46j31L35P4m31L52p4
$$ -77 -133 43 239 -101 97 171 267 95 -236 14 124 219 -102 139 -195 -49 -180 155 229 -202 150 76
3904G6R5j34n0j78L05l68K82k59J14J6K41j6O7k96n4M58o2q8k89J01K78n6J9j20
$$ 76 171 37 -13 -191 114 -254 28 -231 -117 -101 140 124 191 -105 -159 299 237 149 -140 -39 239 183 202 82
3928H2K38l83N1M7J59p6k4j38n9J91j61J22OK06j08j18k43L21l2M3l11O1J29J38
$$ 82 320 -63 -12 35 194 118 94 -44 -103 88 -73 49 55 261 153 35 -208 113 81 124 -187 -126 3 141
3952A41n10J69K50O6j48K53k22k6j27M4J58N5r8p5K8J15k24K40q1J06m09L57J85
$$ 141 -369 -200 50 116 -32 221 -1 -27 -154 -110 48 103 5 -70 -42 73 -151 89 8 114 -295 62 247
3975B47j71j58L2M3j10L07n65N46m8k79J37K8K16q3k06K83M0l32M8K28o4j36M7
$$ 247 76 -82 -50 -7 -117 190 -375 171 123 -156 -19 9 225 142 -64 219 259 -73 -25 203 139 3 50
3998E0N5j9q6k98M47m2N8Ll28L02j83rJK02j82M6r6J72k24J52P5l82J41K51J05
$$ 50 105 86 0 -298 149 107 165 168 -160 142 -41 -50 -49 153 -29 17 -79 93 -131 21 96 -286 -145 106 211
4023B11l05L66k03j34J34K07k32K3k1k90L60j37kJ28J34k28L3r2k0Q4R5j18k10
$$ 211 -94 272 69 -65 69 276 44 67 46 -244 116 -21 -23 105 239 11 44 -48 -68 16 111 -7 -217
4046b17J26LK04j35J40J16r0k90J65Rn6J93k60k4M6J97j15j32K38j34j43Q1m7
$$ -217 -91 -88 116 -19 121 237 147 -143 22 31 -25 168 -92 -116 -70 127 12 -120 118 -16 -159 -78 -125
4069a25j2K3J8J82k7mo9O8p1O3K98l03L08l51q2N2Q1q3k32J51K22j57n8R5J3K07
$$ -125 -137 -114 -96 86 59 55 -14 54 -17 46 344 41 349 -2 -84 -32 49 -34 -266 -115 107 -50 -108 -13 0 207
4095B07j63O7J75j76k50K83j09J20l11L28J9j48o9j89J57J41q3k7Q1m9j93K73
$$ 207 44 111 286 110 -140 143 34 154 -157 171 190 42 -27 -216 -59 82 -1 -28 53 4 -189 84
4117H4Pj37J94k8K26q6k95j6n4L9R9r7j37Q6L68k43Q8k79K54J81j73j30N3P4o6
$$ 84 91 -46 148 120 346 260 -35 -51 -105 -66 33 -64 -201 -115 253 10 98 -181 73 254 81 -49 4 78 12
4142A2n5L8j22P3R9J2J09o3k17J71k92K19O4k47J11K37j0j55J75j69k52K06J96
$$ 12 -43 -5 -127 -54 45 57 166 103 -114 57 -235 -16 48 -199 -88 149 139 -16 159 -10 -262 -56 140
4165A40o7n3J15k19J36J45r9j68kL98k49l2j99P9M2j71JK65j20j25J98j31p7J67
$$ 140 73 20 135 -84 52 197 98 -70 -72 326 77 45 -154 -75 -33 -204 -203 62 -58 -183 15 -116 -193 -26
4189b6M9j16J33q1L8J55k41K36P3k10k85J80K23k81K1L02j74l9k3j23L35k95j24
$$ -26 23 -93 40 -41 -3 152 -89 147 220 10 -275 -95 128 -153 -132 170 -4 -43 -66 -189 146 -149 -273
4212b73M91j56k52O9J84j68j15J92J17o5R5k62K83j25O2M8k57L48k04L7p5P2n0
$$ -273 218 62 -190 -121 63 -105 -220 -28 89 24 119 -143 140 15 77 125 -132 216 12 49 -26 46 -4
4235dJ20m2J32k42j04K02j27r5J6K15l6K28k41K67k32l9K3P3K4n6O4p6R2J66m63
$$ -4 116 74 206 -36 -140 62 -65 -160 -144 71 35 263 22 289 57 18 41 114 138 82 146 70 162 328 -135
4260a35P2L42l42k11K12K64k8Kk39r5J54L0j30J1J24k33J51J15j42K08j1K8l72
$$ -135 -63 279 -63 -274 -62 202 174 176 -63 -158 -4 26 -104 -93 31 -202 -51 64 -78 130 119 147 -225
4283b25M37p9l03K11J38l16K8n0J97j70k17O20n45K43K38j8j48p0J42j24P9r9
$$ -225 212 133 -170 41 179 -137 -109 -159 38 -132 -349 271 -274 -31 207 189 41 -29 113 -11 68 -31
4305c1K39m7p5J7N9l06K59k31j24L96k34J98O0k80j41M36j0m9p7J00l4l17K37
$$ -31 208 161 86 103 162 -144 115 -116 -240 156 -78 120 180 -100 -241 195 185 136 59 159 125 -192 45
4328D5R4k50l0K24l00J27j30K10R3J28j83q6Q0l64J46L74l15J41po7J97k96K44
$$ 45 139 -111 -141 83 -217 -90 -220 -10 83 211 28 -58 22 -342 -196 178 -137 4 -3 -70 127 -169 75
4351G5k84M13k37J53p7j04J69l2j35J27k19J89J56j37J93m17L32l79M9J48J36
$$ 75 -209 204 -33 120 43 -61 108 76 -59 68 -151 38 194 57 250 -167 165 -214 -165 -17 119
4372A19q9j20J7J91j96L8M7j63M1K81k68j58J41N4j0K94k25K68l58j74M39k01
$$ 119 30 -90 -73 118 -78 -40 7 -156 -115 166 -102 -260 -119 -65 -75 219 -6 262 -96 -270 169 -32
4394c2J87j68k63K01J01mj86P7K18j50M26l92p3P8j89P3J30J03j96J5P4p7m0J05
$$ -32 155 -13 -276 -75 26 22 -164 -87 131 -19 407 15 -58 20 -169 -96 34 137 -59 -44 30 -47 -87 18
4418A8o4R1k85M71m54Q9J67m0p5J90k75J66n4J9k6M21k87l51K24N2O2J14m34q2
$$ 18 -46 45 -240 231 -223 -134 33 -7 -82 108 -167 -1 -55 -36 -62 359 72 -279 -55 -3 59 173 -261 -343
4442c43M59K5l65j72K14J48L7r2J63Q5j60l15K73km8K17j88pJ66m7j36K27j45
$$ -343 116 141 -224 -396 -182 -34 3 -89 74 159 -1 -316 -43 -45 -93 124 -64 -71 95 48 -88 139 -6
4465fP0J60L6k60J84k61K43oj76m7j4J21l1j88J87l07K46j03L33k77J1Q9k28L10
$$ -6 64 224 260 0 184 -77 166 160 -16 -63 -77 44 13 -175 12 -295 -49 -152 181 -96 -85 4 -224 86
4489H6j72l35K91J00L04k82r9n3J72j1j41N09k77k98O5n0K96k64O8p6N2J19j39
$$ 86 -86 -421 -130 -30 274 -8 -107 -160 12 1 -140 369 92 -206 -141 -191 105 -159 -91 -167 -115 4 -135
4512a35K72j93Q2L4o7o2p3J68j77L28j96K10k64J77Ml61N16l21j0m6K03j84q2
$$ -135 137 -56 26 60 -7 -69 -142 26 -151 177 -19 191 -73 104 108 -253 263 -58 -68 -114 89 -95 -177
4535a77L01m06K09K53j09l63L59k28J17P1j65K2j55J68K59j49m47L07K23k94L19
$$ -177 124 -282 -73 180 71 -292 67 -161 -44 27 -138 -116 -271 -103 156 7 -440 -133 90 -204 115
4556A15n1p1J59kK1j94J41j16l1j74J74k8j14J13L91l50j91K93q3mj51K04k7q0
$$ 115 64 -7 152 150 171 -23 118 2 -29 -203 -29 -57 -171 -58 333 -17 -208 85 2 -2 -153 51 24 -56
4580e6n8J64j05l16L37k4r7L61m54M19l27J92J77l85j6K47L17l27j26L41j13j52
$$ -56 -114 50 -55 -371 -34 -58 -155 206 -248 171 -156 36 213 -172 -188 59 376 49 -77 264 151 -1
4602aq4K56m3l16N7J5K23j81l7K02j24j0K26J77m58J70k08J89q5O4J75j20j32
$$ -1 -85 171 128 -188 -131 -116 107 -74 -111 91 -33 -43 183 360 -98 72 -136 53 -32 32 207 87 -45
4625d5J23Q9r8j49LK92k38R9J62m53K04j36L75k25p0j16L11P2k93J22j98L17k33
$$ -45 78 167 69 -80 -77 215 -23 76 238 -215 -11 -147 228 3 -67 -183 128 200 -93 29 -169 148 -85
4648h5m0K66%q7l3q2L36l48oK37j99N7j10O2K22j40j47J50j52N1J25K3r8J7m2
$$ -85 -125 141 141 54 21 -61 275 -73 -79 158 -41 16 -94 -32 190 50 -97 53 -99 -48 77 100 2 19 -23
4673b3m8p5R7k23L75J13k88Rj48J7L79l71k8l4L13N8k06p3LJ60J01k05J84Q3j67
$$ -23 -71 -146 -49 -272 103 216 -72 -63 -211 -194 185 -186 -214 -248 65 123 -83 -156 -153 7 108 -97 87 170 3
4698Cj97J78J12k72J60J4j0J54o6j0j60R4K6j55N8J46r0P9R5l85J37J39P4lj55
$$ 3 -194 -16 96 -176 -16 -2 -12 142 76 66 -94 0 26 -129 -71 75 -15 64 159 -226 -89 50 124 121 -34
4723c4J90l91K37p6K7l09K70L92l61O1J0R5j41N8M5l17L11m0qq5L1L22r2m24K88
$$ -34 156 -235 2 -74 -47 -356 -86 306 -55 6 16 111 -30 28 73 -244 67 27 19 -66 -35 287 195 -229 59
4748E9mk31J95K11k63M2J2q2O2Kk40L03J20k83J96k15j5L4j35J41Q1l10L04J52
$$ 59 55 -176 19 230 -33 9 21 -61 1 3 -237 66 186 -97 99 -116 -131 -97 -232 -91 -10 -320 -16 136
4772A36l63L13p5o4Q3Q1p3j46L14j52k82R5oR5m3J49mm7nL4M1l99O16l76j29J27
$$ 136 -227 86 11 -53 30 111 38 -108 206 54 -228 -133 -139 -44 -87 62 58 11 6 40 81 -318 298 -78 -207 -80
4798h0K22J85n33J54J47J04l30J04P8k51J98L5K40m90n4K17J68j49k07l3K32M4
$$ -80 142 327 -206 -52 95 199 -131 -27 51 -200 -2 33 273 -217 -271 -54 114 -35 -242 -275 -43 1
4820Ar3J8n6L3Q4m6QQ8R4l51L61l4N0k4l30lP3K5J06K02m10K09q5Q1M7j57K64
$$ 1 -92 -74 -130 -97 -13 -59 -51 37 131 -220 141 107 157 133 -197 -200 -127 -102 4 206 -204 5 -80 1 48 -109 155
4847A55Lj34j79M3Q2J94k19K62j59k8mj24j53J73K6K21j83p2P6m2m1N04m19j68
$$ 155 158 24 -155 -112 -30 164 -55 207 48 20 16 -108 -261 -88 -62 159 -24 -96 -20 -62 -103 401 -18 -186
4871a86J04M1j06K48q0q6m2K91j82r8J24j67K61j18j05q5K09J6p0N7j5j5N2r3
$$ -186 -82 -41 -147 101 21 -65 -107 184 2 -96 28 -139 122 4 -101 -186 23 39 -31 26 11 -4 48 -45
4895d5M7JL8q4j26K12r0O3J75j89j02J52k09P8J05J30j66P6j76P5J06j11j14K72
$$ -45 2 3 41 -43 -169 43 -47 16 191 2 -100 52 -157 -79 26 156 -10 66 -110 -35 71 -40 -154 118
4919A18J19l41J18q2L9JJ98j69k97J99O5k2K75m61L74k40L4o0K27n00N95j19k03
$$ 118 237 -104 14 -68 -29 -28 170 1 -296 -97 -32 -54 221 -240 134 -106 -72 -132 95 -405 190 71 -132
4942a32J33Q4J04l18n9Q7J44J06k16j8Q6k47L05k70j8K53rlo4J18m0j2R2j09M5
$$ -132 1 85 189 -129 -188 -101 43 149 -67 -85 1 -246 59 -211 -229 24 15 12 -52 66 26 14 106 -3 42
4967D2k52L77j49J16k33J49j55l8M53j50j10K62k74l60L29j43J54q4K5R3J32o8
$$ 42 -210 167 18 134 -99 50 -105 -143 310 160 50 312 38 -322 7 -136 18 -66 -41 52 184 116
4989A16R5p5J92l13K13k77j17K92l09J57J99k52K33j50K9l3K04n16L38o3p3R5
$$ 116 211 136 328 15 228 -49 -166 126 -183 -26 173 -79 154 4 33 0 204 -312 26 -37 -110 -15
5011a5p4J93j95K6J14P7k88Q4l7L8J32J32Oj98j2p9K31k12J12pq5J30k58o8O2
$$ -15 -89 104 -91 -65 49 126 -162 -78 -115 -77 55 187 193 -5 -17 -96 135 -77 35 28 -57 73 -185 -253 -191
5036a91K08J8k02J78J35j53q8k52J73L48m18K70j11k8J18j26K13j51o2J27j2O2
$$ -191 17 35 -167 11 146 -7 -95 -347 -174 174 -244 26 -85 -113 5 -121 92 -59 -121 6 -6 56
5058E6j72j00L37j66r3K61j05k35J62j27L12L4l0k25k8J63L0j53K2Jm6K33rl00
$$ 56 -116 -216 121 -45 -138 123 18 -217 -55 -182 130 164 134 -91 -119 44 74 -79 -57 -56 -102 131 122 -178
5082a78K32J40k02j11P9r8L08l01L41K3j22L6j59j82R6M76m05r2K03%k8j18o4
$$ -178 54 194 -8 -119 -40 -138 170 -131 210 233 111 147 -12 -194 -98 378 -27 -119 84 84 56 -62 -126
5105a26J90l9j98J06j04P9K2K42k38J48k04K12o4K0L0l09M75j85m0m7KK14k78
$$ -126 64 25 -173 -67 -171 -92 -70 172 -66 82 -122 90 26 46 76 -233 242 57 17 -30 -28 186 -92
5128i2J53j42o2J09J34m3k9K8N1J15k17q6K40Q7l94M36k32j7p5m7J59j40j35M08
$$ -92 61 -81 -143 -34 100 57 28 56 107 222 5 -81 159 246 -148 288 56 39 -36 -83 76 -64 -199 209
5152B09j30o5k5J69j38j22L59j31k22J42L4k01J67q2r3N4K0N9j15%J17q9o0j11
$$ 209 79 14 -11 158 20 -102 257 126 -96 46 80 -121 46 -36 -129 -75 -55 4 -111 -111 6 -83 -143 -254
5176b54K92j83K86j60PK03N4m36J86K55j96J46n57K98j65J87N8m32L63OK35K7
$$ -254 38 -145 141 -19 -12 191 245 -191 -5 250 54 200 -357 -59 -224 -37 21 -411 -48 -42 193 220
5198B20n0j74L98m03r5R7J44K4l42%J28j57K04K37l75L4J97Q9m17N81l73P5J31
$$ 220 170 -4 394 -9 -104 -7 137 161 -181 -181 -53 -210 -6 231 -144 -110 87 176 -241 340 -33 42 173
5221A73k35L22k30k78L86j3j95M8Qn8J83j77J89j38P6j65nQ5R2q0O8m9j8j51L62
$$ 173 -62 260 30 -248 138 125 -70 -22 -14 -72 111 -66 123 -15 61 -104 -109 -24 68 -12 56 7 -11 -162 200
5246B00j77m0L2j34K86J53k51r1j02O4J60j29K28R8l24P0Q9k29rJ02j77Q8k20
$$ 200 23 -17 15 -119 167 320 69 -22 -124 -60 100 -29 199 297 -27 43 132 -97 -106 -4 -181 -93 -313
5269c13K05J69J30q8L2j37q4R3n4O7k1j18J09k4Q4Q8k49J3k9Q3K18k87J41j40
$$ -313 -108 61 191 103 135 -2 -86 7 -47 20 -1 -119 -10 -34 50 138 -111 -98 -127 -44 174 -113 28 -112
5293a12LK68j58M7j94R0n3J87o2N7N9L2k37L61n89L97q7q8K30j47k9RQ6o8n1j19
$$ -112 -109 159 1 48 -146 -56 -109 78 16 73 132 164 -73 288 -301 96 9 -79 151 4 -25 -16 70 2 -49 -168
5319a68Q5%J76l05J68J65K9K2j54J06l8j43j20R7L58k09k85L84k40J50k45J97
$$ -168 -83 -83 93 -212 -44 121 150 172 18 124 86 -57 -177 -80 278 69 -216 168 -72 78 -167 30
5341C0j36j48K43J07k89J85j54K06m4K6k23J03j21L71l09Q5m5j66M41N7k81j40
$$ 30 -106 -254 -11 96 -193 -8 -162 44 0 26 -197 -94 -215 156 -153 -68 -113 -279 162 219 -62 -202
5363b02J46j29K46J81l92K16L7k92L46J15j91j49J24j20R6j7l4p4P9K99j70j97
$$ -202 -56 -185 61 242 -150 66 103 -189 157 272 81 -68 56 -64 32 15 -19 -93 -14 285 115 -82
5385h2J87j15P8r8r4o0J11ppn4N0j21J52Q7J23k24j03L77j7J9k16j56K88j87K37
$$ -82 105 -10 68 -30 -124 -184 -73 -80 -87 -141 -91 -212 -60 27 150 -74 -177 200 183 202 -14 -170 118 -69 168
5410A68j01J67j37p0j33J0Q3j53J24L6p4J24J42p1N1j90J60q4N1l00K75k52k58
$$ 168 67 234 97 27 -106 -96 -13 -166 -42 -6 -80 44 186 115 166 -24 136 52 103 -197 78 -174 -432
5433d32O01j67j03o6L09j85o2J00j68K37j00J00q6R6l9j18M71k39q6k31K05j54
$$ -432 169 2 -101 -167 142 -43 -105 -5 -173 64 -36 64 -22 74 35 -83 388 149 63 -168 37 -117
5455a17L3J57j86K77k93J75r7J21J7Q3j04j26K72l09K16J19k12q5L97l16j03J13
$$ -117 -84 73 -113 164 -129 46 -51 70 87 170 66 -60 212 -97 119 238 26 -59 338 22 -81 32
5477C2P2p7M3P0ll16L79j76J19J11l41k31K96J35l33J96J1l14M70k12k05J77J17
$$ 32 104 27 70 140 137 -179 200 24 143 254 -87 -318 -22 113 -220 -24 -13 -327 143 -69 -274 -97 20
5500B0O3j0k05R3j0J58k03j56L91k73J61K48j53N8j07j37K10K8l2rr9MM2r6k5
$$ 20 83 73 -132 -39 -49 109 -94 -250 141 -132 29 277 124 182 75 -62 148 176 144 135 36 40 82 -14 -39
5525c9J16O6P6n09J62l0R2j07K84l78K97r3l3K36j59N1j55J31p3K65m43K93j53
$$ -39 77 143 219 -290 -128 -158 -66 -173 111 -267 30 -63 -96 140 -19 32 -123 8 -65 200 -243 50 -103
5548a03J18k26J52O0J45k19L00k29n6m1K17o7j82L01k67K3j22L12p8N4k10J32
$$ -103 15 -211 -59 1 146 -73 227 -2 -58 -99 118 51 -131 170 -97 -74 -196 116 38 92 -118 14
5570A4k18L62j24j54K12l20M77k13K00j09j87K00j17j43J37R5j26l5n1N2K9j33
$$ 14 -204 158 34 -120 92 -228 249 36 236 127 -60 140 23 -120 17 112 -14 -49 -100 -48 -19 -152
5592a52L8J17L6M7J1n6j4o9j8J02m1K28l92J31j15K49j9p2n0l3J48k31K32k37
$$ -152 -114 3 39 86 97 41 27 -42 -60 42 1 229 -163 -32 -147 102 83 11 -39 -72 76 -155 77 -160
5616a60O0j21K62P9j63J00k56J29r7Q9m8PM9J66n5l90K58Q4j63oM47n72L62j90
$$ -160 -100 -221 41 120 -43 57 -199 -70 -167 -78 -126 -119 -70 96 41 -349 -91 -7 -170 -176 271 -301 61 -129
5640a29L4J36l0O5K3k56J42P3k07l3M31n26M57J8m47L90l45L00o3L39o37K05P0
$$ -129 -95 41 11 76 99 -157 -15 58 -149 -182 249 -277 180 198 -249 141 -204 96 33 372 -265 -60 10
5663A0o3j5L5J15j54jJ03j8n3R4M9K3j2P5j89n2J06j84P8L62k16n4J78j59l4l33
$$ 10 -53 -68 -33 82 -72 -73 30 12 -41 53 102 125 113 188 -1 -53 53 -131 -53 309 93 39 217 58 24 -309
5689c09J46K76j89J32k14o0L09Kj80R1L5j41N9L9K25m00K94l1j4k59M6J87j75
$$ -309 -163 113 -76 56 -158 -218 91 93 -87 4 39 -102 -43 -4 221 -179 115 84 70 -189 -143 44 -131
5712a31r5M27l80L03l6k61J71l3L9p9o0K38l17K96N0Lj62n0kJ15Nj50K19p1L6
$$ -131 -226 201 -179 124 88 -173 -2 -35 4 -75 -135 103 -214 82 132 135 -27 -77 -79 36 41 -109 110 39 75
5737G5j02J25j55J58j94j30J46J53l3j23L02k27K88m36L64j68m2J12k77P5R5K6
$$ 75 -27 98 -57 101 -93 -223 -77 76 43 -80 222 -5 283 -153 211 43 1 113 -164 -89 6 32
5759C2p8k4k04L23J63J78p71L56p5r7M5J95m1j04J95j96K05l68M90j3J17l87L42
$$ 32 -46 -70 -274 49 212 390 -381 -25 -100 -197 -152 43 2 -102 93 -103 102 -266 224 211 328 -59 283
5782B83j39j56k9Jj71L22l3J07k86L38k03j07j84K35j38J56K50k18N3j48P9Mj5
$$ 283 144 -12 -41 -40 -211 111 78 185 -101 237 34 -73 -257 -22 -160 -4 246 28 81 -67 12 16 1
5805Ak15P5L90Ok07J05j55j57K62j36J60j59J05L0l61L68j67K48l87J97p6NQ8
$$ 1 -214 -139 251 257 50 155 0 -157 105 -31 129 -30 75 105 -256 112 -55 193 -194 3 -73 -68 20
5828B0o0r8K40j82j1mL42j01o3j70J12j38P2J15P3j47j26J2L59j78j04N7J67k68
$$ 20 -40 -138 102 -80 -91 -95 247 146 83 -87 25 -113 -41 74 147 0 -126 -114 245 67 -37 20 187 -81
5852h1J93L0k15Q1L18k85K0K04m23j5J4P1J05O2j29R8k10M7K41l02L30j18l42
$$ -81 112 142 -73 8 326 41 61 265 -158 -173 -159 -88 17 79 -50 48 -162 -115 126 -176 154 36 -306
5875c06N66j10j58K57m66J97j58J48L2j64J21j19K93l3k69j16Q4J19Jmk4J51j78
$$ -306 260 150 -8 249 -217 -20 -178 -30 2 -162 -41 -160 133 100 -169 -285 -201 -82 -81 -85 -109 42 -136
5898a36k51M90o6j5J31j97Q5j82J45M0oll07L33k56K03J4O8J13k07J03j18j1k27
$$ -136 -387 103 37 22 153 -44 41 -141 4 44 38 35 -272 61 -195 8 22 90 203 -4 99 -19 -30 -257
5922b57K56J01K09n26M14j97Q6J9j90L1p2J91j62K70N0j73j90M3K14m7j41P1j36
$$ -257 -1 100 309 -217 197 0 86 105 -85 -54 -126 65 -97 173 223 50 -140 -97 117 70 -71 0 -136
5945a36L17Pk98J92J02j62J76j67m5K25n84L76J64J50m51rK64k75J34J93j65J25
$$ -136 181 188 -110 82 184 22 198 31 -14 211 -373 3 167 317 -134 -143 121 -154 -20 173 8 133
5967A33o0nJ8l7rn9J08j50r4L84j66mk42K25r2J99k29o1K26p3q8Q2m0k9J38k75
$$ 133 73 68 86 49 40 -19 89 -61 -155 229 63 59 -183 42 -50 149 -80 -141 85 12 -76 6 -34 -63 75 -200
5993b00L54p7J72k66l1J77k7j41qo0K82l94L55o5l66L42l21N42l46j19L33l1j68
$$ -200 154 77 249 -17 -48 129 102 -39 -47 -107 175 -219 136 71 -295 47 -274 268 -78 -197 136 105 -63
6016f3k8J04q4l7Q1J81j38K5J56m71K47J35l93J18L17j65j60jR1J89k65J35Pj74
$$ -63 -91 13 -71 -108 -27 154 16 41 197 -274 -27 108 -285 -167 150 -15 -175 -176 -85 104 -161 -26 -19 -193
6040a93nL03q8Nm2o3j56K62l1KO8M8Q9j48p4J13J42l9j86j2q1K48j72j39K01j13
$$ -193 -198 105 17 22 -20 -83 -239 23 -8 -6 62 110 199 51 -23 90 232 193 7 -5 -86 162 -10 -149 52 -61
6066f1m0J42L5k53K12k9k82N21Rk57J07l8O8k75K59n3P3k25J17m9O1K2J54m39
$$ -61 -101 41 76 -177 35 6 -276 245 254 -3 104 66 134 -141 118 65 138 -87 30 -19 42 64 218 -221
6090b21K38P2k40J90O8k40L97k53q2J24O9K5j12j24m6P5J25J8j53K20l63J94k05
$$ -221 17 89 -151 39 107 -133 264 11 -71 53 122 147 35 -89 -135 -60 65 83 -70 150 -213 -19 -224
6113b24L66j64Q8J7l8Q4k75L9J64K3k49K10O8r2J10k18K55k29K44k63J55j76j25
$$ -224 142 -22 66 83 45 129 -146 -107 57 80 -169 41 109 17 127 -91 164 -65 179 -84 71 -105 -230
6136b30L42J45Lj81j60K44k56n9J13J04J11k24j4K01k43J67KJ96l01J2N8q0J79
$$ -230 112 257 260 79 -81 163 -93 -152 -39 65 176 -48 -62 139 -104 63 65 261 -40 -28 30 -50 129
6159A29j65k09K65j86Q3r0K14o0j55K45p5K58j74N1J15j64m0O6O2j56R8j56o5
$$ 129 -36 -245 20 -166 -83 -173 41 -19 -174 71 -4 254 80 131 246 82 42 108 170 14 112 -44 -109
6182a09K31j06j31K35m48K12Q6l6j73L19m1q1J35l68L02J06m0k78J20P7m4J04
$$ -109 122 16 -115 120 -328 -116 -30 -66 -239 80 39 -42 93 -275 27 133 93 -185 -65 12 -32 72
6204G2J8j23K77j14l17J7J23J2k19K73n5mR6j6O6j62J47P8k7j50J17j67j9j73
$$ 72 90 -33 244 130 -187 -170 -47 -35 -254 19 -36 -40 56 40 106 -56 91 169 142 -8 109 -58 -77 -250
6228b50L25k54R6J78K56l53j17K33k78j15L14n8k24J94o3j13p1L70p6J36k64O5
$$ -250 75 -179 -83 95 351 -2 -119 114 -164 -279 35 -23 -247 -53 -116 -229 -300 70 -6 130 -134 -69
6250f9K34r5j45K8R1j50N7J30j88J00J23J47j59j54jk5K24q6k22K71j39L0J28
$$ -69 165 70 -75 -47 44 -106 -49 81 -107 -7 116 263 104 -50 -51 -76 148 62 -160 111 -28 2 130
6273A30j92K61k51m8p4K03J99m80K12L88l14K02n40J65L15k60O3k15K38J4r3o1
$$ 130 -62 199 -52 -100 -174 29 228 -252 -40 348 34 236 -304 -139 176 -84 -21 -236 2 16 -77 -138
6295a38LM5J04J35k93J21k2j19K25J4J1j23m9P7K51j19m1q2K86p4m89L18m3K9
$$ -138 -135 -90 14 149 -144 -23 -45 -164 61 75 86 -37 -86 -9 242 123 82 0 286 212 -277 41 -2 27
6319B7lk9N6M6k5o8mJ85l50J15p8K85N9j01M4j45o1K02q2j58J11N1o3j24J83K9
$$ 27 24 -5 51 97 72 4 0 185 -165 -50 -128 157 216 115 159 14 -47 155 73 -85 26 77 14 -110 73 102
6345A02j46O6m5J35rk32J27k55M89N3l35j48J38j85K25l0k6P4J97k68K28J57k34
$$ 102 -44 22 -23 112 103 -129 -2 -257 232 285 -50 -198 -60 -245 -20 -50 -76 -2 195 -73 155 312 78
6368G8P0j19j15J60j89J23l1K3J26j1n9r3J0J28M1o6l7J6j04K93j21j54j76N2
$$ 78 148 29 -86 74 -115 8 -23 0 126 115 56 -37 -27 101 142 76 39 55 -49 244 123 -31 -207 -155
6392a55Ko5pJ18J26q7K17o3N9l6p1l1k41L84j8o0k9k15q6L67j24pQ7K3r3j29L06
$$ -155 -153 -218 -225 -107 19 -68 149 86 145 109 38 7 -234 150 132 72 43 -172 -258 109 -15 -22 65 88 -5 -134 172
6419A72k81K23r2r8K29Pj96L2k22Q2P9K82q0L1j88j18K30k16J60J24l14J68J79
$$ 172 -109 114 22 -76 153 160 -36 -4 -226 -144 -65 217 137 168 -20 -138 92 -124 36 160 -154 14 193
6442A93k09K29j87R1J0l68J28R5j82L00Jj91N5J67k72M78n86J84K1j84J19Q7j
$$ 193 -16 213 26 117 127 -241 -113 -18 -200 100 101 -90 -35 132 -140 338 -248 -64 -43 -227 -108 -21 -22
6465b2J78k06N4P8q2j8J84j82n3o5K15J63j56p3n3k26K45j54j51L33j35L45k42
$$ -22 156 -50 4 82 0 -18 166 -16 -69 -134 81 244 88 15 -38 -264 -19 -173 -324 9 -126 219 -23
6488b3R6r1o4Q4k12K88j58J07K65j28l60M39m19J11K81J23l36J32l23L81Q6l96
$$ -23 73 -18 -82 2 -210 78 -80 27 292 164 -196 243 -176 -65 216 339 3 135 -188 193 279 -117
6510a17K70j76n17L96J13m4L3j9O6J4K19m16L97m45P3N2K11n0Jj29L02j45k88
$$ -117 153 -23 -540 -144 -31 -75 -42 -61 5 19 238 -178 219 -226 -153 -101 110 60 61 -68 234 89 -199
6533a99J55J03J86m73K38K08l19K49l69K96j8p1P9r9R6o1m20L07K61m61N12k68
$$ -199 -44 59 245 -228 10 218 -101 148 -221 75 57 -14 65 -34 62 1 -419 -112 149 -312 200 -68
6555f8K32J54k61r4o0L28j56M0M2r0M4o36N35P8j00oO6O6j36p6L0K82j90j8k56
$$ -68 164 318 57 -37 -97 231 75 115 157 67 111 -525 10 88 -12 -18 48 114 -22 -98 -68 214 24 6 -250
$$ [...]
8191A65
##END NTUPLES=NMR FID
##END=
