##TITLE=1H_DE-92k_TFA
 200.13MHz,CDCl3 ,
 8 sc
 
 13.8.2025
##JCAMPDX= 6.0         $$ Bruker NMR JCAMP-DX V2.0
##DATA TYPE= NMR FID
##DATA CLASS= NTUPLES
##ORIGIN= UXNMR, Bruker Analytische Messtechnik GmbH
##OWNER= pz
$$ XWIN-NMR		Version 3.5
$$ Wed Aug 13 16:29:38 2025 Russian Standard Time (UT+4h)  she@DPX200
##.OBSERVE FREQUENCY= 200.1313
##.OBSERVE NUCLEUS= ^1H
##.DELAY= (6, 6)
##.ACQUISITION MODE= SIMULTANEOUS
##.ACQUISITION SCHEME= undefined
##.AVERAGES= 8
##.DIGITISER RES= 18
##SPECTROMETER/DATA SYSTEM= spect
##.PULSE SEQUENCE= zg30
##.SOLVENT NAME= CDCl3
##.SHIFT REFERENCE= (INTERNAL, CDCl3, 0, 14.3821)
##AUDIT TRAIL= $$ (NUMBER, WHEN, WHO, WHERE, WHAT)
$$ ##TITLE= Audit trail, XWIN-NMR		Version 3.5
$$ ##JCAMPDX= 5.01
$$ ##ORIGIN= Bruker BioSpin GmbH
$$ ##OWNER= she
$$ F:/spectra/data/she/nmr/H-C/1/audita.txt
$$ ##AUDIT TRAIL=  $$ (NUMBER, WHEN, WHO, WHERE, WHAT)
(   1,<2025-08-13 16:28:33.34 +0400>,<she>,<DPX200>,
      <created by zg, POWCHK disabled, PULCHK disabled
       configuration hash MD5:
       00 E9 B6 7A A2 85 ED C7 34 08 36 98 17 FE 4E 26
       data hash MD5: 16K
       31 B0 BB 5A CD 0E C9 CD DE 85 AD 23 28 9A C8 AB>)
$$ ##END=
$$ 
$$ hash MD5
$$ 1A FF F8 E2 D1 AF 7A A8 AE 76 6E CB 5A E3 43 83
##$RELAX= 
##$RELAX= 
##$RELAX= 
##$RELAX= 
##$RELAX= 
##$RELAX= 
$$ Bruker specific parameters
$$ --------------------------
##$DU= <F:/spectra>
##$EXPNO= 1
##$NAME= <H-C>
##$PROCNO= 1
##$TYPE= <nmr>
##$USER= <she>
##$AMP= (0..31)
100 100 100 100 100 100 100 100 100 100 100 100 100 100 100 100 100 100 
100 100 100 100 100 100 100 100 100 100 100 100 100 100 
##$AQSEQ= 0
##$AQ_mod= 1
##$AUNM= <au_zg>
##$AUTOPOS= <>
##$BF1= 200.13
##$BF2= 200.13
##$BF3= 200.13
##$BF4= 200.13
##$BF5= 200.13
##$BF6= 200.13
##$BF7= 200.13
##$BF8= 200.13
##$BYTORDA= 1
##$CFDGTYP= 0
##$CFRGTYP= 5
##$CHEMSTR= <none>
##$CNST= (0..31)
1 1 145 1 1 1 1 1 1 1 1 1 1 1 1 1 1 1 1 1 1 1 1 1 1 1 1 1 1 1 1 1 
##$CPDPRG= <>
##$CPDPRG1= <>
##$CPDPRG2= <>
##$CPDPRG3= <>
##$CPDPRG4= <mlev>
##$CPDPRG5= <mlev>
##$CPDPRG6= <mlev>
##$CPDPRG7= <mlev>
##$CPDPRG8= <mlev>
##$CPDPRGB= <>
##$CPDPRGT= <>
##$D= (0..31)
0 0.7 0 0 0 0 0 0 0 0 0 0.03 0 0 0 0 0 0 0 0 0 0 0 0 0 0 0 0 0 0 0 0 
##$DATE= 1755088112
##$DBL= (0..7)
120 120 120 120 120 120 120 120 
##$DBP= (0..7)
150 150 150 150 150 150 150 150 
##$DBP07= 0
##$DBPNAM0= <>
##$DBPNAM1= <>
##$DBPNAM2= <>
##$DBPNAM3= <>
##$DBPNAM4= <>
##$DBPNAM5= <>
##$DBPNAM6= <>
##$DBPNAM7= <>
##$DBPOAL= (0..7)
0.5 0.5 0.5 0.5 0.5 0.5 0.5 0.5 
##$DBPOFFS= (0..7)
0 0 0 0 0 0 0 0 
##$DE= 6
##$DECBNUC= <off>
##$DECIM= 32
##$DECNUC= <off>
##$DECSTAT= 4
##$DIGMOD= 1
##$DIGTYP= 9
##$DL= (0..7)
0 120 120 120 120 120 120 120 
##$DP= (0..7)
150 150 150 150 150 150 150 150 
##$DP07= 0
##$DPNAME0= <>
##$DPNAME1= <>
##$DPNAME2= <>
##$DPNAME3= <>
##$DPNAME4= <>
##$DPNAME5= <>
##$DPNAME6= <>
##$DPNAME7= <>
##$DPOAL= (0..7)
0.5 0.5 0.5 0.5 0.5 0.5 0.5 0.5 
##$DPOFFS= (0..7)
0 0 0 0 0 0 0 0 
##$DQDMODE= 0
##$DR= 18
##$DS= 0
##$DSLIST= <SSSSSSSSSSSSSSS>
$$ [...]
##$SUBNAM0= <"">
##$SUBNAM1= <"">
##$SUBNAM2= <"">
##$SUBNAM3= <"">
##$SUBNAM4= <"">
##$SUBNAM5= <"">
##$SUBNAM6= <"">
##$SUBNAM7= <"">
##$SUBNAM8= <"">
##$SUBNAM9= <"">
##$SW= 18.0517328524113
##$SWIBOX= (0..15)
0 0 2 0 0 0 0 0 0 0 0 0 0 0 0 0 
##$SW_h= 3612.71676300578
##$TD= 16384
##$TD0= 1
##$TE= 0
##$TE2= 300
##$TE3= 300
##$TEG= 300
##$TL= (0..7)
0 120 120 120 120 120 120 120 
##$TP= (0..7)
150 150 150 150 150 150 150 150 
##$TP07= 0
##$TPNAME0= <>
##$TPNAME1= <>
##$TPNAME2= <>
##$TPNAME3= <>
##$TPNAME4= <>
##$TPNAME5= <>
##$TPNAME6= <>
##$TPNAME7= <>
##$TPOAL= (0..7)
0.5 0.5 0.5 0.5 0.5 0.5 0.5 0.5 
##$TPOFFS= (0..7)
0 0 0 0 0 0 0 0 
##$TUNHIN= 0
##$TUNHOUT= 0
##$TUNXOUT= 0
##$USERA1= <user>
##$USERA2= <user>
##$USERA3= <user>
##$USERA4= <user>
##$USERA5= <user>
##$V9= 5
##$VALIST= <valist>
##$VCLIST= <CCCCCCCCCCCCCCC>
##$VD= 0
##$VDLIST= <DDDDDDDDDDDDDDD>
##$VPLIST= <PPPPPPPPPPPPPPP>
##$VTLIST= <TTTTTTTTTTTTTTT>
##$WBST= 1024
##$WBSW= 4
##$XGAIN= (0..3)
0 0 0 0 
##$XL= 0
##$YL= 0
##$YMAX_a= 160237
##$YMIN_a= -151123
##$ZGOPTNS= <>
##$ZL1= 120
##$ZL2= 120
##$ZL3= 120
##$ZL4= 120
##$ABSF1= 10
##$ABSF2= 0
##$ABSG= 5
##$ABSL= 3
##$ALPHA= 0
##$AQORDER= 0
##$ASSFAC= 0
##$ASSFACI= 0
##$ASSFACX= 0
##$ASSWID= 0
##$AUNMP= <proc_1d>
##$AZFE= 0.1
##$AZFW= 0.1
##$BCFW= 1
##$BC_mod= 2
##$BYTORDP= 1
##$COROFFS= 0
##$CY= -3
##$DATMOD= 1
##$DC= 2
##$DFILT= <>
##$DTYPP= 0
##$F1P= 0
##$F2P= 0
##$FCOR= 0.5
##$FTSIZE= 0
##$FT_mod= 4
##$GAMMA= 1
##$GB= 0.15
##$INTBC= 1
##$INTSCL= 1
##$ISEN= 128
##$LB= 0.25
##$LEV0= 0
##$LPBIN= 0
##$MAXI= 10000
##$MC2= 0
##$MEAN= 0
##$ME_mod= 0
##$MI= 1.114404
##$NCOEF= 0
##$NC_proc= 0
##$NLEV= 6
##$NOISF1= 3.799351
##$NOISF2= 2.8
##$NSP= 1
##$NTH_PI= 0
##$NZP= 0
##$OFFSET= 14.38212
##$PC= 1
##$PHC0= -1560.403
##$PHC1= 11.19228
##$PH_mod= 1
##$PKNL= yes
##$PPARMOD= 0
##$PSCAL= 0
##$PSIGN= 0
##$REVERSE= no
##$SF= 200.129724274929
##$SI= 16384
##$SIGF1= 3
##$SIGF2= 2
##$SINO= 400
##$SIOLD= 16384
##$SREGLST= <1H.CDCl3>
##$SSB= 0
##$STSI= 0
##$STSR= 0
##$SW_p= 3205.1282051282
##$SYMM= 0
##$S_DEV= 0
##$TDeff= 0
##$TDoff= 0
##$TI= <>
##$TILT= no
##$TM1= 0
##$TM2= 0
##$TOPLEV= 0
##$USERP1= <user>
##$USERP2= <user>
##$USERP3= <user>
##$USERP4= <user>
##$USERP5= <user>
##$WDW= 1
##$XDIM= 8192
##$YMAX_p= 0
##$YMIN_p= 0
$$ End of Bruker specific parameters
$$ ---------------------------------
##NTUPLES= NMR FID
##VAR_NAME=  TIME,          FID/REAL,        FID/IMAG
##SYMBOL=    X,             R,               I
##VAR_TYPE=  INDEPENDENT,   DEPENDENT,       DEPENDENT
##VAR_FORM=  AFFN,          ASDF,            ASDF
##VAR_DIM=   8192,          8192,            8192
##UNITS=     SECONDS,       ARBITRARY UNITS, ARBITRARY UNITS
##FACTOR=    0.0002768,     1,               1
##FIRST=     0,             0,               0
##LAST=      2.2672688,     0,               0
##MIN=       0,             -151123,         0
##MAX=       2.2672688,     160237,          0
$$ Real data points
##PAGE= N=1
##DATA TABLE= (X++(R..R)), XYDATA
0@%%%%%%%%%%%%%%%qJ6j6J6j6K4l2L2m0M8n6O4p2Q7j00J13j28J45j65J85k08K36
$$ 0 0 0 0 0 0 0 0 0 0 0 0 0 0 0 0 -8 8 -8 8 -8 16 -16 16 -24 24 -32 32 -40 47 -53 60 -68 77 -88 97 -111 125
37A25k65K96l29L65m06M52n00N52o09O72p42Q17r00R92j094J207j330J468j625
$$ 125 -140 156 -173 192 -214 238 -262 290 -319 353 -389 428 -472 520 -574 633 -697 771 -854
56h54J804k009K247k527K861l271L788m459N367o673Q728j2422K1040p7955j4931
$$ -854 950 -1059 1188 -1339 1522 -1749 2039 -2420 2947 -3726 5002 -7420 13620 -64335 -79266
71g9266J81130r6185j01038J68403Q7193j74964l5175J23751R366p6199k8020
$$ -79266 101864 5679 -95359 73044 160237 -14727 -49902 73849 83215 7016 -21004
82b1004l1555K7083N9516q9017r6146J34002R0265j22047l1745J31058M9869n3615
$$ -21004 -52559 -25476 34040 -54977 -151123 -17121 73144 -48903 -80648 50410 100279 46664
94D6664n6344m977Q0292M7744j08777q9175Q4245O0847r7391n0638P4785L0699
$$ 46664 -9680 -14657 65635 113379 4602 -84573 -328 60519 -36872 -87510 -12725 17974
106A7974l5768k0995k172M6929M5151n8729m4616P8612M4292o1555k2284M8872
$$ 17974 -17794 -38789 -40961 5968 51119 -7610 -52226 26386 70678 9123 -13161 35711
118C5711J0837l7660j4907J2414Q531m852l8509l2427M0072L7668m0295k9327
$$ 35711 46548 8888 -6019 6395 14926 10074 -28435 -60862 -20790 16878 -23417 -52744
130e2744L6859M0171l247k5112R087L9295m785l8597m227K2327N628k6065l1355
$$ -52744 -15885 24286 21039 -4073 5014 44309 39524 927 -3300 19027 24655 -1410 -32765
143c2765L922K8345K751k6427n401L2591J1041k7297L761K9693j913j2111m133
$$ -32765 -28843 -498 2253 -24174 -29575 3016 14057 -13240 -9479 20214 18301 6190 2057
156B057n08J9712O203l4668j1223K8979K332k8230m290J6408l822j2794L716N292
$$ 2057 1549 21261 27464 -7204 -18427 10552 12884 -15346 -19636 -3228 -7050 -19844 -16128 -10836
170a0836J1103J5398j7018j1257L4187J0281k7377R6J2613r232q324l094p536
$$ -10836 267 15665 -1353 -12610 21577 31858 4481 4577 17190 7958 -366 -3460 -10996
183a0996J648N414j2869j0092K3044J4887k2636k797K5504K77o908P950m274j594
$$ -10996 -9348 -3934 -16803 -26895 -3851 11036 -11600 -14397 11107 11384 4476 12426 8152 6558
197F558R472j0800j2345J1979N508j9859j1224J4194M779j2506J101N950j325
$$ 6558 16030 5230 -7115 4864 10372 -9487 -20711 -6517 -1738 -14244 -13143 -7193 -8518
210h518R950N183p330J0646J1471j2418n087J0287L51j2068q820L63n52l665q20
$$ -8518 1432 6615 -715 9931 21402 8984 3897 14184 14535 2467 -6353 -5990 -6542 -10207 -11027
225a1027m247J668J0835j752m546J3545P192o911j53M296K828jn614l876j55O21
$$ -11027 -15274 -13606 -2771 -4523 -9069 4476 11668 4757 4604 8900 11728 11727 6113 2237 2082 2703
241B703j693p759j369N121o227n468O863K493j089K504J097N536O503Q60k04P31
$$ 2703 1010 -6749 -8118 -2997 -9224 -14692 -7829 -5336 -6425 -3921 -2824 2712 9215 10075 9871 10602
257A0602J757j035p501k778J211q100n879Q54j406K352K267j729M526P582J676
$$ 10602 12359 11324 3823 1045 2256 -5844 -11723 -10869 -12275 -9923 -7656 -9385 -4859 2723 4399
272D399Q89J664K702k20m467L08K08m418k03k466m283M306L34o024J523K820j430
$$ 4399 5288 6952 9654 9434 4967 5275 5483 1065 862 -1604 -5887 -1581 -1247 -7271 -5748 -2928 -4358
289d358j28Q50J974J602K96K724J318J277M315l251l195L476k346o031o55k589
$$ -4358 -4486 -3636 -1662 -60 236 2960 4278 5555 9870 6619 3424 6900 4554 -1477 -2132 -4721
305d721k433J67j684J432L174J598K272J487L175L387k133j433J297k456j635
$$ -4721 -7154 -6987 -8671 -7239 -4065 -2467 -195 1292 4467 7854 5721 4288 5585 3129 1494
320A494j194l425J076N90l533J701K279n79N70k46Q56J586r12l57N30l6J577l58
$$ 1494 300 -3125 -2049 -1459 -4992 -3291 -1012 -1591 -1021 -1267 -411 1175 263 -94 436 400 1977 1619
338A619j479K901n07k146Q83j099p19M9k520q97J792o38o9J446J759J810n0K58
$$ 1619 140 3041 2534 388 1271 172 -547 -498 -3018 -3915 -2123 -2761 -2830 -1384 375 2185 2135 2393
356B393J827j289j235j43k498J14J15l344M45J880q50R32J477K50K172m21k86
$$ 2393 4220 2931 1696 1553 -945 -831 -716 -4060 -3615 -1735 -2585 -1653 -176 74 2246 1825 1539
373A539J258n92r6j305j475J382j225j946J549q41p70K178j052k06J976m77q76
$$ 1539 2797 2205 2109 804 -671 711 -514 -2460 -911 -1752 -2522 -344 -1396 -1602 374 -103 -979
390i79J370O53O99m73J71J401j375m84M93j669m24M30k115k45Q57j527P61R78
$$ -979 391 1044 1743 1270 1441 2842 1467 983 1476 -193 -617 -187 -2302 -2547 -1690 -3217 -2456 -1478
408a478P9J633N77K72J451QJ76J65j180O83p43k595M15o13j568Q11m30q69J774
$$ -1478 -1399 234 811 1083 2534 2542 2718 2883 1703 2386 1643 -952 -537 -1150 -2718 -1907 -2337 -3206 -1432
427a432j1K41J391P5J049Q01k68R35k21j113O10j040p96q0j334j19J06j342P84
$$ -1432 -1443 -1202 189 264 1313 2114 1846 2781 2560 1447 2057 1017 221 141 -1193 -1312 -1206 -2548 -1764
446a764K19n43J540L47q69J950L11n08J292k79M1K48m30l27q18o19J91j029m55
$$ -1764 -1545 -2088 -548 -201 -1070 880 1191 683 1975 1696 1737 1985 1555 1228 410 -209 -18 -1047 -1502
465a502P06j508K98J479j029J54K102o32j16K350o80m99Q57j08j280m71P93j169
$$ -1502 -796 -2304 -2006 -527 -1556 -1402 700 68 -48 2302 1622 1123 1980 1872 592 121 914 -255
483b55j514J129K98k278J998O25j852J612J431j502N07J236j216l7Q69k93r81
$$ -255 -1769 -640 -342 -2620 -622 3 -1849 -237 1194 -308 199 1435 219 182 1051 758 -223
500b23O60J020j551k29J517j461o21J605j665o26K066r12j506K094k39p61J033
$$ -223 437 1457 -94 -323 1194 -267 -888 717 -948 -1574 492 -420 -1926 168 -71 -832 201
517B01P79p97rR82k91j292J180J99k259J344O84k020R36J314j533L57Q77j141
$$ 201 980 183 174 1156 865 -427 753 952 -1307 37 721 -1299 -363 951 -582 -225 652 -489
535d89L50M77n12m44J92M98o74J71R46m73j86J773j298l47J387p54r14Q26n65
$$ -489 -139 338 -174 -618 -426 72 -602 -431 515 42 -144 1629 331 -16 1371 617 -297 529 -36
554c6q48O22o40j3Q4M43K33k17L40L86k64M38K18m72J77J88n98O16j98p48P72
$$ -36 -884 -262 -902 -915 -831 -388 -155 -372 -32 354 90 528 746 274 451 639 41 657 459 -289 483
575D83m56q78P28O0q58K94L06l20J01L0M05M1J55J032n45q1R28r50k82R54j554
$$ 483 27 -851 -123 -63 -921 -627 -321 -641 -540 -510 -105 -64 91 1123 578 497 1425 475 193 1147 -407
596d07j05R76j187k24O78j25o77N45O56o55J85J069k12r37J459k38j027Q05P0
$$ -407 -512 464 -723 -947 -269 -394 -1071 -526 130 -525 -340 729 517 -420 1039 801 -226 579 649
615F49r77O40L21j281L48N14q77k92P71P7p22N87J037j116M3J196j084J03J317
$$ 649 -328 312 633 -648 -300 214 -663 -955 -184 -107 -829 -242 795 -321 -278 918 -166 -63 1254
634A254r69n04J214n72p66P04j42n87Q3M24p15J78L66j54n38Q72J61p40N41N52
$$ 1254 285 -219 995 423 -343 361 219 -368 -285 139 -576 -398 -32 -186 -724 148 309 -431 110 662
654F62r16O79R9n93M80l31j9j76K1K38l70m23R18k51k76O01p19q4P66o23N1J68
$$ 662 -254 425 524 -69 411 80 61 -115 -94 144 -226 -649 269 18 -258 343 -376 -460 306 -317 -266 -98
676i8N9j38O45j65M7j21M2K84k14l67K19n53n4L87p02L41N59m40J48J20j12L78
$$ -98 -39 -177 468 303 350 229 271 555 341 -26 193 -360 -414 -27 -729 -388 171 -269 -121 -1 -113 265
698B65j25r1K25j16j00L64j29k12M63l81J09n7k7j79m96J07K92m12L0K58m62L07
$$ 265 140 49 274 158 58 422 293 81 544 163 272 215 188 9 -487 -380 -88 -500 -470 -212 -674 -367
720c67N90k21L62Q7m28O21n2j66k97j10J02m71l06M13j60m77N49K23l62O04L55
$$ -367 223 2 364 451 23 644 592 426 129 19 121 -350 -656 -243 -403 -880 -331 -108 -470 134 489
741D89p93O00K9K0olk03J83L3q9m33M78j67p00J43L29l92j68M42l11J72M92l03
$$ 489 -304 296 325 345 339 336 133 316 349 260 -173 305 138 -562 -419 -90 -482 -650 -208 -519 -347 145 -158
764a58N32j90j9L39j71K6J4j37ml0m46J24j50l03K58O0k04M3M00k21M33m5J17
$$ -158 374 184 165 504 333 359 373 236 232 202 -244 -120 -270 -573 -315 -255 -459 -416 -16 -237 196 151 268
787B68M3j50K67J34m18M2K76k57mj25J01k63n24K87L32n45K39L05k22M19k48J80
$$ 268 311 161 428 562 144 186 462 205 201 76 177 -86 -610 -323 9 -536 -297 8 -214 205 -43 137
809A37J03J49j93Mj5Q4k01m63M28j05j28L1K6n2L70l06L8J61n1j88L81k30J24
$$ 137 240 389 196 200 185 269 68 -395 33 -72 -200 -169 -143 -195 175 -131 -93 68 17 -171 210 -20 104
832A04J2K8j61K99k99J72j07J31j50k14L8K57l02L66J50l19k3J3J0j17P6j56L38
$$ 104 116 144 -17 282 -17 155 48 179 29 -185 -147 110 -192 174 324 5 -18 -5 5 -112 -36 -192 146
855A46k21J62k8k47M24l67k1K71r5ML01n30J7J23j74n8O2J09m6K49j67K42m65
$$ 146 -75 87 59 -188 236 -131 -152 119 24 28 329 -201 -184 -61 -235 -293 -231 -122 -168 81 -86 156 -309
878c09L07J98k47j17K72l9o7J73j41P9k79N1K66k93j32N0Lj70L53k45J43K61j36
$$ -309 -2 196 -51 -168 104 65 -2 171 30 109 -170 -119 147 -146 -278 -228 -225 -395 -42 -287 -144 117 -19
901a9J76m8j51L46l0j82R1kj05n2k55K69l57j88L26J97j89N3J9k02K70j70L19
$$ -19 157 109 -42 304 274 92 183 181 76 24 -231 38 -319 -507 -181 16 -173 -120 -101 -303 -33 -203 116
924A16J20m63L92J86l30M25j11k81J65J4l21n3j7q9k3LN5K26K38Q4j29j01K17
$$ 116 236 -227 165 351 21 446 335 54 219 233 -88 -141 -158 -247 -270 -267 -212 14 252 336 207 106 323
947C23j82J30L9m13L95k48k30Q2M8k75L79j48PJ61k26L49j35o6P6n9j20N41l6
$$ 323 141 271 310 -103 292 44 -186 -104 -56 -331 48 -100 -93 68 -158 191 56 -10 66 7 -113 428 392
970C92l35L58l40j15J8j09K15k88o1J64r1K8Pj71M4J95K63j87L95j71q0L11l10
$$ 392 57 415 75 -40 -22 -131 84 -204 -265 -101 -192 -164 -157 -328 -284 -89 174 -13 382 211 131 442 132
993A32j44J56m27L9L64Q0l57n5Q5R0L5n2L32o16K63K35k98K41Rl00J85k57L08
$$ 132 -12 144 -283 -244 120 200 -157 -212 -127 -37 -2 -54 278 -338 -75 160 -138 103 112 -188 -3 -260 48
1016D8j61K29l65K48K82k89L1k71M12k22R7n4J7p0J00j5o3K05o6PP2m39L80J96
$$ 48 -113 116 -249 -1 281 -8 23 -248 164 -58 39 -15 2 -68 32 17 -46 159 93 100 172 -267 113 309
1040C09l08K55m72J15n5K54j14K06l74J11K53m05M07k2k94K18L1k06j61J92Q1
$$ 309 1 256 -216 -101 -156 98 -16 190 -184 -73 180 -225 182 160 -134 84 115 -91 -252 -60 21
1061B1n2J83r9j40N9O9M2l77L42l7k83K83k04Q3N5Rj82K73J07L6j95J67J54r5
$$ 21 -31 152 53 -87 -28 41 83 -294 48 11 -272 11 -193 -110 -55 -46 -228 45 152 188 -7 160 314 219
1085B19k44K19j48k18L30l61%M16m87R4J48j18j97K66k74L79L1K37K64l01M7l97
$$ 219 -25 194 46 -172 158 -203 -203 213 -274 -180 -32 -150 -347 -81 -355 24 55 292 556 255 302 -95
1107i5N0K84j29k4Kk58J31j27kl6K54m57J57k6N59j97k03J39Q6r7L20j57l10K7
$$ -95 -45 239 110 86 88 -170 -39 -166 -168 -204 50 -407 -250 -276 283 86 -117 22 108 11 331 174 -136 -109
1131a09N30n50Rr8m1M8K44l74K93j3n4R8P4J13k08J49K77k73m64O46j78j40j51
$$ -109 421 -129 -120 -218 -259 -211 33 -341 -48 -61 -115 -17 57 170 -38 111 388 115 -349 297 119 -21 -172
1154a72J72l15N47m39k8Q4N4J44j76j38M05M8j24o6K23l37L16j73J06q3p0J23
$$ -172 0 -315 232 -207 -235 -151 -97 47 -129 -267 138 186 62 -4 219 -118 198 25 131 48 -22 101
1176A01P3j86k7j47j80M69k17k5j69L38p2J3O2J24j75R9k07O0LK03k49L1J87k09
$$ 101 174 -12 -39 -186 -366 103 -114 -139 -308 30 -42 -29 33 157 -18 81 -126 -66 -63 140 -109 -78 109 -100
1200a00p8K75k37j42K88J25l07l1L43j38J44KK2M2q1rj61K12k40j18L68r9l56
$$ -100 -178 97 -140 -282 6 131 -176 -207 136 -2 142 144 166 208 127 118 -43 169 -71 -189 179 80 -276
1223b76P7j00J95R2Q8J5j07r3K46j02k82Q2J75j12J49J62m13M14J2j78L9P8m81
$$ -276 -199 -299 -104 -12 76 91 -16 -109 137 35 -247 -165 10 -102 47 209 -204 210 222 44 83 161 -320
1246c20L48j49l5L27l51J71k10L74pj60NL9q5j39M96k44J88m09N04l31l6K89m93
$$ -320 28 -121 -156 171 -180 -9 -219 155 148 -12 -7 32 -53 -192 304 60 248 -161 343 12 -24 265 -228
1269b28R8N7j84L3M02l45r7R5M18l44K93l78L30L52l98J47J13m69r0L18k49J58
$$ -228 -130 -73 -257 -224 178 -167 -264 -169 249 -95 198 -180 150 502 104 251 364 -105 -195 123 -126 32
1291C2o0qj48J1P0N0J7J12j63m5K10N5k57R9J69m22J92K00p3J66p9k58k2K28j27
$$ 32 -28 -36 -184 -173 -103 -53 -36 76 -87 -132 78 133 -124 -25 144 -278 -86 114 41 207 128 -130 -152 76 -51
1316e1N0J84o0l12K02lk27L37j5j26K7j44R4Q5k97K31m6L44m14N7P2J55j67m1
$$ -51 -1 183 123 -189 13 10 -217 120 105 -21 6 -138 -44 41 -256 -25 -71 273 -141 -84 -12 143 -24 -65
1340f5J3P4k4J83q6j72J8j9J64N0O6k33N0J74l93Mk22K44L94m09Q5k03J97J93
$$ -65 -52 22 -2 181 95 -77 -59 -78 86 136 202 -31 19 193 -200 -196 -418 -174 220 -189 -104 -307 -110 83
1364H3n8k29K68k73K17K14j57j57K28O6j17k0n5k18q4N84l38P0rq7n5M03m71K12
$$ 83 25 -204 64 -209 8 222 65 -92 136 202 85 65 10 -208 -292 292 -46 24 15 -72 -127 276 -195 17
1388A7J44q0j56K05j09l0N9j94K31PQ9k79K93j10j76j92L74M7k49P9J47j72N8
$$ 17 161 81 -75 130 21 -9 50 -144 87 94 183 -96 197 87 -89 -281 93 140 -109 -30 117 -55 3
1411CJ89j53o0P9j38j3K08j34K52K2k54j82R6k77K58K8K11l09J7l7K99J36j56
$$ 3 192 39 -21 58 -80 -93 115 -19 233 255 1 -181 -85 -362 -104 -76 135 -174 -157 -194 105 241 85
1434H5l9J27K04m08L5K17j21j60K34l11O9J63J06j43j02lP5j43J2J38k35L63l22
$$ 85 46 173 377 -31 4 221 100 -60 174 -137 -68 95 201 58 -44 -47 28 -115 -103 35 -200 163 -159
1457a59J59K20j04l09M23q5k42J11K8J00O4k60l6N9k9m6j90L02j80J17M3r9Q3
$$ -159 0 220 116 -193 230 145 -97 14 42 142 206 -54 -90 -31 -60 -106 -296 6 -174 -57 -14 -113 -30
1480c0J88j40L18l89m6k4J81J0k80L05J38l37J96m56M51j88K74Mj53R2l4j10j01
$$ -30 158 18 336 -53 -99 -123 58 68 -212 93 231 -106 90 -366 85 -103 171 175 22 114 80 -30 -131
1503a31mJ08L5j06K49p9L3j25J60k95J22M39k18l21Q6K15k3j25J94j58r6K92k36
$$ -131 -135 -27 8 -98 151 72 105 -20 140 -155 -33 406 188 -133 -47 168 145 20 214 56 -40 252 16
1526A6J64j89J03j45L83k51J30J30l48NK7j65J2Q6P7KJ28r0j7K33k53o1j95L06
$$ 16 180 -9 94 -51 332 81 211 341 -7 -2 25 -140 -128 -42 35 37 165 75 58 291 38 -23 -218 88
1550H8j57J77q9k10M27j53Ql6k02J33LR2q2m6j89R8M10k22p2j32m4L09k3o4nM3
$$ 88 -69 108 19 -191 236 83 91 55 -147 -14 -11 81 -1 -47 -236 -138 272 50 -22 -154 -198 111 88 24 19 62
1576F2j40QK68l03K08j28m49N75J25l12L60o1k91j15K81j28j95K39r1K39j0O0
$$ 62 -78 -70 198 -105 103 -25 -474 101 226 -86 274 213 -78 -193 88 -40 -235 4 -87 152 142 202
1598B02j68j3K7K18m82K45j11J27P0k31k22K87L5r0%P8j38J04k5J91J40m28K41
$$ 202 34 21 48 266 -216 29 -82 45 115 -116 -338 -51 -16 -106 -106 -28 -166 -62 -87 104 244 -184 57
1621E7l3Q8l62L43J20l10q6J25Rk2K60k48J07J1j35O0L05k19J20k36J73r4n7J59
$$ 57 24 112 -250 93 213 -97 -183 -58 -49 -71 189 -59 48 59 -76 -16 289 70 190 -46 127 33 -24 135
1645A35l31J80l2k8J26R7j31j07j02q9Q7K86j8J53m06L74j57K49n6k46m3L9O0
$$ 135 -196 -16 -48 -76 50 147 16 -91 -193 -282 -195 91 73 226 -180 194 37 286 230 -16 -59 -20 40
1668D0j03r6J68n1q6K00k40m4K19J36j8k99pR5M40p4N1j07j94O1l0M6j93m2J02
$$ 40 -63 -159 9 -42 -128 72 -168 -212 7 143 125 -174 -181 -86 354 280 331 224 30 91 61 107 -86 -128 -26
1693b6K81l19o5K98j62J09k87K26kj41k2M85n28N4P9K06L66p19R1J14J02k47K35
$$ -26 255 -64 -129 169 7 116 -171 55 53 -88 -110 375 -153 -99 -20 186 552 -167 -76 38 140 -107 128
1716A28j12j22O0j51J08L63l26m0R4O3N2J43k39j18l6K95j63N1J75j73j10k70
$$ 128 16 -106 -46 -197 -89 274 -52 -92 2 65 117 260 21 -97 -133 162 -1 50 225 52 -58 -328
1738c28J26J03M08l79j2K4p6K07j8k93J54J21J98L2k36p7M7J56k54M20m62m1K89
$$ -328 -202 -99 309 -70 -82 -58 -134 73 55 -238 -84 37 235 267 31 -46 1 157 -97 323 -139 -180 109
1761A09k07L43j81q6J18j06l2p1J60p1M56m48m6J44N6j86J44m3q0J9n7J37j65
$$ 109 -98 245 64 -22 96 -10 -42 -113 47 -24 432 -16 -62 82 138 -48 96 53 -27 -8 -65 72 -93
1784i3l4J23jL7l8j27Q8j34k7L21k57M1J32K5k11n4J35K43j56k6o6J98j51L21
$$ -93 -127 -4 -5 32 -6 -133 -45 -179 -206 115 -142 -101 31 56 -155 -209 -74 169 13 -13 -79 119 -32 289
1808B89j24l16J25J23j38n8O7J83k04k6K2k71M31j61L80l06J19o4k31K19l5k62
$$ 289 165 -151 -26 97 -41 -99 -32 151 -53 -79 -57 -328 103 -58 322 16 135 71 -160 59 24 -238
1830b38K07M1m38K91J88Lj89Q7J52pk19N8K39k43J41k38r4K95r5L0j37O5m4m8
$$ -238 -31 10 -428 -137 51 54 -135 -48 104 97 -122 -64 175 -68 73 -165 -259 36 -59 -29 -166 -101 -145 -193
1854a93K60P7Ql29K76k77J0J59j1Q5j39J44k15M7J99j24p4K39l20K00l34J91R7
$$ -193 67 144 152 -177 99 -178 -168 -9 -20 65 -74 70 -145 -98 101 -23 -97 142 -178 22 -312 -121 -24
1877b4qO0l36J10J12J60k12J34n2J21j05m9K35N5j0j10m4np3pK07j40mj35N2J8
$$ -24 -32 28 -308 -198 -86 74 -138 -4 -56 65 -40 -89 146 201 191 81 37 32 -41 -48 159 19 15 -120 -68 -50
1903e0PK48k18k01R5J80l0J88j6lp7j19j19J44J4k30J79j09o8J61k59P1M52k07
$$ -50 -43 205 -13 -214 -119 61 31 219 203 200 123 4 -115 29 43 -187 -8 -117 -185 -24 -283 -212 240 33
1927C3k55L50k58r9M25l56K28j30mO5Q3P8J26k03j91r2J63K21j3m03K96J6l1J01
$$ 33 -222 128 -130 -229 196 -160 68 -62 -66 -1 82 160 286 83 -108 -200 -37 184 171 -232 64 80 49 150
1951A50j68r6KJ65p1N9M1n6n0m0K54m44J18o8J13o5P0K83j55R4l32J71Q7LM4R7
$$ 150 -18 -114 -112 53 -18 41 82 26 -24 -64 190 -254 -136 -204 -91 -156 -86 197 42 136 -196 -25 62 65 109 206
1977B06j69M0k52K94l05P4l7J19j31K35q0n5J88j50N5J00l19J57L40l40p7R1J00
$$ 206 37 77 -175 119 -186 -112 -149 -30 -161 74 -6 -61 127 -23 32 132 -187 -30 310 -30 -107 -16 84
2000H4k21l5K78j12k5k6J31p1Qp3p2j91L32Qk2L55k97j6R0j26l0J03k02M9n2j5
$$ 84 -137 -172 106 -6 -31 -57 74 3 11 -62 -134 -325 7 15 -7 348 51 35 125 -1 -31 72 -130 -81 -133 -148
2026a48M4L6J48j27R4L1j33J91Q3k81M5R6j89J42l1P1M3L7k44O3j02J77q1n7L01
$$ -148 -104 -68 80 -47 47 78 -55 136 219 -62 -17 79 -110 32 1 72 115 152 -92 -29 -131 46 -35 -92 209
2051B09k33r6J86j2k88K98J72k66j93K73m6J22j59l8L1q4L36l07K65K47k89j71
$$ 209 -24 -120 66 54 -234 64 236 -30 -223 50 4 126 -33 -71 -40 -124 212 -95 170 417 128 -43
2073d3K46j42j75K39j72R8K67l31Q1K92l93qJ12l15J31L30l35n3J94%k06J29J09
$$ -43 203 61 -114 125 -47 51 318 -13 68 360 -33 -41 71 -244 -113 217 -118 -171 23 23 -183 -54 55
2096E5M5k84L63k9j69J55Q8n03J95K12j80L61k18q7K89k84J14j89l95N18n6j80
$$ 55 100 -184 179 150 -19 136 224 -279 -84 128 -52 309 91 4 293 9 123 -66 -461 57 1 -179
2118a79k18M87k10K69k66J31M1k03O5J10q6K13j13oj13K21j80J42l36M81l42K1
$$ -179 -397 90 -120 149 -117 14 55 -148 -83 27 -59 154 41 35 -78 143 -37 105 -231 250 -92 -71
2140g1o8Q4M7j51K18J26n47K41K57j34k31K56L3j67R8L8K26l49L3l1j08j10M98
$$ -71 -139 -55 -8 -159 59 185 -362 -121 136 2 -229 27 60 -107 -9 29 255 -94 -61 -92 -200 -310 188
2163A88l0j71M5P6j9m8j11q0j1J62j97L01k35J44k10K14n9p2R3J60k3k16J57K51
$$ 188 158 -13 32 108 89 41 -70 -150 -161 1 -196 105 -130 14 -196 18 -41 -113 -20 140 117 -99 58 309
2187C09k68Q2j51J29j93Q2J9l7j48K54k77M73J37m99K90m79N08j53r3J23K9k78
$$ 309 41 123 -28 101 -92 -10 9 -28 -176 78 -199 274 411 -88 202 -277 231 78 -15 108 137 -141
2209a41J5J83n6k07J74j80l8J53K04j74q3N44l23K01%q3k5j25o5Q4o8l2J13j48
$$ -141 -126 57 1 -206 -32 -212 -250 -97 107 -67 -150 394 71 272 272 189 164 39 -26 58 -10 -42 71 -77
2233g7m7K17j2K13q1k98mn3O18n02q8L8pJ83j65O3j54J01J72q2j6r0r3J03Q6Q
$$ -77 -124 93 81 294 213 -85 -89 -142 476 -26 -114 -76 -83 100 -65 -2 -156 -55 117 35 19 -71 -164 -61 25 33
2259C3J05J7k1J7j48oR1n9j16R0j42K89L9j46j30J34oj82J99J47l68j96M63J25
$$ 33 138 155 134 151 3 -3 88 29 -87 3 -139 150 189 43 -87 47 41 -141 58 205 -163 -359 104 229
2283B29k39J37k18O2k9J44j4k08J80p8J88n0p3Q3n3k92K66j26Q3n8J5k22K51r8
$$ 229 -10 127 -91 -29 -58 86 72 -136 44 -34 154 104 31 114 61 -231 35 -91 -8 -66 -51 -273 -22 -120
2307a20p9L64p7k0K4p8J87k28o4M1J14r4M8r1l04K93p6K08j51J55r1R8k68K72
$$ -120 -199 165 88 68 92 14 201 -27 -91 -50 64 -30 18 -73 -377 -84 -160 48 -103 52 -39 59 -209 63
2331F3k30J09O6k2m5J74l0K8m24N45j96O1j88k07Q4L42r1Q7M3k08k1j6K30j38
$$ 63 -167 -58 8 -14 -59 115 85 113 -311 234 38 99 -89 -296 -212 130 39 126 169 -39 -60 -76 154 16
2355A6K90l57J57k88J47L0k4RM0Rm8j46K69N2k16J84l08L34k06j05J40K54n5r
$$ 16 306 -51 106 -182 -35 -5 -29 -20 20 29 -19 -165 104 156 -60 124 -184 150 -56 -161 -21 233 178 169
2379A69r4j82K33k75K42J74q4j64J14r8j10K57l59L65N6r4j84L0L8k15K10m8Q8
$$ 169 75 -107 126 -149 93 267 183 19 133 35 -75 182 -177 188 244 150 -34 -4 34 -181 29 -19 69
2402F9j10qJ03k32K19k35J64K25k32r2P6J7k4M3L5M4K22k11N0Q4j93l4J5K28j8
$$ 69 -41 -49 54 -178 41 -194 -30 195 -37 -129 -53 -36 -60 -17 18 62 284 73 123 207 14 -20 -5 223 205
2427B05j28j07j8l8K15j71p6M7R9M3k25K22oJ09k13K34k67J40j46N8J54k80j28
$$ 205 77 -30 -48 -86 129 -42 -118 -71 28 71 -154 68 62 171 -42 192 -75 65 -81 -23 131 -149 -277
2450b77J79O1j20J52n6j13K19j95M0K16k51J53j0j05M6K27m2n6j53J49j38j97
$$ -277 -98 -37 -157 -5 -61 -174 45 -150 -110 106 -145 8 -2 -107 -61 166 124 68 -85 64 -74 -271
2472b71K85J43l15K98k77Q5K66j80qj17K58l79J53L36m86K55j08L6J93n1j82k08
$$ -271 14 157 -158 140 -137 -52 214 34 26 -91 167 -212 -59 277 -209 46 -62 -26 167 116 -66 -274
2494b74L71j87p0k03M81M9j52k88K96J11j59j23L73j85K03j94n6K25k01Qo8q2
$$ -274 97 -90 -160 -363 118 167 15 -273 23 134 -25 -148 225 40 243 49 -7 218 17 25 -43 -125
2516a25J49Q7k80J51J23k21J09K52l34L2l8J73M8j71j2j70L40j47l89N67j32J54
$$ -125 24 111 -169 -18 105 -116 -7 245 -89 -57 -95 78 126 -45 -57 -227 113 -34 -423 144 12 166
2538A66M2J0q9j53n9J82q3l0P7j01K63m25K58J23k1l19N1o9J91L4j7K60k01q6
$$ 166 208 218 129 -24 -83 99 16 -14 63 -38 225 -200 58 181 160 -159 -108 -177 14 48 31 291 90 4
2562Dp5J64j23l15M18J33k47J40p0P9k82L72j17K01m46qJ56J26Kr3n1J66k63J66
$$ 4 -71 93 -30 -345 73 206 -41 99 29 108 -174 198 81 282 -164 -172 -16 110 112 19 -32 134 -129 37
2586C7O6p3k80J92j10J27J2O7k18J30k96J91R2p1J05kJ99j86L01j63j85K42l22
$$ 37 103 30 -250 -58 -168 -41 -29 38 -180 -50 -346 -155 -63 -134 -29 -31 168 -18 283 120 -65 177 -145
2609a45K17K8j86K29Jk04P7j73L99m94O98o19J08J58k39M02q5j04k33K46j65J01
$$ -145 72 100 -86 143 144 -60 17 -156 243 -251 447 -172 -64 94 -145 257 172 68 -165 81 -84 17
2631A7J18j20J48M8m5l88J4P6J95r4n2J92m22M37k1l71L72J19m13J74j4p7J3K05
$$ 17 135 15 163 211 166 -222 -208 -132 63 -31 -83 109 -313 124 103 -268 104 223 -190 -16 -30 -107 -94 111
2655A11j91K69r0l84L63j34o6k71L29j54K46J87m63K50j37L0J1L32k72K82k74
$$ 111 -80 189 99 -285 78 -56 -122 -393 -64 -218 28 215 -248 2 -135 -105 -94 238 -34 248 -26
2676b6j16K63q1k83L14J39j58l2j52L77l30OJ43k34R8j41L08J27n61K20q6J72
$$ -26 -142 121 40 -243 71 210 52 20 -132 245 -85 -79 64 -170 -72 -213 95 222 -339 -119 -205 -33
2698c3R3m0j58J86q6J96j02J30j53q0Q1L1l61K03M4P2j77M35l27k04N07l10K17
$$ -33 60 20 -138 48 -38 158 56 186 33 -47 34 65 -296 -93 -49 23 -154 281 -46 -250 257 -53 164
2721A64k00K01j67K31j70k91J4J23q9J39j17K08j69OO8j64K09J64J2J3j31j57
$$ 164 -36 165 -2 229 59 -232 -218 -95 -184 -45 -162 46 -123 -117 -49 -213 -4 160 172 185 54 -103
2743a03J99l73K66Pj5O8k01N8P6k51L08j49J22k88M04k83K50k26J80k22J9J98
$$ -103 96 -277 -11 -4 -19 49 -152 -94 -18 -269 39 -110 12 -276 128 -155 95 -131 49 -173 -154 44
2765D4O4J51k11j43O0j60J66N0Q6j30j61L45o5j22p7j9m2L1P5n8O9K84j41k16
$$ 44 108 259 48 -95 -35 -195 -29 21 107 -23 -184 161 96 -26 -103 -122 -164 -133 -58 -116 -47 237 96 -120
2789a20J91j67J80M26n09K38m37P2J51J79r2j90r6K51j5L2M0p3P5j26L4j15J21
$$ -120 71 -96 84 510 1 239 -198 -126 25 204 112 -78 -174 77 62 94 134 61 136 10 44 -71 50
2812E0M7k44L61k16j90O8N7K3k45L79k51L37k28P6l4JK7J58j89joR9J0o6m7Q4
$$ 50 97 -147 214 -2 -192 -124 -67 -44 -289 90 -161 176 -52 24 -10 -9 18 176 -13 -14 -20 79 89 23 -24 60
2838F0j55P9k49M16p6j63J8k7K42rp0j06K8j04L88n60K17K36k26L34n95L75k28
$$ 60 -95 -16 -265 151 75 -88 -70 -97 145 136 66 -40 -12 -116 272 -288 -71 165 -61 273 -322 53 -175
2861a75K63J05j52k73K75O3K65l78L90j18k64k10N34k24n9l09L04j27m9M2J70
$$ -175 88 193 41 -232 43 106 371 -7 383 265 1 -209 325 101 42 -267 37 -90 -139 -97 73
2882G3m36J26K63K67m20J07mlL2j69K63l37M10k62J09K0P5j01j96R2k9K94k65
$$ 73 -363 -237 26 293 -127 -20 -24 -27 5 -164 99 -238 172 -90 19 39 114 13 -183 -91 -120 174 -91
2905i1P3J08k76J05J25j39L57j91J2Kj04j76K5L28q5J94j44k35L72j19jJ51j95
$$ -91 -18 90 -186 -81 44 -95 262 71 83 85 -19 -195 -170 158 73 267 123 -112 260 141 140 291 96
2928I6J53k15p4J96n06L78K02k15l7J86k52J24L3j87o2K16j08Q8J20k31k7nL27
$$ 96 249 34 -40 156 -350 28 230 15 -22 164 -88 36 69 -118 -180 36 -72 16 136 -95 -122 -127 200
2951B00j77P6m09J31J37n7K98k33j21j17J33L16l28J41K4j13R4L3P1j3l28J96
$$ 200 23 99 -310 -179 -42 -99 199 -34 -155 -272 -139 177 -151 -10 14 -99 -5 28 99 86 -242 -46
2973d6NL00m93n1J44m7K66k80L65k34j20k1K82N5p2r7R3r8K68o24L21r0P3P2O
$$ -46 -41 259 -234 -285 -141 -188 78 -202 163 -71 -191 -212 70 125 53 -44 49 -49 219 -405 -84 -174 -101 -29 -23
2998b3K19o6j07J34j71J25l02M9J20o9K5J71k6jP6P6n02K85J04J8k39j48L41o0
$$ -23 196 130 23 157 -14 111 -191 -142 -22 -91 -66 105 79 78 154 230 -272 13 117 135 -104 -252 89 29
3022B9J79j00j63J67L4l5m31N79l92J08P0k7j73J72L62l71l4K22j95l37L17n3
$$ 29 208 108 -55 112 146 111 -320 259 -133 -25 45 18 -155 17 379 8 -26 196 1 -336 -19 -72
3044g2R1j30J01kJ22K06k02J06k04L4m0r4J10j45l6J47N5j2j4l04L32j80L26k80
$$ -72 19 -111 -10 -12 110 316 114 220 16 50 10 -84 26 -119 -155 -8 47 35 21 -283 49 -131 195 -85
3068h5K36j36k21K62r7j23L55m25J63P0K35l08J01J60l16n9K6J43m0j4nj41K54
$$ -85 151 15 -206 56 -41 -164 191 -234 -71 -1 234 -74 27 187 -129 -188 -162 -19 -59 -73 -78 -219 35
3091C5PJ29k75J37J9lj01r8Q7Q3K7j08j09P9j23o1J87L0L2K1J12k59K02N9ro8
$$ 35 42 171 -104 33 52 49 -52 -150 -63 20 47 -61 -170 -91 -214 -275 -88 -58 -26 -5 107 -152 50 109 100 32
3117C2q6L4O5n6j43L18m1k31l7j21L47j56j7J21r1N6p2J40M0l6r1K7r1K64j49
$$ 32 -54 -20 45 -11 -154 164 123 -108 -145 -266 81 -75 -92 29 -62 -6 -78 62 102 66 -25 2 -89 175 26
3142B6j19J47j78L27l34K40r2Rp0n5R3M9p9l70P81l79k7k61M15N3J44l30j17K03
$$ 26 -93 54 -124 203 -131 109 17 26 -44 -99 -6 43 -36 -406 375 -4 -31 -292 123 176 320 -10 -127 76
3166G6j14j51L09k09l5J41J49j1k16j0L49j47K5Oo9l81L70K12n82O8L91k24R9
$$ 76 -38 -189 120 -89 -124 17 166 155 -61 -71 278 131 156 162 93 -288 82 294 -288 -220 171 -53 46
3189D6J04j83J53j03j3m4l4J6J59m3K3J13l8k14K8M7k5K5PK27j08J94l97L8M0
$$ 46 150 -33 120 17 4 -40 -74 -58 101 58 81 194 156 -58 -30 17 -8 17 24 251 143 337 -60 -22 18
3214A8J98j02n0l71L65P7j20k28m5L15j76J24K3Q1j20J96j9j56j44J62r8J44k0
$$ 18 216 114 64 -307 58 135 15 -213 -258 57 -119 5 28 109 -11 185 166 10 -134 28 -70 74 54
3237E4O5J6j1k1k06J26Lj8J15j24j43J48q0j92K61j12J21k25J22N2l5K43l2l0
$$ 54 119 135 124 103 -103 23 26 8 123 -1 -144 4 -76 -268 -7 -119 2 -223 -101 -49 -84 159 127 97
3261I7k51O6J73k43K53j39J27j30J76j86l3j75K76l5p7J32J78o3R7j30J5l3j88
$$ 97 -154 -88 85 -158 95 -44 83 -47 129 -57 -90 -265 11 -24 -101 31 209 146 243 113 128 95 -93
3284i3O7j6M5k18K47n8m6jL63k03K52o52M49j00L6m9Q6j84jN75n10J77Rk0r8J24
$$ -93 -26 -42 3 -215 32 -26 -72 -73 290 87 339 -313 136 36 72 23 109 -75 -76 499 -11 166 175 155 57 181
3310A81k73r2K89M3j83j2k75L75k7q0n0k3K9q5J97k11L32k9j80P4O9k58L30j81
$$ 181 -92 -184 105 148 -35 -47 -322 53 26 -54 -104 -127 -98 -183 14 -197 135 106 -74 0 69 -189 141 -40
3334d0j36R9J47K62l92q1j46K73j37K46L92o97Q1K19J36p5l21L95j56l73O3L65
$$ -40 -176 -77 70 332 -60 -141 -287 -14 -151 95 487 -210 -129 90 226 151 -170 225 69 -304 -241 124
3356A24j4m25R3Q2J45J9l5QjJ11k99k9J76K14j78j90J04J04k34K72rJ80k28j00
$$ 124 110 -315 -222 -140 5 24 -11 -3 -4 107 -192 -221 -45 169 -9 -199 -95 9 -225 47 38 218 -10 -110
3380a10J60k73L11M4Q3j84R5l19k7K39j02L76l11k5K43n08L37j06K63p1k13j3
$$ -110 50 -223 88 132 215 31 126 -193 -220 19 -83 293 -18 -43 200 -308 29 -77 186 115 -98 -111
3402a11R6j76K58o4j83K91N7p8Q3n20K48j56J89K5j14M7Q0l22J66K91M6p5m23
$$ -111 -15 -191 67 3 -180 111 168 90 173 -347 -99 -255 -66 -41 -155 -108 -28 -350 -184 107 153 78 -345
3425c45M65j04K10k33J41K07l98j19J65K38j20j33J54j68K72k03j55K21j09K17
$$ -345 120 16 226 -7 134 341 -57 -176 -11 227 107 -26 128 -40 232 29 -126 95 -14 203
3445B03k44N0M0p4lR7j23j85J66O9J46k66K56k83P8J18j88L05m34L27j29O3j46
$$ 203 -41 9 49 -25 -28 69 -54 -239 -73 -4 142 -124 132 -151 -73 45 -143 162 -272 55 -74 -11 -157
3468a57J94K30n53J84m9KK01M4m9j60J07j2K09k01l5N7P3j15j83J62P1k98K06
$$ -157 37 267 -286 -102 -151 -149 52 96 47 -113 -6 -18 191 -10 -45 12 85 -30 -213 -51 20 -278 -72
3491g2K8j12J89L13n02O7j2mo3L8%M41k13j93J92o1j11P0O1k40Q8N1K14N9k83
$$ -72 -44 -156 33 346 -156 -89 -101 -105 -168 -130 -130 311 98 -95 97 36 -75 -5 56 -184 -96 -45 169 228 -55
3516e5J36j08j65K92j06j13n2J82Q8j06K70k94%j57K31Q1n7k0j55N5O5J72k75
$$ -55 81 -27 -192 100 -6 -119 -171 11 99 -7 263 -31 -31 -188 43 124 67 47 -108 -53 12 184 -91
3539i1J99k15P3q8k5K60k37J58J59j44K40k11j09K17l22K43o1r1l2J29J00k16
$$ -91 108 -107 -34 -122 -147 113 -124 34 193 49 289 78 -31 186 -136 107 46 -45 -77 52 152 -64
3561f4M6L7k21JL4M77m42kP4J22j09J95j46k76L44k8N6k51J94j2j06q4J75q8J56
$$ -64 -18 19 -202 -201 -167 310 -132 -134 -60 62 -47 148 2 -274 70 42 98 -153 41 29 -77 -161 14 -74 82
3586H2K6k2o0k53K59K70m29K78j19k95K92r8K4j97K01O6K2j32J27j37K72l78R8
$$ 82 108 86 26 -227 32 302 -127 151 32 -263 29 -69 -45 -242 -41 25 47 -85 42 -95 177 -201 -103
3609a03L81k74O0n4J50m5K9k46N88o33o7K93k14j39K54O6j96J06N9r7N4J24K00
$$ -103 278 4 64 10 160 115 144 -102 486 -147 -214 79 -135 -274 -20 46 -150 -44 15 -82 -28 96 296
3632B96o35L13PJ87l1j63L41l90j71M72l26PJ00n2J88l07K96j38m6N9j01J6j4
$$ 296 -339 -26 -19 168 137 -26 315 -75 -246 226 -100 -93 7 -45 143 -164 132 -6 -52 7 -94 -78 -92
3655i2K57k2k01QR5J42K9k17j05J03K00j97j28J31N9j1j86J42l97K79Q4J68R6
$$ -92 165 143 -58 -50 45 187 216 -1 -106 -3 197 0 -128 3 62 51 -135 7 -390 -111 -27 141 237
3678B37j98J07p3j83J30j01O3j74L4L12J38l03J12j28j04P4P5j2m0j93L9K67k64
$$ 237 39 146 73 -110 20 -81 -18 -192 -158 154 292 -11 101 -27 -131 -57 18 6 -34 -227 -188 79 -185
3701a85J78J20k51J4rO4L6P7n3l1N3M4j75Q1K65k20j86J37J68j63j18JJ54O9p6
$$ -185 -7 113 -138 -124 -133 -69 -33 44 -9 -40 13 57 -118 -37 228 8 -178 -41 127 -36 -154 -153 1 70 -6
3726fJ36o4J05m4k54L37j55J48m23LL00k43m8K24j07K01j2j90j79Q3J26K40j14
$$ -6 130 66 171 127 -127 210 55 203 -220 -217 83 -160 -208 16 -91 110 98 -92 -271 -188 -62 178 64
3749F4r7j90L01K7k4k93K2L90k65J32r4m2Q9j14k33K70O5r2l7K45j87P1o8j59
$$ 64 -33 -223 78 105 81 -212 -190 200 -65 67 -27 -69 20 -94 -327 -57 8 -84 -121 124 -63 8 -60 -219
3773b19M79m98J18K2J82n2k54Q0n0J25j09j32K93R6l19K50L1N4M08o27K42j66
$$ -219 260 -238 -120 -98 84 32 -222 -142 -192 -67 -176 -308 -15 81 -238 12 43 97 505 -122 120 -46
3795d6j1K32j31L0j05n2j16J11K6M0Q6p4j23L3K26j24nj6J95k02j9Q0l8J67k87
$$ -46 -57 175 44 74 -31 -83 -199 -88 -62 -22 64 -10 -133 -100 126 2 -3 -19 176 -26 -45 35 -3 164 -123
3820a23J53rj06O5M0k35M07l63J60Q0KM2j11N4j07q3j35j10N16k45J13k00J06
$$ -123 30 21 -85 -20 20 -215 192 -171 -11 69 71 113 2 56 -51 -134 -269 -379 137 -108 5 -195 -89
3843h9N8J22p0o8j01J62j05k2L19j39o4K36j57J04K2J9l98O0l2j19J21K16l4O1
$$ -89 -31 91 21 -47 -148 14 -91 -113 206 67 3 239 82 186 208 227 -171 -111 -143 -262 -141 75 41 102
3867A02m9P2p8L0K01m43J79Jj47Q4J44m20K72J16L3j03J26r9K25j13n00L87j23
$$ 102 53 125 47 77 278 -165 14 15 -132 -48 96 -324 -52 64 97 -6 120 21 246 133 -367 20 -103
3890a03K27n7R9k08n8J33k33P7M9M1j78Q4J56j17j4o0L6L9J44k33O0J56rK34l18
$$ -103 124 67 166 -42 -100 33 -200 -123 -74 -33 -211 -127 29 -88 -102 -162 -126 -87 57 -176 -116 40 31 265 -53
3915e3j34P9L05P9k78J69o8j74r1l9j2J86n8pj12M07l83K11l3J9J63j50o7j1l1
$$ -53 -187 -108 197 276 -2 167 99 -75 -166 -205 -217 -31 -89 -96 -208 199 -184 27 -6 13 176 26 -41 -52 -83
3940h3k40L94m7L6j96K33J29j54l20KK15P4J6qj14j09J81J39l12K61r1J91M4k07
$$ -83 -323 71 24 60 -136 97 226 72 -248 -246 -31 43 59 51 -63 -172 9 148 -164 97 6 197 241 34
3964C4j76J01J06K5jo0P9k59J35P3J21j1k83J83jK17l59K9N0m0j71o8M5K33j91
$$ 34 -142 -41 65 90 89 29 108 -151 -16 57 178 167 -116 67 66 283 -76 -47 3 -37 -208 -276 -231 2 -189
3989a89K25l4j69L61k46n4P3L14m81L80j42q7R8p4Q2J01l53N2L57l97J79r5J21
$$ -189 36 2 -167 194 -52 -106 -33 281 -200 180 38 -49 49 -25 57 158 -195 -143 214 -183 -4 -99 22
4012B2o3n7o6L22j93j74Q8LJ09j52J91j3j63J36J38j87L8K80m18o5N7L26l84J05
$$ 22 -41 -98 -164 158 -35 -209 -121 -118 -9 -161 30 17 -146 -10 128 -59 -21 259 -159 -224 -167 159 -225 -120
4036a20J6J4L5O4j4J7J22l6J20l23J66M4j57q5L81l23J50l00L2K84k1K14l78O7
$$ -120 -104 -90 -55 9 -5 12 134 98 218 -105 61 105 -52 -137 244 -79 71 -229 -197 87 66 280 -98 -31
4060c1J49j69L4j31J73j65J43J15k7O6j13k37L09l17J87J37J4O6k19J17m8M7j96
$$ -31 118 -51 -17 -148 25 -140 3 118 91 157 44 -193 116 -201 -14 123 137 203 -16 101 53 100 -96
4083i6K23p3k35L02k70J31R3j26rP6J52k04l2J05Q9l6q1J33j59j02J78N1j89J67
$$ -96 127 54 -181 121 -149 -18 75 -51 -60 16 168 -36 -68 37 126 90 9 142 -17 -119 59 110 -79 88
4107H8l5p6o7k5J20k16N8L01r3n5m9J4k06L21k7n8j23O01n10j2K13k29L8r2J99
$$ 88 53 -23 -90 -115 5 -211 -153 148 55 0 -49 -35 -241 80 53 -5 -128 473 -37 -49 164 -65 -27 -119 80
4132H0P3p0j74K21k16K45j73P2J6k36L4J21n8L00j34l81K13J49k38K17p5r1K4
$$ 80 153 83 -91 130 -86 159 -14 58 74 -162 -128 -7 -65 235 101 -280 -67 82 -156 61 -14 -105 -81
4155h1K95m56K85L4l23J08j33J40m5J22J30j40J71j80p4K46k13M13k39j33J02
$$ -81 214 -242 43 77 -246 -138 -271 -131 -176 -54 76 -64 107 -73 -147 99 -114 299 60 -73 29
4176B9j8l9K68k95m0J72q2m0K01j51j00m9K7M13l79L23j74r4J12k17j96N58k27
$$ 29 11 -28 240 -55 -95 77 -5 -45 156 5 -95 -144 -117 296 -83 240 66 -28 84 -133 -329 229 2
4199Bq7K40o16O30j74O6j63L0K90r4n8j34K1p1l2L74k49P2K77k77j16l7Q0J68
$$ 2 -85 155 -461 169 -5 61 -102 -72 218 124 66 -68 -47 -118 -150 224 -25 47 324 47 -69 -106 -26 142
4223A42j60j25J93P0j25r9K72j68R3k54K23L1j31j04P6j6j19J3j5J61p6R4j07
$$ 142 -18 -143 50 120 -5 -104 168 0 93 -161 62 93 -38 -142 -66 -82 -201 -188 -203 -42 -118 -24 -131
4246a31J87O2J47j71r2L38l22k0n5K0K59j21p7L28k64k50p7M06l17K06k45M38
$$ -131 56 118 265 94 2 340 18 -2 -57 -37 222 101 24 352 88 -162 -239 167 -150 56 -189 249
4268B49k75J12r5o9K27j88l4Q2PJ9Lo6O3j41O1j15J3lJ86k34L35k04K11l05K82
$$ 249 -26 86 -9 -78 149 -39 -73 9 16 35 38 -28 35 -106 -45 -160 -147 -150 36 -198 137 -67 144 -161 121
4293A21j97J48k5n5k28L19k13N6M7P8R8k28l4J30l5J26n2M0l9k88J74M20k08l44
$$ 121 -76 72 47 -8 -236 83 -130 -74 -27 51 149 -79 -113 17 -18 108 56 96 57 -231 -57 363 155 -189
4317a89j%J94n0K32l49m9K55j50k6Q4M3J88j44K07k47J16r3j91q2K59j79K27L6
$$ -189 -190 -190 4 -46 186 -163 -212 43 -107 -133 -49 -6 182 38 245 -2 114 21 -170 -252 7 -172 55 91
4341I1K1r5j45O7J17J14k93j6K60j35j92J9K37J39j27O2j86K4M6O9J5o9K00k18
$$ 91 112 17 -128 -61 56 170 -123 -139 121 -14 -206 -187 50 189 62 124 -62 -38 8 77 92 23 223 5
4365Ek52kJ07K90k65jJ98K64o41R3K51Ok65K53Q4L7k74J30n2O0p9K17m56L13j09
$$ 5 -247 -249 -142 148 -117 -118 80 344 -297 -204 47 53 -212 41 125 162 -112 18 -34 26 -53 164 -292 21 -88
4390h8K19l08L37j48j41J79j84O8l3J24k34L73l40K72k03O9K3P2J80k70l8J59
$$ -88 131 -177 160 12 -129 50 -134 -66 -99 25 -209 164 -176 96 -107 -38 -15 57 237 -33 -71 88
4412H8J6k52M25m75K70N4k34K52l82N64k98K31l21J72k50P8K50m0j4j47j61J54
$$ 88 104 -148 277 -198 72 126 -108 144 -238 326 28 259 -62 110 -140 -62 188 148 134 -13 -174 -20
4434b0J88l17J63j44L85Nk50k10K59l40L85j96L13k58M1N2n3K59k11r2K54k83
$$ -20 168 -149 14 -130 255 260 10 -200 59 -281 104 -92 221 -37 4 56 3 262 51 -41 213 -70
4456g0K5q1p5J69J46o4M6J02j09Qj66K88l62M39k56j50L72k12J8n3r5K88l72J66
$$ -70 -45 -126 -201 -32 114 50 96 198 89 97 -69 219 -143 296 40 -110 262 50 68 15 -80 208 -164 2
4480Bj00Q9j18J7L20k83Q2k02K31j16J00R0j93K36j59L10k11j83M4j68P4J91j03
$$ 2 -98 -9 -127 -110 210 -73 9 -193 38 -78 22 112 -81 155 -4 306 95 -88 -44 -212 -138 53 -50
4503e0n3M9M3j23J05L5R6l91J15J71l2j05P0O3J52M3k52J17j17J80l7j84n9J50
$$ -50 -103 -54 -11 -134 -29 6 102 -289 -174 -3 -35 -140 -70 -7 145 188 -64 53 -64 116 79 -105 -164 -14
4527a4Op2J00Jp1k24O14j42k88K42k69J92O5j12J46k00M6k50J61K00n8j04L48
$$ -14 -8 -80 20 21 -50 -274 340 198 -90 152 -117 75 140 28 174 -26 20 -230 -69 131 73 -31 317
4550C17k82L6j88N2oj72K93J19K3n7k94L53j29J31j45J27j09J73n2k77m1L06o1
$$ 317 35 71 -117 -65 -71 -243 50 169 192 135 -159 194 65 196 51 178 69 242 190 -87 -128 178 117
4573A17P8j94n4L34l72j32K90K0j12O3j85L30M8m4l11M7K41Q7m62J42J00J33k27
$$ 117 195 1 -53 281 -91 -223 67 87 -25 38 -147 183 231 187 -124 -77 164 251 -211 -69 31 164 -63
4596f3R2J28k75L59q3K70m84qN5j25J31r5R2m4M5K98n25M4K33P9j54R9n3j16j9
$$ -63 29 157 -118 241 158 428 -56 -64 -9 -134 -3 -98 -6 -50 -5 293 -232 -188 45 124 -30 69 16 -100 -119
4621a19K7m9Q4k26N1J74j60J11k20M48k32L70l62J06k76K40K01j47k99K65J74
$$ -119 -92 -141 -57 -283 -232 -58 -218 -107 -327 121 -111 259 -103 3 -273 -33 168 21 -278 -13 161
4642A61n0M0j54K7n7K72k01rj06K10k13J64Q9j89L2P2K0k10K08k36K9K86P0j52
$$ 161 111 151 -3 24 -33 239 38 29 -77 133 -80 84 173 -16 16 88 108 -102 106 -130 -101 185 255 103
4666A03J40P2j96k96q4L22K41l86J39j90J42K2j70j32M75k97L9K04l12K82j89
$$ 103 243 315 119 -177 -261 61 302 -84 55 -135 7 29 -141 -273 202 -95 -56 148 -164 118 -71
4687g1pJ5L39k20J5M7l9P0p5k29qK18J65k99J65J16k54r6P6K11Q5k95p1J59K24
$$ -71 -78 -63 276 56 71 118 79 149 74 -155 -163 55 220 -79 86 202 -52 -148 -72 139 224 -71 -142 17 241
4712B41j49k6k41K03k50L38J05m65J70k7M70m61j82J02J45j7K1P5j50J12j61j93
$$ 241 92 66 -175 28 -222 116 221 -244 -74 -101 369 -92 -274 -172 -27 -44 -23 52 -98 14 -147 -340
4734c40L45J62k65J63r0lO9l1K54j04J30k77Lp0J44J86j91k02K02mOj35J57j26
$$ -340 5 167 -98 65 -25 -28 41 10 264 160 290 13 16 -54 90 276 85 -117 85 81 87 -48 109 -17
4758a7o3LK81n3l14K12J3j20K90j84j61m1o7L72N6j69j79K88m4k12Q7j56K1l2
$$ -17 -80 -77 204 151 -163 49 62 -58 232 48 -113 -154 -221 151 207 38 -141 147 103 -109 -22 -178 -157 -189
4782a89K59K0o2j47O5NK27j94kl10M16j69J13K92l16j39K39j57p3J14K50j03l51
$$ -189 70 90 28 -119 -54 -49 178 -16 -18 -328 88 -81 32 324 8 -131 108 -49 -122 -8 242 139 -212
4805b12K60j54K37Q1j69qq7k26K64Q6K22l40L5N6j41J16J41M5l35K59m58L34l8
$$ -212 48 -106 131 212 43 35 -52 -278 -14 72 294 -46 -11 45 -96 20 161 206 -129 130 -328 6 -32
4828c2o0J42R8j00J43j44o5J00j96K47k67M79l10k45J80K38P2r0J8k81L2J43K16
$$ -32 -92 50 148 48 191 47 -18 82 -114 133 -134 345 35 -210 -30 208 280 190 208 -73 -41 102 318
4851C18k35L0l20J35L06l97M29l60J15j43n1K37j04j47J83J06q6K8j78J54L7k3
$$ 318 83 113 -207 -72 234 -163 266 -94 21 -122 -173 64 -40 -187 -4 102 16 44 -134 20 57 34
4873C4J97l04l4q5j37L23p0L5N6pJ01j88J29j75O1K11j29K43l02Q0k78L25n4K7
$$ 34 231 -73 -107 -192 -329 -6 -76 -41 15 8 109 -79 50 -125 -64 147 18 261 -41 39 -239 86 32 59
4897E9O0j76J23K24j2l27j30K55o2J0l3M0K57k07k01LP9J63J30m28j72J97O2L13
$$ 59 119 -57 66 290 278 -49 -179 76 14 24 -9 31 288 81 -120 -117 -38 125 255 -173 -345 -148 -86 227
4921B27k45J11k83L08l33NL7K3P0J8q1K30n5J30k82J95J26P3k59O8j49l7r8l8
$$ 227 -18 93 -190 118 -215 -210 -173 -150 -80 -62 -143 87 32 162 -120 75 201 274 15 83 -66 -103 -201 -239
4945b39P3L4J3N0K65j02j59J91K18k2j87l90M42j90J21l02J99J57l40J15j37K82
$$ -239 -166 -132 -119 -69 196 94 -65 126 344 322 135 -255 187 -3 118 -184 15 172 -168 -53 -190 92
4967I2l3j41K01r2k51K83J17m22L25j13m7j36K57p1N4Q8o0L0j08j31J62L7l3k1
$$ 92 59 -82 119 27 -224 59 176 -246 79 -34 -81 -217 40 -31 23 111 51 81 -27 -158 4 41 8 -13
4991a3m82L83M70j69l45L5j4R9J98l3k8j08o8N5r6K17r3J4j48j2L53j76K66n09
$$ -13 -495 -112 358 189 -156 -121 -135 -36 162 129 101 -7 -75 -20 -116 101 8 22 -126 -138 215 39 305 -204
5015b04L93k23l97O05k57J47l19K18K26p6j2k5J5o8p7k5L3o7N7K4J32J25m15J55
$$ -204 189 -34 -431 174 -83 64 -255 -37 189 113 101 76 91 23 -54 -79 -46 -113 -56 -32 100 225 -190 -35
5039c5l4j15K04J9J3n8M1m9j54K76j76J3K27j8k33L0n3j4L08j01p3J88K1k13j27
$$ -35 -69 -184 20 39 52 -6 35 -14 -168 108 -68 -55 172 154 -79 -49 -102 -116 192 91 18 206 227 14 -113
5064a13J48J33j93L4r3O4p1J70j58L7J20p3L5o6k12K56j31J12R8k79J53R5n7P3
$$ -113 35 168 -25 9 -84 -20 -91 79 -79 -42 78 5 40 -26 -238 18 -113 -1 97 -182 -29 66 9 82
5088H2J36j32q8j3j82L42j47j61J82k21k5L1L39k92J53K9r8k37J41M12m01Q9q9
$$ 82 218 86 -2 -15 -197 145 -2 -163 19 -202 -227 -196 143 -149 4 33 -65 -302 -161 251 -150 -61 -150
5111a50J81k4R2j06j5PK54l56M9N6J24L8k7K90n71L44N0l74r3L50k74Q1Q9k06
$$ -150 31 7 99 -7 -22 -15 239 -117 -68 -12 112 150 123 413 -158 186 236 -138 -231 119 -155 -74 15 -191
5135a91J82j54J91m82M85P1j81M4j44K08J22J02l34J68j62K92O1l05N1R4j25j56
$$ -191 -9 -163 28 -454 31 102 -79 -35 -179 29 151 253 -81 87 -75 217 278 -27 24 118 -7 -163
5157a63J46K01j46j28L1K14k73K15n9k26j03J65l4J50Q9j31K63m75M06k66J67
$$ -163 -17 184 38 -90 -59 155 -118 97 38 -188 -291 -126 -160 -10 79 -52 211 -264 142 -124 43
5178D3J06j52k63K02K29k64j9K42j2j61q5J89n8j21O2Q2L74k07l3o9k80K80j17
$$ 43 149 -3 -266 -64 165 -99 -118 124 112 -49 -134 55 -3 -124 -62 20 394 187 154 85 -195 85 -32
5201c2Q0n5k28K60j39J97J95O2l48R6j92l6P3n0J11j49K37KQ0j30j72J23k1R2
$$ -32 48 -7 -235 25 -114 83 278 340 -8 88 -104 -140 -67 -117 -6 -155 82 84 164 34 -138 -15 -36 56
5225E6k80J14N6r2J91M7L5j57J86j09j01k01J01J57J2P0o8NJ51m91K50L24o3k70
$$ 56 -224 -110 -54 -146 45 92 127 -30 156 47 -54 -255 -154 3 15 85 17 22 173 -318 -68 256 193 -77
5249g7J01J37k58j48J86J33k58J67L86m93j84L45J38m84L49rM0k41N7N8L0p6O8
$$ -77 24 161 -97 -245 -59 74 -184 -17 369 -124 -308 37 175 -309 40 31 71 -170 -113 -55 -25 -101 -33
5272c3J31R0j67l9j35R8J81j71j77N7K45j74J64j32l0J10j20J00J40j10%R4l25
$$ -33 98 188 21 -18 -153 -55 126 -45 -222 -165 80 -94 70 -62 -92 18 -102 -2 138 28 28 122 -203
5295b03K9R1pj47K76N2J13k87j48K84j37L13j18k05m8K87l31K54l49L04L0J20
$$ -203 -174 -83 -90 -237 39 91 204 -83 -231 53 -84 229 111 -94 -142 145 -186 68 -281 23 53 173
5317A73j87k95M33k53L99j08J8k7j65R4K41p7k54K07k46o3K22k60N9k39O40m07
$$ 173 -14 -309 124 -129 270 162 180 153 -12 82 323 246 -8 199 -47 -110 112 -148 -89 -328 312 -95
5339i5j41K37m9J01k62r6J77J24k4j08N4J2k3K94j09j21J96M3l52J40Pr7N72l57
$$ -95 -236 1 -48 53 -209 -305 -128 -4 -28 -136 -82 -70 -93 201 92 -29 167 210 -142 -2 5 -92 480 123
5363A23p3q4J8k52M84k75J53n6ql32J41K80k98O2J67j16Q3J9k59K07p1J55k47
$$ 123 50 -34 -16 -268 216 -59 94 38 30 -302 -161 119 -179 -117 50 -66 17 36 -223 -16 -87 68 -179
5386a79J72P8j8m0q4K23j14p9K70l34k8k8J27j12J33p7n5M46j94j93K62j58j32
$$ -179 -7 71 53 13 -71 152 38 -41 229 -105 -133 -161 -34 -146 -13 -90 -145 301 107 -86 176 18 -114
5409a14O8K15k60k14K17k02K72K52k73J74k08J64k05J1L49k21J19j07o2L07l84
$$ -114 -46 169 -91 -305 -88 -290 -18 234 -39 135 -73 91 -114 -103 246 25 144 37 -25 282 -102
5430a02K94j83j14K61m58R7O1J89J56k17m9M9J24K09j4k99K00j18J27k09j5Kr7
$$ -102 192 9 -105 156 -302 -205 -144 45 201 -16 -65 -16 108 317 303 4 204 86 213 4 -11 -9 -106
5453a06K29p5k04O9j07L63O0l78L89k38k04L46j40J50k94J98k25J89k25M92l56
$$ -106 123 48 -156 -87 -194 169 229 -149 240 2 -202 144 4 154 -140 58 -167 22 -203 289 -67
5474f7JK90n33K90K80l95J26o1M5R0N6l6mL3r8k57L51L0j46J3j2o6K03k11k3K02
$$ -67 -66 224 -309 -19 261 -134 -8 -69 -24 66 122 86 82 115 17 -240 111 141 -5 8 -4 -70 133 -78 -101 101
5500A01m04L76J2J05l07LK67l43L2q6L21k36L64k61k11L76r9K60j56j37j35L6
$$ 101 -303 73 85 190 -117 -114 153 -190 -158 -244 77 -159 205 -56 -267 109 10 270 114 -23 -158 -122
5522a22K22j89p3J65K08K2l26N6K3K97m65K30q6j82N51n60J40J0J19%j39J82N0
$$ -122 100 -89 -162 3 211 233 -93 -37 -14 283 -182 48 -38 -220 331 -229 -89 -79 40 40 -99 83 133
5545A33j24l1R7J80k84L42k47j80k28L25M9j09m7Q1J48p3jj59r4J14j8R8mJ8J33
$$ 133 9 -22 75 255 -29 313 66 -114 -342 -17 32 -77 -124 -43 105 32 31 -128 -222 -108 -126 -28 -32 -14 119
5570A19J13l03K80j19l85L88j13K54j11K9k7j78n2R3K28l94M22j73J02qo2j55
$$ 119 232 -71 209 90 -295 93 -20 234 123 152 125 -53 -105 -12 216 -178 244 71 173 165 103 -52
5592e2j46J23J25K22j77j32P9K00j41l02K00J68k48J09k64K65k20L23j05J62k91
$$ -52 -198 -75 50 272 95 -37 42 242 101 -201 -1 167 -81 28 -236 29 -191 132 27 189 -102
5613a02K40j79N23n41Q4l17J16K48j00M73k29q2k53N0q5P7L50m10O6M2J66R9j70
$$ -102 138 -41 482 -59 25 -292 -176 72 -28 445 216 134 -119 -69 -154 -77 273 -137 -71 -29 137 236 66
5636F6j60J65j52J33k51M52j37k12L00k33r0rK68k38J86k22K60j95j14M66m53
$$ 66 -94 71 -81 52 -199 253 116 -96 204 -29 -119 -128 140 -98 88 -134 126 -69 -183 283 -170
5657a70K92K1p2o8J33k58J18Pl2K63k50o4J83j72J55q5J45m66L47k79P4K14j22
$$ -170 122 143 71 3 136 -122 -4 3 -29 234 -16 -80 103 -69 86 1 146 -320 27 -252 -178 36 -86
5680h6K96j91j18L74N1j92r0j0J52j89n3J43pk04M1O8P5K4k9P4n8l5l45L00P5
$$ -86 210 19 -99 275 326 134 44 34 186 -3 -56 87 80 -124 -83 -15 60 84 55 129 71 36 -309 -9 66
5705F6k01J84k60J60J53j63J80l4k0j02M2j08k9L01N9j33l62M87J73k82k64l3
$$ 66 -135 49 -211 -51 102 -61 119 85 65 -37 5 -103 -132 169 228 95 -267 220 393 111 -153 -186
5727a86J84K71l34L5J68j76j43K25j96J06P4k02J36k48K49k53L98PO4k5J05j03
$$ -186 -2 269 -65 -30 138 -38 -181 44 -152 -46 28 -174 -38 -286 -37 -290 108 115 179 154 259 156
5749A56k70K1K38l72J53j45K33q5pJ66pk39p3K67j89R4k19K34J07J7m4k57Q0J53
$$ 156 -114 -93 145 -227 -74 -219 14 -71 -78 88 81 -158 -231 36 -153 -59 -278 -44 63 80 36 -221 -141 12
5773A2j6j75J70l6j62L91l50J00J54n5m3o4o2Q5L7J85j38J01k68K34j05k10J41
$$ 12 -4 -179 -9 -45 -207 184 -166 -66 88 33 -10 -74 -136 -51 -14 171 33 134 -134 100 -5 -215 -74
5796g4K27M3j76L6J32j58k38R7l04K93J51J22j36q9n8r5K18M4k92L12N0l5l85
$$ -74 153 196 20 56 188 30 -208 -111 -415 -122 29 151 15 -74 -132 -227 -9 35 -257 55 105 70 -315
5819c15K97K3K1j44J47j16P8O2j10K8k02O0K85K9r6K0j17K44o2j98J62J87j53
$$ -315 -18 5 26 -118 29 -87 -9 53 -57 -29 -231 -171 114 143 47 67 -50 194 132 -66 96 283 130
5842A30l8q6L0J15j52P4r7k52M12q3N6j13J45Q0j33k43K15R3j37Q7k15j12L64
$$ 130 92 6 36 151 -1 73 -24 -276 136 53 109 -4 141 221 88 -155 60 153 16 103 -112 -224 140
5865A40j73O0k4j77L61l61K91k21r2M4K02j71L62j82j09K5J22k12K5L20j08j46
$$ 140 -33 27 3 -174 187 -174 117 -104 -196 -152 50 -121 241 59 -50 -25 97 -115 -90 230 122 -24
5887b4nk37K96r1j07K72j36K5J53m7k67J85j65K88j64q3L09k19P2P5k42K95l87
$$ -24 -29 -266 30 -61 -168 104 -32 -7 146 99 -168 17 -148 140 -24 -107 202 -17 55 130 -112 183 -204
5910b04R7L05j17J49q8q3p4J72j53J17l4j44P0K70k39k58L21j52K04j20j25j9
$$ -204 -107 198 81 230 142 59 -15 157 4 121 87 -57 13 283 44 -214 107 -45 159 39 -86 -105
5932a05L83o9O9m92P9O2J93J33j62j14J35n6o4j21L16j74j65K01P3k32k28L92
$$ -105 278 209 278 -214 -135 -73 120 253 91 -23 112 56 -8 -129 187 13 -152 49 122 -110 -338 54
5954E4J9K49n53J73J12J8N4k05Q2O5J9O4j15Ro1J28j87K37l1n3m7j91J87j68j07
$$ 54 73 322 -231 -58 54 72 126 -79 3 68 87 151 36 45 -16 112 -75 162 131 78 31 -160 27 -141 -248
5979b48L23l4j79O7K61L7q8q4K21k05j20K00l83K14%n0J68k81M18m36O9K95L3
$$ -248 75 41 -138 -71 190 227 139 55 276 71 -49 151 -232 -18 -18 -68 100 -181 237 -199 -130 165 198
6002A98j49j86J40q8M3J62l0L3o4j9j76J29M1Pj7N8nR9j11k41N84l36p7p7o6R8
$$ 198 49 -137 3 -85 -42 120 90 123 59 40 -136 -7 34 41 24 82 77 176 65 -176 408 72 -5 -82 -148 -50
6028e0RR5o9N2J33l32J67J04l5mk75L81j21M0n2k71L92n81L17J32l15L44j53K16
$$ -50 -41 54 -15 37 170 -162 5 109 74 70 -205 176 55 95 43 -228 164 -417 -100 32 -283 61 -92 124
6052A24j7l97L26j82K42k2n0J2J45N0l13J66k68N2J78r1J11j94P6j63Q2j7J54
$$ 124 107 -290 36 -146 96 74 24 36 181 231 -82 84 -184 -132 46 -45 66 -128 -52 -215 -133 -150 4
6075DJ72m4j26J30p6l51k5M10q1l6K35k49J25J8j38m2R5K37k31O9M8N5m37L7N16
$$ 4 176 132 6 136 60 -291 -316 94 13 -23 212 -37 88 106 -32 -74 21 258 27 96 144 199 -238 -201 315
6100C15k96J2j77j36L7M54l53J34J0r4J12r6J33K9j55L68k00P4k72L0MJ15r3K92
$$ 315 19 31 -146 -282 -245 209 -144 -10 0 -94 18 -78 55 84 -71 297 97 171 -101 -71 -67 48 -45 247
6124B47K61o08P9j65L95k98m9K01j38K65L3j44K33l06J45k05J42l08J55L36j54
$$ 247 508 -100 -21 -186 209 -89 -138 63 -75 190 223 79 312 6 151 -54 88 -220 -65 271 117
6145A17k02j22M2L21p0j98K59p2l07L59r0k31J50r5P4M8Nj43J33n9O9m8P7J07
$$ 117 -85 -207 -165 156 86 -112 147 75 -232 127 37 -194 -44 -139 -65 -17 -12 -155 -22 -81 -12 -60 17 124
6169A24k73K19M2j1r8r7m0M7K04l23L29j13n3j1j75L06j62J34M2j00n3R3L03l53
$$ 124 -149 70 112 101 3 -94 -134 -87 117 -206 123 10 -43 -54 -229 77 -85 49 91 -9 -62 31 334 -19
6193a9l8l49Q4L87m4j67J3J3L51l1k96K51k16R3r8j72K97j4j35L60k18k28L84
$$ -19 -57 -406 -322 65 21 -146 -133 -120 231 200 -96 155 -61 32 -66 -238 59 45 -90 270 52 -176 208
6216B08j12p5J68l39K42l37K37qj8J42m55R4K75J5J01l51J10J59J39l70L63k14
$$ 208 96 21 189 -150 92 -245 -8 -16 -34 108 -347 -253 22 37 138 -213 -103 56 195 -175 188 -26
6238b6M7N8j89K22K4j12J52j83j48K85M5l70L13j31p3K77k39n9m6O49l14j50J03
$$ -26 21 79 -110 112 136 24 176 -7 -155 130 175 -195 118 -13 -86 191 -48 -107 -153 496 182 32 135
6261A35q5O3m15L60m5k65J06K66l08R6R8L0k7q7j52j3K31n2l60L27k05K38k45
$$ 135 50 113 -302 58 13 -252 -146 120 -188 -92 6 36 9 -78 -230 -243 -12 -64 -424 -97 -302 -64 -309
6284c09K30L62k19k15L43k94n3J20P9jp5K63l72L11j96j2J8N4J17k40K52l97K14
$$ -309 -79 283 64 -151 192 -102 -155 -35 44 43 -32 231 -141 170 -26 -38 -20 34 151 -89 163 -234 -20
6307b0Pk4q2L47l1l17o4P0M7q6M0J8j6o6K55n3l5k88r0M24j36M2k11L05r4K4M0
$$ -20 -13 -37 -119 228 197 -120 -184 -114 -67 -153 -113 -95 -111 -177 78 25 -10 -298 -388 36 -100 -58 -269 36 -58 -34 6
6334FL0J82l33n4K5O2K38l1j95K63J56m53K67m0j10j17j10L62l2j88j06L67j07
$$ 6 36 218 -115 -169 -144 -82 156 125 -70 193 349 -104 163 123 13 -104 -214 148 116 -72 -178 189 82
6357H2j42K15n2j3j63j3Q9M5r0n4K9k01L93k46K98j83J27k10N2R1J29N4j28l15
$$ 82 -60 155 103 90 -73 -86 3 48 -42 -96 -67 -268 125 -121 177 -6 121 -89 -37 54 183 237 109 -206
6381b06K71L8r1L91o22L30L3n5k8j43O2o6J25l3J36j4j61k6k42M87l9j43L79o21
$$ -206 65 103 12 403 -219 111 144 89 61 -82 -20 -86 39 6 142 128 -33 -59 -301 186 147 4 383 -238
6405b38j9J26p6L08k26K18j66J13N2k99J60Q8J72q9k91K99r4Q5K28r7k37l49K22
$$ -238 -257 -131 -207 101 -125 93 -73 40 92 -207 -47 41 213 124 -167 132 38 123 351 254 17 -332 -110
6428a10J88k8n6k9J27j33p6K09j63q4K27M9l46J14J42l10L0M65l70L79k74k7J05
$$ -110 78 50 -6 -35 92 -41 -117 92 -71 -155 72 121 -225 -111 31 -279 -249 216 -154 225 -49 -76 29
6451B9j39J5J3j25K35k01K74r6j14J02J07j69J05k63K33q9O1R4l38L93k54K67
$$ 29 -110 -95 -82 -207 28 -173 101 5 -109 -7 100 -69 36 -227 6 -83 -22 72 -266 127 -127 140
6473A40Oj50k11J26K29J03k82Nr7QQ0P1N1J4Q0m00M88j79j55M7k06M27l89K41
$$ 140 146 -4 -215 -89 140 243 -39 -34 -131 -123 -43 28 79 93 173 -227 261 82 -73 -26 -232 195 -194 47
6497D7M5J1j85K4k1L51l39J86l42O8M7Q5K1p1K5J37k01J97j56R0r0l47Q1K81J71
$$ 47 92 103 -82 -58 -79 272 -67 119 -223 -155 -108 -23 -2 -73 -48 89 -112 85 -71 19 -71 -418 -337 -56 115
6522A15j50O0r7K9J47j62J36l75P3L06J7m9m6J8j83L04l01K15r5k49J50L62k03
$$ 115 -35 25 -72 -43 104 -58 78 -297 -224 82 99 50 4 22 -161 143 -158 57 -38 -287 -137 225 22
6545B2l47N07j10N4j64Lj29K41k71J75N6K2p0k7N1j51J77j28K65j45K90m3m77
$$ 22 -325 182 72 126 -38 -35 -164 77 -194 -19 37 59 -11 -38 13 -138 39 -89 176 31 321 278 -199
6568a99K46Q9k28J49K00l71Q2o3J67P1j49J55L9j06N0j89J36j04r6J06K57j21
$$ -199 47 136 -92 57 257 -114 -32 -95 72 143 -6 149 188 82 132 -57 79 -25 -121 -15 242 121
6590A21k66K05o1J82k53J29j6m4L06n59L10l8N9Mrl87N12j47o2o7J13L2j81rK
$$ 121 -145 60 -1 181 -72 57 41 -3 303 -256 54 16 75 79 70 -317 195 48 -14 -81 32 64 -117 -126 -124
6615a24K5K05K93l84J7N3m18L60J41j82j38J56J36k40J46p8j3L60k8m66M60k85
$$ -124 -99 106 399 15 32 85 -333 27 168 -14 -152 4 140 -100 46 -32 -45 315 287 -179 281 -4
6637dj12j19L28l4rr3r6P7J41l1j94J95n7J12j71m5J94j21J93j15J07k38O7J86
$$ -4 -116 -235 93 59 50 -43 -139 -62 79 48 -146 49 -8 104 -67 -112 82 -39 154 39 146 -92 -25 161
6661A61pk85M01j55Pk4j8k85J36L34j36l60J66k26L68j05J45j27p9Qj7jm7l7K00
$$ 161 154 -131 270 115 122 98 80 -205 -69 265 129 -231 -65 -291 77 -28 117 -10 -89 -81 -98 -99 -146 -183 17
6686A7K3j89J5Rp9L43p6j45J78q6j11J70P4j43K28j94K94n45K83R1k44J62J1m00
$$ 17 40 -149 -134 -125 -204 139 63 -82 96 10 -101 69 143 0 228 34 328 -217 66 157 -87 75 86 -314
6710c14J53j03K02N0J03Lp5j56p4K25J8k4k84J28J69p6O4O5o5L2k60J65Q6M29
$$ -314 -161 -264 -62 -12 91 94 19 -137 -211 14 32 8 -276 -148 21 -55 9 74 9 41 -219 -54 32 461
6734D61n45J37j57M03k15k74K61r1l5M8k5J64k38K38m15M86m3j07k25l8O0K17
$$ 461 -84 53 -104 299 84 -190 71 -20 -55 -7 -32 132 -106 132 -283 203 160 53 -172 -210 -150 67
6756F7l1j19N9m0K46j47k49L03o0j29J18Q5k00j07J38q6K64l2k1Lj29j10J19J3
$$ 67 36 -83 -24 -64 182 35 -214 89 29 -100 18 103 -97 -204 -66 -152 112 80 59 62 -67 -177 -58 -45
6780d5J90m4n75M10L58l99P7O8J54j47J86M1k97L8j26K36j75J75M8j44p0l34N01
$$ -45 145 101 -474 -64 294 -105 -28 40 194 47 233 274 -23 15 -111 125 -50 125 173 29 -41 -375 126
6803A26j50N1j11J13M8L0k24K53P7j35k70K64n5m08O26m56L60j96J12r0r4m4R8
$$ 126 -24 27 -84 29 77 107 -117 136 213 78 -192 72 17 -391 235 -221 139 -57 55 -35 -129 -173 -75
6826g5J27k9J39l06K49m4k00L8L52j53j32n0l4L28k66n4K28k6j65nM6J74j07R0
$$ -75 52 23 162 -144 105 61 -139 -101 251 98 -34 -84 -118 210 -56 -110 118 92 -73 -78 -32 142 35 125
6850A25j32N8o9j00K21n5k5J84j86J02k60m8K87k59M30j64j98K24l4n8PJ68k56
$$ 125 -7 51 -18 -118 103 48 23 207 21 123 -137 -185 102 -157 273 109 -89 135 101 43 50 218 -38
6873c8J72j44O7r8K8J1R8k38j00M33k69J96j56K01k35K2j23L05k3k01K79k36M1
$$ -38 134 -10 57 -41 -13 -2 96 -142 -242 191 -78 118 -38 163 -72 -50 -173 132 109 -92 187 -49 -8
6896hk56M46k17J03J05l54J75P6m2K9M2l47K25J20k04K30k00p1M56l16n3J96j96
$$ -8 -264 182 -35 68 173 -181 -6 70 28 57 99 -248 -23 97 -107 123 -77 -148 308 -8 -61 135 -61
6919f1K37k27M46j91q9j13l23L08m5K87k66M2o9J0K4l2J80j78K12j35M7mR1j08
$$ -61 176 -51 395 204 115 2 -321 -13 -58 229 -37 5 -64 -54 -30 -62 118 -60 152 17 64 60 151 43
6943D3j54M3MK5n0K71p6k37J60n9K00k87O5L5J52j50m8m0P9K18p7R7k75J85Qj61
$$ 43 -111 -68 -64 -39 -89 182 106 -131 29 -30 170 -117 -52 -17 135 -15 -63 -103 -24 194 117 214 -61 124 132 -29
6969b9R3P4j58K70k30J46m4J9l17M02j87N6K5q4R1j90Q4j51k2J80J29j32j20j51
$$ -29 64 138 -20 250 20 166 122 141 -176 226 39 95 120 36 127 -63 21 -130 -152 28 157 25 -95 -246
6993b46J62K11K25l57k83L43j6j7Rk16J42P6p5q5L91n1n1o4r5K40k58J09n49M39
$$ -246 -84 127 352 -5 -288 55 39 22 31 -185 -43 33 -42 -127 264 213 162 98 3 243 -15 94 -455 -16
7017a6l01N79k07J09l62J9J01J79O8L7j76j68J72J40k29Q4mK54r9m25L68m4o4
$$ -16 -317 262 55 164 -198 -179 -78 101 169 206 30 -138 34 174 -55 29 25 279 180 -245 123 79 15
7040A5J34k43m9J86n0J05j34K14l34L19r9p0m5m8J19K59l73O0K13m26K51j0j97
$$ 15 149 -94 -143 43 -7 98 -36 178 -156 163 64 -6 -51 -99 20 279 -94 -34 179 -247 4 -6 -203
7063b03J22j86K29l8n1L61q1l07q9K75j14P0Q5q7j5J98j25r5p8Q8K76l27J72K23
$$ -203 -81 -267 -38 -76 -127 234 153 -154 -243 32 -82 -12 73 -14 -29 169 44 -51 -129 -41 235 -92 80 303
7087C03n78K80J50l03Q7Q4J25m01N73m75J99J03j45k42P5J36Qn0K4J99Q9l13K65
$$ 303 -275 5 155 -148 -61 23 148 -253 320 -155 44 147 2 -240 -165 -29 -21 -71 -47 152 241 -72 193
7110A93o4k85Q3K36k92K2J49J26j13q0K33k16k40r3L35L3q0M9K15j13J61k61R5
$$ 193 129 -156 -73 163 -129 -107 42 168 55 -25 208 -8 -248 -341 -6 27 -53 -4 211 98 259 -2 93
7133I3l2N6j74o1J76J3l72K80K5j36K01j47j9Q9k42K18k8L8M6k1K33l39J02m7
$$ 93 61 117 -57 -118 58 71 -301 -21 4 -132 69 -78 -97 -8 -250 -32 -60 -22 24 3 236 -103 -1 -48
7157d8j55qK95j14L45k45l47L47j78o9O6J90J89j15m19L08n4K90j44k91J43K9
$$ -48 -203 -211 84 -30 315 70 -277 70 -108 -177 -111 79 268 153 -266 42 -12 278 134 -157 -14 15
7179A5K39j29L5J29m65J28K19j61qL6pRj20N9O7J10K02m54jJ15J35j83k41J43
$$ 15 254 125 160 289 -176 -48 171 10 2 38 31 40 -80 -21 46 156 358 -96 -97 18 153 -30 -271 -128
7203a28M85l26R4j41J46l72L93k99J32j51L79j17m1n4M5j61m7L0K34q6J40j84
$$ -128 357 31 125 -16 130 -242 151 -148 -16 -167 212 95 54 0 45 -116 -163 -133 101 15 155 -29
7225b9L3O4j0k03O5L1j20Q8q0L47k00R5m04M00Rj20m4L69o00K64q7K99l52J77
$$ -29 4 68 58 -145 -80 -49 -169 -81 -161 186 -14 81 -323 77 86 -34 -78 291 -309 -45 -132 167 -185 -8
7249hK49j97p5kJO9J86k73m6N6J11j0k46JJ35O3N3P8pn6j02n5q7J84k62J52r1
$$ -8 241 44 -31 -33 -32 37 223 -50 -96 -40 71 61 -185 -184 -49 14 67 145 138 82 -20 -75 -162 22 -240 -88 -179
7276a79J58j34K31q4k09J54L30l22P1Q0j11O0l24K66P3r6J00o55O37P1j75J86
$$ -179 -21 -155 76 -8 -217 -63 267 -55 16 96 -15 45 -279 -13 60 -36 64 -591 46 117 -58 128
7298A28m13J68L30j89L1j17m8J32p0Q9n64P21j91j39j6n8P2J08r9K46r0L2J40
$$ 128 -285 -117 213 24 55 -62 -110 22 -48 41 -523 198 7 -132 -148 -206 -134 -26 -125 121 31 63 203
7321B03k30K31j45K95l71J52P3l52J18K02j96j0j83N2R5j49K10n3J65k22J91k48
$$ 203 -27 204 59 354 -17 135 208 -144 -26 176 -20 -30 -213 -161 -66 -215 -5 -58 107 -115 76 -172
7343a72J12L02k38M9k98L03m7J64r0J61l86R1j11K65k44q9K82J88k46R6j3r3k19
$$ -172 -60 242 4 53 -245 58 11 175 85 246 -140 -49 -160 105 -139 -228 54 242 -4 92 79 -14 -233
7366b33J10J29j6J21N8L3k48J47N3j48k18L58j50J10j35K08j64k68M20l40J70
$$ -233 -123 6 -10 111 169 202 -46 101 154 6 -212 146 -4 106 -29 179 15 -253 167 -173 -3
7387cj19J99m06L13J50L0L6k3j30J85k49J14N7k90K75kj56J77J0m2K28m08L02
$$ -3 -122 77 -329 -16 134 164 200 177 47 232 -17 97 154 -136 139 137 -19 158 168 126 354 -54 248
7410B48Jq8j62j40M82m02J24Oo1K1K7j90J92J67j79J9j04Q0j3L6o6J60k99J20
$$ 248 249 161 -1 -141 341 -61 63 69 8 29 56 -134 58 225 46 65 -39 41 28 64 -2 158 -141 -21
7434b1N6O3n6k90J53Q6L3J02j66J62k42R8kp6L18k15K3j7q5J64j52j35J00nR5
$$ -21 35 98 42 -248 -95 -9 24 126 -40 122 -120 -22 -24 -100 218 3 26 9 -76 88 -64 -199 -99 -104 -9
7459ij30N0oj65J45j58J86J56l6j91J07J99j51N0k8K02l65M6l1J55j05Rj8K13
$$ -9 -139 -89 -95 -260 -115 -273 -87 69 33 -158 -51 148 -3 47 19 221 -144 -98 -129 26 -79 -70 -88 125
7483A25L9k13j52M16k52K95l01J52j44j49n3M3K82j04N4nj60K8K61l09J69K16
$$ 125 164 -49 -201 215 -37 258 -43 109 -35 -184 -237 -194 88 -16 38 33 -127 -99 162 -147 22 238
7505B38mr4R4l05O6L42j88j08j26JJ04J88j49m2Q0p0j06K58j61K49j46l16M21
$$ 238 234 140 234 -71 -5 337 149 41 -85 -84 20 208 59 17 97 27 -79 179 18 267 121 -195 226
7528B26l03J5K01o3PJ03R6o09L92j29J93k50J58Nr6k55L24q9j40O4M57r8l67L4
$$ 226 -77 -62 139 76 83 186 282 -327 65 -64 129 -121 37 42 -54 -309 15 -74 -214 -150 307 209 -158 -124
7552a24k2M81k74l3p1J36j77k2K50l8n2N0l28M81m18J01j03J81o3pK53m12K7K50
$$ -124 -146 335 61 28 -43 93 -84 -106 144 106 54 104 -224 257 -161 -60 -163 18 -45 -52 201 -211 -184 66
7576F6p2m7k5J91J00l14JJ75j7R1k16K70k05o1J11j10L93j28k34J05J69j16k24
$$ 66 -6 -53 -78 113 213 -101 -100 75 58 149 -67 203 -2 -63 48 -62 331 203 -31 74 243 127 -97
7599i7J65J01r3q6J1j03Q2J38k00K93k08P5j71L5l6K42k90j44L72j15k0j21Q1
$$ -97 68 169 76 -10 1 -102 -20 118 -82 211 3 78 -93 -58 -94 148 -142 -286 86 -29 -49 -170 -89
7622h9K0L34l43k06L41j37K00j4Q9Lj32j13O4k2r6J42j92M31k84K02k50L6p1k47
$$ -89 -69 265 -78 -284 57 -80 120 106 195 198 66 -47 17 -5 -101 41 -151 280 -4 198 -52 -16 -87 -334
7646c34L91l3q8J01J5J82l86J66K50o8l08J25J86j14q9J53j10K08k60j65K16J03
$$ -334 57 24 -64 37 52 234 -152 14 264 196 -112 13 199 85 -4 149 39 247 -13 -178 38 141
7668A41l37K62k70L30l2p0j52K06q7R9j43K32k46L2j3ON7o0j80L46k72k7K02L73
$$ 141 -196 66 -204 126 94 24 -128 78 -9 90 -53 179 -67 -35 -48 -42 15 -45 -225 121 -151 -178 24 397
7692C97l91j52N14l81J02r2j23K01j11k8KK15j90j53Q1L2R3J40J68o01L34lk20
$$ 397 6 -146 368 -13 89 -3 -126 75 -36 -64 -62 153 -37 -190 -109 -77 16 156 324 -277 57 54 -166
7715a66J36j22M08l93L42l4r6l85N55j13j88K57j16j85P5L5N8r4Q9N3j51L7j00
$$ -166 -30 -152 256 -137 205 171 75 -310 245 132 -56 201 85 -100 -25 10 68 -26 63 116 -35 2 -98
7738i8J9P3j01j8J42O4j68l3p0J70O3J25m89N42j33M6L4M4j85k03L51K30l53K21
$$ -98 -79 -6 -107 -125 17 81 -87 -120 -190 -20 43 168 -321 221 88 134 168 212 27 -176 175 405 52 273
7762B73k65k86K34P2j70R1m3J55j66M75o41L35O3q0r8p1J55k75N5PM95j59p9j82
$$ 273 8 -278 -44 28 -142 -51 -94 61 -105 370 -271 64 127 47 -51 -122 33 -242 -187 -180 315 156 77 -105
7786a05K82l51J95J62mj40j24K03j60N7r2J01J22k0l94L2M45j14k55M79j56l54
$$ -105 177 -174 21 183 179 39 -85 118 -42 15 -77 24 146 126 -268 -236 209 95 -160 319 163 -191
7808a91L25j7n6j45K08J06j90J23K5k48K0l2oJ86l05N02j62l24L77k07Q9j77j59
$$ -191 134 117 61 -84 124 230 40 163 188 -60 -40 -72 -78 108 -197 305 143 -181 196 -11 78 -99 -258
7831b58K06J25p1j95Q0J48N1J39k99P5l9j37K62j13l7K90j71n2K53q9K7l71J53
$$ -258 -52 73 2 -193 -113 35 86 225 -74 1 -38 -175 87 -26 -63 227 56 4 257 168 195 -176 -23
7854b3j37K41j51L65j83j21M7l8J19k1l84J24J97nl2K2j9K61j51l15M0J66R3l
$$ -23 -160 81 -70 295 112 -9 38 0 119 98 -286 -162 35 30 -2 20 1 262 111 -204 -164 2 95 92
7878I2L2j02n9K69k44j91L2k6Q0O7l2K70k43p6N7p3N26k35j00n3K49j52l62J30
$$ 92 124 22 -37 232 -12 -203 -171 -197 -117 -50 -82 188 -55 -131 -74 -147 379 144 44 -9 240 88 -274 -144
7902a44J23K32m15M09k26J41lj59L36l23J11K38n96K30R0l69N14j33k7q8n1M1
$$ -144 -21 211 -204 205 -21 120 117 -42 294 -29 82 320 -276 -46 44 -325 189 56 29 -59 -110 -69
7924f9n4J18K74j00j99p1L2K20m75M55l24k3L6J23J50P2k37J88J2k49L17K1j19
$$ -69 -123 -5 269 169 -30 -101 -69 151 -324 131 -193 -216 -180 -57 93 165 -72 116 128 -121 196 217 98
7947I8l29K95j06K1L6J94m91K61P4Km04P59m97K50l13P6L6J15l47M01j02j19J68
$$ 98 -231 64 -42 -21 15 209 -282 -21 53 55 -349 410 -87 163 -150 -74 -38 77 -270 131 29 -90 78
7970G8j46J92p4Jl05K31j35M30j45J15k21J76j88Pq7J21k92J71L10p4k06L13l23
$$ 78 -68 124 50 51 -254 -23 -158 272 127 242 21 197 9 16 -71 50 -242 -71 239 165 -41 272 -51
7993e1J74m35Q1K98J08%j00m00K50L23m54J99j95K65m1M08J1m72J64k89n2L63
$$ -51 123 -312 -231 67 175 175 75 -325 -75 248 -206 -7 -202 63 22 430 441 -31 133 -156 -208 155
8015A55M4m37L60l6R5j31j75J47M9j68K2J42n1p0n9J89j94J15j21L77j97q2j71
$$ 155 199 -238 122 86 181 50 -125 22 71 -97 -75 67 16 -54 -113 76 -118 -3 -124 253 56 -26 -197
8038a97K43k9nq1J41k08j17M15j83R9k08J56mN4j40L14m16J44K78j88k05L87l38
$$ -197 46 17 12 -69 72 -136 -253 162 -21 78 -130 26 22 76 -64 250 -166 -22 256 68 -137 250 -88
8061h8j18J74N1R7Pk03Q1j89R1J63Rp7kN9j71K0J62m6L5O5k61q2L50q6k51K74
$$ -88 -206 -32 19 116 123 -80 1 -188 -97 66 75 -2 -4 55 -116 -96 66 20 55 120 -141 -223 127 41 -210 64
8087F4J09K44j51l37j9N0j39JK31K3J82k49P1k86K08j57l5J90j0R9J69r6m55M37
$$ 64 173 417 266 -71 -90 -40 -179 -178 53 76 258 9 80 -206 2 -155 -190 0 -10 89 258 162 -293 144
8111A44l58J03j40K01k3K36k33O6R7l2m8j20j17L07j79L3L1O5j46n3P0L42r1j48
$$ 144 -214 -111 -251 -50 -73 163 -70 -4 93 61 13 -107 -224 83 -96 -63 -32 33 -113 -166 -96 246 155 7
8135GJ20o5j25K8R0o3j08J86p6L73m73n6J80M17o96K25o6O4pJ01K31l41rJ41j43
$$ 7 127 62 -63 -35 55 -8 -116 70 -6 367 -106 -162 18 435 -261 -36 -102 -38 -45 56 287 -54 -63 78 -65
8160f5R0j07mN6M2j21Q3J38r1nJ43j38k78J30O9N3k47J88N1J18l0P6l9j88j51
$$ -65 25 -82 -86 -30 12 -109 -26 112 21 16 159 21 -257 -127 -58 -5 -252 -64 -13 105 75 151 112 -76 -227
8185b27L16L8k59J36j09L3
$$ -227 89 127 -132 4 -105 -72
8191g2
$$ Imaginary data points
##PAGE= N=2
##DATA TABLE= (X++(I..I)), XYDATA
0@%%%%%%%%%%%qJ6j6J6j8K6l2M0m8N6p2Q8j04J20j36J60j89K17k50K86l26L71
$$ 0 0 0 0 0 0 0 0 0 0 0 0 -8 8 -8 8 -10 16 -16 24 -24 32 -40 48 -56 64 -72 88 -101 116 -134 152 -174 197
33A97m20M75n36O02o75P56q44R41j045J160j288J424j573J737j916K113k328K564
$$ 197 -223 252 -284 318 -357 399 -445 496 -549 611 -677 747 -826 911 -1005 1108 -1220 1344
51A344k824L112l433L790m192M649n171N772o476P315q331R595j1218J3390j6460
$$ 1344 -1480 1632 -1801 1989 -2203 2446 -2725 3047 -3429 3886 -4445 5150 -6068 7322 -9138
66i138K1164k9366M7736j65832L7267K31503j70461n6649M9912O2499M6877K646
$$ -9138 12026 -17340 30396 -135436 -98169 133334 -37127 -93776 -43864 18635 65512 68158
78F8158j16175M6609J46178o5004j72343Q0622J10964q3644p7945L6317J0535
$$ 68158 -48017 -1408 144770 79766 -92577 -11955 99009 15365 -62580 -26263 -15728
89a5728K3798k241p8922r72R2002k3619n9933N9169N8940m4439k3620L4392K5328
$$ -15728 8070 5829 -73093 -74065 17937 -5682 -65615 -6446 52494 8055 -15565 18827 44155
102D4155J6098q167o5674n825O8417l1436r0641K5595N0227k7228k2799J1525
$$ 44155 60253 52086 -13588 -19413 49004 17568 -73073 -47478 2749 -24479 -47278 -35753
114c5753K2764M1246J277m9267R003P6663M140p7470j4175N1591l060m3091p913
$$ -35753 -12989 28257 29534 -19733 -10730 65933 70073 -7397 -21572 30019 26959 -16132 -24045
127b4045J3999J1394j0941k6975J2347L6314m966k8605l826K9909K5339j9419
$$ -24045 -10046 1348 -9593 -36568 -24221 12093 7127 -21478 -25304 4605 29944 10525
139A0525k2937K4815K3643k0564j9614J6681J8069j9815k9640k210J2930R000
$$ 10525 -12412 12403 36046 15482 -4132 12549 30618 10803 -18837 -21047 -8117 883
151H83j3772k8799J6182L9781j3629k0180K6622J7347r526n133J435O066O705
$$ 883 -12889 -41688 -25506 14275 646 -19534 7088 24435 14909 9776 11211 17277 23982
164B3982j5126k7899N503K6634j2559l0316J4368J8514j4365j160J0412K84J2451
$$ 23982 8856 -19043 -13540 13094 535 -29781 -15413 3101 -11264 -12424 -2012 -1728 10723
177A0723O33k0379J1905K6598j3424k3542J0129J4381j2828j1271L366n591k257
$$ 10723 11356 -9023 2882 29480 16056 -7486 2643 17024 4196 -7075 -3709 -9300 -11557
190a1557N769j2832j053K6253m768j9607J7762J9843p154m462M877o14k084q40
$$ -11557 -5788 -18620 -19673 6580 1812 -17795 -33 19810 12656 8194 13071 12457 10373 9533
204I533q206p860O814j141k0337L297J9036p641r526R047M829L992N362l818n4
$$ 9533 1327 -6533 281 -860 -21197 -17900 1136 -6505 -16031 -6984 -2155 1837 7199 3381 3327
219C327Q655K006p713k177Q906k603j4959m08M324n777k899l124m353P014N307
$$ 3327 11982 13988 6275 4098 13004 10401 -4558 -4966 -642 -6419 -9318 -12442 -16795 -9781 -4474
234d474m088M108J0378L153j933J512Q018J33q698l015k312l526l64p345o725
$$ -4474 -8562 -4454 5924 9077 7144 8656 16674 16807 8109 5094 2782 -744 -1108 -8453 -15178
249a5178N909J743m472K824O067M096n62p62N702L474j334n99k477N01M066n309
$$ -15178 -9269 -7526 -11998 -9174 -3107 989 427 -335 5367 8841 7507 6908 4431 4932 8998 3689
265C689m628L503k065n084j395j144O70p86l039K012L754M136K471q64N745N504
$$ 3689 -939 2564 499 -4585 -5980 -7124 -6454 -7240 -10279 -8267 -4513 -377 2094 1230 6975 12479
281A2479l830m75K494m463l537k832n127q57r8k962j534K646N307R59r51N767
$$ 12479 8649 8174 10668 6205 2668 -164 -5291 -6148 -6246 -9208 -10742 -8096 -2789 -1830 -2781 2986
297B986L244k941J964Q79k676J590k508l640K160M69k862o69k56R34n67k279J152
$$ 2986 6230 3289 5253 6132 3456 5046 2538 -1102 1058 1527 -1335 -2004 -2260 -1326 -1893 -4172 -3020
314c020j64l28J233m87K158M330j613N19L291p75m25m2l213j016j408k885o95
$$ -3020 -3184 -3512 -2279 -2766 -608 3722 2109 2628 5919 5144 4719 4677 1464 448 -960 -3845 -4540
331d540n79P1J215l75K765L056k36J625J131j255J468j090k961R09j555k490J012
$$ -4540 -5119 -5048 -3833 -4208 -1443 1613 1377 3002 4133 2878 4346 3256 295 1204 -351 -2841 -1829
348a829l33k63J504k85N16J223q7O51n39m32J776j401o19J820j471pJ217j579
$$ -1829 -2162 -2425 -921 -1206 -690 533 446 1097 558 126 1902 501 -118 1702 231 224 1441 -138
366a38J59N84j398m09l37p18R94l28K0J532K37J077Q66n96J531q6k349J179m60
$$ -138 21 605 -793 -1202 -1539 -2257 -1263 -1591 -1571 -39 198 1275 2141 1545 3076 2990 641 1820 1360
385A360l004M85j224j228J269Q4l7Q13R98J526k04L97K406r11j304J278j278j084
$$ 1360 -1644 -1159 -2383 -3611 -2342 -2258 -2295 -1482 -484 1042 838 1235 3641 2730 1426 2704 1426 342
403C42L66j599q70O04j178k58N95k88J154K0k52K093J7OJ293o84Q05L08j547O64
$$ 342 708 -891 -1761 -1157 -2335 -2593 -1998 -2286 -1132 -1112 -1364 729 746 752 2045 1361 2166 2474 927 1591
423A591O4j939k24l34j179N79r82j80J029m74P67Q51j29J561N74l38J170J27l30
$$ 1591 1655 -284 -508 -842 -2021 -1442 -2424 -2604 -1575 -2049 -1282 -431 -560 1001 1575 1237 2407 2534 2204
442B204J54j276n06L99k024j55J67j792O85J98q68J467R65o6J100Q13K18M96m90
$$ 2204 2358 1082 576 975 -1049 -1204 -1037 -2829 -2144 -1946 -2814 -1347 -382 -448 652 1465 1683 2179 1689
461A689L88j94j074M83j401o30R41j262j163K031q66j210J863L12j119J284L49
$$ 1689 2077 1883 809 1292 -109 -739 202 -1060 -2223 -192 -1058 -2268 -405 -93 -1212 72 421
478D21m62K33J090K95j494J245Q78k400O96J483k663j88J598k038o63J730j233
$$ 421 -41 192 1282 1577 83 1328 2206 -194 502 1985 -678 -866 732 -1306 -1969 -239 -1472
495a472r7J158L47k89O32J054k15r68J831r77j390J571r33j583K203m87k378J945
$$ -1472 -1569 -411 -64 -353 279 1333 1118 150 1981 1004 -386 1185 252 -1331 872 385 -1993 -48
513d8P74j634P80R91j263k56J124K5j718P86J232j388K70J726j854K71J920j372
$$ -48 726 -908 -128 863 -400 -656 468 493 -1225 -439 793 -595 -325 1401 -453 -182 1738 366
531C66n68J060n16n30N40n90m12j3N62n02l33J029J61p75J121m19j116J642k41
$$ 366 -202 858 342 -188 352 -238 -650 -663 -101 -603 -936 93 254 -521 600 181 -935 707 466
550D66j304J295J42r64P38M88o99J00L9Nm68m92M87n85m5M67n33N21P29p44P15
$$ 466 -838 457 599 -365 373 861 162 262 301 306 -162 -654 -167 -752 -797 -330 -863 -342 387 -357 358
571C58O67j038Q72L69o72j69N28r92K22J6n20l29o4L45m78L67O66o65oJ342q58
$$ 358 1025 -13 859 1228 556 387 915 -77 145 161 -359 -688 -752 -407 -885 -518 148 -517 -523 819 -39
592c9m21J681o70o02P34k6n78M62l67k90J11k93M7p23P99k10j106J360L45j352
$$ -39 -460 1221 551 -51 683 657 79 541 174 -116 -5 -298 -251 -974 -175 -385 -1491 -131 214 -1138
612a138J113Q96r53N44Q14j110j24Q23n77m24K81L34j034K5O18o61l39Q68k49
$$ -1138 -25 871 -82 462 1276 166 42 865 288 -136 145 479 -555 -530 88 -573 -912 -44 -293
631b93p46J531l27j090J577P3o38O27j47o44J03K92m19n5L07rj102R87K34o34
$$ -293 -1039 492 165 -925 652 725 87 714 567 -77 26 318 -101 -156 151 142 -960 27 261 -373
651c73O1P74p51j24N89o10P8P43l82P1J99J08Qk81M44j49r68O47P1o41M42n9n94
$$ -373 -312 462 -289 -413 176 -434 -356 387 5 76 275 383 391 110 554 405 -563 84 155 -486 -44 -103 -697
674f97P73L0l17J66m4j01K42k05K41K90o10K47kJ54M5j02rJ23k44K89k18k78N2
$$ -697 76 106 -211 -45 -89 -190 52 -153 88 378 -232 15 13 167 212 110 101 224 -20 269 51 -227 -175
697a75n7m68N05Q7n51O85L0p0M62O0k01J41K79k88k95j78K02k80j15J47o71J4
$$ -175 -232 -700 -195 -108 -659 26 56 -14 448 508 307 448 727 439 144 -34 168 -112 -227 -80 -751 -737
719g37P25l06j13N02n44J43M49Q0j75K50k12L44k70L65K02p20J93P7o10L74m10
$$ -737 -12 -318 -431 71 -473 -330 119 199 24 274 62 406 136 501 703 -17 176 253 -357 17 -393
740c93m23M61J28l41p2N42l35M25L98J17J49l79L67m40q2R9l75k57O62n36j41
$$ -393 -816 -355 -227 -568 -640 -98 -433 -8 390 507 656 277 644 204 122 221 -154 -411 251 -285 -426
761d26L12l09J92L29k75k5j84J65J59mM16R2m31M02J85m49K51n1k79K6J41p25
$$ -426 -114 -423 -231 98 -177 -202 -386 -221 -62 -66 350 442 11 413 598 149 400 349 70 96 237 -488
783d88K16j20J77K5n7j9L21RK63j4j43J86j67P5P9l2n26L21m98J87K54l4j84K27
$$ -488 -272 -392 -215 -190 -247 -266 55 64 327 313 170 356 189 264 343 311 -215 106 -392 -205 49 15 -169 58
807E8k75L1M67m88M49m63J69L17j98K55o8J33k75L13m74K29k33k52K83p4l08N35
$$ 58 -217 -186 281 -207 242 -221 -52 265 67 322 254 387 112 425 -49 180 -53 -305 -22 -96 -404 131
829A31j92lRJ01J6k53J98K04j79j98L88j65k80Q04n29k39L64k49K57L8k59N5O2
$$ 131 -61 -64 -55 46 62 -191 7 211 32 -166 222 57 -223 581 52 -187 177 -72 185 223 -36 19 81
852H1j26J10k24j28L03l16M79j00l32L67j53L4J70Rj56J80Q8l36L38k55j38j02
$$ 81 -45 65 -159 -287 16 -300 179 79 -253 114 -39 -5 165 174 18 198 286 -50 288 33 -105 -207
874b07j01K43j30j80K61j11Q0O1j59K7M08m1m9J17q3M6l18K63o8j18J79k22n4
$$ -207 -308 -65 -195 -375 -114 -225 -145 -84 -243 -216 192 151 102 219 136 182 -136 127 59 -59 120 -102 -156
897a56p6J8L4j87J40o5L85k20j5L25r7j35L00j92NK00k66l2J7q7J84l55j67M80
$$ -156 -232 -214 -180 -367 -227 -292 93 -127 -142 183 86 -49 251 59 64 264 -2 -34 -17 -104 80 -275 -442 38
921C8k88K19l14M09J9l1j44K34J34m04M96j11J05j55k12q5o6J82j18j46k30L10
$$ 38 -250 -31 -345 64 83 52 -92 142 276 -128 368 257 362 207 -5 -90 -156 26 -92 -238 -468 -158
943a58l63K40M24k47j51L25l3p2J69L44k94L14l94Q7j57j8j10J82k86L04k68k24
$$ -158 -521 -281 143 -104 -255 70 37 -35 134 478 184 498 104 191 34 16 -94 88 -198 106 -162 -386
965c86K06m8j49M34J1OJ39r4j14O7J1K91k56q8q9J7J0r8m1K42j35k29N89l32j87
$$ -386 -180 -228 -377 57 68 74 213 119 5 72 83 374 118 30 -59 -42 -32 -130 -171 71 -64 -293 296 -36 -223
990b23K51O7o0K78l15k39N11j18K40m19J97k56P0j9p8J72k64k5K15LJ32n13M50
$$ -223 28 95 35 313 -2 -241 270 152 392 -27 170 -86 -16 -35 -113 59 -205 -230 -15 -12 120 -393 57
1013E7Jj80K14k35M24r6n3l21o0L77l17L99k80J54K26m93J47j9j66J51M8k23K67
$$ 57 58 -122 92 -143 281 185 132 -189 -249 128 -189 210 -70 84 310 -183 -36 -55 -221 -70 -22 -245 22
1036B2k38m0K13m1L03j22J4R5j81r4L05n07L68K9l75L05L8k43N7K08r2k32P7K63
$$ 22 -216 -256 -43 -84 219 97 111 206 25 -69 236 -271 97 126 -249 56 94 -149 -92 116 24 -208 -131 132
1060A32m4m0K73k87nJ28M1l71q3L56N8R4k14k91K60J10l01j2J48l0l00M22l10
$$ 132 88 48 321 34 29 157 198 -173 -256 100 158 252 38 -253 7 117 -184 -196 -48 -78 -378 44 -266
1083b66L43q3r7K95j00L3l26K28K72m56P3K07j08k65J50J00l27K48k51N37o4r9
$$ -266 77 -6 -103 192 92 125 -201 27 299 -157 -84 123 15 -250 -100 0 -327 -79 -330 207 143 44
1105D4r0k22K74J11j54K42k15l58P40k90j95L20j99k58O8K1j59K03J9J15j90K30
$$ 44 -46 -268 6 117 -37 205 -10 -368 372 82 -113 207 8 -250 -182 -161 -320 -117 -98 17 -173 57
1127E7j71P8K45m2j97M22N5l31m9J76m40J81R6k66R9N2j53L65n9L8r0l15K10J68
$$ 57 -114 -36 209 167 -30 392 447 116 67 243 -197 -16 80 -186 -87 -35 -188 177 118 156 66 -249 -39 129
1151A29m8J9K1k4K29m3j96N8k12P7j8N0l53j6R8R2J09K58j10k61L4J18j26m1L42
$$ 129 81 100 121 97 326 283 87 145 -67 10 -8 42 -311 -327 -229 -137 -28 230 120 -141 -107 11 -115 -156 186
1176A86k90l0K63m38N97m65J7K66o8j53K38n7m0J53m55K91J49p1J65k21k49K60
$$ 186 -104 -134 129 -309 288 -177 -160 106 38 -115 123 66 26 179 -276 15 164 93 258 37 -212 48
1198D8j16J98K74k51m00L62k16R3j16K4j13J17O5k50L86K14j81k22P2J03K9j10
$$ 48 -68 130 404 153 -247 115 -101 -8 -124 -100 -213 -96 -31 -281 105 319 138 -84 -12 91 120 10
1220A0L54m10K56k6j61p2K05k19o7J53n9O7j93J91L8m1j3J01l74N54q8l51N5M98
$$ 10 364 -46 210 184 23 -49 156 -63 -130 23 -36 31 -162 29 67 26 13 114 -260 294 206 -145 -90 408
1244D08k39m9k84J0J4m8J9J78q2K95p5k39M12m11k72K41J12j47Q3%O5R5J63m35
$$ 408 169 120 -164 -154 -140 -188 -169 9 -73 222 147 -92 320 -91 -363 -122 -10 -157 -74 -74 -9 86 249 -186
1268a86J07N73l57k95J83J06l21Q2M4l6K04j85j77L31k05K99M8j83o4L68n14J05
$$ -186 -79 494 137 -158 25 131 -190 -108 -64 -100 104 -81 -258 73 -132 167 215 32 -32 336 -178 -73
1290g3L32p5j50J73l81L86j32k36K77%l61J59N6q9O13n27K4J52l4J08j56R5K15
$$ -73 259 184 34 207 -174 212 80 -156 121 121 -240 -81 -25 -114 499 -28 -4 148 114 222 66 161 376
1313C76m8l59J99l35j59K78J30k14M4J12P0l26J46K56j76j98K80L3k53J95L82
$$ 376 328 -31 168 -167 -326 -48 82 -132 -88 24 94 -232 -86 170 -6 -204 76 109 -144 51 433
1334D33l31r3O8k6j47K37l4j62J19j09lk11K30j13L17k17J09J69j28l06K17J31
$$ 433 102 9 77 51 -96 141 107 -55 64 -45 -48 -259 -29 -142 175 -42 67 236 108 -198 19 150
1356A50j83Pr1K08o6K03k00j87N9mL0m69Q39q5m02J79j10Q0j8j59M54j15l30J94
$$ 150 -33 -26 -117 91 25 228 28 -159 -100 -104 -74 -543 296 211 -191 -12 -122 -42 -60 -219 235 120 -210 -16
1380a6jj04K46l24J92j09M4K01J5k4k67J99j27j02J81n0j5jJ40l18K46M8N7l18
$$ -16 -17 -121 125 -199 -7 -116 -72 129 144 120 -147 52 -75 -177 4 -46 -61 -62 78 -240 6 54 111 -207
1404b07J49j03k8K78j50M6o0K11m48L31j14j00K25N6j14M2J12q7L19l97J1J25
$$ -207 -58 -161 -189 89 -61 -15 -75 136 -312 19 -95 -195 30 86 -28 14 126 39 358 -39 -28 97
1426I7o6r4J04J97o4k46N8k0OM5J18j77K46j5n4l10J73J53L39l55j45M0J82k77
$$ 97 31 -63 41 238 174 -72 -14 -34 -28 17 135 -42 204 189 135 -175 -2 151 490 135 -10 30 212 -65
1450f5K9l9L71j83j95L83k41k49R9K35K5k63l4J15k75M97j94K41k30J29O9k12
$$ -65 -36 -75 296 113 -82 301 60 -189 -90 145 170 -93 -127 -12 -287 210 16 257 27 156 225 13
1472A3M0k85K64j54k2K63k51m4k4L48J08j7n78O13l62N3J45j9j56K8K58n0k32
$$ 13 53 -232 32 -122 -144 119 -132 -176 -200 148 256 239 -339 274 -88 -35 110 91 -65 -37 221 171 -61
1495f1m2J33J68l53K71l17J56J53k38J58P6k55K84J1p1j21K27m9k60K95p8j56
$$ -61 -103 30 198 -155 116 -201 -45 108 -130 28 104 -151 133 144 73 -48 179 130 -130 165 87 -69
1517f9L9k4K02l41L67l37O5L1o8J71M8J52j64j37K36Q9k48O5k18J11k8j87J17
$$ -69 -30 -54 148 -193 174 -163 -98 -67 -135 36 84 236 72 -65 171 260 12 77 -141 -30 -58 -245 -128
1540a28PKJ72k34K51q6J06M3k81K29j02j04P9Q1j32J48O9N8j42n1p3J66j71K39
$$ -128 -121 -119 53 -181 70 -16 90 133 -148 81 -21 -125 -46 35 -97 51 120 178 36 -15 -88 78 -93 146
1564A46k98J21J35M1r3k36K78l72M26k10J17Q4j97j11L53j74J42j56Q9j70k9L8
$$ 146 -152 -31 104 145 52 -184 94 -278 148 -62 55 139 -58 -169 184 10 152 -4 85 -85 -114 -76
1586g6K48k48q5L35m84J42M8k00J91K20p1pM9j94J81K45l02J97N6m56L24Q6m43
$$ -76 172 -76 -161 174 -310 -168 -120 -320 -129 91 20 13 62 -132 49 294 -8 189 245 -211 113 199 -244
1609b44P8K32o8j41K96l01J70j38L02l78K88O7l52J48L0j6O0J03n4j11j11m4n3
$$ -244 -166 66 -2 -143 153 -148 22 -116 186 -192 96 163 -189 -41 -11 -27 33 136 82 -29 -140 -184 -237
1632b37J96j52K23J53n10K65K6lJ01j17K7p6J15j86K59j15Q9p0kq8O8J56k67J44
$$ -237 -41 -193 30 183 -327 -62 -36 -39 62 -55 -28 -104 11 -175 84 -31 58 -12 -14 -102 -34 122 -145 -1
1656aj07N0J00k33J66M9j47n8M4q4K47L5P0J21q8j22k19L72m77L58j78j26L9K00
$$ -1 -108 -58 42 -191 -25 24 -123 -181 -137 -221 26 61 131 252 164 42 -177 195 -282 76 -102 -228 -189 11
1680A1m9J79m2l53J1J94R8J04J7k21M32k53J22l86k90M28pM4O0j13j86k4K71j89
$$ 11 -38 141 99 -254 -243 -49 49 153 170 -51 381 128 250 -136 -426 2 -5 39 99 -14 -200 -224 47 -142
1704a42J04k4K50k17J20q4k05N02k15j44K74q3m5j90j0J1J01r8J05J21j14l42
$$ -142 -38 -62 188 -29 91 7 -198 304 89 -55 219 136 91 -99 -109 -98 3 -95 10 131 17 -325
1726c25K23K31J37J09l11K14n14J75J05l5L38k17j73J78j48J8M7j66K8K71Nj99
$$ -325 -102 129 266 375 64 278 -236 -61 44 9 347 130 -43 135 -13 5 52 -114 -86 185 190 -9
1748iMJ38k05Q8p7o3j69K8K59J60l63K41l60L96J52k69N0J6j34K34j54q5J81j46
$$ -9 -5 133 -72 16 -61 -124 -293 -265 -6 154 -209 32 -328 68 220 -49 1 17 -117 117 -37 -122 59 -87
1772h7J33j08P5N4m3k46L26j35j18K0K16j20N5j8j05J63j16J58l47L25j33K4o8
$$ -87 46 -62 13 67 24 -222 104 -31 -149 -129 87 -33 22 4 -101 62 -54 104 -243 82 -51 -27 -95
1795i5J79j33K48Q5l32j6j4K29j2l04n5M47k62J46k80K20j9R4p12O96k42J17L
$$ -95 84 -49 199 284 -48 -64 -78 151 139 -165 -220 227 -35 111 -169 51 32 126 -586 110 -132 -15 -12
1818a2j0n3O8k2k24K46k00K51O0K34m16K94k17O2K13k92J52k19K94l08K73k21
$$ -12 -22 -75 -7 -29 -253 -7 -207 44 104 338 -78 216 -1 61 274 -18 134 -85 209 -99 174 -47
1840d7K41j70k28K33J46J47m63K85q1N6k65Q5j30M04j79L5j86JO4J18L8Rl72L85
$$ -47 194 24 -204 29 175 322 -141 144 63 119 -146 -61 -191 213 34 69 -117 -116 -52 66 104 113 -259 126
1864A26j12J22L5l81J22J66j68J77o3o3j8L08j48j74K6K17l10K1K28k13K35o2
$$ 126 14 136 171 -210 -88 78 -90 87 24 -39 -57 251 103 -71 -45 172 -138 -117 111 -102 133 71
1886G1k7r6K10k02J03k03L20j21p4J88J1j59q0k06J95J06j25NP5m5qmJ29j33j0
$$ 71 44 -52 158 -44 59 -144 176 55 -19 169 180 21 -59 -265 -70 36 -89 -84 -9 -54 -62 -66 63 -70 -80
1911h0K37k28L4Q1M5k02J42J78k16p8q1L6K90m17J76J08O0j53J68j44P1j16J27
$$ -80 157 -71 -37 44 89 -113 29 207 -9 -87 -168 -132 158 -259 -83 25 85 -68 100 -44 27 -89 38
1934C8j80J66j05j88R4J27N0k08M45k38L2k68K25l3kL16l84n6J85J2J30j17K3
$$ 38 -142 24 -81 -269 -175 -48 2 -206 239 1 33 -235 -10 -43 -45 271 -113 -169 16 28 158 41 64
1957F4k46J17p2l9J75o7J13P8l21J81J07J38o7k44J94l1m3J03k54K06K74l99l6
$$ 64 -182 -65 -137 -176 -1 -68 45 123 -198 -17 90 228 161 -83 111 80 37 140 -114 92 366 -33 -69
1980f9J5j10L01N0k80K43j69KR3O5k19n2J45k88K02L2j6p5J11J91j16M62m18R8
$$ -69 -54 -164 137 187 -93 150 -19 -17 76 141 -78 -130 15 -273 -71 -39 -55 -130 -19 172 56 518 100 198
2004A98j45j02M8q1L60k95k6j26J81j68J2K44j34q6J71r9J30mJ38l04m9j90L12
$$ 198 53 -49 -1 -82 278 -17 -43 -169 12 -156 -144 100 -34 -120 51 -48 82 78 216 -88 -137 -327 -15
2027a5L66k32k24J80J38k97mK05k58K44Q1k23L8k23J43K60j46p5J74j84l2P0P9
$$ -15 351 119 -105 75 213 -84 -88 117 -141 103 184 -39 -1 -224 -81 179 33 -42 132 -52 -84 -14 65
2050F5p4j49N0J69j07j94J40J54r5n1J54k23M32m55j2L9JK53N2j61L5m1j95l9
$$ 65 -9 -158 -108 61 -46 -240 -100 54 -41 -92 62 -161 271 -184 -196 -157 -156 97 149 -12 23 -18 -213 -252
2074b52L79k50J76J56r0j55K69k20nQ7k31K66R0J4k82j30J08j01J34L4l9k7Q1
$$ -252 127 -123 53 209 119 -36 233 13 8 95 -136 130 220 234 -48 -178 -70 -171 -37 -3 -42 -69 12
2097A2J63j45J67l99j79L99K6m9r3n0J30R3R7l54O2K11l27L43Q6k62K3k04L62
$$ 12 175 30 197 -202 -381 18 44 -5 -98 -148 -18 75 172 -182 -120 91 -236 107 193 -69 -46 -250 112
2120A12j62m7pp0J61M3p1K13k22R9l90J76K47l6j17Q2l0j3j3j84M52j1k03n0j86
$$ 112 -50 -97 -104 -174 -13 30 -41 172 -50 49 -341 -165 82 46 -71 11 -19 -32 -45 -229 223 212 9 -41 -227
2145b27O5J61J01o7j51R8j03J04J63m0l65M89m81K29J88j40r1J23j24j24J68J8
$$ -227 -162 -1 100 33 -118 -20 -123 -19 144 104 -261 228 -253 -24 164 24 -67 56 -68 -192 -24 -6
2167fj46k2L63l28J56N2J8j18j35J52j49L03l92L21m5p3K08k66qJ48J00k23J20
$$ -6 -152 -174 189 -139 17 69 87 -31 -166 -14 -163 140 -252 69 24 -49 159 -107 -115 33 133 -90 30
2190C0j81j35K51j05K64j22K16m4k97M20m98K87J58l52L67k31J67J6k77l4J69
$$ 30 -151 -286 -35 -140 124 2 218 174 -123 297 -201 86 244 -108 259 28 195 211 -66 -100 69
2211F9K8j88J92k20p4K41j07ol2K70j32k36K65J92k42j28j2K21j95J29j51J44
$$ 69 97 -91 101 -119 -193 48 -59 -65 -97 173 41 -195 70 262 20 -108 -120 101 -94 35 -116 28
2233B8q1J32J38l16R7K23m10M68m33J47P7l2J23k25J1K89j11J56l31N8j3K9R3
$$ 28 -53 79 217 -99 -2 221 -189 279 -154 -7 70 38 161 -64 -53 236 125 281 -50 8 -5 24 117
2256A17k60L42k48K55k38o9j6J98j81Q4m1J39J1j98K92K1k41K02n8j04o7k1J97
$$ 117 -143 199 -49 206 -32 -101 -117 81 -100 -16 -57 82 93 -105 187 208 -33 169 111 7 -60 -81 116
2279A16k55K54j96K03k3k57Q1J9R8J58k91K7L9J16j95k4J55Q9k3j97J02J91N5
$$ 116 -139 115 -81 122 99 -158 -77 -58 40 198 -93 -66 -27 89 -106 -130 25 114 91 -106 -4 187 242
2302B42Q5k68j98P2o0J84j39O0K97j66K0l46L67n91M39M9j41L16j27k53Q0J89
$$ 242 327 59 -139 -67 -127 57 -82 -22 275 109 129 -217 150 -441 -2 47 -94 222 95 -158 -78 111
2324A11l80L62k55J88L17n21J13k03M87l60m8L01k28P3O5N8J25l42J14K99p1k96
$$ 111 -269 93 -162 26 343 -178 -65 -268 219 -141 -189 112 -116 -43 22 80 205 -137 -23 276 205 -91
2346i1L01k63J57J35j04k12L83k65j30J71J88L9o98M71N8k4J28j57K8l40J62p8
$$ -91 210 -53 104 239 135 -77 306 41 -89 82 270 309 -389 82 140 116 244 87 115 -225 -63 -141
2368a41Q6J46j77O5Jk3LQ5l8p9k05K19L76n60K50q0k3K00R8j27J61l91M82l88
$$ -141 -55 91 -86 -21 -20 -43 -40 45 7 -72 -277 -58 318 -242 8 -72 -95 105 203 76 237 -154 328 -60
2392f0M18l36o3o1j50K40K25j91j99J14k92N81l09J08J29j04rK5l3l0K99j79R5
$$ -60 358 22 -41 -102 -252 -12 213 22 -177 -63 -355 226 -83 25 154 50 41 66 33 3 302 123 218
2415B18j79o3j06N3L95n77J98q6K6K55m6o9Q4j96J18j94N5K25l85L90O1m64K93
$$ 218 39 -24 -130 -77 318 -259 -61 -147 -121 134 88 19 103 -93 25 -169 -114 111 -274 116 177 -287 6
2438FJ8l47J57K47ok4j3j74J29j65L12l53J07P1r7L4N9J62m3j10k50J79Q0J41
$$ 6 24 -323 -166 81 75 51 38 -136 -7 -172 140 -213 -106 -35 -132 -98 -39 123 80 -30 -280 -101 -21 120
2462A20J05k89j53j62O06j15j87k70M29l12J45L18j63k47K0J31K60j59kn1k16
$$ 120 225 -64 -217 -379 227 112 -75 -345 84 -228 -83 235 72 -175 -155 -24 236 77 75 24 -192
2483a92K74J77m10P2J31j08j03Q9L60r2j81q8J8M8K5J59Rj87J70n2j34j7R9lK13
$$ -192 82 259 -151 -79 52 -56 -159 -70 290 198 17 -71 -53 -5 20 179 188 1 171 119 -15 -32 67 64 277
2508B77j84K6J89l84J29j6j60k4K19j41M0K88m12R9J66m1k83J45j73K52M3n7J27
$$ 277 93 119 308 -76 53 37 -123 -147 72 -69 -29 259 -153 -54 112 71 -212 -67 -240 12 55 -2 125
2531A25l19J92l2J00j16O5k28J64oL03k78K1l0K66m01J11K28j05j91R9p2M2oK42
$$ 125 -194 -2 -34 66 -50 15 -213 -49 -55 248 -30 -9 -39 227 -174 -63 165 60 -131 -32 -104 -62 -68 174
2555A74K7k81J98n10N11k32L8p1L13k33J24nom2p3J74k5l34K26J42N1k18K94k05
$$ 174 201 -80 118 -392 119 -113 -75 -146 167 -66 58 53 47 5 -68 106 81 -253 -27 115 166 -52 242 37
2579C7q9r1L03J8l01J42p3K30k79Lj32J63J80k83J83j9M63n79Q6j53L42l19oK75
$$ 37 -52 -143 160 178 -123 19 -54 176 -103 -100 -232 -69 111 -172 11 -8 455 -124 -38 -191 151 -168 -174 101
2603A01J83l75K04J95l04p0N1J84p2j99j97M58J7j47L3J91k90K8N0p6LR0j91K04
$$ 101 284 -91 113 308 4 -66 -15 169 97 -102 -299 159 176 29 62 253 -37 -9 41 -35 -32 58 -133 71
2627G1J14l91L25N9l45K13k14L20j88J67j73J26J83l02J24j11j63j3K67N7j12
$$ 71 185 -206 119 178 -167 46 -168 152 -36 131 -42 84 267 -35 89 -22 -185 -198 69 126 14
2648A4j01M4K11J01k58r0M5J8k58K26K03k51J2J27J28J37k57l08N6L39m3j43J63
$$ 14 -87 -43 168 269 11 -79 -34 -16 -274 -48 155 -96 -84 43 171 308 51 -257 -201 138 95 -48 115
2671A15q3K34j98o5K48k99J4p3J35Rk46o9K00L17m01K59l23K85j70q0J74J44m0
$$ 115 32 266 68 3 251 -48 -34 -107 28 37 -209 -278 -78 239 -162 97 -226 59 -111 -191 -17 127 87
2694H7j02K0j91J73L02n0m40L20k49K15J1Oj99K56k50J20J5N6j87J66J13k74K99
$$ 87 -15 5 -186 -13 289 239 -201 119 -130 85 96 102 -97 159 -91 29 44 100 -87 79 192 -82 217
2717B17j99L71k57j71o6rM46k35j9K64n41O0J6K42L3p8l0J15j75K03m7R1k28J91
$$ 217 18 389 132 -39 -105 -114 332 97 78 342 -199 -139 -123 119 152 74 44 159 -16 187 140 231 3 194
2741A94p9k48J46j89K20j38J65J23k77q5mk5K82j38N6Q5r3j34J32O0j84K6L17
$$ 194 115 -133 13 -176 44 -94 71 194 -83 -168 -172 -197 85 -53 3 88 -5 -139 -7 53 -131 -105 212
2764B12j57l76L37J97j98l1N4o9M8q4K06j20j48J21j08P9L5j44J39M14l48P1k45
$$ 212 55 -321 16 213 15 -16 38 -31 17 -67 139 19 -129 -8 -116 -37 -2 -146 -7 407 59 130 -115
2787a15J18K86k70j00J81l96K65j58O0L64l13P8J15R4k86O3j23L02j98k6J2qJ31
$$ -115 3 289 19 -81 100 -296 -31 -189 -129 235 -78 0 115 209 -77 -14 -137 165 -33 -59 -47 -55 76
2810G6LJ40k24R5l63L55M9k64Q2J74k41M05k79o3J36k62M36m15j03L79j01l89
$$ 76 79 219 -5 90 -273 82 131 -133 -51 123 -118 287 8 -55 81 -181 255 -160 -263 116 15 -374
2832c74N39k67K21k54J42k75L92N5P2j27j4q5Q8J14m79L54l30N6L29m09M30k69
$$ -374 165 -102 119 -135 7 -268 124 179 251 124 110 25 113 227 -252 102 -228 -172 157 -252 178 -91
2854i1j30R3R6j2n7J73%L2k8pj19J69k19l1L23N6m24k3LJ27j88K60N6k1K8kO8
$$ -91 -221 -128 -32 -44 -101 72 72 104 76 69 -50 119 -100 -131 192 248 -176 -199 -196 -69 -257 3 59 38 66 64 132
2881A32R2k62J35O5j39j6O6j49k04K50J17K62k34P4l38J21O3N7o2K5N7J70jj34
$$ 132 224 -38 97 162 23 7 73 -76 -280 -30 87 349 115 189 -149 -28 35 92 30 55 112 282 281 147
2905A47k45M71l08J15m96L13P0j34k82L44L0r8O8n8oQ3J93k75J51M02o12K55j94
$$ 147 -98 373 65 180 -316 -3 67 -67 -349 -5 25 -73 -5 -63 -69 14 207 -68 83 485 -127 128 -66
2928f6r4M15J0l63J14m3J23l17k21O25j34R2j46J16l5j92J53N4j2lj41L79j45
$$ -66 -160 255 265 -98 16 -27 96 -221 -442 183 49 141 -5 111 76 -116 37 91 79 76 -65 314 169
2951A69L1k62K05j63J17j67p0K18o8k30K29L36o53L19k15L27r7J37j86J3Q5M5
$$ 169 200 -62 143 -20 97 -70 -140 78 10 -220 9 345 -308 11 -204 123 26 163 -23 -10 75 120
2973A20r3j29q0R4q8K5J09p5Lo4K45J25k95K51m20J90J06J56rk69P3J04k22J23
$$ 120 27 -102 -182 -88 -176 -151 -42 -117 -114 -178 67 192 -103 148 -272 -82 24 180 171 -98 -25 79 -143 -20
2997b0m4J23Q0L35l08k7Q3l11j37J20K58m6O2k22N1j48M05l17L6l4J16k25M05
$$ -20 -64 59 139 474 166 139 222 -89 -226 -106 152 106 168 -54 -3 -151 254 -63 -27 -61 55 -170 235
3020B35m95J81P7J02O2l54R1j16L51l46J99MJ45l29L33k07J93K4L8L1q3j13J85
$$ 235 -260 -79 -2 100 162 -192 -101 -217 134 -212 -13 -9 136 -193 140 -67 126 150 188 219 136 23 208
3043B08m00J78K15k76K68k34K17m16J15J98j31P4K18m8j15M9l23K60r2J17J38
$$ 208 -192 -14 201 -75 193 -41 176 -240 -125 73 -58 16 234 186 71 120 -203 57 -35 82 220
3064B20K8m32J68K05l07r6L70j55r7O8J69k07Q6m0K1P1o5j65K81j13l6pK29k23
$$ 220 248 -184 -16 189 -118 -214 156 1 -96 -28 141 -66 20 -20 1 72 7 -158 123 10 -26 -33 196 -27
3088b7r1N2j01K36rp7o8J79p3R7K2J25l69L7N7L8j2j98K33j63K39l22J41Lk39
$$ -27 -118 -66 -167 69 60 -17 -85 94 21 118 140 265 -104 -67 -10 28 16 -182 51 -112 127 -195 -54 -51 -290
3113b90M44L77m61l53L21k8j51K72j41k09M23j94K39m11K24K5n38K37L34J6j42
$$ -290 154 531 70 -283 38 10 -141 131 -10 -219 204 10 249 -162 62 87 -451 -214 120 136 -6
3134fM0n6JmK7j99K17J42k1k4k04J11k4j19K88K66m16L8r5M33m81qQ9N8j75K54
$$ -6 34 -22 -21 -25 2 -197 20 162 141 117 -87 24 0 -119 169 435 19 57 -38 395 -86 -94 -5 53 -122 132
3160A32q3k45L75J7Nl68l3J5L15l11N76m78J23L1j62L62l57m4K79k97P4M02j12
$$ 132 49 -196 179 196 201 -167 -200 -185 130 -181 395 -83 40 71 -91 271 -86 -130 149 -148 -74 328 216
3183B16l99L06l31J44K38l66L5j03K89j07j77K68K64k47j17J28R2n6q5L0p7QK22
$$ 216 -183 123 -208 -64 174 -192 -157 -260 29 -78 -255 13 277 30 -87 41 133 77 -8 22 -55 -47 175
3206A75k13l1M6j72K05k88M60j91M2j46j42K87q2r4J18L5q5O4J82j62J97k17j75
$$ 175 -38 -69 -23 -195 10 -278 182 -9 33 -113 -255 32 -50 -144 -26 9 -76 -12 170 8 205 -12 -187
3229a87J52r5K80L5k80M0P6J41p9N5j97Q4k40pN25l80R3L4J83l00J46k1j88J30
$$ -187 -35 -130 150 185 -95 -55 21 162 83 138 -59 25 -215 -222 303 -77 16 50 233 -67 79 58 -130 0
3253@N5L6n9j04R7j13k0N9r0l6R4L5K27j73j35K16j94J30K3j66M2K24j26j40L91
$$ 0 55 91 32 -72 25 -88 -108 -49 -139 -175 -81 -46 181 8 -127 89 -105 25 48 -118 -76 148 22 -118 273
3278B73p4p1k28Q0k09M95j84q2P2K01k73K4R3O3m9P3j81J97l06K06o5m65K78O
$$ 273 199 128 -100 -20 -229 266 82 0 72 273 0 24 117 180 131 204 23 220 -86 120 55 -410 -132 -126
3302a26mo7M44k00Rk26P2P2k4j94L09pj82P1Q5k59L80j46j74Q8J13m2L9K1J57
$$ -126 -130 -197 247 47 56 -170 -98 -26 -50 -244 65 58 -124 -53 32 -227 153 7 -167 -79 34 -8 31 52 209
3327B09j33j05O2J68k96K39j16N4k20K28j45J02R8k35P9L18n93M26O3J00k35P3
$$ 209 76 -29 33 201 -95 144 28 82 -138 90 -55 47 145 -90 -11 307 -286 140 203 303 68 141
3349A41j42J4KK46k93p5J45q4M78n51J24j01l20L64J17j71J28p2j27L42k1o7J57
$$ 141 -1 13 15 261 -32 -107 38 -46 432 -119 5 -96 -416 -52 65 -106 22 -50 -177 165 144 77 234
3372B34n88L36L4j81J45l13K28j5L45m38L39l46M51l20O3Q6kN5r6R3m1K7j64M3
$$ 234 -354 -18 16 -165 -20 -333 -105 -120 225 -213 126 -220 231 -89 -26 60 58 113 17 110 69 96 -68 -25
3396b5J81k24J82J73k95o1K54N5j18j54K63j5m29j7J30k3K53k97J85K36k79Q6
$$ -25 156 -68 114 287 -8 -69 185 240 122 -32 231 216 -213 -230 -100 -123 130 -167 18 254 -25 61
3418F1N5P2n69J78N8K7oJ26k5l44K37K40j57k0M4K51l21M3q7J59K4J56j05r3o5
$$ 61 116 188 -381 -203 -145 -118 -124 2 -23 -367 -130 110 -47 -67 -23 228 -93 -50 -137 22 46 202 97 4 -61
3443f1m1J49l4n2R5l1N2p3L3l85L13J41j61l0j19j2l4L71l29o2J89n8J50r0k20
$$ -61 -102 47 13 -39 56 25 77 4 37 -348 -35 106 -55 -85 -204 -216 -250 121 -208 -270 -81 -139 11 -79 -299
3468b99L30K35k43o3%J80k36j20J79p6K83m00QK7J20j9R3L9j24J28j03j98J47
$$ -299 31 266 23 -40 -40 140 -96 -216 -37 -113 170 -230 -222 -195 -75 -94 -1 38 -86 42 -61 -259 -112
3491a12L4J84k09P6K12k43J88K1m30J43p9M2J65J37p5j15K22k38J7L22k24j69
$$ -112 -78 106 -103 -27 185 -58 130 151 -279 -136 -215 -173 -8 129 54 -61 161 -77 -60 262 38 -131
3513a31K95l69L19j6k2j82J59k71K31n5K14j78j00J82J2K2J85j2k41j44O5J98
$$ -131 164 -205 114 98 76 -106 53 -218 13 -42 172 -6 -106 76 88 110 295 283 42 -102 -37 161
3535A61r7j55K38R9j42n6k09K52K08n88M12k25J30j73J99k23J70j40o7J60q1R4
$$ 161 64 -91 147 246 104 48 -161 91 299 -289 123 -102 28 -145 54 -169 1 -139 -206 -46 -127 -33
3557c3N5N0k70K07m9J36K84k73j4J00J35k57K5l61K54O7O6l7l3J17k66J24o0o0
$$ -33 22 72 -198 9 -40 96 380 107 93 193 328 71 96 -265 -11 56 122 85 52 169 -97 27 -33 -93
3581i3J67k8J65k13j00j83K4M71k13R2k97Q2K05l2JQ7l49L45j48j23L57k95R8
$$ -93 74 46 211 -2 -102 -285 -261 210 -3 89 -208 -126 79 47 48 135 -214 131 -17 -140 217 -78 20
3604B0k14J90M5j83PL3j7N2J2L16j54J09l66J67Mj68K60l6L2l7K2K22j61k27q1
$$ 20 -194 -4 41 -142 -135 -102 -119 -67 -55 261 107 216 -150 17 21 -147 113 77 109 72 94 316 155 -72 -153
3629a53rJ28J45on2j67L46j78J04k37P9K12j32q8J4P9k5J29n3R0k83O9l05K14
$$ -153 -162 -34 111 105 53 -114 232 54 158 -79 0 212 80 -8 6 85 60 189 136 226 -57 12 -293 -79
3653g9J08m9J83N2j89q2N9pO3j03J4R8Jn4n5J9K24l38J26p7J84K4k35MK75j1j54
$$ -79 29 -20 163 215 26 -56 3 -4 59 -44 -30 68 69 15 -40 -21 203 -135 -9 -86 98 122 -113 -109 166 155 1
3680Ar3m8m0L42k45j51K82k71K04j66j7K20j24K43J00j01q7j83K29j1j25j01M7
$$ 1 -92 -140 -180 162 -83 -234 48 -223 -19 -185 -202 18 -106 137 237 136 49 -134 95 84 -41 -142 -95
3703i5J99J40k1l26P8j59K24J86k78J32n6J56j9M4l42j2J80M5j70K69j34k28k4
$$ -95 104 244 223 -103 -25 -184 40 226 -52 80 24 180 161 205 -137 -149 31 76 -94 175 41 -187 -211
3726b11N4K79n03L19L8j92M4M8P4n0K35k21J13k0k08L16k49k3K20R8j99l2q3J00
$$ -211 -157 122 -381 -62 -24 -216 -172 -124 -50 -100 135 -86 27 7 -201 115 -134 -157 63 161 -38 -70 -153 -53
3750e3L52l65J19k18K70j98Q3j84K24J01j78j83M15j37j7l9Q6k40J4J33R4R0j79
$$ -53 299 -66 53 -165 105 -93 -10 -194 30 131 -47 -230 185 48 31 -8 78 -162 -148 -15 79 169 -10
3773a0k05K05L0k90RM36n3J17j52P9j82k03N61l96L22l76J12M6k03K2r8R8J74
$$ -10 -215 -10 20 -270 -261 175 122 239 87 166 -16 -219 342 -54 268 -108 4 50 -153 -131 -229 -131 43
3796D3j79J79l03L98M5k69L16l93J16M5K4Qj41K80k77K14M3j03J14q7J76k75J07
$$ 43 -136 43 -260 138 183 -86 230 -163 -47 -2 22 30 -111 169 -108 106 149 46 160 73 249 -26 81
3819H1p4M3P2k58K57j91L63l91K73l62J96O9n8q8n9K37np0K3J4k4K19k78J32j73
$$ 81 7 50 122 -136 121 -70 293 -98 175 -187 9 78 20 -68 -127 110 105 35 58 72 48 267 -11 121 -52
3844e2L6k02K75rj38K95m15K01l1j60L52j43j18K47l11j45M13K67n38l1J53J86
$$ -52 -16 -218 57 48 -90 205 -210 -9 -40 -200 152 9 -109 138 -173 -318 95 362 -176 -207 -54 132
3866A32r1j17m8j8L05m06L35k24K69m8m3Q3r9j21m3L32j98K66j65j83j68L05k42
$$ 132 41 -76 -124 -142 163 -243 92 -132 137 89 46 129 30 -91 -134 198 0 266 101 -82 -250 55 -187
3889a87M09k17J38l67K27j2RJ97k74M6k6K70r9J28m23Q2M9n7mJ4Q1Q1J86l38m7
$$ -187 222 5 143 -224 3 -9 0 197 -77 -31 -57 213 114 242 -181 -99 -50 -107 -111 -97 -16 65 251 -87 -134
3914a34K31j08J32j05n7q5k33L46L1J30m38M15l62R0O1J51j82j2L28l95K07l6
$$ -134 97 -11 121 16 -41 -126 -359 -13 18 148 -290 125 -237 -147 -86 65 -117 -129 199 -196 11 -25
3936b5NJ60M7l40M81k25j20q4q8J4N4O0K18j32o2J12r9J57j45M2r0p1j6M15l38
$$ -25 -20 140 187 -153 328 103 -17 -101 -189 -175 -121 -61 157 25 -37 75 -24 133 -12 30 -60 -131 -147 268 -70
3961g0N0J3K3k8J50k10l3J95r9r5K68j77L30l67k50K95k23L23j74J21j21J23K2
$$ -70 -20 -7 16 -12 138 -72 -105 90 -9 -104 164 -13 317 -50 -300 -5 -228 95 -79 42 -79 44 66
3984F6k7j50L00k74J36r5N0L3N0l69K07q6l5M38j43m7r1MP1n5M0j69P5k0j67K44
$$ 66 39 -111 189 -85 51 -44 6 39 89 -280 -73 -159 -194 244 101 54 -37 -33 38 -17 23 -146 -71 -91 -258 -14
4010a4l6n3J70j01m9J13j37J29J08k64L56l89J80j39K88l81K36j2R5k03K65j54
$$ -14 -50 -103 67 -34 -83 30 -107 22 130 -134 222 -167 13 -126 162 -219 17 5 100 -103 162 8
4032HM9m6M7M2K77k70j04m3J12j5j8k41k4L67m47L05O4Lj24P3N2R6o7j74M9K34
$$ 8 57 11 58 100 377 107 3 -40 72 57 39 -202 -226 141 -306 -1 63 66 -58 15 67 163 96 -78 -29 205
4058B05l43n5M49J0m61N5K01j3r7o1L30j29p5n5Q9j43M32n72J02K43j27K5r5J09
$$ 205 -138 -193 256 266 -195 -140 61 48 -49 -110 220 91 16 -39 50 -93 339 -233 -131 112 -15 10 -85 24
4082B4L2Q2l69L71l07L51k20L03l33j53L26r3M0j16K62m41L28oj2o7j16K62r6
$$ 24 56 138 -231 140 -167 184 -36 267 -66 -219 107 14 54 -62 200 -241 87 81 69 2 -114 148 52
4105E2J6j33j75M03p5J55l26j98J69K29j36L0K17k73O3j15J66j11p1M03k59K71
$$ 52 68 -65 -240 163 88 243 -83 -281 -112 117 -19 11 228 -45 18 -97 69 -42 -113 290 31 302
4127C02l43n2N6k5J86Q2k16k75K25L2O5k41J13K52j84j51K4J56j05M13m15j6K5
$$ 302 -41 -93 -37 -62 124 206 -10 -285 -60 -28 37 -204 -91 161 -23 -174 -150 6 -99 314 -101 -117 -92
4150i2J51J38l01J1J52q1K98j86mj17J75j4O3o9M5k93J49j60J41j37J94o8j2j29
$$ -92 59 197 -104 -93 59 -22 276 90 86 -31 144 130 193 124 169 -124 25 -135 6 -131 63 -5 -17 -146
4174a46m6J90m06N98R3l21K36j77j56M71j48j80j07J16N8n3J38l9j66L9J13k17
$$ -146 -192 -2 -408 190 283 -38 198 21 -135 336 188 8 -99 17 75 22 160 121 -45 -6 107 -110
4196a10R3K81q2k18J47k99K07l2j06j9OK59Q4l65L71k18J31n1q1J27J2J10l16
$$ -110 -17 264 182 -36 111 -188 19 -13 -119 -138 -132 127 211 -154 217 -1 130 79 -2 125 137 247 -69
4219f9K9k43M44k07P3O6j01k1M4j77K36JJ26k20q2J93j81J54j38r1L45L1m43M39
$$ -69 -40 -283 161 -46 27 93 -8 -29 15 -162 74 75 201 -19 -101 92 -89 65 -73 -164 181 212 -231 208
4243B08k14J05J14q0J69l97M1MQ0O2m8J76j16J12n5k62rJ54L6j12J84m5P4j81
$$ 208 -6 99 213 133 302 -95 -54 -50 30 92 44 220 104 216 161 -101 -110 44 80 -32 152 107 181 0
4267@j27L11k36O7o3K29r4j65K0q6N6L6r4O2L06j02k89L16k34q0J00oJ07J3k6
$$ 0 -127 184 -52 15 -48 181 87 -78 -58 -144 -88 -52 -146 -84 222 120 -169 147 -87 -167 -67 -73 34 47 21
4292B1k90L31j70J22j20M7r7K57j6j66m4m9K68k35L45k97J6J28J8M8m8j92Q6Q3
$$ 21 -269 62 -108 14 -106 -59 -156 101 85 -81 -125 -174 94 -141 204 -93 -77 51 69 117 69 -123 -37 46
$$ [...]
8191E8
##END NTUPLES=NMR FID
##END=
