##TITLE=1H_DE-92k4_TFA
 200.13MHz,CDCl3,
 8 sc
 
 10.7.2025
##JCAMPDX= 6.0         $$ Bruker NMR JCAMP-DX V2.0
##DATA TYPE= NMR FID
##DATA CLASS= NTUPLES
##ORIGIN= UXNMR, Bruker Analytische Messtechnik GmbH
##OWNER= pz
$$ XWIN-NMR		Version 3.5
$$ Thu Jul 10 13:47:07 2025 Russian Standard Time (UT+4h)  she@DPX200
##.OBSERVE FREQUENCY= 200.1313
##.OBSERVE NUCLEUS= ^1H
##.DELAY= (6, 6)
##.ACQUISITION MODE= SIMULTANEOUS
##.ACQUISITION SCHEME= undefined
##.AVERAGES= 8
##.DIGITISER RES= 18
##SPECTROMETER/DATA SYSTEM= spect
##.PULSE SEQUENCE= zg30
##.SOLVENT NAME= CDCl3
##.SHIFT REFERENCE= (INTERNAL, CDCl3, 0, 14.3821)
##AUDIT TRAIL= $$ (NUMBER, WHEN, WHO, WHERE, WHAT)
$$ ##TITLE= Audit trail, XWIN-NMR		Version 3.5
$$ ##JCAMPDX= 5.01
$$ ##ORIGIN= Bruker BioSpin GmbH
$$ ##OWNER= she
$$ F:/spectra/data/she/nmr/H-C/1/audita.txt
$$ ##AUDIT TRAIL=  $$ (NUMBER, WHEN, WHO, WHERE, WHAT)
(   1,<2025-07-10 13:45:51.87 +0400>,<she>,<DPX200>,
      <created by zg, POWCHK disabled, PULCHK disabled
       configuration hash MD5:
       00 E9 B6 7A A2 85 ED C7 34 08 36 98 17 FE 4E 26
       data hash MD5: 16K
       90 42 68 32 34 A2 61 7B C9 F5 21 B7 B4 33 FA C3>)
$$ ##END=
$$ 
$$ hash MD5
$$ 85 87 F8 D7 9F 26 CF 0F 7E 4C 79 E5 FB 65 C3 8A
##$RELAX= 
##$RELAX= 
##$RELAX= 
##$RELAX= 
##$RELAX= 
##$RELAX= 
$$ Bruker specific parameters
$$ --------------------------
##$DU= <F:/spectra>
##$EXPNO= 1
##$NAME= <H-C>
##$PROCNO= 1
##$TYPE= <nmr>
##$USER= <she>
##$AMP= (0..31)
100 100 100 100 100 100 100 100 100 100 100 100 100 100 100 100 100 100 
100 100 100 100 100 100 100 100 100 100 100 100 100 100 
##$AQSEQ= 0
##$AQ_mod= 1
##$AUNM= <au_zg>
##$AUTOPOS= <>
##$BF1= 200.13
##$BF2= 200.13
##$BF3= 200.13
##$BF4= 200.13
##$BF5= 200.13
##$BF6= 200.13
##$BF7= 200.13
##$BF8= 200.13
##$BYTORDA= 1
##$CFDGTYP= 0
##$CFRGTYP= 5
##$CHEMSTR= <none>
##$CNST= (0..31)
1 1 145 1 1 1 1 1 1 1 1 1 1 1 1 1 1 1 1 1 1 1 1 1 1 1 1 1 1 1 1 1 
##$CPDPRG= <>
##$CPDPRG1= <>
##$CPDPRG2= <>
##$CPDPRG3= <>
##$CPDPRG4= <mlev>
##$CPDPRG5= <mlev>
##$CPDPRG6= <mlev>
##$CPDPRG7= <mlev>
##$CPDPRG8= <mlev>
##$CPDPRGB= <>
##$CPDPRGT= <>
##$D= (0..31)
0 0.7 0 0 0 0 0 0 0 0 0 0.03 0 0 0 0 0 0 0 0 0 0 0 0 0 0 0 0 0 0 0 0 
##$DATE= 1752140751
##$DBL= (0..7)
120 120 120 120 120 120 120 120 
##$DBP= (0..7)
150 150 150 150 150 150 150 150 
##$DBP07= 0
##$DBPNAM0= <>
##$DBPNAM1= <>
##$DBPNAM2= <>
##$DBPNAM3= <>
##$DBPNAM4= <>
##$DBPNAM5= <>
##$DBPNAM6= <>
##$DBPNAM7= <>
##$DBPOAL= (0..7)
0.5 0.5 0.5 0.5 0.5 0.5 0.5 0.5 
##$DBPOFFS= (0..7)
0 0 0 0 0 0 0 0 
##$DE= 6
##$DECBNUC= <off>
##$DECIM= 32
##$DECNUC= <off>
##$DECSTAT= 4
##$DIGMOD= 1
##$DIGTYP= 9
##$DL= (0..7)
0 120 120 120 120 120 120 120 
##$DP= (0..7)
150 150 150 150 150 150 150 150 
##$DP07= 0
##$DPNAME0= <>
##$DPNAME1= <>
##$DPNAME2= <>
##$DPNAME3= <>
##$DPNAME4= <>
##$DPNAME5= <>
##$DPNAME6= <>
##$DPNAME7= <>
##$DPOAL= (0..7)
0.5 0.5 0.5 0.5 0.5 0.5 0.5 0.5 
##$DPOFFS= (0..7)
0 0 0 0 0 0 0 0 
##$DQDMODE= 0
##$DR= 18
##$DS= 0
##$DSLIST= <SSSSSSSSSSSSSSS>
$$ [...]
##$SUBNAM0= <"">
##$SUBNAM1= <"">
##$SUBNAM2= <"">
##$SUBNAM3= <"">
##$SUBNAM4= <"">
##$SUBNAM5= <"">
##$SUBNAM6= <"">
##$SUBNAM7= <"">
##$SUBNAM8= <"">
##$SUBNAM9= <"">
##$SW= 18.0517328524113
##$SWIBOX= (0..15)
0 0 2 0 0 0 0 0 0 0 0 0 0 0 0 0 
##$SW_h= 3612.71676300578
##$TD= 16384
##$TD0= 1
##$TE= 0
##$TE2= 300
##$TE3= 300
##$TEG= 300
##$TL= (0..7)
0 120 120 120 120 120 120 120 
##$TP= (0..7)
150 150 150 150 150 150 150 150 
##$TP07= 0
##$TPNAME0= <>
##$TPNAME1= <>
##$TPNAME2= <>
##$TPNAME3= <>
##$TPNAME4= <>
##$TPNAME5= <>
##$TPNAME6= <>
##$TPNAME7= <>
##$TPOAL= (0..7)
0.5 0.5 0.5 0.5 0.5 0.5 0.5 0.5 
##$TPOFFS= (0..7)
0 0 0 0 0 0 0 0 
##$TUNHIN= 0
##$TUNHOUT= 0
##$TUNXOUT= 0
##$USERA1= <user>
##$USERA2= <user>
##$USERA3= <user>
##$USERA4= <user>
##$USERA5= <user>
##$V9= 5
##$VALIST= <valist>
##$VCLIST= <CCCCCCCCCCCCCCC>
##$VD= 0
##$VDLIST= <DDDDDDDDDDDDDDD>
##$VPLIST= <PPPPPPPPPPPPPPP>
##$VTLIST= <TTTTTTTTTTTTTTT>
##$WBST= 1024
##$WBSW= 4
##$XGAIN= (0..3)
0 0 0 0 
##$XL= 0
##$YL= 0
##$YMAX_a= 186703
##$YMIN_a= -154271
##$ZGOPTNS= <>
##$ZL1= 120
##$ZL2= 120
##$ZL3= 120
##$ZL4= 120
##$ABSF1= 10
##$ABSF2= 0
##$ABSG= 5
##$ABSL= 3
##$ALPHA= 0
##$AQORDER= 0
##$ASSFAC= 0
##$ASSFACI= 0
##$ASSFACX= 0
##$ASSWID= 0
##$AUNMP= <proc_1d>
##$AZFE= 0.1
##$AZFW= 0.1
##$BCFW= 1
##$BC_mod= 2
##$BYTORDP= 1
##$COROFFS= 0
##$CY= -3
##$DATMOD= 1
##$DC= 2
##$DFILT= <>
##$DTYPP= 0
##$F1P= 0
##$F2P= 0
##$FCOR= 0.5
##$FTSIZE= 0
##$FT_mod= 4
##$GAMMA= 1
##$GB= 0.15
##$INTBC= 1
##$INTSCL= 1
##$ISEN= 128
##$LB= 0.25
##$LEV0= 0
##$LPBIN= 0
##$MAXI= 10000
##$MC2= 0
##$MEAN= 0
##$ME_mod= 0
##$MI= 1.114404
##$NCOEF= 0
##$NC_proc= 0
##$NLEV= 6
##$NOISF1= 3.799351
##$NOISF2= 2.8
##$NSP= 1
##$NTH_PI= 0
##$NZP= 0
##$OFFSET= 14.38212
##$PC= 1
##$PHC0= -1200.458
##$PHC1= 12.7925
##$PH_mod= 1
##$PKNL= yes
##$PPARMOD= 0
##$PSCAL= 0
##$PSIGN= 0
##$REVERSE= no
##$SF= 200.129724274929
##$SI= 16384
##$SIGF1= 3
##$SIGF2= 2
##$SINO= 400
##$SIOLD= 16384
##$SREGLST= <1H.CDCl3>
##$SSB= 0
##$STSI= 0
##$STSR= 0
##$SW_p= 3205.1282051282
##$SYMM= 0
##$S_DEV= 0
##$TDeff= 0
##$TDoff= 0
##$TI= <>
##$TILT= no
##$TM1= 0
##$TM2= 0
##$TOPLEV= 0
##$USERP1= <user>
##$USERP2= <user>
##$USERP3= <user>
##$USERP4= <user>
##$USERP5= <user>
##$WDW= 1
##$XDIM= 8192
##$YMAX_p= 0
##$YMIN_p= 0
$$ End of Bruker specific parameters
$$ ---------------------------------
##NTUPLES= NMR FID
##VAR_NAME=  TIME,          FID/REAL,        FID/IMAG
##SYMBOL=    X,             R,               I
##VAR_TYPE=  INDEPENDENT,   DEPENDENT,       DEPENDENT
##VAR_FORM=  AFFN,          ASDF,            ASDF
##VAR_DIM=   8192,          8192,            8192
##UNITS=     SECONDS,       ARBITRARY UNITS, ARBITRARY UNITS
##FACTOR=    0.0002768,     1,               1
##FIRST=     0,             0,               0
##LAST=      2.2672688,     0,               0
##MIN=       0,             -154271,         0
##MAX=       2.2672688,     186703,          0
$$ Real data points
##PAGE= N=1
##DATA TABLE= (X++(R..R)), XYDATA
0 0 0 0 0 0 0 0 0 0 0 0 0 0 0 0 8 -8 8 -8 8 -12 16 -16 24 -24 32 -32 40 -48 52 -59 68 -79 89 -99 114 -128
36 -128 143 -161 179 -199 221 -246 274 -302 333 -368 407 -448 493 -545 598 -660 727 -805 887
55 887 -984 1095 -1220 1367 -1541 1752 -2013 2343 -2780 3383 -4278 5730 -8491 15542 -74220
70 -74220 -81381 135652 28109 -134688 17054 186703 65882 -37587 -8215 33489 81186
81 81186 70990 -97588 -145585 33342 69057 -110861 -134465 -11745 33810 33808 19560 -21173
93 -21173 33594 115663 53675 -30430 18824 63522 18890 -20185 -45015 -69042 -12807 39848
105 39848 -37546 -92907 -12759 40260 10995 -9712 -22063 -3654 63496 58930 -24810 -20194
117 -20194 66305 65593 -11562 -28535 5982 19503 12024 -28822 -76698 -41970 23890 978 -55875
130 -55875 -40909 18363 45818 25489 1225 13474 42446 47005 15445 -18429 -8582 18602
142 18602 2252 -41311 -51387 -18084 8929 -4637 -27813 -24260 3833 34800 26460 -11263
154 -11263 -4937 34422 34364 7308 -4160 -1370 11312 13043 -15092 -34251 -11342 10638 -13970
167 -13970 -40756 -22684 2481 8687 9444 -2900 -4399 29592 40531 9501 2015 17929 13483
180 13483 406 -7956 -20168 -20571 -4845 -9030 -33455 -23507 9308 7143 -4948 3635 7164 13886
194 13886 30514 15940 -6538 6892 20582 4165 -10856 -7516 -6171 -9776 -9321 -16995 -23607
207 -23607 -4729 6258 -12070 -12037 9605 14606 14344 15943 7544 9085 22755 16772 -5552 -10038
221 -10038 -761 -6757 -18269 -16438 -17048 -16095 -2471 -3279 -11896 3618 19032 11174 6294 11253 12703
236 12703 12512 11046 1863 -6670 -2250 3170 -7712 -15582 -8778 -8111 -9568 -5946 -8808 -8026 3889
251 3889 5693 1625 5391 12898 15941 12975 8460 5789 5246 4723 -1707 -13757 -13945 -9044 -13163 -14170
267 -14170 -10128 -7518 -66 5694 4512 7562 13525 14360 9783 5528 5311 3899 -941 -3214 -6677
282 -6677 -9603 -4701 -3645 -8173 -5741 -2550 -1900 21 -356 -868 1519 4112 5145 3159 3483 8511
298 8511 7952 2676 2158 1061 -722 -1660 -6942 -10556 -7841 -6714 -6519 -5738 -2993 3404 6246 6471 9457
315 9457 9461 7741 7246 2947 -595 -2022 -4827 -6459 -7491 -8999 -6041 -3199 -1863 570 1298 2884
331 2884 6100 4949 2408 2769 2895 3022 715 -2051 -716 245 -1610 -1583 -2498 -1368 -40 -2601 -3865
348 -3865 -2258 -1721 -690 35 121 3247 4227 3378 4613 4098 2693 2570 67 -1569 -3079 -5501 -4985
365 -4985 -4901 -6122 -3210 -1249 117 2991 3220 2684 5735 5434 3795 2015 1295 1157 -1380 -3862 -3404
382 -3404 -3333 -3934 -2063 -2766 -1873 951 233 -115 1635 2171 2651 2261 1738 2592 1028 158 1428 -346
400 -346 -1274 -607 -1868 -2724 -2330 -3302 -3127 -1932 -1027 149 311 1803 3873 2667 2486 4347 2394 1360
418 1360 1243 -1521 -2334 -2120 -3539 -4090 -3532 -2588 -1567 -1659 150 1864 1373 2682 3617 2326 3152 3080
436 3080 642 832 599 -1449 -1040 -1509 -1918 -2358 -2581 -1448 -1788 -1624 -195 -676 -45 2173 1335 1032
454 1032 3664 2893 1118 2694 2089 227 88 -521 -1831 -2499 -1853 -2006 -3454 -1468 584 -1825 -129
471 -129 2976 856 1028 3465 1961 889 2319 1141 -660 -799 292 -1079 -2752 -613 -358 -2090
487 -2090 20 833 -1425 278 1620 -129 248 1576 671 194 533 290 -62 -91 633 -642 -1106 255
505 255 -153 -1262 600 -389 -848 1103 332 -761 655 396 53 396 477 140 -522 289 751 -1303 -1038
524 -1038 897 -247 -834 386 -698 -66 1171 422 -191 211 841 986 -936 -329 481 -1243 -658 227
542 227 -1413 -1340 712 -53 -469 620 819 839 641 982 237 -227 1347 445 -2100 -754 -340 -1839 -677
561 -677 -497 -1748 -22 1081 23 176 1358 1245 277 876 850 -336 -446 830 -803 -1728 681 -468
579 -468 -1525 456 89 -1186 397 533 -491 -353 427 841 -428 328 1218 -17 1037 2165 -374
596 -374 77 1075 -517 -981 -440 -1422 -1801 -928 -912 -590 -545 506 691 972 1790 1280 271 1473 943 -701
616 -701 -158 -165 -1087 -434 -763 -803 -488 -440 225 -167 -31 1297 108 -339 1071 5 -708 665 342 -580
636 -580 529 687 165 101 281 678 -631 -828 294 -968 -1359 319 -509 -450 542 284 143 709 626 664
656 664 93 -269 91 -572 -368 -118 -767 -134 399 -355 220 505 -255 344 455 -613 -126 -275 -642 -86
676 -86 -270 162 43 356 901 412 -115 991 178 -878 348 -14 -720 30 -249 -573 114 181 -12 170
696 170 292 303 -254 -407 307 -460 -319 453 31 59 506 453 345 703 29 -143 -365 -443 -458 -1002 -1067 -465
718 -465 -838 -374 330 160 548 1216 748 712 885 191 271 -137 -234 30 -1083 -673 -279 -763 -187 -145 -642
739 -642 486 107 -446 427 329 -94 138 288 211 581 376 752 569 246 562 -303 -559 -112 -845 -1262 -529
760 -529 -663 -742 -135 83 65 426 977 1050 820 796 743 -82 -81 348 -898 -505 -144 -647 -505 -362 -329 -89 -187
783 -187 -42 357 -23 265 192 -283 483 601 -295 623 514 -92 269 69 -449 -104 -419 -531 -416 -439 -253
804 -253 -307 -190 279 130 25 660 214 11 595 133 -256 362 -227 -51 363 -369 -300 -547 -243 -114 -199
825 -199 -259 -41 -370 -10 74 83 358 696 126 151 646 92 178 -148 -359 382 -532 -90 184 -752 177 112 -283
848 -283 458 260 -69 414 -172 -210 42 -366 -53 126 -323 336 252 -79 453 74 -184 152 28 -45 129
869 129 -453 -131 -285 -611 -170 280 -130 228 342 -88 398 396 -116 324 0 241 201 -241 83 114 -145 -54
891 -54 -167 -182 331 -262 -290 -222 -235 -507 86 -269 59 66 239 552 717 330 725 298 13 40 -344 -363 -143
914 -143 -800 -459 -222 -699 -35 -123 -478 117 325 101 310 -103 507 572 -70 298 280 -247 155 -173 -226 -311
936 -311 -376 -468 -315 -481 -99 -105 -475 390 244 -75 516 543 303 489 41 61 87 -71 -447 -159 -517 40 -355
959 -355 -349 148 -159 -271 0 -380 -80 199 -100 410 222 104 423 422 165 353 -100 -207 32 -271 -485 -496
981 -496 -340 -462 -224 -340 104 29 79 362 236 214 576 60 136 328 -407 -192 -164 -481 -222 54 -162 0
1003 0 6 -76 -123 57 264 -5 -379 -102 249 -357 127 278 95 509 223 73 203 297 -69 -466 -239 -143 -613
1026 -613 -559 -137 -286 -426 329 -55 261 714 214 20 587 309 8 -105 -246 -60 -402 -184 111 -244
1046 -244 -41 266 -172 -144 453 -256 -195 412 -515 -255 63 -35 -89 383 62 370 53 344 -45 -330 64
1067 64 -15 -644 -117 -196 -286 118 -216 -275 257 -25 89 -132 152 96 -25 200 308 -55 47 771 -184 -69
1089 -69 444 -301 -122 7 -284 -323 -214 -383 -52 130 -90 462 -79 100 478 186 219 292 -91 53 -37 -345
1111 -345 239 274 33 84 -260 -294 268 -289 -76 -13 -456 174 15 -363 54 218 156 402 343 96 317 -213
1133 -213 -112 -250 -232 -52 -319 -599 -325 -284 -108 74 -8 418 392 231 135 12 166 480 275 -293 60 -198
1155 -198 -91 162 -61 -138 -87 -67 -350 -248 -48 -49 -131 -125 351 -83 -12 287 -80 79 697 32 84 354 -323
1178 -323 -145 -204 -158 7 -232 -199 -118 -123 -272 -43 -87 287 248 39 123 60 -21 151 138 -204 75 23 -218 -108
1202 -108 -199 -113 -175 -369 -245 -284 118 42 49 167 202 85 41 105 -13 189 64 -196 308 75 -348 -146 -216 -168
1226 -168 -27 -63 10 27 -90 -3 -144 -60 81 5 23 247 29 203 240 -15 138 133 -322 17 -180 -189 -62 -242
1250 -242 -254 -10 -133 169 433 -60 279 322 165 143 -137 -555 -19 104 -222 -193 -100 -119 55 -31 201 -234
1272 -234 159 33 -206 -308 -447 -103 -212 63 -180 24 250 51 505 230 244 49 1 -406 31 -87 -198
1293 -198 -197 -275 -180 -46 135 156 -85 77 47 -257 -159 394 -13 -187 130 -45 99 -151 49 43 64 116 -306 -345
1317 -345 -514 18 -351 11 188 -80 -51 90 408 327 55 174 270 -60 32 154 -205 -76 -93 -227 -67 -60
1339 -60 -179 56 -26 -226 -59 -297 96 183 -6 -60 370 124 55 197 378 288 268 272 30 -368 -146 -76 -320
1362 -320 -54 -175 -257 27 316 216 220 204 126 146 -9 99 347 86 177 -19 -160 48 -20 -282 -84 -104 -88
1385 -88 31 -288 -158 231 18 -2 93 -103 193 300 240 412 182 -199 182 108 62 -170 -179 -107 81 -338 142
1408 142 282 -56 223 252 -104 179 24 -156 158 -16 -1 308 51 170 150 -130 -147 46 249 7 -232
1429 -232 -267 105 -275 -39 49 -14 43 16 206 -8 -33 -194 320 54 85 255 -10 -274 -82 -64 -8 94 -235
1452 -235 93 -158 -479 -170 -50 -99 -8 -204 -104 15 128 -62 -36 122 291 166 -303 75 -116 -125 18 -311
1474 -311 76 -415 -159 -7 183 -142 31 193 27 381 -172 252 161 370 229 -44 159 105 -57 -157 -121
1495 -121 -116 -211 71 -293 -31 154 -314 -95 105 -84 5 108 101 364 291 -61 44 -221 -60 -97 -50 -303 -217
1518 -217 -448 -178 -50 128 76 -88 14 111 90 -267 205 19 61 188 205 116 43 -210 75 -141 -135 18 -202
1541 -202 -366 -201 -58 -33 148 32 -16 167 -58 424 29 171 198 24 -172 352 -213 75 -66 -262 -39
1562 -39 -273 -134 87 179 44 -59 -43 -409 -4 81 53 112 78 279 106 -323 -41 -123 -114 -132 -78 274 131 138 151
1587 151 -153 14 -262 -108 0 22 217 -164 254 82 433 -45 -58 219 48 30 6 -105 98 -18 -267
1608 -267 -44 -215 -154 218 229 168 154 4 187 171 11 24 -210 -102 47 -134 48 172 -173 -6 -44 -129 -122
1631 -122 128 -68 -27 -89 -96 -146 107 -105 84 178 -187 200 225 1 185 353 124 -47 284 87 -68 120
1653 120 -379 170 -313 -123 -88 -29 209 227 -36 -108 369 -74 81 48 -330 -93 -66 123 -43 -153 -1 62
1675 62 -173 -205 -178 -64 -11 -123 -188 -140 -284 10 122 76 -82 338 361 154 49 105 125 -32 64 -307 -224 -67
1699 -67 -89 -240 -402 -107 249 105 153 362 248 20 90 -112 -10 96 70 -50 -245 60 -385 32 -75 15
1721 15 205 -235 201 -58 24 -136 -3 -70 61 212 -130 84 -4 136 -241 150 -64 -105 -185 -150 47 -144
1743 -144 -49 -310 -319 22 -24 75 -37 40 201 144 55 362 10 140 156 8 129 -167 -1 -93 -76 172 -165 179
1767 179 -21 293 -104 287 116 -236 -311 -23 90 200 -12 143 85 15 -243 -129 -260 223 23 28 -97 9
1789 9 -97 160 -40 133 2 -135 -54 -137 -93 104 184 -154 178 152 84 -8 47 -225 22 -72 41 -135 -109 -87
1813 -87 320 -152 -47 171 163 152 121 -58 -39 39 141 210 98 -137 -151 398 49 -135 -36 214 -40 -139 -137 -179 179
1838 179 213 -77 -91 187 -49 -212 50 64 -157 272 -7 2 74 45 -105 -95 -333 -258 140 -35 -172 -104 -86 390
1862 390 -58 80 49 60 171 315 104 -5 -186 15 -117 -323 28 -124 -106 -145 -112 -432 34 12 -80 33
1884 33 252 -103 -15 -115 -216 155 -39 -72 -20 45 16 -150 -176 142 -62 -93 -182 -9 -209 -22 -85 72 -125
1907 -125 53 201 -151 139 -1 106 58 117 -7 -150 -103 -175 20 -171 -141 17 -328 177 121 63 -85 319
1929 319 -22 87 -221 -28 129 -190 -30 29 -195 94 52 -306 76 153 105 -39 -131 -334 -10 124 154 -24
1951 -24 -451 -33 276 0 219 77 4 265 337 -207 -141 -32 34 -140 -234 -177 -208 -284 -61 -20 -210 8 305
1974 305 61 341 240 106 141 24 -273 258 -114 -122 65 -40 40 121 -303 127 -297 -78 31 -187 16 2
1996 2 -50 68 225 59 -33 11 211 163 136 34 179 -1 -76 -172 -32 -403 -116 40 -32 188 -129 194 -200
2019 -200 -37 -141 -11 22 204 9 91 36 -134 -37 107 199 -17 -231 9 -101 -417 -73 38 -4 -100 -32 -67
2042 -67 -21 -57 171 126 -184 71 102 -128 -106 38 -104 7 -98 -208 69 -104 -92 -124 252 187 -80 169 -38
2065 -38 133 69 281 199 22 160 156 -15 -203 -239 -160 -34 -16 71 41 22 203 -98 -16 187 26 385 116 77
2089 77 156 23 -99 202 35 -109 -72 -91 178 161 138 -92 -13 -120 63 140 -10 -255 -79 -194 161 93 251
2112 251 122 -221 -99 399 24 0 -134 54 -30 -32 56 -15 -112 83 -108 -300 84 131 -17 73 -54 129 78
2135 78 12 123 39 157 91 17 56 47 -308 197 64 -277 46 123 -87 -52 103 -180 -64 -115 123 -72 -14 -20 -51
2160 -51 359 -112 138 148 -519 -136 9 -54 134 -31 -46 -78 -128 -253 158 -15 86 252 6 244 76 143
2182 143 -45 8 -65 197 -185 -102 160 -91 -231 -67 -119 -83 269 207 -4 33 -172 -55 -130 106 -117 158 -37
2205 -37 278 -72 -22 335 -176 225 -102 -182 -87 217 -134 68 19 -231 117 170 19 42 269 99 -71 147
2227 147 115 113 144 -36 -256 97 -28 -188 -96 108 -54 265 15 415 226 -105 19 254 -93 182 -10 -332
2249 -332 -6 -95 103 83 -245 -147 -162 133 -168 -88 -120 133 -184 -85 57 -264 60 242 413 157 192 376 -124
2272 -124 87 -95 -96 -292 -399 75 235 -54 181 40 -127 -29 -36 41 70 114 -29 -203 -56 108 431 28 42
2295 42 138 -182 -34 -54 -36 -63 -105 209 -139 94 -54 2 97 13 8 -45 432 -170 -157 146 -7 -62 -128 -82 -185
2320 -185 111 144 -227 -94 16 -109 25 25 99 -222 159 -246 86 329 109 338 -78 168 151 -5 107 211
2342 211 -148 -138 10 -207 21 -79 -46 5 47 13 80 -103 -18 97 97 -222 -43 257 -48 272 51 -59 72
2365 72 48 -63 -235 -460 7 61 126 -89 -132 -20 37 90 58 63 53 26 -65 -196 -151 -6 -10 -13 -55 28 -51 -87 -108 -149
2393 -149 31 -145 63 146 62 104 35 198 51 116 -74 -9 -14 -37 -40 -55 -90 146 -71 27 -192 57 -10 37 218
2418 218 99 112 -36 -41 329 277 250 -56 -177 -242 134 -185 -380 -164 -375 -89 -158 77 -69 88 -238 -127
2440 -127 -44 122 94 29 4 62 -108 29 95 6 128 45 -165 -188 -125 43 -173 -303 -106 -37 160 107 5 -140
2464 -140 48 66 100 -61 31 -39 -122 -78 43 245 -80 209 0 206 -82 154 -204 -53 27 -210 -53 -231
2486 -231 -64 96 -132 -82 99 -127 232 -34 96 59 4 169 -175 33 180 29 -159 35 -111 63 174
2507 174 112 21 234 27 -31 -64 220 33 240 -48 22 -53 -273 -39 49 -195 -76 49 188 -7 50 -48 -46 349
2531 349 -86 -226 205 398 11 -52 -46 149 19 -73 91 141 -250 -41 -52 -151 184 173 -11 -142 28 223 82
2554 82 138 188 321 226 -24 -116 -75 41 100 110 -61 -134 -126 -33 33 166 29 118 78 102 163 206 1 -24 52 198 -72
2581 -72 -17 -99 314 -10 31 -85 -169 135 -282 404 229 -171 11 71 -192 -83 35 -5 260 -87 -103 -276 278
2604 278 -43 -59 90 -310 51 15 -47 -320 4 -35 21 -121 60 -7 83 -145 25 176 380 -126 31 -9 215
2627 215 418 268 326 143 33 94 175 -140 398 -222 -40 89 -151 -137 -59 157 -34 108 -6 -55 346 -175
2649 -175 62 -8 -176 7 -353 -160 -20 95 -92 -155 -219 -214 -158 -297 46 -59 -49 244 -103 -214 -120 -159 135
2672 135 -163 95 -91 -219 -93 -67 89 -83 -337 54 136 71 -15 56 -69 -328 27 -26 45 162 72 -217 115
2695 115 104 168 112 57 60 48 31 -184 13 -282 -106 7 145 -43 -308 152 183 4 188 260 -140 -291 -191
2718 -191 195 275 -78 -144 50 58 -71 -23 -5 -190 -127 178 65 -4 -55 -141 -145 253 51 -45 -163 66 278 189 206
2743 206 292 95 304 -80 -47 -68 -188 322 243 225 -106 -203 -4 258 -38 102 68 -39 -119 -49 24 180 -35
2766 -35 -125 -11 -27 -203 -40 8 -179 3 181 26 -267 -5 188 -145 174 150 57 199 -93 112 196 120 -169
2789 -169 27 -180 -123 -70 341 -155 -184 78 50 196 11 227 -112 117 167 -246 17 -31 213 -13 -91 -34 86
2812 86 -212 -27 -422 39 82 -42 -60 123 -69 138 49 -50 -139 -149 207 80 89 26 -63 77 46 103 123 -88 76
2837 76 -199 -59 -52 60 8 222 10 -96 163 -64 -210 218 27 158 29 -186 201 220 -60 -29 102 123
2859 123 11 149 63 -21 -99 -239 39 -37 -3 201 -102 -26 -12 -153 186 -72 -92 -133 -226 -200 144 8 1 -24 92
2884 92 -133 95 -28 84 -92 -61 -133 -469 37 35 126 -129 167 70 -116 -28 27 16 -154 -322 -45 -120 69 60
2908 60 49 316 168 -195 279 40 194 181 128 50 -56 -90 -180 216 34 -109 -105 5 -1 -110 -436 -22 193 -7
2932 -7 -63 -343 16 -92 -90 67 144 190 -134 58 232 121 -119 -46 -82 -119 -2 288 -19 -107 94 -137 42 -206
2956 -206 -60 -17 118 11 -69 317 48 0 127 -93 61 27 -36 -229 -102 -245 -73 43 46 6 -206 -7 -48
2979 -48 -34 125 -83 256 -364 -85 73 51 90 16 127 -36 285 -233 248 -257 76 101 5 41 98 294 -147
3002 -147 -45 179 -32 -157 -88 -82 33 -40 -52 35 -85 -188 59 44 -70 86 49 -424 346 156 110 -59 -254
3025 -254 139 1 147 132 -138 141 184 -32 -285 74 213 154 43 -21 84 -37 -179 36 5 31 -82 21
3047 21 -55 35 84 213 -219 -53 23 -77 -89 -82 -87 -26 -78 176 -20 -99 37 185 -519 -145 209 -254 33 -42 119
3072 119 192 54 -5 84 -29 -126 -58 -333 122 102 -14 50 157 -139 -155 52 -19 -318 158 -47 -19 -19 -142 -57
3096 -57 -172 -37 -92 -210 -76 52 187 74 -153 -282 -252 74 83 -25 -327 99 -83 368 -1 -96 -102 -158 83
3119 83 87 243 -184 78 -189 -158 -70 185 -258 -195 128 64 -144 -37 73 -106 75 109 41 24 -38 -104 25 40
3143 40 102 0 -59 58 -215 -89 280 56 -150 -103 257 -99 7 -123 219 -108 -202 109 187 212 103 -209
3165 -209 13 209 93 237 121 344 108 -65 -172 -161 -192 171 -93 46 78 23 31 -49 164 -121 -95 14 75
3188 75 212 -9 -296 -179 -47 -38 279 -91 22 44 -98 43 137 -134 13 24 97 -87 45 -41 -18 148 -85
3211 -85 0 136 136 -38 198 72 41 253 -208 -34 -26 72 112 42 -17 -267 161 272 157 21 -36 115 26 58 -176
3236 -176 -211 -107 -131 -4 -147 -15 -40 65 -207 -344 42 -80 184 -230 124 4 -107 -181 -85 69 181 179
3258 179 74 264 -47 5 15 25 116 48 -21 -107 23 10 -58 -9 -28 77 29 -132 -219 -70 -216 107 -7 85 76
3283 76 -76 -125 -15 60 -142 157 311 -170 104 120 99 67 272 -274 -139 65 59 294 22 96 -65 161 -98
3306 -98 82 149 -201 1 -13 -33 -87 -108 6 -7 -32 -352 166 -63 -98 -59 -145 144 -104 102 47 -135 -58 335
3330 335 -97 294 73 -249 -17 -28 -31 -143 13 -146 161 -138 149 -60 -95 -30 -32 -11 37 210 168 6 169
3353 169 53 139 104 -24 137 -146 -43 -184 301 70 3 -103 -334 229 -99 -103 -182 -185 96 -119 43 138 87
3376 87 -95 3 -5 -105 284 313 21 25 315 -266 67 27 79 20 7 -68 59 157 -299 179 273 -138 17 41 -127
3401 -127 82 17 -64 190 -64 -72 109 66 8 128 185 -242 158 136 -166 55 9 269 62 -42 197 -343 -79
3424 -79 15 -57 -109 -82 -63 -98 -16 49 -134 67 -313 -335 30 -395 144 -50 6 -154 221 -14 -78 145 -14 -113
3448 -113 -42 -240 177 8 -72 11 -310 198 43 91 -176 73 -25 -71 -114 166 -69 138 42 -101 106 61 -17
3471 -17 -232 -60 55 -4 -81 -83 -112 -125 -50 115 77 155 -42 -47 -61 -136 318 -28 -45 -185 228 -269 12 -46 -295
3496 -295 155 -80 -109 -89 367 -24 226 2 -306 -105 19 -173 -227 -132 218 422 -39 23 3 -76 33 -85
3518 -85 70 -225 18 213 -55 -158 -153 -94 77 -29 -20 -56 90 -21 24 5 26 -208 -109 18 -146 -141 93 244
3542 244 6 84 248 -105 1 47 162 1 -217 29 -35 178 -71 -330 -7 140 237 89 25 58 61 3 -100
3565 -100 -7 -129 15 -46 -215 -65 77 110 -287 1 240 70 174 71 88 -30 -130 113 114 285 -102 -4
3587 -4 -64 84 221 271 -34 -64 115 122 -98 61 211 17 -134 71 -56 -70 -7 -98 -117 -64 211 148 88 103 195
3612 195 -55 -14 -68 23 159 -71 153 -306 -17 -84 -105 57 0 81 300 -131 78 200 -244 -22 154 33
3634 33 131 28 254 46 -173 51 42 -27 118 175 255 235 104 -39 -412 25 -44 238 95 -137 -131 207 -44 19
3658 19 -156 -179 -25 -45 -86 -2 -22 -91 55 -193 -107 112 141 -25 121 -99 78 -12 -140 -6 -148 49 -33 67
3682 67 -26 170 -220 -274 -90 222 -202 -155 96 -230 -214 233 213 63 180 75 381 2 74 -118 -116 -138 -8
3705 -8 -147 202 -304 -240 -24 -256 -100 -36 -37 -41 -149 -45 40 -19 -215 -23 -196 66 -28 -267 -96 152 -175 70
3729 70 42 -10 418 49 -117 -47 162 31 -133 -217 356 -78 269 116 203 95 -70 -105 -145 17 167 -71 31
3752 31 109 -89 19 148 -141 201 173 -65 -249 -51 -72 -38 -51 -165 142 87 -81 -73 49 -167 -307 -271 306
3775 306 -76 105 -106 29 28 -25 60 77 -231 146 -4 -51 -91 39 104 192 -26 39 -25 127 171 94 -118 225
3799 225 -109 -486 -39 189 0 55 211 -91 186 -301 -89 -202 -162 -54 -13 219 225 -316 -35 -49 -62 246
3821 246 -97 252 -34 -97 -3 225 251 139 -34 -121 -118 252 -128 1 -130 -42 387 -361 88 37 -91 165 44
3844 44 69 161 183 -386 -161 68 -2 200 -176 190 147 207 -35 -121 75 4 -78 25 -131 -50 109 -216 -164 -233
3868 -233 150 -170 -331 132 58 -70 239 31 178 128 172 16 69 342 -21 -67 -70 175 -88 -13 221 -245 282
3891 282 208 -60 126 -157 348 101 25 91 23 72 76 -110 -36 -55 312 -81 30 -106 -37 -81 -82 138 -36 29 358
3916 358 38 38 -204 113 -69 61 77 -74 -60 104 -20 69 165 -102 174 130 79 149 268 41 -258 -88 -121
3939 -121 -72 100 -92 -264 -92 -65 -29 -104 269 15 190 200 120 -98 -182 -216 153 124 -196 180 84 46 -95 2
3963 2 -13 -26 -52 181 -20 -38 133 71 38 88 46 -28 -126 66 -180 -67 115 -130 197 199 43 118 -76 -11 -1 -19
3989 -19 -169 -44 142 127 271 105 47 -218 142 2 114 25 -107 180 -85 -96 -89 134 -227 240 -73 -173
4011 -173 54 4 93 -48 -251 -56 -188 238 120 -16 -35 147 -34 177 133 173 -129 76 -35 -108 -12 -157
4033 -157 -104 -196 182 230 44 152 -19 -107 -177 -133 36 -50 -103 -159 -50 -204 -10 -47 -444 -19 -56 -156 -78 45
4057 45 102 329 115 -121 -69 -32 50 122 286 -111 -116 -14 -123 151 38 142 -239 -22 36 -78 385 327 241 104
4081 104 -38 36 138 -182 75 -175 51 -77 -161 146 -11 -67 -30 -191 40 62 -55 5 96 -83 -80 -188 -83
4104 -83 -124 -144 85 -51 49 349 -152 -238 -37 97 -62 50 -11 413 92 235 11 -141 -65 -111 108 1
4126 1 -71 153 -117 -212 74 41 186 135 83 -1 85 196 -76 192 -30 23 80 -162 30 28 167 33 -12 -244 102
4151 102 -450 -40 247 -62 -34 -26 -268 113 31 -225 42 -61 -125 12 58 29 -127 -135 61 157 156 19 157 53
4175 53 47 -54 59 118 91 141 -88 189 63 -93 171 280 -125 505 221 -84 -215 -175 183 52 107 130 -15
4198 -15 201 -116 -112 4 -207 15 86 259 -1 251 -90 10 -176 165 -277 58 85 78 -45 132 -367 114
4220 114 -41 -71 -61 39 -134 -200 347 192 -309 -27 -155 113 76 -165 93 -1 -106 -10 -78 300 -6 146
4242 146 42 133 171 -321 -98 196 -37 -201 -103 300 82 236 -153 44 99 223 361 -75 38 72 29 -14
4264 -14 317 137 93 -226 -132 -32 -23 108 -107 -135 -108 -22 133 -21 162 -168 -81 -295 52 -92 187 -25 54
4287 54 61 -7 203 -21 -127 -181 -69 -200 -217 270 59 -176 178 62 53 -2 -6 -182 102 -153 25 69 -179 83
4311 83 198 178 -20 133 -97 -84 -55 -70 -178 208 -160 -389 -30 18 -157 25 -154 -178 145 -190 -269 -41 -71
4334 -71 -129 -30 118 -159 -3 -119 -49 105 35 -62 -132 -160 -96 -49 -296 -197 -29 72 -251 76 -114 85 -10 28
4358 28 -8 -146 190 -329 218 57 228 438 66 -4 -220 -135 134 -368 92 -157 238 116 172 142 174 -14
4380 -14 143 -149 -169 91 -267 -70 165 -48 206 -96 -58 3 -37 -184 12 103 106 163 83 -72 -38 124 169 131
4404 131 -1 130 -142 -251 298 -70 201 -254 -194 -95 314 65 22 104 -161 -76 37 -69 389 68 -138 20
4426 20 -149 -67 -46 128 -59 200 72 262 139 186 185 24 -38 48 -51 -59 -49 -164 -140 -157 234 -44 -406 67 119
4451 119 -59 63 -53 -56 66 -16 9 117 62 22 76 211 -33 -110 -39 -110 1 -159 -139 34 90 135 144 119 -26
4476 -26 318 220 159 -158 42 -49 52 206 354 -279 99 -57 -100 -4 -51 -70 323 41 198 259 89 -9 -69 111
4500 111 109 -123 -101 133 25 118 -66 -71 161 -141 288 -130 55 -99 -67 -137 -100 132 104 45 -217 -89 -8 105
4524 105 -134 189 -123 -200 18 226 52 -67 33 73 214 80 141 -117 -43 -47 -54 301 -140 -16 -22 -289 200
4547 200 8 -55 -91 -190 105 44 -180 -79 -73 -147 -143 -76 69 -305 216 -77 -123 -16 -89 -10 -161 -102 -8 -9 -140 -235
4573 -235 -314 103 -14 286 -2 66 28 -262 62 -58 165 -228 91 -307 120 -179 35 -61 -123 177 126 -41
4595 -41 -56 195 -80 141 28 -60 339 -81 152 -84 -29 -15 1 139 60 -85 126 11 85 -49 28 -58 -217
4618 -217 -210 -223 -120 -147 69 -232 -18 -102 -119 146 5 -154 -233 -17 -229 -133 -135 64 71 116 -55 -255 -30 37 85
4643 85 272 138 89 41 -37 7 -365 27 -8 111 -164 35 128 -150 -17 -185 -22 147 88 -181 -198 28 113
4666 113 -205 -37 -43 217 101 -246 267 -125 -55 -10 182 -84 -50 50 145 369 -95 -344 -63 47 57 10 110
4689 110 74 171 -4 95 10 -121 208 -242 -19 20 13 -49 -200 76 -184 -385 170 24 -106 -23 -125 -92 95
4712 95 86 123 -123 111 -20 -17 46 -66 236 -40 224 210 204 92 249 -153 -96 -61 52 -50 -79 269 114 90 -117
4737 -117 -197 164 130 -150 -296 -98 -289 -42 50 -47 -8 65 99 -180 38 250 -26 116 146 53 -11 86 64 -114
4761 -114 44 -81 109 27 -130 252 226 113 -183 20 12 69 -115 -51 77 -53 -173 -106 -79 94 -110 60 -24
4784 -24 129 83 89 -193 -27 95 108 -288 45 -303 -14 132 7 -108 -129 158 -74 67 -11 93 4 -43 36
4807 36 -114 275 119 126 255 113 141 142 73 53 74 -224 79 90 -142 -9 217 -59 80 -84 -44 -31 -164 60
4831 60 -233 16 245 -233 128 -76 -283 -23 73 22 -24 -126 -29 -138 66 -263 -44 -5 -117 -285 -29 53
4853 53 -71 -102 -151 -156 -258 -33 -72 -104 93 -161 199 0 -73 -205 -273 207 -239 -241 -58 -29 -75 -206 -38 142
4877 142 174 -39 -291 -82 8 208 119 -199 81 -77 234 -126 83 248 100 149 -1 190 -197 42 74 79
4899 79 6 167 -2 197 -76 18 24 -3 357 -15 -81 -171 58 161 -216 -281 -25 116 1 138 -101 -7 -169
4922 -169 -212 -112 -78 -127 85 164 -56 257 32 19 65 -96 -44 -114 -114 -119 78 -102 -63 -54 -233 -63 -37 -221 9
4947 9 -109 -5 51 -18 262 -83 -206 113 -34 -299 25 -101 94 -61 173 86 9 -231 -178 -53 31 65 -257
4970 -257 12 406 -2 -169 -158 108 -31 23 17 29 103 154 -2 82 152 2 -29 102 -166 64 -162 -175 34 78
4994 78 84 -19 -295 -235 78 -81 85 -62 2 27 -409 -83 34 -100 -131 -38 -77 -100 -133 111 -233 123 172 -116
5018 -116 -121 80 174 -202 -210 -77 224 -174 6 149 -172 -23 -8 -119 40 -282 -54 201 -45 159 -230 -309
5040 -309 -247 256 29 63 -139 33 150 4 60 -161 -11 311 198 20 -6 -191 198 -174 118 -15 49 -94
5062 -94 -44 98 -69 85 -123 -84 -53 181 11 86 -151 -222 148 -248 -251 172 -87 -218 226 -166 2 63 45
5085 45 100 -81 58 -290 -2 9 -114 47 -186 15 -28 76 127 -16 -12 23 126 -32 -211 -167 45 -153 65
5108 65 -227 136 79 -28 -106 -93 -167 -13 202 -83 83 116 -164 -223 -64 181 96 106 -134 281 8 52 289
5131 289 66 130 264 -92 5 93 -126 234 -8 220 132 -100 -76 2 116 -82 59 39 17 -53 68 134 128 186
5155 186 78 79 89 -110 2 -154 -308 71 101 47 -120 -263 -251 56 -50 294 86 172 -7 -50 64 352 -67
5178 -67 -84 196 -43 -134 59 57 -373 -157 61 125 38 37 -202 -33 8 -16 -70 -182 65 140 -16 30 -145 -50 171
5203 171 53 36 -41 113 -36 -24 -56 -24 -228 -31 74 -130 -93 -68 -55 -295 -40 -204 -44 68 -47 118 -325
5226 -325 47 -119 9 1 122 -278 135 56 42 -104 48 122 -197 46 -109 -93 -212 218 -168 128 -47 -57
5248 -57 -29 -89 72 -46 45 -63 87 -14 -86 -84 7 -41 -199 -103 245 138 -72 -299 22 159 -405 109 -59
5271 -59 -253 -70 -41 -234 338 68 0 379 11 112 -99 -21 -30 256 62 -54 -352 -174 -106 -113 -10 -74 -124 -45
5295 -45 -157 -168 158 -261 11 261 -3 12 -231 -196 86 315 112 139 -35 82 -84 -262 -1 81 -225 330
5317 330 -29 -101 -330 -170 25 66 55 -21 106 86 55 78 -18 -36 -107 -23 -6 52 -108 -168 144 26 31 -43 -261 -294
5343 -294 303 -70 -225 8 35 11 88 -51 48 53 -56 23 -108 -113 -52 113 64 -91 -32 -79 249 -39 -171 -466
5367 -466 -66 7 11 140 234 162 40 106 196 110 -306 43 -89 -83 162 -84 -67 177 -224 135 -153 -340 -183 14
5391 14 -183 1 189 -9 -54 368 216 -21 118 -218 102 114 -96 6 125 -109 -144 67 0 -193 3 98
5413 98 -12 -16 -109 187 284 -30 -78 143 78 16 164 118 95 -70 -36 50 47 128 16 -110 -30 -66 -318 -146 219 222
5439 222 -45 113 -74 3 183 89 -103 172 -124 48 -27 -52 263 -55 -15 338 -116 -38 -178 177 -92 75
5461 75 -108 126 -10 68 87 -27 -169 36 13 -336 111 61 -331 8 21 -24 3 234 389 120 -103 -108 -234
5484 -234 -207 27 128 -200 -134 136 40 -144 124 -436 -22 59 -136 -22 64 -123 -231 322 5 -46 2 88 108
5507 108 25 19 -39 -13 -170 124 49 34 -122 -185 57 -74 112 -91 -90 187 148 -23 20 -136 128 2 -177 -157
5531 -157 -274 -108 -271 -163 88 -53 -45 -262 -9 -34 116 45 -122 4 -93 -155 156 -1 112 14 -278 -138
5553 -138 148 14 35 63 14 73 71 30 114 303 -7 -118 146 322 -97 30 -32 -175 84 -42 174 114 57 -189
5577 -189 -115 -106 -190 -116 61 13 -90 81 -56 57 -227 -70 -39 97 40 -285 68 51 -39 89 135 -252 70 -64
5601 -64 10 13 87 96 96 -40 217 -57 -157 22 -183 198 6 -30 -107 43 107 -188 -153 88 83 240 51 121 109 -10
5627 -10 -151 145 -46 -140 -36 156 74 130 -67 19 -20 294 -63 -301 173 -78 -159 -20 -163 158 -149 -81 -237
5650 -237 48 -403 78 69 -350 53 244 130 74 -32 42 -39 46 42 69 177 -35 86 -532 164 260 -43 -223
5673 -223 -264 -167 -226 -7 3 15 185 166 25 38 -18 -205 -17 -103 -235 296 -85 -106 -244 212 172 124 -113 48
5697 48 391 -135 -103 -111 -40 -175 276 49 124 -46 143 -61 -153 73 -118 -81 -57 46 253 -151 -40 92 66
5720 66 0 134 70 125 79 -153 -115 111 158 -142 -70 120 -98 127 -248 92 24 22 157 77 138 -141 -20 28 163
5745 163 -218 275 -29 76 49 152 279 -44 -115 93 -114 -37 -33 -132 8 79 45 -75 -20 36 220 98 225
5768 225 406 179 41 149 221 -219 146 -130 -70 224 31 -165 175 55 -63 -256 -37 7 -137 73 31
5789 31 -162 -195 -66 89 46 143 -8 -35 62 83 111 178 14 -53 -40 233 -43 -1 126 3 211 -35 -9 47 -63
5814 -63 152 -24 -135 168 45 95 108 102 122 211 -156 44 355 -29 -122 -62 124 304 -139 85 229 -149 24
5837 24 -100 135 64 -150 -213 79 121 2 -137 -62 -232 -237 92 -136 193 -157 -175 -5 220 -98 -100 -120 79 -9
5861 -9 -300 -157 -110 -61 -174 -16 -62 37 -302 194 -83 -35 -39 -59 -111 -104 345 -190 166 45 118 -99 -53 -103 22
5886 22 201 141 90 -17 -61 -9 51 51 -56 -32 178 61 211 226 81 372 -71 119 266 10 -61 -119 120 -34
5910 -34 -50 -300 -127 -6 88 246 93 -181 -162 -23 -27 -51 -352 -150 -69 133 68 -51 161 6 327 103 27
5933 27 213 273 205 -101 193 1 -141 163 -184 2 -63 -3 23 171 204 -32 -223 54 -5 -45 -209 -114 -281
5956 -281 171 182 -16 259 9 -1 -19 -250 -27 279 -25 282 268 139 -143 214 -118 -45 -18 134 -66 -199
5978 -199 114 -85 121 -20 -107 -154 -95 150 -129 300 325 -76 110 208 51 53 79 119 41 48 201 165 -89 329
6002 329 -95 94 144 154 289 141 82 68 -231 -162 262 -36 -7 395 45 -99 70 -109 -44 91 -77 164
6024 164 17 -118 -26 157 -89 182 58 150 195 -156 53 162 -73 -69 -65 204 84 -122 56 -578 -353 300
6046 300 222 23 119 -188 78 -84 257 -208 -113 -66 -60 -13 -133 231 176 -53 85 16 -162 -52 80 -1 -237
6069 -237 -16 -120 394 1 46 -166 -8 123 -157 -256 -18 20 -47 142 179 107 70 -38 -10 31 10 129 263
6092 263 -241 -130 95 183 24 140 -18 -115 -130 -125 -243 -10 -92 -233 -133 -112 -255 215 43 -89 -44 -55 -120
6115 -120 57 -83 59 -191 -71 -123 218 148 91 50 -91 -73 -108 40 62 16 186 -149 -95 -251 -110 119 151
6138 151 -105 -192 154 62 -50 -182 -48 263 -19 -1 -105 264 102 -79 76 -106 -24 -25 -55 8 104 203 267 55
6162 55 51 -22 91 -55 -523 -163 -110 67 -170 4 -174 171 23 -97 36 275 -135 -194 55 -141 37 46 93
6185 93 -27 -28 85 -4 -106 -14 -92 -164 47 117 -74 4 -136 198 239 4 195 249 -166 -86 144 -178 -132 91
6209 91 59 -144 -167 -59 -172 240 153 41 119 -55 9 122 -12 17 -134 45 -137 -124 -8 -122 159 -160 -183
6232 -183 59 -80 -92 -12 33 185 279 -71 251 123 29 -151 -136 -14 -156 -134 -81 37 5 252 61 -382 47
6255 47 149 113 29 -1 -236 6 199 -22 52 368 -197 23 -2 152 232 -187 88 -255 81 3 -25 11 208
6278 208 41 6 -127 -188 -31 28 150 -25 8 -158 -125 123 51 -192 -72 177 -81 180 308 -89 -101 -292
6300 -292 -136 -169 -142 -5 5 82 51 -37 22 -50 -212 61 81 -289 -125 -4 242 -83 -161 -120 -191 -178 -45 -36 -307
6325 -307 -68 98 20 168 63 -86 18 81 -4 -88 -56 -82 -102 -34 -70 29 -58 108 11 -219 154 188 15 218
6349 218 68 23 63 257 59 -231 62 80 255 80 -115 212 -225 83 551 33 -42 -45 -116 -87 159 133 61
6372 61 97 -4 62 -4 273 -48 -10 -127 -99 -212 9 -96 -10 -201 66 -38 74 47 33 -231 -145 -238 -48 73
6396 73 81 143 -31 -158 -124 154 117 292 -143 63 -2 -48 -32 40 -150 115 42 13 3 110 -259 33 51 256 225
6421 225 12 -145 -14 20 -133 80 2 202 -158 -180 19 55 -6 -40 83 -201 -61 22 -114 123 -15 -48 -54
6444 -54 -211 -128 89 127 51 0 224 160 -212 -242 -25 49 -17 -389 -270 226 -62 102 -74 -89 186 -67 -31 110
6468 110 -208 50 -90 224 -95 226 -66 -2 31 -143 -111 -100 -170 -91 -73 -52 -65 4 -45 72 -142 -176 74 121
6492 121 61 150 106 -156 54 -111 -101 -3 -127 50 -82 -224 235 -156 91 -10 119 -189 35 -123 71 153
6514 153 -109 -69 -158 54 -58 115 68 -117 48 69 -186 117 -246 -274 -152 -57 72 -190 255 179 219 -162 -148
6537 -148 -58 -53 243 -109 55 34 -22 -63 102 115 -174 51 74 -11 184 54 -51 78 49 -96 97 127 -52 -12
6561 -12 -14 216 94 3 -79 112 -101 44 -123 -123 -102 -175 74 -26 -198 -10 -25 174 247 0 243 -112 37 105
6585 105 -178 167 241 95 -87 19 140 22 145 -50 -80 -98 -9 195 -96 116 139 141 -186 -52 -207 -99
6607 -99 25 59 113 -146 148 -58 107 -28 -207 -97 -72 -131 6 189 35 131 109 54 205 -135 195 -372 309
6630 309 -90 -248 127 16 116 -196 64 8 141 111 31 -281 -177 111 124 440 -61 -111 147 235 -70 153
6652 153 133 -172 -32 143 310 -176 -213 157 216 -24 113 -58 95 295 253 -38 -289 73 -52 39 33 158
6674 158 -306 32 39 -136 -161 65 -90 -64 -36 215 5 -140 -94 126 -221 -137 148 28 -303 -1 21 107 259
6697 259 264 -77 87 84 -129 132 20 -129 -129 105 -143 374 -53 57 -133 -7 -166 86 -165 -30 91 99 -3
6720 -3 20 -161 -41 -10 232 -128 58 29 -108 99 132 -6 37 -147 -122 59 55 98 92 130 42 184 -35 -42 102 145
6746 145 51 -305 175 50 -185 77 80 -32 44 27 12 38 -66 -20 9 142 282 5 -178 -25 180 -227 -203
6769 -203 -285 -42 41 23 221 84 1 114 86 336 80 172 -62 20 141 -151 167 21 234 48 -29 -39 230
6792 230 -302 164 0 125 134 205 62 -36 53 105 -219 328 21 236 -74 -91 -288 -19 11 -124 -14 -45 -199
6815 -199 367 64 -7 -42 -116 129 102 36 56 111 -411 -157 -152 119 -40 76 -29 30 -173 -176 -165 -17 15 174 12
6840 12 168 332 -64 285 295 195 117 100 20 -71 107 98 -220 11 144 150 87 -298 -95 -11 -200 5 -76 -88 -99
6865 -99 -120 112 36 -118 -113 -286 29 -80 137 178 -116 -172 -146 96 -39 48 118 349 -10 -103 93 -86 103 -25
6889 -25 -79 -373 29 -34 -17 19 -4 100 139 -253 -65 150 -64 -79 -54 -131 74 -59 -135 169 71 24 -125 115
6913 115 -269 75 -257 -53 164 10 -18 -47 13 -60 208 -337 0 -71 -159 153 17 -206 94 -112 36 324
6935 324 -183 88 41 129 305 -212 193 282 124 38 77 144 77 -61 182 247 -72 -108 -16 319 -124 183 47
6958 47 -260 144 247 -123 -218 209 -443 -106 267 -174 20 -12 -32 -54 81 -21 113 -91 -144 -32 -155 63
6980 63 234 -132 86 -3 -133 7 52 -186 -101 -26 58 -75 139 -104 -86 1 -59 -88 -9 -78 -147 106 58 -5 178
7005 178 -11 -84 125 -38 -3 162 136 36 -174 -52 83 -101 -71 53 -208 82 134 151 303 -17 -301 88
7027 88 175 34 -182 -71 -127 38 -41 -233 311 -169 -75 -17 71 142 -65 346 -239 93 75 -396 -111 31 76
7050 76 -26 167 21 -82 17 47 -36 -94 248 -54 116 -55 40 46 -59 350 38 84 -110 -105 -155 -80 131 -88
7074 -88 -121 86 96 113 -303 51 148 -190 -91 165 107 -89 130 -156 -229 -36 80 62 90 124 -165 -14 104 166
7098 166 -41 174 7 -320 -142 85 6 291 -5 107 56 98 85 -296 25 54 6 13 -66 -173 27 78 -91
7121 -91 -197 192 221 147 -28 -185 -100 39 153 -71 35 51 115 78 198 -36 -208 -57 -117 39 -153 53 -202
7144 -202 138 -126 31 40 -27 154 -2 -41 244 126 1 -150 35 -113 135 173 -35 123 143 102 -90 158
7166 158 178 -132 -165 73 -292 -164 126 -91 180 140 20 87 49 1 71 -56 3 41 -65 -147 120 45 -22 45
7190 45 23 23 83 46 312 -53 -37 183 -71 14 232 107 87 -77 223 -81 122 -84 -23 51 158 25 167 40
7214 40 39 78 -217 413 37 -235 -120 -46 -157 351 187 29 -115 -18 -91 -99 13 440 203 29 -146 165 -13
7237 -13 -175 -109 -28 239 73 7 33 140 80 71 85 154 -35 -231 30 270 -141 -156 210 26 215 316 -238 -84
7261 -84 -19 -299 -156 3 22 153 -160 54 313 17 -4 43 152 -130 -65 -61 -386 14 -50 -27 201 -198 -99 -33
7285 -33 59 124 81 -211 102 21 201 -41 31 10 114 -258 47 129 -3 116 7 480 30 143 -146 74 -96
7308 -96 44 -112 43 -76 -13 -43 -137 72 -113 13 -75 -69 -91 57 213 -54 160 192 295 515 -112 232 101
7331 101 -125 -20 -54 -61 12 -17 -194 -20 97 100 -3 -45 -223 -78 26 -101 -155 168 -95 -197 102 -28 -281
7354 -281 -5 -401 -73 121 0 28 -109 146 18 -47 81 -67 -215 59 -42 16 149 108 -258 315 120
7375 120 134 424 -171 -64 -162 243 -133 136 -93 336 87 -77 59 87 40 210 8 40 -9 50 110 -189 0
7398 0 100 68 -201 253 -41 -166 122 166 -6 -172 -8 105 -300 -72 -342 73 323 -36 -146 208 -75
7419 -75 209 129 4 -16 -267 130 -29 -74 -90 -18 -22 97 -102 128 -178 28 77 -77 125 -30 -51 -151 25
7442 25 132 -217 -19 147 -144 -119 -157 -169 144 -13 78 223 106 -167 -185 -84 -110 -37 60 -249 233 -33 56
7465 56 71 -69 -105 41 -30 -298 -147 -32 -11 -174 9 102 -113 -284 80 136 -61 21 91 -127 157 177 -11
7488 -11 193 -189 -36 -135 121 -34 141 220 18 298 -169 185 28 -57 27 -55 146 272 -86 114 -126 -187
7510 -187 -215 99 57 -45 -95 -155 -63 8 121 -90 96 -18 18 123 34 199 -45 -216 -24 -6 23 97 178 -2
7534 -2 7 44 -91 -57 48 96 -291 113 108 219 -85 -108 217 79 -8 117 45 -129 -58 -162 136 64 -249 -116 64
7559 64 -63 205 103 -103 72 88 181 -10 94 45 159 152 -107 174 165 -100 -88 218 111 213 81 198 123
7582 123 -134 61 -100 16 28 261 32 -84 -43 83 202 -55 221 -191 -50 70 -203 -78 -5 -194 -120
7603 -120 -23 -114 134 -73 -133 -245 -49 -115 -124 38 51 -10 90 133 -268 -256 231 66 -65 -248 -25 -99 27 -70
7627 -70 107 14 -74 -24 -52 31 95 85 44 -35 -28 -111 182 63 -155 -225 108 -21 266 16 48 185 107 160 -170 -69
7653 -69 -35 89 92 -79 -319 299 379 39 10 253 -163 -103 204 3 -23 -262 -278 59 93 -203 -198 23 139 -250
7677 -250 -192 18 -107 178 -55 -83 3 -96 -110 170 97 -292 -97 -169 89 -69 -92 52 -140 -74 67 -76 -167
7700 -167 84 -244 -330 -24 -355 -30 -40 139 36 146 64 -3 -75 205 41 -158 19 159 -10 -180 -72 383
7722 383 14 64 -156 -43 109 -73 40 -249 171 -119 -61 206 153 -230 -126 -310 -114 -126 -23 308 -110
7743 -110 -75 -8 24 304 -31 104 -7 68 118 -244 -125 39 -35 -203 -200 367 139 113 183 253 81 32 -199 -229
7767 -229 -12 144 -94 291 73 -235 43 -85 77 -100 -60 -30 -163 -60 129 -105 15 -194 -4 93 119
7788 119 -77 90 -42 171 137 -94 190 -28 55 82 194 -23 -97 96 -156 195 86 -57 81 151 134 282
7810 282 4 150 10 154 203 -163 -188 -102 -16 -217 88 -214 180 -14 -228 16 123 -123 -54 170 -40 -134
7832 -134 -35 63 12 -28 -112 -22 168 198 515 16 -56 56 -122 -49 12 -67 -120 -25 -199 73 102 -152 13 -93 73
7857 73 16 159 65 -209 71 -154 -147 -78 156 122 -129 34 85 -170 126 -140 59 137 -29 -180 241 2 291
7880 291 -44 -62 -78 -102 40 65 228 135 69 173 140 -90 34 162 133 26 -58 174 92 319 69 241 106
7903 106 -151 -198 108 60 132 -133 34 -102 139 23 150 82 69 193 190 152 145 -73 -5 127 -77 94 223 12
7927 12 253 -40 222 -54 13 -67 283 -10 -191 18 -165 -41 -35 92 -94 -64 78 -198 67 78 -73 -247
7949 -247 -143 -229 -161 50 186 -20 56 57 -132 -108 -17 -133 10 -2 -62 -49 -267 -124 -29 -8 -166 90 380 71
7973 71 215 212 -221 -82 -149 -78 125 4 -158 -26 -28 -88 -34 5 -10 -56 -97 49 -176 47 -57 108 34 -31 28
7998 28 -275 187 34 160 118 -77 151 -34 217 17 -144 75 127 193 89 -54 69 -105 -141 204 -240 -73
8020 -73 108 109 -67 139 -247 -34 103 86 25 10 21 35 -141 -153 2 -7 12 139 111 -5 -375 -298 59 -38 55
8045 55 -84 235 32 -13 -60 -170 157 -114 -5 -88 8 253 49 28 12 111 61 57 107 151 -86 -55 -44 -335 -9
8070 -9 16 -62 30 31 313 -91 72 -37 -118 -255 -125 136 -85 58 51 -220 222 163 91 -111 -199 29 29 8 162
8095 162 -140 0 -185 26 -158 -178 236 -399 -110 -17 77 -14 -355 -214 -38 -65 26 239 -34 45 -171 206
8117 206 209 72 -47 -51 -200 47 -63 -200 0 172 -124 140 -28 92 -197 -58 117 -13 125 6 55 28
8139 28 252 -100 22 -86 -60 252 -64 69 89 174 49 -4 -121 -144 -55 -88 -102 314 194 196 255 129 -47 -48 -190
8164 -190 166 62 -40 -215 168 163 181 -70 130 37 -15 21 254 -119 113 -268 -19 36 49 -12 265 110 74
8187 74 134 27 -233 -321
8191c21
$$ Imaginary data points
##PAGE= N=2
##DATA TABLE= (X++(I..I)), XYDATA
0 0 0 0 0 0 0 0 0 0 0 0 1 -8 8 -8 8 -16 16 -24 24 -32 39 -41 49 -63 72 -81 96 -112 128 -148 169 -193 218
33 218 -248 280 -316 353 -397 444 -494 549 -613 678 -752 833 -918 1013 -1118 1232 -1357
50 -1357 1495 -1647 1815 -2004 2214 -2451 2721 -3031 3390 -3816 4324 -4948 5734 -6760 8160
65 8160 -10193 13431 -19412 34192 -154271 -130384 141673 -1985 -69569 -76124 -36028 77047
77 77047 154416 -18318 -84701 80354 147003 4653 -42936 -20777 -8156 47988 43409 -105984
89 -105984 -104388 56510 62056 -76575 -110812 -46041 41990 76686 -13340 -99137 9313 136769
101 136769 63112 -44745 790 65329 52438 6775 -60831 -73707 14610 26804 -77122
112 -77122 -94482 -5768 33478 16401 -190 -12199 15571 81287 71936 -14803 -26339 38789
124 38789 37474 -18511 -38265 -28404 -8017 5461 -24040 -51839 -19049 27447 18507 -26975 -29556
137 -29556 22371 50254 22712 -8518 -2631 30455 44317 14244 -18361 -11238 13739 5935 -36105
150 -36105 -45222 -12725 -2074 -18257 -25438 -17910 11452 38911 19360 -6633 14304 42365 32496
163 32496 5927 -7592 -9337 -2229 1601 -19925 -39394 -13807 6173 -15582 -22951 -3820 7735
176 7735 18208 16854 -5433 -27 32736 31739 -854 -6857 10019 9749 -813 -7601 -22697 -21679
190 -21679 150 -9466 -32600 -14316 8108 1466 -149 7348 10662 22488 30503 13287 -2960
203 -2960 9470 18653 -2097 -16413 -12654 -16064 -13657 -6317 -18969 -19953 3128 7502 -4062 1934
217 1934 13462 13831 13100 12019 4892 4806 15852 8331 -12365 -9321 794 -8413 -13056 -12232 -18096
232 -18096 -11929 270 -3962 -7732 4728 15319 12645 9327 14789 15673 12250 9961 -986 -9789
246 -9789 -2812 -4192 -17039 -17853 -12451 -9266 -4522 -3007 -3066 3287 10210 11009 6506 7223 11362 8040
262 8040 3582 2336 -1302 -814 2312 -5462 -10449 -6226 -4939 -6170 -7058 -8512 -6015 -92 2862 2076
278 2076 2749 10137 14175 9263 7653 9061 4897 2424 -2576 -10658 -10443 -8281 -10865 -12993 -10109 -3807
294 -3807 1174 2549 5198 8594 8610 11079 9286 4034 3355 2079 -1772 -3843 -5632 -5851 -3863 -3998
310 -3998 -3805 -3448 -2990 1012 1134 -2287 -631 2139 2875 3103 1811 2843 5922 4755 3216 2243 1146
327 1146 1036 -1997 -6347 -5914 -5565 -6520 -5217 -4041 -822 2460 3486 5546 6662 5706 6727 5745 2126
344 2126 327 -2201 -4755 -4390 -5838 -6483 -3903 -2963 -918 561 212 3245 5328 2860 2836 3026 2408
361 2408 1992 -920 -1865 -219 -1484 -1439 -1512 -2976 -1023 -950 -2974 -1257 -55 -223 757 961 1737 2639
379 2639 1946 3498 3237 1415 2209 916 -1501 -2054 -3406 -4928 -3112 -3173 -3506 -2457 -699 1855 1932
396 1932 1965 4753 5413 3638 4046 2503 688 825 -1461 -3441 -3070 -2789 -2853 -3430 -3235 -1074 -1153 -780 1726
415 1726 1700 1577 3242 2216 1562 2964 2002 1029 1094 132 -706 -1575 -2053 -1602 -3566 -3494 -1780 -2270 -1724
434 -1724 223 -362 1197 3101 2034 2450 3462 2608 1680 657 -78 -725 -2237 -2247 -3001 -3580 -1523 -1585
452 -1585 -2723 155 1095 -53 2022 2901 1239 1699 2398 1070 -198 283 203 -1323 -1120 328 -2062
469 -2062 -2038 714 -1567 -2817 740 484 -1034 914 1378 183 948 2344 1565 82 1404 1870 -785
486 -785 -534 603 -2154 -1925 -127 -1890 -1813 179 -110 -281 481 1013 1579 1481 1596 928 74 1131 678
505 678 -1249 -273 -338 -1720 -319 -272 -1675 -250 412 -245 370 372 906 302 444 805 -450 -1054 997
524 997 -69 -1437 261 -76 -838 579 326 -328 -35 780 862 -399 -119 984 -385 -780 685 -850
542 -850 -1171 537 -283 -1161 33 340 90 126 333 225 -180 1221 1225 -1340 66 1409 -321 -331 635
561 635 -911 -348 912 -731 -1450 -308 -404 -1312 -1030 255 -327 -291 1586 851 -182 1878 1646 -83
579 -83 1090 1060 -832 -396 -573 -1730 -2084 -953 -784 -1257 -494 920 146 688 1892 480 253 1774
597 1774 647 -820 255 -317 -799 -606 -414 -599 -746 -193 44 -568 -216 101 -701 65 584 -851 224
616 224 792 56 807 1286 374 662 516 64 -192 -640 -144 -1187 -1891 -426 -340 -1303 271 853 -133 1045
636 1045 1126 623 627 261 571 -271 -593 118 -348 -1183 237 62 -485 125 316 -420 137 -85 -316 -500 -500
657 -500 -124 -126 -197 442 274 196 596 243 589 612 -383 -93 148 -845 -532 -75 -616 -469 30 -53 161 334
679 334 543 -33 -723 420 313 -1126 78 200 -480 537 843 169 712 934 202 -213 -195 -85 -526
698 -526 -1417 -214 -538 -1203 32 166 -216 740 813 303 679 182 302 283 -159 271 -209 -404 338 -96
718 -96 -372 299 205 -233 -30 -582 -252 -93 -369 13 -95 7 559 478 796 1071 702 419 309 -118 -189 -552
740 -552 -996 -621 -487 -1020 -616 -258 5 250 646 508 948 395 759 347 -105 290 -127 -972 -174 -116 -1227
761 -1227 -250 -164 -384 -155 -435 11 -582 -33 -31 -333 -136 681 8 236 1094 554 -176 430 66 -110 -318
782 -318 -371 -590 -1038 -586 -400 -694 -435 380 -42 242 588 481 463 427 177 216 422 -26 -82 -305 -580 -179
804 -179 -544 -4 -307 -465 -72 -120 -405 386 -79 -427 1040 277 -118 336 158 73 135 -22 -42 -183 -457
825 -457 73 -523 -540 -59 -106 -232 352 -62 -260 512 -120 -9 -218 -372 285 2 -148 265 14 207 146
846 146 -166 -330 167 -346 -265 -342 -374 -133 -386 -353 165 30 40 678 -144 263 478 88 49 162 -8 5 -24
869 -24 -25 391 -6 170 282 149 354 122 -375 -443 -276 -701 -570 -259 -52 139 -20 387 625 169 242 748
891 748 -172 318 49 -627 91 4 -621 -172 -388 -332 211 -255 41 150 -351 -34 189 27 264 115 -90
912 -90 40 -32 -65 296 11 -83 93 -493 -168 -283 -433 -158 -200 -297 478 -118 -205 842 46 467 704 122
934 122 225 162 -251 114 -437 -393 57 -818 -361 -65 -595 -91 63 -228 235 75 -139 203 228 219 440 182
956 182 479 300 -117 222 90 -565 -388 -80 -834 -197 -95 -452 152 -138 166 612 -37 653 342 46
976 46 142 85 -346 76 -114 66 64 -560 119 95 -283 -9 -335 -530 -68 -180 -129 271 30 -89 560 246 226
999 226 387 281 242 692 53 14 -407 -449 -10 -761 -217 73 -472 -75 281 -28 523 398 337 146 484 -181
1021 -181 -206 196 119 127 -232 208 99 -271 248 149 -292 167 -231 -724 -202 10 -261 -68 169 3 -97 287
1043 287 549 208 195 279 -219 125 312 -264 -484 114 -182 -251 247 68 17 -5 149 213 -136 -84 117 -279
1065 -279 250 72 -264 414 91 -143 417 492 -57 234 100 -409 -1 -150 -199 -97 -68 -32 130 -27 459
1086 459 149 -195 440 137 -156 82 -67 -235 203 -317 -206 -302 -215 -61 -71 -170 3 -28 -197 -122 -187 138
1108 138 294 145 447 291 269 334 -13 3 253 -60 -295 -255 -100 -677 -268 -88 -204 -81 -303 91 38 -45
1130 -45 216 -106 -204 236 -180 18 106 -68 -126 72 -306 4 -143 -178 -79 -179 -221 -263 -230 -157 -49 -300 59
1153 59 351 60 420 322 278 351 70 -108 -285 -100 -373 -352 -372 -319 -117 -217 146 2 -144 454 -179 -139 259
1176 259 -99 43 98 -412 -21 221 75 70 -40 -146 -253 -373 -244 200 -462 -177 -75 -466 -196 173 -159
1197 -159 387 135 86 277 -86 7 162 -151 29 60 -359 -146 -301 -178 -105 -199 -105 -34 134 -25 172 -33
1219 -33 285 360 6 444 221 -88 491 110 -167 -80 -12 -317 87 -73 27 -66 -209 314 -7 63 338 -15
1241 -15 -44 185 -85 -49 185 -435 -140 -64 98 -95 9 1 52 -99 -250 -252 -352 -392 -233 -258 -204 150 144 40 377
1266 377 31 368 317 169 160 97 -49 -50 -76 -132 -85 -267 438 135 -296 190 -54 99 174 -146 -82 2 -36 -15 486
1291 486 193 445 237 18 147 186 116 69 -481 -198 -220 -157 -68 -265 -72 27 177 61 381 -61 224 33
1313 33 77 7 177 112 65 -85 -248 -103 -133 -290 -69 148 -309 234 -151 6 76 118 316 117 248 183 255
1336 255 -50 376 -384 157 126 -364 -69 -124 -294 -264 -310 -174 -84 133 111 143 325 142 313 142 72 343 -97
1359 -97 99 242 -93 83 -5 3 45 -200 -394 -159 -370 -142 -252 -151 391 -272 -162 351 212 197 408 -129
1381 -129 201 151 -9 -15 -247 -202 212 -273 -62 186 114 1 313 83 -80 73 109 34 -271 -19 6 25 -144
1404 -144 157 252 -46 138 -66 133 -272 -509 -138 -73 -188 172 -43 -41 45 -118 227 458 -243 242 17 120
1426 120 -63 -102 -224 -49 -159 -57 162 17 -74 243 -387 123 23 159 92 -196 170 125 -67 12 288 146
1448 146 -185 165 -166 -15 129 -332 106 53 -121 56 -123 -290 49 38 74 45 -97 77 183 44 378
1469 378 -146 -231 128 -2 200 92 -143 -196 12 -121 -134 -347 -233 -117 -134 -183 75 379 -63 280 73 16
1491 16 89 -122 89 191 -20 -50 -114 -84 231 -114 23 -83 -124 -227 78 -192 234 -48 -232 302 40 79
1513 79 244 267 214 253 86 227 217 -329 70 -114 -195 -264 -124 -104 39 115 -121 69 10 148 -138 83 365
1536 365 403 -95 128 10 -218 213 -81 -165 -174 -155 -481 -102 63 -183 -162 -202 -52 49 171 -43 -107 217 144
1559 144 -1 -8 71 -209 40 318 12 -96 -80 -399 -159 -80 -57 158 -237 152 212 -32 66 -5 -5 34 36 30 104 76
1585 76 0 -136 -83 73 -250 -330 -184 -357 -191 134 -138 -43 139 -27 215 77 89 125 -34 -155 104 12 -121
1608 -121 128 138 82 132 -37 -12 -11 -116 -235 220 32 -151 11 152 158 -103 -94 52 148 139 172 -67 -3 14 -258
1633 -258 -2 -170 -149 -156 -40 -9 48 -4 -78 183 11 150 213 16 358 -50 322 10 156 3 -79 -305 -18
1656 -18 -20 13 -7 -223 -214 48 55 -145 -19 -46 -4 151 127 81 -44 219 209 -157 103 152 -147 -286 14 -206 -18
1681 -18 5 -230 13 -20 -13 98 276 -79 138 -81 232 112 -61 -15 135 81 127 182 -63 50 10 -357 -386 68
1705 68 -129 161 -172 -119 -4 -115 259 133 275 361 -192 -77 214 -33 -210 -331 -361 -103 4 27 -81 68
1727 68 -19 -228 1 205 206 34 -61 -205 177 69 429 -45 -88 -182 -87 -272 -179 146 -163 -46 -127 54 81 -102
1751 -102 20 -23 -8 230 49 102 152 -115 97 84 112 67 -246 -36 259 152 -187 -306 137 322 -157 -4
1773 -4 -34 -73 50 64 -203 3 179 -120 2 92 -172 -114 -124 -153 325 129 -68 10 -275 33 -19 -4 -146 18
1797 18 -167 -99 2 179 540 68 -77 96 134 -98 83 -89 -102 -94 118 -150 2 -19 -125 -91 -201 -50 -320
1820 -320 -11 -56 138 -172 277 -134 275 34 122 247 -319 -5 62 -395 -51 100 13 -16 -132 -12 -103 -148
1842 -148 -44 122 -353 251 313 139 182 320 -152 -154 165 5 42 127 145 287 -138 -225 -126 -24 169 55 9
1865 9 -91 -42 16 -56 179 -93 367 -241 89 -124 -358 57 -135 -352 -41 -135 -2 110 109 -12 14 -139 60
1888 60 -34 132 -33 203 96 136 127 -70 -51 -106 -106 16 100 -157 -115 -165 312 209 -185 32 128 5 -36 25 71
1913 71 -65 -28 -147 214 120 72 -74 -217 -82 -143 -114 28 37 201 -261 158 268 218 -280 -46 36 165 -52
1936 -52 -59 -215 219 -16 7 68 -160 -130 33 81 -169 -313 -273 -54 238 -282 9 105 6 145 -42 236 -75
1959 -75 -37 276 35 -141 -214 16 13 48 -31 163 13 49 5 -73 125 -24 6 71 116 71 -195 231 119 30 168
1984 168 91 34 133 90 229 -175 -55 -216 93 -146 34 -79 -23 218 -26 -29 -59 208 -101 90 -275 35 54
2007 54 -101 -45 135 458 75 -35 44 -102 74 25 -188 -205 -71 -167 65 95 33 -37 35 -343 147 153 209 -6
2031 -6 -116 106 262 -114 -284 -219 -136 -335 -205 -163 55 -117 -101 -37 184 92 -116 130 138 297 249 -97 100 -47
2055 -47 -18 -103 -71 24 -122 -223 -73 -44 -169 99 -64 241 219 -315 72 5 -111 -49 131 20 31 59 -33 35
2079 35 -93 -189 40 165 -92 -151 56 -173 -449 -237 12 275 -118 125 219 314 68 74 -262 -282 54 41 -11
2102 -11 245 -17 -135 133 46 20 -82 -54 34 74 -127 59 49 182 175 53 -48 9 141 -174 16 11 57 -205
2126 -205 136 -170 249 -151 -115 -113 3 -59 -52 -34 -101 262 82 10 -118 -38 159 67 -312 7 -218 -319 -76 131
2150 131 76 -92 -147 32 -172 -111 134 -49 -175 151 -225 -195 215 -37 -102 -38 -57 -32 247 90 21 13 66 98
2174 98 -244 -167 -96 47 109 22 144 -159 89 145 15 205 38 42 224 -44 -93 -221 -416 -182 235 -132 -207
2197 -207 82 -162 -170 -57 -169 -305 101 185 150 79 -1 12 73 60 -154 -217 -44 -163 287 130 63 37 -71 -7
2221 -7 -112 -136 -169 7 -124 -16 152 123 322 101 -169 185 -227 62 -58 -91 207 15 -122 -265 -242 -55
2243 -55 -56 -159 179 75 49 105 52 11 44 157 2 -235 -92 133 -39 -23 74 -157 -268 -151 39 -24 116 -157
2267 -157 110 251 -8 260 74 0 159 69 -52 182 60 48 -89 285 -154 -293 111 -89 64 201 -95
2288 -95 -166 -125 100 -141 -61 -110 -41 -75 40 17 -70 31 -101 141 -92 202 71 -310 -43 -221 60 -8 140
2311 140 61 -231 58 -39 199 343 104 68 -307 249 -73 17 148 127 40 21 -68 -171 -49 60 12 -32 -8 -296
2335 -296 102 -85 -81 -316 -57 159 -56 100 211 195 258 -11 -68 -116 34 188 -190 151 -102 -264 -62 -35
2357 -35 -174 285 91 201 142 177 276 185 85 -46 188 -49 152 38 16 -63 -162 -155 -231 -31 161 -51 3 -38
2381 -38 196 124 180 174 201 95 27 -2 -235 134 -31 420 278 82 97 -356 -13 34 35 57 96 -149 -164 103 -224
2406 -224 375 212 71 115 -327 -17 -161 -369 5 -433 147 -31 -113 229 -114 89 294 25 115 133 90 -51
2428 -51 105 12 -219 -107 89 -230 -251 148 94 -89 -31 -264 -132 116 21 304 118 157 -25 80 93 227 287
2451 287 -162 -33 204 223 -57 209 19 -94 -51 -76 -51 115 20 -91 -114 -278 -148 -217 -12 -188 -147 71 -135
2474 -135 -42 101 70 -239 -129 -116 -177 212 -32 170 5 50 -39 100 26 -16 -85 -233 -20 22 -110 42 -6 96
2498 96 23 -157 151 -52 -69 255 -37 -70 73 -264 -377 -33 -341 37 -170 164 40 104 -44 130 19 57
2520 57 -53 85 -71 151 152 140 -53 -235 13 -150 -53 -56 -193 -103 -91 210 113 45 176 -101 -22 -193 162 -123
2544 -123 -49 -101 113 -19 -142 -141 -177 -55 104 3 -203 -46 -92 -19 -165 44 -44 94 233 42 134 -29 -165
2567 -165 -90 -17 -69 50 186 -5 -9 -22 -260 -135 -266 22 110 -67 126 99 69 87 154 -78 94 -165 -12 124
2591 124 -4 -51 -129 -206 -94 27 -235 119 -128 45 253 20 166 112 124 -38 -92 193 93 292 115 -99
2613 -99 168 73 35 -20 -161 -138 -108 -120 -135 1 -130 -76 -35 -70 68 -81 134 332 104 88 23 -200 5 -98
2637 -98 10 -205 -1 233 22 -109 44 32 -192 -6 230 -50 179 268 167 -128 -230 120 -136 -168 111
2658 111 -101 -39 -230 44 -102 -144 -286 64 62 83 -22 -7 112 176 -105 240 68 -19 119 107 193 31 26 -10
2682 -10 66 -50 -126 241 -231 66 141 153 59 -121 49 -131 144 127 -11 -16 6 36 52 -130 121 -11 -11 1 -115
2707 -115 -178 -149 -40 96 41 -257 207 27 -144 61 84 103 62 -102 -21 -133 -3 -29 -281 137 8 175 -110
2730 -110 -80 -81 80 263 192 164 -142 -85 -56 69 57 258 -104 -206 76 94 -98 -92 62 -308 21 22 -123 -67 -6
2755 -6 -37 8 32 124 -97 64 -502 17 90 -5 188 7 190 81 18 -157 -117 -148 -133 -99 -25 -297 -45 -118 60
2780 60 -121 7 110 364 235 -43 42 177 212 -233 111 -171 16 -123 199 -1 -41 199 -91 174 -1
2801 -1 -171 -106 -116 92 -1 101 247 -95 -250 -343 84 17 213 76 126 -219 -218 -50 -38 -42 219 103 152 -137 290
2826 290 38 -2 -76 161 36 -233 135 61 22 -192 77 -113 -156 9 -112 40 177 -296 43 -1 -19 -184
2848 -184 239 57 -80 -253 -30 -93 -41 82 -189 67 46 -1 29 60 -123 107 -32 -147 -271 142 -222 201
2870 201 84 -212 58 16 -94 -105 151 -69 186 331 30 -99 121 103 51 -73 -46 -10 99 -115 113 -47
2892 -47 37 -89 136 -88 -143 117 -235 -129 -117 -252 -198 -205 320 -64 -44 -96 122 170 -152 9 140 -281 -103
2915 -103 -112 7 267 82 34 -130 -23 -158 -13 -149 -70 -151 15 -65 -266 120 -99 129 -67 -204 -51 80
2937 80 -254 -28 7 -61 -106 137 -158 77 -72 -309 24 82 181 20 179 -136 260 -210 -104 28 -27 13 103
2960 103 -29 -70 -157 17 -140 -32 147 -290 155 143 86 251 -30 -102 144 174 33 -49 18 24 127 197 -53 -175
2984 -175 -65 -57 47 194 -147 84 184 -35 -86 -95 0 22 106 21 -11 64 155 -37 -31 -150 24 8 21 21 -60 166
3010 166 171 127 9 -106 118 297 3 157 -166 115 -246 -175 -156 -10 -147 -95 25 -111 -171 -76 -85 52 98 7
3034 7 445 189 87 -73 -40 71 -90 -207 76 -111 -123 88 -119 -71 13 -142 -79 -8 -40 -71 -74 -261 -13 54
3058 54 -103 83 -171 -102 97 -359 90 -52 -128 -41 36 -168 -18 -58 136 16 196 93 244 -59 210 -91
3080 -91 103 -271 53 90 104 352 -49 -40 484 201 -103 -81 -279 127 257 -70 -235 -148 13 49 181 60 35
3103 35 75 239 147 5 -61 -88 -35 1 87 3 -49 -279 109 -206 133 -191 6 -69 -69 232 79 113 237 227 310
3128 310 193 -6 158 40 -207 315 -207 -165 -223 -166 -98 158 114 -13 50 18 401 138 118 88 -66 -18 93
3151 93 67 -52 -114 -127 -154 185 96 -20 -232 -217 119 -51 118 -201 -51 -62 -246 57 -131 -39 37 -48 -34 143
3175 143 -149 -98 153 -42 227 102 -130 -95 -23 -198 -138 -52 38 -79 -274 92 -65 -183 -85 -384 9 -109
3197 -109 -49 -1 202 144 -19 28 -9 -176 -136 272 -59 -12 -136 -32 216 -194 62 431 53 -212 -74 -100 -27
3220 -27 212 -102 -26 -47 377 152 159 -5 106 -240 14 284 -45 194 33 -90 208 75 -24 65 -93 -58 188
3243 188 -164 -144 -95 -65 159 76 -102 -176 91 56 55 169 -108 28 51 225 -36 185 -228 117 -73 145 180
3266 180 208 173 -252 45 182 170 82 -122 97 40 -188 -58 126 67 -14 3 105 -79 -12 267 -142 58 2
3289 2 288 78 -103 -74 265 223 -9 76 -111 238 233 322 45 -55 74 172 8 50 -395 -46 -92 6 -185 -55
3313 -55 247 117 100 60 -63 95 -4 229 -171 -9 142 116 209 45 -129 -265 94 91 -52 -204 66 -124 -33
3336 -33 -57 123 -38 -194 -75 87 -1 85 -16 -46 8 49 -159 101 7 -15 -120 43 -35 -118 140 -43 1 -114
3360 -114 -51 -246 142 150 -126 131 83 65 250 165 -23 -137 -191 81 189 244 113 212 -183 130 136 -36 -129 89
3384 89 257 -62 127 -172 -177 127 -11 142 117 78 70 89 -280 -259 217 -40 -148 143 181 102 -19 -198 -204 28
3408 28 13 278 -88 56 -10 -194 134 -147 -155 70 -9 246 101 61 288 -86 151 59 36 131 2 -37 163 135
3432 135 -13 169 317 86 32 -320 -141 -151 -19 -276 95 -122 150 104 -175 24 -181 -225 -379 -169 79
3453 79 21 -139 -235 -78 275 -133 183 58 -52 -160 -17 25 256 -183 -237 -78 -216 205 -41 -51 -300 -208
3475 -208 277 79 -1 -186 -503 75 -148 -53 -37 7 229 19 -34 248 -76 68 36 -151 -47 -34 -10 169 -163
3498 -163 -36 4 -325 111 235 -335 59 52 202 132 163 22 -85 -27 278 -135 93 -127 -345 -80 96 60
3520 60 -39 -9 8 -50 -14 4 273 85 1 -8 32 35 -286 110 -2 -101 1 -96 -246 117 -266 245 -84 -285 -246
3545 -246 45 144 146 457 109 86 57 33 2 69 -132 147 -43 -255 103 113 -125 243 87 -44 143 53 189
3568 189 35 149 -128 -150 -6 -54 25 -303 83 296 99 238 83 -50 -106 -186 -100 124 -289 160 17 -147
3590 -147 217 -30 24 380 -147 -76 457 25 -115 9 -17 54 70 -62 87 -187 -58 -3 -126 275 40 182
3612 182 64 154 -163 -43 168 -28 8 -66 -156 -306 -142 17 -65 -326 -243 -34 49 52 148 1 114 -114 -137 -39
3636 -39 -174 32 2 24 -59 107 194 119 73 -34 -77 14 141 -362 53 160 39 65 -7 50 -111 38 201 -39
3660 -39 37 -182 172 -34 -55 -49 40 111 200 77 25 139 229 -103 54 115 5 -37 68 114 39 39 116 3 -107 -19
3686 -19 92 41 -79 -60 -205 17 127 -161 -95 286 -6 37 74 14 -153 250 -298 -129 35 -254 356 102
3708 102 -42 -12 -232 -61 -136 29 -18 -180 -76 129 30 169 192 84 305 80 73 -64 -90 -76 -77 66 146 -186
3732 -186 -73 -34 -253 150 27 -70 -92 -67 -191 8 180 33 21 4 -88 -242 6 248 95 195 -186 -50
3754 -50 -11 25 -36 58 -40 -129 -79 137 441 148 -1 123 74 173 4 193 -131 213 -27 150 -11 -5 163 -55
3778 -55 311 56 28 262 -135 19 100 153 95 108 25 54 4 17 -279 194 -44 181 -75 -139 217 -14 -279 -38
3802 -38 70 407 234 -84 5 92 41 -6 97 176 86 113 368 -11 -142 98 135 -216 93 135 -125 -268 157
3825 157 -198 151 155 108 -212 -212 -41 44 389 -148 135 -26 -174 -92 -294 -123 10 18 -92 238 189 189 114 171 -67
3850 -67 -28 89 -307 -63 -239 -81 -60 -91 136 -41 144 -76 118 -28 17 -87 -40 -38 -34 -94 -110 -24 -229 31
3874 31 -140 -41 -123 -366 150 25 -95 88 323 -23 -183 312 -70 -135 -183 -61 -186 -94 300 -8 -50 281
3896 281 96 86 175 168 110 14 17 -169 74 131 -193 287 -223 287 14 103 138 143 -305 -35 228 -229 70 -213
3920 -213 74 125 164 -135 77 -233 -215 131 -2 169 -25 13 321 27 -54 -150 -222 -110 15 27 -155 41 -134
3943 -134 90 414 -42 -18 114 293 46 -134 25 7 -41 -104 386 -21 -345 34 250 200 208 97 58 -171 -63
3966 -63 -107 -318 271 64 35 57 -135 -50 -52 -254 84 46 -67 -15 -159 -154 110 62 -51 134 -132 23 22 61 -34
3991 -34 -106 14 111 121 -47 -131 65 270 117 62 224 -41 -179 112 85 -117 -67 -69 -50 127 -49 2 -162 -24
4015 -24 232 299 71 231 104 105 -41 36 -101 -108 -114 -23 241 8 -76 -56 -92 -76 -176 -149 -60 -106 191 130 53 46 299
4042 299 28 -158 -68 100 146 73 158 369 -114 27 4 -138 113 -24 -205 256 -155 96 -257 71 17 99
4064 99 400 -32 -43 62 -256 -4 -138 32 101 261 -123 65 -202 -75 -82 -113 249 -42 16 159 154 143 -240
4087 -240 -49 181 -220 16 -5 -60 -210 -124 176 -110 -103 -135 78 -49 326 52 -26 134 -197 139 -78 82
4109 82 204 168 61 61 -117 -66 -38 -24 27 91 -291 140 -20 -121 180 51 -192 -126 -41 -217 87 97 -116 -175
4133 -175 -185 92 73 -12 161 -237 204 153 154 -37 14 174 1 -278 88 -19 222 -18 3 119 -73 168 -104
4156 -104 100 175 -173 50 -18 -45 -207 54 168 -22 133 332 41 18 147 -63 -51 -58 24 150 159 -115 3
4179 3 230 110 153 -185 -82 111 -18 -254 43 -118 -2 -132 -68 86 -224 198 -177 216 447 387 -173 -51
4201 -51 39 142 -210 -20 -37 -94 -103 -128 190 -257 -151 -65 -55 -232 -157 -113 -5 -36 -434 -235 224 255 81 196
4225 196 1 3 -12 114 -208 -167 49 -179 -336 64 -2 -105 112 -205 -42 144 -82 37 -166 -59 -179 -157
4247 -157 88 219 -174 -280 103 -129 62 -68 -77 -9 -178 17 -107 173 -78 100 -93 -107 19 -164 -126 -161
4269 -161 -53 33 -67 -70 -250 -48 -18 -82 -3 101 176 52 -8 66 -254 114 -165 -199 -14 -69 191 151 237 138 147
4294 147 13 -422 122 38 -95 -98 81 -33 181 251 -23 101 218 44 88 -109 -130 15 -229 -93 16 -73
4316 -73 -68 28 -69 76 21 -152 87 102 -154 102 -148 -111 -126 -21 41 49 61 108 -71 129 -44 10 -196 -231 -44
4341 -44 -71 -5 37 99 -241 83 -101 19 69 -57 122 16 120 66 -201 -182 -94 -187 -355 -225 -1 48 364 -46
4365 -46 -147 -239 -143 59 6 236 -147 85 149 -61 151 -41 -204 -35 271 -87 -69 127 117 -2 -137 147
4387 147 20 -116 -44 94 50 -304 54 24 261 -33 10 -163 107 47 -234 -140 -142 31 -121 40 -93 0 142
4410 142 -133 82 44 -269 3 -15 2 -56 -97 -90 17 -178 -53 65 -210 28 156 28 -73 -50 83 -135 180
4433 180 74 -271 -80 37 64 280 -139 -160 -17 18 3 245 -14 56 -42 -190 50 -238 -46 -23 72 -33 14
4456 14 -125 -305 -237 153 103 69 -183 157 -294 -148 36 161 -44 -78 -87 -332 87 118 111 -126 62 178 -240
4479 -240 32 232 278 24 477 19 207 -76 -198 -67 -196 -16 -120 -52 -73 -145 206 -74 114 -196 -174 -195
4501 -195 -52 20 -184 -37 28 92 -62 59 13 235 84 -141 -59 -29 -5 -52 -236 199 -14 -94 -187 58 22 -61
4525 -61 -342 -102 159 -124 76 -4 -195 -97 -20 -15 -131 -193 78 130 130 -98 32 -144 267 -19 19 145 -135 140
4549 140 -27 260 53 115 -193 260 -99 206 88 211 -35 -115 -79 -73 -137 -36 113 -43 -132 221 184 -74 -50
4572 -50 7 -265 -16 42 296 -160 -39 -54 -26 39 -38 44 -103 -72 -94 -107 -133 -2 196 -17 -198 92 184 89 -16
4597 -16 -27 23 175 224 -131 -99 52 -22 -29 35 45 -157 52 -187 -87 125 57 -18 79 -234 19 44 273 -510 140
4622 140 118 209 -127 -30 34 18 -205 54 147 -45 -63 44 323 41 96 46 -62 46 58 24 220 21 344 14
4646 14 172 -71 71 -316 214 14 10 155 13 118 -88 -234 -56 93 -215 -193 -103 123 -89 -14 -51 -21 -23
4669 -23 -77 59 136 -134 -249 6 -116 -221 -122 177 -80 -264 -24 -128 -11 -127 -230 -72 -67 -258 217 -68
4691 -68 -14 -118 -116 -196 -132 -137 -33 171 -193 -180 118 -137 40 77 -105 141 83 217 174 88 29 188 -216 -25 216
4716 216 62 -242 -65 103 -98 151 180 -73 93 -155 -117 -31 -63 119 -5 -31 137 -11 -10 -97 102 123 102
4739 102 55 51 137 -164 -85 161 124 43 -143 -179 332 244 -64 -65 13 142 129 105 -1 -174 -258 274 -265 206 23
4764 23 -34 119 -258 -231 -74 -33 -124 -286 -118 114 46 -227 56 -120 -26 44 93 135 -95 56 228 -3 25 196
4788 196 170 98 128 -7 -153 -128 -23 136 -63 122 46 -81 342 -163 54 79 -10 88 -169 153 65 47 -161
4811 -161 57 76 -94 -84 -199 4 -67 191 29 200 262 -110 171 304 -76 219 11 -10 -252 377 245 -71
4833 -71 -153 -79 -136 231 -183 18 -152 64 -271 -17 168 0 -139 141 -103 -138 35 -192 -69 -149 -26 7
4855 7 4 -134 24 -126 112 -283 -232 -14 53 -179 95 -145 28 153 -36 -38 332 -61 -37 205 26 -57 175
4878 175 -101 -95 109 170 -216 139 -252 -131 30 -41 60 -122 14 10 -29 -80 -117 -105 37 -69 39 55 -74 44
4902 44 -73 -113 -401 -145 116 -99 454 11 91 76 78 108 185 74 158 136 -98 -104 -29 -117 -68 67 163 -253 170
4927 170 -264 -70 -45 44 81 318 358 -155 42 -21 -67 -63 -129 78 164 74 -37 91 -111 -169 -174 -30 28 177 27
4952 27 353 -129 174 -51 16 -69 -94 -99 -115 96 228 -21 -36 -43 -370 -46 -162 18 -135 -309 134 36 163 -225
4976 -225 -186 19 -211 146 146 -19 2 101 -185 360 -86 -31 98 -13 75 63 4 -175 189 97 -176 30 -149
4999 -149 60 4 -21 -105 30 -224 -72 -21 72 -287 -427 -68 -141 124 3 -4 58 -32 137 164 -249 -217 150 126
5023 126 -45 -141 -204 176 31 70 -73 -138 182 -165 85 187 -162 40 8 -169 -143 -123 -91 -46 -63 -203 -136 -2
5047 -2 -112 18 33 69 -43 -65 -33 30 -123 37 -146 -54 7 101 110 28 45 -205 -141 35 -13 -122 -3 -197 55
5072 55 86 106 -189 151 146 184 284 -23 187 115 -77 -92 71 42 -247 21 157 110 -468 -288 -24 -49 182 -68
5096 -68 -128 261 -50 -154 -76 106 152 -29 16 128 -83 -159 -215 -359 55 -130 53 -99 -450 -84 -93 -52 89
5119 89 101 -13 148 -244 82 -2 145 158 141 -82 -2 -115 145 -103 -16 25 28 -36 12 170 12 -113 -156 2
5143 2 103 -59 -58 -17 -132 293 74 -14 -87 -199 -138 207 296 21 66 68 22 -249 99 444 -225 25 293 75
5167 75 66 -5 27 77 -107 111 224 -127 -7 143 161 -60 -34 -166 -186 -152 184 -177 -38 82 270 112 -270
5190 -270 -54 90 -71 8 232 266 -55 169 44 -22 -136 128 167 302 -90 -164 26 -181 79 -80 10 -255
5212 -255 38 -41 278 -48 54 -200 -52 31 -56 -112 -98 163 -139 -7 -69 -21 -23 120 285 -189 -422 -80 113
5235 113 -141 -184 -213 -145 -193 23 134 13 54 177 -66 -33 152 -81 57 -167 -94 342 -296 54 163 67 -35
5258 -35 79 58 177 373 23 -90 -72 254 137 51 -167 -126 -167 99 -98 -27 -1 -36 56 -60 172 70 -137
5281 -137 -121 -179 268 28 249 152 227 208 -356 -218 -152 47 307 -135 230 38 12 -273 -263 -201 281 225 219 31
5305 31 109 -137 -9 -112 55 114 187 -164 -177 -35 -141 2 172 -307 81 -201 106 -17 -16 157 -76 -7 102
5328 102 -175 -4 86 -207 -85 106 37 -129 96 219 134 172 1 14 59 -77 -18 -123 252 239 85 -77 -13
5351 -13 -48 147 23 16 81 -95 129 106 -146 -112 190 6 20 28 95 129 -296 199 58 126 -21 41 -362 -275 187
5376 187 -42 -269 194 -109 7 26 205 -40 6 -123 -229 -331 37 -72 73 146 232 -251 187 -207 -192 151
5398 151 60 18 27 -143 -147 -315 162 51 -21 124 -78 172 311 -36 -112 56 504 130 4 13 -123 -129 -18 -24 111
5423 111 -97 0 31 39 -30 -164 20 208 111 -98 -219 -8 87 77 114 -234 22 105 65 -237 28 -192 -82 -124
5447 -124 -100 -48 -152 -113 124 20 4 -77 -87 43 59 -22 146 43 151 137 67 186 226 9 193 61 132 -259
5471 -259 -108 -147 -109 56 -107 -78 3 66 150 57 106 9 69 35 307 140 -124 -67 117 140 -120 50 104 184 345
5496 345 136 175 -69 -97 29 -101 86 -80 108 122 139 189 -19 15 13 191 -17 85 289 149 -82 -19 -101
5519 -101 -91 78 -103 118 77 -13 -145 -299 -185 269 218 -169 113 141 350 -45 200 -11 -6 -69 -176 128 115
5542 115 21 52 106 -529 -1 6 -71 88 -157 -27 187 52 -291 36 224 218 -283 236 -26 126 146 10 302
5565 302 -17 -136 -118 -96 -123 214 23 83 -124 121 -108 -11 48 -27 -274 36 178 92 -144 8 29 -209 153
5588 153 86 -160 172 301 10 -94 11 2 -69 -261 85 26 -198 -198 47 40 -7 260 131 37 -50 32 107 230 74
5613 74 35 -139 93 30 58 -283 141 -219 59 304 54 140 59 178 -242 150 8 -20 -32 110 140 235 -86
5636 -86 222 191 -194 -69 85 -132 79 77 -47 -179 341 -174 94 -121 -248 245 -18 165 -92 24 208
5657 208 -93 29 -49 149 297 49 -127 105 232 -22 -21 315 51 26 184 11 129 -157 15 -224 45
5678 45 -167 -37 182 -321 -113 -75 43 -7 -214 40 -91 39 65 -257 -8 -228 21 133 -36 -35 -8 -181
5700 -181 133 -41 -39 20 108 33 -10 91 -83 43 39 -182 -32 -17 -143 -97 -24 95 -236 -160 -65 -47 213 222 -125
5725 -125 -40 13 160 120 -147 -74 -264 107 -44 -23 -139 144 10 -287 -41 -164 253 -176 128 -23 90 -92
5747 -92 -10 -121 -139 -59 2 291 -75 52 -107 -164 227 11 -21 216 120 130 -78 267 -214 169 40 -54 93
5770 93 -192 80 -169 382 37 -128 -15 -290 63 202 -326 170 -37 -93 -13 -122 -170 30 166 403 315 57
5792 57 35 -166 -106 -114 -292 183 75 220 -117 -61 -123 -177 -110 39 -219 -122 -93 -161 95 136 -87 46 93 -251 -2
5817 -2 -392 -176 -134 -96 -41 94 151 -70 -152 185 -446 198 130 -97 49 -199 -3 270 -53 147 -78 71 -34
5840 -34 137 -107 -29 -152 115 -240 -154 -92 -71 -41 119 -42 -127 184 92 29 -35 32 275 76 -161 -98 38 -185
5864 -185 -185 -104 -167 123 -97 45 -51 293 13 162 217 181 134 111 -62 2 143 109 42 -236 40 -124 20 112
5888 112 151 -94 243 37 -135 -140 -6 -351 -97 62 21 -75 -111 -19 -245 -112 -212 86 -95 452 38 197
5910 197 192 -208 -147 73 -48 127 63 -94 64 81 -210 -48 -90 132 -38 -160 -185 35 135 -91 -157 -11 -114
5933 -114 95 167 413 11 -1 131 -138 41 -97 167 -288 118 -66 223 -96 20 -67 58 149 -219 103
5954 103 217 43 -76 -105 -44 55 -123 -167 228 -80 67 55 -58 319 220 14 -61 26 -11 66 107 295 95 -364
5978 -364 -128 276 -92 -253 -22 38 -21 10 -118 -134 171 -86 56 -99 100 10 -236 -3 -183 -143 -233 89
6000 89 235 -223 -44 -55 -72 6 149 95 -166 -174 -287 -103 -10 234 -76 -49 206 -178 -245 69 -27 -106 -43 147
6024 147 -11 80 -144 90 93 240 -204 94 -8 -86 128 55 138 34 112 -193 -141 6 124 -72 -236 -138 -118
6047 -118 113 -293 -53 18 -85 0 -135 -4 -27 -16 103 -203 -178 108 -260 -197 -189 -28 -84 338 -21 197 -270
6070 -270 105 -178 143 -127 -8 45 -126 250 126 -247 -159 403 37 -95 -7 35 -148 -34 -90 -120 159 -233
6092 -233 -34 18 -174 -14 329 165 -53 -36 -101 23 144 -58 221 -73 150 209 73 -50 365 76 -213
6113 -213 85 44 29 212 98 -71 44 -156 -54 240 2 19 -115 160 69 123 21 198 278 -77 -118 -3
6135 -3 -8 -99 -32 280 -2 -180 54 7 -106 0 20 61 -202 -2 -62 11 33 -183 -123 95 -92 125 84 -170 165
6160 165 211 -134 -165 -15 152 36 258 345 -28 1 -187 -91 -27 -126 109 24 -220 35 206 -80 25 -53 -12
6183 -12 11 104 -65 338 309 1 107 -227 -94 263 -92 64 114 127 -75 -72 62 -70 65 -232 249 -222 -146
6206 -146 -240 34 -323 81 133 -153 -68 -181 -102 49 53 161 20 189 211 95 163 33 282 -181 -284 -175 -63
6229 -63 331 153 206 105 -78 87 100 -110 -34 -129 -65 -109 -23 -204 -161 145 -340 -43 -151 -237 -413 43 278
6252 278 3 -211 181 -36 -215 -118 -245 -11 403 -176 77 5 143 -22 105 -76 106 101 76 37 190 2
6274 2 291 34 -184 -202 -224 49 187 272 -207 98 30 97 -138 100 -77 230 0 -99 42 13 -89 74 -86
6297 -86 82 140 -122 10 -125 100 17 190 -46 51 101 218 -36 79 185 -118 5 -49 -87 -148 -234 126 -62
6320 -62 -163 202 133 88 -306 80 -28 -65 -165 95 -143 52 70 15 -217 141 -62 90 -279 -199 121 50 40
6343 40 -75 -122 -13 -189 -122 115 65 17 39 -101 28 107 34 -59 67 142 261 210 -9 128 152 146 -141 -159 -195
6368 -195 -22 -104 -20 32 43 23 -141 -23 -37 131 -153 174 -7 -19 -131 362 155 109 -7 -167 -7 -30 -98
6391 -98 -46 93 -277 98 43 -215 29 2 -102 117 8 -112 106 -15 38 -105 239 46 156 -212 2 78
6413 78 -85 19 -218 176 54 216 2 186 -121 -275 63 6 73 98 42 -29 -10 -62 71 229 -240 -318 -73
6436 -73 110 -63 69 -11 223 87 -46 144 76 88 -328 52 -101 -136 147 -82 -85 -218 -174 45 -96 130 354
6459 354 119 -28 83 164 -30 -78 -1 22 -42 88 65 223 100 -57 89 -142 141 -40 -45 113 -75 211 -72
6482 -72 -71 17 -46 61 70 -31 -104 123 -112 -221 32 54 118 -118 176 157 -84 244 178 -154 4 58 -328 55
6506 55 135 -95 -51 103 256 191 180 71 61 -48 134 -70 12 -35 -203 -7 -77 125 157 -142 136 36 -209
6529 -209 -260 21 -167 -50 22 49 -141 -68 54 -156 176 -130 26 -74 141 33 -11 133 -65 -197 -14 -54
6551 -54 -145 -188 32 -120 -116 -120 218 -196 -311 52 41 -34 76 -231 208 67 -25 299 27 -231 -146 228 -97 -155
6575 -155 176 214 158 124 -311 -8 -15 -83 -36 -47 266 -101 -153 89 -103 -31 -130 150 -2 159 -13 165 -1 127
6599 127 -131 146 295 -13 -187 264 -142 7 17 122 143 -53 34 36 -20 88 25 -172 90 64 126 -99 -48
6622 -48 33 -322 28 80 13 -79 -36 174 -208 231 -147 85 169 -182 -98 345 34 -98 -92 82 129 79 -219 79
6646 79 -172 163 -54 148 129 50 55 128 99 10 52 -39 -247 -342 -30 211 4 -134 -69 -194 -58 64 35 -70
6670 -70 108 -161 102 49 128 -114 -173 -52 -46 169 42 209 -47 95 -42 430 235 49 -100 -105 -44 -98 215
6693 215 118 -9 -206 279 -158 -37 -55 -217 205 31 116 -44 -194 -112 -519 -282 -222 81 224 -48 -79 33
6715 33 36 -194 30 167 176 31 143 -146 -144 97 -52 -43 56 208 -95 -39 148 -36 -16 236 -168 -116 162 124 -4
6740 -4 -279 85 -84 48 193 37 -56 -31 1 122 -19 181 -17 83 153 -102 -68 124 -199 -120 -248 42 -47
6763 -47 261 -56 -47 -76 -114 28 -234 -56 100 -11 -282 3 112 89 -179 231 -253 -187 -14 176 -187 54
6785 54 -151 -171 296 -12 -48 -214 -22 152 190 -139 -51 -98 -59 -37 -453 -177 -92 100 94 85 -31 -143 -101 182 -132
6810 -132 -83 125 66 6 121 32 -287 -3 58 10 33 160 -9 78 10 9 34 273 75 53 328 -70 -163 -5 156
6835 156 -299 44 1 312 150 0 -32 -60 -66 12 -143 -156 122 -88 -212 148 144 -262 24 69 -165 -44 82
6858 82 -177 -72 -178 138 -157 47 289 -126 11 -115 213 87 -232 140 -64 -79 66 -70 -271 -239 79
6879 79 -64 111 57 -290 39 -70 -71 -5 258 -59 -76 -20 199 188 181 -239 -8 173 79 195 10 164 120 190
6903 190 -73 121 -11 -110 -198 41 26 168 -168 -25 76 -139 146 -61 -33 -24 38 -98 114 191 18 327 -86
6926 -86 165 98 238 166 -41 21 8 -177 187 -10 -8 -83 169 196 66 -155 199 25 -215 -90 -39 -85 -207 118
6950 118 381 -21 164 -64 -32 62 -21 374 -31 88 125 41 51 111 249 -93 -105 77 205 14 -9 -47 -295
6973 -295 22 -105 150 43 8 218 -288 -78 -271 58 -181 -152 106 -243 184 -235 227 -89 -49 238 -117
6994 -117 -53 -37 225 -54 -156 128 -12 -59 -43 -113 -187 120 -271 -142 103 163 209 66 41 -13 106 -224 44
7017 44 -96 -167 -135 -117 -107 107 -269 243 -32 -117 -5 81 -19 67 43 -46 166 264 -88 6 12 81 46 54 -61 -6
7043 -6 -46 -125 43 284 52 -55 19 78 25 -82 78 -26 25 -119 -78 27 -178 -13 72 -147 77 80 -148 -103
7067 -103 300 23 176 -66 -212 -74 117 -73 -51 -63 182 33 -65 -76 4 -130 -10 -120 -5 77 -89 63
7089 63 91 -34 -72 -76 -181 -6 60 -294 -157 -424 -77 304 198 85 118 -77 -372 12 -274 -174 -17 -6 -291
7112 -291 -199 -30 90 84 6 1 198 236 -19 -100 -58 284 -55 170 -38 40 -227 -286 -40 113 -18 133 -229 302
7136 302 38 166 -309 46 63 -130 27 2 121 -19 -22 15 283 -141 42 129 -195 85 138 -162 -56 99
7158 99 -103 403 -16 241 -102 7 198 15 -266 191 18 -15 115 -262 -209 137 21 108 70 127 -82 12
7180 12 34 13 39 70 150 133 -37 34 -294 80 -148 69 60 -41 -127 147 42 -53 -140 192 -124 268 -42 -252
7204 -252 -59 -75 -123 21 16 -93 18 -85 -152 -125 -268 18 83 118 26 92 63 -4 138 -28 28 -9 -218 -133 63
7229 63 43 -17 -93 -155 76 38 45 34 201 210 -41 -51 159 252 -235 -505 -59 32 255 -115 -177 40 -29 -17 48 56 -201
7256 -201 70 -146 96 -24 306 -43 12 125 -25 -73 -79 59 22 30 364 -269 1 102 -43 112 251 99
7278 99 264 -179 66 -166 -229 13 96 -85 -57 -104 -40 94 75 87 -30 -126 -179 -164 167 -157 50 -62 66 60
7302 60 91 95 256 103 69 189 41 -230 -49 114 -73 163 -335 132 11 174 -194 152 33 18 -82 -156
7324 -156 -5 -33 126 5 -108 117 -25 35 55 -299 -55 160 68 62 55 0 -61 -10 123 102 -240 156 68 43 -65
7349 -65 -70 -109 -110 93 -102 -33 413 249 16 35 37 -72 129 11 55 138 -115 -46 -154 -93 18 -254 33 110 56
7374 56 42 78 117 -186 -92 12 108 -92 94 -121 62 -74 105 122 -101 69 -101 135 -155 75 142 24 110
7397 110 -164 -117 -119 104 237 78 28 -39 -154 147 -210 8 153 10 201 -19 35 -153 258 -184 41 4
7419 4 -5 -22 -7 -106 -308 -75 -11 73 34 145 -35 7 -398 2 -180 -133 123 42 -136 -123 -35 -74 -62 -60 89 -139
7445 -139 -371 66 -99 -3 -100 -5 54 338 -65 74 119 105 263 -296 -14 -62 -15 208 141 -119 -125 314 198 107
7469 107 39 123 -315 -74 -166 88 31 -74 -95 120 97 -203 8 -16 -18 32 -80 -283 -70 -176 194 236 149 119
7493 119 90 46 -13 -57 96 13 109 71 -83 -25 -34 -22 -20 83 165 1 -95 -36 69 14 2 -82 -60 -125 -70 -76 -231 284
7521 284 -127 91 179 139 69 -152 153 -114 -74 51 34 385 83 -88 12 114 249 140 185 -142 250 61
7543 61 -15 36 -11 47 239 81 -42 -173 21 39 99 178 223 91 258 96 -69 97 178 200 -81 58 -407 329
7567 329 -77 148 68 127 -95 196 97 404 -202 -280 142 -19 311 -349 -116 -126 -26 38 108 38 85 -169 160
7590 160 25 20 74 -48 45 179 78 -66 13 249 137 -218 -280 45 52 -24 6 50 -14 -13 75 253 424 -231 -105
7615 -105 167 123 301 165 14 74 41 38 -83 119 35 -30 -15 -48 153 4 -123 24 19 328 -13 -106 179 237
7639 237 121 67 16 184 20 57 80 -133 -141 7 -31 -30 -65 114 -84 90 229 10 -87 -118 37 -144 75 26
7663 26 136 204 68 153 -155 39 2 -168 9 -128 -32 -215 -243 33 87 283 -153 -249 -23 -75 -193 -1 57
7686 57 -134 -52 -46 128 -71 -137 -95 -28 48 -10 138 -95 -43 -80 -227 -150 232 205 25 90 -185 46 52 -63 96
7711 96 54 3 -14 89 2 2 -20 126 182 14 -93 -72 -45 -49 -54 134 186 -15 438 138 -277 267 -89 101 39 -223
7737 -223 135 -41 -43 -86 50 -20 -88 -245 154 35 -23 -74 116 -144 -61 182 -8 153 -142 -348 136 -283 -122
7760 -122 202 -44 171 26 29 120 -57 208 -141 -218 -103 43 77 -170 229 -50 -37 -33 -155 148 108 78 219
7783 219 63 -75 68 -104 62 76 83 -30 166 58 -66 -5 143 182 147 179 34 340 164 27 -124 108
7805 108 111 -119 -180 70 -193 7 226 113 52 269 23 -22 96 207 121 123 -136 -18 -206 -279 207 -28 51
7828 51 -87 140 3 17 -115 38 -44 44 -78 -284 -82 105 -113 -143 -170 29 -324 -17 -178 -1 -102 -117
7850 -117 -113 -170 -273 239 -52 -17 191 72 142 -153 -150 -83 35 107 65 -93 -58 3 391 72 101 -86 44 217
7874 217 35 346 -100 -113 68 136 57 243 -25 -181 81 -98 21 -73 16 -151 -75 -46 75 109 -14 -131 116
7897 116 -114 -82 -284 -89 -150 -189 -69 161 270 -335 -98 -148 -114 -66 -6 -231 244 -75 248 -237 -116 212
7919 212 278 -115 -112 32 124 326 -81 99 -115 257 -321 -37 -78 96 -287 153 77 -14 -152 221 269 -37 28
7942 28 72 2 -11 -111 -23 -461 -81 107 196 119 -139 12 54 -61 -178 -239 -111 26 -237 43 -242 -7 -132
7965 -132 205 99 56 145 0 147 -16 9 -82 -90 142 -36 138 -46 82 -14 111 9 18 -19 153 57 -3 11
7989 11 -258 74 -110 242 83 119 47 6 -227 -9 -221 -134 178 -15 4 25 94 146 24 -56 -70 -88 3 69 91
8014 91 -57 192 22 138 -3 262 -187 -4 -83 -100 115 270 -142 249 0 45 -135 56 -92 52 -22 15
8036 15 144 37 60 -56 -53 35 20 3 -45 -169 -295 -83 -83 -70 102 -191 14 -103 92 -51 -79 -140 -56 338 -2
8061 -2 -2 116 -370 -304 123 -127 -151 -90 142 236 10 79 158 83 192 -108 -221 180 122 289 65 -114 73 -190
8085 -190 -67 4 219 137 62 -39 -225 49 -161 -20 63 126 72 -66 155 -80 -78 152 -179 72 -151 32 -245
8108 -245 90 -14 43 50 -32 79 49 110 46 -124 155 23 161 -40 297 -3 147 -229 191 -9 -46 229 -32
8131 -32 41 -313 125 153 8 -36 -33 -291 165 168 1 -45 116 189 19 138 130 -16 30 -292 -15 172 -303 301
8155 301 -55 -241 -253 323 -124 0 -23 -58 42 -273 -37 -29 -30 69 89 7 -30 -144 66 -176 -233 -65 5 -73 -66
8180 -66 201 -70 -60 245 66 -106 -359 100 13 113 -207
8191b07
##END NTUPLES=NMR FID
##END=
