##TITLE=1H_DE-02_TFA
 200.13MHz, CDCl3,
 8 sc
 
 28.4.2025
##JCAMPDX= 6.0         $$ Bruker NMR JCAMP-DX V2.0
##DATA TYPE= NMR FID
##DATA CLASS= NTUPLES
##ORIGIN= UXNMR, Bruker Analytische Messtechnik GmbH
##OWNER= pz
$$ XWIN-NMR		Version 3.5
$$ Mon Apr 28 15:40:52 2025 Russian Standard Time (UT+4h)  she@DPX200
##.OBSERVE FREQUENCY= 200.1313
##.OBSERVE NUCLEUS= ^1H
##.DELAY= (6, 6)
##.ACQUISITION MODE= SIMULTANEOUS
##.ACQUISITION SCHEME= undefined
##.AVERAGES= 8
##.DIGITISER RES= 18
##SPECTROMETER/DATA SYSTEM= spect
##.PULSE SEQUENCE= zg30
##.SOLVENT NAME= CDCl3
##.SHIFT REFERENCE= (INTERNAL, CDCl3, 0, 14.3821)
##AUDIT TRAIL= $$ (NUMBER, WHEN, WHO, WHERE, WHAT)
$$ ##TITLE= Audit trail, XWIN-NMR		Version 3.5
$$ ##JCAMPDX= 5.01
$$ ##ORIGIN= Bruker BioSpin GmbH
$$ ##OWNER= she
$$ F:/spectra/data/she/nmr/H-C/1/audita.txt
$$ ##AUDIT TRAIL=  $$ (NUMBER, WHEN, WHO, WHERE, WHAT)
(   1,<2025-04-28 15:39:39.65 +0400>,<she>,<DPX200>,
      <created by zg, POWCHK disabled, PULCHK disabled
       configuration hash MD5:
       00 E9 B6 7A A2 85 ED C7 34 08 36 98 17 FE 4E 26
       data hash MD5: 16K
       9C BD 34 8B BE 90 EB E0 F7 8F 6B 41 48 3A A4 43>)
$$ ##END=
$$ 
$$ hash MD5
$$ 29 88 DE 7E E7 A2 8F 29 28 4D CE 57 DB 62 E6 6F
##$RELAX= 
##$RELAX= 
##$RELAX= 
##$RELAX= 
##$RELAX= 
##$RELAX= 
$$ Bruker specific parameters
$$ --------------------------
##$DU= <F:/spectra>
##$EXPNO= 1
##$NAME= <H-C>
##$PROCNO= 1
##$TYPE= <nmr>
##$USER= <she>
##$AMP= (0..31)
100 100 100 100 100 100 100 100 100 100 100 100 100 100 100 100 100 100 
100 100 100 100 100 100 100 100 100 100 100 100 100 100 
##$AQSEQ= 0
##$AQ_mod= 1
##$AUNM= <au_zg>
##$AUTOPOS= <>
##$BF1= 200.13
##$BF2= 200.13
##$BF3= 200.13
##$BF4= 200.13
##$BF5= 200.13
##$BF6= 200.13
##$BF7= 200.13
##$BF8= 200.13
##$BYTORDA= 1
##$CFDGTYP= 0
##$CFRGTYP= 5
##$CHEMSTR= <none>
##$CNST= (0..31)
1 1 145 1 1 1 1 1 1 1 1 1 1 1 1 1 1 1 1 1 1 1 1 1 1 1 1 1 1 1 1 1 
##$CPDPRG= <>
##$CPDPRG1= <>
##$CPDPRG2= <>
##$CPDPRG3= <>
##$CPDPRG4= <mlev>
##$CPDPRG5= <mlev>
##$CPDPRG6= <mlev>
##$CPDPRG7= <mlev>
##$CPDPRG8= <mlev>
##$CPDPRGB= <>
##$CPDPRGT= <>
##$D= (0..31)
0 0.7 0 0 0 0 0 0 0 0 0 0.03 0 0 0 0 0 0 0 0 0 0 0 0 0 0 0 0 0 0 0 0 
##$DATE= 1745840379
##$DBL= (0..7)
120 120 120 120 120 120 120 120 
##$DBP= (0..7)
150 150 150 150 150 150 150 150 
##$DBP07= 0
##$DBPNAM0= <>
##$DBPNAM1= <>
##$DBPNAM2= <>
##$DBPNAM3= <>
##$DBPNAM4= <>
##$DBPNAM5= <>
##$DBPNAM6= <>
##$DBPNAM7= <>
##$DBPOAL= (0..7)
0.5 0.5 0.5 0.5 0.5 0.5 0.5 0.5 
##$DBPOFFS= (0..7)
0 0 0 0 0 0 0 0 
##$DE= 6
##$DECBNUC= <off>
##$DECIM= 32
##$DECNUC= <off>
##$DECSTAT= 4
##$DIGMOD= 1
##$DIGTYP= 9
##$DL= (0..7)
0 120 120 120 120 120 120 120 
##$DP= (0..7)
150 150 150 150 150 150 150 150 
##$DP07= 0
##$DPNAME0= <>
##$DPNAME1= <>
##$DPNAME2= <>
##$DPNAME3= <>
##$DPNAME4= <>
##$DPNAME5= <>
##$DPNAME6= <>
##$DPNAME7= <>
##$DPOAL= (0..7)
0.5 0.5 0.5 0.5 0.5 0.5 0.5 0.5 
##$DPOFFS= (0..7)
0 0 0 0 0 0 0 0 
##$DQDMODE= 0
##$DR= 18
##$DS= 0
##$DSLIST= <SSSSSSSSSSSSSSS>
$$ [...]
##$SUBNAM0= <"">
##$SUBNAM1= <"">
##$SUBNAM2= <"">
##$SUBNAM3= <"">
##$SUBNAM4= <"">
##$SUBNAM5= <"">
##$SUBNAM6= <"">
##$SUBNAM7= <"">
##$SUBNAM8= <"">
##$SUBNAM9= <"">
##$SW= 18.0517328524113
##$SWIBOX= (0..15)
0 0 2 0 0 0 0 0 0 0 0 0 0 0 0 0 
##$SW_h= 3612.71676300578
##$TD= 16384
##$TD0= 1
##$TE= 0
##$TE2= 300
##$TE3= 300
##$TEG= 300
##$TL= (0..7)
0 120 120 120 120 120 120 120 
##$TP= (0..7)
150 150 150 150 150 150 150 150 
##$TP07= 0
##$TPNAME0= <>
##$TPNAME1= <>
##$TPNAME2= <>
##$TPNAME3= <>
##$TPNAME4= <>
##$TPNAME5= <>
##$TPNAME6= <>
##$TPNAME7= <>
##$TPOAL= (0..7)
0.5 0.5 0.5 0.5 0.5 0.5 0.5 0.5 
##$TPOFFS= (0..7)
0 0 0 0 0 0 0 0 
##$TUNHIN= 0
##$TUNHOUT= 0
##$TUNXOUT= 0
##$USERA1= <user>
##$USERA2= <user>
##$USERA3= <user>
##$USERA4= <user>
##$USERA5= <user>
##$V9= 5
##$VALIST= <valist>
##$VCLIST= <CCCCCCCCCCCCCCC>
##$VD= 0
##$VDLIST= <DDDDDDDDDDDDDDD>
##$VPLIST= <PPPPPPPPPPPPPPP>
##$VTLIST= <TTTTTTTTTTTTTTT>
##$WBST= 1024
##$WBSW= 4
##$XGAIN= (0..3)
0 0 0 0 
##$XL= 0
##$YL= 0
##$YMAX_a= 124648
##$YMIN_a= -109961
##$ZGOPTNS= <>
##$ZL1= 120
##$ZL2= 120
##$ZL3= 120
##$ZL4= 120
##$ABSF1= 10
##$ABSF2= 0
##$ABSG= 5
##$ABSL= 3
##$ALPHA= 0
##$AQORDER= 0
##$ASSFAC= 0
##$ASSFACI= 0
##$ASSFACX= 0
##$ASSWID= 0
##$AUNMP= <proc_1d>
##$AZFE= 0.1
##$AZFW= 0.1
##$BCFW= 1
##$BC_mod= 2
##$BYTORDP= 1
##$COROFFS= 0
##$CY= -3
##$DATMOD= 1
##$DC= 2
##$DFILT= <>
##$DTYPP= 0
##$F1P= 0
##$F2P= 0
##$FCOR= 0.5
##$FTSIZE= 0
##$FT_mod= 4
##$GAMMA= 1
##$GB= 0.15
##$INTBC= 1
##$INTSCL= 1
##$ISEN= 128
##$LB= 0.25
##$LEV0= 0
##$LPBIN= 0
##$MAXI= 10000
##$MC2= 0
##$MEAN= 0
##$ME_mod= 0
##$MI= 1.114404
##$NCOEF= 0
##$NC_proc= 0
##$NLEV= 6
##$NOISF1= 3.799351
##$NOISF2= 2.8
##$NSP= 1
##$NTH_PI= 0
##$NZP= 0
##$OFFSET= 14.38212
##$PC= 1
##$PHC0= -1191.055
##$PHC1= 24.39221
##$PH_mod= 1
##$PKNL= yes
##$PPARMOD= 0
##$PSCAL= 0
##$PSIGN= 0
##$REVERSE= no
##$SF= 200.129724274929
##$SI= 16384
##$SIGF1= 3
##$SIGF2= 2
##$SINO= 400
##$SIOLD= 16384
##$SREGLST= <1H.CDCl3>
##$SSB= 0
##$STSI= 0
##$STSR= 0
##$SW_p= 3205.1282051282
##$SYMM= 0
##$S_DEV= 0
##$TDeff= 0
##$TDoff= 0
##$TI= <>
##$TILT= no
##$TM1= 0
##$TM2= 0
##$TOPLEV= 0
##$USERP1= <user>
##$USERP2= <user>
##$USERP3= <user>
##$USERP4= <user>
##$USERP5= <user>
##$WDW= 1
##$XDIM= 8192
##$YMAX_p= 0
##$YMIN_p= 0
$$ End of Bruker specific parameters
$$ ---------------------------------
##NTUPLES= NMR FID
##VAR_NAME=  TIME,          FID/REAL,        FID/IMAG
##SYMBOL=    X,             R,               I
##VAR_TYPE=  INDEPENDENT,   DEPENDENT,       DEPENDENT
##VAR_FORM=  AFFN,          ASDF,            ASDF
##VAR_DIM=   8192,          8192,            8192
##UNITS=     SECONDS,       ARBITRARY UNITS, ARBITRARY UNITS
##FACTOR=    0.0002768,     1,               1
##FIRST=     0,             0,               0
##LAST=      2.2672688,     0,               0
##MIN=       0,             -109961,         0
##MAX=       2.2672688,     124648,          0
$$ Real data points
##PAGE= N=1
##DATA TABLE= (X++(R..R)), XYDATA
0@%%%%%%%%%%%%%%%%%%%lJ1j6J6j6J6j6K1k9L2l4M0m6N1n8O6p5Q5r4J05j18J31
41F9j45J61j79J96k16K40k64K90l20L52l89M30m74N24n80O44p16Q01r02J021j167
62f24J351j591J914k379L109m412P416k7280P258O2387o2909k0702J07489r43
76G0084j21244K9720J07151n2655j04456N4624O9734o7120n2738M9104L0012k0130
88g914k1262Q382M4509J1934m2080M741M4750j2976m3616Q416L1988j4837m0728
101b8693M136K8182l581k2925j001K6574J4204k4588q083L4690M421l1071K995
114d740K2745o700j7960J501J1273k582j2021n67Q259M122n572r470P837J2645
128H770q811r173J1667O872q208m548O861M621o354n917N608J606o020j443K481
$$ y = [0, 0, 0, 0, 0, 0, 0, 0, 0, 0, 0, 0, 0, 0, 0, 0, 0, 0, 0, 0, -3, 8, -8, 8, -8, 8, -8, 13, -16, 16, -18, 22, -24, 27, -31, 35, -40, 45, -49, 56, -62, 69, -76, 85, -94, 102, -114, 126, -138, 152, -168, 184, -205, 225, -249, 275, -305, 339, -377, 424, -478, 543, -624, 727, -864, 1050, -1329, 1780, -2632, 4784, -22496, -15238, 47149, -15760, -36462, 71027, 70084, -51160, -21440, 85711, 33056, -71400, -16776, 52958, -14162, -66900, -17796, 12216, -7914, -29176, -20794, 23715, 35649, -6431, -1690, 43060, 30084, -13532, -5116, 26872, 12035, -28693, -24557, 3625, 44, -22881, -23882, 2692, 16896, -7692, -15775, 18915, 23336, -7735, -4740, 18005, 11305, -6655, -5154, 6119, 3537, -8484, -9051, -792, 3330, -2242, -11712, -3875, 8770, -41, -9214, 2453, 9325, 1117, -3431, 3430, 8051, 1697, -4220, 1388, 2994, -3026, -4469, -1988]
143a988J375j767j834L454L112j817j068K427J119p6l025k98L081k116l760K069
159a112K285k598j467J782J782j192n86K065L65r62K77L0O4Pr70m25J194p87q95
178a143N09P64l10m10M17O04k26m12K86N55n82J94k57L40m37k70Q3L28l40R4L95
199A82k44J34nJ27J10j62J2J53j12m39n1M02l21J85l09j10O14k01j51K29R1l1
221A03J66p0M06n52J3M02m10n57M06n3m16J21j08M66O8k5K92J37M1J5j53n1K59
244E00j35m22K82l03n10M66j33K79k51o1M03K63m37K20N3k13J14j42R8M14m84
265Aj1l1K07j20k95l8L12q4k87J49J54j05K47j92L48k1q3n5K44k07M9k36k47q6
289c87J28K70k50M9L73l67K81j10P1j56J4L24k31j00J03j35P6j41J46j26L66k15
$$ y = [-1988, -613, -2380, -4214, -760, 2352, 535, -533, 1894, 3013, 2937, -88, -386, 2695, 579, -3181, -1112, 1173, -1425, -2892, -1110, 672, -520, -1106, 959, 1324, 362, 639, 669, 733, 740, -230, -655, 539, -248, -1143, -634, 130, -180, -590, -173, 431, 205, -207, 79, 634, 52, 246, -11, 329, -108, -378, -295, 33, -307, -213, 182, -62, 72, 67, 194, 304, 142, 154, 307, 195, -244, -295, 107, -214, -29, -338, -448, 166, -35, -186, 43, 134, 103, 269, 199, 605, 53, 66, 468, 58, -499, -93, -146, -562, -441, -549, -83, -15, -40, 252, 389, 430, 445, 292, 241, 500, 365, -57, 225, -78, -588, -122, -255, 24, -227, -288, 115, 378, -59, 161, 214, 1, 115, -27, 71, 485, 1, -10, -41, 166, 46, -249, -287, 25, -59, -346, -197, -43, -148, 99, -93, 255, 234, 151, 96, 340, 133, 182, -54, -301, -387, -259, 11, -239, -190, 183, -184, 97, -13, 58, -98, -84, 240, 9, -91, 12, -123, -47, -188, -42, -168, 198, -17]
311a7J25j38M47m12k22L88j36J49k70J3L59l39o0L36k68n7K51l88J09J94p0j37
333a43o2J50j16K60k09L85l00M6K83m28J2K73k63lJ93k36k24L59m7K15o9j51R3
356A8j82J48j8N1j91J93j52K37J09k58K33l61K55k22j2K00r0%J15j06R6j9m5K3
380B2Rj65J64p9J05j22j12J35j14Q8K74o0k37L23n3m72O08j21o1k11L10j39j82
403i0L28l26Lp9O1K0j90J40J65l58M32k64K12k2%j66P0K5l0L0Q2J00k20L2J99
428A54j99J78j86r8K6R8J4J18J13l49J78R3l31O44l54j09k9o6K83m06J94J21k05
451a18Q2L6j2K33k13k00J00J54K8j26L68l75L5L87o76L65J24k60P7o8M2J63q1
474F5o0J01k6j06j88L94l19J15J8%k76L74j93M3llK05j15J52k60K69j96NJ27k71
$$ y = [-17, 108, -30, 417, 5, -217, 171, 35, 184, -86, -73, 286, -53, -113, 223, -45, -102, 149, -239, -130, 64, -6, -143, -205, -55, -171, 89, -120, 265, -35, 11, 294, -134, -122, 151, -112, -115, 78, -158, -382, -23, -70, 145, 76, -75, 18, -164, -16, -34, 17, -174, 19, -133, 104, 213, -45, 188, -173, 82, -140, -152, 48, -42, -42, 73, -33, 63, 44, -1, 22, 31, -134, 30, -49, 56, -66, -178, -43, -157, -69, 205, 145, -92, 231, 178, -294, 314, 193, 132, -79, 231, 92, -90, 238, -88, -85, -164, -103, -83, -273, -133, 32, -326, 106, -158, 54, 32, 32, -134, -64, -39, -69, -39, 43, 143, -77, -45, 154, -45, 133, -53, -151, -125, -27, -13, 105, 218, -131, 47, 140, -191, 453, 99, -10, -39, -105, 178, -228, -34, 87, -118, -36, 0, -12, 221, 8, -192, -92, 62, 90, -36, 332, -43, -8, 379, -297, 68, 192, -68, 9, -59, -17, 146, 65, 5, 106, 80, -26, -214, 180, -139, -24, -6, -6, -282, 92, -101, -58, -61, -64, 141, 26, 178, -82, 187, -9, -4, 123, -148]
499a48J55L3J33j59j78K44k13K37J24j35j32n0K43n3l56J45L12j61k5M9j55kR4
522BK06k26P1p5N3K3P1j26n6J77j65P5j29J5R0r3J76q7j34K13l47K83k88M10q7
547E2k29p3N40j95l21M46k04j74J09K57j25j88K93l95K98j34j07J32l7J6j10J89
569D0J9J29l03J02P5n8L5K0J21p3j21O4j37R1OK78k30J21J19l68O7p0p3P1m9K37
595A13O7j87K22j04J64k05q8J57k9r1L03j28l6l89R6l5J42J99j25l06J51l5J52
618Hl07M25j42j08P0k8OJ8K52m3k53J83r6j51M7O1o5Q2o7M72j78L8k67k3R2j95
644a69M83o14J62L5J95J2k07J79k20O8j94J73J88O7k54J64oj93r5J17K49O9P4
667B83j84J77k61K9o4J49l29K91j66L4J47K4j52N0%k73K92l54K08K5q0J36L18
$$ y = [-148, 7, 40, 173, 14, -164, 80, -133, 104, 228, 93, -39, -89, 154, 101, -255, -110, 202, 41, 16, 65, -90, -92, 2, 208, -18, 53, -22, 31, 54, 125, -1, -57, 120, -45, 30, -99, -84, 6, -87, 89, 2, -132, 81, -266, 17, -271, 139, 52, -177, -250, 290, 95, -226, 220, 16, -158, -49, 208, 83, -105, 188, -207, 91, -43, -150, -18, -55, -39, -149, 40, 59, 188, -115, -13, 62, 4, 39, 59, 180, 107, -14, 50, -87, 4, 10, 288, 58, 179, 298, -70, -3, -73, -146, -75, -124, 113, 180, -7, 215, 111, 275, 70, -18, 139, 110, 19, 322, 194, 158, -231, -135, -170, -28, 171, 46, -260, -109, -144, 8, -299, 126, -16, -124, -54, -82, -76, -58, 194, 151, -102, 81, -15, -166, -119, -58, -123, -41, -108, 364, 186, 224, -43, -66, 26, -169, 314, -300, -138, -103, 92, 104, -103, 76, -144, -76, -270, -97, 91, 158, -96, 68, 62, -131, -226, -109, 140, 209, 283, 99, 276, 15, 44, -20, 129, -200, 91, -75, -41, 106, 130, -22, 28, 28, -245, 47, -307, -99, -74, -154, -18, 300]
690C00l09j69K54J11m07M2n9L46l5m8k27K30j33k2L7n9JJ24L08k97OJ41q4k37
714a86R5Q7R7k24J86O4l09O6j2K50j87r3q8L80j51L2L91j93k93Q7P5K5K0N9j98
739b0m2J22j2j15L97j55l18J76R0k31r3J87J57k44J69Jk6J23k12J63o3mj28J39
763F1j17K40l31K31j28j53K05j17J14K50n81M71Q9k98j16L8K05j56j7J26J30j83
785c7k51M54k4l18J49m6Q4j71O5K48q8K3k35K62j94J97L4k04J96k89L44k61n5
808a17J05j43j4L03k10P3J0r3N0K7l4J9n1j02R5L5M32k84J01m23J80j1j05J63
832Fn9J44k4M2j30jJ41m02K62n2L44j14l89N7P8qJ50P6j84L9J17J86k16m4j13
857i4j56K12k06K59l18J75J46j56R6j48J26K33j71j28J27k47L32k25k7R7J3J8
$$ y = [300, -9, -178, 76, 187, -220, -178, -237, 109, 74, 26, -201, 29, -104, -126, -89, -148, -147, -23, 285, -12, -6, 135, 51, -186, -91, -4, 93, -131, 55, 119, -190, -124, -136, 114, -73, -166, -254, 126, -25, 7, 398, 205, -88, -1, 74, 99, 119, 178, -20, -62, 60, 48, -67, 330, 175, -143, 33, 123, -108, -201, -14, 143, -101, 68, 69, 43, 166, -46, 117, 54, 50, -78, 61, -56, 184, -147, 84, -44, -197, 8, -109, 5, 255, -326, 145, 234, -64, -180, -142, 63, -93, -110, 16, 146, -37, -288, 166, 142, -176, -27, -73, 11, -160, -95, 153, 65, 88, -147, 115, -79, 118, 152, -52, 144, -145, 199, -62, -117, -12, -155, -169, 134, -76, -3, 7, -86, -36, -9, -43, -24, -75, -177, -82, -47, 385, 101, 202, -221, -41, -52, -157, 6, -53, 91, 67, 109, -21, -22, 119, -283, -21, -73, 271, 157, -232, -175, -97, -105, 45, 121, -63, -24, 93, 279, 63, 19, -94, -250, -38, -244, 15, -303, -128, 18, -138, -42, -190, -64, 169, -2, -130, -3, -250, 82, -143, -170, -73, -60, -42]
879d2k12J30J23M77n62r5J44K40m75K42j24j8K29j76J11j1kL9k74L22j3k70J63
902e4j35J54J14q5R2p4%j43J03j34J74R9k16j09K1L70j97n2r6J00m0K20m5k49
926a82J03j13P2K42j10k56J77K78j07l28L33O9m1l4p7O6J18j08l48R0J86m2K0
949HK7j51K69j30nk6Nj61P2L5L04k99P2m8O4k71J74p3R6j15J88k9p2j49K41r5
975f9k00L20k20J0K84k13L4L6j16j08L85k47p8K51m2K65m85J73n5L0J54l44M72
998B37k60k00O0K19qn4N3k08lK8K09j69K43k81K63j02j80M8o7J68Mp4M78n54J51
1023AK0J23l08K40q2k9n1P5JqMj03K06j70O1j84j68K72o4k0K08p1j3J28k09L65
1049B24k14K43k97n0J98J22j56m8O5J64j90j08L12k93J91k29Jp8mK70j58r7Q9
$$ y = [-42, -254, -124, -1, 476, -86, -181, -37, 203, -272, -30, -154, -172, 57, -119, -8, -19, -21, 18, -256, 66, 53, -217, -54, -189, -35, 79, -6, 86, 12, 12, -131, -28, -162, 12, 111, -105, -214, -193, 177, -20, -72, -168, -68, -108, 112, 67, -182, -79, -192, -120, 122, 12, -244, -67, 211, 104, -224, 109, 178, 137, 103, 26, 92, 210, 102, -246, -156, 30, -12, 8, 35, -116, 153, 23, 18, -8, -3, -164, -92, -57, 247, -52, 20, -28, 36, -235, -61, -134, -38, -153, 35, 6, -66, -215, 26, -69, -269, 51, -169, -159, 125, -88, -54, -18, -134, -242, 143, -104, -182, 69, 27, 292, -193, -20, -75, -45, 109, -235, 237, -23, -223, -163, 56, 48, -6, 47, -161, -164, -136, 73, -96, 147, -134, 129, 27, -153, -105, -172, -4, 0, -74, 404, -150, 1, 21, 144, -164, 76, -6, -35, -86, -11, -10, -18, -14, -117, 89, -81, -20, -204, -372, -100, -164, -184, 24, -47, -60, 68, -141, 224, 10, 253, -44, -94, 104, 226, 70, 22, 87, 251, 61, -47, 265, -28, 163, -66, -65, -143, -147, 123, -35, -132, -43]
1072d3n1J48o8j8p7N08n17o6J85j95n7L73j25J5J15l06M6L14k35m0O2j84K98k4
1096E8l66L72n5j96K93J8M5r0j90J52j26k7K18j96j73K84m8j07J88j15n7J89L8
1119A09l4K9J87k69k4j81K90l6l31J61J57k78J41J81m5J46j44j52M5k34N27k52
1141gJ04k39J53k81M47k3J4l32N0J58K0M9mj44l5J66J7j40K28j89N3k6r9o0J03
1166a7l9j07N1k22M11j06l3P1M9K20l03j6j4J65j97J31q3K59k61K01k67M4L6L14
1190B87k53j42R1k55O04l57R4n0j50K59k72Q6K1j51R2j29K31n8K3J84j48M7km5
1214GR7k74J09Q6%O4l10N8P8J7k25L40J4k86KK28J04r6J0J02l20J46J20O1j73
1239d1k07j73M82j10L4j42L29k30J62j72J28P4m5P9k02j07J45j74J65J20k34J44
$$ y = [-43, -94, 54, -14, -32, -109, 399, -118, -184, 1, -194, -251, 122, -3, 12, 127, -179, -133, 181, -54, -94, -32, -216, 82, 58, -308, 64, 9, -187, 106, 124, 169, 79, -111, 41, -85, -112, 106, -90, -263, 21, -27, -134, 54, -61, -118, 71, 109, 75, 104, 291, 22, -2, -183, 107, 71, -260, -99, 58, -220, -79, 102, 57, 203, 59, -93, -48, -282, 245, -7, 97, -142, 11, -270, 177, 154, 168, -164, -114, 44, 64, 113, 109, -35, -70, 96, 113, -27, 201, 12, 65, 39, -60, -120, -17, -56, -163, -112, -334, 77, -29, -62, 9, 58, 278, -25, -41, -55, 110, -87, 44, -39, 220, -41, 160, -107, -63, -27, 287, 34, -108, -17, -272, 332, -25, 69, 19, -131, 128, -144, -58, -37, -188, -96, -225, 6, -52, -29, 155, 7, 54, 52, 7, 104, -170, -61, 25, 25, 89, -221, -163, -85, -68, -293, 47, 61, -225, -223, 5, 109, 13, 23, 125, -195, -49, 71, 132, -41, -248, -421, 61, -49, -15, -157, 172, -58, 104, -68, 60, 134, 89, 168, -34, -141, 4, -170, -5, 115, -119, 25]
1261B5N0rj59P8R9j91K17j20j85K58k46J66k39K65J52l91J6K06J06j11j38J69
1283A8M0K5j16M8N4j06J8L2l9K9j66J01K73j81J04k88k3J4Q7P1l2l4k16K59J08
1308H0j6r0k5M9k4L2k36K08K37l36jJ72P9k59J58QP4m4J45k08m8n1O9j57J04j18
1334a98M54k27K1n6P8L96o76K34K41m94J70j98K05O2j27k84L15M2J66k59L22J42
1356C29m00J77q7P0r4q3n8J90J52k41J59k21n9K9M37k7l01k66M1L74J03k19mk55
1380b54K50j30K12j02P8m5M65p54K88J09lj92J71p1j99J54K14m37J03L35k98J97
1402I1j98M00l40K65j25j49O8N9o1j8M7j03R5j13%K75l08R7R3j07k1J49k5j54
1426h3K76k11l27K63J47J72m62J77J15k44J41k70P3Q1L29l25L74J10k37o1L8m1
$$ y = [25, 75, 66, -93, -15, 84, -107, 110, -10, -195, 63, -183, -17, -256, 9, 161, -230, -214, -8, 98, -13, -151, 18, 58, 83, -33, 15, 69, -37, -19, 13, -26, 3, -163, -62, 211, 30, 134, -154, -177, -163, -76, -5, -37, -71, -287, -28, 80, 64, -26, -51, -2, -26, 6, -230, -22, 215, -121, -122, 50, 129, -130, 28, 36, 110, 66, 211, 3, -45, -96, -27, -184, -80, -198, 256, 29, 50, -6, 72, 468, -208, 26, 267, -227, -57, -255, -50, 12, -115, -399, -84, -42, 124, -135, 187, 329, -71, 106, 19, 89, -5, -88, -146, 44, 196, -45, 114, -107, -166, -137, 300, 273, -28, -294, -253, 121, 224, 5, 1, -254, -4, -134, 78, -24, 54, 9, 474, -280, 8, 117, 114, -78, 93, 22, -177, -23, 191, -246, -143, 192, -106, 91, -107, 293, -47, 218, 93, -56, 12, 71, 10, -8, 39, -64, 31, -82, -82, 193, -115, -18, 75, -32, -53, 96, 71, -83, 193, -18, -345, -82, 65, 237, -225, -48, 67, -177, -36, -306, -233, -152, 177, -148, 226, 336, 99, 38, 76, 35]
1448C5K27m03J63j12L8R1L51l36n6M4qq2Mk05M34j06j37L82k67r6K79m3k4k22
1472d9j4K24L3l50K35nj08l1L18l77K16Q2j39j11K44j55p5j06L93j90MK26l31
1495f6L10l59Q8j83L08r3L0J03k03j77K54P1j43j2J36l84K62r1P3K35L5r2k07
1518a05k8K77m5P5j71p4K42l38j54M70K52k94q5J54k23L1Km3P1j72K02J2l3j9
1542DK6j21J52k83K35j52J43m3J0j5K5J08J95L0k42K2n4L3jN2j31J60j28q1%m2
1568i8O8L0j37j0K64k6k14L5J20K11l73J21K3r5J08p3j11N6J77r2k9J57k3K0k54
1593a45M1N2K42m23K50J34p7j34M4p8L01m13Q7J40o5N1K8l6j16R5J0j24L33j91
1617FQ3m8k35J91j22L63m89M61k68m4L60k96r9K1J29m9K05J42k56r6J23j5p6k62
$$ y = [35, 262, -141, 22, -90, -52, 39, 390, 54, -2, 42, 34, -48, -44, -249, 185, 79, -58, 324, 57, -39, 240, 197, 173, -49, -63, 161, 194, -156, 79, 74, -34, -65, 253, -124, 92, 174, 35, -76, 168, 13, -62, -168, 225, 35, 39, 265, -66, 244, -115, -27, -210, 98, 5, 35, 138, -65, -242, 12, 83, -60, -72, 64, -320, -58, -149, -76, 159, 194, 102, -105, -133, 144, 99, 174, 3, -71, 171, -167, -321, 149, 401, 107, 22, 176, -47, -16, -14, -57, 14, -158, 44, 56, 23, 4, 30, -91, 61, -222, 13, -139, 4, -39, -29, -44, -19, 89, 284, 314, 72, 94, 40, 73, 72, 124, -7, 153, 25, -56, -56, -98, -30, 0, -137, -147, 117, 91, -123, -88, 32, 243, -130, -9, 14, -81, 27, -46, -157, -101, 76, -16, -45, 112, 89, 109, -145, -104, -52, 190, -233, 17, 151, 74, -60, -16, -94, 207, -206, -119, 21, -44, 7, 35, -1, -117, -22, -12, -136, 197, 6, 89, 41, -194, -3, -125, 238, -251, 210, -58, -102, 258, -38, -137, -116, 13, -36, 169, 311, 55, -41, 82, 67, -9, -271]
1641b71K98J59j4l68K24M5J9j04j28J05m8K14j85J7L15l63L38l04L91m73j8J92
1663D1oN9k21J5J42j20J03n7K94m59K07Q0k1J58l02r0L18k5q7O3n3j44j24K80
1687E1j88Q4k3R6j32R2kM1j46L9J5M66k74mj03N1k9j01O0j94K50n8J17j88J00
1712B0K0j10J23j88J21J03q7o8Q0J70l09J92l24M3l6J85J44m6R5j92J12O9j84
1735f7J33l6j61J87k28r3RM08k49J36k60K12M12o00J35j91K69m8O4j42j06L45
1757A29k26L25m42Qj0L23j88J75j74J15n3m1K3j0l01K99k9m3K28j96o4l8J06J36
1781E2k94O4K76Q7P3m01K12j64Q4O2j14j10L01k51pK03q7M7N6j80O2o5Q9P0p5
1806a0j34J47j81M44l17r2K01j75K19j29j54p7J71j45J78r0J4K17j95j1K08l4
$$ y = [-271, 27, 186, 172, -196, 28, 73, 92, -12, -140, -35, -83, 131, -54, -37, 278, -85, 253, -51, 340, -133, -151, 41, 35, 94, -127, -112, 30, -90, 13, -44, 250, -209, -2, 78, 57, 215, -87, -177, 141, 116, 29, 92, 39, -105, -229, 51, -137, -53, -76, 20, -112, -20, -22, 19, -127, -88, -73, 393, 119, 115, 12, 63, 34, -67, -7, -201, 49, -9, 108, -80, 20, 40, -70, 53, -135, -14, 89, 2, -66, 14, 184, -125, 67, -257, -214, -250, -65, 79, 33, 128, -64, 48, 117, -67, 66, 30, -131, 56, -172, -265, -256, 152, -97, 39, -221, -9, 403, -197, -62, -253, 16, -32, 32, -110, -216, 129, -97, 228, -214, -206, -216, 107, -81, 94, -80, 35, -18, -59, -36, -46, -347, -48, -77, -120, 108, -88, -152, -190, -84, 52, -242, -178, 98, 185, 258, -143, 69, -95, -11, 51, -63, -173, 128, -123, -130, 73, -14, 33, 89, -91, -29, -94, -5, 65, -10, -144, 3, -178, 266, -51, -143, 58, -117, 102, -27, -181, -258, -87, -232, -54, -144, -130, 87, -108, -119, 89, 55]
1828E5k11J78J74k51J96M6l66J37j63K16m7m7lJ12j13M1o5L15k02k40L29q7Q3
1851H7p9j03K17J1J39j44J9k4q6k27J61K02m8l3m52M19L2J99r0l88M7M17j93p3
1875A0p8l1j3j91M22P0k25K42j72j1J89k02kl04K76K99l33l7N02l44J75j40p8
1898B4PK57q5n0m98L79K8R6k78J83k04K33J45k22J51r9j86P0J93k24J42j65L87
1921B84l13K1j31J81n4q3J73l68M47l35Q0l7K95l06K31j26k5J66lj3O2k20j60
1944b34P27m25o5o5J62j16P6P0j93J61R9m35J16J69L4k03Q0Pj1j12kJ59J56k24
1968f9K4J24j50l49M89Q4j40J9l5j80K78j50J47j14J69p9j51K7O9M0k69J52K68
1991B04k13k71M51j69j09N8l9j4L41l81O1J1j16K07k6O6l12K93k7m3O8J53j30
$$ y = [55, -156, 22, 196, -55, 141, 187, -179, -42, -205, 11, -36, -83, -86, 26, -87, -46, -111, 204, 2, -238, 91, 4, 87, 8, -95, 122, 133, 272, 128, 147, 123, 37, -190, -29, 173, 125, 92, -360, 59, 91, 290, 200, -188, -141, 276, 83, 10, -68, -99, -112, -303, 119, 189, -36, 206, 34, 23, 212, 10, 8, -296, -20, 279, -54, -91, 411, 67, 242, 102, 24, 31, 288, 203, 153, -345, 34, 62, 158, -120, 63, -141, 92, 237, 15, 166, 67, -119, -49, 144, -80, 62, -103, 284, -29, -8, -139, 42, -12, -95, 78, -290, 157, -178, -98, -135, 160, -146, 85, -41, -66, 100, 97, 84, 146, -74, -234, 493, 68, 3, -62, 100, -16, 60, 130, -63, 98, 197, -238, -122, 47, 81, -122, -42, -35, -46, -158, -160, -1, 155, -69, -45, 79, -71, -420, 69, 153, 13, 32, -3, -183, 95, -55, 92, -22, 147, 68, -83, -56, 13, 53, -216, -64, 204, -9, -280, 171, 2, -107, -49, -88, -102, 239, -142, -81, -70, -186, 21, -5, 61, -251, 42, 15, -28, 40, 193, 63]
2014F3j0K9p6j71R5k8o4J33j30J27J75n9k59K57Ol8k3J02k59M5J81k1kk71K67
2039F9q2J71q2J30J81l27j5o5L6Rl20O78l51j59k7l4K44k42J28Q9o5J37l2j51
2063h0K13j20j02n4L45j06L3j10O1j42q0K47M7l35K6J78k09L22K5K0j01L56m87
2086e3J80j74j10M08l44K55k58J04N2j52L2J83P7Q5k63M3p0p6K01k84K20k01O2
2109h3j5K46j07p4l8J61J68k08L2K89m02M7Q9j46j58J83j1j20K31R6j69Q8j72
2132g3J86m42M97j21o5K83k15rp8p4J94m1J05l17K27K54l23J35k29K5Q0M6l47
2155c02K96o2r7L08q0K36j67O1j16J20k4q8K08l90j1J89j99P1P1k12J97n2J99
2178A56K4n0j90Q5l46L51J90l32J84M2j05j23J2J48k66L66j1k28K36k9k65J1K00
$$ y = [63, 53, 82, 6, -165, -70, -98, -162, -29, -159, -32, 143, 84, -175, 82, 88, 50, 27, 129, -130, -85, 96, 75, 73, -198, 69, -13, 158, 76, 206, 387, 60, 45, -20, 16, 25, -295, 383, 32, -127, -154, -188, 56, -186, -58, 31, -34, 103, 71, -80, 133, 13, -89, -143, 202, 96, 129, 19, 80, -62, -142, 105, 152, -183, -157, 21, -188, 134, 159, 179, 78, 434, -53, 127, -47, -157, 251, -93, 162, -96, 8, 60, -92, -60, 123, 200, 285, 22, 65, -5, -81, 120, -164, 56, -145, -83, -98, 148, 41, -33, -71, 90, 258, 50, 82, 371, -31, 16, 105, -41, -199, -16, -27, -147, 84, 180, 11, 99, -73, 113, -329, 168, 47, -18, 265, 50, 41, -37, -111, 83, 42, 147, -170, 57, 311, -12, 123, -106, -81, -1, 45, -302, -6, -68, -165, 143, 63, 299, 132, 193, 77, 197, 173, 85, 293, -97, -108, 81, -118, -47, 24, -188, 9, -43, 156, 180, 130, -60, 25, -321, 30, 220, -112, 72, 114, 9, -114, -102, 46, -220, 146, 135, -93, 143, 114, -151, -140, 60]
2201F0l67L53k4l4P1o5r9q0J01L88j64O4k37mk4J15j64j33M43j07j33J2R0mk72
2226b14J40j62K49j4m4K3n5J42j74K09J59l37K89l08J92j09o6K0K46qk03j75K16
2249A6j44K75k91K47N7n3k59j05L4K86J1%L4k04K04j20M1j12k11M59j30l18M79
2272A96m36L12j15K64j32r6n7j99L22K1j84R3Q9j49j02K05j99Q0K53j58j68K08
2294D8l6m8J45J85j93j05KK01m46J91j65K32j44M01m75K22O0j86o4J91M1l7J15
2317A35K45l51J13k15o7j31L6J34N0j86M20J4j18r1qK15j75j5k77J55K91j64k1
2340a1l8j3K9J64O2qn4k06M8k29L06j96M2J61j98l1k4L8J92P0k10K04m42K89J31
2365G6l49M12J68k48K0J00j41J09k47J16K9k01K25k6l26J30j31L76l81J74L84
$$ y = [60, -307, 46, 22, -12, 59, -6, -105, -185, -84, 304, 140, 204, -33, -37, -61, 54, -110, -243, 200, 93, -40, -28, 62, 58, -214, -74, -236, 13, -1, -45, -22, -77, 65, -109, 100, 259, -78, 211, -97, 95, -14, -80, -60, 186, 178, -25, -200, 16, -128, 147, -144, 103, 160, 107, -152, -257, -223, 63, 74, 74, 108, -96, 108, -12, 29, -83, -294, 165, 35, -283, 196, -240, 72, -43, 221, 89, -7, -64, -263, 59, 80, -104, -11, 78, -71, -173, 32, -167, -87, 166, 8, -160, 48, 12, -36, 109, 294, 101, -4, -2, 199, -247, -56, -221, 11, -133, 268, -207, 15, 75, -111, -175, 16, 57, 20, 135, 380, 29, 142, -73, -140, -271, -235, -101, -51, -237, 183, 197, 79, -12, -20, 195, 20, 5, -272, -117, 174, 10, -11, -49, -62, -33, 131, 193, 185, 131, -75, -27, -256, 50, -146, -104, 57, -141, -172, -196, -158, 34, 104, -106, 98, -344, -55, 76, -273, 139, 307, 59, 79, 179, 38, 147, -100, 16, 45, -156, 69, 43, -283, -153, -284, 92, -289, -115, 269]
2386B69m46K90M3J25l18p5J55l0j49J99P1l31L88q0l00O28k71L0l33J10J0J0j5
2409b0l3m4J31J95l81J92j30J19k80L61K60n25J84j48L95l40J15n8rK75l58M32
2431C33j61j66M7P1J32l99KJ96l93J67K61J45j11k52J24j89k75N52q6O3k77L40
2453A24r9q9K39j11k79K15N1P9P0m47K05k9K88l97J47L1O0m07M49J62k16K2l27
2476b59M87j0n99L73j60J52jP3r5l30L64mJ76l6o7j17o2K08j50K21j22j39l6K24
2500I1j95P1rn6K71m54K52J95r4k49J96j26J62j6J46j93j9l81N18j60Q3nj14j82
2524b68P4N31l98o5P8k0k9M9R2r4J23k53L36l15J01J65k16J95Q5k08Q9j07n4r5
2548b04o1L30k0q2n6R6K74l11q9J27lj95J97k66L82j77J41O3K1k96J19o2J22J16
$$ y = [269, -177, 113, 156, 281, -37, -112, 43, 13, -136, 63, 134, -197, 191, 111, -189, 439, 168, 198, -135, -25, -15, -5, -20, -53, -97, 34, 229, -152, 40, -90, 29, -251, 110, 370, -155, 29, -119, 276, -64, 51, -7, -16, 259, -99, 333, 172, 6, 53, 124, 256, -143, -141, 55, -338, -171, 90, 235, 124, -128, -4, -193, -468, 84, -2, 61, -216, 124, 25, -64, 175, 64, -215, 0, 51, 130, 200, -247, -42, -71, 217, -180, -33, -2, 58, -349, 100, 262, 46, 68, -259, 228, 218, -381, -8, -168, -16, -17, 56, -39, -369, -5, -9, 167, 131, 64, -53, -115, 93, -57, 164, 42, -97, -133, 91, -104, -33, -42, -98, 173, -281, -29, 166, 72, -177, 19, -107, 55, 39, 185, -8, -27, -408, 110, -50, 33, 28, -86, -268, -194, 337, -61, -126, -48, -68, -97, -48, 44, -50, 73, -180, 156, -159, -58, 107, -109, 86, 171, -37, 52, -55, -109, -204, -265, 65, 45, -37, -93, 3, 277, -34, -123, 4, 1, -194, 3, -263, 119, -58, 83, 146, 167, -129, -10, -72, 50, 166]
2572A66k58J00l31N26j92N4p8j04J42o3N2J0k14M27l86O4J39j16K32J50j99l38
2594b17L8J30L23mm03J87j57K78r9P0j4m4O2j42q6O1r9K41j82J30k14K07P0R2
2618B28l03l2K11ml4k11J19J50o0k15K96l27J03o3OK83l10P6R4j39J85r3L44l63
2642e9L4K60m72J43K0J5P7j29j08K37P9j83J08q7J99j61K3n8J04P3O3j58M4o8
2666dJ71j02j16J87k13K13j0j5k90N4L01j64J28l02K91k15K55n6j96k0J36M2p7
2689bp0lP8k4o5k29K23R0j60K14k59K23M8J39k82J39q6P0J11m43M40p02Q07m18
2713a61J7K99J72l94K19k16J57j7k44L98J24m40j00J32j04rM30j68M2r9J87n7
2735A68j5J2k61K89k01k36N27j50k03J71j0l24K73k25J80m1M0n2o5p2L41j51M
$$ y = [166, -92, 8, -323, 203, 11, 65, -13, -117, 25, -38, 14, 24, -190, 237, -149, -85, 54, -62, 170, 320, 121, -217, -179, -49, 274, 270, -133, 54, -103, 175, 76, 146, 132, 88, 150, 8, -78, -17, -116, 125, -57, 73, -141, 66, 136, 228, -75, -107, 104, 100, 66, -145, -26, 124, 64, -151, 145, -182, -79, -142, -136, 147, -163, -87, 7, -132, 53, -40, 304, -59, -25, 235, -237, -94, -74, -59, 18, -111, -219, 18, 97, -86, 22, -65, 134, -27, -4, -62, 42, 115, 178, 20, 64, -4, 167, 65, -51, 136, -77, 136, 126, 111, -179, -125, 176, 12, 140, -162, 129, -86, 169, 113, -83, -103, 33, 75, -2, -72, -75, 3, -21, -86, -315, -92, -2, -162, 52, -207, 16, 64, 203, -79, 60, -26, 44, 155, -288, 152, -550, 257, -161, -144, 155, 327, -67, 152, -64, 93, 76, -168, 230, 354, -86, -186, -54, -158, -167, 263, 95, 137, 38, 225, 168, 153, 165, -96, 193, -8, -244, 283, 133, -70, 101, 91, -233, 40, -185, -5, -46, -6, -58, -123, -195, 146, -5, -1]
2758aN9oR4kl41MK44N6j42P8O0j15J1j84J36J00M0l17K49K24K8k03m2j71NP0q1
2785a47Q7kNj12P3J6J61j48j21K52L9l55K57o7P1M1j99Q1J15j27q5Q6K30k56J78
2810G3k34Q9N2J30K59m98j29M16k56J71K48k68K8k72k5K48j51k3J07j08L25o1
2832A21m23K81J42l15O5Q4N3M9j61J54l35J31J78K64l52J75q5k09L37k56j5K6
2854i1J1l8J34J15j29o1p6J91L1n9j51R1O2j14R1l36L64O8j39k2m0JJ54k0p7q0
2880a20M2N1Q6R3j52r5J10J42o4N6N5l35mK24k09j33M90l07m2m0L77j75j39J17
2904B8M1l7l08J49J63l7q8L16m04L29j6l37L03M9k88L41k28l4j01N5Q2k07J88
2927d1J79k60P4j8K23m68K87MJ9P4KJ2k25l7K5j25L38J0l55L15M1j4K29k49K53
$$ y = [-1, 58, 52, 146, 144, -197, -193, 51, 107, -35, 43, 103, -12, -1, -185, -49, 51, 91, -226, 23, 247, 275, 72, 30, -141, -136, -66, -147, -60, -62, -57, -169, -96, -80, 81, -67, -188, 64, 103, -252, 5, -62, 9, 50, -149, -68, 47, -80, -165, -79, 151, -105, 73, -161, -72, -20, 110, 369, -129, -258, 158, -98, 73, 321, 53, 81, -191, -216, 32, -119, -142, -35, -143, 182, 121, -302, -21, 121, -194, -129, -45, 8, 57, -104, 50, -285, -154, 24, 288, -64, 111, 26, -183, 154, -102, -117, -91, -80, -118, 16, 131, 2, -59, -135, 56, 87, 28, -123, -32, 30, -84, 7, -329, 35, 103, -36, -58, -98, -97, 57, 37, -40, -120, -78, -27, 59, 152, 0, -95, 15, 157, 93, 149, 204, -131, -135, 89, -120, -253, 237, -70, -112, -152, 225, 50, -89, 28, 69, 32, -276, -127, 36, -1, -89, 227, -177, 152, 136, -201, 102, 151, -137, 204, -24, -58, -159, -104, -22, -229, -41, 138, -122, -48, -66, 157, -311, -24, -20, -1, 73, 75, 87, -138, -175, -150, -275, 63, 73, -282, 33, 74, 60, 289, 40, 293]
2952B93l80PM9j3J0O9k4k74M7M47r7m9J43j07j22J67j02k61M49k59k21M15J32
2975C19n67M77r5N9k40m1K2J66l14L60k23r5K84j84J62j90Q1M6K47m01K59J01
2997B33m11L17P7j10r0j4j17K40l83M00o6J16j01j46k78J70M9j49M68j3k26p9
3019a13J06k3j72K60l0j65R5r8J30p7m8K71k97J53q1l0J84L1o3P8K7l44J03j5
3043a18j31J05p1N63l73L48m27K05k75L75l71J53j03P9J00K35j82k47L01j56l22
3064c12L20k1J05m01M35o2l17K62K5J94j72oM8o8k16N10j91j09k76N36k44J19
3086A59J14j32K4j67O6j75qL96l17K43j54j07J94M2j11J53j94j31L7K2J41k7J55
3109B23j25m47J89L58k89R7n1k78N23k02n7J88j81Q3Qj13j60M00r0j59L08l77
$$ y = [293, -87, -80, -31, -44, -34, 35, 11, -263, -216, 231, 134, 85, 228, 121, -1, 166, 64, -197, 252, -7, -228, 187, 319, -248, 229, 134, 193, -47, -88, -66, 100, -214, 146, -77, -172, 112, -72, 90, -100, -19, 27, 274, -127, 132, 233, -178, 139, 216, 106, 16, 2, -115, 125, -258, 142, 76, 192, 91, -55, -333, -163, -114, -263, 205, 192, -34, -113, -7, -30, -202, 58, 28, -137, -42, -140, -10, -87, -135, 136, -161, -8, -89, -119, 65, 96, 33, 111, 138, -206, -103, -118, -249, -144, -215, 348, -25, 323, -104, 101, -174, 201, -170, -17, -120, -41, 59, 294, 112, -135, 166, 10, -312, 8, -13, 92, -309, 126, 64, -253, 9, 34, 228, 56, 50, 98, 30, -186, 324, 133, 24, -252, 284, 40, 159, 273, 141, 165, -2, 64, -111, -119, 277, -40, 203, 49, -58, 136, 178, 67, 220, 26, -105, -68, -46, 95, 68, 223, 98, -349, -160, 198, -91, 6, -45, -323, 200, -2, -59, 129, -52, 31, 39, -74, -234, 166, 76, -83, 225, -152]
3131a52J82p1l2p3J8l8p8R7K31r8R8J71m52J93mm1J59j39Q1J05M9l69J57o4j30
3156b00L40k82L7N4J58j27K97m99l1L78p2j19R7m3o5K35j2l21k6J86kO8j2r7K33
3181A75l96K44m6j66j55M22k30J23o0K08k00O6Q4j9n0J94l68m2k1K77j66r1K52
3204C5j24L07k62J53l7p8j51P5P6j65J67J78l78K18q7M49m69k04J80J20K2J3j01
3227f3M1K52k10M3j8k17K08k56M82k25k5L3k8J18p0M2j60j41L78m54M88j6l69
3250a67j9K11L1J65l34L9J24n2j48L35l02M1N5K14K5k17P9Rj60R1j48M8L7l7l0
3275a10K36l70J25J25j94J55J76o9j16K72j89rJ74j49j32q9K77m4k66J82K13j11
3297H7k10K16k00P6n6K28l94L41k2P2k16j37K81n5n3k84J84k11M50j28j66K61
$$ y = [-152, 30, -41, -73, -146, -128, -166, -244, -147, 84, -14, 84, 255, -197, -4, -8, -49, 110, -29, 52, 157, 206, -163, -6, -70, -200, 140, -142, -105, -51, 107, -20, 277, -222, -253, 125, 53, -66, 31, -12, -77, 158, 146, -175, -201, -15, -17, 51, 39, -58, 175, -221, 23, -23, -189, -344, 78, -152, -29, -89, 119, -81, -15, 69, 50, 0, 194, -174, -216, -237, 40, -126, -217, 35, -89, 218, -44, 109, 72, -6, -157, -82, -6, -171, -4, 174, -204, 14, -73, 376, -93, -297, -117, 3, 25, 38, -63, -22, 230, 20, 63, 45, -172, 36, -220, 262, 37, 12, 45, 17, 135, 65, 107, -53, -194, 184, -270, 218, 202, -167, -186, 25, 56, 221, -113, -74, 50, -2, -150, 185, -117, -76, -21, 193, 218, 1, 80, 89, -71, 20, -128, -80, -43, -80, -110, 126, -244, -119, 6, -188, -33, 143, 74, -42, 230, 41, 32, 206, 57, -75, -164, 113, 69, -197, -15, 198, 87, -123, 93, -107, -31, -87, 141, -253, 88, 66, 138, -78, -215, 66, 11, -42, -326, -142, -353, 97, -31, -197, 64]
3319F4j2J17n67K67mn5J44l3K4j05L80j17q5M1j16k35K71K3p6J82p4p7K46Q0m96
3344b13J20J02q7J10j44j34K39J03k62r4l6L95j40j59K30p8j18L16j69k17L20
3365H4mj03O4j49L23j34J77k13k12P3m1j11K25J14q1Q8j41J50l79M19k01K12k17
3388e7m8K30k9j45N4k70M12o0k36M24k86q7J69J44P0l01n3J23K1qj03l9K63l01
3412a13Q4J43j23j01K2L02j57N8J93j89p2K04l38N7j45J76j77J83j47J86P1J07
3434B24p8j59J47m4j92l8K83k34K33j89j7k00K26k28L88L4k26P0J39j26k80L74
3456A07k04j83L19k95J54J8Q4o7K33j28J6j31J30k45m4K84j62J99o7K9L2k08K32
3479A03J15l49O2q3J32L29L6k68n1r2K6Q2j80j44K21Q4J84k06l19J28j7K56J98
$$ y = [64, 52, 169, -398, -131, -135, -190, -46, -79, -55, -160, 220, 103, 18, 59, -57, -292, -21, 2, -74, 108, 34, -43, 203, 283, -213, -93, 9, -78, 32, -112, -246, -7, 96, -166, -260, -296, 99, -41, -200, 30, -48, -166, 150, -19, -236, 84, 80, -23, 41, -108, 215, 81, 258, 45, -167, -94, -135, -246, -21, 93, 12, 100, -41, 109, -270, 149, -52, 160, -57, -105, 125, 96, -49, 5, -265, 147, 87, -149, 275, -11, -98, 71, 215, 285, -16, -69, 54, 75, 67, -36, -75, 188, -113, -29, 114, -9, -110, -88, 214, 57, 115, 308, 119, 47, 251, -87, -30, -175, 1, -176, 7, -140, 46, 117, 224, 146, -13, 134, 90, -102, -140, 143, -91, 142, -47, -64, -264, -38, -266, 122, 156, -70, 0, 139, 13, -267, 107, -97, -280, 39, -256, -102, -84, 0, -67, 166, 38, 54, -77, 53, -192, -236, 48, -114, 85, 18, 47, 79, -129, 103, 218, -131, -69, -152, -20, 309, 345, 77, 26, -66, -40, 42, -138, -282, -61, 23, 207, 1, -318, -190, -207, 49, 247]
3502B47k53J23j8j03k60M75Q3k81j33PJ97r3j40R8LJ66k60R4mJ48j79K67q5RJ34
3527B42k25j26r9L2K44n1J9j33j8K11l91L24oP9k43L79k01J05pl00P7p5j28K74
3551a7k51J17P7n0M52m12k2K50j28J52n3k31K85j92Q4p8o8m5k7J84K7N7m24J35
3575a78J45oK71l47J33j11J06m7M2j69L6J92o2m6nPj5K65q1J05k30Q3l2Q0l58
3600b22L40l81L47J01l20J3K78k95L37m3j57O7j11L83l32j3p8L4o1M02j11o3j70
3623e5J57J16k47Q5j62k10K43j21R1J55L03m93P4J41j49p5J82J02j8l29J04J20
3645A4J43r4j78J81JL9k24M0j03K69j41L2k8Q6Q0j33J31p0j43Oo0p5R4K08n8q7
3671g0K89j84N8o0j18J32q3o3K34l6j26n8k0J87J3j56K18k85J69j04K37l43M4
$$ y = [247, -6, 117, 99, -4, -264, 211, 294, 13, -120, -113, 84, -9, -149, -51, -48, 118, -142, -48, -52, 96, -83, 184, 99, 108, 242, 17, -109, -208, -176, 68, 17, 36, -97, -115, 96, -295, 29, 23, 102, -141, 238, 37, 142, 135, -165, -88, -163, -291, -17, -268, -151, -74, -124, 328, -84, -106, 144, 16, 168, 115, -116, 169, -23, 61, -17, -85, -130, -157, 27, 54, 111, -313, -178, -33, -39, 232, -115, 18, -93, 13, -34, 8, -161, -125, 67, 5, -41, -46, -39, -54, 211, 130, 235, 5, 88, 56, 136, -222, 118, -263, 84, 185, -135, -122, 156, -139, 198, 155, -2, 65, -46, 337, 5, -8, -86, -52, -113, 289, 178, 115, -55, 102, 218, -29, 56, -106, -316, -73, -194, -103, 52, 355, -138, -64, 77, -72, -147, 35, 137, 119, -210, -106, 14, 157, 63, -115, 66, 67, 106, -118, -78, -181, 88, -53, -21, -49, 37, 117, -16, 115, 45, -98, -92, -152, -227, -133, 75, 17, -70, 219, 35, 93, 33, -85, 47, -36, -99, 135, 99, -27, -85, -105, 82, 95, -61, 157, -128, 41, -63, 174, -169, -125]
3694a25L42ml63p4L48m7k83K16L3j49j51N36m45K96k85L73m2l11J57j35L07k29
3716c5J59o6J49k83q4J01q4J98J74k58O2o6J56k2j38j05L6J62J99k57o5j70M68
3739B31k73m5L05N6k78m0J15k16K78r9K88m92o1M56m01J48n7N3K82k27J76j0j94
3762eo5q1L0K12m21L75J26k66M6K68Q5j98L2j34p2J35k10K04n5n2K48l61K94k3
3786A12O4k25P5j09K09j82r8J70j00J96j3j00j13K73l38M1J83l07J6J75r6K12
3808D5k9j62K75l9m28M40K2k13j10q1L26q8L8J33K45m95L45k53j48K62j70k52
3830c37L61M1o0j44M1R5Qj32l6M56j18p8j95N8RK7k97M02j80N6N3k2j5Q9k45j51
3856c14L13Pk96M75j63n0k15K86j35M3J90k62K74K2L8m20J85LM1J40k70j1N1K55
$$ y = [-125, 217, 213, -150, -224, 124, 77, -206, 10, 43, -106, -257, 279, -166, 130, -155, 218, 176, -135, 22, -113, 194, -35, 124, 58, 207, -76, -160, -59, -143, 55, 229, -29, 33, -33, 123, 101, -37, -142, -106, 56, 255, -2, -67, -237, 231, -42, -87, 218, 274, -4, -44, 71, -145, 133, 34, 322, -170, -231, 225, -176, -28, -85, -32, 250, 23, 199, 189, -5, -70, -151, -121, 91, -330, 45, 171, -95, -49, 219, 304, 106, 138, 4, -68, 67, -143, 61, 6, -46, 202, -159, 135, 112, 176, -49, 26, -83, 126, -56, -154, 16, -84, 112, 99, -1, -114, 159, -179, -138, 45, -262, -246, -71, -167, 45, 16, -146, 129, 90, -338, 102, 124, -89, -199, -280, 46, -42, -4, 129, 374, -121, 224, -29, -177, 85, -85, -337, 24, 65, 5, -139, -98, -3, 5, -127, -163, 293, 175, 97, -98, -40, -31, -4, -301, 101, -79, -23, 30, 8, -7, 82, -163, -314, -1, 6, -290, 185, 22, -28, -243, 43, -92, -49, 141, -121, 153, 175, 213, -207, -22, -19, 22, 162, -108, -119, -68, 187]
3880A87j98j6N0l17Q1K08k9%p1N8p5K2K04k7K52o97L62L20l25l33L20k4J87j13
3904B6j36J78J14k44j12K01M2J60l75J81j36J48j66R3L7n2K10o8p3L4J37k85J20
3927C4L8k91K89J45j62q8j66K67M4k52K34J47l57L00l09K79o2j34J12p1q6O6J3
3950a0Ro9O3o3R4k28J97j51L62k03J80k34K66l9r9j15q0Qr9J19O7J9Jk6J21m3
3976D7j43O3J05k07K54r5P0O9n55M25l02K78J94k39P0K8p1j08K83r1j3j16P9Q1
4000A06J35l12lr7Q5J01K21k8n3k78j95J88K04M7l03q5N00j23l83j8L52r9r2L30
4024B00r7oj32j66J28m6J94%L0R0j35q8n5oRk7q3K04r0R2j78J59J15m8k7R7j29
4051EJ3j82oN0k8J49L7J42l6K1l38N22n01J44j58O5j33J34L06l29P3L2m0J42K
$$ y = [187, -11, -27, 23, -294, -213, -5, -34, -34, -105, -47, -122, -100, 104, 77, 329, -368, -6, 314, -11, -344, -24, -48, 139, 26, -110, 68, 182, -62, -174, 27, 69, 229, -146, 35, -101, 47, -119, -26, 11, -41, 169, 101, 28, 62, 199, -86, 34, 72, -219, 70, 215, 53, -35, -201, 66, 110, -142, 92, 239, -118, 182, -127, 152, 90, -44, 68, -3, -89, -23, -10, -1, -70, -7, -70, 24, -204, -7, -158, 204, 1, 181, -53, 213, 174, 75, -40, -120, -112, -211, -92, -25, -6, -5, -31, 90, 47, -96, -33, 72, -135, 119, 24, 94, 163, -392, 33, -269, 9, 203, -36, 34, 62, -9, -117, 166, 75, 62, -54, 25, 106, 241, -71, -74, -171, -86, 15, 236, 208, 155, -123, -318, -130, 74, 121, -182, -267, 233, 110, -273, -291, 61, -38, -130, 200, 103, 97, -35, -201, -73, -119, 75, 75, 105, 195, 60, -28, -83, -89, -80, -107, -190, 14, -76, 16, -162, -3, 112, 64, 37, 134, 5, 18, -164, -170, -120, -148, 1, 38, 180, 144, 165, -173, 349, -152, -8, -166, -101, -234, -100, 206, -123, -50, -18, -58, 84, 86]
4076H6k44J90KN4j51l77O19j29K05l25J76j98j57n1J93J91J0j06j14M21m21O7
4098e9K84k59n1Q4qJ88l06m9r7K14J66J8l2j42J39O3j62k02L34p5l3n5k14K34
4122b0M3k02J17J70m83M86k50oK84O0k45J1j72J58K0J71k97j25L00k33L45j12
4144B0J02j05O8l17L30o4M0q2m3J14L2nJ22j27j13l0L58m79K22M6Mj36J80j77
4168d0K3J55p9q6qp1L10j78p7K02j37R7n5J35j01l29M8K00q4Q9k17J0L56k57L22
4193B28k48n0J32L3n4K02j39k82L27k21J24j03L5J37k5l28O9L8L02j05o5J40j56
4216iJ12rj02k85K45J50n05M55oj47J25P8j43n0n3K33j10P9j78J50p1j01K09J51
4240B18k04K12m00R8M4j21K25P2M3J2j42J97l14Q6P4k03J35p0q0L97n36K31K60
$$ y = [86, -158, 32, 34, 88, -63, -440, 179, 50, 255, -70, 106, -92, -249, -300, -107, 84, 94, -12, -126, 295, -126, -59, 225, -34, -85, -1, -9, 179, -127, -176, -273, -59, 107, 125, 93, -49, 90, 153, -9, -211, 123, 48, 15, -40, -254, -20, 23, -179, -62, 108, -375, 111, -139, -145, 139, 199, -46, -35, -207, -49, -29, 142, -155, -280, 20, -213, 132, 20, 122, 17, 85, -232, 98, 34, 74, -8, -51, 63, 95, 90, 212, 85, -28, -58, 300, -179, 43, 89, 93, -43, 137, -40, -17, 138, 59, -27, -35, -106, 204, 26, -51, 151, 14, 111, 56, 191, 90, -239, -191, 9, -75, 14, -203, -193, 163, -94, 228, -20, -70, 62, 95, 41, 243, 104, -178, 149, -72, 52, -51, -16, 121, 96, -232, -163, -125, 177, 72, 7, 147, -9, 103, 94, -8, -293, -48, 102, -403, 52, 46, -101, 24, 102, -41, -91, -144, 89, -21, 58, -120, 30, -41, -142, 67, 218, 14, 226, -174, -76, -32, -153, 72, 144, 187, 199, 57, 254, -60, 26, 100, -103, 32, -38, -118, 279, -257, -26, 234]
4263B34k57K11m06R4O6j82N16j67j10l24L02j40J56Q8m9Q0J4p0J70n7k54l7J81
4286E9N5j20j48J40m3k2n6O6O7j40N8J3o3o8P2O0RP0j45k5K34M4n2K09m56K33
4312E1m1O8q7N5m7L35n38K08j28L0k1qK21j33L40k09K7j08J98l14L2q9L21l26
4336a63K82k2l39J30K45m69J45K40M0k49K36m4P2K5k20j17N0R6L00j09j13K12
4358B28k67k0rJ4L7M44l87J19q0J52j9l30k7J23q1l9L2J7k23L98j2Ok55L8K57
4383A16k72j01J97j29K19n1O9n6L9j81j4J55j87L5r4K58j09q7L09o6J54j87J58
4406A75k85n8J94P8K01n07L9q6K79Q7p6Kk9K7L29j64j00j31J80j73j70M1J26k10
4430b31L24l5N1j85K01j25J44k36K75k89J14R2l4J44l92R9J67j40L28m36k4L40
$$ y = [234, -23, 188, -218, -124, -58, -240, 276, 109, -1, -325, -23, -163, -7, 81, 32, 112, 126, 56, 226, 169, -85, -122, 59, 114, -6, -154, -14, -57, -79, -135, -69, -2, -142, -84, -71, -134, -202, -130, -70, -61, 9, -136, -161, 73, 117, 65, 274, -182, 51, 10, 78, -9, 46, -1, 334, -204, 4, -124, -94, -115, -123, 98, -35, 305, 96, 123, 15, 213, -101, -69, -158, 163, -163, 119, 97, -242, -112, 133, -336, -191, 49, 89, -160, 76, 32, 104, 129, -91, -208, -158, -62, 238, 129, 16, 228, -39, -59, -68, -54, -17, 427, 40, 159, 79, 231, 212, -118, -145, -22, -103, -142, -110, -93, -316, 82, 70, 76, -179, -141, 116, -156, -257, -60, -189, 30, -21, 48, -8, 31, -150, -164, -9, -196, -161, -255, 3, -106, -193, 116, 50, 204, 17, 175, -110, -168, 26, 104, 305, -202, -163, -249, 30, 117, 41, 43, 14, 41, 370, 206, 106, -25, 155, -18, -188, -147, -21, -231, 93, 58, 109, -76, 125, 0, 144, -92, 183, -106, 8, 100, 66, 210, -182, -83, 84, -56, 272, -164, -188, 152]
4452A52o9j64j22J12j23L77l86J73K28m35N13k23N2J00j44J6J4m6k96L22q3p9
4474a11J93J1p1p2P1j46K07q9J69j50p2N3n4j53K31j0K06k67j3K64l18J5P4J56
4498A24n6l47M16M9J3l40p4M19k00P3p1j77K37l49J73j0J4L89l60o4L66l42J99
4521H2O0p7K33n67N27m68K23l3l4O1J35j74o0P1J1o9r4J12K31l78J76j44p6N25
4545B73k2j05j35Q7J06r0J1J26l52N3L04n81K66j40P8J61nJ36l05n1K76j49p1
4568a29M82l76k3o1J62j74K44K44m57R1n3J64N5k24J74j6K37k94k06K7J59JK99
4591C26j89l57l2L27j30L00j87o1J66j12K9j2j34l5J68m1j1Q7j29j15j17K46j28
4614a41jk0J50J76j65J64j91J98j98N7J49k11K25N8k85rM4R1k95J12j59K98R6
$$ y = [152, 83, -81, -203, -91, -214, 163, -223, -50, 178, -257, 256, 33, 85, 185, 41, 57, 71, 25, -271, 51, -32, -111, 82, 93, 22, -50, 21, -125, 82, -7, 162, 12, -60, -7, -61, -214, 17, 7, 213, -54, -67, 197, -121, -106, -32, 124, 68, -279, 137, 186, 199, -141, -215, 204, 4, 77, 6, -171, 66, -283, -110, -120, -106, 283, -77, -141, 225, -117, 82, 142, 65, 298, -269, 258, -210, 13, -20, -54, 7, 142, -32, -92, -21, -10, -79, -173, -61, 170, -208, -32, -176, -252, 273, 251, 146, 11, 98, 204, 114, 125, 251, -101, -48, 256, -325, -59, -199, -121, 40, 35, 171, -134, -185, 91, -58, -129, 353, -23, -46, -107, 55, -119, 125, 369, -88, 3, -50, 114, 169, -55, 119, 103, 340, 46, -160, -133, 26, 27, 326, 137, -220, -252, 75, -55, 245, 58, -3, 163, 51, 80, 68, -66, -101, 67, 26, 15, 102, -27, -142, -259, -13, -141, -142, -162, -12, 164, -1, 163, -28, 170, -28, 29, 178, -33, 192, 250, -35, -44, 0, 91, -204, -92, -251, 47, 143]
4637A43j47l9K4Q6J47l05L58k50P7J37l93K63L6o9L4rj25p7N4K16p7m1j55J99
4661H7K22r2l08J42K1j10R8J9m4k8k86L03pj05K28k60o3K26o6j45j2R8J64K0p0
4686C2j42J95j88L9j63K29J12k58K88J27n1n72K46K09l69J80n9J89J81k51k9O7
4708A2k79J66O8M5j98l3L63j36n0J47j48L26m50L98j30k88J14r8M54k09m0j37
4730a03j3M0l5L08j81k59L93j59l76M46k95O01l96J7J00j71J34k25M36j14j20
4751B8j18j54m1J69K66m1k73l0P0J39m5O1k9j71K32J2j76J32k49L53j84J75n6
4774G0j85j03K27N3J88l23K38j95R6Oq3k80Q5j43J72L40j00L2Q9k42O0L8n2J37
4798A25l93L46k5J0Lj32k3J13J92j88k42K05M0n4r7L70k66J89q9k44K26j99R3
$$ y = [143, -4, -43, -19, 67, 214, -91, 267, 17, 94, 231, -162, 101, 137, 68, 102, 93, -32, -109, -55, 161, 84, 43, -112, 87, 309, 217, -91, 51, 72, -38, 60, 79, 35, 7, -279, 24, 17, -88, 140, -120, -183, 43, -23, -168, -180, -82, 82, 102, 32, -110, 85, -103, -64, -227, 2, 114, -144, 144, 271, 220, -352, -106, 103, -266, -86, -145, 44, 225, -26, -55, 12, -267, -101, -33, 12, -186, -219, 144, 8, -42, 105, -43, 283, -167, 231, 101, -187, -73, -171, 283, 74, 34, -103, -116, -76, -111, 197, 16, -243, 150, -9, -385, 61, -234, 367, -29, -12, 88, -83, 51, -174, 262, 148, 28, -90, -244, -285, -116, 150, 109, -164, -194, -124, 15, -30, 31, 2, -169, 63, 75, -101, 31, -218, 135, -49, 126, 70, -115, -218, 9, 62, 250, -73, 165, -30, 66, 72, -11, -291, -206, -349, -177, 163, 63, 95, 184, -58, 2, 40, -12, 125, -268, 78, 53, 63, 66, -66, -89, 24, 216, 28, -214, -9, 31, -23, -120, 250, -16, 173, 84, -160, 66, -133, -40]
4821d0N0K0l13K13L68k55k28K29k21J56QP6L9j77J96j77J67l52K42K91l80K3p5
4844a40K59j13k82L53j32J81J71l56j03K36j23k08J47J17m29N26J7j80K28q3K2
4865A08n1K31l90m8o4K13M3j00l1J94k72J04j04M2J18j6K21q1j93K22j30m3R8
4888G1j49J62k70K70M6j6Om5K8j89j26j07M00j35R0j40K17J26l82L73k19J89q8
4911A12j74Q0L21l89k64L94k92J17K87N1k72l37L96K2Q6j83Q2j04L13l80LR0j
4934d2J61m09K70j36K34Qj67J10N4k48J89j98k1J70J27p3P8k10L8K88l67P4j10
4957a80L68J00p46M13N6j9L4k3j51J02p0P6m1l35M80n1J72q4j89j02J12N7J66
4980A45k1m08M29m06J22M83m46K55k14j50K26k18K49k2O0j15M7J9j95L05o7J47
$$ y = [-40, 10, 30, -283, -70, 298, 43, -185, 44, -177, -21, -13, 63, 102, -75, 121, -56, 111, -241, 1, 292, -88, -65, -140, 119, 6, -276, 77, -55, 126, 297, -59, -162, 74, -49, -257, -110, 7, -422, 104, 121, -59, 169, 86, 108, 57, 288, -102, -150, -214, -1, 42, -58, -89, 105, -167, -63, -167, -125, -7, -23, 198, 117, -76, 146, 16, -27, 71, -78, 84, -186, 84, 130, 114, 120, 75, 103, -86, -212, -319, 81, -54, 36, -104, 113, 239, -143, 230, 11, 200, 112, -62, 18, 339, -50, -314, 80, -212, -95, 192, 243, -29, -366, 30, 52, 138, -45, 37, -67, 246, -134, -131, -41, -42, 119, -290, -20, -156, 78, 86, -81, 29, 83, -165, 24, -174, -195, -25, 102, 29, 107, -103, -65, 223, -144, -70, -180, 188, 288, -458, -45, 11, -8, 26, 3, -148, -46, -116, -40, -81, -416, 64, 13, 185, 101, -88, -190, -78, -21, 145, 124, -284, 145, -261, -139, 344, -102, 153, -61, -211, 15, -203, 46, 24, 84, -31, 16, 35, -160, 145, 78, 225]
5002B25j33n5j55K26M0k38q1K1K34K38k64j57J12Q4r0j99K82k58Q4l3J30Q8j07
5025fl48K45J50j88P1k8K39M1l03M02j26l1k9p2R8k39L54m6k80K68l97K10l8K33
5049A80k22j89L80nk86n8K23K6k76K25j74J22o2K07k17Q4P2k63J96q3K88j79K23
5072B12M3l51p4J46J01o6j2O4J7P2k28L1L38l11R8j01j34K79M8m40J18j18J23
5095a45K23l51L04m5n6k25M14k39L04j78q1J02j13k8O9j85J92N4J4k4o5j6j00
5118a75o2J71K08j13Lk0j13J64K6k9M8Qj79J76r4n9R1NM1m7j83J86m5o6n8Q8K42
5145B14l31L24l97p7M23k16L8RJ31R7j94Rl28J93M4J1r7L46j18k49K51j04k15
5168b36K89J18n9l3P6l38O0J1J25l5k31K24k6Lrj94j23L50lK48j94j4M4k41K81
$$ y = [225, 92, 37, -118, 108, 148, -90, -171, -150, 84, 322, 58, -99, 13, 97, 7, -192, 90, -168, -84, -117, 13, 101, -6, -354, -109, 41, -147, -76, -104, 135, 176, -127, 275, 149, 118, 89, 17, 115, -124, 230, 184, -96, 172, -225, -15, -53, 180, -42, -231, 149, 144, -142, -200, 23, 49, -227, -2, -176, -54, -116, 91, -126, -42, 30, -233, -37, -120, 168, -11, 212, 255, -96, -170, -24, 77, 11, -1, 63, 80, 152, -76, -45, 293, -18, 80, -21, -155, 124, 172, -268, -150, -268, -145, 78, -273, 31, -14, -70, -295, 119, -120, 184, 6, -75, 27, -86, -114, -45, -230, -38, 16, 30, 6, -59, -75, -175, -237, -66, 142, 29, 32, 12, -101, 63, 89, 60, 108, 116, -63, 113, 19, -40, 51, 56, 97, 50, -133, 53, 8, -58, -116, -28, 214, -117, 207, -190, -267, 156, -60, -22, -13, 118, 215, 21, 30, -298, -105, -61, -50, -147, 199, 81, -168, 83, -21, -236, 53, 171, 112, 79, 155, -183, -123, -112, 13, -22, -253, -29, -55, -52, -61, -255, -378, -28, -31, 217, 23, 9, 53, -188, 93]
5193I3k88J31q5M20k95J58Nj36j07J81J4m9m4r6K17Or0J39j68O5k67J20L5l8l
5218h2K00q3J2j41K07j76L5J6m0m01J86K10n1qk0N08m16N4l21N67j7m28J58L05
5242B74j38k0k80N5K09j32J36j23k1l8j2O0M8j89K24j26j52J65J79j63J21p8p0
5265g1J06n2j8k1J56O6k87L66m7l35jj40N29m63J49K19j64J24j97m6J81j16j62
5288b24M08k5j10J60k21n7l3J94l73K19M23p80M01j4n5j11J70K5K56j12j38j70
5310a67J42j25K0K8R1R1j16J48o7Mj57K02j38L8J03R3j08j21j9K62k3m9j5j14
5334Cl25L25O2j27rj71J80r6q8J88k7q3K36K53m42L06N4k54Q4k12K01j9p4L28
5358B93k97l7l3J77k2rk81L69j01K1Q7o4P1O0p5l01J78K03j22L4k08l3j22J84
$$ y = [93, -195, -64, -149, 271, -24, 134, 139, 3, -104, 77, 91, 42, -2, -98, 119, 125, 35, 174, 6, 71, -196, -76, -41, -79, -82, 118, 35, 47, -94, 113, -63, -28, -12, -52, -453, -267, -57, -108, -116, -136, 372, -44, 10, -311, 256, 239, -189, -31, 274, 136, 116, -164, -109, 100, -32, 104, -19, -40, -78, -90, -30, 18, -171, 53, -73, -225, -60, 119, -44, 77, -1, -71, 35, -17, -35, -56, 100, 166, -121, 245, 198, -137, -138, -278, 251, -212, -63, 156, -8, 116, -81, -127, 54, -62, -224, 184, 159, 49, 209, -12, -69, -102, 92, -281, -62, 361, -419, -18, -32, -87, -198, -28, -3, 253, 141, 3, -167, -25, -150, -130, -102, -11, 80, -36, 112, 45, 49, -108, 94, -44, -6, 97, 190, 82, -39, -58, 204, 181, 132, 117, 3, -322, 3, 65, -62, -71, -242, -62, -158, -246, -58, -85, -168, 68, 321, -121, 185, 239, -15, 69, -143, 58, 39, -35, 293, -4, -41, -74, 103, 81, 72, -209, 160, 59, 80, 167, 103, 174, 234, 159, -142, 36, 239, 117, 151, -57, -90, -212, -28]
5382b8R0l1o2q4K53l0j41n9Q9N0p2j60j0L09n1j46J59J1j23qmJ18j58J24j99J22
5408d1K45k4o5j29L50l24k02J64J17k12L82l97j22J56k68N31l35L07k30O7Q4l0
5430B4L50n50K88l5j91j44J51q5M8L90l7l90R5L7n4M8Q0j76Q5J67j26r5J44J50
5454A74j77K0LM9K61k47j47J8j08J06J59j55j7jJO3m8J52k92l4J54J3K89l43q2
5479a89L62l09J82j45J12N9J3j77J88K08m69J68l53L49L0j04J18N3j56k4M14m24
5501i4J69k82L01P2L2j57Q4j00J5J24j7k6k53R7Q2j53K54k49k57L55K05l66K93
5524A29q5Qk19K52j70k33J74M6J10m8J13j12j57L13k08R0j47J92Ok80K14q4Km1
5548a35K81j24M8j74K9PJ25j25K7j40L51m57J87l8M4L6k39J81K09Q3m79L26n4
$$ y = [-28, 62, 31, -31, -115, 138, 108, -33, -92, -3, 47, -25, -185, -195, 114, 63, -83, 76, 87, -36, -44, -48, 70, -88, 36, -163, -41, 204, 180, 115, -14, 336, 12, -190, -26, 91, -121, 261, -136, -258, -102, -370, 161, -174, 133, -97, -30, 54, 24, 374, -176, 112, 77, -114, -258, -107, -192, -144, 246, 209, -181, -86, -49, -103, -55, 25, -151, -66, 101, -25, -120, 24, 174, -3, 17, 20, 69, 330, 83, -64, -46, -154, -48, 111, -44, -61, -62, -61, 2, -46, 106, -186, -220, -66, -53, 236, -107, -189, 173, -136, 46, -99, 13, 72, 85, -92, 96, 304, -165, 3, -350, -1, 29, -75, 43, 96, -60, -84, 330, -94, 75, -207, 94, 166, 198, 41, 125, 25, 40, 164, 147, 121, -132, -35, 47, -106, 148, -101, -358, -3, 202, -164, 129, 44, 52, -167, 85, -85, -318, -144, -98, 12, -36, 77, -35, -192, 121, -87, 3, -144, 48, 54, -226, -12, -96, -94, -135, 146, 22, 70, -104, -75, -68, 57, -68, -41, -181, 170, -287, -100, -138, -94, -58, -297, -116, 93, 176, -303, 23, -31]
5571c1mr3J2J75l16J61K18j85J42j51j5q3K33O2j44j38JJ83J78j10k13J18k4j5
5595c9k4J67O9k46J42nn1q0Q6P4N5j93Q9J32j20J19j75j44J81l3M04l99j53J27
5619a7k63P5L92q6k6j90j91L67P1n2r2l6L64m33j48L54l16J54j68M18J06m34J70
5642A9L2r6J51j40Np5K4J74j54j94L74j25L28m97J17K93o1R7n41M91N6l06j14
5665a42L10j23J15k57P9J7j65J45m8j65R9Q9j19J9P1J31k68L10R5N9l59K12n9
5688D6n5j38K7N3K4K27l09J08j85J71p7r7ML49r3j56J11J0J29O3q1k53K32r3M7
5713F4j7j1qK17j41o6K59k31o3J88j23j2N8n5Kj47j17J36K03k35J49K29k77J44
5737A46m8j71MJ40J5j1p3j04j6N3r3J87J7k23K04j9J62l58J34N4R7m5k24o9K58
$$ y = [-31, -35, -128, -116, 59, -257, -96, 122, -63, 79, -72, -87, -170, 63, 125, -19, -157, -156, 27, 205, 95, -118, 0, -24, -39, -63, 104, 173, -73, 69, 64, 13, -67, 19, 93, 148, -45, 44, 176, 56, 175, 0, -144, 37, 4, 408, 9, -144, -17, -280, -205, 187, 101, 75, -115, -306, 61, 132, 80, -12, -48, 316, -117, -265, 89, -227, -73, -241, 177, 283, -151, 19, 51, -45, 106, -34, -29, -104, -80, 94, -60, -254, 120, -5, 323, -174, -57, 236, 175, 272, -269, 222, 278, -28, -142, 168, 45, 160, -97, -18, -1, -166, -21, -69, -234, -135, -46, -165, -146, -75, 56, -212, 98, 193, 252, -107, 105, 46, -9, -147, -120, -67, -43, 184, -125, -17, -202, -31, -108, -205, -201, 148, 55, -101, 10, 20, 149, 212, 131, -122, 110, 17, 64, 47, 36, 28, 245, 104, 38, 297, 66, 3, 191, 68, 56, 114, 59, 61, -86, -203, -67, 136, -99, 50, 279, 2, 146, 98, -73, -69, 71, 86, 75, 2, -102, -118, -65, -158, 29, 46, -177, 27, 8, 170, -188, -54, 0, 97, 52, -172, -241, 17]
5762A7m0M8J36k1P2j85o2K81n64O72k79P4J41k04J79j36J83l39Q3j3J12J14l73
5785a04q7J29j6R3Q3q7O2k05J00J18L4j07k53k29O25k34M5qk18L11L0K25l89J65
5809H3j0j5j11jl5J24q2q9M1j83L42l7j52K62l30K59n7k88L77l39M36m44L82k21
5833h8L68l87l2P9Q9j11r7J73Q6o8J20k23J78J85k37j71l8J13L82j54j3j97K40
5856A97j15J15l28K40J00j55l2m1j6K64l5l04K31l11L68k9k5J13m46J66J01p6
5878a8J16l05K24k73L90J97l78q1J60l55L42K88k18K02l30K0J14k67K5Q3q5j58
5900c07L4R9J07m1J33l7k43M40l09L41m31K51J8j55J08K92l40L1J20j98J57j18
5922d8K42r2j11n0O8Nq5K44J39l39q0j69M70j57p4J93k0j8M7j6M7j65K71m56N8
$$ y = [17, -23, 25, 161, 140, 212, 27, -35, 246, -318, 354, 75, 149, 290, 86, 265, 129, 312, -27, 56, 43, 155, 269, -104, -191, -62, -78, 15, 98, 11, 73, -132, -32, 86, 120, 13, -240, -469, 156, -78, -33, -41, -259, 52, 82, 307, -82, 83, 73, 58, -53, -54, -89, 35, -47, -136, -95, -278, 64, 27, -125, 137, -193, 66, 9, -279, 98, -241, 195, -249, 133, -88, 280, -107, -139, -60, 29, -82, -179, -6, 80, 12, 132, -91, 87, 272, 35, -136, -174, -61, 321, 167, 154, -43, 197, 82, 197, -131, 109, 209, 54, 22, -19, -35, 229, 194, -110, 121, -190, 178, 149, 124, 237, -209, -43, 58, -18, 98, -207, 17, -256, 134, 331, -47, -128, 32, -323, 19, 307, 89, 291, -39, -19, 95, -172, -147, -64, -149, -307, -273, -174, -67, -108, 25, -12, -255, 185, -124, 217, -214, 37, 55, -100, 8, 300, -40, -9, 111, -87, 70, -48, 194, 102, -9, -59, 9, 14, -71, 173, 312, -27, -107, -276, 194, 37, -37, 156, 136, 118, 165, 149, 196, 31, 302, -154, -96]
5947i6K5R1j23J82k96L98j36j66L33k35K0K26J66n60K38O1m0m20L09M05k62j45
5969b5K31l06J50J51J8k68j75L75q5l1J20p9J44j40j01q4j74K34k9J40M1K36j86
5992A57l7j61J2m8L33l09J96q5Qq2k3j1k71L28L59k32K0k28J25q1N8k51K60r0
6016e3K78j57p8K06j17K74m90nL33l22j55N14j68O8k26J06Q3p9Q1R1k19Q7j04
6039e2J81m1k29J57L6J05k25J46r2k48J33K79j55o4m5n0k40L38k76J75J30K80
6061B43q1J18k71P8j02l1NJ03o0k44K57p9K3JK95M3o4n16J71J71J33j64J14r6
6085D7j36K59l01r4M30j92Nk10J14N0J12p9m4j62L61q5k13K29j45k7K78j82J6
6108C1j07l5J59j6J96k89k34J09J33J61j83j45K28Q6j63K02n0j22J37m9j69k4
$$ y = [-96, -71, 20, -103, 79, -217, 181, 45, -121, 212, -23, -3, 223, 389, -171, 67, 128, 88, -332, -23, 382, 120, -25, 206, -100, 50, 201, 219, -49, -224, 151, 66, 35, 155, 76, 220, 80, -21, -105, -279, -45, -74, 66, 107, 343, 157, 120, -41, -29, -77, 256, -53, 143, 58, 66, -16, -39, -50, -321, 7, 366, 134, 154, -74, 51, -30, 28, -223, 37, -53, 225, 68, -10, 196, 79, 353, -137, -142, 191, -131, -286, 228, 60, 128, -98, 8, 91, 12, 93, 184, -35, 52, -52, 129, 88, -141, 16, 52, 157, -68, 78, -14, -262, -129, 150, -5, -69, -114, -164, -404, -66, -342, -167, -37, 243, 162, 280, 9, 87, -15, -46, -41, 62, 2, -242, 15, -64, -41, -40, 255, 298, 234, -282, -111, 60, 193, 29, 143, 47, -89, 170, -131, -225, 205, 13, 18, -192, -78, -28, 84, 5, -39, -201, 160, 75, -138, 91, -54, -81, 197, 15, 31, -76, -111, 48, 32, 228, -61, -295, -186, -53, 108, -75, -220, 8, 94, -69, 133, 83, -39, 98, 49, -120, -144]
6130a44k79M60J65j89q5q6J96j61M61l54m0N5m4K3L36l79P8j0j00nO6J71p8j69
6154a12J15K4O7P7Jk57K0nj98K92O7J30m23R8J02m2O2j43K6P4r8M17l89j02R0
6179a07M09m03M6L16k11pK7p5Mj05K17K05J27k69o2k22P9J14k5k8r0K09m13O9
6203a95J08J83k51l2P8L0M0K2j31K30J2Jm53M29j60J30Mp6LL9K46j39k2J75l35
6228f4M0Oj7l6M9ok91N24k77L76j78Pk91M85j62l14J48n2j88L12k60J96p1Q0K70
6253B86m04j4QJ41J67k26l7R2j5J39q6rk04L15k47p9J57k09J45o8K57l37K20O1
6277E3P5o9r1J71k19Q8L9m2J62j48o3J45j76K63k44K9o5J0O1j00PL37j52Ll93
6302c19K76K45k33k81N86k68l4N5N5j36%N8rj00L46l17J1K41K00l82jn7qk88K75
$$ y = [-144, -423, 37, 202, 13, -72, -158, 38, -123, 338, -16, -56, -1, -45, -22, 314, -65, 13, 3, -97, -102, -36, 135, 57, -112, 3, 27, 94, 171, 172, -85, -65, -70, -268, 24, 91, 221, -202, -104, -2, -44, 18, -125, -99, -25, -123, 294, -95, -197, -107, 302, -101, -55, 261, 50, 43, 70, -5, -1, -106, 111, 316, 443, 174, 112, -110, -31, 83, 58, 30, -60, 149, -264, -195, -87, 96, -155, -187, -109, -79, -39, -17, -148, 82, 94, 95, -358, 71, -89, 41, 45, -31, -28, 11, 257, 118, 96, 271, -64, -24, -18, -35, -71, -22, -28, -319, 205, -72, 304, 126, 133, -158, 327, 165, -149, -1, -53, -241, 71, -189, 7, -64, 16, 286, -118, -132, -124, 17, 184, -42, -79, 13, -2, 137, 51, 42, -162, 153, -94, -173, -16, -225, -80, -148, 109, -228, -8, 53, 128, 59, -32, 139, -80, 8, 47, 5, 167, 19, -44, 101, -75, 188, -56, -27, -92, -82, -21, -121, -114, 223, 71, 74, -319, -43, 202, -31, -312, 274, 6, -28, 27, 82, -54, -54, 4, -5, -105, 241, -76, -65, 176, 376, -6, -7, -64, -72, -360, -85]
6327h5O8j58L43p7qj00J21j90L76j55l1j44J85l68K72j11j39K2K52j63J27j29
6349i2K53l8m4k25J80J8J90k06j02J16L7j02R7K9o7j65l3L58k52q2J1J8K95j51
6373D3J1n1k20L2J64o1n0Q9N3j65K29q9L8j25R1k03J38L0R1J22q2j42O0k87J84
6398a00J48j93J59j71J98j88L41k02J39K15m44Q9n9j62K99j45K8l0Q2k0j33k6
6420a75L06n06K85L36j16Qj50J78q0k57J77Ok2mj31mO7R7J41k23M69m57m3K35
6444A37j0m8q6J03k71L40l80K82k4K24l16j22k02L11J21m64N72Nr7k6j41K69o8
6467A09J15j74j22k30L29j26N0oQ3r7P1l4M2j32j16K46K66j64k58L42j39l7l8
6490b0QL5n3l40M39j43K60o8N5l92k2K22J57j06J53k18R8Jl04L08k0j00j30L36
$$ y = [-85, -17, -175, 168, 91, 83, -17, 104, -86, 290, 135, 104, -40, 145, -223, 49, -62, -201, -179, 73, -90, 37, -92, 161, 123, 79, -146, 34, 52, 242, 36, -66, 50, 87, -15, 82, 111, 44, -121, -154, 204, -48, -130, -119, -101, 194, 43, 54, 3, -217, -185, -21, -82, -132, -43, 10, -155, 74, -15, 23, -102, -11, -214, -76, -46, 45, 167, 85, -57, 3, -284, -100, 48, -145, 14, -157, 41, -147, 194, -8, 131, 346, -98, -9, -68, -230, 69, -76, -48, -78, 4, -16, -149, -175, 131, -375, -90, 246, 130, 138, -12, 166, 86, -171, 6, 12, -10, -14, -145, -149, -82, 15, 156, -67, 402, -55, -98, 137, 127, 79, -7, 96, -175, 165, -215, 67, 43, 267, -49, -171, -373, -62, 59, -405, 167, 172, 75, 49, -92, 177, 109, 224, 50, -72, -302, 27, -99, -49, -55, 28, -69, 2, -32, 10, -122, -238, 8, 274, 110, -148, 194, 55, 18, -20, -12, 23, -30, -370, 69, -74, 186, 118, 173, -219, -241, -19, 138, 32, 185, -33, 65, 66, -238, 70, 50, -50, -180, 156]
6514A56j03J45j48l46M4N47m72K84j82J70k57K56l14J17r6l9J99j2M23o30M50
6535A92r5j9j00K1q9K32k46p6l2K81l22L16k27J91r1j08P9J87K26l44L23l02L79
6558C76l13m31M30l48L98j20k8K39l80L87q5p4k40L05k25L23k82j07p1K16j5J04
6580E9k1J02r3K71k15j77J55r6j08J86j23j79M73l40m8K60k19K1L6J30j4l11L54
6603A03Q8m14K16K30m23L11k20K65j37j71o1K97M8k85J44K42j46j33j76R5j81
6624c08M43m16J68L05j98j47J14j80K05J26k10nJ20k50K47K3K63j41n66K58o4
6645b13J22J31Q8L0k16K36nn29L73l38L74j01L70k51kQ0j24m1jL2j74J74J05j44
6669b4Oj3J84P6l71j19L41nK26m18K71p9j29K53j75J27q5J39l49L36j77J92K5
$$ y = [156, 53, 198, 50, -296, -252, 295, -177, 107, -75, 95, -162, 94, -220, -103, -199, -238, -39, -51, 372, -258, 192, 97, 78, -22, -1, -90, 142, -104, -180, -212, 69, -253, 63, -164, 27, -64, -172, -93, 94, 320, -24, 299, -3, 376, 63, -368, 62, -286, 112, -8, -36, 203, -177, 210, 125, 51, -189, 116, -109, 214, -68, -175, -246, -30, -45, 59, 38, 140, 47, 318, 103, -74, 81, -15, -123, 63, -60, -239, 234, -106, -154, 106, -113, -92, -56, 74, 60, -251, 103, 191, -223, -7, 223, -200, 111, -109, 156, 19, -152, -213, 84, 132, -153, -9, 233, 87, -46, -222, -127, -308, 135, -281, -113, 192, -6, -153, -39, -219, -14, 112, -98, -103, 17, -233, 14, 37, 300, 159, -407, -149, -213, -91, 40, 128, 158, -58, 178, 173, -356, 17, -321, 53, -48, 322, 71, 69, 149, 25, -16, -17, 15, -159, 15, 120, -24, -18, -31, 153, 229, -142, -261, 80, 75, 301, -117, 154, 75, -54, 199, 24, 151, 66, 205, -144, 192, 15, 207, 232]
6692B32m49K64J50m89K69K28k67K75j40O9k34K19j05r4R5l48J09K35k8P4j64K25
6714A26j10O3M5k66L09N9k43K7L17p20M26NM9K55m95P4Q6n0R8L1n9Q7j0j97N7
6739c6J0k0J8M5O9p9o0o4k7J68l59K30J60J84l31M5k32L76j20k03L76q2k56j09
6763b97J05L97m06J50K33k44L31l58K7R5n9M4J8r6K59l40L63Oj78Q1k1j48J75
6786A37J76n63K94J12k58j03J51P0R2q3j37J65k3l7o3q7K40j49P6J58k08L0o5
6809g5J18R1k43J52R5j96p6K08j96J52o1j24J47j67K70R4k27o7P0K90k37k57K10
6832b9N2K40k32P6q6j72K04j62R9k7q8K15j07j01K36r9p1J45l74j30L34o8K99
6855A54j93J00l93L91r2j70J02j03J79Q5L0j93K85Q4m11J85j06J97m6k97J8K70
$$ y = [232, -217, 47, 197, -292, -23, 205, -62, 213, 73, 142, -92, 127, 22, -72, 23, -325, -216, 19, -9, 65, -99, 126, 16, 79, 124, -142, 167, 226, -17, 10, 327, -393, 33, 38, 87, 342, -153, -79, 7, -43, 55, 86, 27, 114, 104, -93, -36, -26, -46, -28, 17, 86, 7, -53, -117, -144, 24, -335, -105, 55, 239, -92, -47, -279, 97, -23, -226, 150, 68, -188, -297, -192, 205, -201, -51, 182, -62, 269, -89, -62, 33, -26, 18, 36, -60, 199, -141, 222, 228, 50, 131, 110, -38, 137, 313, -250, 44, 156, -102, -205, -54, 16, 108, 25, -112, 53, 30, -7, -70, -157, 83, -66, 10, 168, -40, -10, -75, 43, 134, -109, 43, 138, -58, -134, 74, -122, 30, -31, -155, -8, -175, 95, 189, -38, -105, -35, 255, 18, -239, -29, 23, 263, 31, 107, 21, -151, 53, -109, -10, -37, -125, 90, -17, -118, 118, 19, -52, 93, -281, -411, -77, -145, 154, -39, 61, -332, 59, -33, -203, -101, -204, -25, 60, 90, -103, 182, 266, -145, 40, -66, 131, 85, -212, -194, 76]
6877G6j22l6P1N3j9MPK3j88o0J3K38l5J2l1L2k20J59K36k43k5L9R3k72K10m0n6
6904h1j82M32M3j24J18l39N2j60M8K52R6l42M46q4k30r2J03m4J72NO7l8j5k29
6928a26K25l10K4L3J31qK03J95n04NK37M2m62M21J14m27J44j38J92J63j34q9M
6951f5j59L33k63K26j97j09K5m9K20n2J47J14j05k5l1P1j71J15O8N5j0lJ39n95
6975c21K51N4R6j75L7J57N4j98K61k38J48l11J61J23K73l36K77k43l3L03k50k9
6997F1Q2l02N4J70p4J64j35R4m74M83k45M2J53k7R6j84K89k97L73n04K79p8k0
7020@J2Q8l04k09L91p4L07r9lP3l01m9M56l86J00j96K65p6j01r9K16L00j77k16
7044h2p4K57l0J42l37K93o5k9j97J68j57j25K27k40L47j71J03j45j01K41j11P0
$$ y = [76, -46, -82, -11, 42, 23, 27, 34, 57, -131, -191, -178, 60, 25, 37, 6, 38, -182, -23, 213, -30, -55, -16, 77, -195, 15, -25, -81, -263, 169, 212, 88, 206, -133, -81, -241, -193, 59, 155, -187, 259, 175, -55, -147, -44, -88, 84, 89, 156, 118, 103, -126, 99, -211, -187, -154, -23, -31, 172, 367, -137, -132, 105, 147, -315, 106, 220, -207, -63, -201, -9, 154, 20, -69, -65, -224, 109, -154, 72, -125, -234, -209, -258, -38, -90, 57, 171, 66, 41, 10, 81, -90, 25, 93, 148, 138, 135, 274, -321, -70, -16, 80, -95, -58, 99, 153, -45, 216, -22, 126, -185, -24, 99, 372, 36, 313, 70, 37, 340, 90, 61, 143, -159, -105, 65, -9, 155, 20, 114, -360, 123, -122, -80, 73, 46, 142, -42, 247, -50, 323, -181, 98, 20, 0, 12, 100, -204, -413, -22, -96, 211, 112, 109, 182, -119, -168, 288, -98, 2, -194, 71, -5, -106, -205, 11, 311, 134, -82, -156, 101, 71, 213, -124, 169, 104, 75, -122, 46, -111, -236, -9, -249, 98, -73, 30, -115, -216, 25, -86, -16]
7066a6J09j61K37k41N9K40j21k13K71J53l70k00J79j3j4O2J28l43J76J62Q6k84
7088a14J38K2M3l08K85j28r2Q8j33K70q2O3m2Kk53K40l15M10q7p0R7J53j81K99
7112C05l58j0K22l22L77k07n1K21j64J58J2k07j03m3J94j68K41j69J22R5K2J2
7134A79m31M11k04j72K52k2m07M18K3Q1k94l4n6Q4J21j00J49J05r9r4J49j55k95
7157c91L06Q5J29M0j04q9k6J93r3M20m62K1j4K17m84M17l09J66Q2j9k30j98P8
7180b65L48K76n40J80q2j86J41O9o5N4P4j8nJ76p9j55K43J0m78M07n6n1L4o4K9
7205co0M2j90K35k24K67N7J11m31K69M9K4J71l42K42m97J52J41k51Q7J47j02J14
7228HK63k81J59J0j34K57l47o0r4K64q7J8l0J35J58r1o3k04J50j14K13P5j47J55
$$ y = [-16, 93, -68, 169, -72, -13, 227, 106, -107, 164, 317, -53, -253, -74, -87, -101, -39, 89, -254, -78, 84, 170, -114, 24, 46, 89, -219, 66, -62, -154, -66, -199, 71, -11, 52, 10, 12, -241, -1, -316, 94, 7, -63, 34, 187, 6, 305, -53, -63, 159, -163, 214, 7, -44, 177, 13, 171, 183, -24, -127, -170, 24, -144, 97, -72, 50, 145, 167, 179, -252, 159, -45, -217, 35, 13, -394, 24, 47, 128, -166, -200, -256, -172, -51, -151, -2, 103, 4, -90, 59, -96, -391, -85, 0, 129, 169, 65, -24, -50, 143, 50, 470, 8, 29, 15, 232, -252, 165, -144, 22, 104, 85, -145, -343, -265, 83, 359, -181, -1, -83, -269, -128, -59, -124, -70, 4, -14, -19, 157, 78, -77, 166, 176, -302, 105, 49, -2, 32, -32, -3, -63, -21, -211, 24, -200, 67, 124, 235, -196, 73, 122, 146, 317, -25, 217, -280, -128, 13, -238, -151, -4, -106, 8, 271, -10, 149, 159, 25, 282, -65, -125, -219, 45, -42, -24, -54, 81, 239, 148, 85, -119, 31, -83, 130, 205, 58, 213]
7252B13J73l89q7J09j63p0K40L0r4J79n7j66J64k13N26j81m87L33q7n4J25K34
7274B78n02L03j81P0lm7R3P3J63m22M8L0K40J50m76J41J25K4k78n4K3KK27l25
7298b98L09J38j05m2k0m6m7j7p3J29J62J4j95R4r7K16r6j78K6J01J61n0j32J15
7322F9L6k04J7N3N4k9j17K80k40%Q6K43j28l03M15J22n77J69j93J97R0L9J26P8
7346B83k36J17k54N6p4l6K79j62lJ67N7j38K8j31l92L86L18l43K54l10N7K26j07
7369D2P2j84O4MJ7j38Q7j38N07l58J51l9j79L6l4J12Q9j74j39J70j68J36J02j7
7393B1J72r3m9n9n3j56L10j99J46NL6M7k93J42J82p9n5l9K18m34J01K32q9P3l4
7418E3j60N2L0j80K23l07K75j16j67L70m6j28O3J12m18L89j67K45j28j68L09p9
$$ y = [213, 386, -3, -90, 19, -144, -214, 26, 56, -38, 141, 84, -82, 82, -131, 395, 214, -273, 60, -27, -81, 44, 278, -224, 79, -102, -32, -35, -82, 11, 84, 247, -175, -127, -97, 143, 293, -183, -42, 83, 107, -171, -225, -202, -200, 27, -298, 11, 149, 44, 2, -18, -64, -111, -128, -201, -72, 90, 104, -91, 3, -94, 122, 26, -152, -126, -25, 136, 86, -46, 69, 105, -99, -82, -29, 25, -4, -121, 159, -81, -81, 5, 248, 120, -183, 232, 354, -223, -54, -247, -50, 40, 79, 205, 283, 47, 164, -90, -34, -108, -144, 135, -27, -30, 137, 194, 56, 84, -47, -439, -53, 265, -78, 176, -134, -77, 149, 42, 114, -70, -6, -2, 15, -123, -36, -174, 333, -25, 126, 87, -92, -56, -90, 22, 111, -63, -202, -32, -200, -64, 38, 21, 193, 100, 51, -8, -61, -217, 93, -106, 40, 45, 81, 128, -165, -23, 159, 80, 25, -14, 204, -230, -129, 103, 14, 87, 53, -107, -55, -25, -205, 18, -289, -14, -130, -297, 73, 27, -101, -38, 74, -344, 45, -122, 123, -5, -173, 136, 57]
7440E7pj60L5M1K01q7k82L78l49J33P6j26O5M0p6K84l14N80k67l17j4K8N7j19
7464a43R9j36K18r7J67p1p3J84j50Q6j55J8p7K20p5J11j37k12K18j38K11J00q2
7487H6n1J76j80J04l36N20k19j55l55M61n2N6Q7k08j04J14r2J50J62l11K23J56
7509B32l32J76l51M24j74L8O2l31L32j58j3M2j23J76K75j04R7l44O0J89jk70R3
7532ej91K29r3J79N3J7k05q3K88j08J8j86K18m0J4l06L57j26N5j19q7N6J2P1j74
7557a56M13j59l6j70Q8J63k24K42k06k1j00M26k46J29k52P5p0q1K66j96K8M4r6
7580a39M68j22n24L42j3l5J77k00lM1K91l27K6RJ34Q0j32k71R6K39L8j71Q3j77
7604i0K14j98k4J96k91O2J70r0Q6mk69K76l18J38O1Q0p7K93n26K06J94j85JJ76
$$ y = [57, 50, -110, -75, -34, 167, 80, -202, 176, -173, -40, 36, -90, -25, 15, -61, 223, -91, 489, 222, -95, -109, -81, -24, -143, -44, -180, 38, -59, 108, 37, -36, 148, -2, 84, -71, -53, -130, 90, 15, 126, -11, -223, -5, -143, 68, 168, 86, 35, 211, 31, 135, -201, 319, 100, -55, -410, 51, -1, 55, 142, -66, -170, -56, -148, 2, 164, -147, 76, 232, -100, 76, -275, 149, -25, 13, 75, -256, 76, -82, -95, -53, -176, 0, 275, 171, 268, -76, -16, 173, 172, -98, -5, -196, 33, -60, 119, 172, 189, -16, -99, 189, 81, 99, -87, 131, 91, 105, -201, 156, 30, 85, -34, -121, -65, -53, 18, -156, 257, 98, 62, -108, -20, 143, -81, 161, -45, -66, -166, 260, 14, 143, -109, -34, -104, -185, 81, -115, -87, -43, -139, 329, 207, -317, 25, 12, -23, 154, -46, -49, -8, 283, -44, -18, -9, 125, 205, 73, -198, -102, 137, 175, 4, 87, -90, 124, -74, -98, 98, -193, -131, 39, -51, 35, 31, -238, 38, -280, -142, -81, -1, -78, 215, -311, -105, 89, -96, -95, 81]
7628H1N7j58L71m10n6J61R3l27K12j47R9k70N22K9k05M1k08J6m6J99O9o2k3K12
7652B50k15K61l19J39k62K59m11L33n2L8j39J7N0L6N1k16M49l80j79K08K70r6
7674I2K8L8l04k16M07j85K33K7L1j31L3k2l7m5o6J21J16p6J62j9j49K1k29Q7K05
7699A22l56J22K53k67K56k98J56P1o7K35k33L06k02n3j75L77k59l60O19l92K06
7720F1P7l37K57p7J62r3J22j85K2j37L38J07l00J13l32K47k2J24q2J11k78R2k99
7743c09L12M6O7m02N3M67j69n3J19L5m2k77N32o01L33k3o2O6m4k70K30J0j07L18
7767B29j91R1O1J46k20j04j21j32M65l92k2L14L2Q2j13k84P3J05l0J14q3j0M0
7790E0M9M6K99l45k20K3J57R8k05L5j15O6o7O2rJ77m83M77l9j05r6K83J44j80
$$ y = [81, 138, -20, 351, -59, -115, 46, 139, -188, 24, -123, -24, -294, 228, 257, 52, 93, -115, -99, -145, 54, 123, 61, 38, 250, 35, 296, -23, 116, -146, 113, -298, 35, -17, 21, -118, -101, -51, -15, 36, -180, 269, -111, -290, -82, 188, 92, 120, 158, -146, -362, 45, -140, 93, 120, 151, 20, 53, 31, -6, -51, -117, 4, 120, 44, 206, 187, 38, 59, -170, -83, 122, -234, -112, 141, -126, 130, -168, -12, 59, -8, 227, -6, 300, 98, 45, -130, 247, -12, -372, 247, -145, 61, 138, -199, 58, -19, 143, 50, 172, -13, 9, -128, 210, 317, 17, 130, -202, 45, 23, 147, 65, 176, -102, -10, -309, 3, 49, 116, -286, -233, 234, 65, 12, 131, 166, 124, -153, 379, -222, 111, 88, 26, 92, 48, -222, 8, 18, -89, 229, 38, 129, 190, 336, 116, 12, -109, -241, 224, -168, -190, 124, 156, 238, 125, -159, -86, 19, -11, 103, 20, 10, 50, 99, 145, 444, 99, -121, -98, 59, 157, -48, -13, -128, -62, -129, -67, -76, 101, -382, 95, 56, -49, -145, 138, 282, 102]
7814A02qm1j05O2L5K0J30O7m05K7P3mj63L19Pj06RJ06j37K8r0Q1q8K07l44q0K03
7841i5J19k71L30k40N7K37k09K2j4l3J1L06k88m23K99L68r1l18K70J74j18j04
7863a1J63m4J77n57K73N6l6j6J07q3J22Q4m27J4L85l55L59k30lJ09k26r5K91Q3
7887A40j4j04p8K29k02J17j01l2J3J77j84k2J62j39K23j18j9j80Q1P7j57L18k70
7910h3J89m2j81j97M12k49J75O1p1J3J40lj52k15J57J00J25k20J11j09L1j6r7
7933a21k9J03r7J70j05P6o1J01n3O8l29L67j16j61L23j22Q4L1j23j68J95M5R7
7956A75l08M46m65L20k3k68n0J97q3j80J62k2M1n1O2J93n1l2k36P3J10p7J19K07
7980B59k26m2J02k40K09k94M52k83m5J78K22k43j29J82k32K55k79K49Qq0j62J92
$$ y = [102, 94, 53, -52, 10, 45, 65, 195, 262, -143, -116, -43, -47, -210, 109, 116, 10, 19, 125, -12, 16, -74, 7, -81, 126, -218, -298, -95, 24, -247, 83, -157, -100, 137, -72, -50, -64, -97, -86, 220, -68, -491, -192, 176, 85, -233, 37, 211, 93, -11, 152, 108, 285, -272, 1, 57, 21, 5, 112, 29, 151, 235, -192, -178, 207, -148, 211, -19, -22, 87, -139, -234, 57, 140, 126, 22, -56, 173, -29, 88, -13, -45, -32, 145, -39, -61, 101, -38, 185, 67, 48, -132, -51, 26, -131, 187, -83, 106, 64, -117, -314, 98, -151, 24, 85, 14, 27, 167, 164, 12, -203, -46, 54, 179, -41, 70, -39, -8, -24, -121, -150, -47, -144, 26, -79, -3, -64, 37, -16, 52, -277, 90, -26, -187, 136, 14, 98, 129, 6, -162, 33, 78, 175, -133, 313, -152, 168, 145, -123, -173, 24, -59, -239, -77, -99, -58, -109, -47, 146, 95, 63, -173, -100, 10, -67, 52, 259, 33, -9, 93, -147, 62, -232, 220, -63, -108, 70, 292, 49, -80, 102, -130, 125, -154, 95, 103, 23, -139, 53]
8002E3q6l44L95m2j6K1JJ53l33J06J00J13k16j02K07l58N28j4m3l30M6J99j44
8025a06L9ML35j07k63J54J26n33K29K67j3l17P7J90j25j0r4P2J54l31M08Q9k91
8048d6q0L58l35J45J0j22k0K04j78n8L27k61lJ01k1q4M9L9J42j68j40j6J12N6
8072A1l6K09J80n27L86l95pm8J96K97l00p0K82n71M04N5J31m41K10J33j32k82
8094c15L27O5r7k10J64K03K7k63J01j54J26L26L5j90k40J68J45k43P9J88p0k99
8116a27j08J66J97j91K18m35m5K25kq6K86j71J02K58l90R4j92N8M22k72j42N9
8138g6k72K96K00l43K3J62n5m4J50J55k76J77k78J87p6P9M1n1n3L5j08K47k5j39
8162d4m2o2J92k25L24m5k2o3n9J71o6j70J88l04J92m0o6R3K52n4m82J89K15J58
$$ y = [53, -33, -377, 18, -24, -40, -19, -18, 135, -198, -92, 8, 121, -95, -197, 10, -348, 180, 166, 123, -207, -161, 38, -106, -67, -63, 272, 165, -98, 56, 182, -351, -122, 145, 132, -185, -108, 82, -43, -53, -147, -75, 79, -252, 156, 245, -46, -126, 232, -103, 42, 52, -70, -90, 114, -64, -122, 205, -56, -59, 42, 21, -63, -14, 25, 167, -1, -141, -157, -45, 11, -25, 184, 364, -163, 223, -172, -179, -227, -31, 266, -34, -104, 178, -393, 11, 66, 197, -244, -34, 99, -33, -315, 12, 77, -20, -230, -66, 137, 164, -99, 2, -152, -26, 300, 335, 145, -95, 73, 218, -25, 54, 242, 172, -127, -235, -69, 128, -63, 155, -280, -325, -100, -102, -188, 98, -73, 29, 287, -103, -9, -201, -143, 279, 7, -135, -76, -348, -52, 148, -195, -172, -10, -65, -109, 41, 196, -80, 97, -181, 6, -70, 9, 50, -1, -54, -19, -127, 120, 95, -44, -86, -148, 44, -181, 143, 98, 76, 13, -46, 125, 59, -111, 77, -227, -35, -75, -141, -48, 204, 150, -332, -143, 72, 230]
8186B30p1p3j91k81L63
$$ y = [230, 159, 86, -105, -386, -23]
8191b3
$$ Imaginary data points
##PAGE= N=2
##DATA TABLE= (X++(I..I)), XYDATA
0@%%%%%%%%%%%%Qj6J6j6J6k4L2m0M8n6P2q0Q8j04J27j51J74j98K24k56K94l34
34a76L75m23M78n38O02o68P40q27R22j019J123j242J375j517J670j841K030k236
52a172K465k718L000l318L680m094M570n128N792o598P604q898J0627j3072J6825
67I565k3379L8073j34220L9877J94732j62806n8718J03186O8726o5238k5045K6155
79A0908M5251j4506n0041k2710O1954O856q4087p304Q8910j9396p0104K7230N7465
92C0426k0338l9116P264M5888M117l7662o107L6631N577l2440p953L2701p3l5634
106a6719J269K4175q544j6417P22J1130J0187r021j0811J8941J5866j6461j1245
119f928J7016R644j8701j0218J4918M40j7505Q81J0220j309n568o3O595N804m768
$$ y = [0, 0, 0, 0, 0, 0, 0, 0, 0, 0, 0, 0, 0, 8, -8, 8, -8, 8, -16, 16, -24, 24, -32, 40, -40, 48, -56, 71, -80, 94, -104, 120, -136, 158, -176, 199, -224, 254, -284, 318, -350, 390, -437, 485, -534, 589, -653, 722, -795, 875, -966, 1064, -1172, 1293, -1425, 1575, -1743, 1937, -2157, 2413, -2715, 3077, -3521, 4083, -4815, 5812, -7260, 9565, -13814, 24259, -109961, -70084, 124648, -38158, -96876, 6310, 75036, 9798, -15247, 10908, 56159, 41653, -8388, -31098, 30856, 37712, -46375, -53679, 35231, 15835, -54269, -27039, 30426, 10088, -29028, -21764, 24124, 28241, -9421, -15528, 21103, 26680, -5760, -13713, 18988, 18915, -16719, -15450, 8725, 181, -16236, -15514, -4384, 5803, -3218, -14029, 4912, 20778, 4317, -6928, 10088, 19732, 1031, -9187, 5731, 6171, -11334, -10453, -233, -1542, -7110, -7173, -578, 5226, 458]
134D58k881O602L008m648m276K928M601m812o931M339M362l803l595K799L932
149B083k403l493M110L025l525q34K452J01k66r54l38J535q60j688K88P97K8j648
167a590K51K079l48j430J023J274o07p00P46jn04m87K70L4j83m55L67m2n3J10
187b46J82L83p4k18K70K67n50J78J56l49k56m0K00J94m08kL95L0o4n5M58m8k49
210A54l29J63n1l07L14N7j89l45K62J94J10o0K10L04m05O2L68o42M41J46o42m9
232b34K75k56m63N93j89J32k49L28K72n26rO90k89K91L07o09K58k00l2j1k43P3
254i1q5m68K07J41j34RM00J24Q4r1L11P5k33kL12p10J07K86m73K30m09K78j73
277c05L67k51K61J20n5J09m56J61K24m00K41R7P7k37J34O0q2j67j17J32J19k58
$$ y = [458, -2423, 4179, 7187, 2539, -1737, 1191, 5792, 980, -5951, -1612, 2750, -1053, -4648, -1849, 2083, -320, -3813, 297, 3322, -203, -1037, 1415, 1516, 1250, 296, -42, 1493, 633, -1055, -767, 30, 58, -1590, -1339, 740, 392, -1038, -15, 1259, 652, -48, 698, 697, 193, -294, -24, 10, -173, -628, -261, -303, -356, -246, -64, 319, 245, 27, 297, 564, 14, 192, 348, -1, -257, -297, -97, 97, -311, -313, 82, 112, 48, -7, 451, 403, 154, -175, -12, -63, -370, -56, 1, -188, -533, -271, -77, 33, -27, 183, 487, 82, 144, 512, -130, 311, 457, -185, -234, 41, -215, -678, -85, -274, -142, -391, -63, 209, -317, -326, 364, 75, 366, 673, 64, 322, 122, 90, 79, -164, -91, -176, -644, -437, -296, -430, -421, -21, 103, 187, 96, 407, 482, 249, 247, 559, -151, -44, 242, -231, -1, -410, -132, -305, 62, -189, 72, 192, 137, 246, -210, -49, 175, -225, 16, 113, 190, -47, 87, 147, 65, -102, -219, -87, 32, -226]
299b26L37m43K17j1j44O21j27k39K23j99K45m50k56N11j29k40J50r9K02r7QQ9
321e7M67j78j9j82o3j24J74M9k01K36m18L45k5j16J24K29j03Pq5O6k42j13K42
344A3l33L04j08K00k13K19o6j24p2M4M5M05m02LJ79J61l73J17N95l12P7k91k4
367D4j53J13n0k42K56k00k5K04J25L9k11jO5p0J59N1p0N9kk18J26j14J19L72m72
392i6R9J86M4m81O3P7L0L66r7j45K5Q5j39m6mj09K84l85L08P5k75j30J00K26L6
417I7N6m9k88J42l9L46j66l26J66%K00j0r5k3L22l44r3j8J0J45OJ02j5j26j85
442a85M33l73L19k72m5L42k99Q1K8n8o8K19J57J72m18J98j71j7l4OQo4N1J16j96
467g0Q2J21j73q1L05l2k52K8K49j22p2Q6j62O8r8M40n28Q0J65J72k24J45k87Q3
$$ y = [-226, 111, -332, -115, -126, -270, 351, 224, -15, 208, 9, 254, -196, -452, 59, -70, -310, -160, -259, -57, -154, -146, -57, 410, 232, 213, 31, -32, -156, 18, 67, -134, 102, -316, 29, 4, -112, 12, 241, 138, 145, 60, 126, -116, -229, 13, -320, -16, -124, 76, -137, 82, 16, -108, -180, -136, -91, 314, -88, -85, 94, 255, -118, -1, 594, 282, 359, 68, 44, -109, 4, -46, -288, -32, -232, -257, -53, 72, 111, -100, -101, -36, -106, 53, 104, 34, 93, 91, -127, -1, -115, 4, 376, -96, 3, 189, 233, -248, -185, -108, -78, 288, 191, 46, 71, 156, 17, -29, -33, -142, 142, -243, 65, 140, -135, -265, -165, 61, 97, 153, 104, -184, -42, -81, 265, 99, -227, -61, -61, 139, 129, 34, 11, 333, -11, -104, -122, -112, 33, 39, 141, 126, 0, -185, 248, -125, 194, -78, -123, 219, -80, 1, 29, -29, -97, 122, 279, 451, 33, 231, 60, 43, 9, 15, 23, -41, 10, 126, -70, 12, 133, -40, -121, 184, 152, -100, -72, 177, 55, -17, 69, -93, -25, -123, 317, -211, -131, 34, 206, -18, 127, -160, -77]
491g7J54Q8n4j43j17J87M5l04J81n6J05j19K62j68M6n8J9q0K55k79K52m34J93
514a02n8K53j66P4J9r4J99j88j5K32R0m76M85k58j31P0N3r0K88j47k37J12r4J84
538Cr1J96p9j69J76l42N73j29j5j46K22R3k69j66k28N09k62K36K18l91J42L6j4
561A03r4J97j76l02K01K57k02N1J1j15K5J65K0k82J22J19J09j83J73k54j06M28
583B67l85L27l59J34k42K88K5k80N43j21j83q2K10j49J2R4JN6j62p5K76o3J6J3
607A61j15j22P6J3p9M7J78r0j44K26p3j2L50l70k87K32J63k34J56l25J43K37k76
630a45J95j00k04J65N7PK14k40k1J6l5J23o2j51P3J6K70r6rJ7l66M09k98K53r7
655ij38N3J39n1P1k21o0K45N02p53J4M07k69J6R0l54L43J87m20L48j62J99j34
$$ y = [-77, 77, 165, 111, -32, -149, 38, 83, -221, -40, -96, 9, -110, 152, -16, 30, -28, -9, -89, 166, -113, 139, -295, -102, -160, 93, -73, 1, 20, -74, 125, -63, -78, 154, 244, -232, 253, -5, -136, -66, -13, -103, 185, 38, -199, -87, -181, 3, -88, 108, 29, -140, 36, -306, 267, 138, 123, -23, 199, 292, 23, -143, -371, 138, -124, 112, 330, -61, 81, 117, 103, 9, 206, 30, -272, -71, 186, -16, 35, 46, -69, -44, 121, 141, -141, -19, 100, 209, 26, 199, -55, -161, 267, -118, 209, -150, -16, -258, 30, 55, -225, 318, 197, 14, -68, 142, -7, 5, 99, 100, 156, -6, -81, 195, 132, 148, 161, 46, -76, 0, 13, -66, -19, 159, 69, -75, 151, 78, 66, 416, 46, -241, -9, 154, -80, 76, -249, -106, 131, -145, 50, -50, -254, -89, -32, -25, 189, -51, -72, -56, -91, 32, -30, -181, -108, -92, 178, 82, 73, 90, -276, 133, -165, 88, -9, -147, -94, 45, -6, 65, -156, -216, 29, 531, -222, -208, 199, -70, -54, 36, -318, 25, 212, -208, 140, -22, 177, 43]
678D3R9k88o3J8J54j15J69J13j85P3m07N21m3J22j18k62N4J99k03MR1L40k71L3
702G8j22R3J13l96L17k07J8m8K81n3q3j58J79P7m45J27M71j61K4j29K8j1P7n1
726A9l65N47j98l1j16P2O9p7P7K42k71L4Q6k02L22l67K96J40j18P5j27l1k34L25
750A67Lm78L66K8k30J61J59k53K11Lk83N9L42j97Q0J77k81k40K81j61K75q6l02
773a99M68k64J77j59J11j74Nn8j12R9O7M3p8J82j1Q2o6p4K5j37p6K69L3r9l13
798b59K48J4J27l89L24j3J91k21J9k86K24J76j02J14J15l08m6J19j71N8M2Q1j44
821h7J68q9J65l64K37K4j54J48o3l8%M5k3J41J99l82J69k69m7PL59j65j7p0J75
846F9l00Q5J74p4R9j24j52P9L79o04M97J4j94k04K04Q9L1J53j75L8m2j51J73M3
$$ y = [43, 142, -146, -209, -191, -37, -152, 17, 130, -55, 18, -389, 132, 89, 211, 93, -169, -115, 84, -119, -115, -24, 316, 45, 78, -44, 49, 162, -234, 83, -124, -106, -154, 127, 74, -9, -167, 12, 89, -356, -229, 242, 81, 105, -24, 4, -7, 70, 19, -346, 201, 3, -28, -144, -72, -3, -80, -3, 239, -32, 2, 88, -114, 208, -159, 137, 277, 159, 234, 107, 76, -158, 167, 170, -308, 58, 86, -144, 17, 176, -77, 134, 137, -146, -87, 255, 58, 138, 315, 34, -206, 75, -86, 189, 103, -199, 269, 5, 182, 23, 134, -40, -35, -93, -205, -106, -39, 4, -74, 108, 97, 179, 113, 39, 64, -73, -149, 120, 153, 54, -259, -11, 3, 130, -259, 65, 52, 243, 22, 41, -245, -21, 155, 53, 167, 282, -26, -72, 47, -124, -66, -24, 57, -87, 81, -8, 157, -207, 30, 54, -100, 48, -15, -53, -53, -8, -31, 110, 309, -73, 96, -173, -220, -213, 146, -19, -36, -106, 69, -231, -146, 28, -46, 53, -71, -223, -144, 235, -369, 128, 142, -52, -256, -52, 37, 68, 221, 46, 84, 42, -109, 64, 107]
870A07l0Q9l09p4O8N4J68o0qp0L03k55K5n3K13p4j00p0K0K00P1k29J65m6m9mm10
897c58J86j30N18k11j16O1L11k48j26J26o0k1J73J19r4j26j05J55j50j44L46l17
919b11j1L43j68O3P1P0r7k06J24J69Q4j69l7l22j2M74j52k42j8M72R8j88k06Q9
943A8p8J46L7l63L91l37J97j89K82j47n8J41j3j38K31j36q7M6N4LK5L7j44J52
967G0j81J69J28j22j80MK11j14r5J50k25J96j21K23J1j58j24J29K93l93J19K65
989B55o7o2j44m1J90j39K69j76j14o5N1M2k1J03j02R8j72N6R4j7Nj5OJ1n6J32
1015A21j50o1L6j52K79L9q1k0L0j19j13J35K14j40NN1J05l47L38m36M88l45K9
1038i4L9k8l2J00jJ25j04J03m7L1k47J03k0l1r0n7J34J51J07j85r4K28J0j40n3
$$ y = [107, 77, 166, -143, -217, -149, -95, 73, 13, 5, -65, 238, -17, 8, -45, 168, 94, -6, -76, -56, 144, 215, -14, 151, 105, 56, 52, -358, -172, -302, 216, 5, -111, -50, 261, 13, -113, 13, -47, -68, 105, 224, 130, 4, -101, 54, -96, -240, 106, -211, -222, 121, -47, 16, 87, 157, 60, -146, -22, 147, 231, 62, 25, -297, -309, 165, 13, -229, -247, 225, 323, 135, -71, 18, -60, 86, 123, -240, 151, -186, 11, -178, 104, -43, -101, 40, 27, -111, 120, -16, -103, -57, -3, 0, 25, 62, -82, 70, -111, 58, 186, 64, -116, -112, 99, -15, -110, 40, -185, 11, -110, 113, 124, -34, -158, -29, 264, -129, -10, 255, 188, 126, -18, -59, 131, -8, 261, 85, -29, -94, -43, -1, -22, 81, -21, 77, -95, -39, 55, 38, 43, 28, 34, 45, -11, 121, -29, -90, -54, -206, 73, 112, 31, 11, 41, -78, -191, -56, 158, 18, 23, 74, 179, -168, 170, -266, 222, -123, -94, -55, -83, -115, -15, -16, 109, 5, 108, 61, 92, -155, -52, -72, -103, -193, -250, -116, 35, 142, -43, -137, 91, 101, -39, -92]
1063i2K42Q1l59N7k33O76l99P8J98m17K53j16J64N7j19k36J97J48k06M4L98m68
1085e2p9J54Q4k9j84J13m0k46K43J6j37R9p8j39L67k0K05j29J15k52j5O8P0k79
1109a45M8J00J5m2m0J76k20K11k98K30M2m3j26K20J2j92k51L63R5k74j35K27L22
1132B95l71k9j33K23j26l5P9M5J0p6J57k66L45p0J02l14L33l88J03M8O7k72N21
1155B48l62O3J3j83J82J03j10j71K22Q6J16j37j31k36J76K15j97Q1K20k7j19j32
1177h0k1K0O3R0K9J5l4R0j63p1K0L67k66j89J24J0j17K40J13k79K00p0j32p8L19
1202B00k38l8j00K03k19K25J09k48l1n7r7J99L07R7j83J48k17k4j04J40n5K0j06
1225f9L13m08M27l43k7J18o2m4J15k33J91J65Q8m02L82l98N5p8J01Q3R4j05j59
$$ y = [-92, 150, 231, -128, -71, -304, 372, -27, 51, 249, -168, 85, -31, 133, 190, 71, -165, 32, 180, -26, 18, 416, -52, -131, 23, 107, 78, -106, 7, -33, -279, -36, -20, -157, -58, -136, -275, 92, 72, 277, 148, 263, 11, -4, 64, 134, -145, -97, 3, 18, -24, -64, 112, -108, 103, -195, 35, 77, 34, -92, 128, 140, -52, -303, 60, 155, -119, -254, -27, 295, -76, -105, -238, -15, -141, -176, -97, -52, -42, -118, 39, -227, 118, 48, 150, -164, 169, -219, -116, -68, -1, -273, 248, -114, -51, -38, -221, -39, 64, -46, -217, 5, 91, 207, 70, -61, -297, -121, 94, -103, -22, 198, 171, 52, -80, -101, -81, -18, 72, 101, 116, 82, 172, 9, -62, -42, 325, 59, -130, -6, 4, -113, 127, 240, -39, 161, 91, -41, -119, 200, -38, -76, -176, 27, -192, 33, 142, -106, -137, -194, -291, -92, 215, 312, 129, 277, 60, 36, -68, 72, 17, 37, -69, 244, -164, 263, -80, -107, 11, -51, -95, 20, -213, -22, 143, 231, -171, 211, -187, -132, -210, -109, -26, 68, -37, -196]
1248a96L74l53K70k4Q0k53J15j28M4L38k90J86l16N4J2J90j10J89m82K36J64J32
1270B32l6k87l3K17k08J94m6q5rj7J14J83j75j55J49j50O2J82p5l38O26m65J1
1293a09K80k63K41j2p9k04q8O5kJK18M4j17J33o5J78k75l5j40J36K11j33K62l00
1317e3K57k74j0K7o4j59L80j71M7k91K62j5j62J81K07l15K3J08K0J00k5k45J09
1340f3O6OR2k27j17K25j72N3R8J07Q7j19K13Q1l21j9J39j85l1P7N7j47J6K10p5
1365E1j97J34M1K08m07K88J49j94k33J83R9m6N9j80J80l28L41k22m3L5j94K96
1387B0M2N2m6R4r3j11K0O4j38K5Q2o0J2j85p9M57J42o9l10J48o9mJ34m8j94K11
1413I7j42p7J41k12J81Mj59K63J5j85R2J82k05K33j21k97L20n5j93j65J89K5j49
$$ y = [-196, 178, -175, 95, 71, 151, -102, 13, -115, -71, 267, -23, 163, -153, -99, -87, 103, -7, 182, -300, -64, 100, 232, 196, -91, -124, 93, -115, 79, 33, -52, -61, -78, 36, 219, 44, -111, 38, -112, -50, 132, 57, -281, 345, -120, -109, 171, -92, 149, 137, 58, -146, -234, -169, -171, -170, 48, 92, -25, 108, 43, 221, -54, -89, -229, -93, 118, -15, 247, -53, 204, -70, -80, -53, -117, -276, 104, -67, -20, -311, -49, -64, -226, -45, 162, -153, -130, -22, -2, 98, 73, -172, -63, 3, 9, 101, -126, -243, -18, -190, -137, -39, 68, 155, 36, 249, 330, 9, -10, 129, -56, -87, -10, 47, -100, -84, 126, 51, -146, -12, 29, 237, -170, 118, 267, 73, -160, 23, 122, 76, 135, -45, 135, -193, 148, -74, -117, -82, -276, 20, 62, 114, 68, 162, 69, -42, -22, 42, -96, -71, 11, -49, -37, -222, -301, 156, 298, 229, -81, 67, -2, -6, 128, 80, -114, 97, -45, -122, 19, -193, -12, -8, -167, 96, 111, -74, 18, 200, -5, 228, 107, -190, 130, 75, -118, -283, -94, -69, -218]
1436b18J26J85L63l13pJ22j44k07Q6J60Mm42J85R0j73K13q0K04j2o2M1Lm47M21
1460I8PN6l92J46nJ51k3R4P6l46J77L45p08M70j14Oj99K14j05l3K46j32o3j34
1484a68L45j51k26K62k14L73m00K64j91J13k47N9K46m6k32L29J65m87M12j66R6
1505A36k28Rk8K18r3N4PJ5j68P2P5K8j53J07r6K46l66L09j48K63p6k43N5O4K78
1530C37n79L49j33p0J24J12l2l42J68J51q2J29j21j09J67Q4o8r9k15N36l97k11
1552c01L17P2j73J82k45L99k19j19%J75J67j88j32R4J25jl35P4J16m8M5j37J09
1575b3M5J43j40pJ37j34p0K04l33J22JM3l7K9J91l82P3M03m11M%M3P4l4m7J17
1601A1J58j35R0k78M45l10j79J36O1J85j24Q1k67J81kj45K8L88m19L16k95N1m
$$ y = [-218, -92, 93, 456, 143, 136, 258, 114, -93, -7, 153, 157, -285, -100, -10, -183, 30, -50, 154, 142, 80, 121, 124, -323, 98, 105, 161, -231, -85, -90, 61, 38, 132, 208, -138, 39, 384, -324, 146, 32, 38, -161, 53, -52, -85, 161, 29, -34, -168, 177, 26, -200, 62, -152, 221, -179, 85, -106, 7, -240, -181, 65, 19, -213, 116, 281, -206, 206, 40, 136, -92, -83, -111, 107, 14, 68, 75, 90, -78, -6, 69, 97, -56, 51, -45, 201, -165, 144, -4, 259, 183, -60, -5, 59, 337, -242, 107, -26, -96, 28, 140, 108, -234, -66, 85, 3, 132, 11, -98, 69, 153, 85, -14, -229, 307, -90, -301, 16, 88, -85, 97, -148, 251, 32, -87, -87, 88, 255, 67, -65, 29, 154, 153, -182, -108, 8, -40, 5, -132, -23, 22, 165, 25, 18, 155, 21, -49, 155, -178, -56, -55, -12, -49, -20, 171, -211, -138, 265, -146, -142, -142, -99, -25, -59, -106, 11, 169, 34, 124, -154, 291, -19, -198, -62, -1, 184, 60, 141, -126, 55, 53, -92, -64, 324, -95, 221, -74, -23, -27]
1624b7R2K0k32Q0j47L13J32j12j7k34J67k31L83j23j19m0O0L93l50k2k2M0J24
1647A28l2k61K10n7Q4Jj74K14r0K32l86K13j18N7J15l17J74o1J66J15k92J42j47
1670h4J61j65j57K65m2k9j77M65q0j27j25k2J58k06J95K11P3m01j84L59r9q3j97
1693b91J81r0J33K2K14j23M3q6J4K28m47M8L23r4J4j77J69j27j04K51K41n35J37
1716e6Q1l1rm0J97Po3p1N6L4k07J15J0l2K57j62J57k39K59m1q4N9j33P8N5l06
1742a09J59j98J25p5j2Q4k06M38m9k20L8K74j06m16L92j17o2J28r8p0J09p0j94
1765b55J61O8j10R9J63n1k56M1J06L24k55o8j30P6J12N9p7j34L43l18j2P4k02
1788b42L75j71J28J45n79K87j03J04K35l42qQ2J75Jj55M2j47Q2J05j5P7m23M82
$$ y = [-27, 65, 85, -147, -67, -214, 99, 231, 119, 102, -132, 35, -196, 187, 64, -55, -95, -35, 358, 8, -14, -36, 4, 128, 96, -165, 45, -12, 72, 73, -101, 113, 23, 255, -131, 82, -36, 21, 136, -181, -7, -68, 98, 213, -79, 63, -84, 77, -88, -245, 20, -22, -51, -228, 237, 157, 30, -95, -117, 41, -165, 30, 241, 314, -87, -271, 88, -11, -94, -291, -110, -200, -67, -45, 169, 46, 89, 3, 17, 245, -202, -154, 169, 75, 89, -88, 81, -46, -150, 101, 342, -193, -56, 25, -6, -15, -55, 142, 149, 86, 15, 71, 105, -102, 13, 23, -9, 248, 86, 243, 4, 263, 222, 138, 197, 64, 142, 197, -109, 50, -148, -23, -98, -110, -26, -232, 206, 157, -63, -25, 249, 143, -273, 119, 2, -60, 68, -30, -100, 9, -61, -255, -94, -26, -136, -37, 126, 75, -181, -140, -34, 290, 35, -33, -163, -87, 25, 84, 7, -127, 216, -102, -114, -40, -242, 133, -38, 90, 235, -344, -57, -160, -56, 179, -163, -171, -89, 86, 87, -68, -26, -173, -91, 14, -1, 76, -347, 135]
1811A35r0J54j76o6m2K09n1l6J38l09J79M9K03l34j96N66n02P4L68m77K51j61
1833a14L67m33K24P1M8p1J05q9m95N08l3K4J5j33p7j48K04J92k76M0j36L86P3
1856B52K0l69J16K3r8K7oJ24J24j17P1j02j15K76j75M7l02K05L2O8j46K46j37
1879F4J64j49K61m26Q8j16J81j23n2J83k6m2k0n9k15K51j3P2k70K70J76k4j07
1902F8n3k52M27n3L1k42L6j45R8J52QlJ01P3k46J9l6j44N6OM04j43J06m00K6k0
1928a26O2r0O6M8O1k7L2K67l08P6K97l11j76j34M45k86K11M4j00k44J97m7K5j58
1952a76K81p3L3k18K80j71J57k09J42j50J23K0R1j15j87p1M18l03O4J67k35M2
1974i0j00R3J41r9p9k6K63j79R3j65r2K26j7J55l6Pk22J5k4J87k1j54J33J92l78
$$ y = [135, 45, 199, 23, -43, -85, 124, 73, 37, 175, -134, 45, 94, 297, -37, -233, 333, -169, -95, 273, -204, 47, -114, 253, -180, 44, 115, 163, 92, 197, 108, -387, 121, 88, 112, 127, -6, -83, -231, -27, 165, -111, -71, -207, 179, 252, 272, -97, 19, 42, -56, -29, -35, 89, 213, 96, 167, 65, -50, 226, 51, 98, -204, 1, 33, 101, -45, 201, 64, 228, 79, 340, -86, 2, -114, 67, -56, -108, 75, 49, 7, -13, -72, -287, -36, -49, 23, -247, 23, 199, 175, 68, 15, -237, 190, 137, 168, -74, -38, -183, -85, 67, 75, 72, 173, 246, 0, 19, -17, -161, -105, -99, 305, 162, 268, -132, -106, -126, -64, -154, -88, -40, 21, -6, 26, 293, -15, 61, 358, 47, -129, -263, 182, -104, 107, 151, 51, -193, 4, -43, -18, -176, 105, 32, 65, -153, 127, -44, 113, -96, 46, -104, 19, 39, 130, 15, -172, -243, 175, -128, -64, 103, -132, -90, -190, -97, 44, -55, -134, -160, 103, -76, 17, -148, -240, -14, -31, 124, 88, 95, -127, -112, -136, 51, 30, -124, 9, 201, -177]
1999a77J21J38k58K42j31Q8n0j13J62k87J98J62j35K5j29K27j75K08j50j76M85
2020B75k20J06j49J87k85J41K91m34K29j02pK43j50k27R9J07m1j45J08k07K83
2041A02J82k60j78L9M4J66L8j77J3N2jr9p1L28M8%Lk46L08l74q2J62j47L61k40
2066b9m2J06l17K87O5Kj57O3j62L61J24o51L08Q7j67p7M24k61K26o4j76J87m11
2089b74K92R2o3l10K07n2J33P7J53m18J93N3j9k2j28J72p2kK4k40L50k47r1K45
2113E3l11n1N70k48k32J95L6lNl4K96l11n3J6j50M6J2K82k2j85Jj18J65q0K31
2138A10R6j62o9q6R0m7Q6p6M7j70J79k83L04J0r3j45P3L13k23J43l69K21k70L50
2162B9j73l8K5L09K06m72KK43n36L21j55kM25k63K16l29K04p5K77j79L21l37o8
$$ y = [-177, -56, 82, -176, 66, -65, 23, -27, -140, 22, -265, -67, 95, -40, -15, -144, 83, -92, 116, -34, -210, 275, 55, 161, 12, 199, -86, 55, 346, -88, 141, 39, 32, 275, 125, -102, -3, 104, 63, -82, 26, -181, 102, 284, 24, -154, -115, -71, 95, 133, -44, -31, 21, 20, -79, -150, 178, 226, 226, 229, -17, 291, -83, -165, -3, -150, 211, -29, -71, 35, -282, 5, 70, 72, -85, -22, -184, 177, 301, -350, -42, 45, -122, -199, 225, -36, 190, 126, -50, 137, -274, 18, 110, 47, -263, -56, -108, 25, 102, 255, -163, 30, 83, 64, 42, -86, 86, 14, 12, 36, -204, 146, -101, -192, 53, -258, -309, 261, 13, -219, -24, 12, 9, 14, -20, 276, -35, -88, -72, -222, -176, -164, 118, 96, -89, -88, -206, -41, -121, 110, 206, 44, -25, -111, -21, -68, 18, -58, -11, -181, -2, -285, 19, 29, -64, -209, -136, 177, -46, 97, -272, -51, -321, 29, -144, -182, -157, 152, 358, -114, -112, 131, -405, -84, -239, -241, 184, -79, 137, -192, 12, -63, 214, 35, 356, 19, -49]
2185d9o0R7J32j21J16k61J59K50k86O8k16k76M70J05L0k44K20j35J8P8J03j69
2207B9k39J54J20m4k10K08Q9n81O47l82J27Q7k10K63j21K41j85K35k87l9M14k39
2229G7j56q9L03m75L01K04n2k06p7K53k24K28o2j93j22L68j89J60lj83j0O7Q2
2252Br3J16L1j02K7o3R9j73J13n8L83l64q3L13m00K63l9p3J74M0k05p8J27Q3k2
2277A8P0m47L75J37l8k73o1L63r3k66L16N2k95K37P0J8k82m2q9L3M25o0j55l0
2301a7q0j80L04j75J07k2J41j70Q9Q7k27J16m0K70l3j07L3j91J62K7p4Km7K67
2325B42j34o9J15M4J53k34j10k2k06M19j69P5m2k4j94J39r5j01K18j37M69l30
2347GJ35J82l93K61j62j24K17j21j33J66j24P2l26L1K39KO3J32k29L44j5q1J44
$$ y = [-49, -109, -12, 120, -1, 115, -146, 13, 263, -23, 45, -171, -447, 23, 128, 158, -86, 134, -1, 17, 95, 198, 29, -210, -56, 64, 20, -190, 18, 107, -474, 173, -209, -82, 5, -205, 58, -63, 178, -7, 228, -59, -98, 316, 77, -79, -168, 135, -340, -39, 165, 113, -93, -170, 83, -141, 87, 25, -168, -290, 78, -111, 49, 46, -137, -147, -80, 2, -91, 25, 56, -46, -19, -82, 17, -156, -43, -101, 282, -82, -165, 148, -252, 11, -28, -101, 73, 113, -92, -170, -43, 40, 18, 88, -359, 16, 153, 115, -158, -219, 144, 51, -215, 101, 153, -142, 95, 165, 183, -99, -141, -230, -197, 228, 168, 13, -17, -97, -277, 27, -148, -41, -63, 78, -92, -3, 84, -143, -27, -67, 203, 170, 63, 96, -95, 67, 94, 20, 22, -25, 242, 108, 39, 154, 198, 351, 117, 7, -15, -221, 198, 29, 104, 62, 38, -156, -17, -112, -213, 5, -132, 337, 7, 142, 324, -69, 192, 30, -94, 123, 2, -131, 35, -89, -17, -343, -312, -73, -71, -8, 124, -105, 239, 224, 143, 287]
2370B87r3j93J38j86l80N44l2M1k65L85l53K16J54m09k1J43j66K54m3J24j86p1
2392a12Q8l06L00K7j3K12Ll82L13K37m99J34L3r1K5J21j44K64j57m1o2K7K54j93
2416C8K46j52J7j19k49K92o2l07K73J23j31m8K76k15k07K97k22K51r1K13n8j97
2438c2M4M9j03N9k19LJ96K9K54k18j60J91j59K16p7k71L14M5j95L24n32K45K9
2461C2j13m2J71p3l6P2o6j47J32j51J85k5O9K06r0k76L69l11M45k40m0j31K24
2484A64k99j49K59N6O3l02N38k35Q8j81j22l1J05J28k41R5J91j43p8K26r5p0j11
2507a44q6O4M12l31J15j51K3oo7O1L3J09M0j31L37k49K9j98L41J08n93N25l29
2530h8K43j01j69O3L05l76L73l36j25K55j34J07N9j38n6J54j84L02j61l5J76k55
$$ y = [287, 194, 1, 139, -47, -427, 117, 85, 126, -139, 246, -107, 109, 263, -146, -167, -24, -190, 64, 21, 145, -41, -112, -24, -330, -30, -3, -16, 196, 199, -183, 130, 367, -132, 2, 35, -56, -31, 90, -54, 210, 53, 12, -50, -23, 231, 38, 284, 132, 149, 30, -219, 73, 11, -296, -23, 100, -31, -79, 197, -18, -225, 72, -150, 101, 10, 223, 165, -32, 12, 61, -42, 17, -202, -199, -3, 26, 280, 62, -98, 93, -66, 150, 73, -198, 116, 161, -34, 290, -242, 3, 32, -81, -123, 48, -25, -61, 11, -55, -202, -70, -221, -36, -61, 8, 214, 124, -152, 217, -94, 351, 111, 71, -60, 164, -135, -284, -25, 31, 94, -208, 330, 95, 183, 2, -120, -151, -46, 82, -159, -64, 127, -16, -94, 132, 37, -33, -144, -230, -166, 246, -85, 30, -121, -98, -104, -171, -110, -77, 32, 72, -59, 278, 29, 58, -140, 201, 309, -284, 241, -88, 155, 54, -115, -52, 253, -123, 250, -86, -211, 44, -90, 17, 76, -62, -118, 36, -148, 154, -7, -42, 134, -121]
2552a21q0J68p2J82lj51mo7L2O3j22J18J80o7P0j79J71j41n3Kj50K39j22j32K34
2577ek22K02n7J25r0Q3j40N9N5L4j1k7j5m1J30Q1r0J02j18l8O6k0j99K18k0ok
2604E4J7J02l38J38K97k28n0J32l13M89J5m15P3j16K36Lj62j06L2NJ58J80m40
2627b37L48j64j4J82r2k2Q4m60N02l81J89R1j11P2k01R8J96Q5p7m4k28M66k17
2650F5k93M03r7j35j78K51K65m16K98q9j04L0K3j71J50O3j19J38k46o3K2K34J9
2673E0p8L23l70N3j10K25p6j04j14O8J48j99K49J32m11M4J50j58K23m2k7K33k10
2696aj18J86k85K95m5J3K8j38n1J82j42K01m8j74J40j72J01J30K55l52k04L60
2718A61j32j36J28N6Q6q0j43J12M8Q4L3l39K35j34J2L79n52k92M45J5N9j50J0
$$ y = [-121, -201, -33, -105, 77, 74, -77, -81, -148, -116, -53, -175, -57, 123, 56, 126, -53, 118, -23, -76, -74, -224, 15, -107, -239, -5, -227, -25, -82, 43, -47, 36, -104, -45, 10, 44, 33, 6, -9, -50, 80, 161, 71, 173, 55, 17, 83, 63, -136, 82, 62, 56, 54, 71, 173, -165, -27, 270, 42, -8, 124, -189, 300, 315, -100, -27, -143, 93, 96, -66, -172, -140, -135, 23, 203, -237, 111, -53, -67, 115, 23, 1, 85, -375, 127, -254, -65, 26, -85, -13, -214, -116, 80, 165, 88, 44, -184, 282, 65, -228, 175, 78, -57, -235, 16, 281, -135, 163, 74, -30, 0, 23, -148, 2, 65, -54, 84, -162, -225, -203, 31, 50, -28, 295, -75, -22, -132, 93, 17, -87, -201, -133, 15, -184, 65, 197, -214, -170, -20, -178, 45, 3, -24, 209, -1, -119, 67, -218, 77, 32, 45, 73, -65, -116, 66, -76, 125, 77, -97, 43, -129, -28, 102, 357, 5, -199, 161, 29, -107, 21, 77, 163, 83, -60, 52, 100, 184, 217, -122, 113, -21, -9, 370, -182, -474, -29, -14, 45, -105, -95]
2741i5j41J62J55J2k4n5J26j96M3rj00J21j15K1L95m04O9P2p8J41n4j09l1O3J42
2766A11k15J54j14K84m75L14j5k6K53l32J32q3j0q8M47k94j59K58k55J10J18l58
2788b43K35N21n62P3k15RJ38pQj27o5K87j48j50J56K25J3J51k37l5j00J01k1J14
2812A21j17J0j42K31M3O1m2P3q8m3j01L5j02j7k0K2L37j22Kl37J96K6r0J88j31
2837gJ36j52n0KJ31k25K01j46P7m6J26j93J98N7j34kk9L0J00N3k52KJ21L0j71
2862a43QJ69k36O4J9N9K78l76J01J60l2k26q1Q7K42L8L8k71J80O5Mp3n4J06j7
2887A09P2l15J60K3j91K68k59J62J46j48j76n7K44Q6j56K55l19k5p4J66j68J14
2909h3L92m01J38j7j34l62M14R7K5jj31O6J27j61n1J82j15j77N5L10rj99j84J90
$$ y = [-95, -236, -74, 81, 93, 69, 14, 140, -56, -13, -22, -122, -1, -116, -95, 300, -104, -35, 37, -41, 100, 46, -63, -94, -31, 111, -104, 50, -64, 220, -255, 59, 44, 18, 271, -61, 71, -12, -22, -110, 337, 43, -116, 142, -113, -3, 115, -243, -8, 513, -49, 24, -191, -182, -44, -51, -43, -170, -235, 52, -96, -246, -90, 135, 148, 299, 62, 27, -73, 28, 7, 121, 4, 14, -128, 103, 146, 207, 165, 238, 150, 107, 6, 41, -61, -78, -98, -76, 261, 139, 141, -196, 0, 26, -64, 124, -7, 129, -23, -73, -71, 60, -165, 36, -110, -33, -79, 47, -146, 52, 109, -25, -27, -56, -26, 74, 127, -125, -123, -2, 28, -143, -135, 34, -202, -138, -119, -60, 218, -158, -57, 103, 71, -155, -236, -149, 93, 131, 169, -102, 78, 143, 147, 74, 20, 126, 109, 181, -134, 26, 49, -142, 126, -133, 29, 175, 27, -149, -206, 38, 124, -32, 223, -96, -121, -195, -29, -197, -83, 309, -92, 46, 29, -105, -467, -53, 44, 69, 68, -63, 3, 130, -31, -82, 100, -15, -192, -137, 173, 164, -35, -219, -29]
2933b9j40Q9J56j97K90k40K37o1r3J10j09M12n86j13K27m5O4kK58j47J87k87Q7
2956F8K62l75J8J17j82J10k80M81j91K75j88j23k87K28r9m3O8J3n3J61L1K08j96
2979B3N5j61J61l75N18Lkl15O9j9Q4r6j98k2L37j00q2n2K47k18J83J0o6J9j01
3004i8P5q1p5P1J94j34L70m20n1J20K06j63J84j35n5j41j10J93Q6K6k3Lj2J48
3028A78j2k54n9K09m5o0J32l49K91j20J82j4k63l0M47l52n2q2K30j16J33J81k84
3051a09o9%K79j58J56j39j9M9QP6j83mq2K88q9J11k12J95j68R8j55P8J76N7k73
3076h9K43%k09j68J18j54K56K19l09LK47j50k00J10J08L21n04O3J92o3k48O1K01
3099D8o3K72k82J22j88J51j74j38p1L80M9K08l76j48Q8M34m22K40k0J79l90k44
$$ y = [-29, -169, -80, 76, -121, 169, -71, 166, 105, 12, 122, 13, 425, -161, -274, -47, -92, -28, -30, 228, 81, 268, -19, 68, 330, -45, -27, 90, -92, 18, -262, 219, 28, 303, 115, -8, -295, -67, -166, -209, -141, -128, -181, -20, 11, 219, 23, 78, -83, 78, -297, 221, 224, 222, -93, -24, -43, 41, -55, -253, -275, 62, -38, -120, -172, 75, -143, 40, 50, -16, 3, -98, -23, -104, -179, -108, 86, -48, 322, -98, -149, -29, 177, 14, 198, 63, 8, -133, -243, -50, 36, 62, 39, 42, 30, 178, 166, -88, -147, 62, 17, -43, 89, -260, 31, -89, 93, 79, -184, -214, 233, -119, -171, -253, -23, -139, -6, 175, -109, -178, -178, 101, -57, 99, -40, -59, -10, -2, 74, -109, -113, -195, 93, 4, 115, -97, 98, -70, 28, -127, -49, 127, 184, -89, 154, 154, -55, -223, -105, -259, -3, 216, -93, -90, 157, 7, -193, -83, 25, 346, -158, -95, 97, 34, -214, -153, 48, -15, 257, -25, 97, -91, 60, -114, -252, -323, 57, 106, 314, -62, -210, -122, 312, -110, 130, 110, 289, -101, -345]
3121c45N13O8j84k09M6N0J25Q4l6k66nJ00L8r7J29R7M5J92k10j98k02J61L95j82
3145A09L3J32l02K66l78j04K35J88m03K65r2K54j41L2J51m19K61j49l42J79K26
3166AJ00r7j25J7K87m2j45k07K54M3N1l61L53j56K58j58J71l47R7Q8j64J72l9
3189E1L1q6J89k46m0J36p2k0p2P4J16j33K10k81q0P0L52k56K32O7k48j85L60k66
3213i7J67J72j35j16l1l3R1J29k32j67L94l8k02J75j35K15l01L39k11k94K03L31
3235B24p0k68L44k14j31J59l37J97L7O3N3J07L7l5k45J25o6r3L4k3N1L87n51M16
3259B01l05K1O1Q3L03l41k22L46j75J71l26kJ34K46k56k25M49j67o9O5J74l60
3281a94M5L13PQ3k8l2k56O3q9J31N3K42k59l6o4J92l03J81j17K85l29O8K83L5
$$ y = [-345, 168, 236, 52, -157, -111, -61, 64, 148, 112, -154, -159, -59, -21, -118, 11, 108, 153, 345, 135, -63, -265, -104, 291, 109, 142, 274, -28, 238, -140, -244, -9, 179, -224, 41, -51, 203, 62, 94, 245, -174, 87, -62, -404, -225, 1, 101, 4, -121, -104, 183, 141, -4, -211, 43, 86, 137, -224, 129, -27, 231, 73, 244, -103, -6, 82, -82, 90, 51, 82, -4, 185, -61, -101, 35, -37, -57, -129, -55, 61, -72, 138, -143, -223, -153, 199, -57, 175, 242, -6, -191, 169, -97, 70, 242, 107, -9, -40, -73, 18, 147, -85, -252, 142, 104, -98, 77, -58, 157, -144, 195, -16, -310, -107, 224, 154, -114, 230, 16, -115, 44, -293, -96, -59, 4, 57, 164, 201, 166, -79, 46, -20, -113, -79, -102, -51, 336, -215, 201, -104, -83, -22, 61, 364, 23, -199, 147, -28, 143, -183, -185, -51, 195, -61, -286, 163, -4, -73, -8, 166, -194, -149, 164, 171, 254, 226, 194, -62, 1, -88, 43, 96, 338, 79, 43, -21, 171, -132, 49, -68, 217, -112, -44, 239, 274]
3305B74m40J25L4l6L04j24k5k31K20kj21Jk60L5K58o8L8K0J64j68NK5K20r9j89
3330d0O0k66J65J39j77K00j5j84j4N8q5k22L06K34j83J3P8k4J94j54j21j08R6
3353e0N0J44k74P8m4J91j24J94j11k38L10J16n5n17K62J6J72j88k04K42J51j32
3375a1j28J49K37m12pK25J02k50P4k36m0L78K78j94j76k63J90J78j4k20J94Nm7
3398A2j17J66j37K41r3j0K5Q1j87Q4k28J9K76k44R3j0j74L52m3k12L34n09K03
3421g8l7K62N0k63j1K6Q4j64K70j08J89l68K26r5m9N4J62Q7k11k0K62%l48K4Q7
3446C1r9K80k08q0J34m4J7J7j1K4Q2K51n34M0J51r9K21J20j48n7m3l37M94Q3j34
3471A51j90J03j62j77M47k8j20j31K15M3j06J66r6j82J05j5L6j57P5%j02Q7R3
$$ y = [274, -166, -41, -7, -43, 261, 137, 112, -119, 101, 99, -22, -21, -281, -246, 12, -56, -18, 2, 166, -2, 3, 28, 248, 149, -40, 20, -246, -81, 58, -119, 81, 66, -118, -132, -74, -159, -381, -75, 159, -24, -11, 67, 43, 237, 83, -38, -146, -50, 0, 144, -130, -52, -96, 95, -29, 165, 54, -184, 126, 242, 187, -330, -68, -52, 120, -68, -272, -30, 121, -11, -139, 10, 247, -165, -172, 53, 155, -95, -21, -257, -297, 81, 359, 165, -11, -274, -84, 94, 80, -140, 54, 59, 12, -105, 61, -76, 165, 72, 62, 87, 168, -19, 65, -163, -144, 132, -112, -19, -29, -203, 149, 106, -106, 228, -281, -78, -115, 147, 197, -66, -77, -51, 33, -131, 139, 31, 220, -148, 78, -17, -66, -12, 150, 237, 26, 6, 268, 268, -80, -56, 31, -68, 212, 4, -76, 58, 14, 31, 48, 37, 61, 143, 394, -140, -100, 51, -48, 173, 293, 145, 88, 45, -292, 202, 285, 151, -39, 64, -98, -275, 172, 144, 24, -107, 108, 151, 45, 211, 115, -67, 38, 23, 59, -98, -23, -23, -125, -38, 55]
3494E5j15K36N7k25m2O9K7k49K96j96K19l35M8L08j42K21k62K05j9r8Qj53Q6j51
3518a52K0K91Qj86O1K78k59j13K02j01m0Q8j98R4Q0o7Q2j45J13l7q2n6K53j67
3542c3K41k59Q9J27k80mK06Q9o1k98K85k05K99l77K19j63K06k49o5L73j35q9J96
3565A12r3j49J91j05J6l04L37j38J52k60M84j87pP1k75K77p2l9J31o2r9j76L69
3588A74Kk47J02n4k03QK61J15O8m12K43N0j96R6j1j50j63J38J33q8j9J91j5q5
3612f2n9J16m4R9P3j67K00Mn2J75k06q1k35K76j09n6o6K38K8j31o2K71k56RL24
3637B27l70K23P3j65K2l8J29k03L03l20QM34k95l1j37R8m8K06L0j72L7P2k81J57
3661d1K2M39k47l85K00j69J53P7j54K27j93Q9O6p8j34L35n9j11K65m07K12l08
$$ y = [55, -60, 176, 233, 8, -34, 35, 62, -187, 109, -87, 132, -203, -155, 153, 11, 232, -30, 175, 156, 58, 66, -87, -1, -152, -132, 159, 167, -19, 42, 320, 61, -52, 150, 49, 9, 97, -101, -7, 73, 6, 88, -57, 56, 19, -63, -119, 134, -33, 208, -51, 38, 165, -115, -119, 87, 176, 115, -183, 102, -103, 196, -181, 38, -125, 81, -168, -233, 140, 5, -84, 112, 19, -130, 61, -44, -28, -332, 5, -133, 19, -241, 243, 56, 49, 120, -155, 122, 50, 11, 142, 80, -19, -195, 174, 176, -71, 31, -23, -226, -218, 43, 158, 226, -186, 57, 107, -89, 7, -4, -154, -317, -179, -46, -134, -153, 38, 23, -62, -121, -5, -49, 50, 123, -44, 156, 160, 108, 283, 77, -4, -239, 37, -72, -128, -194, 44, 72, -59, -121, 150, -106, -97, 227, -143, 80, 153, -12, 10, -28, 101, -102, 201, -119, -111, 323, 28, -3, -140, -42, -90, 116, 146, -26, 11, 83, -198, -41, -19, 420, 173, -212, -12, -181, -28, 49, -105, 122, -71, 18, 84, 6, -128, 207, 148, 37, 302, -105, 107, -201]
3683b01L81j92L4j83R0J84j48J43j10J10j57j89J73J0Q1L6j19J57j64J11J60k03
3705Dr2K5k11K51n8j57K85j56J07j5L5p8N6k7p7O9K58j72n6Q1l27K50N3j06J49
3730I1j72q5J35l97M81j77K47jp3l03L09j97K44j55K9L7l1J16lj70l9J88j5j93
3754a34J43j45j6K30k14j10K02K9j14J81N6q4J19k54K78K16k77n4l7N6j79R3p2
3777h7J91J90j85l24R5l1K67Q7k53R2q2L5j9L3L5j66J31R7k70K74Kk56J43j32
3801a33O8nJ63j75k9K63j14N3k41L07k93L38k88j22J63J32K48m39nN0O0j97J29
3824f7j13J02m3L21N4j91j80N3j60J0M18j24J37l61l3J29j5N7K24j66j09K52q4
3847A11J81j54k18K00k52K48j76P7j32L10k78J2K31l62o6O5N62o55J45J10R9j59
$$ y = [-201, 180, -12, 22, -161, -71, 113, -35, 108, -2, 108, -49, -238, -65, -55, 26, 62, -57, 100, -64, 47, 207, 4, -88, -63, -274, -23, -81, -238, 47, -109, -2, -17, 18, -60, -4, -31, -108, -39, 219, 47, -9, 72, -255, -5, 48, -58, 91, -81, -166, -31, -428, 53, -124, 123, 122, 49, -254, 55, -142, 102, -53, -24, 13, -18, 98, 95, -75, -114, 74, 59, -134, 9, -136, -152, 78, -136, -246, -44, -15, -129, 52, 108, 24, 143, -111, 167, 383, 106, 52, 15, 71, -108, -15, -87, 104, 294, 109, -215, -120, -151, 116, 203, -50, 42, -40, -5, -24, 9, 44, -122, 9, 106, -164, 110, 112, -144, -1, -133, -65, -70, 93, -82, -111, 152, 38, 91, -150, 157, -136, 202, -86, -208, -45, 87, 335, -104, -109, -59, 1, -196, -67, -180, -78, -121, 200, 254, 63, -117, -64, -224, -214, 204, 80, 217, -144, -177, -48, -63, -6, 218, 52, -57, 195, 111, 292, 138, -80, 120, -132, 116, -60, 17, -115, 195, -83, -71, 160, -202, -268, -203, 359, -296, -151, -41, 58, -101]
3869a01j24L87j57J86l12K40j65j19L7J52J5J51j06j16N1j2l1K23m18K03P0R8
3891A52k14L2k8j59J77j72J47j1J34l15K30K98k3m8j00l3J73o7k86L8L0o1N9K09
3915A62k16J3K05k69l33M66q3J74K4r0j07J45n4r6Q3o1K17j96J43O9m0j74K03
3938A85k55Q8P5j88J23j15J3L47l50K2JJ39p5l8rk3p2J24R2l41M32j20j91l9P5
3963a00O3J57jl55JK23J32k83L43k94K00n19K16M69k78J36j78J08p3k6jj2J71
3986I9j06J10q4KQ1k71J80k32r9M37j09L8J57k34j17j18K77Q3m14M99l53K26L6
4009H8o1q5j88K09K31k81J27L03k08n55L93j96K58M4j81j19L05j4J61m05J52l1
4031e3J50J04j21K12m18j39L55q4l4M0j17K41j24m2r0j64N79j0k31Kj60M1j46
$$ y = [-101, -225, 162, 5, 191, -121, 119, -46, -165, -128, 24, 39, 190, 84, -32, 19, 7, -24, 199, -219, -16, 54, 152, -62, -30, -58, -217, -40, -212, -65, -76, 58, -257, -27, 271, 248, 200, 100, 67, 240, 173, -113, -75, -45, -106, -47, 162, -54, -41, 164, -105, -438, 28, -55, 119, 143, 53, -54, 91, 37, -59, 24, -37, 180, -16, 127, 196, 156, -18, 185, -70, 18, 93, -95, 28, -87, -74, 273, -77, -55, -54, 85, 10, -28, -37, -60, -132, -8, 84, -257, 175, 55, -136, -175, -100, -37, 120, 119, -236, -235, -12, 120, -163, 180, -114, 86, -433, -217, 252, -26, 110, -68, 40, -33, -59, -60, -72, 99, -7, 103, 19, 21, 102, -169, 11, -221, -320, 117, 8, 46, 203, -31, -148, -266, 11, 94, -320, 179, -174, 52, 88, 27, -58, -246, -37, 194, -87, 40, 343, 135, -420, -27, -223, 35, 79, -102, -221, 84, 70, 231, -174, -22, -53, 97, 201, 80, 292, -126, -265, 90, 6, -28, 12, -105, 136, 12, -30, -120, -284, 295, 285, 54, 56, -104, -63, -209]
4054b09Q8n6j6J89J88j47J04k86J89L60l79L38l30j11L30k63P3q7J21J50l28o1
4076a43M46m31L37l93K03k49L46r1j7L12j49n2m01L43J20n29M16M1l59L48k73
4097a75K02J02j81q5n6M0O1j35L15j87R1J11J15k3k43J26l28P0J58j53P1M85l36
4120D5LN5p7Rr5J57l59L16p6j49k9k9J79Q2O2j40j09L29o0j93J47q0j7m1j6L08
4146B22m52L23J31k53Q0p9qK47j78K0o4Oj23K25J40j36N8l22L70j45j82P9K46
4169B05O1j90K71l09p4j11J35N2k06K54J3k20J80J91k00j14o1L11k30l8q0L73
4191B13k22j19J51j73L3K00N2q1k23K00j10J48J03k9k02M7j1m0j0J76j73m2k2
4214a34L94j98J85j67k38L65l57K08M7k0j22J71n65J66K43M60n19Q7j17J25k70
$$ y = [-209, -121, -177, -193, -4, 184, 37, 141, -145, 44, 404, 25, 363, 33, -78, 252, -11, 62, -25, 96, 246, -82, -143, 303, -128, 209, -184, 19, -230, 116, 25, 8, 320, 171, 119, -282, 61, 181, -348, 68, 109, -250, 98, -175, 27, 129, -52, -137, -193, -153, -92, -227, 88, -99, -8, 103, 218, 195, -48, 78, -250, -180, -22, -175, -104, 381, 45, 48, 103, 26, 35, -60, 97, -262, 54, -22, -171, -200, -229, -50, 32, 94, -46, -155, 174, 114, -79, 68, -12, -29, -70, -86, 222, -230, 93, 224, -29, 51, -28, -36, 211, 33, 53, -11, -5, -128, 97, 237, 101, 159, -163, 207, 62, -120, -41, 205, 266, 76, 347, 38, -36, -147, -12, 40, -166, 88, 101, -119, 61, 252, 52, -62, -123, 188, -42, -80, -160, 213, -9, -128, 23, -150, -117, 83, 135, 54, -169, 31, -79, 69, 172, 143, -59, -12, -23, -63, -73, 103, -70, -112, -134, 260, 62, 247, 80, -158, 207, -150, 58, 105, 85, -37, 134, -431, -265, -22, 438, -81, 6, -111, 14, -256]
4235b56n4K93Q7j88P0p2LK76k04j2J26R7j12k0p7p2k4j45J09R1P6M7j74L87l01
4260d9k6N1N8j41j52M5L21J82l86K7M5m2k51L86J5J91k15j32k5Q8q8L4J62p2L3
4285E9l19J04N3K48n02L54o5n7L57k04K7j28j69L81k03n1J20j8J6k69L37j87o4
4308a80K69n5j72J11o8J3L0j09M9J31N9j3j69q1N9R3J33K5k60R4J81j10q5N8r1
4333h8j85L88j87J42k66Q6K34p9j53L8K64J6l65P4M96l19p0n5q9J09j20J91j84
4356a22K3p0K34n0o3J07q1j58M6M25l37J44O0j68K06l32K65k00K39j3l3k38q6
4379b02K23k3j77J54Q6j16J42M6o9m21L44K37n53N62m1j16j83k15K55Q4j36J80
4401F1N2j20L05l21M2J2j72J35J59p4j1J49l26m5J01r4P9O2j03J97Jl40J42Q2
$$ y = [-256, -310, -17, 70, -118, -48, -120, -117, 159, -45, -57, 69, 166, 54, 34, -43, -115, -139, -284, -175, -84, -8, 39, -135, 252, -49, -75, -24, 34, -107, -259, -214, 107, 289, -97, -70, -25, -67, -318, 68, 83, 274, 59, -73, -98, -10, -98, -64, 98, 26, 59, -260, -156, -103, 145, -357, -3, -68, -125, 232, 28, 55, -73, -242, 139, -64, -115, 5, -13, 3, -266, 71, -116, -180, 89, 34, -138, -27, -95, -82, -52, -161, -112, 19, 78, 65, -104, -185, -126, -33, 100, 125, -135, -41, 140, 30, -55, 3, -88, -273, 115, -72, 70, -196, -110, 124, 45, -108, -70, 194, 210, -155, -81, 415, 96, 26, -29, -118, -9, -129, 62, -122, -99, -169, 65, 15, -48, 59, -22, -180, -134, 291, -46, 98, 158, -10, 196, -136, 129, -71, 168, 155, 122, -116, -202, 21, -2, -179, -25, 61, -55, 87, 133, 64, -357, -13, 224, -329, 233, 192, 76, -107, -322, -67, 17, -119, 61, 113, -7, 298, -23, 19, 31, -141, -6, 153, 79, 68, 217, -109, -154, -53, -147, -68, -6, -109, 88, 89, -251, -109, -27]
4425b7J8n0j53K82j76J11J6j73P6p4L85k32k11K52J58n89N39j98o7L73l64J9K33
4448A48k68J59N8J52q3K6l66M12j03j33j29K21j32p5M04j50j38R6J30l36M64m20
4470f3q6J24J13j52L04n16K31j31j11L60p2p7Q6L25o41K29J54j32J76l6j31j50
4492a96J87J53j91M6j62J04L5M1j60J12j0J70n5n1J5K5J09r0j62M5k93K63M1j2
4516c6Q0j9J37q5P3LM4k5n07L80N0q2k35L05k91J91k19L4J09J81MJ51k14J10k98
4541a59J88k87N7J65J05K41j08O1k21j69n2L29j79J22l6m2k77O7J79N2O3j36m9
4564h6O2l7Lj58J84J87j89m0lJ11J58k18m1l8Jq0n9K93k43L29l34K58j97m4P5
4589a06Q4O8r7J77l67M86k35o5J26k01J22j6N8p1J42j34j46j25K61K98j74j65
$$ y = [-27, -9, -59, -212, 70, -106, 5, 21, -152, -76, -150, 235, 3, -208, 44, 202, -387, 152, -46, -113, 260, -104, -85, 148, -120, 39, 97, 249, 166, 192, -174, 238, 135, 2, -127, 94, -38, -113, 291, 141, 3, 99, 229, -107, 357, -63, -149, -25, 88, -64, 240, -276, -45, -176, -287, 73, 1, -76, 10, 335, -306, -77, 77, -55, 121, 85, -46, -196, -9, 144, -47, -1, -163, -59, -24, 17, -143, -31, -41, 129, 74, 23, 38, 63, 172, 82, -80, -35, -328, -65, -24, -36, 44, 25, 162, 77, 150, 153, 197, 172, -335, 45, 95, 13, -222, 83, -208, -17, -236, -202, -93, 88, 92, 243, 29, 139, -159, 29, -258, -201, -36, 69, 310, 202, 263, 42, -127, -179, 150, -29, 93, 57, 15, -262, -195, -16, 36, 99, -37, -86, -24, -61, -58, -216, -32, 155, -34, -74, -77, 34, 192, -26, -67, -105, -104, -184, -243, 50, -193, 136, -198, 60, -137, -181, -106, -22, 46, -51, 126, -241, 245, 10, -55, 71, -130, -8, -24, 34, -37, 105, -29, -175, -300, -39, 259, 85, -80]
4611h0j05N71k30k43j60K25J05k81L46l01J41J40k56J96o8K74k33k16J83q4K9
4632d7o5J87j98MN0O3j71J10k2J87Lj92K69j20j82J31j10J69J16l77L47J71l63
4655d0J0O2q9J03k84N5J19J44K79l21J85j21j59J12j49m8m9J70o4j52J34L70k66
4678AR2l2Q3rl02K53n0j86m3r5Q3L2L10j29j9j36nM69l22K40l34m0K68l04O5J73
4704F3J30l36PP3K4P6j14J60j4m8J28n7l25K16p9J41M4j43J11j67K17j64J9J45
$$ y = [-80, -185, 386, 156, -87, -247, -22, 83, -198, 148, -153, -12, 128, -128, 68, 0, 274, 41, -175, 8, -76, -47, -112, 75, -123, -119, -69, -6, -177, -67, -89, 98, 101, -91, 178, 58, -124, 7, -103, 66, 182, -195, 152, 323, -40, -30, 32, -57, 46, -238, -183, -64, 80, 359, 38, 223, 102, -57, 55, -94, -142, -191, -21, -85, -237, -103, 267, 1, 93, 61, 144, 135, -167, 86, 36, -150, -193, -288, -205, -173, 137, 8, -11, -147, -152, 317, -5, 235, -99, -139, 129, -175, -110, 63, 193, -143, -136, -63, -39, 37, -77, 83, 69, 21, 149, 92, -233, -17, -96, 45, 89, -54, 57, -110, 107, -57, -38, 107]
$$ [...]
8191F6
##END NTUPLES=NMR FID
##END=
