##TITLE=1H_DE-92K_TFA
 200.13MHz, CDCl3,
 8 sc
 
 29.4.2025
##JCAMPDX= 6.0         $$ Bruker NMR JCAMP-DX V2.0
##DATA TYPE= NMR FID
##DATA CLASS= NTUPLES
##ORIGIN= UXNMR, Bruker Analytische Messtechnik GmbH
##OWNER= pz
$$ XWIN-NMR		Version 3.5
$$ Tue Apr 29 16:25:22 2025 Russian Standard Time (UT+4h)  she@DPX200
##.OBSERVE FREQUENCY= 200.1313
##.OBSERVE NUCLEUS= ^1H
##.DELAY= (6, 6)
##.ACQUISITION MODE= SIMULTANEOUS
##.ACQUISITION SCHEME= undefined
##.AVERAGES= 8
##.DIGITISER RES= 18
##SPECTROMETER/DATA SYSTEM= spect
##.PULSE SEQUENCE= zg30
##.SOLVENT NAME= CDCl3
##.SHIFT REFERENCE= (INTERNAL, CDCl3, 0, 14.3821)
##AUDIT TRAIL= $$ (NUMBER, WHEN, WHO, WHERE, WHAT)
$$ ##TITLE= Audit trail, XWIN-NMR		Version 3.5
$$ ##JCAMPDX= 5.01
$$ ##ORIGIN= Bruker BioSpin GmbH
$$ ##OWNER= she
$$ F:/spectra/data/she/nmr/H-C/1/audita.txt
$$ ##AUDIT TRAIL=  $$ (NUMBER, WHEN, WHO, WHERE, WHAT)
(   1,<2025-04-29 16:23:50.25 +0400>,<she>,<DPX200>,
      <created by zg, POWCHK disabled, PULCHK disabled
       configuration hash MD5:
       00 E9 B6 7A A2 85 ED C7 34 08 36 98 17 FE 4E 26
       data hash MD5: 16K
       53 F0 2D 03 97 EA EC 45 A0 78 9A B0 96 71 44 F0>)
$$ ##END=
$$ 
$$ hash MD5
$$ 61 7A 3A AC 99 1A A6 49 1D 60 31 EB 1F A6 A6 B2
##$RELAX= 
##$RELAX= 
##$RELAX= 
##$RELAX= 
##$RELAX= 
##$RELAX= 
$$ Bruker specific parameters
$$ --------------------------
##$DU= <F:/spectra>
##$EXPNO= 1
##$NAME= <H-C>
##$PROCNO= 1
##$TYPE= <nmr>
##$USER= <she>
##$AMP= (0..31)
100 100 100 100 100 100 100 100 100 100 100 100 100 100 100 100 100 100 
100 100 100 100 100 100 100 100 100 100 100 100 100 100 
##$AQSEQ= 0
##$AQ_mod= 1
##$AUNM= <au_zg>
##$AUTOPOS= <>
##$BF1= 200.13
##$BF2= 200.13
##$BF3= 200.13
##$BF4= 200.13
##$BF5= 200.13
##$BF6= 200.13
##$BF7= 200.13
##$BF8= 200.13
##$BYTORDA= 1
##$CFDGTYP= 0
##$CFRGTYP= 5
##$CHEMSTR= <none>
##$CNST= (0..31)
1 1 145 1 1 1 1 1 1 1 1 1 1 1 1 1 1 1 1 1 1 1 1 1 1 1 1 1 1 1 1 1 
##$CPDPRG= <>
##$CPDPRG1= <>
##$CPDPRG2= <>
##$CPDPRG3= <>
##$CPDPRG4= <mlev>
##$CPDPRG5= <mlev>
##$CPDPRG6= <mlev>
##$CPDPRG7= <mlev>
##$CPDPRG8= <mlev>
##$CPDPRGB= <>
##$CPDPRGT= <>
##$D= (0..31)
0 0.7 0 0 0 0 0 0 0 0 0 0.03 0 0 0 0 0 0 0 0 0 0 0 0 0 0 0 0 0 0 0 0 
##$DATE= 1745929429
##$DBL= (0..7)
120 120 120 120 120 120 120 120 
##$DBP= (0..7)
150 150 150 150 150 150 150 150 
##$DBP07= 0
##$DBPNAM0= <>
##$DBPNAM1= <>
##$DBPNAM2= <>
##$DBPNAM3= <>
##$DBPNAM4= <>
##$DBPNAM5= <>
##$DBPNAM6= <>
##$DBPNAM7= <>
##$DBPOAL= (0..7)
0.5 0.5 0.5 0.5 0.5 0.5 0.5 0.5 
##$DBPOFFS= (0..7)
0 0 0 0 0 0 0 0 
##$DE= 6
##$DECBNUC= <off>
##$DECIM= 32
##$DECNUC= <off>
##$DECSTAT= 4
##$DIGMOD= 1
##$DIGTYP= 9
##$DL= (0..7)
0 120 120 120 120 120 120 120 
##$DP= (0..7)
150 150 150 150 150 150 150 150 
##$DP07= 0
##$DPNAME0= <>
##$DPNAME1= <>
##$DPNAME2= <>
##$DPNAME3= <>
##$DPNAME4= <>
##$DPNAME5= <>
##$DPNAME6= <>
##$DPNAME7= <>
##$DPOAL= (0..7)
0.5 0.5 0.5 0.5 0.5 0.5 0.5 0.5 
##$DPOFFS= (0..7)
0 0 0 0 0 0 0 0 
##$DQDMODE= 0
##$DR= 18
##$DS= 0
##$DSLIST= <SSSSSSSSSSSSSSS>
$$ [...]
##$SUBNAM0= <"">
##$SUBNAM1= <"">
##$SUBNAM2= <"">
##$SUBNAM3= <"">
##$SUBNAM4= <"">
##$SUBNAM5= <"">
##$SUBNAM6= <"">
##$SUBNAM7= <"">
##$SUBNAM8= <"">
##$SUBNAM9= <"">
##$SW= 18.0517328524113
##$SWIBOX= (0..15)
0 0 2 0 0 0 0 0 0 0 0 0 0 0 0 0 
##$SW_h= 3612.71676300578
##$TD= 16384
##$TD0= 1
##$TE= 0
##$TE2= 300
##$TE3= 300
##$TEG= 300
##$TL= (0..7)
0 120 120 120 120 120 120 120 
##$TP= (0..7)
150 150 150 150 150 150 150 150 
##$TP07= 0
##$TPNAME0= <>
##$TPNAME1= <>
##$TPNAME2= <>
##$TPNAME3= <>
##$TPNAME4= <>
##$TPNAME5= <>
##$TPNAME6= <>
##$TPNAME7= <>
##$TPOAL= (0..7)
0.5 0.5 0.5 0.5 0.5 0.5 0.5 0.5 
##$TPOFFS= (0..7)
0 0 0 0 0 0 0 0 
##$TUNHIN= 0
##$TUNHOUT= 0
##$TUNXOUT= 0
##$USERA1= <user>
##$USERA2= <user>
##$USERA3= <user>
##$USERA4= <user>
##$USERA5= <user>
##$V9= 5
##$VALIST= <valist>
##$VCLIST= <CCCCCCCCCCCCCCC>
##$VD= 0
##$VDLIST= <DDDDDDDDDDDDDDD>
##$VPLIST= <PPPPPPPPPPPPPPP>
##$VTLIST= <TTTTTTTTTTTTTTT>
##$WBST= 1024
##$WBSW= 4
##$XGAIN= (0..3)
0 0 0 0 
##$XL= 0
##$YL= 0
##$YMAX_a= 200306
##$YMIN_a= -193067
##$ZGOPTNS= <>
##$ZL1= 120
##$ZL2= 120
##$ZL3= 120
##$ZL4= 120
##$ABSF1= 10
##$ABSF2= 0
##$ABSG= 5
##$ABSL= 3
##$ALPHA= 0
##$AQORDER= 0
##$ASSFAC= 0
##$ASSFACI= 0
##$ASSFACX= 0
##$ASSWID= 0
##$AUNMP= <proc_1d>
##$AZFE= 0.1
##$AZFW= 0.1
##$BCFW= 1
##$BC_mod= 2
##$BYTORDP= 1
##$COROFFS= 0
##$CY= -3
##$DATMOD= 1
##$DC= 2
##$DFILT= <>
##$DTYPP= 0
##$F1P= 0
##$F2P= 0
##$FCOR= 0.5
##$FTSIZE= 0
##$FT_mod= 4
##$GAMMA= 1
##$GB= 0.15
##$INTBC= 1
##$INTSCL= 1
##$ISEN= 128
##$LB= 0.25
##$LEV0= 0
##$LPBIN= 0
##$MAXI= 10000
##$MC2= 0
##$MEAN= 0
##$ME_mod= 0
##$MI= 1.114404
##$NCOEF= 0
##$NC_proc= 0
##$NLEV= 6
##$NOISF1= 3.799351
##$NOISF2= 2.8
##$NSP= 1
##$NTH_PI= 0
##$NZP= 0
##$OFFSET= 14.38212
##$PC= 1
##$PHC0= -1548.4
##$PHC1= 12.59221
##$PH_mod= 1
##$PKNL= yes
##$PPARMOD= 0
##$PSCAL= 0
##$PSIGN= 0
##$REVERSE= no
##$SF= 200.129724274929
##$SI= 16384
##$SIGF1= 3
##$SIGF2= 2
##$SINO= 400
##$SIOLD= 16384
##$SREGLST= <1H.CDCl3>
##$SSB= 0
##$STSI= 0
##$STSR= 0
##$SW_p= 3205.1282051282
##$SYMM= 0
##$S_DEV= 0
##$TDeff= 0
##$TDoff= 0
##$TI= <>
##$TILT= no
##$TM1= 0
##$TM2= 0
##$TOPLEV= 0
##$USERP1= <user>
##$USERP2= <user>
##$USERP3= <user>
##$USERP4= <user>
##$USERP5= <user>
##$WDW= 1
##$XDIM= 8192
##$YMAX_p= 0
##$YMIN_p= 0
$$ End of Bruker specific parameters
$$ ---------------------------------
##NTUPLES= NMR FID
##VAR_NAME=  TIME,          FID/REAL,        FID/IMAG
##SYMBOL=    X,             R,               I
##VAR_TYPE=  INDEPENDENT,   DEPENDENT,       DEPENDENT
##VAR_FORM=  AFFN,          ASDF,            ASDF
##VAR_DIM=   8192,          8192,            8192
##UNITS=     SECONDS,       ARBITRARY UNITS, ARBITRARY UNITS
##FACTOR=    0.0002768,     1,               1
##FIRST=     0,             0,               0
##LAST=      2.2672688,     0,               0
##MIN=       0,             -193067,         0
##MAX=       2.2672688,     200306,          0
$$ Real data points
##PAGE= N=1
##DATA TABLE= (X++(R..R)), XYDATA
$$ plain form
0 0 0 0 0 0 0 0 0 0 0 0 0 0 0 0 0 0 8 -8 8 -8 8 -8 12 -16 16 -20 24 -24 28 -34 36 -44 50 -55 60 -68 78 -88
38 -88 97 -108 120 -134 149 -164 181 -201 220 -243 269 -295 324 -359 395 -436 482 -534 594 -666
58 -666 749 -847 966 -1118 1312 -1571 1936 -2489 3424 -5273 10255 -50793 -121805 52179
72 52179 41953 -14467 112083 93005 -63630 52375 166302 -33623 -107077 101119 49497
83 49497 -186205 -86905 70601 -84479 -152351 12078 49323 -30734 -6237 82585 118386
94 118386 44450 -25903 58675 134752 9803 -92716 7269 44515 -96651 -100402 33169
105 33169 -16099 -106310 406 54007 -39610 -29825 53710 43587 -721 6572 42610 52195
117 52195 18543 -960 25033 34066 -14043 -34031 16767 -2328 -93284 -55765 31887 -29762
$$ packed form
0@%%%%%%%%%%%%%%%%Qj6J6j6J6j6K0k8L2l6M4m8N2o2P0q0R4j05J15j28J46j66
38h8J85k05K28k54K83l13L45l82M21m63N12n64O19o83P54q31R18j016J128j260
58f66J415j596J813k084K430k883L507m425N913q697J5528o1048p1012J73984
72E2179j0226n6420J26550j9078j56635J16005J13927j99925p3454K08196n1622
83D9497k35702R9300J57506j55080o7872J64429L7245q0057K4497Q8822L5801
94A18386p3936p0353Q4578P6077j24949j02519R9985L7246j41166l751J33571
105C3169m9268r0211J06716N3601r3617R785Q3535j0123m4308P293L6038R585
117E2195l3652j9503K5993R033m8109j9988N0798j9095r0956L7519Q7652o1649
$$ plain form
129 -29762 -84329 2720 52814 -3127 -12319 62550 78620 5195 -2294 57171 28791 -36871
141 -36871 -18240 7810 -37301 -71122 -24258 14694 -29172 -44879 17649 32468 -5121 6740
153 6740 41536 36513 1040 -3725 36559 29637 -29954 -20792 24454 -6771 -50272 -16579 18774
166 18774 -24936 -53787 5420 26011 -24811 -9777 41749 23894 -279 18760 34615 22398
178 22398 -2581 -3752 10188 -9811 -35422 -21671 -4671 -22736 -38795 -5784 21453 -11859
190 -11859 -13810 40398 31859 -9415 16335 41002 10810 -11696 2039 12978 -9135 -27553
202 -27553 -11432 -4298 -21403 -26537 -10265 5142 -7207 -18990 13759 28878 -3777 7893
214 7893 42768 18780 -6932 16673 26192 -7418 -24182 -2417 -4545 -34437 -26579 -4523 -14918
$$ packed form
129b9762n4567Q7049N0094n5941r192P4869J6070p3425p489N9465k8380o5662
141c6871J8631K6050m5111l3821M6864L8952m3866j5707O2528J4819l7589J1861
153F740L4796n023l5473m765M0284o922n9591R162M5246l1225m3501L3693L5353
166A8774m3710k8851N9207K0591n0822J5034N1526j7855k4173J9039J5855j2217
178B2398k4979j171J3940j9999k5611J3751J7000j8065j6059L3011K7237l3312
190a1859j951N4208q539m1274K5750K4667l0192k2506J3735J0939k2113j8418
202b7553J6121P134j7105n134J6272J5407j2349j1783L2749J5119l2655J1670
214G893L4875k3988k5712K3605R519l3610j6764K1765k128k9892P858K2056j0395
$$ plain form
227 -14918 -18706 -3518 7321 14497 9323 9896 27485 21567 2289 10172 19201 1631 -15945 -7066
241 -7066 4439 -16457 -27143 -2853 -3230 -22740 -10434 4870 -1183 -5004 3497 16504 13267
254 13267 3084 16412 24431 7025 984 9576 6821 -9867 -19421 -8183 -8020 -27888 -20087 -220
268 -220 -7547 -10773 5275 14417 12786 9530 15197 20479 8269 1624 7427 1612 -8490 -10481 -7475
283 -7475 -4521 -12588 -13578 1428 -503 -11454 -91 8227 627 -3000 4092 10731 3801 -1097 11950
298 11950 11154 -2572 1872 7545 -416 -7653 -7308 -3670 -6816 -15636 -7879 579 -4656 -2702 6034
313 6034 8778 8977 6199 8857 10927 1271 -1833 3023 -3714 -9655 -6624 -4627 -4306 -6780 -2541 6550
329 6550 1118 -2929 7013 7364 -271 -688 2834 3156 -2832 -4727 3547 1565 -5582 446 3231 -1959
$$ packed form
227a4918l788J5188J0839P176n174N73J7589n918j9278P883R029j7570j7576Q879
241g066J1505k0896j0686K4290l77j9510J2306J5304o053l821Q501J3007l237
254A3267j0183J3328Q019j7406o041Q592k755j6688r554J1238J63j9868P801J9867
268b20p327l226J6048R142j631l256N667N282j2210o645N803n815j0102j991L006
283g475K954q067r90J5006j931j0951J1363Q318p600l627P092O639o930m898J3047
298A1950p96j3726M444N673p961p237L45L638l146q820P757Q458n235J954Q736
313F034K744J99k778K658K070r656l104M856o737n941L031J997L21k474M239R091
329F550n432m047R942L51p635m17L522L22n988j895Q274j982p147O028K785n190
$$ plain form
345 -1959 -1775 -652 297 -1825 -5157 701 2576 -3344 357 5172 3129 2592 2083 3342 3437 -3001 -3050
362 -3050 177 -5201 -6497 -3140 -2793 -1432 -1668 1309 7172 2283 826 8025 5618 -747 268 1124
378 1124 -765 -5361 -5737 -445 -3064 -6124 447 868 -1815 1529 2254 1914 1546 796 3594 2392 -1269
395 -1269 1832 2290 -698 211 -728 -162 1 -4291 -3076 -96 -4021 -4469 -1121 -72 536 -48 2546
412 2546 5668 2176 2071 6671 2426 -423 1616 54 -2555 -4104 -4004 -1987 -3971 -4986 -234 -473
428 -473 -1597 1908 1889 2467 3169 1852 4015 2639 -521 2737 1982 -1697 -659 -422 -1446 -1769 -3802
445 -3802 -1917 -1273 -3560 -2186 -589 -214 1482 572 1487 4682 1831 1540 4887 2084 -52 1583
461 1583 125 -2265 -2971 -1706 -1415 -4135 -3206 601 -2374 -1985 1724 281 386 1924 1161 2141 2643
$$ packed form
345a959J84J123R49k122l332N858J875n920L701M815k043n37n09J259R5o438m9
362c050L227n378j296L357L47J361k36K977N863m889j457P199k407o365J015Q56
378A124j889m596l76N292k619l060O571M21k683L344P25l40l68p50K798j202l661
395a269L101M58k988R09r39N66J63m292J215K980l925m48L348J049O08n84K594
412B546L122l492j05M600m245k849K039j562k609j549J00K017j984j015M752k39
428d73j124L505j9N78P02j317K163j376l160L258p55l679J038K37j024l23k033
445c802J885O44k287J374J597L75J696r10R15L195k851k91L347k803k136J635
461A583j458k390p06J265K91k720R29L807k975L89L709j443J05J538p63R80N02
$$ plain form
478 2643 904 1863 1417 447 645 -884 73 -811 -3475 -736 -590 -3923 -1186 357 -1792 -495 845
495 845 473 1489 942 1394 1966 375 970 1175 -499 677 -312 -964 313 -1678 -1388 1435 -1345 -2342
513 -2342 79 -132 -675 -338 -184 1089 17 1 2111 553 827 2489 -52 -422 1113 -706 -471
530 -471 -233 -1866 -1157 -511 -805 -262 -675 658 1275 -1339 763 1799 -1408 357 1862 -402 -582
547 -582 918 522 768 64 755 1114 -1179 108 470 -1686 -729 -446 -2043 -679 -721 -795 1226 533 40
566 40 1019 1000 1131 1252 23 808 -330 -1067 707 -779 -1148 648 -733 -842 187 -993 51 801
584 801 -1236 -954 -24 -35 269 25 490 1294 -63 1175 1932 -480 723 1602 -1311 -1202 -160 -1313
602 -1313 -1284 -1385 -1049 -91 -975 185 1130 99 937 1440 -112 1225 1005 -417 671 625 -813 166
$$ packed form
478B643j739R59m46r70J98j529R57q84k664K739J46l333K737J543k149J297J340
495H45l72J016n47M52N72j591N95K05j674J176r89o52J277j991K90K823k780r97
513b342K421k11n43L37J54J273j072j6K110j558K74J662k541l70J535j819K35
530d71K38j633P09O46k94N43m13J333O17k614K102J036l207J765J505k264j80
547e82J500l96K46p04O91L59k293J287L62k156R57K83j597J364m2p4K021o93m93
566D0R79j9J31J21j229P85j138p37J774j486l69J796j381j09J029j180J044P50
584H01k037K82R30j1L04k44M65Q04j357J238P57k412J203Q79k913J09J042j153
602a313K9j01L36R58q84J160R45j031Q38N03j552J337k20j422J088m6j438R79
$$ plain form
620 166 66 -235 -79 -548 -120 -458 -1562 70 -507 -1477 278 -181 -650 1364 726 912 1898 1021 749
639 749 1173 339 384 -437 -693 -607 -1999 -1293 274 -1776 -1075 854 -240 -183 843 334 794 627 71
658 71 722 462 766 559 -481 416 528 -779 201 380 -934 -314 -588 -1922 -901 -488 -460 167 171 906
678 906 1062 571 1582 1458 251 1423 76 -730 939 -778 -1091 -310 -1059 -927 34 -986 -145 -196
696 -196 -64 644 -141 -222 1045 73 25 1117 7 327 820 -117 526 210 -541 70 -910 -1279 -704 -936
716 -936 -850 119 -545 142 564 -150 948 592 430 813 339 -91 971 -179 -462 441 -589 -190 -71
735 -71 -764 -86 -590 -833 -160 -463 -543 551 -177 24 986 384 487 1044 358 894 390 -266 79 -580 -539
756 -539 -59 -989 -1020 -207 -1048 -341 277 -124 244 411 48 1028 267 -71 820 -172 350 872 -383 -28
$$ packed form
620A66j00l01J56m69M28l38j104J632n77r70J755m59m69K014o38J86R86q77k72
639G49M24q34M5q21k56Q6j392P06J567k050P01J929j094N7J026n09M60j67n56
658G1O51k60L04k07j040Q97J12j307R80J79j314O20k74j334J021M13K8O27MP35
678I06J56m91J011j24j207J172j347q06J669j717l13P81p49J32R61j020Q41n1
696a96J32P08p85q1J267r72m8J092j110L20M93r37O43l16p51O11r80l69N75k32
716i36Q6R69o64O87M22p14J098l56j62L83m74m30J062j150k83R03j030L99J19
735g1o93O78n04k43O73l03q0J094p28K01R62o02J03N57o86N36n04o56L45o59M1
756e39M80r30l1Q13q41P07O18m01L68J67l63R80p61l38Q91r92N22N22j255L55
$$ plain form
776 -28 495 -786 -30 -114 -902 -664 -783 -553 -20 -869 -341 230 -37 453 1207 142 995 724 -11 679
796 679 97 -85 177 -669 -517 72 -689 -197 200 -919 23 -216 -545 454 -17 -87 629 53 606 748
816 748 33 665 467 -24 404 8 -300 -109 -384 -825 -460 -1218 -227 -113 -862 11 470 -112 514 371
836 371 -7 616 397 -29 338 -194 278 394 -696 -255 -153 -258 65 -378 -717 -119 -498 -540 154 -209
856 -209 147 364 -108 637 973 52 634 472 27 514 -87 -317 -158 -687 -119 -418 -905 292 -25 -625
876 -625 314 -80 12 367 -29 245 439 -187 449 487 -448 503 406 -364 276 -262 -529 -126 -847 -517 -462 -722
898 -722 -294 326 -157 560 564 -5 736 375 101 829 -85 -56 326 -236 -328 -412 -867 -43 -405 -804 141 -213
920 -213 -267 203 -76 109 593 -95 711 278 6 679 229 -100 672 -43 -484 -150 -879 -641 -384 -825 -101
$$ packed form
776b8N23j281P56q4p88K38j19K30N33q49N28N71k67M90P54j065Q53k71p35O90
796F79n82j82K62q46J52N89p61M92L97j119R42k39l29R99m71p0P16n76N53J42
816G48p15O32j98m91M28l96l08J91k75m41L65p58R91J14p49Q73M59n82O26j43
836C71l78O23k19m26L67n32M72J16j090M41J02j05L23m43l39N98l79m2O94l63
856b09L56K17m72P45L36r21N82j62m45M87o01k30J59n29N68k99m87J197l17o00
876f25R39l94R2L55l96K74J94o26O36L8r35R51r7p70O40n38k67M03p21L30N5k60
898g22M28O20m83P17Mn69P41l61k74P28r14K9L82n62r2q4m55Q24l62l99R45l54
920b13n4M70k79J85M84o88Q06m33k72O73m50l29P72p15m41L34p29K38K57m41P24
$$ plain form
941 -101 -483 -395 190 45 225 632 2 -268 475 -59 292 96 -22 -65 93 31 -82 -311 -274 49 -518 -622
963 -622 178 -432 -12 353 -207 223 427 -168 763 408 157 808 157 -88 417 -260 -326 -126 -520 -307 -237
984 -237 -395 -51 -592 -56 399 57 329 535 68 340 595 -62 419 546 -98 207 133 -421 -24 -488 -323
1005 -323 231 -360 -424 -231 -473 98 -63 83 497 96 373 743 -59 146 502 -130 -176 -45 -145 -53 -109
1026 -109 -421 -152 -527 -360 181 -439 -95 193 -527 -179 415 159 250 735 207 348 307 370 309 -320 94
1047 94 76 -682 -427 -95 -431 -430 114 -430 124 105 28 521 -42 138 402 -60 267 247 -114 352 -145 -41
1069 -41 417 -202 -63 -184 -405 -104 159 -571 -314 149 -185 -157 259 262 423 631 465 324 -113 414 182
1090 182 -722 -69 -36 -338 -4 -127 -272 -151 59 -292 11 -189 448 172 -443 432 406 -122 502 458 92
$$ packed form
941a01l82Q8N85j45J80M07o30k70P43n34L51j96j18m3J58o2j13k29L7L23n67j04
963f22Q00o10M20L65n60M30K04n95R31l55k51O51o51k45N05o77o6K00l94K13P0
984b37j58L44n41N36M55l42K72K06m67K72K55o57M81J27o44L05p4n54L97m64J65
1005c23N54n91o4J93k42N71j61J46M14m01K77L70q02K05L56o32m6J31j00R2n6
1026a09l12K69l75J67N41o20L44K88p20L48N94k56R1M85n28J41m1O3o1o29M14
1047I4j8p58K55L32l36JN44n44N54j9p7M93n63J80K64m62L27k0l61M66m97J04
1069d1M58o19J39j21k21L01K63p30K57M63l34K8M16LJ61K08j66j41m37N27k32
1090A82r04O53L3l02L34j23j45J21K10l51L03k00O37k76o15Q75k6n28O24m4l66
$$ plain form
1111 92 428 -263 -252 -118 -366 89 -65 -619 -35 -273 -492 -152 -272 -34 236 -152 314 378 270 247 179 -196
1133 -196 338 -186 -11 -113 41 -148 -277 -164 -152 -122 -202 59 -39 -171 344 122 -101 579 255 -5 289
1154 289 -62 228 306 -69 110 158 -400 -259 47 -339 -179 -4 -173 -153 -112 152 306 -77 423 326 -49 408
1176 408 280 -142 269 61 -209 76 -364 53 -273 -605 -139 -109 -404 -63 -168 -270 306 27 10 410 259
1197 259 207 209 161 591 0 -278 198 -64 -420 -188 -320 -313 -246 3 -215 90 -107 174 87 51 202 179 13
1220 13 313 -69 209 29 -50 -50 64 -318 -61 -183 -635 -60 -91 -74 47 -33 -143 270 -95 219 -144 -193 59
1243 59 146 -244 123 383 -169 234 -367 -158 32 -123 -102 -37 -143 143 -97 49 24 -48 78 378 -166 113
1265 113 720 -210 95 7 -177 87 -197 -138 19 -365 -162 -195 31 124 16 57 105 224 -82 222 26 -123
$$ packed form
1111I2L36o91J1J34k48M55j54n54N84k38k19L40j20K38K70l88M66O4j08k3o8l75
1133a96N34n24J75j02J54j89j29J13J2L0q0K61r8j32N15k22k23O80l24k60K94
1154B89l51K90P8l75J79M8n58J41L06l86J60J75j69K0M1K64J54l83N00r7l75M57
1176D08j28m22M11k08k70K85m40M17l26l32M66L0k95L41j05j02N76k79j7M00j51
1197B59n2Km8M30n91k78M76k62l56K32j32PO7K49k18L05j97K81q7l6J51k3j66
1220A3L00l82K78j80p9%J14l82K57j22m52N75l1J7J21q0j10M13l65L14l63m9K52
1243E9Q7l90L67K60n52M03o01K09J90j55K1O5j06K86k40J46k5p2J26L00n44K79
1265A13O07r30L05q8j84K64k84N9J57l84K03l3K26R3j08M1M8J19l06L04j96j49
$$ plain form
1287 -123 352 42 165 65 75 172 188 -274 -178 -7 -279 -213 57 -507 -88 23 -314 176 -130 174 94 -83
1309 -83 451 155 113 151 -17 3 304 -70 -158 -87 -406 -309 -94 -260 -177 252 -104 179 -219 205 360 13 2
1332 2 173 34 199 136 -222 18 19 -307 -98 -181 -324 -2 -270 -46 185 -14 -69 -105 7 222 116 432 169
1355 169 246 104 64 92 -118 126 -204 -105 -453 -182 -15 -151 -17 17 18 -42 -19 -261 214 -38 148 275 102
1378 102 129 -124 251 -146 186 50 -445 -27 -167 165 200 -430 52 -17 -119 250 615 -111 166 337 -50
1399 -50 149 49 83 173 -243 47 168 -87 -258 31 -336 -58 -64 -94 141 -210 99 202 150 71 -15 15 -41 -57
1423 -57 261 -9 -146 -120 64 -145 -218 -343 -233 80 110 -74 8 -43 224 18 202 129 347 -173 92 185 -269
1446 -269 5 -68 25 -36 25 206 -57 -184 -194 -192 -84 -114 0 -185 217 -7 -244 73 161 131 322 292 170 16
$$ packed form
1287a23M75l10J23j00J0R7J6m62R6J71k72O6K70n64M19J11l37M90l06L04q0j77
1309h3N34k96m2L8j68K0L01l74q8P1l19R7K15j66Q3M29l56K83l98M24J55l47j1
1332BJ71j39J65o3l58K40Jl26K09q3j43L22k68K24K31j99n5l6J12K15j06L16k63
1355A69P7j42m0K8k10K44l30R9l48K71J67j36J34L4Jo0K3k42M75k52J86J27j73
1378A02K7k53L75l97L32j36m95M18j40L32L5o30M82o9j02L69L65p26K77J71l87
1399e0J99j00L4R0m16K90J21k55j71K89l67K78ol0K35l51L09J03n2p9q6L0n6j6
1423e7L18k70j37K6J84k09p3j25J10L13L0j84Q2n1K67k06J84p3K18n20K65R3m54
1446b69K74p3R3o1O1J81k63j27j0KJ08l0J14j85M02k24k37L17Q8l0J91l0j22j54
$$ plain form
1470 16 -72 -57 -23 -10 -115 160 -73 -165 -38 -120 171 -95 -108 419 102 -62 299 -59 284 249 95 382 58
1493 58 -65 10 -207 -166 -245 -142 -371 -219 -112 -125 75 -184 175 34 172 376 39 178 46 -29 209 -39
1515 -39 90 269 -92 -235 -46 30 -272 -236 -127 -131 126 43 -68 49 -78 -47 -7 -26 3 -67 -67 42 42 36 118 -201
1541 -201 -264 68 -33 -140 -212 -96 -4 -81 -62 -189 -130 265 167 -70 38 212 48 86 1 -171 33 -231 -63
1564 -63 -72 -78 -88 -34 -398 119 96 179 87 -106 -284 -41 134 106 400 50 -61 70 -3 -62 71 -178 -301 59
1588 59 5 116 -130 -35 -72 173 -137 -116 14 -62 -65 153 414 21 -26 98 74 143 31 83 -70 58 -73 107
1612 107 21 164 -124 -189 52 120 156 -90 97 -355 356 81 -241 43 -12 -93 -64 -58 -233 243 29 -223 7
1635 7 -102 -348 -135 73 113 71 -23 434 -11 52 -76 111 -46 13 39 40 92 -245 -58 175 -58 -277 301 -197
$$ packed form
1470A6q8J5L4J3j05K75k33r2J27q2K91k66j3N27l17j64L61l58L43l5j54K87l24
1493E8j23P5k17M1p9J03k29J52J07j3K00k59L59j41J38K04l37J39j32p5K38k48
1515c9J29J79l61j43J89P6l02L6J09mK57q3j11J17j27L1M0j9K9p0%J09%oQ2l19
1541b01o3L32j01j07p2J16R2p7J9j27N9L95r8k37J08J74j64L8q5j72K04k64J68
1564f3roj0N4l64N17k3Q3r2j93j78K43J75k8K94l50j11J31p3n9J33k49j23L60
1588E9n4J11k46R5l7K45l10K1J30p6lK18K61l93m7J24k4O9j12N2j53J28j31J80
1612A07q6J43k88o5K41O8L6k46J87m52P11k75l22K84n5q1K9Oj75M76k14k52K30
1635Gj09k46K13K08M0m2r4M57m45O3j28J87j57N9K6JN2l37J87K33k33k19N78m98
$$ plain form
1659 -197 19 -60 -208 149 -138 -49 -307 -93 269 -73 -62 364 -12 229 126 205 -307 152 -41 36 -282 -208
1681 -208 -97 -104 203 -24 59 -35 38 -50 -321 269 399 -268 34 185 -63 -63 -110 96 -71 127 100 -63 22 133
1705 133 -252 341 -82 -280 -66 -80 -60 -66 -164 -143 1 -132 -37 77 -70 -140 476 -218 -56 -95 -114 148 265
1728 265 66 84 7 -21 112 54 -83 120 40 221 -88 -147 -13 -240 -116 -66 -188 -201 9 -161 49 5 185
1751 185 25 201 192 -27 -324 -12 63 85 225 132 -264 -181 -187 -209 -83 -138 -23 -49 9 136 38 -125 124 -76
1775 -76 -96 95 259 49 139 66 13 0 215 -189 -153 -184 4 -109 -255 -83 21 53 -20 249 40 40 -14 -113 150
1800 150 -20 151 118 -35 29 -83 142 -119 80 -250 199 -34 86 62 0 215 -175 -75 14 -41 230 115
1822 115 149 201 8 253 -210 -106 102 -133 -26 15 254 -92 -24 64 -79 -128 -23 0 54 -33 -82 -13 8 -133
$$ packed form
1659a97K16p9j48L57k87Q9k58K14L62l42J1M26l76K41j03P9n12M59j93P7l18P4
1681b08J11pL07k27Q3r4P3q8k71N90J30o67L02J51k48%m7K06j67J98k7j63Q5J11
1705A33l85N93m23j98K14j4K0or8K1J44j33R5J14j47p0O16o94J62l9j9K62J17
1728B65j99J8p7k8J33n8j37K03q0J81l09n9J34k27J24N0j22j3K10j70K10m4J80
1751A85j60J76rk19k97L12P5K2J40r3l96Q3ok2J26n5J15k6N8J27r8j63K49k00
1775g6k0J91J64k10R0p3n3j3K15m04L6l1J88j13j46J72J04L2p3K69k09%n4r9K63
1800A50j70J71l3j53O4j12K25k61J99l30M49k33J20k4o2K15l90J00Q9n5K71j15
1822A15L4N2j93K45m63J04K08k35J07M1K39l46O8Q8j43m9J05K3N4q7m9O9K1j41
$$ plain form
1846 -133 155 184 -138 111 -66 -107 -152 14 33 39 -38 11 -137 -98 -212 110 -14 19 -10 -57 41 -77 -293 162
1870 162 -32 24 166 -204 -168 -194 -327 42 5 -79 109 124 204 -13 -72 186 -339 31 -62 284 -82 -43 -9 27
1894 27 289 -308 73 -286 -47 -317 -145 -43 -52 -95 239 23 22 -70 192 -172 -166 243 122 65 -261 51 203
1917 203 227 -181 112 -311 -213 101 -34 -333 -31 45 -119 247 -293 34 -282 -123 -12 148 -231 4 78
1938 78 91 236 -67 89 -140 -66 204 142 146 -222 -23 -85 -45 -152 231 -212 53 -98 -91 41 245 -108 -31 -26
1962 -26 -147 53 146 -69 12 32 98 62 -125 29 15 -153 68 3 177 -36 136 -55 -64 145 -363 244 274 -27
1986 -27 162 353 9 -208 -46 92 -111 73 164 -69 -106 -203 17 -56 -169 79 227 62 -8 -98 201 -44
2008 -44 -59 137 91 -147 331 -132 -56 78 0 99 -152 -196 114 22 -34 -231 12 438 126 -67 45 -203 53
$$ packed form
1846a33K88K9l22K49j77m1m5J66J9Op7M9j48L9j14L22j24L3k9m7R8j18k16M55
1870A62j94N6J42l70L6k6j33L69l7q4J88J5Q0k17n9K58n25L70r3L46l66L9L4L6
1894B7K62n97L81l59K39k70J72J02rm3L34k16jr2K62l64OM09j21n7l26L12J52
1917B03K4m08K93m23R8L14j35k99L02P6j64L66n40L27l16J59J11J60l79K35P4
1938G8J3J45l03J56k29P4K70o2Ml68J99o2M0j07L83m43K65j51PJ32K04l53P7N
1962b6j21K00R3k15Q1K0O6l6j87J54j4j68K21o5J74k13J72j91rK09n08O07L0l01
1986b7J89J91l44k17J62J38k03J84R1k33l7r7K20p3j13K48J48j65p0r0K99k45
2008d4j5J96m6k38M78m63P6J34p8R9k51m4L10r2n6j97K43M26l12j93J12k48K56
$$ plain form
2031 53 -256 -112 -111 221 -147 13 -128 -62 -107 -222 157 -184 89 -189 -155 273 -96 -171 -20 85 103 -17 -72
2054 -72 -142 -111 -12 -52 -156 -189 -347 10 -137 -111 -17 -114 -73 24 218 -257 153 159 220 7 129 116 -143 -195 243
2079 243 -26 -78 130 23 -37 82 23 -151 200 38 71 88 -21 -71 177 -2 130 -187 -188 -118 -41 -174 -255 -4
2103 -4 -74 -81 -16 -5 109 49 242 -122 -21 53 -43 223 -128 157 49 185 -394 -79 -177 -161 -110 -96 28 -34 -332
2128 -332 216 0 -16 153 -22 -44 171 8 47 -126 87 35 -23 -135 -170 80 -21 -47 50 -156 -61 -77 -55 166
2152 166 -91 98 60 -13 -184 95 5 -166 112 -8 98 -307 181 289 270 51 56 166 95 -25 -171 -146 26
2175 26 22 115 -144 -94 -38 -17 145 -85 -111 -24 81 -174 48 9 3 98 157 85 72 164 33 30 -214 82 266 -153
2201 -153 184 56 48 131 -52 9 89 -212 63 36 69 -103 97 -59 26 -141 72 -97 -60 36 -268 85 105 -110
$$ packed form
2031E3l09J44JL32l68J60j41O6m5j15L79l41K73k78L4M28l69p5J51J05J8j20n5
2054g2p0L1R9m0j04l3j58L57j47K6R4r7M1R7J94m75M10OO1k13J22j3k59n2M38
2079B43k69n2K08j07o0J19n9j74L51j62L3J7j09n0K48j79J32l17jP0P7j33q1K51
2103dp0pO5J1J14o0J93l64J01P4r6K66l51K85j08J36n79L15r8J6N1J4J24o2k98
2128c32N48k16j6J69j75k2K15j63L9j73K13n2n8j12l5K50j01k6R7k06R5j6K2K21
2152A66k57J89l8p3j71K79r0j71K78j20J06m05M88J08j9k19NJ10p1j20j46K5J72
2175B6mR3k59N0N6K1J62k30k6Q7J05k55K22l9oR5N9p2j3R2j31lk44K96J84m19
2201a53L37j28qQ3j83O1Q0l01K75k7L3j72K00j56Q5j67K13j69L7R6l04L53K0k15
$$ plain form
2225 -110 -161 -32 35 -230 -204 -33 -169 -57 -283 -81 474 118 121 -223 -57 1 -77 -144 -32 206 -6 127 233
2248 233 -137 60 -93 57 2 -28 -155 -65 160 -71 191 -100 -351 -235 88 -149 -159 -79 -147 -67 8 125 77
2271 77 216 253 -238 -53 183 163 160 -52 47 188 -18 147 -90 -103 -37 30 -326 65 160 -6 23 -267 41 -101
2295 -101 -90 173 38 407 163 -109 303 60 4 -223 -28 37 18 -130 -275 66 143 -91 -247 -305 96 -23
2317 -23 43 -4 -124 -54 -17 46 -250 -112 -249 -21 -53 -83 28 -11 -3 -171 221 -189 27 48 120 124 -26 5 -31 -227
2343 -227 -132 83 -5 141 12 -387 -164 -188 -62 -207 -278 -138 43 -276 -57 7 12 331 20 -26 -288 101 172
2366 172 41 214 -98 -73 -71 -395 -62 -217 -50 134 -246 -88 -209 61 111 -156 -71 74 61 43 116 102 18
2389 18 101 -15 9 -106 -116 1 -87 27 342 184 -193 86 9 23 29 -248 -29 -379 -338 146 -208 95 198
$$ packed form
2225a10n1J29O7k65K6J71j36J12k26K02N55l56Ll44J66N8p8o7J12K38k12J33J06
2248B33l70J97j53J50n5l0j27R0K25k31K62k91k51J16L23k37j0Q0o8Q0P5J17m8
2271G7J39L7m91J85K36k0lk12R9J41k06J65k37j3O6O7l56L91R5j66K9k90L08j42
2295a01J1K63j35L69k44k72M12k43n6k27J95O5j9j48j45L41P7k34j56n8M01j19
2317b3O6m7j20P0L7O3k96J38j37K28l2l0J11l9Qj68L92m10K16K1P2Mj50L1l6j96
2343b27R5K15q8J46j29l99K23k4J26j45p1J40J81l19K19O4NL19l11m6k62L89P1
2366A72j31J73l12K5Kl24L33j55J67J84l80J58j21K70N0k67Q5J45j3j8P3j4q4
2389A8Q3j16K4j15j0J17q8J14L15j58l77K79p7J4Ok77K19l50M1M84l54L03J03
$$ plain form
2412 198 -141 41 -116 -251 247 41 -91 177 93 -109 105 -103 -283 191 -53 9 -121 -23 168 -62 -198
2433 -198 65 -407 100 127 -33 -73 29 1 -309 -29 -181 21 221 -310 118 -16 -134 -56 -366 128 19
2454 19 -189 64 -53 -18 318 -59 3 -149 -29 -27 52 143 -85 -8 -91 -73 -327 -96 71 -221 57 24 130 179
2478 179 -248 -77 154 13 34 -60 254 121 -13 -226 -29 -177 -80 185 0 236 -31 36 56 20 -55 25 230
2501 230 -166 -24 53 56 27 53 -88 213 42 -71 -48 116 -42 -332 40 -142 127 -78 24 140 -6 -45
2523 -45 194 148 103 -57 107 11 133 -60 7 393 -2 87 30 105 -53 -174 -57 -224 102 -45 66 -46 23
2546 23 -181 1 187 111 132 -53 16 -1 -170 14 -67 5 -219 6 82 -196 -346 224 -23 180 -43 -300 -6
2569 -6 -58 371 219 16 -24 136 -125 -161 -110 4 105 -72 -132 161 44 -132 -43 -77 -95 -255 -80 30 59 130
$$ packed form
2412A98l39J82j57j35M98k06j32K68q4k02K14k08j80M74k44O2j30R8J91k30j36
2433a98K63m72N07K7j60m0J02k8l10K80j52K02K00n31M28j34j18P8l10M94j09
2454A9k08K53j17L5L36l77O2j52J20KP9R1k28P7q3J8k54K31J67k92K78l3J06M9
2478A79m27J71K31j41K1r4L14j33j34k13J97j48R7K65j85K36k67O7K0l6p5Q0K05
2501B30l96J42P7Lk9K6j41L01j71j13K3J64j58k90L72j82K69k05J02J16j46l9
2523d5K39m6m5j60J64r6J22j93O7L86l95Q9n7P5j58j21J17j67L26j47J11j12O9
2546B3k04J82J86p6K1j85O9j7j69J84q1P2k24K25P6k78j50N70k47K03k23k57K94
2569fn2M29j52k03m0J60k61l6N1J14J01j77o0K93j17j76Q9l4j8j60J75J10K9P1
$$ plain form
2593 130 230 251 28 190 63 51 -204 161 72 -124 -40 -181 -63 -95 136 -289 27 -135 66 -112 -55 -102
2615 -102 43 -4 110 146 -38 -158 135 -2 115 -46 -8 92 24 52 14 37 -18 1 -183 165 -11 -77 290
2638 290 -41 87 -88 -14 140 94 -133 19 12 -177 -329 108 98 -185 -73 314 -14 -24 199 -61 35 40 -18
2661 -18 -77 -42 184 -23 -54 64 88 96 75 33 -180 153 52 -213 -152 -38 -28 155 -4 216 -14 375 100 -85
2685 -85 -33 -253 240 -215 -106 -162 -21 -21 -217 9 -258 402 316 171 156 -76 -164 72 -200 162 125 -53 -44 94
2709 94 67 111 -183 -67 14 -93 -102 259 32 194 143 -229 117 -32 1 -47 150 214 189 -272 -295 -32 -49 -205
2733 -205 -218 -59 -94 -72 8 20 33 95 258 180 48 92 -315 -305 -30 -65 9 17 -190 -57 -175 -24 315 -202 -142
2758 -142 474 -211 -78 -150 -27 -160 -88 98 -50 -90 -45 115 -40 -69 -80 44 -132 -164 -79 -27 -48 -126 29 -210
$$ packed form
2593A30J00K1k23J62j27j2k55L65q9j96Q4j41J18l2K31m25L16j62K01j78N7m7
2615a02J45m7J14L6j84j20K93j37J17j61L8J00o8K8l8K3n5J9j84L48j76o6L67
2638B90l31J28j75P4J54m6k27J52pj89j52M37j0k83J12L87l28j0K23k60R6Nn8
2661a8n9L5K26k07l1J18K4Qk1m2k13L33j01k65O1J14J0J83j59K20k30L89k75j85
2685h5N2k20M93m55J09n6J41%j96K26k67O60q6j45j5k32q8K36k72L62l7j78RJ38
2709I4k7M4k94J16Q1j07rL61k27J62n1l72L46j49L3m8J97O4k5m61k3K63j7j56
2733b05j3J59l5K2Q0J2J3O2J63p8j32M4m07J0K75l5P4Qk07J33j18J51L39n17O0
2758a42O16o85J33p2J23j33P2J86j48m0M5J60j55k9j1J24j76l2Q5N2k1p8J55k39
$$ plain form
2782 -210 -231 -48 17 -110 -162 -188 91 520 63 173 -135 203 31 3 212 34 -110 5 -177 41 -116 109
2804 109 -200 417 255 23 168 -81 32 314 52 -2 -191 -199 255 -29 -97 -239 -132 300 230 -127 35 49
2826 49 -46 -32 -47 157 42 -14 -95 161 -58 -232 -98 312 168 -31 272 31 17 -219 29 256 90 -1 184
2849 184 34 107 -90 -54 -377 50 -27 55 106 22 -69 -161 -257 156 -74 212 179 -450 63 -108 -99 -75 -149 154 151
2874 151 161 227 66 -212 -147 -131 -64 75 9 162 173 102 26 -102 -44 -9 -58 -74 145 -110 65 37 16 -228 -79
2899 -79 -73 122 -75 91 6 115 109 73 7 -211 41 -118 7 -250 -57 -67 79 16 36 17 355 122 86 -16
2923 -16 -79 255 170 101 -90 50 88 69 7 96 2 -156 -50 -99 103 39 92 35 67 228 -34 -7 -103 -43 -309 67
2949 67 -167 -104 -231 -81 -76 208 -108 -233 24 -164 17 336 141 -28 273 173 118 -311 -221 -8 51 -282
$$ packed form
2782b10k1J83O5j27n2k6K79M29m57J10l08L38j72k8K09j78j44J15j82K18j57K25
2804A09l09O17j62k32J45k49J13K82k62n4j89qM54k84o8j42J07M32p0l57J62J4
2826D9r5J4j5K04j15n6q1K56k19j74J34M10j44j99L03k41j4k36K48K27j66r1J85
2849A84j50P3j97L6l23M27p7Q2N1q4r1r2r6M13k30K86l3o29N13j71RK4p4L03l
2874A51J0O6j61k78O5J6O7J39o6J53J1p1p6j28N8L5m9j6K19k55J75k8k1k44J49
2899g9OJ95j97J66q5J09ol6o6k18K52j59J25k57J93j0J46o3K0j9L38k33l6j02
2923a6o3L34q5o9j91J40L8j9o2Q9r4j58J06m9K02o4N3n7L2J61k62K7r6O0k66L76
2949F7k34O3j27J50NK84l16j25K57j88J81L19j95j69L01j00n5m29R0K13N9l33
$$ plain form
2971 -282 50 46 144 -151 161 -31 -23 5 -300 -270 -27 -4 172 -85 -61 -92 -117 -136 -184 -197 -202 251 -86 -22 -54 0
2997 0 -50 -72 172 275 9 148 -191 -41 -442 -246 -4 -206 268 28 156 173 10 -49 41 -262 119 -207
3019 -207 55 123 36 75 104 358 -89 266 23 183 -8 247 80 -210 88 -189 -68 101 31 -45 110 141
3041 141 249 101 -42 236 28 -112 -49 66 150 124 60 74 -53 -117 -48 137 24 -119 -85 -38 -96 51 -115
3064 -115 -179 140 -75 63 150 -59 96 -7 -74 24 55 -22 -224 15 31 -199 14 106 119 121 202 -15 76 129 -21
3089 -21 182 26 209 -147 85 143 11 -53 -82 -205 112 -168 -210 -106 23 -270 -184 -83 72 55 -278 136
3111 136 36 9 -59 46 -3 287 -28 77 -56 119 -91 127 -79 161 37 -162 116 89 -42 64 118 21
3133 21 52 26 -82 -192 85 -17 -221 26 27 103 241 -207 136 -117 -206 162 254 133 50 70 -82 178 -41
$$ packed form
2971b82L32mR8k95L12j92QK8l05L0K43K3J76k57K4l1k5j9m8j3nM53l37O4l2N4
2997@n0k2K44J03k66J39l39J50m01J96K42k02M74k40J28J7j63n9R0l03L81l26
3019b07K62O8q7L9K9K54m47L55k43J60j91K55j67k90K98k77J21J69p0p6J55L1
3041A41J08j48j43K78k08j40O3J15Q4k6o4J4j27o4O9J85j13j43L4M7n8J47j66
3064a15o4L19k15J38Q7k09J55j03o7R8L1p7k02K39J6k30K13R2J3KQ1k17R1N3j50
3089b1K03j56J83l56K32N8j32o4k9j23L17k80m2J04J29k93Q6J01J55j7l33M14
3111A36j00k7o8J05m9K90l15J05j33J75k10K18k06K40j24j99K78k7j31J06N4r7
3133B1L1k6j08j10K77j02k04K47JP6J38m48L43k53q9L68R2j21q3K0j52K60k19
$$ plain form
3156 -41 -145 94 56 283 131 -83 -217 136 253 -135 88 120 116 197 -70 -119 9 16 -76 28 -139 -116 20 131
3180 131 38 -177 -69 234 -59 -13 239 74 -123 -84 -112 -193 -74 120 94 245 -206 46 -109 -72 53 -142
3202 -142 -19 115 -516 184 -185 -20 137 232 106 71 30 -81 39 4 -130 -234 248 -137 -235 -46 121 -136
3224 -136 -161 -26 24 232 -94 87 118 112 25 166 46 188 -37 -180 -14 -239 17 -94 34 45 52 -26 83
3247 83 128 -22 74 193 -41 140 37 42 193 -102 -126 182 83 342 147 82 -52 -140 16 -12 -198 -56 -80 8
3271 8 -102 20 -42 -25 155 -49 303 -77 51 163 -35 99 154 -309 263 -119 -68 294 51 -14 -253 -48
3293 -48 -201 -37 74 390 9 -178 -1 -138 -104 289 65 84 -58 -55 95 -208 -221 55 -38 -171 252 -75
3315 -75 -121 73 154 347 -93 -174 117 74 32 402 -91 493 326 -83 205 123 -38 81 252 69 57 -101 -113
$$ packed form
3156d1j04K39l8K27j52k14j34L53J17l88K23L2mQ1k67m9J28Pr2J04j67K3J36J11
3180A31r3k15J08L03k93M6K52j65j97L9k8q1J19J94k6J51m51K52j55L7J25j95
3202a42J23J34o31P00l69J65J57R5j26l5m1j11J20l5j34j04M82l85r8J89J67k57
3224a36k5J35N0K08l26J81L1oq7J41j20J42k25j43J66k25K56j11J28J1Pp8J09
3247H3M5j50R6J19k34J81j03NJ51k95k4L08r9K59j95o5j34q8J56k8j86J42k4Q8
3271Hj10J22o2J7J80k04L52l80J28J12j98J34N5m63N72l82N1L62k43o5k39K05
3293d8j53J64J11L16l81j87J77j37L4L93k24J9j42LJ50l03j3K76r3j33M23l27
3315g5m6J94Q1J93m40q1K91m3m2L70m93N84j67m09K88q2j61J19J71j83j2j58j2
$$ plain form
3338 -113 -280 -72 3 160 -70 220 225 102 302 -2 288 252 221 -196 80 79 76 -31 6 -11 161 -31 26 45
3362 45 130 -112 -140 -75 38 31 -22 -158 -63 -34 -184 92 -141 63 168 -27 167 -87 -355 -78 390 -106 24
3385 24 -185 -79 154 134 123 149 -31 -192 -179 -72 -232 -68 133 -141 -190 -8 -114 -306 -132 -92 -50 -187 -207
3408 -207 -107 69 -195 -15 -40 -162 204 502 77 -426 -48 -61 -242 -25 -118 -28 20 -118 55 -93 384 8
3430 8 220 -296 -1 217 7 13 -225 -74 11 -58 -112 9 9 160 -32 -144 -82 430 -114 44 -26 -254 -83 14
3454 14 284 -193 -69 8 -82 -53 -169 -115 -223 -9 45 -126 -98 -73 165 81 213 -129 134 141 75 162 -318 -143
3478 -143 -78 -220 405 -28 -151 107 -92 384 -94 123 113 13 -137 -144 139 -99 -10 49 -58 -93 188 -51
3500 -51 282 -112 235 16 -246 -36 169 137 -62 23 63 -314 -2 74 -131 -16 -133 -129 -81 -240 252 -44 -37
$$ packed form
3338a13j67K08P5J57k30K90Nj23K00l04K90l6l1m17K76jlj07L7j7J72j92N7J9
3362D5Q5k42k8O5J13pn3j36R5K9j50K76k33K04J05j95J94k54k68K77M68m96J30
3385B4k09J06K33k0j1K6j80j61J3J07j60J64K01k74m9J82j06j92J74M0M2j37k0
3408b07J00J76k64J80k5j22L66K98m25n03L78j3j81K17r3R0M8j38J73j48M77l76
3430HK12n16K95K18k10Ok38J51Q5o9n4J21%J51j92j12O2N12n44J58p0k28J71R7
3454A4K70m77J24P7r0K9j16N4j08K14N4j71K8K5K38q4J32l42K63Po6Q7m80J75
3478a43O5j42O25m33j23K58j99M76m78K17j0j00j50pK83k38Q9N9j07l5K81k39
3500e1L33l94L47k19k62K10K05l2j99Q5M0l77L12P6k05J15j17MM8j59M92k96P
$$ plain form
3523 -37 -189 -8 229 -27 31 109 67 147 -128 -35 181 194 -314 -202 86 189 1 -77 53 -55 45 16 -70
3546 -70 162 -131 -1 218 -24 143 -255 -94 -6 -369 -194 -70 -335 -146 222 -119 21 36 7 243 -342
3567 -342 -151 157 -49 -120 -14 113 6 -2 64 40 140 207 206 341 -65 10 221 69 -23 -133 170 -330 99
3590 99 -157 103 -3 154 51 65 -18 180 -33 70 179 114 -138 223 105 -147 -199 5 75 -157 33 -189
3612 -189 131 -137 99 130 -240 75 152 50 -176 122 86 -166 -301 81 30 -119 -164 -49 12 41 73 -5 -2 -29
3636 -29 -23 239 -51 -3 204 184 -176 7 -66 -40 -99 159 -255 20 49 -58 19 -28 -66 -13 -1 -113 200 -123 -17
3661 -17 27 198 -109 -86 -79 -53 57 -195 -195 -78 -167 -25 -128 216 -111 -234 -197 205 272 89 -60 -83 -84 78 0
3686 0 -167 -55 134 106 54 -290 121 -89 254 -130 -94 9 22 5 -72 -181 -64 128 135 -74 -111 -5 72 74 4
$$ packed form
3523c7j52J81K37k56N8P8m2Q0k75R3K16J3n08J12K88J03j88p8J30j08J00k9q6
3546g0K32k93J30K19k42J67l98J61Q8l63J75J24k65J89L68l41J40J5k9K36n85
3567c42J91L08k06p1J06J27j07qO6k4J00O7jJ35m06P5K11j52r2j10L03n00M29
3590I9k56K60j06J57j03J4q3J98k13J03J09o5k52L61j18k52n2K04P0k32J90k22
3612a89L20k68K36L1l70L15P7j02k26K98l6k52j35L82n1j49m5J15O1K9L2p8Lk7
3636b9OK62k90M8K07k0l60J83p3K6n9K58m14K75K9j07P7m7l8N3J2j12L13l23J06
3661a7M4J71l07K3PK6J10k52%J17q9J42j03L44l27j23L7M02O7j83j49k3jJ62p8
3686@j67J12J89k8n2l44M11k10L43l84L6J03J3j7p7j09J17J92Pk09l7J06P7Kp0
$$ plain form
3711 4 73 -328 -69 157 -209 -327 -169 -66 -163 -161 -192 45 -204 -15 20 159 88 193 493 147 -87 -274 118
3734 118 30 67 -3 -69 92 -80 77 -77 -55 -154 -46 132 351 125 31 171 -117 160 9 -16 22 -43 -239
3757 -239 85 -223 -20 123 -15 84 -9 239 -39 7 15 -99 -81 20 -87 150 73 -157 -83 -129 -212 -10 -19 -341
3781 -341 -153 -109 -94 29 65 -246 111 164 -52 -384 -14 -283 82 63 -198 106 -68 107 77 -180 -52 -32
3803 -32 -35 -254 -274 -194 -62 41 82 -32 88 -153 178 0 -45 74 -143 -148 -295 164 -104 50 93 -171 292
3826 292 -6 23 -20 52 -150 79 120 265 -36 92 4 -19 -14 62 -137 16 -57 116 130 -91 42 -106 -142 259
3850 259 -232 -21 203 110 -66 138 90 192 181 65 -43 115 -108 185 85 190 -119 99 6 158 22
3871 22 17 53 123 -22 -229 77 71 52 -205 -7 -66 116 201 -172 49 34 169 -146 37 -17 -101 167 134 94 -255
$$ packed form
3711DO9m01K59K26l66j18J58J03r7Kl1K37k49J89L5J39p1J05L00l46k34j87L92
3734A18q8L7p0o6J61j72J57j54K2r9J08J78K19k26r4J40k88K77j51k5L8o5j96
3757b39L24l08K03J43j38R9r3K48k78M6Qj14J8J01j07K37p7k30P4m6q3K02rl22
3781c41J88M4J5J23L6l11L57N3k16l32L70k69L65j9k61L04j74J75l0k57J28K0
3803c2lk19k0Q0J32J03M1j14J20k41L31j78m5J19k17nj47M59k68J54M3k64M63
3826B92k98K9m3P2k02K29M1J45l01J28q8k3NP6j99J53p3J73J4k21J33j48l6M01
3850B59m91K11K24r3j76K04m8J02j1j16j08J58k23K93j00J05l09K18r3J52j36
3871B2nL6P0j45k07L06oj9k57J98n9J82Q5l73K21j5J35l15J83n4q4K68l3m0l49
$$ plain form
3896 -255 152 261 76 -163 -37 42 -310 1 96 -88 87 33 50 151 -114 -123 70 42 25 -7 -341 -143 80
3919 80 232 -114 -82 -88 21 34 84 201 80 -195 33 205 166 -151 -2 49 -184 100 -68 -156 -66 -178 -46
3942 -46 138 -56 -11 -84 -129 19 12 -39 -59 95 -100 -246 13 -296 -45 -4 29 82 225 -151 37 182 13 -23
3966 -23 62 160 -53 -118 -161 -131 35 109 199 1 233 -10 70 -73 37 32 198 2 -87 -176 -61 -69 -116 -145 -94 -238
3992 -238 35 -54 -38 149 -21 -49 198 -49 -302 -95 -104 -159 129 -161 64 -323 -45 322 246 21 91 -140 -192
4015 -192 -10 -77 -336 -46 28 32 310 0 -160 -70 166 -132 -123 -178 52 9 258 -119 457 61 33 146 28
4038 28 -220 102 148 -136 77 247 -32 2 -317 198 186 41 398 118 -185 -95 -4 3 -4 -127 -32 -372 -18 11
4062 11 21 -87 -82 -150 -70 76 193 40 -143 -21 303 -139 -244 102 166 6 139 -59 -25 -119 95 -354 9
$$ packed form
3896b55M07J09j85k39J26P9l52L11R5j84J75n4J7J01k65rJ93k8j7l2l34J98K23
3919H0J52l46L2oJ09J3N0J17j21k75K28J72l9l17J49N1k33K84j68q8R0j12J32
3942d6J84j94M5p3m5J48pn1k0J54j95j46K59l09K51M1L3N3J43l76J88J45j69l6
3966b3Q5R8k13o5m3L0J66P4R0j98K32k43Q0j43J10nJ66j96q9q9J15qm7k9N1j44
3992b38K73q9J6J87j70k8K47k47k53K07rn5K88k90K25l87K78L67p6k25P0k31n2
4015a92J82o7k59K90P4MK78l10j60R0K36k98Rn5K30m3K49l77N76l96k8J13j18
4038B8k48L22M6k84K13J70k79L4l19N15j2j45L57k80l03R0R1Ppj23R5l40L54K9
4062A1J0j08No8Q0J46J17j53j83J22L24m42j05L46O4j60J33j98L4r4K14m49L63
$$ plain form
4085 9 136 -14 -316 108 -112 79 -84 86 -75 153 45 81 -41 -196 -37 1 86 187 141 -170 -299 61
4107 61 129 -253 115 -76 72 -150 -33 69 81 142 39 215 -54 -115 -79 100 -34 -75 61 -126 -193 123 -111
4130 -111 170 19 -80 -84 236 274 278 178 -118 -132 275 -258 -82 -180 95 253 -128 -148 -173 -180 -62 223 -19 196
4154 196 9 -203 173 173 -172 -251 -26 -90 -142 -12 63 -110 156 77 242 83 -133 26 11 -54 174 65 -106
4177 -106 -203 -196 28 -171 -34 -33 -151 15 69 3 166 -120 55 193 -216 -197 166 -49 182 134 -56 -25 65 266
4201 266 203 -99 -70 -166 27 -130 -160 -87 -139 203 -8 -20 -113 93 -112 -56 -49 99 36 -164 211 -31 136 -61
4225 -61 -73 -85 115 180 -140 -110 -52 -27 71 -42 124 82 -33 181 -140 69 183 -360 -16 -59 150 -71 -215
4248 -215 174 -240 -179 84 -122 -135 70 341 366 226 178 128 -149 77 178 -126 -107 39 172 132 163 13 -89
$$ packed form
4085IJ27j50l02M24k20J91j63J70j61K28j08L6j22j55J59L8Q5J01m6l11j29L60
4107F1O8l82L68j91J48k22J17J02J2O1j03J76k69o1L6J79j34m1J36j87o7L16k34
4130a11K81j51r9mL20L8Mj00k96j4M07n33J76r8K75J58l81k0k5pJ18K85k42K15
4154A96j87k12L76%l45p9K25o4n2J30P5j73K66p9J65j59k16J59j5o5K28j09j71
4177a06r7PK24j99J37Jj18J66N4o6J63k86J75J38m09J9L63k15K31m8j90L1R0K01
4201B66o3l02K9r6J93j57l0P3n2L42k11j2r3K06k05N6PJ48o3k00L75k42J67j97
4225f1j2j2K00O5l20L0N8K5R8j13J66m2j15K14l21K09J14n43L44m3K09k21j44
4248b15L89m14O1K63k06j3K05K71K5j40m8n0k77K26J01l04J9J46J33m0L1j50j02
$$ plain form
4271 -89 -9 15 -11 -55 36 -76 -98 32 103 28 62 -227 -2 46 -18 29 -31 -212 50 -151 -118 208 81 112 141 54
4297 54 158 -94 -220 76 1 -107 396 77 71 -92 -28 230 -78 -184 26 93 -226 8 -373 112 340 37
4319 37 94 79 100 -36 143 169 116 -218 176 212 -71 71 381 360 -87 20 -256 62 308 -33 -255 -102 210
4342 210 29 145 41 -160 120 -87 10 192 -304 114 -10 -116 -254 -392 71 140 -234 171 -251 59 -4
4363 -4 40 -227 -177 -261 -2 110 243 54 -65 -282 45 -47 -96 -71 159 59 -7 64 68 -44 112 59 -20 -128 -38
4388 -38 88 172 -36 -66 16 -3 73 225 3 -36 7 -103 -170 -329 135 24 -116 -72 38 302 63 277 -175
4411 -175 -160 157 -65 35 68 -2 120 217 178 -130 -64 -82 298 139 28 -387 171 74 -220 65 60 252 -62
4434 -62 -57 66 65 37 342 242 233 134 -79 -194 -169 -126 -63 -226 -3 -165 -115 0 118 96 22 -172 243 120 79
$$ packed form
4271h9Q0K4k6m4R1j12k2J30P1p5L4k89K25M8o4M7o0j81K62k01L3L26j27L1K9q7
4297E4J04k52j26K96p5j08N03l19oj63O4K58l08j06K10O7l19K34l81M85K28l03
4319C7N7j5K1j36J79K6n3l34L94L6k83J42L10k1m47J07k76L18K46l41k22J53L12
4342B10j81J16j04k01K80k07R7J82m96M18j24j06j38j38M63O9l74M05m22L10o3
4363dM4k67N0q4K59J12J33j89j19k17L27r2m9K5K30j00o6P1Mj12J56n3p9j08R0
4388c8J26Q4k08l0Q2j9P6J52k22l9M3j10o7j59M64j11j40M4J10K64k39K14m52
4411a75J5L17k22J00L3p0J22R7l9l08O6j8L80j59j11m15N58r7k94K85nJ92l14
4434f2NJ23jk8L05j00rr9k13j15K5M3O3j63K23j62N0J15J18k2p4j94M15j23m1
$$ plain form
4459 79 107 -223 -144 -26 75 23 170 55 133 155 82 133 41 292 148 29 108 -12 -187 88 177 -61 -2 143
4483 143 30 113 156 166 118 84 80 62 57 -230 -197 -70 -269 293 -141 -228 -21 -83 -20 -127 -130 102 63 -132 10 51
4509 51 68 78 224 217 159 -62 66 -277 127 29 -17 73 -101 -160 -403 188 -209 380 -144 43 -38 127 108 171
4533 171 65 298 12 130 -255 87 193 -53 133 117 37 0 -23 -102 -128 68 -3 153 41 -226 152 -77
4555 -77 -33 -67 30 -163 10 37 -282 -98 299 -10 302 -70 21 -199 171 99 90 -62 72 -184 -102 -9 -129 79
4579 79 -103 238 0 15 52 -227 198 172 -24 -27 33 -23 250 -72 30 -58 174 77 162 44 29 51 -198 -13
4603 -13 -20 -55 86 -124 -67 14 241 -161 387 -237 -7 136 -14 -180 77 192 200 185 82 -317 108 132 210 2
4627 2 -47 148 -56 125 -46 -140 271 -6 -201 166 53 -35 -434 -70 22 -53 360 -15 -73 -106 65 25 -75
$$ packed form
4459G9K8l30P9J18J01n2J47j15P8K2p3N1r2K51j44j19P9j20j75K75Q9k38N9J45
4483A43j13Q3M3J0m8l4mj8nk87L3J27j99N62m34q7K07o2O3j07lK32l9j95J42M1
4509E1J7J0J46pn8k21J28l43M04r8m6R0j74n9k43N91l97N89n24J87q1J65j9O3
4533A71j06K33k86J18l85L42J06k46J86j6q0l7k3p9k6J96p1J56j12k67L78k29
4555g7M4l4R7j93J73K7l19J84L97l09L12l72R1k20L70p2rj52J34k56Q2R3j20K08
4579G9j82L41k38J5L7k79M25k6j96lO0n6K73l22J02q8K32r7Q5j18j5K2k49J85
4603a3pl5J41k10N7Q1K27m02N48o24K30J43j50j66K57J15Qj5j03l99M25K4P8k08
4627Bm9J95k04J81j71r4M11k77j95L67j13q8l99L64R2p5M13l75n8l3J71m0j00
$$ plain form
4650 -75 -216 7 -12 -63 -77 -109 26 25 86 -118 78 142 192 -97 435 -189 -92 47 -302 -130 154 224 -24 58
4674 58 402 -115 91 -117 -38 -101 29 52 29 -11 -86 232 -73 40 179 -228 -8 40 -279 -117 -299 -187 41
4697 41 12 -77 -57 -45 89 -339 32 151 -27 156 -103 115 -21 174 12 27 -20 68 155 -68 323 281 233 -95
4721 -95 175 88 -246 -19 -20 -108 -88 -152 -225 -422 6 -41 -65 123 42 2 -146 -99 -192 71 -31 -53 6 112 -147
4746 -147 -132 4 -328 213 37 124 132 -20 46 -84 28 -348 172 37 -2 -140 -18 -62 -255 -68 113 27 6
4769 6 -91 -4 -125 -187 33 3 128 81 157 98 -216 -62 -197 2 -229 104 75 -45 -8 -214 -25 -53 -6 53 -154
4794 -154 80 -179 126 -193 -123 115 -102 -114 -55 -36 157 -139 59 197 7 -204 196 -109 -82 190 -87 -83
4816 -83 -257 69 65 122 -26 114 -11 -92 -119 180 17 258 21 -123 -54 189 -108 77 -148 101 -199 -138 54
$$ packed form
4650g5j41K23j9n1j4l2J35jO1k04J96O4N0k89N32o24R7J39l49J72K84P0k48Q2
4674E8L44n17K06k08P9o3J30K3k3m0p5L18l05J13J39m07K20M8l19J62j82J12K28
4697D1k9q9K0J2J34m28L71J19j78J83k59K18j36J95j62J5m7Q8Q7k23L91m2m8l28
4721i5K70q7l34K27jq8K0o4p3j97M28m7k4J88q1m0j48M7r3K63j02k2N9J06k59
4746a47J5J36l32N41j76Q7Qj52O6j30J12l76N20j35l9j38J22m4j93J87J81q6k1
4769Fr7Q7j21o2K20l0J25m7P6n9l14J54j35J99k31L33k9j20L7k06J89k8M7N9k07
4794a54K34k59L05l19P0K38k17j2N9J9J93k96J98J38j90k11M00l05K7K72k77M
4816h3j74L26mN7j48J40j25q1k7K99j63K41k37j44O9K43k97J85k25K49l00O1J92
$$ plain form
4839 54 123 76 128 74 31 -251 128 54 -39 159 23 14 -67 24 164 11 64 -260 23 47 -38 -195 128 -5 -196
4864 -196 -168 136 -10 156 76 83 106 -256 -85 -484 -127 -173 165 307 -54 -135 -35 3 -330 26 -310 -67 216
4887 216 61 70 112 114 -391 -226 -63 -9 2 218 31 -207 110 192 -119 113 59 176 -80 229 60 -166 -13
4910 -13 78 118 -114 -155 -30 32 -120 60 75 51 171 81 138 -135 70 22 67 171 -227 49 -218 -174 -91 -82 148
4935 148 -151 179 44 -195 -13 -168 -199 80 -135 217 -198 -2 -98 85 14 170 115 -137 -150 -165 85 35
4957 35 63 -76 128 -79 229 46 -154 147 -23 257 284 -46 186 4 -110 -288 -109 -81 115 -185 52
4978 52 224 65 -89 49 -285 -28 -107 -139 -79 -120 67 184 16 -127 110 -83 166 -134 220 -34 6 -145
5000 -145 168 208 -38 -5 23 203 -45 -142 108 48 116 117 -125 97 -111 162 -46 -231 -38 -45 -208 260 -32
$$ packed form
4839E4O9m7N2n4m3k82L79p4r3J98j36rq1R1J40j53N3l24K83K4q5j57L23j33j91
4864a96K8L04j46J66q0PK3l62J71l99L57m6L38J42l61q1J00L8l33L56l36K43K83
4887B16j55RM2Kn05J65J63N4J1K16j87k38L17Q2l11K32n4J17k56L09j69k26J53
4910a3R1M0k32m1J25O2j52J80J5k4J20r0N7k73K05m8M5J04l98K76k67M4Q3RK30
4935A48k99L30j35k39J82j55l1K79k15L52m15J96r6J83p1J56n5k52j3j5K50n0
4957C5K8j39K04k07L08j83k00L01j70K80K7l30K32j82j14j78J79K8J96l00K37
4978E2J72j59j54J38l34K57p9l2O0m1J87J17j68j43K37j93K49l00L54k54M0j51
5000a45L13M0k46L3K8J80k48r7K50o0O8Jk42K22k08K73k08j85J93pj63M68k92
$$ plain form
5023 -32 45 -20 -43 -80 -91 -182 -116 -230 -155 38 -1 -6 157 119 132 -217 -73 108 45 54 94 -216 -16 -195 45 312
5049 312 -31 38 79 -38 189 172 -138 206 432 -42 50 -110 -79 235 -122 -75 -93 -62 138 -36 36 67 -112
5072 -112 -159 -75 14 -265 -134 21 5 34 -59 87 121 192 -136 63 -54 -65 171 -124 -42 126 -258 -200 -49 -305
5096 -305 -171 -129 -310 -303 -34 157 65 -159 12 63 -68 -157 -58 -188 -147 -211 246 80 -76 -67 93 -214 197 -26
5120 -26 -323 5 38 26 -75 212 0 377 -65 43 -121 -62 -68 -187 -215 222 84 -14 147 185 281 135 -98
5143 -98 23 -119 -143 -37 14 -211 150 -152 -137 -181 -52 48 -182 -106 -58 -169 -101 84 -86 139 -78 -125 -58
5166 -58 170 101 1 -146 164 -334 -179 92 223 -83 72 33 -161 127 -262 -40 41 49 -27 74 131 68 45
5189 45 123 171 133 312 93 118 35 72 -215 203 -71 -269 -96 85 -49 107 62 99 -138 13 113 104 13 -389
$$ packed form
5023c2P7o5k3l7j1r1O6j14P5J93l9nJ63l8J3l49J44J81o3RM0l10K00j79K40K67
5049C12l43O9M1j17K27j7l10L44K26m74R2j60L1L14l57M7j8L1K00j74P2L1j79
5072a12m7Q4Q9k79J31J55j6K9r3J46L4P1l28J99j17j1K36k95Q2J68l84N8J51k56
5096c05J34M2j81PK69J91r2k24J71N1j31q9R9j30M1o4M57j66j56RJ60l07M11k23
5120b6k97L28L3j2j01K87k12L77m42J08j64N9oj19k8M37j38r8J61L8R6j46k33
5143i8J21j42k4J06N1k25L61l02J5m4J29J00k30P6M8j11O8J85j70K25k17m7O7
5166e8K28o9j00j47L10m98J55K71J31l06J55l9j94K88l89K22Q1Qp6J01N7o3k3
5189D5P8M8l8J79k19K5q3L7k87M18k74j98J73J81j34J56m5L7k37J51J00rr1m02
$$ plain form
5213 -389 -167 -66 -86 68 395 -188 68 -147 99 -25 -21 79 -436 50 -174 -18 -110 -21 3 -43 -45 54 121 -72
5237 -72 109 -168 -287 139 267 -109 233 -19 183 21 -148 -232 115 -44 37 142 -130 -28 21 104 -98 -92
5259 -92 341 -66 -4 -74 212 -76 -133 -118 -189 97 -56 -61 78 -138 160 -124 98 -34 -8 -67 -81 90 -35 34
5283 34 130 252 -263 -113 15 -30 -16 33 -101 -125 99 308 15 -164 106 172 -238 -74 402 146 124 91 -294
5306 -294 207 402 -228 -6 15 125 -159 54 -91 72 -60 84 76 -136 -179 154 -60 -45 -105 -125 -152 -347 41
5329 41 207 -70 -114 -143 -210 419 -87 -271 18 -139 -150 -66 -6 86 18 254 69 -77 137 73 70 87 -264 34
5353 34 41 -71 -155 47 238 16 58 -26 272 150 30 83 -383 -55 182 0 166 285 -160 -106 -43 86 -41
5376 -41 120 46 157 227 -37 53 8 -56 -17 -163 -63 -153 121 7 -71 -38 -18 -35 76 -27 156 35 -26 40 -6
$$ packed form
5213c89K22J01k0J54L27n83K56k15K46j24MJ00n15M86k24J56r2Q9K4m6kR9O7j93
5237g2J81k77j19M26J28l76L42k52K02j62j69q4L47j59Q1J05k72J02M9Q3k02O
5259i2M33m07O2p0K86k88n7J5p1K86j53nJ39k16K98k84K22j32K6n9j4J71j25O9
5283C4R6J22n15J50J28m5J4M9j34k4K24K09k93j79K70O6m10J64M76k56k2l3l85
5306b94N01J95o30K22K1J10k84K13j45J63j32J44qk12m3L33k14J5o0k0k7j95L88
5329D1J66k77m4k9o7O29n06j84K89j57j1Q4O0R2o8K36j85j46K14o4lJ7l51K98
5353C4Pj12q4K02J91k22M2q4K98j22j20N3m66L28K37j82J66J19m45N4O3J29j27
5376d1J61p4J11P0k64R0m5o4L9j46J00r0K74j14p8L3K0j7J11j03J83j21o1O6m6
$$ plain form
5401 -6 150 -140 6 259 -161 -31 119 42 288 -46 9 158 -24 -72 -96 -59 346 244 12 112 36 39 -167
5424 -167 3 240 -95 64 56 153 -156 -179 -173 53 93 -271 300 -107 118 140 -11 145 -55 135 62 103 -46
5447 -46 89 117 84 -51 111 90 279 -232 452 -179 -109 460 8 -56 8 -41 -46 -179 -218 -47 135 -318 -29 172
5471 172 -64 63 17 -45 -30 13 -2 -157 165 106 -53 43 -33 406 -125 -51 18 6 168 -20 119 -174 -162 57
5495 57 -85 249 -26 65 0 52 12 -7 102 3 -10 -196 158 41 152 -11 3 -50 35 -39 18 -137 -4 249
5519 249 78 189 -289 128 54 110 -142 46 24 -69 45 246 -82 49 131 -361 -155 352 -203 -172 -87 -253
5541 -253 -123 -183 -95 -185 12 -17 -64 62 -214 15 -189 20 21 -79 292 215 81 148 -35 -152 29 226 -216
5564 -216 -93 -195 28 -150 177 31 -100 139 169 -35 -65 101 52 -142 -95 -183 -164 -44 49 69 129 119 87 171
$$ packed form
5401fJ56k90J46K53m20J30J50p7K46l34N5J49j82m8k4L7M05j02k32J00p6Lk06
5424a67J70K37l35J59qR7l09k3OK26M0l64N71m07K25K2j51J56k00J90p3M1j49
5447d6J35K8l3j35J62k1J89n11O84o31P0N69m52o4O4m9nj33l9J71J82m53K89K01
5471A72k36J27m6o2J5M3j5j55L22n9j59R6p6M39n31P4O9j2J62j88J39k93J2K19
5495E7j42L34k75R1o5N2m0j9J09r9j3j86L54j17J11j63J4n3Q5p4N7j55J33K53
5519B49j71J11m78M17p4N6k52J88k2r3J14K01l28J31Q2m92K06N07n55L1Q5j66
5541b53J30o0Q8r0J97k9m7J26k76K29k04K09Jj00L71p7j34O7j83j17J81J97m42
5564b16J23j02K23j78L27j46j31K39L0k04l0J66m9j94M7q8J9J20R3K0O0j0l2Q4
$$ plain form
5588 171 -125 206 61 84 -137 -404 114 -36 -29 -243 130 -48 96 -118 53 -95 62 -2 -83 133 -26 84
5610 84 -67 80 176 -255 -61 22 341 31 -7 195 -123 147 -173 -65 47 220 -41 -163 89 -1 -179 -62
5632 -62 99 42 -22 -148 -76 -98 125 54 -54 -20 148 -226 46 -53 220 -97 308 220 172 275 -25 97 -59
5655 -59 -75 48 113 -5 211 -18 132 48 231 -247 68 -241 140 -18 -245 173 -59 -130 -271 46 -40 47
5677 47 1 -111 90 59 -80 -27 20 -15 306 167 43 33 184 -70 156 -77 -156 -132 70 -247 82 214 75
5700 75 112 -78 -188 141 -64 -208 95 -131 -92 75 -91 16 52 -237 80 166 -82 144 -51 -34 42 10 -120
5723 -120 2 102 99 -31 56 112 143 85 117 65 -74 -26 -263 -145 -28 -300 -50 38 272 104 104 -9 -190 -151
5747 -151 -18 74 8 -204 -32 35 -196 -8 -235 204 -77 -167 177 8 48 -110 -123 58 154 -222 124 108 -20
$$ packed form
5588A71k96L31j45K3k21k67N18j50Pk14L73j78J44k14J71j48J57o4q1K16j59J10
5610H4j51J47R6m31J94Q3L19l10l8K02l18K70l20J08J12J73k61j22K52r0j78J17
5632f2J61n7o4j26P2k2K23p1j08L4J68l74K72r9K73l17M05q8m8J03l00J22j56
5655e9j6J23O5j18K16k29J50q4J83m78L15l09L81j58k27M18k32p1j41L17q6Q7
5677D7m6j12K01l1j39N3M7l5L21j39j24j0J51k54K26k33p9K4K02l17L29J32j39
5700G5L7j90j10L29k05j44L03k26L9J67j66J07L6k89L17Q6k48K26j95J7P6l2j30
5723a20J22J00lj30Q7N6L1n8L2n2j39M8k37J18J17k72K50Q8K34j68%j13j81L9
5747a51J33R2o6k12J72O7k31J88k27M39k81r0L44j69M0j58j3J81R6l76L46j6j28
$$ plain form
5770 -20 -289 -160 174 -277 -2 -84 178 -132 57 -22 -28 -297 -11 75 -79 75 301 -75 116 94 123 -179 176
5793 176 185 -196 -222 -20 -9 -264 -12 -20 -159 -110 72 254 180 124 195 -11 17 -196 37 -60 -154 205 -14 156
5817 156 116 56 10 52 -270 174 162 54 16 -232 -50 -201 -33 -121 -385 -33 -143 -81 -366 -23 -450 -146 137
5840 137 -57 262 -39 32 -112 -46 -311 22 106 31 -101 38 10 62 -80 -59 271 326 -121 336 25 114 -183
5863 -183 106 -111 -130 10 87 100 -161 149 121 -279 -192 -135 -53 276 -284 -101 -315 55 -103 74 -240 308
5885 308 107 -263 235 81 -15 -251 69 -282 -59 92 -148 -505 87 34 36 80 -55 -33 -42 321 -11 -161 -33
5908 -33 -25 228 -158 149 111 -274 -22 47 8 48 -49 42 49 -105 289 -149 -54 70 -13 57 -65 38 30 -120 48
5933 48 196 159 -47 96 -327 44 31 -51 -45 17 -8 -175 21 -155 24 -5 -257 68 -6 33 167 54 241 129
$$ packed form
5770b0k69J29L34m51K75q2K62l10J89p9ok69K86Q6j54J54K26l76J91k2K9l02L55
5793A76Rl81k6K02J1k55K52qj39M9J82J82p4n6P1k06K8k13K33r7r4L59k19J70
5817A56m0o0m6M2l22M44j2j08l8k48J82j51J68q8k64L52j10O2k85L43m27L04K83
5840A37j94L19l01P1j44O6k65L33Q4p5j32J39k8N2j42K1L30N5m47M57l11Q9k97
5863a83K89k17j9J40P7J3k61L10k8m00Q7N7Q2L29n60J83k14L70j58J77l14N48
5885C08k01l70M98j54r6k36L20l51K23J51k40l57N92n3KM4j35K2rL63l32j50J28
5908c3QK53l86L07l8l85K52O9l9M0r7R1Pj54L94m38R5J24q3P0j22J03qj50J68
5933D8J48l7k06J43m23L71j3q2OO2k5j67J96j76J79k9k52L25p4L9J34j13J87j12
$$ plain form
5957 129 -23 -126 196 123 -47 216 84 -236 137 -220 120 93 -56 -173 17 -76 -88 -151 89 59 -61 -33
5979 -33 52 -95 -174 -35 -80 -135 -2 -119 -322 58 -150 -104 -292 197 125 194 162 -119 -207 -133 91 -172 103 3
6003 3 214 58 -47 -83 -122 -39 -132 -87 272 41 160 1 130 -303 266 -106 -19 -51 -17 148 120 20 -41 -62
6027 -62 54 83 -27 104 -114 -30 -173 -118 -124 -114 129 96 2 -266 -96 8 -74 12 -30 -104 -145 -104 -160 -91 -107 -35
6053 -35 50 56 242 220 -64 -4 -40 -105 -93 -55 -131 -167 238 37 273 80 -17 -22 -11 -177 -17 -112 52 91 74 -312
6079 -312 175 -15 -286 84 252 -214 -35 -128 -165 34 82 -18 -256 -108 -333 -191 -167 80 50 -66 -126 177
6101 177 -82 253 62 -33 162 -74 1 -123 -275 244 28 -192 -79 110 -213 101 287 84 168 183 -117
6122 -117 138 129 152 -91 57 -179 11 77 -48 -175 -162 -23 -32 143 -71 -237 92 23 26 65 -249 198 54 -1
$$ packed form
5957A29j52j03L22p3j70K63j32l20L73l57L40k7j49j17J90r3j2o3K40l0j20K8
5979c3Q5j47p9J39m5n5J33j17k03L80k08M6j88M89p2O9l2k81q8P4K24k63K75j00
6003CK11j56j05l6l9Q3r3M5L59k31J19j59J29m33N69l72Q7l2L4J65k8j00o1k1
6027f2J16K9j10J31k18Q4j43N5oJ0K43l3r4k68J70J04q2Q6m2p4m1M1n6O9j6P2
6053c5Q5OJ86k2k84O0l6o5J2L8p6l6M05k01K36j93r7nJ1j66J60r5J64L9j7l86
6079c12M87j90k71L70J68m66J79r3l7J99M8j00k38J48k25J42K4K47l0j16o0L03
6101A77k59L35j91r5J95k36P5j24j52N19k16k20J13J89l23L14J86k03Q4J5l00
6122a17K55rK3k43J48k36J90O6j25j27J3J39rJ75k14j66L29o9LL9l14M47j44n5
$$ plain form
6146 -1 95 -221 -31 -57 436 -198 -55 17 194 163 -93 23 -303 241 94 -105 -178 -221 -238 183 -243 -89 -188
6169 -188 -8 -77 13 0 -158 -187 47 -82 -140 41 151 -95 4 -139 234 47 99 69 92 1 -221 34 42 50 12
6194 12 -155 -21 -161 -169 65 60 91 -261 49 -68 -164 -80 50 299 -47 -2 -92 -129 -152 -30 -116 -201 59 -203 -163
6219 -163 -15 -84 -144 66 -25 50 290 253 -53 -158 191 123 -64 -70 -56 69 42 -293 427 85 -8 -22 -111 124
6243 124 62 -210 33 -33 37 34 173 -61 109 6 -12 -49 317 227 -214 -9 -63 86 174 225 -107 101 -19 5
6267 5 -149 70 -20 15 106 137 20 118 21 -16 -62 211 -125 263 182 187 -14 289 106 125 65 -153 27 -150 132
6292 132 25 -204 201 167 158 114 -33 161 69 80 199 -128 -155 -335 213 54 182 180 -5 47 174 56 52 71
6316 71 194 -15 141 -121 55 83 -212 123 275 17 242 72 -8 58 86 254 -44 -63 -167 142 -13 49
$$ packed form
6146aR6l16J90k6M93o34J43P2J77l1k56J16l26N44j47j99p3m3j7M21m26J54r9
6169a88J80o9R0j3j58k9K34j29n8J81J10k46R9j43L73j87N2l0K3r1k22K55QQl8
6194A2j67J34j40qK34nL1l52L10j17r6Q4J30K49l46M5r0l7k3J22q6q5K60k62M0
6219a63J48o9o0K10r1P5K40l7l06j05L49o8j87oJ4J25k7l35P20l42r3j4q9K35
6243A24o2k72K43o6P0lJ39k34J70j03j8l7L66r0m41K05n4J49Q8N1l32K08j20K4
6267Ej54K19r0L5R1L1j17R8r7l7m6K73l36L88q1Nk01L03j83J9o0k18J80j77K82
6292A32j07k29M05l4rm4j47J94r2J1J19l27k7j80N48j59J28kj85N2J27j18mJ9
6316G1J23k09J56k62J76K8k95L35J52k58K25j70q0O6K8J68k98j9j04L09j55O2
$$ plain form
6338 49 49 45 6 47 -166 -113 24 64 100 -134 -3 249 91 29 142 44 -104 -116 -150 234 38 -46 295 -272 -332
6363 -332 170 -66 253 -115 -51 -118 184 -164 -112 -192 -165 81 -14 84 -71 142 -182 131 -160 16 49 -233 -69
6386 -69 81 171 -117 70 86 -132 178 -99 -35 -99 102 237 160 -138 -181 164 -33 -10 17 -30 40 -78 109 39
6410 39 29 -284 -65 -160 -261 290 -7 52 103 -36 145 -48 -9 44 168 82 -111 32 24 98 55 -74 -122 123
6434 123 -66 148 90 -211 -154 33 -26 2 -76 -68 -103 202 179 181 237 168 -102 -239 119 148 145 -38 25 -233 119 -177
6460 -177 25 108 449 85 76 209 172 -200 83 -258 -13 28 17 169 39 32 128 -96 142 27 -172 -34 160
6483 160 -223 -33 92 247 137 -194 -85 -271 -107 176 31 78 207 -97 -136 -121 -51 -16 -56 -11 251 247 -209
6506 -209 -226 260 109 -115 -56 -118 102 -257 -42 170 33 7 4 152 245 91 -120 -144 -149 -84 -90 304 -93 18
$$ packed form
6338D9%ml9M1k13N3J37M0L6k34J31K52j58o2J13r8j48j2l4L84j96q4L41n67o0
6363c32N02k36L19l68O4o7L02l48N2q0K7K46r5R8j55K13l24L13k91J76L3k82J64
6386f9J50R0k88J87J6k18L10k77O4o4K01J35p7k98m3L45j97K3K7m7P0j18J87p0
6410C9j0l13K19r5j01N51k97N9N1j39J81j93L9N3J24q6j93J43qP4m3j29m8K45
6434A23j89K14n8l01N7J87n9K8p8Ql5L05k3KN6o9k70j37L58K9lj83O3k58L52k96
6460a77K02Q3L41l64rJ33l7l72K83l41K45M1j1J52j30pR6k24K38j15j99J38J94
6483A60l83J90J25J55j10l31J09j86J64K83j45M7J29l04l9J5P0L5m0M5K62mm56
6506b09j7M86j51k24N9o2K20l59K15K12j37k6lJ48R3j54k11k4nO5oL94l97J11
$$ plain form
6530 18 -127 302 162 -145 -2 31 194 -311 3 278 124 -2 222 -14 -176 -280 126 -81 57 -82 -77
6551 -77 -224 -121 -282 -70 189 116 -347 66 7 -3 250 -241 132 79 87 -58 56 -39 -87 19 143 -169 -19
6574 -19 -91 -410 46 62 12 -130 -27 189 171 157 -6 164 69 -80 120 195 40 202 104 210 64 18 355
6597 355 179 26 81 1 -60 -38 -20 -102 67 20 -148 23 -44 -93 182 -30 -139 -2 131 115 5 45 64 -324
6621 -324 50 43 196 -69 68 -144 30 -237 296 36 -138 47 -139 -362 251 45 164 75 -283 -81 -158
6642 -158 -6 -77 312 81 -67 -150 -104 -58 -79 -46 -115 -65 -102 -350 -15 6 -80 194 -108 -116 51 -111 -149 129 33
6667 33 125 -100 -397 104 269 -21 -40 74 59 78 -42 43 -158 -35 -35 202 72 -112 2 175 28 -33 -84
6690 -84 40 44 -82 -23 -75 -244 214 -48 -45 87 1 33 2 158 116 -46 27 -110 -52 340 -92 -58 53 87 -143
$$ packed form
6530A8j45M29j40l07J43L3J63n05L14K75j54j26K24k36j62j04M06k07J38j39N
6551g7j47J03j61K12K59p3m63M13n9j0K53m91L73n3Qj45J14r5m8J06J24l12J50
6574a9p2l19M56J6n0j42J03K16j8j4j63J70r5j49K00P5j55J62r8J06j46m6L37
6597C55j76j53N5q0o1K2J8q2J69m7j68J71o7m9K75k12j09J37J33j6j10M0J9l88
6621c24L74pJ53k65J37k12J74k67N33k60j74J85j86k23O13k06J19q9l58K02p7
6642a58J52p1L89k31j48q3M6M6k1L3o9N0l7k48L35K1q6K74l02qJ67j62l8K78r6
6667C3R2k25k97N01J65k90j9J14j5J9j20Q5k01J23%K37j30j84J14J73j47o1n1
6690h4J24Mj26N9n2j69M58k62LJ32q6L2l1J56m2j62P3j37N8L92m32L4J11L4k30
$$ plain form
6715 -143 -200 94 -66 133 -171 149 12 105 -187 280 7 -31 139 105 -241 -29 -108 5 -118 -141 67 22
6737 22 54 21 222 74 98 -167 237 -46 -76 132 -101 -21 106 -166 -7 -243 188 -202 121 123 -69 -178 -58
6760 -58 -126 214 -59 114 -52 -10 -168 19 -106 62 -96 -69 -70 -268 171 -235 38 46 233 -127 -246 47 77
6783 77 20 -16 -117 189 -293 122 276 84 -151 97 70 64 -1 19 25 82 -187 -193 28 44 -40 -114 148 -108 -153 -12
6809 -12 246 3 113 -85 -43 -155 -182 -85 103 -30 -99 26 238 -186 -38 66 -49 133 -116 106 12 -165
6831 -165 -282 16 -373 158 108 -214 -35 -226 -155 2 -16 131 218 -178 43 100 -205 -162 -4 43 -158 -68 137
6854 137 212 17 -220 182 1 -147 -19 52 -80 -223 -21 57 -1 -216 -12 3 -94 -103 2 45 -58 195 93
6877 93 -153 207 33 74 174 202 181 -23 83 -120 -16 189 -46 -76 214 -194 102 -16 117 -120 130 75
$$ packed form
6715a43n7K94j60J99l04L20j37R3k92M67k73l8J70l4l46K12p9J13j23k3K08m5
6737B2L2l3K01j48K4k65M04k83l0K08k33Q0J27k72J59k36M31l90L23Kj92j09J20
6760e8o8L40k73J73j66M2j58J87j25J68j58K7jj98M39m06K73QJ87l60j19K93L0
6783G7n7l6j01L06m82M15J54j92k35K48k7oo5K0ON7k69oK21J6q4p4K62k56m5J41
6809a2K58k43J10j98M2j12k7R7J88j33o9J25K12m24J48J04j15J82k49K22r4j77
6831a65j17K98l89N31n0l22J79j91P1J57j8J47Q7l96K21N7l05M3J58M7k01R0K05
6854A37P5j95k37M02j81j48J28P1j32j43K02P8n8k15K04J5r7rJ05M3j03K53j02
6877I3k46L60j74M1J00K8k1k04J06k03J04K05k35l0K90m08K96j18J33k37K50n5
$$ plain form
6899 75 72 -290 -145 -25 -136 -85 29 -15 188 -44 -259 71 44 82 302 22 -68 22 11 147 -171 -88 -5 105
6923 105 -207 54 -141 185 18 64 66 -48 428 -80 -182 -95 221 -255 106 36 -163 15 -208 151 149 -177
6945 -177 62 63 -319 105 217 92 -54 -147 69 176 -108 -344 40 -78 7 -95 -55 95 -185 45 79 -146
6967 -146 68 -74 -46 51 -181 81 -228 206 -525 -26 19 -197 -96 -123 -122 -17 -7 1 102 -1 -132 -60 -10 -107
6991 -107 348 72 -272 59 -101 -34 -24 77 110 194 -164 -294 97 -20 12 25 -162 147 -9 -8 -165 150 111
7014 111 363 117 41 71 90 -132 138 -271 -199 110 -117 31 141 -419 -130 274 10 109 -45 -19 -68 -28 37
7037 37 -186 -209 -112 -78 20 96 -118 88 -107 -135 -135 -56 19 56 -115 44 -142 -84 77 69 -181 -34 -9 83 76 133 38
7064 38 -141 202 -118 65 33 -146 45 7 6 -329 28 340 165 -107 145 162 103 -44 -31 32 43 -74 -55 -54
$$ packed form
6899G5ll62J45J20j11N1J14m4K03k32k15L30k7L8K20k80r0R0j1J36l18Q3Q3J10
6923A05l12K61j95L26j67M6Kj14M76n08j02Q7L16m76L61p0j99J78k23L59kl26
6945a77K39Jl82M24J12j25j46r3K16J07k84k36L84j18Q5j02M0J50k80K30L4k25
6967a46K14j42K8R7k32K62l09M34p31M99M5k16J01k7JJ05J0QJ01j03j31P2N0r7
6991a07M55k76l44L31j60O7J0J01L3Q4l58j30L91j17L2J3j87L09j56Jj57L15l9
7014A11K52k46p6L0J9k22K70m09P2L09k27J48J10n60K89M04k64R9j54K6m9M0O5
7037C7k23k3R7L4R8P6k14K06j95k8%P9P5L7j71J59j86N8J61qk50J47K5R2pN7r5
7064C8j79L43l20J83l2j79J91l8jl35L57L12j75k72K52J7n9j47J3O3J1j17J9J
$$ plain form
7088 -54 -18 -311 124 -86 -173 -58 182 -103 -311 39 107 153 3 -19 186 -31 145 -56 -36 239 -93 22
7110 22 8 -125 -100 14 -159 -80 -149 -91 -228 -246 213 293 -44 68 221 53 -170 85 0 104 69 -128 -277
7133 -277 -275 -214 -20 431 31 -22 -158 -278 96 58 -115 -127 50 59 360 295 -85 -138 -174 -273 -83 148 -21 10
7157 10 53 200 65 47 -104 -265 -123 -189 -175 -27 143 201 196 116 -15 -54 49 -52 -269 227 73 -19 139 -15
7181 -15 -40 80 -141 -149 -82 127 -139 27 243 -20 8 -49 -127 42 -15 -109 -194 -156 -101 28 -81 162 -49 -233
7205 -233 -79 147 101 -56 214 35 41 -79 43 5 51 -108 -207 -18 -117 116 193 20 41 -106 -108 -226 -211 -4
7229 -4 -151 277 65 72 83 -136 -184 14 -24 142 64 -67 -43 30 39 9 -100 65 -178 -38 -72 -257 -187 -92 85
7254 85 95 123 91 105 64 143 -4 216 295 124 74 -70 -39 18 -320 -6 134 -77 -411 60 129 62 261 7
$$ packed form
7088e4L6k93M35k10q7J15K40k85k08L50O8M6j50k2K05k17J76k01K0K75l32J15
7110B2j4j33K5J14j73P9o9N8j37j8M59Q0l37J12J53j68k23K55q5J04l5j97j49
7133b77KO1J94M51m00n3j36j20L74l8j73j2J77RL01o5l80n3l6r9J90K31j69L1
7157A0M3J47j35j8j51j61J42o6J4J48J70N8nq0j31l9J03j01k17M96j54r2J58j54
7181a5k5J20k21qO7K09k66J66K16k63K8n7p8J69n7r4q5L8N5J29j09K43k11j84
7205b33J54K26m6j57K70j79Oj20J22l8M6j59r9J89r9K33P7j73K1j47kj18J5K07
7229dj47M28k12PJ1k19m8J98l8J66p8j31K4P3Rl0j09J65k43J40l4j85P0R5J77
7254H5J0K8l2J4m1P9j47K20P9j71n0j44L1N7l38L14J40k11l34M71O9o7J99k54
$$ plain form
7278 7 -128 22 52 71 -316 97 -317 -147 106 -283 -114 15 128 -105 248 55 168 55 -323 277 -181
7299 -181 -8 93 125 54 266 43 193 -177 -15 146 -270 61 4 35 54 -61 196 -154 79 -111 -151 81
7321 81 -198 157 -26 218 -209 -123 106 120 137 -71 46 -98 105 65 128 422 259 13 -178 120 -252 -86
7343 -86 202 -41 45 -158 -31 198 16 -263 55 -84 86 243 -161 -118 15 -106 157 -185 31 -94 59
7364 59 23 -168 -122 69 36 33 204 190 -117 -152 -20 -53 -80 180 330 -176 9 131 43 199 56 111 61 92 58
7389 58 95 56 123 60 180 -101 -82 73 -99 418 -139 68 64 -123 161 -72 -199 -21 -149 23 48 -172 112
7412 112 62 92 -220 -8 -38 127 62 -159 -183 -251 -75 -81 23 22 -239 86 -139 -52 78 -6 109 -137 31 -30
7436 -30 -99 146 259 -136 82 -6 85 -354 -138 -86 -191 276 -47 -28 -55 -221 -204 78 -6 -150 -47 153 60
$$ packed form
7278Gj35J50L0J9l87M13m14J70K53l89J69J29J13k33L53j93J13j13l78O00m58
7299a81J73J01L2p1K12k23J50l70J62J61m16L31n7L1J9j15K57l50K33j90m0K32
7321H1k79L55j83K44m27Q6K29J4J7k08J17j44K03m0O3K94j63k46j91K98l72J66
7343h6K88k43Q6k03J27K29j82k79L18j39J70J57m04M3J33j21K63l42K16j25J53
7364E9l6j91M6J91l3lJ71j4l07l5J32l3k7K60J50n06J85J22q8J56j43N5n0L1l4
7389E8L7l9O7o3J20k81J9J55j72N17n57K07mj87K84k33j27J78j28J72K5k20K84
7412A12n0L0l12K12l0J65o5k21k4o8J76oJ04jk61L25k25Q7J30q4J15k46J68o1
7436c0o9K45J13l95K18q8R1m39K16N2j05M67l23J9k7j66J7K82q4j44J03K00r3
$$ plain form
7459 60 46 187 100 182 79 81 209 101 6 22 -168 -148 238 217 48 26 -205 228 54 80 -170 40 -12 -173
7483 -173 244 79 -151 -136 -155 -15 53 -55 119 -30 -36 -63 88 -31 10 31 -134 -273 -22 165 2 94 -122
7506 -122 8 -58 -258 173 -217 -173 341 -50 31 55 32 106 -25 63 117 -42 -8 20 -173 -139 158 -119 -221 305
7530 305 -287 -7 -53 14 -29 -320 120 215 112 -142 50 -94 -141 14 -94 -45 -214 -77 72 177 127 323
7552 323 221 23 112 52 207 219 -108 -161 -135 -147 188 -363 -48 10 -40 -28 28 352 -3 -201 -16 -4 99 -54
7576 -54 32 105 -161 -37 48 -24 -57 4 -116 -108 -73 100 -104 25 -221 -82 35 23 54 -82 -338 -313 13 -35 -58
7601 -58 216 70 35 288 -111 6 -99 272 -196 -69 42 -26 69 16 -187 157 112 59 -83 268 -212 -226 -198
7624 -198 40 -172 129 259 -130 72 25 84 -95 -33 45 -8 -29 -275 -5 134 -334 82 -117 184 206 97
$$ packed form
7459F0j4J41q7Q2j03KJ28j08r5J6j90K0L86k1j69k2k31M33j74K6k50K10n2j61
7483a73M17j65k30J5j9J40O8j08J74j49ok7J51j19M1K1j65j39K51J87j63R2k16
7506a22J30o6k00M31l90M4N14l91Q1K4k3P4j31Q8N4j59L4K8j93L4K97k77j02N26
7530C05n92K80m6O7m3k91M40R5j03k54J92j44m7J55j08M9j69J37J49J05n0J96
7552C23j02j98Q9o0J55J2l27n3K6j2L35n51L15N8n0J2N6L24l55j98J85J2J03j53
7576e4Q6P3k66J24Q5p2l3O1j20QL5J73k04J29k46J39J17j2L1j36k56K5L26m8k3
7601e8K74j46l5K53l99J17j05L71m68J27J11o8R5n3k03L44m5n3j42L51m80j4K8
7624a98K38k12L01J30l89K02m7N9j79O2P8n3k1k46K70J39m68M16j99L01K2j09
$$ plain form
7646 97 296 -41 -179 234 -22 -29 368 164 105 -84 48 13 -19 -258 -78 40 -45 -141 -126 -302 -1 225 379
7669 379 -13 113 0 148 -58 197 -194 243 38 153 176 -256 -10 -113 23 107 184 35 113 -161 127
7690 127 -93 77 472 -26 2 83 62 12 217 -15 119 79 -199 -36 -249 180 -152 -299 -85 -133 224 -24
7712 -24 7 127 9 31 244 168 60 63 102 -53 -1 45 114 228 54 97 -135 -167 -132 -54 46 127 -143 -262 292
7737 292 -26 -82 16 29 31 -150 -114 76 -150 -132 51 17 54 -94 122 89 -169 -194 -115 68 127 -14 146 138 159
7762 159 266 242 133 -211 -210 101 309 206 -90 -94 62 160 170 -51 91 -339 -204 173 12 -103 159 169 145
7785 145 21 -165 4 -37 172 18 -261 -221 16 274 -73 -135 -210 -131 -221 161 134 -14 29 -124 211 107 -75
7808 -75 -356 -156 24 64 -139 133 169 -266 -76 -109 103 -131 -145 100 -65 -239 206 119 -111 -46 91 -173
$$ packed form
7646I7J99l37j38M13k56pL97k04n9j89J32l5l2k39J80J18q5r6J5j76L01K26J54
7669C79l92J26j13J48k06K55l91M37k05J15K3m32K46j03J36Q4P7j49P8k74K88
7690A27k20J70L95m98K8Q1k1n0K05k32J34m0k78J63k13M29l32j47K14m8L57k48
7712b4L1J20j18K2K13p6j08LL9j55N2M6O9J14j74M3k32l2L5P8J00Q1k70j19N54
7737B92l18n6R8J3Kj81L6J90k26J8J83l4L7j48K16l3k58k5P9J83N9j41J60qK1
7762A59J07k4j09l44JL11K08j03k96mJ56R8J0k21J42m30J35L77j61j15K62J0k4
7785A45j24j86J69m1K09j54k79M0K37K58l47o2p5P9r0L82k7j48M3j53L35j04j82
7808g5k81K00J80M0k03K72L6m35J90l3K12k34j4K45j65j74M45q7k30O5J37k64
$$ plain form
7830 -173 -148 112 27 76 -206 3 -70 110 63 98 59 -116 -243 22 97 -64 140 -430 -66 32 -74 250 -49
7853 -49 51 -251 61 -183 -48 27 -123 196 -348 -128 102 72 139 -128 -126 -116 -115 15 112 81 -51 -254 2 -136
7877 -136 125 55 -294 -207 53 66 -64 -136 12 -16 -134 45 7 -234 29 134 -5 -40 114 102 -318 -134 128
7900 128 -140 202 175 -390 73 140 72 -7 -123 20 -74 -60 152 -25 4 -44 -16 92 86 159 -35 -45 28 -131 39
7925 39 295 -200 -60 221 26 -35 20 -230 -43 -55 66 160 -209 -78 -162 -92 72 145 -30 -48 -156 105 -167
7948 -167 -206 126 -347 11 187 81 56 79 290 -129 6 209 -146 -26 -44 -144 57 487 -2 221 83
7969 83 9 -60 325 189 -56 162 279 -66 7 215 101 226 37 -62 158 -60 226 -149 -92 84 -294 210
7991 210 176 86 257 -74 253 -22 232 -14 26 78 -202 76 242 -85 -200 187 -194 -90 130 -14 47 71
$$ packed form
7830a73K5K60q5M9k82K09p3J80m7L5l9j75j27K65P5j61K04n70L64R8j06L24k99
7853d9J00l02L12k44J35P5j50L19n44K20K30l0O7k67KJ0JJ30R7l1j32k03K56j38
7877a36K61p0l49Q7K60J3j30p2J48k8j18J79l8k41K63J05j39l5J54j2m20J84K62
7900A28k68L42k7n65M63O7o8p9j16J43r4J4K12j77K9m8K8J08oP3j94j0P3j59J70
7925C9K56m95J40K81j95o1N5k50J87j2J21R4l69J31q4P0J64P3j75j8j08K61k72
7948a67l9L32m73L58J76j06k5K3K11m19J35K03l55J20j8j00K01M30m89K23j38
7969H3p4o9L85j36k45K18J17l45P3K08j14J25j89r9K20k18K86l75N7J76l78N04
7991B10l4r0J71l31L27k75K54k46M0N2k80K78J66l27j15L87l81J04K20j44O1K4
$$ plain form
8013 71 -226 -274 3 -203 -179 -125 49 332 -8 -305 -286 116 232 23 92 -41 224 402 2 -57 -23 60 -172
8036 -172 282 26 84 -68 239 -126 -44 23 -271 -57 323 31 151 107 -132 -5 -33 43 22 -31 -170 39 188
8059 188 137 -277 358 -12 95 220 171 -129 47 209 126 -224 190 -232 56 331 297 -212 47 164 35
8080 35 -78 -143 51 161 150 211 -111 -212 -114 36 -137 -240 -213 -118 142 43 -158 -161 -168 -205 49 19 106 154 112 157
8106 157 174 -139 179 113 -6 95 32 -41 -7 137 -346 -78 -72 -20 -24 -149 17 -6 79 190 -53 -151 297 -14
8130 -14 -195 -278 -152 -38 -55 167 102 -169 108 121 241 48 -64 30 -239 68 -21 -325 44 -127 -129 -214 180
8153 180 -78 -56 -18 65 -17 219 -126 138 -163 32 44 287 215 81 -123 193 -45 89 -120 117 97 15 36
8176 36 -120 279 203 69 -58 210 -74 48 -206 -217 -11 113 -78 64 85
$$ packed form
8013G1k97m8K77k06K4N4J74K83l40k97J9M02J16k09O9j33K65J78m00n9L4Q3k32
8036a72M54k56N8j52L07l65Q2O7k94K14L80k92J20m4k39J27k8P6k1n3j39K09J49
8059A88n1m14O35l70J07J25m9l00J76J62q3l50M14m22K88K75l4n09K59J17j29
8080C5j13o5J94J10j1O1l22j01R8J50j73j03K7R5K60r9k01lpl7K54l0Q7M8m2M5
8106A57J7l13L18o6j19J01o3p3L4J44m83K68ON2mj25J66k3Q5J11k43r8M48l11
8130a4j81q3J26J14j7K22o5k71K77J3J20j93j12R4k69L07q9l04L69j71kq5L94
8153A80k58K2L8Q3q2K36l45K64l01J95J2K43p2j34k04L16k38J34k09K37k0q2K1
8176C6j56L99p6j34j27K68k84J22k54j1K06J24j91J42K1
8191H5
$$ Imaginary data points
##PAGE= N=2
##DATA TABLE= (X++(I..I)), XYDATA
$$ plain form
0 0 0 0 0 0 0 0 0 0 0 0 8 -8 8 -8 16 -16 24 -24 32 -40 48 -56 64 -80 92 -106 125 -144 166 -190 218 -249
32 -249 282 -320 360 -407 456 -512 571 -639 711 -790 876 -970 1074 -1184 1309 -1441 1588
49 1588 -1752 1928 -2125 2340 -2583 2855 -3161 3509 -3908 4373 -4922 5579 -6383 7396 -8721
64 -8721 10525 -13143 17304 -24959 43712 -193067 -126893 200306 -123427 -163816 73444 102515
76 102515 -48067 36337 114030 78647 31903 34261 17581 46098 -3753 -78913 -5079 48250
88 48250 -99476 -88295 65103 -7018 -127253 -14954 36806 -53581 -21811 81491 23788
99 23788 -46236 38783 106377 38528 -4520 26532 52123 20036 -63742 -68363 20150 -25866
111 -25866 -127345 -36627 51144 -46810 -62818 75978 85000 -26993 10491 120206 56566
$$ packed form
0@%%%%%%%%%%Qj6J6j6K4l2M0m8N6p2Q8j04J20j44J72j98K31k69L10l56M08m67
32b49N31o02O80p67Q63r68J083j210J350j501J666j846K044k258K493k750L029
49A588l340L680m053M465m923N438o016O670p417Q281r295J0501j1962J3779j6117
64h721J9246k3668L0447m2263O8671k36779O6174L27199l23733m0389K37260K9071
76A02515j50582Q4404P7693l5383m6744K358j6680K8517m9851p5160P3834N3329
88D8250j47726J1181J53398p2121j20235J12299N1760r0387L1770J03302n7703
99B3788p0024Q5019O7594o7849m3048L1052K5591l2087q3778m621Q8513m6016
111b5866j01479R0718Q7771r7954j6008J38796R022j11993L7484J09715o3640
$$ plain form
122 56566 -41272 11488 45553 -24070 -48259 -11903 -7618 -43967 -54989 -3797 17790 -31325
134 -31325 -27684 32123 27977 -15508 2937 57593 42610 -18555 1580 57183 21442 -29182
146 -29182 -2234 19576 -25566 -59803 -16484 12047 -46167 -56970 18748 22403 -23455 11422
158 11422 55540 27929 1731 28779 46555 8064 -20754 -653 224 -31204 -38631 -17015 -2188
171 -2188 -24314 -37280 11719 29046 -18216 -2126 52097 23828 -16423 17895 44448 3266
183 3266 -24145 10861 17928 -26145 -27798 -499 -10621 -28045 -23575 -6053 5719 -10840 -8672
196 -8672 28125 24252 -1110 21304 42056 12487 -10630 13177 19801 -22921 -31727 1704 -13000
209 -13000 -41076 -16570 1751 -8908 -10182 661 16709 18909 5967 12883 26619 14569 -1215
$$ packed form
122E6566r7838N2760L4065o9623k4189L6356M285l6349j1022N1192K1587m9115
134c1325L641N9807m146m3485J8445N4656j4983o1165K0135N5603l5741n0624
146b9182K6948K1810m5142l4237M3319K8531n8214j0803P5718L655m5858L4877
158A1422M4118k7611k6198K7048J7776l8491k8818K0101Q77l1428p427K1616J4827
171b188k2126j2966M8999J7327m7262J6090N4223k8269m0251L4318K6553m1182
183C266k7411L5006P067m4073j653K7299j0122j7424M470J7522J1772j6559K168
196h672L6797l873k5362K2414K0752k9569k3117K3807O624m2722q806L3431j4704
209a3000k8076K4506J8321j0659j274J0843J6048K200j2942O916J3736j2050j5784
$$ plain form
222 -1215 6661 18200 -2099 -24665 -1659 6386 -30313 -26549 4938 -10800 -28772 -5617 11341
235 11341 881 -3153 17503 27703 10728 10881 26120 16435 -187 -3479 -1171 -4050 -22947
248 -22947 -26693 -7108 -12373 -26891 -8596 7827 1656 -896 11970 22232 12105 4389 17035
261 17035 15027 -2387 -531 3780 -1342 -8757 -11599 -2841 -4244 -18266 -9646 2912 -8709 -13394
275 -13394 1674 8687 1696 -648 14646 20083 3787 6268 18639 6365 -5267 -2319 -3088 -10323
289 -10323 -17263 -14170 -6291 -11571 -12189 1603 6288 3310 6003 11476 15296 7822 1522 9359 5302
304 5302 -7997 -4031 -217 -6332 -8663 -5195 862 -2926 -8450 2124 5761 -6247 -3357 5772
318 5772 2882 -1399 -58 7045 6970 -1442 3182 9542 670 -3075 483 -2789 -5654 -8116 -5973 -1797
$$ packed form
222a215P876J1539k0299k2566K3006Q045l6699L764L1487j5738j7972K3155J6958
235A1341j0460m034K0656J0200j6975J53J5239r685j6622l292K308k879j8897
248b2947l746J9585n265j4518J8295J6423o171k552J2866J0262j0127p716J2646
261A7035k008j7414J856M311n122p415k842Q758j403j4022Q620J2558j1621m685
275a3394J5068P013o991k344J5294N437j6296K481J2371j2274j1632K948p69p235
289a0323o940L093P879n280o18J3792M685k978K693N473L820p474o300P837m057
304E302j3299L966L814o115k331L468O057l788n524J0574L637j2008K890R129
318E772k890m281J341P103p5q412M624O360q872l745L558l272k865k462K143M176
$$ plain form
334 -1797 -6006 -4350 4682 3219 1677 5820 7428 6381 1865 -378 4335 -1394 -9020 -3181 -1263
349 -1263 -5693 -4901 -1131 2766 750 -1181 6399 6150 -1661 1843 4383 -1037 -3064 -2004 454 -1246
365 -1246 -5263 -141 3283 -3042 -1324 2060 -465 -642 -341 260 1756 -1053 711 4633 837 830 3512
382 3512 1817 1287 -1571 -2531 562 -4347 -7866 -2069 -1481 -4545 -2130 1453 3634 2215 1859 7552
398 7552 5785 441 4083 3027 -2268 -1802 -1644 -2964 -4111 -5401 -1458 -1507 -4268 -646 1522 -515
414 -515 1120 1970 2060 3508 1102 1968 4444 916 282 2128 549 -714 -2114 -2110 -1171 -4707 -4947 -621
432 -621 -2522 -3424 -118 706 2305 1810 1913 5176 4106 917 3478 2341 -1027 -579 -1049 -1748 -2947
449 -2947 -3504 -487 -1959 -4903 215 1171 -1627 601 2365 1484 2166 1149 1844 2881 1258 1087 1108
$$ packed form
334a797m209J656R032j463j542M143J608j047m516k243M713n729p626N839J918
349a263m430P92L770L897k016j931P580k49p811L504K540n420k027J060K458j700
365a246m017N122L424o325J718L384k525j77L01O01J496k809J764L922l796pK682
382C512j695n30k858r60L093m909l519N797N88l064K415L583K181j419l56N693
398G552j767n344L642j056n295M66J58j320j147j290L943m9k761L622K168k037
414e15J635Q50R0J448k406Q66K476l528o34J846j579j263j400MR39l536k40M326
432f21j901r02L306Q24J599m95J03L263j070l189K561j137l368M48m70o99j199
449b947n57L017j472k944N118R56k798K228J764q81O82j017O95J037j623j71K1
$$ plain form
466 1108 -239 667 -1734 -2132 -9 -2900 -3494 345 -1953 -2812 855 954 230 868 2046 3046 966
483 966 774 3006 152 -572 1476 -655 -670 121 -2282 -961 -451 -2469 -436 268 -1506 -431 -84
500 -84 708 395 -362 2372 2462 -702 1111 2094 -67 761 -158 -1506 -221 -1075 -1755 -430 -1521 -1001
518 -1001 -130 -556 377 -63 526 1893 -816 -748 2191 583 -929 1513 663 -419 400 703 747 -434
536 -434 -649 868 -1923 -1895 396 -1134 -1157 342 -961 -80 1071 330 944 1083 656 754 263 740 936
555 936 -1020 -112 906 -1808 -657 891 -696 -304 164 -740 -129 -563 -669 249 -1183 -847 806 10
573 10 847 963 350 2164 1141 -505 1369 124 -1013 125 -1188 -2276 -963 -739 -420 -859 -808 1280
591 1280 310 -43 1640 413 196 1614 -611 -333 1381 215 -41 372 115 288 -262 -183 202 -1397
$$ packed form
466A108j347R06k401l98K123k891n94L839k298q59L667R9p24O38J178J000k080
483I66j92K232k854p24K048k131j5P91k403J321N10k018K033P04j774J075L47
500h4P92l13p57K734R0l164J813R83k161Q28r19j348J285q54o80J325j091N20
518a001Q71m26R33m40N89J367k709O8K939j608j512K442q50j082Q19L03M4j181
536d34k15J517k791K8K291j530k3J499j303Q81J151p41O14J39m27R8m91M77J96
555I36j956R08J018k714J151J548j587L92M68r04O11m34j06R18j432L36J653p96
573A0Q37J16o13J814j023j646J874j245j137J138j313j088J313K24L19m39N1K088
591A280r70l53J683j227k17J418k225K78J714j166k56M13k57J73n50P9L85j599
$$ plain form
609 -1397 -802 -113 -1713 -1105 712 -693 -19 1296 382 1467 1417 1150 1634 848 -96 216 -928 -587
627 -587 -531 -1978 -629 -1034 -1631 154 149 -969 407 902 -225 637 193 732 257 -339 928 567 -22
646 -22 1529 224 -885 910 -766 -1317 -309 -1257 -1266 -595 -1260 -883 -37 426 1057 440 1039 2519 464
665 464 467 1517 -70 -112 197 -1316 -298 -187 -1277 -374 -376 -435 -40 -215 -408 429 -280 386 327 -679 1512
686 1512 1012 -42 1403 886 -200 813 352 -369 -69 -1087 -915 -699 -1501 -381 -577 -949 373 171
704 171 289 1518 466 493 1100 82 442 462 -391 388 114 -759 474 -432 -686 -51 -1278 -504 34
723 34 -961 -98 62 -557 1006 479 -60 1254 911 475 1125 136 227 306 -715 -503 -562 -1244 -294 -695 -1125
744 -1125 191 -162 -857 542 -18 647 813 12 780 626 129 836 206 -315 905 -134 -452 -242 -677
$$ packed form
609a397N95O89j600O08J817j405O74J315r14J085n0k67M84p86r44L12j144L41
627e87N6j447J349m05n97J785nj118J376M95j127Q62m44N39m75n96J267l61n89
646b2J551j305j109J795j676n51J008r48rO71o65L77Q46M63O31o17N99J480k055
665D64LJ050j587m2L09j513J018J11j090R03kn9L95j75j93Q37p09O66n9j006K191
686A512n00j054J445n17j086J013m61p21L00j018J72K16q02J120j96l72J322k02
704A71J18J229j052K7O07j018L60K0q53P79k74q73J233r06k54O35j227P74N38
723C4r95Q63J60o19J563n27n39J314l43m36O50r89R1P9j021K12n9o82R50m01m30
744a125J316l53o95J399n60O65J66q01P68j54m97P07o30n21J220j039l18K10m35
$$ plain form
763 -677 -674 -349 -818 -857 -556 -695 409 65 -62 964 300 615 1264 26 381 718 -258 141 -245 -595
783 -595 8 -560 -439 176 -480 -448 110 -545 -175 90 -403 15 437 84 731 369 551 1059 257 66 534
804 534 -171 -560 -192 -676 -519 -423 -629 -11 -429 -323 556 49 245 994 266 544 469 -110 411 244 -15
825 -15 217 -167 -222 261 -477 -311 212 -572 -492 186 -735 -291 -17 -6 265 276 90 829 210 369 973 -478
847 -478 107 400 -447 -385 -222 -1178 -182 -659 -356 63 -400 -32 696 -470 -204 543 -61 563 445 35
867 35 623 406 292 615 -143 163 350 -749 -138 -270 -1183 -61 -487 -593 73 -24 214 596 255 478
887 478 996 320 559 499 52 386 153 2 67 -164 -467 -264 -653 159 -178 -507 95 -25 -388 162 -51
908 -51 333 869 480 290 916 202 381 447 -661 -109 -250 -998 -459 -304 -997 31 -170 -473 390 9
$$ packed form
763f77LL25m69l9L01j39J104l44j27J026o64L15O49j238L55L37r76L99l86l50
783e95O03n68J21O15o56L2N58o55L70K65m93M18M22l53O47l62J82N08q02j91M68
804E34p05l89L68m84J57R6k06O18m18J06Q79n07J96P49p28K78p5n79N21j67k59
825a5K32l84n5M83p38J66N23p84Q0O78r21M44K74J1K71J1j86P39o19J59O04j451
847d78N85K93q47O2J63r56R96m77L03M19m63L68P28j166K66P47o04O24j18m10
867C5N88k17j14L23p58L06J87j099O11j32r13J122m26j06O66r7K38L82l41K23
887D78N18o76K39o0m47L34k33j51O5k31l03K03l89Q12l37l29O02j20l63N50k13
908e1L84N36l89j90O26p14J79O6j108N52j41p48N39J55o93J028k01l03Q63l81
$$ plain form
928 9 477 460 -305 703 531 68 343 523 19 323 -140 -101 191 -339 -175 -282 -837 -75 -406 -849 290
949 290 -91 -56 319 412 200 646 428 83 515 141 486 -128 -483 41 -375 -488 -11 -585 -305 271 -373
970 -373 157 -48 -56 214 295 -116 552 316 -27 387 94 109 357 -147 161 -76 -293 85 -539 -755 -263 -238
992 -238 -136 45 -264 -41 528 274 445 500 -87 369 -143 -100 321 -141 -90 -38 -391 24 -189 -453 -117 -245
1014 -245 -253 43 -160 -222 279 -116 -370 453 70 249 332 210 252 -261 -220 182 -521 -705 308 -665 -414 64
1036 64 -416 -156 143 222 302 253 304 224 -205 234 563 -36 56 600 -270 -107 -21 -523 -392 33 -531 -233 -592
1059 -592 -137 -220 -293 119 644 392 487 317 -34 720 220 4 224 -105 -370 100 -382 -265 76 -357 -216
1080 -216 -265 -284 152 -357 -195 249 -174 241 455 -134 277 511 -41 33 428 -149 -86 123 -524 -367 -456 -191
$$ packed form
928IM68j7p65J008j72m63K75J80n04L04m63L9K92n30J64j07n55P62l31m43J139
949B90l81L5L75R3k12M46k18l45M32l74L45o14l55N24m16j13M77n74K80N76o44
970c73N30k05qK70Q1m11O68k36l43M14k93J5K48n04L08k37k17L78o24k16M92K5
992b38J02J81l09K23N69k54J71N5n87M56n12M3M21m62N1N2l53M15k13k64L36j28
1014b45qK96k03o2N01l95k54Q23l83J79Q3j22M2n13M1M02p03j84J013r73K51M78
1036F4m80K60K99P9Q0m9N1q0m29M39L29n99R2N44q70J63Q6n02J31M25n64K98l59
1059e92M55q3p3M12N25k52R5j70l51P54n00k16K20l29k65M70m82J17L41m33J41
1080b16m9j9M36n09J62M44m23M15K14n89M11K34n52P4L95n77O3K09o47J57q9K65
$$ plain form
1102 -191 -195 -421 -128 121 -244 58 371 227 318 459 71 247 -237 84 -124 -234 -265 161 -232 19 60 -294
1124 -294 -98 -301 -31 61 -331 -217 291 -306 115 224 443 -18 143 130 -1 18 -52 196 -188 -129 -118 -490
1146 -490 -168 -65 -331 -128 18 -232 479 219 -132 146 83 199 421 -36 213 268 -312 1 65 -80 -239
1167 -239 -318 -323 -126 -338 -237 -96 -370 210 363 -64 98 383 -142 178 68 34 233 -180 142 117 -487 -52
1189 -52 -71 -350 2 -102 -533 204 101 -217 48 103 164 271 292 406 -83 141 313 434 -153 -112 -146 -425
1211 -425 -340 -296 -371 -338 -154 42 44 -246 76 301 120 386 -15 57 526 237 30 323 -387 -89 -47 -269 6
1234 6 -102 -220 -158 -5 -242 172 -259 38 231 -19 65 102 83 368 368 -298 233 32 -12 -191 -299 -63 -81
1257 -81 -324 -228 -32 -278 119 68 -213 428 -2 33 -73 82 57 28 -43 150 9 -226 183 -348 -237 30
$$ packed form
1102a91mk26K93K49l65L02L13j44R1J41l88J76m84L21k08j10l1M26l93K51M1l54
1124b94J96k03K70R2l92J14N08n97M21J09K19m61J61j3j31J9p0K48l84N9J1l72
1146d90L22J03k66K03J46k50P11k60l51K78o3J16K22m57K49N5n80L13O4j45j59
1167b39p9nJ97k12J01J41k74N80J53m27J62K85n25L20j10l4J99m13L22k5o04M35
1189e2j9k79L52j04m31P37j03l18K65N5O1J07K1J14m89K24J72J21n87M1l4k79
1211d25Q5M4p5L3J84J96Kk90L22K25j81K66m01P2M69k89k07K93p10K98M2k22K75
1234Fj08j18O2J53k37M14m31K97J93k50Q4L7j9K85%o66N31k01m4j79j08K36j8
1257h1k43R6J96k46L97n1k81O41m30L5j06J55k5k9p1J93j41k35M09n31J11K67
$$ plain form
1279 30 -302 -443 -106 -341 7 47 -73 309 -91 38 449 94 105 138 308 27 -10 103 -70 -88 -229 44
1301 44 -61 -458 -24 -165 -215 76 -359 -301 49 173 24 -14 -137 413 101 12 189 -26 -39 406 49 -54
1323 -54 -128 -140 -182 -28 -212 -55 23 -103 332 -61 79 232 161 -26 347 170 49 -29 -62 -65 -108 -254 -19 -414
1347 -414 -359 -104 -119 -347 65 -83 -308 516 -151 185 304 57 197 257 -242 396 147 178 281 -3 43 -423
1369 -423 -105 42 -96 -167 86 -26 -1 86 7 199 359 33 244 221 -33 13 -14 -315 2 -132 74 106 -88
1392 -88 -76 118 -51 -64 18 132 44 -157 243 328 167 -58 177 -250 71 148 -202 75 79 58 -335 -176 -24
1415 -24 95 -159 -657 311 80 28 306 -204 98 158 -212 332 180 -25 74 -24 18 233 -48 -246 -17 -112
1437 -112 133 -104 -16 -360 -194 9 153 21 119 545 -66 194 158 -124 159 114 199 4 24 -100 -87 -138 -141
$$ packed form
1279C0l32j41L37k35L48M0j20L82m00J29M11l55J1L3J70k81l7J13j73j8j41K73
1301D4j05l97M34j41n0K91m35N8L50J24j49l8j23N50l12q9J77k15j3M45l57j03
1323e4p4j2m2J54j84J57P8j26M35l93J40J53p1j87L73j77j21p8l3lm3j46K35l95
1347d14N5K55j5k28M12j48k25Q24o67L36J19k47J40O0m99O38k49L1J03k84M6m66
1369d23L18J47j38p1K53j12K5Q7p9J92J60l26K11k3k54M6k7l01L17j34K06L2j94
1392h8J2J94j69j3Q2J14q8k01M00Q5j61k25K35m27L21P7l50K77Mk1l93J59J52
1415b4J19k54m98R68k31n2K78n10L02O0l70N44j52k05R9r8M2K15k81j98K29r5
1437a12K45k37Q8l44J66K03J44j32R8M26o11K60l6k82K83m5Q5j95K0j24J3n1l
$$ plain form
1460 -141 51 -196 147 -185 -56 98 257 34 -6 -67 93 201 -65 87 314 -98 187 114 -21 39 -17 -250
1482 -250 -103 -19 -44 -142 -67 2 420 139 220 180 -168 254 71 -48 -65 -46 -243 -133 74 313 137 -269 11
1505 11 -128 137 -94 -215 -110 109 -105 -205 383 150 94 -64 44 182 171 -201 63 -81 -455 -96 -429
1526 -429 -205 -144 -142 -74 -8 88 -22 285 39 -54 52 246 180 -51 110 126 -231 -229 113 -92 28 134 26 -50
1550 -50 -84 92 131 -56 1 390 176 216 26 -167 223 -11 19 170 143 -20 110 -266 -137 85 -300 -257 20
1573 20 -275 136 -146 78 296 -74 116 105 98 195 298 -82 -14 98 -154 -163 60 -13 -73 -23 -217 -232 -155 -231 35
1598 35 -171 30 -194 -47 42 65 23 375 44 -139 -178 -81 241 49 -213 -76 -106 -244 -10 -48 -442 -35 -336
1621 -336 72 5 279 50 -97 -27 -172 5 112 197 177 88 126 50 -200 361 -160 -258 -39 147 -40 42 55
$$ packed form
1460a41J92k47L43l32J29J54J59k23m0o1J60J08k66J52K27m12K85p3j35O0n6k33
1482b50J47Q4k5r8P5O9M18k81Q1m0l48M22j83j19j7J9j97J10K07K39j76m06K80
1505A1j39K65k31j21J05K19k14j00N88k33n6j58J08J38j1l72K64j44l74L59l33
1526d29K24O1KO8O6R6j10L07k46r3J06J94o6k31J61J6l57KL42k05J20J06j08p6
1550e0l4J76L9j87N7L89k14M0j90j93L90k34L0J51k7j63J30l76J29K22l85M3K77
1573B0k95M11k82K24K18l70J90j1pR7J03l80O8J12k52rK23p3o0N0j94j5P7p6K66
1598C5k06K01k24J47Q9K3m2L52l31j83l9R7L22j92k62J37l0j38K34l8l94M07l01
1621c36M08o7K74k29j47P0j45J77J07Q5k0q9L8p6k50N61n21r8K19J86j87Q2J3
$$ plain form
1644 55 -245 -158 144 302 -221 230 -85 5 239 208 18 -83 49 -37 164 132 -41 -12 -8 17 120 -223 -90
1667 -90 -40 4 88 116 250 161 29 276 290 51 55 54 11 121 9 -32 219 229 -128 -91 -124 -85 -357 50 -400 -66
1693 -66 41 -16 130 97 -11 266 -20 120 -60 -72 -9 -188 42 -151 31 100 142 66 154 -184 -24 145 -183
1716 -183 -34 -152 -89 14 -13 278 100 204 204 176 -141 -8 -49 -187 -150 60 34 98 46 41 -72 122 203 12
1740 12 148 337 446 -43 20 387 -119 33 182 -397 219 251 184 -257 -33 -249 -81 64 329 86 -265
1761 -265 345 -7 287 -10 130 -21 86 -41 -142 -172 -18 -248 -79 -65 -207 -15 -56 203 57 49 280 245
1783 245 294 152 -60 217 -9 -111 213 -164 -54 -9 120 -204 57 -34 -94 227 125 -248 -48 85 232
1804 232 94 137 -40 194 126 -120 320 -187 276 -38 -163 -117 -36 -156 -7 -37 -114 142 213 395 -107 13
$$ packed form
1644E5l00Q7L02J58n23M51l15R0K34l1j90j01J32q6K01l2j73K9MK5J03l43J33
1667i0N0M4Q4K8J34q9j32K47J4k39Mjm3J10j12m1K51J0l57L7l3L9k72M07m50L34
1693f6J07n7J46l3j08K77k86J40j80j2O3j79K30j93J82O9M2p6Q8l38J60J69l28
1716a83J49j18O3J03k7K91j78J04%k8l17J33m1j38L7K10k6O4n2nj13J94Q1j91
1740A2J36J89J09m89O3L67n06J52J49n79O16L2o7m41K24k16J68J45K65k43l51
1761b65O10l52K94k97J40j51J07j27j01l0J54k30J69J4j42J92m1K59j46qK31l5
1783B45M9j42k12K77k26j02L24l77J10M5J29l24K61r1o0L21j02l73K00J33J47
1804B32j38M3j77K34o8k46M40n07M63l14j25M6Q1j20J49l0p7K56P1J82n02J20
$$ plain form
1826 13 -29 -53 -1 31 -63 268 -77 -228 -331 6 -285 170 22 -110 -25 -88 -170 138 -6 -86 47 -109 121
1849 121 53 -141 201 -131 137 24 212 259 78 -28 -127 158 -117 42 -31 -63 -63 -91 27 256 -197 -109 -78
1872 -78 23 130 -240 7 166 83 125 249 196 -129 226 -215 94 -299 237 -68 84 -118 -125 243 -269 0
1894 0 -37 33 -17 -97 193 224 -377 28 381 124 51 -70 -328 -75 13 -418 179 -268 80 -15 -92 188 161 106
1918 106 36 57 -94 35 205 -84 40 -290 -22 224 91 50 3 -253 -120 -118 41 -117 219 -9 -52 -60 99
1941 99 254 94 -15 85 -209 122 -77 -34 69 -120 -88 -81 -27 -149 210 -1 254 -178 55 27 10 36 -62
1964 -62 -203 -159 104 -85 329 164 -333 105 -221 217 148 232 -38 -67 -197 -2 128 189 118 -46 6 249 -266
1987 -266 81 128 160 -98 -5 -43 78 -100 10 -22 -168 -86 75 -94 -130 -59 -143 -27 246 201 116 -113 34 201
$$ packed form
1826A3m2k4N2L2r4L31l45j51j03L37k91M55j48j32Q5o3q2L08j44q0J33j56K30
1849A21o8j94L42l32K68j13J88M7j81j06r9K85k75J59p3l2%k8J18K29m53Q8L1
1872g8J01J07l70K47J59q3M2J24n3l25L55m41L09l93N36l05J52k02pL68n12K69
1894@l7P0n0q0K90L1o01M05L53k57p3j21k58K53Q8m31N97m47L48r5p7K80k7n5
1918A06p0K1j51J29J70k89J24l30K68K46j33m1m7k56J33KJ59j58L36k28m3qJ59
1941I9J55j60j09J00k94L31j99M3J03j89L2PN4j22L59k11K55m32K33k8j7K6r8
1964f2j41M4K63j89M14j65m97M38l26M38o9Q4k70k9j30J95J30O1p1j64N2K43n15
1987b66L47M7L2k58R3l8J21j78J10l2j46Q2J61j69l6P1q4J16K73m5q5k29J47J67
$$ plain form
2011 201 38 -109 26 65 -163 23 -283 111 126 67 7 -178 124 174 355 -55 185 15 106 -136 -50 -41 70
2034 70 164 168 -186 -16 365 8 85 -40 11 -233 -81 -71 -57 14 141 -171 -118 67 -133 33 46 -118 -64 -33
2058 -33 -42 -36 -167 -140 -26 115 -116 143 -131 136 -125 150 -169 29 280 -81 209 18 102 -22 47 -161 73
2081 73 -137 -87 247 -63 -216 -8 43 -58 -274 -160 6 12 112 35 176 221 264 67 -241 76 -58 -64 133
2104 133 -50 -101 88 116 25 214 196 71 -76 -64 84 -144 -153 139 168 -98 212 105 188 141 -108 -60 -69 -368
2128 -368 -140 76 -385 48 10 -186 68 -49 45 -168 -55 -280 -3 -24 72 219 -57 -111 -136 0 171 -15
2150 -15 131 36 -157 -48 37 -142 -124 -100 -96 161 -103 296 41 11 142 -111 -78 -53 52 -70 124 52 -237 -10
2174 -10 206 80 -108 349 206 228 117 -90 -29 104 -81 -94 -369 88 -98 94 -3 58 -109 93 184 244 -71
$$ packed form
2011B01j63j47J35L9k28J86l06L94J5n9o0j85L02N0J81m10K40j70R1k42Q6RJ11
2034G0R4Ml54J70L81l57P7j25N1k44J52J0J4P1J27l12N3J85k00J66J3j64N4L1
2058c3rOj31K7J14J41k31K59k74K67k61K75l19J98K51l61K90j91Q4j24O9k08K34
2081G3k10N0L34l10j53K08N1j01k16J14J66OJ00p7J41M5M3j97l08L17j34oJ97
2104A33j83n1J89K8r1J89j8j25j47J2J48k28rK92K9k66L10j07Q3m7k49M8rk99
2128c68K28K16m61M33l8j96K54j17R4k13J13k25K77k1R6J47k76n4k5J36J71j86
2150a5J46r5j93J09Q5j79J8K4MK57k64L99k55l0J31k53L3K5J05j22J94p2k89K27
2174a0K16j26j88M57j43K2j11k07O1J33j85j3k75M57j86J92r7O1j67K02R1O0l15
$$ plain form
2197 -71 -99 186 -113 243 67 -181 -125 39 -237 -126 -36 146 406 39 -36 79 72 67 -278 -62 -14 9 253 163
2221 163 39 -59 109 -307 138 -108 313 83 -148 86 -215 84 -285 -5 77 210 -223 17 -44 -150 76
2242 76 140 10 37 -31 -49 -164 -85 135 21 -67 -108 177 50 163 143 -16 74 -150 289 182 -202 -84 -219
2265 -219 15 -13 -162 89 -56 -24 230 -165 92 129 47 253 -137 268 -114 31 82 -311 -45 196 -34 -65
2287 -65 -28 -100 192 20 -18 257 103 16 37 65 -139 -10 -230 5 4 -58 94 37 -52 -99 105 -19 -124 -89 -116
2312 -116 81 -77 80 21 -19 -233 80 -45 377 -100 -111 52 159 -35 -48 95 101 -26 -36 130 -64 18 -55
2335 -55 -70 44 -126 -55 -55 -257 -396 24 -98 -269 71 -181 -32 31 -122 -99 -7 171 20 14 24 50 -244 43
2359 43 64 339 -6 61 29 -187 -61 -20 42 -58 242 -194 -31 41 -209 58 -64 141 26 12 340 -20 -13
$$ packed form
2197g1k8K85k99L56j76k48N6J64k76J11R0J82K60l67p5J15pnl45K16M8K3K44r0
2221A63j24r8J68m16M45k46M21k30k31K34l01K99l69K80Q2J33m33K40o1j06K26
2242G6O4j30K7o8j8j15P9K20j14q8m1K85j27J13k0j59R0k24M39j07l84J18j35
2265b19K34k8j49K51j45L2K54l95K57L7q2K06l90M05l82J45N1l93K66K41k30l1
2287f5L7p2K92j72l8K75j54q7K1K8k04J29k20K35jo2J52n7q9m7K04j24j05L5k7
2312a16J97j58J57n9m0k14L13j25M22m77j1J63J07j94j3J43Oj27j0J66j94Q2p3
2335e5j5J14j70P1%k02j39M20j22j71L40k52J49O3j53K3R2J78j51oJ0K6k94K87
2359D3K1K75l45O7l2k16J26M1O2j00L00m36J63P2k50K67j22K05j15j4L28l60P
$$ plain form
2382 -13 -67 -189 213 -233 106 -13 90 74 -114 52 -214 60 -77 -206 -55 -254 96 51 111 198 -108 -47
2404 -47 -114 -100 -249 -40 -257 -17 -91 49 -7 61 238 -61 -103 212 -87 128 77 -133 219 -56 -81 105 175
2427 175 -104 -98 198 346 -11 -293 44 47 -292 133 97 254 4 -129 -152 60 145 -85 -131 -217 -163 -132 88 -160
2451 -160 -315 -36 114 156 375 69 0 -188 -212 52 -154 -57 29 167 -362 157 -152 316 -50 19 -195 175
2473 175 -117 -76 -62 96 -80 -24 -39 197 38 -221 81 90 293 -62 64 67 -13 97 -22 -76 115 -77 46
2496 46 -285 365 12 106 -68 -414 17 196 -58 223 -89 -56 131 49 -113 118 -141 255 -97 178 76
2517 76 239 -270 54 -85 -46 4 151 12 -192 223 -191 113 -133 -237 -163 60 -101 -150 -141 203 -118 52
2539 52 33 72 79 96 -81 145 291 4 92 63 -89 -31 -118 -65 26 249 -126 -153 -169 265 -69 34 154 55 -130
$$ packed form
2382a3n4j22M02m46L39j19J03j6j88J66k66K74j37j29J51j99L50m5O0Q7l06O1
2404d7o7J4j49K09k17K40p4J40n6O8J77k99m2L15k99K15n1k10L52k75k5J86P0
2427A75k79OK96J48l57k82L37Ll39M25l6J57k50j33k3K12Q5k30m6q6N4L1K20k48
2451a60j55K79J50M2K19l06o9j88k4K64k06R7Q6J38n29N19l09M68l66O9k14L70
2473A75k92M1J4J58j76N6j5K36j59k59L02RK03l55J26Lq0J10j19n4J91j92J23
2496D6l31O50l53R4j74l46M31J79k54K81l12L3J87q2j62K31k59L96l52K75j02
2517G6J63n09L24j39L9N0J47j39k04M15m14L04k46j04P4K23j61m9RL44l21J70
2539E2j9L9PJ7j77K26J46k87Q8k9j52N8q7N3R1K23l75k7j6M34l34J03J20r9j85
$$ plain form
2564 -130 109 148 129 121 -61 187 -40 96 -145 -48 -145 -65 237 302 -238 -81 43 92 -68 -152 53 0 -84 50
2588 50 238 53 130 -29 131 178 184 70 -59 -49 295 100 -10 -91 145 -350 -251 151 -201 -141 -51 43 -127 151
2612 151 -253 -24 -126 115 -154 -29 -237 34 97 -261 -15 -251 183 50 -125 -48 48 90 207 139 -168 -47
2634 -47 -29 31 -120 109 -119 390 -86 206 104 327 -267 6 -47 -197 -216 -81 -207 252 -307 30 156 120
2656 120 -14 -327 155 99 -213 -45 -221 -4 197 36 -83 171 -72 123 -169 51 -105 87 100 -170 -80
2677 -80 -61 33 -140 -91 -17 -182 39 242 58 -110 39 47 -85 -57 178 79 -179 31 15 137 -59 380 -86
2700 -86 0 -13 163 -210 -14 -95 256 -107 0 147 -124 49 225 250 -140 208 55 48 -78 -7 73 153 -284
2723 -284 43 109 -58 32 21 8 162 339 297 27 187 -188 -26 17 -12 34 -85 299 217 -5 3 -55 39 66 -323
$$ packed form
2564a30K39L9j9qj82K48k27J36k41R7r7Q0L02O5n40J57J24M9j60q4K05n3q4J34
2588E0J88j85P7j59J60M7Oj14j29J0L44j95j10q1K36m95R9M02l52O0R0R4j70K78
2612A51m04K29j02K41k69J25k08K71O3l58K46k36M34j33j75P7R6M2J17o8l07J21
2634d7J8O0j51K29k28N09m76K92j02K23n94K73n3j50j9J35j26M59n59L37J26l6
2656A20j34l13M82n6l12J68j76K17K01j61j19K54k43J95k92K20j56J92J3k70R0
2677h0J9R4j73M9P4j65K21K03j84j68J49Qj32K8K35r9k58K10j6J22j96M39m66
2700h6Q6j3J76l73J96q1L51l63J07J47k71J73J76K5l90L48j53pj26P1Q0Q0m37
2723b84L27O6j67R0j1j3J54J77m2k70J60l75J62M3k9M6j19L84q2k22Qn8R4K7l89
$$ plain form
2748 -323 -147 107 -8 66 66 -372 -185 -113 154 -22 237 210 192 45 55 -73 -187 91 223 -43 150 -77
2770 -77 120 -97 -252 -1 56 -40 136 134 138 113 -10 9 55 -223 -189 -59 -201 -200 170 199 -175 -194 162 124 161 8
2796 8 -86 146 -203 88 183 -234 65 -135 133 -150 11 -45 73 233 -91 118 0 5 243 320 -215 39 126
2819 126 55 54 -455 48 -88 75 -243 -21 130 81 -283 -13 -58 -22 -4 -306 140 60 86 -247 -123 -57 196
2842 196 6 -60 -68 -234 -6 -92 -104 -146 -33 72 64 94 -15 17 64 -214 -169 31 -134 109 -193 154 -268 -170
2866 -170 -139 -73 -13 62 217 -212 38 97 -4 -168 210 7 -35 18 95 307 69 -320 364 123 -136 28 5
2889 5 44 -67 -168 108 132 -48 100 22 -93 24 -149 291 -28 34 -59 127 -193 130 -66 99 -123 -287
2911 -287 64 184 63 -18 113 56 -257 -129 -101 320 17 -74 145 -354 23 27 168 220 187 -67 -104 80 185
$$ packed form
2748c23J76K54j15P4%m38J87P2K67j76K59k7j8j47J0j28j14K78J32k66J93k27
2770g7J97k17j55K51N7r6J76kMk5j23J9M6k78L4J30j42JL70K9l74j9L56l8L7j53
2796Hr4K32l49K91R5m17K99k00K68k83J61n6J18J60l24K09j18NK38P7n35K54Q7
2819A26p1jn09N03j36J63l18K22J51m9l64K70m5L6J8l02M46q0K6l33J24O6K53
2842A96j90o6qj66K28q6j2m2J13J05qL0j09L2M7k78M5K00j65K43l02L47m22R8
2866a70L1O6O0P5J55m29K50N9j01j64L78k03m2N3P7K12k38l89O84k41k59J64k3
2889EL9j11j01K76K4j80J48p8j15J17j73M40l19O2r3J86l20L23j96J65k22j64
2911b87L51J20j21q1J31n7l13J28K8M21l03r1K19m99L77MJ41N2l3k54l7J84J05
$$ plain form
2934 185 -17 -41 -159 207 115 -153 -166 67 -248 -259 70 25 104 148 -142 75 -89 -64 33 1 -166 -191 -45 -103
2958 -103 211 -92 -5 69 281 -107 167 -149 -22 147 18 -5 -112 -246 -134 -207 -39 124 -36 164 61
2979 61 -5 105 136 137 -90 -212 84 -42 346 78 181 95 173 -141 -88 283 -110 14 -334 122 -105 -60 26
3002 26 166 155 -71 51 -172 -27 -47 91 -284 -69 -158 -107 115 85 -46 98 -4 216 -62 42 -99 -205
3024 -205 103 -52 -202 -88 -153 278 5 -370 82 -46 60 29 244 -114 -34 134 -57 12 -6 -208 156 55
3046 55 40 219 253 159 -46 -51 -93 -196 -90 41 47 -77 -79 48 -114 48 343 -32 -32 -38 -37 112 -122 12 -168 -9
3072 -9 41 258 -220 29 108 71 -109 187 140 175 -109 83 -12 -112 33 16 131 -109 -8 49 -21 -207 -94 285
3096 285 -240 92 12 -53 37 -96 22 -39 142 -83 -193 -165 -115 -12 -88 4 -126 -184 -19 204 -9 -128 -80
$$ packed form
2934A85k02k4j18L66r2k68j3K33l15j1L29m5P9M4k90K17j64K5R7l2j67k5J46n8
2958a03L14l03Q7P4K12l88K74l16J27J69j29k3j07j34J12p3J68J63j60K00j03
2979F1o6J10L1Jk27j22K96j26L88k68J03q6P8l14N3L71l93J24l48M56k27M5Q6
3002B6J40j1k26J22k23J45k0J38l75K15q9N1K22l0j31J44j02K20k78J04j41j06
3024b05L08j55j50J14o5M31k73l75M52j28J06l1K15l58Q0J68j91O9j8k02L64j01
3046E5j5J79L4r4k05nm2j03J06J31Oj24kJ27j62J62K95l75%oJJ49k34J34j80J59
3072iN0K17m78K49P9l7j80K96m7L5k84J92r5j00J45j7J15k40J01N7p0j86J13L79
3096B85n25L32q0o5R0j33J18o1J81k25j10K8N0J03p6R2j30n8J65K23k13j19M8
$$ plain form
3119 -80 -198 227 54 -19 6 -144 -223 169 -105 145 251 -111 137 50 -82 -137 -59 296 -186 -9 23 312 33
3142 33 -191 -158 55 123 130 148 77 -63 -46 -25 43 106 77 -198 48 205 3 -162 -256 25 19 131 -417 -259 38
3167 38 94 92 -312 23 -248 180 181 77 0 105 28 -153 272 80 43 23 -126 67 -112 31 22 -50 -19 -41 -13
3192 -13 107 -165 265 -40 -201 54 -15 47 -86 158 52 -176 124 -79 93 -38 61 -183 -125 119 58 -174
3214 -174 -87 -103 46 192 -201 -116 -162 68 -66 141 109 -73 44 -88 138 208 -38 -136 29 30 -47 36 36 27 -289
3239 -289 -153 30 -130 83 -69 154 39 -167 -336 -165 -41 364 383 -270 29 122 132 -116 95 -128 -73
3260 -73 92 -60 46 187 235 138 -78 178 30 -82 47 44 -101 -257 267 56 -10 170 -101 -47 -59 116 -28
3283 -28 -230 67 262 -156 -247 -65 -76 319 103 41 -90 80 124 -18 -347 -16 -139 -192 -121 -16 -148 11
$$ packed form
3119h0j18M25j73p3K5j50p9L92k74K50J06l62K48q7j32n5P8L55m82J77L2K89k79
3142C3k24L3K13O8PJ8p1j40J7K1O8O3k9k75K46J57k02j65r4K81oJ12n48J58K97
3167C8N6km04L35k71M28Jj04p7J05p7j81M25j92l7k0j49J93j79J43rp2L1k2K8
3192a3J20k72M30l05j61K55o9O2j33K44j06k28L00k03J72j31R9k44N8K44o1k32
3214a74Q7j6J49J46l93Q5m6K30j34K07l2j82J17j32K26P0k46r8J65Jp7Q3%rl16
3239b89J36J83j60K13j52K23j15k06j69J71J24M05J9o53K99R3J0k48K11k23N5
3260g3J65j52J06J41M8r7k16K56j48j12J29lj45j56N24k11o6J80k71N4j2J75j44
3283b8k02K97J95m18r1J82j1L95k16o2j31J70M4j42l29L31j23n3P1J05j32J59
$$ plain form
3305 11 -53 -339 155 125 -98 -368 43 20 -304 7 55 -7 -110 -147 154 136 107 184 98 -17 -51 -181 -267 -55
3329 -55 20 -258 -175 62 -162 -300 -70 12 -38 137 -16 -113 -134 44 -13 -110 94 211 -135 140 27 99 428
3352 428 -73 -181 346 -61 -282 -54 -5 65 -119 221 -84 -147 150 144 39 -22 114 151 -178 -147 132 -172 -95
3375 -95 211 128 -147 -211 24 122 293 97 130 151 10 99 -81 -6 -173 -80 76 76 -145 118 144 66 -176 -70
3399 -70 160 81 211 52 7 148 -136 96 -19 -9 301 128 115 0 -165 -175 -60 188 -47 56 271 147
3421 147 49 37 46 -60 81 -243 312 290 -240 58 -10 -65 69 -165 -359 13 331 286 -62 -101 -27 -69 -76 -22 -91
3446 -91 230 -103 -10 12 75 -119 -32 -203 -13 102 -19 -45 48 47 -262 -45 235 188 -16 -145 218 32 -5 241
3470 241 -332 -117 -34 -62 46 65 1 217 62 -134 -29 -29 63 -17 -42 5 -7 102 151 46 105 -105 7 -267
$$ packed form
3305A1o4k86M94l0k23k70M11k3l24L11M8o2j03l7L01j8k9P7q6j15l4j30q6K12
3329e5P5k78Q3K37k24j38K30Q2n0J75j53r7k1J78n7r7K04J17l46K75j13P2L29
3352D28n01j08N27m07k21K28M9P0j84L40l05o3K97oj05o1J36L7l29L1K79l04P7
3375i5L06q3k75o4K35R8J71j96L3K1j41Q9j80P5j67R3J56%k21K63K6p8k42J06
3399g0K30p9J30j59m5J41k84K32j15J0L10j73j3j15j65j0J15K48k35J03K15j24
3421A47r8j2Rj06J41l24N55k2n30K98o8n5J34k34j94L72L18m5l48l9P4m2pN4o9
3446i1L21l33R3K2O3j94Q7j71J90J15j21k6R3jl09K17K80m7k04j29L63j86l7K46
3470B41n73K15Q3k8J08J9o4K16j55j96J05%R2q0k5M7j2J09M9j05N9k10J12k74
$$ plain form
3494 -267 -93 113 60 185 -10 63 112 -52 138 -2 -99 129 -24 -242 -1 37 31 58 158 56 82 -193 79
3517 79 -18 250 25 136 -191 -44 67 -263 17 104 199 -178 125 -41 68 -219 -33 67 -203 369 -106
3538 -106 73 -270 74 217 13 -6 68 -91 13 -41 -118 -182 182 256 -4 -40 250 -113 -19 337 -98 -172 8
3561 8 -131 -221 48 -238 -132 -52 182 47 -109 -37 -276 -123 -6 163 -241 92 293 -302 17 -123 -11 15
3583 15 55 75 259 -179 -3 -41 48 113 70 -43 106 -80 136 122 354 66 -140 -18 123 -145 252 104 142
3606 142 -175 -303 176 -214 85 253 13 37 101 130 -319 -23 -82 86 113 77 -42 -44 165 -22 -24 56 117 149
3630 149 49 167 -96 -126 -138 -187 214 -125 57 71 56 -41 -184 -54 81 89 283 61 -164 301 352 -17 39
3653 39 -112 -101 207 -252 -62 -173 -95 -89 -152 -103 -103 107 27 -194 66 -155 -60 31 -26 -126 -30 -120 -230 -245 2
$$ packed form
3494b67J74K06n3J25j95P3M9j64J90j40r7K28j53k18K41L8oK7J00j02K6k75K72
3517G9r7K68k25J11l27J47J11l30K80Q7R5l77L03j66J09k87J86J00k70N72m75
3538a06J79l43L44J43k04j9P4j59J04n4p7o4L64P4k60l6K90l63R4L56m35p4J80
3561Hj39r0K69k86J06Q0K34j35j56P2k39J53J17J69m04L33K01n95L19j40J12K6
3583A5M0K0J84m38J76l8Q9O5m3j13J49j86K16j4K32k88k06J22J41k68L97j48L8
3606A42l17j28M79l90K99J68k40K4O4K9m49K96n9J68K7l6j19kK09j87kQ0O1L2
3630A49j00J18k63l0j2m9M01l39J82J4j5r7j43J30J35QJ94k22k25M65N1l69N6
3653C9j51J1L08m59J90j11P8Oo3M9%K10q0k21K60k21R5R1n7j00R6r0j10j5K47
$$ plain form
3678 2 -16 -16 8 135 -25 92 -167 -52 76 156 -62 30 64 -135 59 38 -7 -47 -63 -19 -93 24 89 -81 242
3703 242 391 -80 -107 93 89 -135 135 -10 113 -60 -8 -164 -105 -114 -64 40 -212 185 -255 -163 -7 259 -145
3726 -145 110 -46 -36 134 302 -6 -187 246 273 -220 289 -114 -33 30 -229 95 -64 60 87 -36 -95 61
3748 61 48 -77 -161 -97 -136 181 -24 0 -125 0 -62 38 153 115 52 242 -73 -130 72 -67 97 -109 9
3771 9 90 -92 -336 -70 -41 -75 -177 21 9 208 -145 -265 -268 74 -107 180 -46 -2 -201 153 -210 -83 89
3794 89 20 -76 -112 113 -39 70 -206 22 -158 -28 -74 -42 27 104 178 199 18 103 307 -68 46 -98 52 58
3818 58 -100 -66 -37 -98 -87 46 -51 2 -3 56 77 -40 116 136 196 -130 189 -192 200 -107 281 -65 10 258 140
3843 140 65 -171 -18 -20 -250 108 54 -74 -84 -91 -77 11 66 -175 115 122 78 -83 -28 1 56 -124 96 38 -296 -208
$$ packed form
3678Bj8%K4J27j60J17k59J15J28Q0k18R2L4j99J94k1m5m0j6M4p4J17O5j70L23
3703B42J49m71k7K00mk24K70j45J23j73N2j56N9rN0J04k52L97m40R2J56K66m04
3726a45K55j56J0J70J68l08j81M33K7m93N09m03Q1O3k59L24j59J24K7j23n9J56
3748F1j3j25q4O4l9L17k05K4j25J25o2J00J15l8o3J90l15n7K02j39J64k06J18
3771IQ1j82k44K66K9l4j02J98j2J99l53j20lL42j81K87k26M4j99L54l63J27J72
3794H9o9r6l6K25j52J09k76K28j80J30m6L2O9P7P4K1j81Q5K04l75J14j44J50O
3818E8j58L4K9o1J1J33r7N3nN9K1j17J56K0O0l26L19l81L92l07L88l46P5K48j18
3843A40p5k36J53kk30L58n4j28j0pJ4Q8N5k41K90Pm4j61N5K9N5j80K20n8l34Q8
$$ plain form
3869 -208 -65 198 7 -25 75 -47 160 203 201 -197 197 246 -202 -90 76 118 97 -173 -160 -29 -75 104 86
3892 86 191 -82 219 170 -180 48 -313 -16 23 32 -233 179 275 -140 -181 -12 -59 -167 -19 -192 -140 -86 -76 120
3916 120 -159 -186 307 -102 162 -195 -227 75 55 185 -267 96 119 -329 287 216 127 -289 -33 -24 -69 257 141
3939 141 -230 41 61 -41 52 -189 258 -4 133 136 -61 61 -72 188 100 -51 -24 -62 234 -138 -141 8 -212
3962 -212 -183 -336 -184 -123 120 -124 63 -55 -13 66 42 204 318 -115 -106 10 53 99 -23 72 -178 -118 178 -31
3986 -31 414 145 139 -42 235 371 22 -59 -88 -88 144 -190 -76 -78 121 -51 -13 -75 80 -74 42 145 170 95
4010 95 -166 -176 -169 -89 -31 147 114 120 190 -141 -70 -41 -73 -71 127 115 69 125 10 304 -48 111 68 -287 -69 32
4036 32 -185 195 -30 -188 -360 -206 5 -48 99 -161 150 -108 152 -192 -208 -127 -5 241 56 -16 273 -160
$$ packed form
3869b08J43K63j91l2J00j22K07M3kl98L94M9m48J12J66M2k1k70J3J31m6J79j8
3892H6J05k73L01m9l50K28l61K97L9Rk65M12R6m15m1J69m7j08J48j73N2N4J0J96
3916A20k79k7M93m09K64l57l2L02k0J30m52L63K3m48O16p1q9m16K56Rm5L26j16
3939A41l71K71K0j02R3k41M47k62J37Lj97J22j33K60q8j51K7l8K96l72lJ49k20
3962b12K9j53J52O1K43k44J87j18M2P9k4J62J14m33RJ16M3M6j22R5k50O0K96k09
3986c1M45k69oj81K77J36l49q1k9%K32l34J14kJ99j72L8o2J55j54J16J03K5p5
4010I5k61j0PQ0N8J78l3OP0l31P1K9l2KJ98j2m6N6j15K94l52J59m3l55K18J01
4036C2k17L80k25j58j72J54K11n3J47k60L11k58K60l44j6Q1J22K46j85p2K89m33
$$ plain form
4058 -160 -94 -27 28 87 172 306 -171 -115 11 -242 -112 14 207 -160 213 -81 -262 128 -194 -149 -76 434 -235
4081 -235 -25 -56 -128 170 96 244 -316 -137 16 161 150 -105 -40 -125 -19 -77 30 -81 -29 12 -75 26 63 -49
$$ packed form
4058a60O6O7N5N9Q5J34m77N6J26k53J30J26J93l67L73k94j81L90l22M5P3N10o69
4081b35K10l1p2K98p4J48n60J79J53J45j1k55O5q5J06n8J07j11N2M1q7J01L7j12
$$ [...]
8191C2
##END NTUPLES=NMR FID
##END=
